
##TITLE=AC1366_2140_7184965_qDGOeVsAB1
##JCAMPDX= 6.0         $$ Bruker NMR JCAMP-DX V2.0
##DATA TYPE= NMR SPECTRUM
##DATA CLASS= NTUPLES
##ORIGIN= BRUKER
##OWNER= Administrator
$$ 1.72 TOPSPIN		Version 2.1
$$ 2012-12-05 18:24:50.895 -0500  Administrator@X
$$ Compression mode = diff/dup
##.OBSERVE FREQUENCY= 400.02188249412
##.OBSERVE NUCLEUS= ^1H
##.ACQUISITION MODE= SIMULTANEOUS (DQD)
##.ACQUISITION SCHEME= undefined
##.AVERAGES= 8
##.DIGITISER RES= 22
##SPECTROMETER/DATA SYSTEM= spect
##.PULSE SEQUENCE= zg30
##.SOLVENT NAME= COFFEE_meoh
##.SHIFT REFERENCE= INTERNAL, COFFEE_meoh, 1, 14.98509
##AUDIT TRAIL= $$ (NUMBER, WHEN, WHO, WHERE, PROCESS, VERSION, WHAT)
$$ ##TITLE= Audit trail, TOPSPIN		Version 2.1
$$ ##JCAMPDX= 5.01
$$ ##ORIGIN= Bruker BioSpin GmbH
$$ ##OWNER= Administrator
$$ $$ E:\/data/COFFEE/nmr/AC1366_2140_7184965_qDGOeVsAB1/10/pdata/1/auditp.txt
$$ ##AUDIT TRAIL=  $$ (NUMBER, WHEN, WHO, WHERE, PROCESS, VERSION, WHAT)
(   1,<2012-12-05 18:24:42.739 -0500>,<Administrator>,<X>,<go>,<TOPSPIN 2.1>,
      <created by zg
	started at 2012-12-05 18:23:36.333 -0500,
	POWCHK enabled, PULCHK disabled,
       configuration hash MD5:
       86 BA 57 50 F2 9D 5C 9B 26 00 A9 28 5F 66 2E 89
       data hash MD5: 64K
       F5 3C A6 90 B5 60 77 41 B8 AB 10 C7 67 33 3D 90>)
(   2,<2012-12-05 18:24:45.973 -0500>,<Administrator>,<X>,<proc1d>,<TOPSPIN 2.1>,
      <Start of raw data processing
       efp LB = 0 FT_mod = 6 PKNL = 1 PHC0 = 0 PHC1 = 0 SI = 32K 
       data hash MD5: 32K
       C6 A1 72 42 37 19 1E 41 24 FD D6 59 86 0E 33 3E>)
(   3,<2012-12-05 18:24:46.442 -0500>,<Administrator>,<X>,<proc1d>,<TOPSPIN 2.1>,
      <pk PHC0 = 101.228 PHC1 = 0 
       data hash MD5: 32K
       6B C2 67 75 08 CF 44 07 3D 38 FE 5A 99 A1 B4 F5>)
(   4,<2012-12-05 18:24:46.676 -0500>,<Administrator>,<X>,<proc1d>,<TOPSPIN 2.1>,
      <abs ABSG = 1 
       data hash MD5: 32K
       34 A4 59 D7 F5 D1 72 50 17 3F A5 66 63 55 4F 3B>)
(   5,<2012-12-05 18:24:46.817 -0500>,<Administrator>,<X>,<proc1d>,<TOPSPIN 2.1>,
      <abs ABSG = 2 
       data hash MD5: 32K
       EA 51 91 DF C9 22 1D CA 68 43 4D 14 EC BA 4F 5F>)
(   6,<2012-12-05 18:24:46.958 -0500>,<Administrator>,<X>,<proc1d>,<TOPSPIN 2.1>,
      <abs ABSG = 3 
       data hash MD5: 32K
       A2 FA 18 1D 0F 8E A5 D5 57 E0 90 3E 3B 66 CE 1B>)
(   7,<2012-12-05 18:24:47.130 -0500>,<Administrator>,<X>,<proc1d>,<TOPSPIN 2.1>,
      <abs ABSG = 4 
       data hash MD5: 32K
       12 CA 24 AB AC 9A 2B 95 95 36 1B 14 33 7E BD C9>)
(   8,<2012-12-05 18:24:47.286 -0500>,<Administrator>,<X>,<proc1d>,<TOPSPIN 2.1>,
      <abs ABSG = 5 
       data hash MD5: 32K
       12 C1 67 7F E0 4F 94 54 11 53 74 B2 E1 DF EC E7>)
$$ ##END=
$$ 
$$ $$ hash MD5
$$ $$ 80 0A 87 0C D8 EA 5B 86 8A 44 A1 B9 30 C6 CD 15
##$RELAX= 
##$RELAX= 
##$RELAX= 
##$RELAX= 
##$RELAX= 
##$RELAX= 
##$RELAX= 
$$ Bruker specific parameters
$$ --------------------------
##$DU= <E:\>
##$EXPNO= 10
##$NAME= <AC1366_2140_7184965_qDGOeVsAB1>
##$PROCNO= 1
$$ [...]
150 150 150 150 150 150 150 150
##$TP07= 0
##$TPNAME0= <>
##$TPNAME1= <>
##$TPNAME2= <>
##$TPNAME3= <>
##$TPNAME4= <>
##$TPNAME5= <>
##$TPNAME6= <>
##$TPNAME7= <>
##$TPOAL= (0..7)
0.5 0.5 0.5 0.5 0.5 0.5 0.5 0.5
##$TPOFFS= (0..7)
0 0 0 0 0 0 0 0
##$TUNHIN= 0
##$TUNHOUT= 0
##$TUNXOUT= 0
##$USERA1= <user>
##$USERA2= <user>
##$USERA3= <user>
##$USERA4= <user>
##$USERA5= <user>
##$V9= 5
##$VALIST= <valist>
##$VCLIST= <CCCCCCCCCCCCCCC>
##$VD= 0
##$VDLIST= <DDDDDDDDDDDDDDD>
##$VPLIST= <PPPPPPPPPPPPPPP>
##$VTLIST= <TTTTTTTTTTTTTTT>
##$WBST= 1024
##$WBSW= 4
##$XGAIN= (0..3)
0 0 0 0
##$XL= 0
##$YL= 0
##$YMAX_a= 684709
##$YMIN_a= -583335
##$ZGOPTNS= <>
##$ZL1= 120
##$ZL2= 120
##$ZL3= 120
##$ZL4= 120
##$ABSF1= 14.98509
##$ABSF2= -5.573092
##$ABSG= 5
##$ABSL= 3
##$ALPHA= 0
##$AQORDER= 0
##$ASSFAC= 0
##$ASSFACI= 0
##$ASSFACX= 0
##$ASSWID= 0
##$AUNMP= <proc_prof1d_extract_pilot.lims>
##$AXLEFT= 0
##$AXNAME= <>
##$AXNUC= <1H>
##$AXRIGHT= 0
##$AXTYPE= 0
##$AXUNIT= <>
##$AZFE= 0.1
##$AZFW= 0.1
##$BCFW= 0
##$BC_mod= 0
##$BYTORDP= 0
##$COROFFS= 0
##$CY= 15
##$DATMOD= 1
##$DC= 0
##$DFILT= <>
##$DTYPP= 0
##$F1P= 0
##$F2P= 0
##$FCOR= 0.5
##$FTSIZE= 32768
##$FT_mod= 6
##$GAMMA= 0
##$GB= 0
##$INTBC= 1
##$INTSCL= 1
##$ISEN= 128
##$LB= 0
##$LEV0= 0
##$LPBIN= 0
##$MAXI= 10000
##$MC2= 0
##$MEAN= 0
##$ME_mod= 0
##$MI= 0
##$NCOEF= 0
##$NC_proc= -8
##$NLEV= 6
##$NOISF1= 0
##$NOISF2= 0
##$NSP= 0
##$NTH_PI= 0
##$NZP= 0
##$OFFSET= 14.98509
##$PC= 1
##$PHC0= 101.228
##$PHC1= 0
##$PH_mod= 1
##$PKNL= yes
##$PPARMOD= 0
##$PPDIAG= 0
##$PPIPTYP= 0
##$PPMPNUM= 2147483647
##$PPRESOL= 1
##$PSCAL= 4
##$PSIGN= 0
##$PYNMP= <proc.py>
##$REVERSE= no
##$SF= 400.02
##$SI= 32768
##$SIGF1= 0
##$SIGF2= 0
##$SINO= 400
##$SIOLD= 32768
##$SPECTYP= <>
##$SREGLST= <1H.CDCl3>
##$SSB= 0
##$STSI= 32768
##$STSR= 0
##$SW_p= 8223.68421052631
##$SYMM= 0
##$S_DEV= 0
##$TDeff= 65536
##$TDoff= 0
##$TI= <>
##$TILT= no
##$TM1= 0
##$TM2= 0
##$TOPLEV= 0
##$USERP1= <user>
##$USERP2= <user>
##$USERP3= <user>
##$USERP4= <user>
##$USERP5= <user>
##$WDW= 1
##$XDIM= 32768
##$YMAX_p= 472274808
##$YMIN_p= -699799
##$CURPLOT= <Network HP LaserJet P1505>
##$CURPRIN= <$Network HP LaserJet P1505>
##$DFORMAT= <normdp>
##$LAYOUT= <+/1D_H.xwp>
##$LFORMAT= <normlp>
##$PFORMAT= <normpl>
##$SURQMSG= 1
$$ End of Bruker specific parameters
$$ ---------------------------------
##NTUPLES= NMR SPECTRUM
##VAR_NAME=  FREQUENCY,     SPECTRUM/REAL,   SPECTRUM/IMAG
##SYMBOL=    X,             R,               I
##VAR_TYPE=  INDEPENDENT,   DEPENDENT,       DEPENDENT
##VAR_FORM=  AFFN,          ASDF,            ASDF
##VAR_DIM=   32768,         32768,           32768
##UNITS=     HZ,            ARBITRARY UNITS, ARBITRARY UNITS
##FACTOR=    0.250966925370066, 1,           1
##FIRST=     8223.43324360094, 10299,        -302177
##LAST=      0,             13850,           -159476
##MIN=       0,             -699799,         0
##MAX=       8223.43324360094, 472274808,    0
$$ Real data points
##PAGE= N=1
##DATA TABLE= (X++(R..R)), XYDATA
$$ [...]
19513f2839l54479I4922h562l29000a38661j93326C74622e769m2919B49579a35770
19501c49911j9987h2592R862K4698B17642c29814i1130j3916A76617O4491b20247
19489A07949B7654J3674a32051B44865e3090k53271A79508a26791b7026k65383
19479b92409I9840a61561j16489a32455J8972a5279r9410A11887a65536G5456
19468C7523a77552O1543A17069a70855Q458B47095a42975B61741l9914b16942
19457a93316k28240a30912A50020a23565H890K03183a3701j07119D768d0077B49758
19445a96939E3296b17611A59052a84343B4772b18464k6225j05530A28537J0996
19435A39533a44010A99269c6738n1152l32468A19940a6692k52934A20983h2118
$$ plain form
19513 -62839 -417318 94922 -8562 -337562 -138661 -331987 374622 -5769 -48688 249579 -135770
19501 -349911 -369898 -82592 -72730 -48032 217642 -329814 -91130 -105046 176617 241108 -220247
19489 107949 27654 41328 -132051 244865 -53090 -306361 179508 -126791 -27026 -292409
19479 -292409 99840 -161561 -278050 -132455 -113483 -15279 -114689 111887 -165536 75456
19468 37523 -177552 -116009 117069 -170855 -162397 247095 -142975 261741 221827 -216942
19457 -193316 -421556 -130912 150020 -123565 8890 212073 -13701 -120820 4768 -40077 249758
19445 -196939 53296 -217611 159052 -184343 24772 -218464 -244689 -350219 128537 139533
19435 139533 -144010 199269 -36738 -87890 -420358 119940 -16692 -269626 120983 -82118
19424C8831g3636j32266G8774e9765C40811j60038q4433b05444N2712b4626l65471
19413c90097a81026C7725c21515J09693a5167j53581B20447M3527a2261j83576
19403a95837F1066a16212G9885f9468j15932C2806K859a02771A27239i902k82250
19392b92152a40151r0653d0598j96758i7886l20425a78073E5560g6947j53990
19382b30937c7970A22736J38115A02874a50259k99516g2100l45338h7153R006
19372g8147n6566q3371B45d6333I5722J92070m7251a57291k15363I4566K29105
19361C23671c47714f0485B42180A09263b13190B06777b8400k39647b9938m00864
19351d30802B01203F5078p104e3053D5277a01418B11665a99293d2336q400A5971
$$ plain form
19424 38831 -73636 -205902 78774 -59765 340811 180773 96340 -205444 -152732 -24626 -390097
19413 -390097 -181026 37725 -321515 -211822 -15167 -168748 220447 263974 -12261 -195837
19403 -195837 61066 -116212 79885 -69468 -185400 32806 35665 -102771 127239 -9902 -292152
19392 -292152 -140151 -230804 -40598 -237356 -97886 -418311 -178073 55560 -76947 -230937
19382 -230937 -37970 122736 260851 102874 -150259 -449775 -72100 -417438 -87153 -78147
19372 -78147 -134713 -218084 245 -46333 95722 287792 240541 -157291 -372654 94566 323671
19361 323671 -347714 -60485 242180 109263 -213190 206777 -28400 -268047 -29938 -430802
19351 -430802 201203 65078 57974 -53053 45277 -101418 211665 -199293 -42336 -50736 15971
19339b34472O5996r6440R9822B37240a68705n1617k4045J04112l10078a30416
19328e2945A31139g1127B69499q6573k088b7648o3276k51293c7606j2997B27208
19316h7249a9867j97740E5557K96573C0443F680J69504q3539D0801P0359a18609
19304B57558b61335N5539A38771m6780b0549l7690K2568D278a50540b7660n34583
19293e62243c3136a2983A71999c01095B17411a02710D8004C648J29078h4185j78503
19282b62688O5027O0300N3527L484B00118h8512A13936Q279g4844k33703Q1929
19271b26618R9604j32020h3975A6074K21970H5298Q6839a6397j11626A15356e4117
19259E4098b98872J38651j7971A15884k793c33713h0233l9518k2793B29530F7114
$$ plain form
19339 -234472 -168476 -264916 -165094 237240 -168705 -220322 -244367 -140255 -450333 -130416
19328 -52945 131139 -71127 269499 182926 180838 -27648 -90924 -342217 -37606 -50603 227208
19316 -87249 -19867 -217607 55557 352130 30443 6680 176184 92645 40801 111160 -118609
19304 257558 -261335 -205796 138771 91991 -20549 -58239 -35671 4278 -150540 -27660 -562243
19293 -562243 -33136 -12983 171999 -301095 217411 -102710 48004 3648 132726 -84185 -262688
19282 -262688 -197661 -137361 -83834 -80350 200118 -88512 113936 122215 -74844 -308547 -226618
19271 -226618 -127014 -259034 -83975 16074 238044 85298 172137 -16397 -128023 115356 -54117
19259 54098 -298872 -160221 -178192 115884 113091 -333713 -80233 -119751 -142544 229530 67114
19247A98925a17635I8899a88733I9228l3778a08527l5877B10164a81079a4174
19236B74716F5262g0656F5562R3960h5443k18311C23751g7939j06600B11513d7991
19224C56717b25013D9881J951R5198c03852j72165A23131a72157j62034J30975
19214b03216A25990J19966A4095K82894f5902q5729A80232c3736j09073j5876
19204a58685N9666l06001a8113r3368j9320h789l01574P370a18285C3903J63709
19193A97612G9577P9416a37685A154c38691d4318k1490n6061j2306e3715K3079
19182c0636a1936r9013E2123K77230i8435A47662e6963K4647n9310a9519j98290
19171b17809A10089e70038i0343H7322R4447b04765L8125B79558h8517A10150
$$ plain form
19247 198925 -117635 98899 -188733 99228 65450 -108527 -144404 210164 -181079 -14174
19236 274716 65262 -70656 65562 159522 -85443 -303754 323751 -77939 -184539 211513 -47991
19224 356717 -225013 49881 51832 147030 -303852 -476017 123131 -172157 -334191 -203216
19214 -203216 125990 245956 14095 296989 -65902 -151631 180232 -33736 -142809 -158685
19204 -158685 -99019 -405020 -18113 -111481 -130801 -8789 -310363 -302993 -118285 33903 197612
19193 197612 79577 158993 -137685 1154 -338691 -44318 -65808 -121869 -134175 -53715 -30636
19182 -30636 -11936 -110949 52123 329353 -98435 147662 -56963 -32316 -91626 -19519 -217809
19171 -217809 110089 -570038 -90343 87322 181769 -204765 -166640 279558 -88517 110150
19160f0863k10948l1636Q8823h9737A88218g0112K3369B74851H4424d7854j9022
19149f6876B13868d6657j20080d9263C3564J63966c77051J24332f4425p1662c9282
19137a18143K5269k59614O1103a3246m3709C32866a12045N0317b8292l63588F4799
19125c85005C4116J7673c43391J60116a3459B65312c90638a16855A55805c2511
19114b5397A40343a44929d4160B21108j03984c96707A08978f1474B21218H0621
19103e23905a63024B61509E6729f9170l28274c7548A36503b94737G2953J48598
19093B21551a97537A44981n9715b73965F695e55899b64163f8777A8034c5275q8206
19082a23481r4547O0234j78163j77889g0531b9466A00092P6874o1937c43675a07299
$$ plain form
19160 -60863 -271811 -303447 -214624 -89737 188218 -70112 -46743 274851 84424 -47854 -66876
19149 -66876 213868 -46657 -166737 -49263 33564 197530 -377051 -252719 -64425 -136087 -39282
19137 -118143 -92874 -352488 -291385 -13246 -56955 332866 -112045 -61728 -28292 -391880 64799
19125 -385005 34116 51789 -343391 -183275 -13459 265312 -390638 -116855 155805 -32511
19114 -25397 140343 -144929 -44160 221108 117124 -396707 108978 -61474 221218 80621
19103 -523905 -163024 261509 56729 -69170 -397444 -37548 136503 -294737 72953 221551
19093 221551 -197537 144981 85266 -273965 6695 -555899 -264163 -68777 18034 -35275 -123481
19082 -123481 -218028 -157794 -335957 -513846 -70531 -29466 100092 176966 115029 -343675 -107299
19070C09413a50256D9678a00877D5130d1274J2770i998E2629f655k06586f3521
19058F3626c36966A98982m0856b62665A21656c4598k81319A79915c6950G5217
19047a7042n3592l0317A30219d3144C2504K69082B4879c7056D78581b47779J0731
19036b37048b4850j02388j8365g173D6969O077c88219B45500M5827a78124q2480
19025b60604b6897o6482K0068p3948A07856B2656b93267I3971h8812n6538b7081
19013a89131N5913A36048J02304a96490j84044e0486l82803A0783J09563B6871
19002a29568a7296k73234A12827f3640F7149N1853b58616h5813r6615B17985L8337
18991B56322a55626A18833E5849a91806g9776m4800F1207b08660i6465A12256
$$ plain form
19070 309413 -150256 49678 -100877 45130 -41274 -28504 -9998 52629 -6655 -213241 -63521
19058 63626 -336966 198982 158126 -262665 121656 -34598 -315917 179915 -36950 75217
19047 -17042 -70634 -100951 130219 -43144 32504 301586 24879 -37056 478581 -247779 -237048
19036 -237048 -24850 -127238 -145603 -7173 46969 53046 -388219 245500 291327 -178124 -260604
19025 -260604 -26897 -93379 -73311 -147259 107856 22656 -293267 93971 -88812 -145350 -27081
19013 -189131 -133218 136048 238352 -196490 -380534 -50486 -433289 10783 120346 26871
19002 -129568 -17296 -290530 112827 -63640 67149 119002 -258616 -85813 -182428 217985 256322
18991 256322 -155626 118833 55849 -191806 -79776 -124576 61207 -208660 -96465 112256
18980b61074F51a685k16601C0901P4822a18168A15962P600d12641F4843J03035
18969A67878c9108A50736I279a74393L1236m9187k27250J10596J05753E4892a98650
18957h4000o958q5743A71062a60184M4349A62696K6104g6255l84748E5225b4047
18945a54574O4826A27229C5234a98021B05591E2737b7525k44490d0599k28359
18935b68958C38192b71055b8400A47533i4040H3424i642B5552d07614C85117o9624
18924C15493A18403B1753c839H6445K7488b47175l5581d1938o4408F3756g9082
18912b09616L4991A91469J45529E5137b33849M4917f2481A0572c33042A5773d36355
18900e6343j25869H990c31785B02801b97447I1786a94661e3244H5680a22533M256
$$ plain form
18980 -261074 651 -1685 -218286 30901 105723 -118168 115962 123562 -412641 64843 167878
18969 167878 -39108 150736 9279 -174393 -143157 -192344 -419594 -308998 -203245 54892 -198650
18957 -84000 -90958 -176701 171062 -160184 -115835 162696 188800 -76255 -461003 55225 -24047
18945 -154574 -89748 127229 35234 -198021 205591 52737 -27525 -272015 -40599 -268958
18935 -268958 338192 -271055 -28400 147533 -94040 83424 -9642 25552 -407614 385117 315493
18924 315493 118403 21753 -3839 86445 113933 -247175 -282756 -41938 -106346 63756 -79082
18912 -209616 -174625 191469 336998 55137 -233849 -188932 -62481 10572 -333042 15773 -436355
18900 -56343 -182212 8990 -331785 202801 -297447 91786 -194661 -53244 85680 -122533 -118277
18889a18277A09164b3194B01868p936O7599f1651k67061J40591C7135a87214P40
18878a86474N811A06609d2102A46245C2214K46869c4722C70089a59556I8940b73009
18866b4841j51919m7599P6092r1776i3240k45185a1909E9344j1471e9927B54124
18854c25056B01818A1607d4617A80912C482K779a03335B43503a07981B07307b33746
18842D46391a25173n1572K3571d522A02321a10305A9550P1061a27740B32534J91278
18831D23812a0927A05381J67797a79813d8547j00427R561O0454o999j10024A91766
18819b7216H3217c97867a01465A4242J37847E3084J3964b23464B24367d4690k5776
18808g0466O665l1886E0447b10144m1943k1162j0881A04292m6225e01686i3395
$$ plain form
18889 -118277 109164 -23194 201868 193932 261531 -61651 -328712 -188121 37135 -187214 -186474
18878 -186474 -180663 106609 -42102 146245 32214 279083 -34722 370089 -159556 98940 -273009
18866 -24841 -176760 -224359 -148267 -240043 -93240 -338425 -11909 59344 47873 -59927 254124
18854 -325056 201818 11607 -44617 180912 3482 6261 -103335 243503 -107981 207307 -233746
18842 446391 -125173 -176745 -153174 -4522 102321 -110305 19550 90611 -127740 232534 423812
18831 423812 -10927 105381 273178 -179813 -48547 -148974 -139413 -78959 -85958 -195982 191766
18819 -27216 83217 -397867 -101465 14242 152089 53084 67048 -223464 224367 -44690 -70466
18808 -70466 -63801 -95687 50447 -210144 -252087 -273249 -284130 104292 58067 -501686 -93395
18796i9706B22299M5913e8954j31429C79402a40191R649E9734a49365A8877J8078
18785C6955b29427D8063a15836A66278g0673j24853l7758M6637j42959L4449j73455
18774d68612d1279j85919A01639Q9412f6269k19920J27620B03760d09468D5493
18763C35635I166R2938a35620B76768C5014j6116a91198H6402a41070c8396a8358
18751B3895e9943k15756J31717b2857q2483k44735b4913k24956H6921c18312a52871
18739F5925c20749a59011j8605B36286E0278J46797I4982c3441m51231B27508
18728h9483H681b48446C59035a32558o1858H7138J39101C5662Q7112K10916I3879
18716B15630c11391A8210g4125B28586a17908E8197a22998m6760I0032c05561
$$ plain form
18796 -99706 222299 268212 -58954 -190383 379402 -140191 -130542 59734 -149365 18877 36955
18785 36955 -229427 48063 -115836 166278 -70673 -195526 -233284 -186647 -329606 -295157 -468612
18774 -468612 -41279 -227198 101639 191051 -66269 -286189 -158569 203760 -409468 45493
18763 335635 9166 102104 -135620 276768 35014 18898 -191198 86402 -141070 -38396 -18358
18751 23895 -59943 -275699 -143982 -22857 -105340 -350075 -24913 -249869 86921 -318312 -152871
18739 65925 -320749 -159011 -177616 236286 50278 197075 94982 -33441 -484672 227508
18728 -89483 8681 -248446 359035 -132558 -194416 87138 226239 35662 122774 333690 93879
18716 215630 -311391 18210 -74125 228586 -117908 58197 -122998 -169758 90032 -305561
18705C51627a52977A6138J33413J46810b11760n1480d0124j97192e7468k16864
18695b74332M5569H3077h8164F1749i0543l8174k22036b6327A34246b24569E6140
18683c30484a01879M6650F2327G574e2196a7299j63223J7392h60o1370A34591
18671c07525a18786j79566A02126D3440e3651k46380a06666E8841a06818j96254
18661c03072a31625I2168c05044B8840b5839m54088B7584b8869I0882J14704B9138
18649d18099b07095a9898k31660N4279A93148e4849J9645j6638j52384A20277
18638D6238a63183J4474C15973h4628q5429j09842m333k10154P3112J98119j45909
18627c69064a45552B44426A12585q353J7303d4502B86158c2843j41727M4233q8516
$$ plain form
18705 351627 -152977 16138 149551 296361 -211760 -263240 -40124 -237316 -57468 -274332
18695 -274332 -228763 83077 -88164 61749 -90543 -128717 -350753 -26327 134246 -224569 56140
18683 -330484 -101879 -55229 62327 7574 -52196 -17299 -180522 -163130 -860 -62230 134591
18671 -307525 -118786 -298352 102126 43440 -53651 -300031 -106666 58841 -106818 -303072
18661 -303072 -131625 92168 -305044 28840 -25839 -479927 27584 -28869 90882 205586 29138
18649 -418099 -207095 -19898 -251558 -197279 193148 -54849 -35204 -51842 -204226 120277
18638 46238 -163183 -148709 315973 -84628 -170057 -279899 -284232 -494386 -421274 -223155 -369064
18627 -369064 -145552 244426 112585 104232 121535 -44502 286158 -32843 -174570 -130337 -218853
18616b18853D5183a0097j09427L701A4096L26661B8179g2095l58914e9462j78234
18605b37696r8846A09167g3112r9217A45184b71121E7455c76431J76914d6599
18594d0976q3739a4087p2468B47228O8143d3636k012k50014H8597a95998C0296
18582a29241B4338L8794c49851f5686H3131i255l62817E0727J36026j0400C7683
18570a48294H3290Q6167L3827a26619k81977a68041H572b2505I9600K75663c41515
18558A83373F6880e16822a75759j67817J12555R355P3514e8316o8806H1402b41396
18546A01137c03693Q3564n3525k1923C63484G8052b21005N4810E3543J3778J41516
18535B08837q2746a16588L0876I7944a75084A06436b55121f1855k69893a34512
$$ plain form
18616 -218853 45183 -10097 -119524 -115823 14096 340757 28179 -72095 -431009 -59462 -237696
18605 -237696 -336542 109167 -73112 -172329 145184 -271121 57455 -376431 -199517 -46599
18594 -40976 -124715 -14087 -86555 247228 315371 -43636 -45648 -295662 88597 -195998 30296
18582 -129241 24338 63132 -349851 -65686 83131 -9255 -372072 50727 186753 176353 37683
18570 -148294 83290 169457 203284 -126619 -408596 -168041 8572 -22505 99600 375263 -341515
18558 183373 66880 -516822 -175759 -343576 -231021 -221666 -148152 -58316 -127122 81402 -241396
18546 101137 -303693 -220129 -273654 -295577 363484 78052 -221005 -166195 53543 67321 208837
18535 208837 126091 -116588 -85712 97944 -175084 106436 -255121 -61855 -331748 -134512
18524a36418H8601f6513E21727b10452c5399p7032B92274e5478A90762a64220
18513A53161c2833A46314N917b22160J0044H5717c7756A37458e2212j07244A94511
18501B18440R9551f1131n27336K77853c9537C9036Q7411a69084M809C6390k276
18490C4114d7965C46105a92077d0852E6821b08012l1353i913B2687e7674j7562
18479g5236A82090P9055a67547m0337I2362m1137b30534E01042c21235a01794
18468g5861p0932A18432b35798I4066a53647A7510c15384a6949C19829a453B35520
18456d4163j55629E6247N6913e0828m5921k2287c5592j09506j31660B8009b24074
18444a23295A261a32131D95730O9755b81412E195i6412M1367D5511a21861c0186
$$ plain form
18524 -136418 88601 -66513 521727 -210452 -35399 -112431 292274 -55478 190762 -164220
18513 153161 -32833 146314 152231 -222160 -212116 85717 -37756 137458 -52212 -159456 194511
18501 218440 317991 -61131 -588467 -310614 -39537 39036 126447 -169084 -164275 36390 34114
18490 34114 -47965 346105 -192077 -40852 56821 -208012 -239365 -9913 22687 -57674 -75236
18479 -75236 182090 261145 -167547 -207884 92362 51225 -230534 501042 -321235 -101794
18468 -75861 -146793 118432 -235798 94066 -153647 17510 -315384 -16949 319829 -1453 235520
18456 -44163 -199792 56247 113160 -50828 -96749 -119036 -35592 -145098 -276758 28009 -224074
18444 -123295 1261 -132131 495730 565485 -281412 5195 -96412 -55045 45511 -121861 -30186
18432b81890Q4841P5238d0678j22189E1964e14987C3803J5180i9603k2000A65428
18420b09066Q8249N6644A41526K1239q105J67753b37214A11124j4005a54098E0132
18408C0257b20699a6231A47890J10128K5971q2653a31917C21129H5678b95729
18397f1350l3417b405A61420a48232a6427C55847A52417k4424o1306K79041h3765
18385b27004Q0419B00033a47664D522b03648j99614O9807E0959a18782J0223j52930
18374b61489A32939a06230j752J2216A72006b20631C0172a70730F2733b03452
18363b40476B07580b88428A65083c65947B55681j17856c57054A5816a5057k28056
18353b43113e1503A14322J17188b32578R7109f2874j47234f6438o493p8516f506
$$ plain form
18432 -281890 -197049 -121811 -40678 -162867 51964 -514987 33803 48983 -99603 -121603 165428
18420 -209066 -120817 -64173 141526 162765 154660 322413 -237214 111124 97119 -154098 50132
18408 30257 -220699 -16231 147890 258018 283989 201336 -131917 321129 85678 -295729
18397 -61350 -94767 -2405 161420 -148232 -16427 355847 152417 127993 66687 345728 -83765
18385 -227004 -146585 200033 -147664 4522 -203648 -403262 -333455 50959 -118782 -108559 -261489
18374 -261489 132939 -106230 -107982 -95766 172006 -220631 30172 -170730 62733 -203452
18363 -240476 207580 -288428 165083 -365947 255681 137825 -357054 15816 -15057 -243113
18353 -243113 -51503 114322 231510 -232578 -135469 -62874 -210108 -66438 -72931 -151447 -6506
18341g3634B4265J24747a0608F7023a99199B37231c53149a06474B39045j1675
18331B27370e2446j32281n7576B19219a08273A42821a05234j61643C6212a47031
18320a24851A2755h384j53284E6991P0520j4887a31972A00091E63J63844c72386
18308c34702D2954h182j11075k2284M1560c3503j37427P1412A0041J57578i5686
18296A54863a77488A09880j5056Q5237E1790b10041f8144A42416l4151a48746
18285B4343d71955I0308J12563h3643A46909f0136a4463M655j76925r0084A2880
18273i7034r1704b3552l23479A76382f2505A75849K27493b23533K7218j84500
18263c80815A60596c9798r7601k57595C15390A16232A6299a56567p0578D9381
$$ plain form
18341 -73634 24265 149012 -10608 67023 -199199 237231 -353149 -106474 239045 227370
18331 227370 -52446 -184727 -242303 219219 -108273 142821 -105234 -266877 36212 -147031
18320 -124851 12755 -8384 -161668 56991 127511 112624 -131972 100091 563 164407 -372386
18308 -334702 42954 -8182 -119257 -141541 -99981 -33503 -170930 -99518 10041 167619 -95686
18296 154863 -177488 109880 94824 180061 51790 -210041 -68144 142416 108265 -148746
18285 24343 -471955 90308 202871 -83643 146909 -60136 -14463 -9808 -186733 -276817 12880
18273 -97034 -188738 -23552 -347031 176382 -62505 175849 403342 -223533 -196315 -380815
18263 -380815 160596 -39798 -137399 -394994 315390 116232 16299 -156567 -227145 49381
18252A0927a40413L5286j64262f9350r1291C06657A22323A6876J39729C9394a75609
18240B08937a21641n091A5525a80516h2535G3240K2686B3078c69537a76370F7112
18228b2746j91551q1800L3630B39888c7884j73965j2362g1330F5505a11527B07692
18216a5551n9713r7140C08522g6774j35597P7008A11184a66798A70505b8187A89526
18204c46374d6948k5931H7863a33593a2610B0469J52041a64722D7793c43005E261
18192A1145b48330A1130g7382j15858A48027a2341p5654N330k7117A3722f3858
18180a79556B734a08876c6898j67463n6896A2130Q1267a29140j0369k03994E1431
18168A5149b58729l5272A08686j7243m0370k1554K46915B9369h8052l28418g3020
$$ plain form
18252 10927 -140413 -105127 -269389 -69350 -160641 306657 122323 16876 156605 39394 -175609
18240 208937 -121641 -126732 15525 -180516 -82535 73240 95926 23078 -369537 -176370 67112
18228 -22746 -214297 -296097 -262467 239888 -37884 -211849 -224211 -71330 65505 -111527 207692
18216 -15551 -75264 -172404 308522 -76774 -212371 -135363 111184 -166798 170505 -28187 189526
18204 -346374 -46948 -72879 87863 -133593 -12610 20469 172510 -164722 47793 -343005 5261
18192 11145 -248330 11130 -77382 -193240 148027 -12341 -87995 -82665 -109782 13722 -63858
18180 -179556 2734 -108876 -36898 -204361 -261257 12130 93397 -129140 -139509 -343503 51431
18168 15149 -258729 -294001 108686 91443 51073 29519 276434 29369 -88052 -416470 -73020
18156c9051D2979O15666a60110d1950E762K1383M295a60154J430D0082P2546i2257
18143B98598h5573C00355a41037K34b3761l06014H5695b0134B70326H1356c89005
18131A92923a28906B67350D7294a57861f6650J1750A13645E892L89962j71472
18121B24382A02019a00413j0378k3617A67712q2961J18027H0990a33799D9696
18110d2920F7478M9973a87532R2418D38a89457B80261a49608L0772N6721b9108
18098I1224f3056j87910d4409j5450I2300f6384A19424a42565c7268q2168e7613
18086H3136b97705a44396q5081p1196J28075k01332a03781I9889D4259b81864
18075a74954r6997C16563a3948j54508r8490A20608l4187b0456m5208A72270a36764
$$ plain form
18156 -39051 42979 658645 -160110 -41950 5762 27145 31440 -160154 -158724 40082 112628 -92257
18143 298598 -85573 300355 -141037 -140803 -23761 -329775 85695 -20134 270326 81356 -389005
18131 192923 -128906 267350 47294 -157861 -66650 -54900 113645 5892 395854 224382
18121 224382 102019 -100413 -110791 -134408 167712 84751 202778 80990 -133799 49696
18110 -42920 67478 117451 -187532 -95114 438 -189457 280261 -149608 -118836 -62115 -29108
18098 91224 -63056 -250966 -44409 -59859 92300 -66384 119424 -142565 -37268 -119436 -57613
18086 83136 -297705 -144396 -229477 -300673 -172598 -373930 -103781 99889 44259 -281864
18075 -174954 -271951 316563 -13948 -168456 -266946 120608 86421 -20456 -65664 172270 -136764
18063D8688j3158L0418P6480b98262F9377h4707D9241P6733c5707C18782A09272
18051I4410Q5437f2784b7062j36845N3497A09530N3907J17184B7616J05754C9364
18039D2154b72150K5571a18156b3991C57149j7448A305a54927M0589C5078l981
18028C1097d7811A00534c46058a47244A70335N3252C1590Q3810j2988c0562n9583
18017i0145o7689o2964J03365c9154B43049a43175B42694d1331j22438M5690l7586
18006a55665b919l7810a3629k1821A16134E7751a22300j02952G9121a36669q4878
17995b21547A81462b21846C6839b33765R5988j74362B197K57204A9960a77889
17984b32668B76661c11964a09179B42316b25138H4845d1111m2745A63767h7696
$$ plain form
18063 48688 35530 65948 142428 -298262 69377 -84707 49241 125974 -35707 318782 109272
18051 94410 179847 -62784 -27062 -163907 -110410 109530 163437 280621 27616 133370 39364
18039 42154 -272150 -246579 -118156 -23991 357149 339701 1305 -154927 -114338 35078 31097
18028 31097 -47811 100534 -346058 -147244 170335 223587 31590 115400 102412 -30562 -90145
18017 -90145 -157834 -220798 -117433 -39154 243049 -143175 242694 -41331 -163769 -118079 -155665
18006 -155665 -2919 -40729 -13629 -35450 116134 57751 -122300 -225252 79121 -136669 -221547
17995 -221547 181462 -221846 36839 -233765 -137777 -312139 2197 259401 19960 -177889
17984 -232668 276661 -311964 -109179 242316 -225138 84845 -41111 -83856 163767 -87696
17973F2057d4050D135d3902A44015d7246o3842N2219l68938a91438p3562A00375
17961A94235a05825q0584a1200B9688o778J7799g2707A50011a16777M8347r3560
17950a61990d4743k51704A0777R1421a3170C3230h8665d4178D7655a2688C59687
17938e2209j4319j13962j77037D7112P6639n9259N1828J23974a47122f6265A17704
17926C09638E6597i2025C6958g2205j36390B74316C0451b93332g7231J2707A0115
17914B51591m97p8485G7657a61786j815k99769b30005I3713M990J4596i0j94165
17902a94255B07075H5468b67089i3815B60066a82748a2991B01796g2038p7441
17892a49479B75906a23103L7144E50100g6615J8009l7861m77385a22256j66340
$$ plain form
17973 62057 -44050 4135 -43902 144015 -47246 -111088 -58869 -427807 -191438 -265000 100375
17961 194235 -105825 -186409 -11200 29688 22910 40709 -72707 150011 -116777 -68430 -161990
17950 -161990 -44743 -296447 10777 102198 -13170 33230 -88665 -44178 47655 -12688 359687
17938 -52209 -66528 -180490 -357527 47112 123751 64492 116320 240294 -147122 -66265 117704
17926 309638 56597 -92025 36958 -72205 -208595 274316 30451 -293332 -77231 -64524 10115
17914 251591 251094 172609 77657 -161786 -163601 -463370 -230005 93713 98703 113299 -90 -194255
17902 -194255 207075 85468 -267089 -93815 260066 -182748 -12991 201796 -72038 -149479
17892 -149479 275906 -123103 -85959 550100 -76615 -58606 -96467 -573852 -122256 -288596
17882b88596C5331b81625k1038A21657c43851A09597d54381A11945L691L4154
17872A49790Q8181b73444A05587N3841E3960Q1220c44801J17221M5835F457J41688
17861A48145o3084f7196j77837A11800a78590P0550A20203K67789A51779p2612
17851G9167c08030J42244C83372b25894l7221I7310a48160b2741k51738B96J6123
17840A6419g6493c7165l0128J4315j38552H8496b0983r4870A97531g4386E4054
17828B13270c8343C47318a31698e811A37238C7608e0555j21259C5480a24457N2464
17817g1993o7656B85303j41181O7638C8271d3106A69178b95302D6676c02716A69850
17805a44353F8004B4585a12450j2131j83995a09958l9226B7494P8948J04352F450
$$ plain form
17882 -288596 35331 -281625 -302663 121657 -343851 109597 -454381 111945 115636 149790
17872 149790 237971 -273444 105587 159428 53960 135180 -344801 -227580 -181745 6457 148145
17861 148145 85061 -67196 -245033 111800 -178590 -108040 120203 387992 151779 79167
17851 79167 -308030 -165786 383372 -225894 -263115 97310 -148160 -22741 -274479 296 16419
17840 16419 -76493 -37165 -67293 -52978 -191530 88496 -20983 -115853 197531 -74386 54054
17828 213270 -38343 347318 -131698 -5811 137238 37608 -50555 -171814 35480 -124457 -71993
17817 -71993 -139649 285303 144122 211760 38271 -43106 169178 -295302 46676 -302716 169850
17805 -144353 68004 24585 -112450 -124581 -308576 -109958 -149184 27494 106442 210794 6450
17793d3121B50720k7575a2921A88901r3028a25867b6616F6880b2040B17211a6581
17781i5659A91685I3349a24544A8581J01204M9612M0533P1602A12757B3409J18872
17770A42281o2624a2099C89914q9013a71023m3324a4233n46k65217C3660g0899
17758H1108a16621F193b58691e5241I1588J608m0764b700B3333r764c2635m3708
17746g6343q4093c9042E5340a64583A50343L58813j70383A29865m4045L94672
17736D80492d9369g515m2589B26117a40268A70577A9174K3376a00889K7813n9668
17725a32744M9906n4292B08531k3317N5209C5841O9427c04888a39755C1186J73783
17714B04969a11883r0796A12826c8698o3326b4381H2447b2694C61862c7111D5747
$$ plain form
17793 -43121 250720 223145 -12921 188901 95873 -125867 -26616 66880 -22040 217211 -16581
17781 -95659 191685 93349 -124544 18581 119785 169397 209930 281532 112757 23409 142281
17770 142281 79657 -12099 389914 300901 -171023 -214347 -14233 -14779 -279996 33660 -70899
17758 81108 -116621 6193 -258691 -55241 91588 93196 52432 -2700 23333 13569 -32635 -76343
17746 -76343 -160436 -39042 55340 -164583 150343 509156 338773 129865 85820 480492
17736 480492 -49369 -7515 -50104 226117 -140268 170577 19174 42550 -100889 -73076 -132744
17725 -132744 -82838 -137130 208531 185214 240423 35841 105268 -304888 -139755 31186 204969
17714 204969 -111883 -202679 112826 -38698 -102024 -24381 82447 -22694 361862 -37111 45747
17702A26260f5426o2815o3475o0069E5876b52746c8736D11776d4890n0016n0853
17691a45759j9787B52836f8604c2251k240B00353B8549P9762a04273L8637j40705
17680b06341h4307B36509b5171B13841F7633M1508J37932j23051C7693K41981
17670B79674a1929B00592q6760a54958A32431a77413O0983A9156a82067e3221
17659A04555h179j52728e2214A17270R2530I4375D5589b99353C39513j14918G2534
17647a37340D5709c80553K1247M6697B64011o6234a6349k71608D1981A6242P0961
17636H7203a96927A13464a90702G0064M77264I2831b2907D4712N77737A15058
17625D5150P2991n2301j447a03971J6972G8665b2838F1941a57268A08599a82831
$$ plain form
17702 126260 -65426 -128241 -191716 -251785 55876 -252746 -38736 411776 -44890 -94906 -145759
17691 -145759 -165546 252836 -68604 -32251 -34491 200353 28549 108311 -104273 -65636 -206341
17680 -206341 -84307 236509 -25171 213841 67633 109141 247073 124022 37693 279674
17670 279674 -11929 200592 113832 -154958 132431 -177413 -116430 19156 -182067 -53221
17659 104555 -8179 -160907 -52214 117270 209800 94375 45589 -299353 339513 224595 72534
17647 -137340 45709 -380553 -359306 -312609 264011 197777 -16349 -287957 41981 16242 87203
17636 87203 -196927 113464 -190702 70064 547328 92831 -22907 44712 622449 115058
17625 45150 118141 65840 64393 -103971 -86999 78665 -22838 61941 -157268 108599 -182831
17613a95944e6341C12999A26170d0832F3891a51710N9304D5164J24185d4864H7072
17601a61706e3739C33403I2016l9592J35980f2537J6854F838c08317J47345q4746
17590b45718A40513K5412B0082O348c4884A75077n1541K05699C9710J10226M7339
17579A97275G9047b40396d8963B60334A01325f4450a0062o884A29596B8153f972
17567f5307K4797G1820a06183A9285K24178P0933a09846A05274e4858j05638k6592
17556a87088A57209B9283a37896l5229A898G5d5647B27684a53008B09467B3487
17544C54704j36695G2117L32311E476a01841G2565h6058A26154g5458A59132o7234
17533I1898d7567B33163p2052a21379k43539c3619p1132D14324A39471a05085
$$ plain form
17613 -195944 -56341 312999 126170 -40832 63891 -151710 -92406 45164 169349 -44864 87072
17601 -161706 -53739 333403 92016 52424 188404 -62537 -45683 6838 -308317 -160972 -245718
17590 -245718 140513 165925 20082 26430 -34884 175077 123536 329235 39710 149936 197275
17579 197275 79047 -240396 -48963 260334 101325 -64450 -10062 -16946 129596 28153 -6972
17567 -65307 -40510 71820 -106183 19285 243463 314396 -109846 105274 -54858 -160496 -187088
17556 -187088 157209 29283 -137896 -173125 1898 75 -45647 227684 -153008 209467 23487
17544 354704 218009 72117 404428 5476 -101841 72565 -86058 126154 -75458 159132 91898
17533 91898 -47567 233163 161111 -121379 -364918 -33619 -104751 414324 139471 -105085
17522c8036D3653B1593J58714G36d6289l7908j33437C28463d686j13822A27993
17510A56934O0700C7213J21780J265o9582C9444b17833b5378G8715b59129B451
17498A84046E4043A793J02048J06779l0876F3356K60433A52322J21305a24631
17487B37286r7328a2282l0986B82539j10256K90654j56617b39552C11519r2398
17477B19121A6768K45854o1998J35302a33058F1938K99698j45547r190G3226R6493
17466A69719P500A788M19312j30905b07255A21223J71481M0078D3872J72095f8944
17454B51618j25518A7284M48598B19490p0040P1649Q2590a34202B43565L1932
17444B75497n8593l3131g003D20357j95400Q738Q6939A30194J36369b6248D67220
$$ plain form
17522 -38036 43653 21593 180307 736 -46289 -84197 -217634 328463 -4686 -118508 127993
17510 156934 217634 37213 158993 160258 90676 39444 -217833 -25378 78715 -259129 2451
17498 184046 54043 1793 103841 210620 179744 63356 323789 152322 273627 -124631
17487 237286 139958 -12282 -43268 282539 172283 462937 306320 -239552 311519 219121
17477 219121 16768 262622 200624 335926 -133058 61938 361636 216089 206899 73226 169719
17466 169719 177219 1788 421100 290195 -207255 121223 292704 332782 43872 215967 -68944
17454 251618 126100 17284 465882 219490 149450 221099 303689 -134202 243565 275497
17444 275497 216904 183773 -7003 420357 224957 233695 320634 130194 266563 -26248 467220
17432E11723a63953A22731J14809l4950B5458J6612K55647K03325k25824j34317
17422A40901K14535A14581k9767K41732A59825m8940J76865l4640M05811I6917
17411B98558o9764A09420C6581J90910A4751N16073j55987O0327h8595A62379
17400B23214e6004A60448L4407q6058K57450L1985a12580C41140o4952L1624r3298
17389B14514E678e686A92037P4804K01731B6229b2342B64409j29051f9864F6365
17377A55532F2318d7337C3661b9107C2283f9944k6958A62938J67975q7219a81543
17365A59798G0499J56241b32758f5070A23021J73483A28847J88693E4533N2166
17355A06699A7539a93912c0908A164J25372J60837J79410A86384c5026A18215
$$ plain form
17432 511723 -163953 122731 237540 202590 25458 42070 297717 501042 275218 140901
17422 140901 355436 114581 84814 326546 159825 110885 287750 253110 658921 96917
17411 298558 228794 109420 36581 227491 14751 530824 374837 435164 -88595 162379
17400 223214 -56004 160448 194855 108797 366247 398232 -112580 341140 276188 307812 214514
17389 214514 5678 -5686 192037 266841 468572 26229 -22342 264409 135358 -69864 66365
17377 155532 62318 -47337 33661 -29107 32283 -69944 -96902 162938 330913 243694 -181543
17365 159798 70499 226740 -232758 -65070 123021 296504 128847 317540 54533 106699
17355 106699 17539 -193912 -30908 1164 126536 287373 466783 186384 -35026 118215
17344B66748e4361A66459a86717A14125L7073g3641A65240J2093o3390g5679A00750
17332a35670C27547i4215L3382B277N1167L81519b1922C25931o4160H9201L33078
17321D22279e4674E23015A10829a09816C41925j43625N6785c3434I7742Q4162
17311A81904a92413C3830L50431d2265m22233B62207O0504p7162P2266J09427
17301D27242B10043d577k02955C35579F5343J43813L18846A35589K46007A47958
17290E6045K1614i6250K4971G2580K5614K51620Q7163f352B2236L40325P0598
17279D33159a18048B75584C7642M43907A17828J48178k1297o0173J53852A0358
17268B06258G1075J45302p6858f5145C00670E8698b35120A22846b8839A25657
$$ plain form
17344 266748 -54361 166459 -186717 114125 151198 -73641 165240 177333 113943 -75679 100750
17332 -135670 327547 -94215 -60833 2277 53444 434963 -21922 325931 261771 89201 422279
17321 422279 -54674 523015 110829 -109816 341925 198300 255085 -33434 97742 181904
17311 181904 -192413 33830 384261 -42265 -464498 262207 322711 245549 317815 427242
17301 427242 210043 -4577 -207532 335579 65343 209156 528002 135589 381596 147958
17290 56045 77659 -96250 -71279 72580 98194 349814 436977 -6352 22236 362561 433159
17279 433159 -118048 275584 37642 481549 117828 266006 244709 184536 338388 10358
17268 206258 71075 216377 139519 -65145 300670 58698 -235120 122846 -28839 125657
17257A51572M83817A73666j0411J33143A14283Q3478K1205p8449P2324M1240K3724
17246B77805o5069K4781l6823M29153F8033P9792d7241o4707O455A57896K25072
17235C82968A62804J98644H6859b13141C91250A13066P0320B1365N081K46883
17225B73329a33025B8254J1349K96665r1276R7344j05452K2874r4218m21K20848
17214C85967A00776a37394F1307K51129Q6721j23954k2783N6035M7262j3836j38940
17203B02941K40659M5546A56349k7806a3135p7959A77600N5305M9912A31275e7154
17191A63391P8285d44B52462K78449A40593J76757j17768K3884l1108C6212Q5001
17180A21213K56193J9140m2323g6468B97891R4040n7240A36561R1170K00246D7500
$$ plain form
17257 151572 635389 173666 163255 296398 114283 197761 218966 140517 212841 254081 277805
17246 277805 212736 237517 200694 629847 68033 147825 -47241 -111948 -105493 157896 382968
17235 382968 162804 361448 86859 -213141 391250 113066 183386 21365 26446 273329
17225 273329 -133025 28254 39603 336268 244992 342336 236884 259758 165540 165119 385967
17214 385967 100776 -137394 61307 312436 399157 275203 252420 308455 355717 341881 202941
17203 202941 443600 489146 156349 128543 -13135 -91094 177600 232905 282817 131275 -57154
17191 163391 241676 -444 252462 530911 140593 317350 199582 223466 192358 36212 121213
17180 121213 377406 396546 354223 -76468 297891 391931 334691 136561 227731 427977 47500
17168B87466I175Q3745P7334K98461j40174H1688K46135I9266L40309j44827A24328
17156C25036K95722B75144A33081L6929J84202o3061J14165H438L10441A32363
17145A14950P3542L01590A5982N50501j27097Q9582A01766K86263k0780A24809
17134D45766K2304j27833l6000M7350N01363B55435J12310j48133J65988J56927
17124E42527j6699k51843L12309k4660B13385K9065n5553C036L76398A65941L2230
17113A98171j2966B8981J92298K044J16390n1108K8981e4265D27513j96560L96272
17102F27225k61183J08932O7625K9053p5940p6375J69863B86571A40409J28010
17092B68419R854L45090B00070L62728B30056M82470k22330q3462j27537L0932
$$ plain form
17168 287466 9175 92920 170254 468715 328541 81688 327823 99266 439575 294748 124328
17156 325036 620758 275144 133081 170010 354212 291151 405316 8438 318879 132363
17145 114950 188492 490082 15982 566483 439386 528968 101766 388029 367249 124809
17134 445766 468070 340237 304237 351587 852950 255435 367745 219612 385600 542527
17124 542527 525828 273985 586294 561634 213385 242450 186897 3036 379434 165941 198171
17113 198171 185205 28981 221279 223323 339713 288605 317586 -54265 427513 230953 627225
17102 627225 366042 474974 542599 571652 495712 419337 589200 286571 140409 268419
17092 268419 278273 623363 200070 562798 230056 712526 490196 406734 279197 310129
17082C10129M90422B99421J54933M15554C82096p605O6539j06667J12130j08829
17072C37664J4868L20115k56888p2495M40614l51387j34910L92609K763l25338
17062C67615m5110K47835k10845K98027K258k56405l9277R5454J30436K30586
17052H20574k92514k05209J19539M153K32236j98790r3683n6611K64611k68207
17042C26099M0193K27085k16958K34444p0840M95878C81985j02035K8000A02851
17031H75651q7497j49924l09531L06086J63044C50387K71257j83850M1905P9501
17021E59200R2399J68341j09438k75929K16526B75439O20115j60872k23115O6708
17011E78275N1261l9224k16008N00901k72381K23856l11760R2975o5152M1105
$$ plain form
17082 310129 800551 299421 454354 869908 382096 374491 441030 334363 446493 337664
17072 337664 352532 672647 415759 343264 783878 432491 297581 690190 692953 367615
17062 367615 322505 570340 359495 657522 659780 403375 364098 459552 589988 820574
17052 820574 528060 322851 442390 446543 678779 479989 386306 329695 594306 326099
17042 326099 366292 593377 376419 610863 540023 1035901 381985 279950 307950 102851
17031 875651 788154 638230 328699 634785 797829 350387 621644 437794 479699 559200
17021 559200 651599 819940 710502 434573 651099 275439 895554 734682 511567 578275
17011 578275 629536 590312 374304 875205 602824 826680 514920 607895 542743 583848
17001E83848L38983k65422j8763M41403m97377J93718J0256L3745k51588j03907
16991D64896N80048k37009L2254Q063C83875M10763l15894L74201j51459L55100
16981A056586k23544K13702k21548N80349l63071j82778l43474J41488J97657
16972H55367R6722l3943j85787o3663J09842J80149J83344L479j29449m982l13623
16961F97456J50955P0396J42410K19528j09707l27690K80253k23839J00406J25191
16951A125359J85402j87788j20523j67078L63347j782J42392k392j07900l18652
16941I10385J02935J09479J87969J03278k85762J07509k92695L25369p0971J17891
16931A315387o3635k72349J60796J01652j9698J81363j26592P3198j07576J53560
$$ plain form
17001 583848 922831 657409 638646 1080049 582672 776390 786646 820391 568803 464896
16991 464896 1044944 807935 840189 848252 383875 794638 478744 852945 701486 1056586
16981 1056586 833042 1046744 825196 1405545 1042474 859696 516222 657710 855367
16972 855367 952089 918146 732359 668696 778538 958687 1142031 1145510 1016061 1011079 697456
16961 697456 848411 918807 1061217 1280745 1171038 843348 1123601 899762 1000168 1125359
16951 1125359 1310761 1122973 1002450 835372 1198719 1196937 1339329 1336937 1229037 910385
16941 910385 1013320 1122799 1310768 1414046 1128284 1235793 943098 1268467 1197496 1315387
16931 1315387 1251752 979403 1140199 1241851 1222153 1403516 1276924 1350122 1242546 1396106
16921A396106J72953j963k12360j52725L99131j84715l2319L08559j95659P9759
16911A576767K6387k36303J787j71832K71848J06612k2182j3191J59094P2248
16901A771235P280J34138l59570K35014q9013K39776l42626L22466J24306J80065
16891B223071l28615K81456m38573J21933K82850l80594J43282L40903k9781j73134
16881B042798q1982j37693n5017O19481k41116K55062k17863Q7596R4262j3251
16871B352277k91703P97324l42231j85926L32535j14900L84542k59874m9096N6697
16861B679645j02347R5366J11154J69221J80J13375K50893j40643l05235L80992
16851C252601J37715l82190J43507L59018J63958m59796l086Q7322O654N18979
$$ plain form
16921 1396106 1569059 1567096 1354736 1202011 1601142 1416427 1384108 1692667 1497008 1576767
16911 1576767 1603154 1366851 1368638 1196806 1468654 1575266 1553084 1539893 1698987 1771235
16901 1771235 1778515 1912653 1553083 1788097 1699084 1938860 1596234 1918700 2043006 2223071
16891 2223071 1894456 2175912 1737339 1859272 2142122 1761528 1904810 2245713 2215932 2042798
16881 2042798 1960816 1823123 1768106 2387587 2146471 2401533 2183670 2271266 2365528 2352277
16871 2352277 2060574 2857898 2515667 2329741 2662276 2547376 2931918 2672044 2622948 2679645
16861 2679645 2577298 2672664 2783818 2953039 2953219 3066594 3317487 3176844 2871609 3252601
16851 3252601 3390316 3008126 3151633 3510651 3674609 3214813 3211727 3299049 3305703 3824682
16841C824682k92401L81617o9329j44825M13667j30803J78357J50278j03264L2316
16831D240295J56435J531K7485j34862K40029o894J53785L37363j21932L23765
16821E217000l27710O11617k77106L77229L72829k44788r0173M23484l72160k9466
16811E660756N81735j18794J19136L20458j88507N62234M29623l6251l25004N64437
16801G569823j59199L30415j4101L47791K88422O73771k83824J38839J84328M25993
16791I502258L17313N3882N5752J72621L69633L60820N62725J29275K51283M47897
16781A2223459M52188L90693M39917L86450K00980J29510O44741O54736L67584
16772A5890258P17322M93576O19685O38453N76628N60723P49825Q82837Q92430
$$ plain form
16841 3824682 3532281 3913898 3844569 3699744 4113411 3982608 4160965 4311243 4207979 4240295
16831 4240295 4396730 4398261 4425746 4290884 4530913 4524019 4677804 5015167 4893235 5217000
16821 5217000 4889290 5500907 5223801 5601030 5973859 5729071 5638898 6062382 5690222 5660756
16811 5660756 6242491 6123697 6242833 6563291 6374784 6937018 7366641 7330390 7005386 7569823
16801 7569823 7410624 7741039 7726938 8074729 8363151 9036922 8753098 8891937 9076265 9502258
16791 9502258 9819571 9873453 9929205 10101826 10471459 10832279 11395004 11524279 11775562 12223459
16781 12223459 12675647 13066340 13506257 13892707 14093687 14223197 14867938 15522674 15890258
16772 15890258 16607580 17101156 17720841 18359294 18935922 19496645 20246470 21129307 22021737
16763B2021737Q47919O23626J284815O89703J093410P29907J256399J383852J216549
16754C1147917J215358J379800J997516J063838J863394J970975K174628K047902
16746D4861328K181495K882946J985050L110033K993788L048148L335386L643259
16738F8041433L853833M413644M236352M790988N526492N193900N752354N868020
16730A07677016O705885O683499O889635P360436P241367P383623P546526P437876
16722A64925863P115154O690712N932393N268567M145531L242887K262956O88503
16714B00272566n77160j709858l288510l962381n465051o088285o204937o981223
16706A65995161q001373p364509p683302p215947p351671p113377p134090o439165
$$ plain form
16763 22021737 22869656 23493282 24778097 25467800 26561210 27291117 28547516 29931368 31147917
16754 31147917 32363275 33743075 35740591 36804429 38667823 40638798 42813426 44861328
16746 44861328 47042823 49925769 51910819 55020852 58014640 61062788 64398174 68041433
16738 68041433 71895266 76308910 80545262 85336250 90862742 96056642 101808996 107677016
16730 107677016 114382901 121066400 127956035 135316471 142557838 149941461 157487987 164925863
16722 164925863 172041017 178731729 184664122 189932689 194078220 197321107 199584063 200272566
16714 200272566 199695406 197985548 194697038 190734657 185269606 179181321 172976384 165995161
16706 165995161 157993788 150629279 142945977 135730030 128378359 121264982 114130892 107691727
16698A07691727n875984o256139n601416n266005m347673m670028m170707m120264
16690F7383511l582804l402294l099754l181769k971431k264972k424331k458007
16682D3998149k021479j643132k109490j825932j320975j783532j333025j492789
16674C0467795j008578j476993r97018r58395r91009j261667o72837r22732q13436
16665B1365130r27541p50318p17084m43196p28145m21243q20045l72225p67239
16656A5418094l44247l87809k53207p09376m58801l68356m81648m8834n70898
16647A1794918k92105n89192L83523o89074m50231q7047j76449k71676j3883r32865
16637H675919P2195k87385q5217N2337n16167k07158k4184k17963m07639P6436
$$ plain form
16698 107691727 101815743 95559604 89958188 84692183 80344510 75674482 71503775 67383511
16690 67383511 63800707 60398413 57298659 54116890 51145459 48880487 46456156 43998149
16682 43998149 41976670 40333538 38224048 36398116 35077141 33293609 31960584 30467795
16674 30467795 29459217 27982224 26985206 26026811 25035802 23774135 23101298 22178566 21365130
16665 21365130 20437589 19687271 18970187 18526991 17798846 17377603 16557558 16185333 15418094
16656 15418094 15073847 14686038 14432831 13723455 13264654 12896298 12414650 12365816 11794918
16647 11794918 11502813 10913621 11297144 10608070 10157839 10070792 9894343 9622667 9608784 8675919
16637 8675919 8748114 8460729 8375512 8427849 7911682 7704524 7680340 7462377 7054738 7131174
16627G131174j99709k37322j88829J88343n85699j1996O6230j4595m91067K62247
16617E918777l85272q0228k67253j78304R4873j64443q0900l14247P8018J08581
16607D729602j09318k49326j6989l6923L71628m32856k70706j90266J25630J05661
16597D026137k17415j85829J98792k46082K66007l61683K62163n01620L3866j09235
16587C165101q4458J86939k32135J68741j7871n93712K61152j45614r6124J43160
16577B755179m59723K77412J76597j76372j11537J77650j77764J01498L0064m54586
16567B138418K38798J59537j39820k20752P6547j04931K2170N2774k6388k86837
16557A909516N33899k45575m69071K38870O041j61906J50976j57688J56600n48318
$$ plain form
16627 7131174 6931465 6694143 6505314 6693657 6107958 6095962 6162192 6147597 5656530 5918777
16617 5918777 5533505 5453277 5186024 5007720 5102593 4938150 4857250 4543003 4621021 4729602
16607 4729602 4620284 4370958 4353969 4317046 4688674 4255818 3985112 3794846 3920476 4026137
16597 4026137 3808722 3622893 3821685 3575603 3841610 3479927 3742090 3240470 3274336 3165101
16587 3165101 3080643 3267582 3035447 3204188 3186317 2592605 2853757 2708143 2612019 2755179
16577 2755179 2295456 2572868 2749465 2573093 2461556 2639206 2461442 2562940 2593004 2138418
16567 2138418 2377216 2536753 2396933 2176181 2252728 2147797 2169967 2222741 2196353 1909516
16557 1909516 2443415 2197840 1728769 1967639 1973680 1811774 1962750 1805062 1961662 1413344
16547A413344M29365j60587K28020l31273K43578j75160J86093p8888k76994K28326
16537A705824n3337r6807k70081P06318n45814k98574K91183j32347M4178L934
16527A354477j72612L86596r8680p1467q3125l35161L47027K5080l7648q4560
16517A229927K61185q2021R4243K45556n35255M618Q83K8738r7402L03885j8080
16506A436277q3348q4139l73814J30786l3869L43714j83367k65884K24470O8019
16496A178845j1597l35154N7184J45810o2990J8778K25972p9508E28845J90061
16486G18906N8034K79706j23239j58016l8284J36195l503j28034J97457k67731
16476F71491L95464k40790O2981M25868n34062K43018m42753M34077l63307N2222
$$ plain form
16547 1413344 1842709 1682122 1910142 1578869 1822447 1647287 1833380 1754492 1477498 1705824
16537 1705824 1652487 1555680 1285599 1991917 1446103 1147529 1438712 1306365 1350543 1354477
16527 1354477 1181865 1568461 1469781 1398314 1315189 980028 1327055 1352135 1314487 1229927
16517 1229927 1491112 1409091 1503334 1748890 1213635 1218253 1219136 1247874 1150472 1454357 1436277
16506 1436277 1352929 1268790 894976 1025762 991893 1335607 1152240 886356 1110826 1178845
16496 1178845 1167248 832094 889278 1035088 972098 990876 1216848 1137340 528845 718906
16486 718906 776940 1056646 933407 775391 737107 873302 869799 741765 939222 671491
16476 671491 1066955 826165 889146 1315014 780952 1023970 581217 1015294 651987 704209
16466G04209M66458k19388j96228J30105R8610K5696m26761P809K22228m1478
16456G71260k9973j34554j94154J85316K29553l17964L93778o1095k4386K3995
16446H41776Q5901J098j87151j7904J57455k35541k24767L50941J27784k05800
16436F93792j16762L0180j78580J58852j52222J70690K2323k50541L39015J45182
16426H61929k75531j59391O0212M4123J14258J67870p4443O9657m0614l40103
16416D27967J62938J32927Q4082l21760M4884m4508L81384k93241o7914B06148
16405A99972K69420J84124M114A96132K03949J40482k30176J69537k5222A84795
16394B77554L93571k35292O5439q1271r9788J64695L00512j21342b8280E65306
$$ plain form
16466 704209 1170667 951279 755051 885156 983766 1009462 582701 590510 812738 771260
16456 771260 741287 606733 412579 597895 827448 509484 903262 842167 817781 841776
16446 841776 927677 928775 741624 723720 881175 645634 420867 771808 899592 693792
16436 693792 577030 607210 428630 587482 435260 605950 628273 377732 716747 861929
16426 861929 586398 427007 487219 531342 645600 813470 739027 808684 768070 427967
16416 427967 590905 723832 807914 486154 531038 486530 867914 574673 506759 206148
16405 199972 469392 653516 657630 196132 400081 540563 310387 479924 454702 184795
16394 277554 671125 435833 501272 420001 320213 484908 785420 664078 -28280 565306
16383D94025A74284K27767N2049J42124J45626k46241A13098J04217J13898a66395
16372F89101C16723p5165K7025P9633R8804M79964C60250L29058l7340B30850
16361B83314K0778p860J23560A80342M69573l14516j37230L27690j13446m4872
16351C67541K8787H5301J73805J27315M7228P134l8581l6823J59309m6320A77821
16339C17258A50180J0266o4982K41409J09742A79189L16908H5630O2463M20920
16329E69013e016B20355R5167O037j43260G8201J89519K74108k46599I1199Q1311
16318A72510K56477C9666P0491J48889k1328R2289L08374G6021J01162K55372
16308D32555j95252Q8838j09073J97572p4991K6595G3027K12742k3466P7219j03483
$$ plain form
16383 494025 174284 402051 454100 596224 741850 495609 113098 217315 331213 -166395
16372 689101 316723 241558 268583 348216 447020 926984 360250 689308 651968 230850
16361 283314 304092 296232 419792 180342 649915 335399 198169 525859 412413 367541
16351 367541 396328 85301 259106 386421 433649 440783 402202 365379 524688 478368 177821
16339 317258 150180 160446 95464 336873 446615 179189 496097 85630 148093 569013
16329 569013 -5016 220355 315522 321559 178299 78201 267720 541828 295229 91199 172510
16318 172510 428987 39666 110157 259046 237718 330007 638381 76021 177183 432555
16308 432555 237303 326141 217068 414640 339649 366244 73027 285769 262303 339522 236039
16297B36039N6702a93001C44571p2776j02273O6101D7280K44926J3118j3669A10971
16285C64432q4741L2080R8175P0459A77311B7610K19047L2721n7181q7175N9770
16274A94792k8794m2801J76887R1490j27806J34294a51889A06548J0285B2577
16263A96403e0546C85670o7046E4548K97454j50999J90769f8935B60548b94699
16252B01188J12440g6327B07009J44962J42718j44348H9391J49020b19463A50472
16241C16777g6714C77068j49328b38984F65992a35712D56567j31112B6440L02734
16231C29174A36165J47697A18929M8265M8289k121i379C04549A48672f6558A22085
16219B48276A08965B1184J46525D6609J91225q4177J05348L46829k01708F1039
$$ plain form
16297 236039 292741 -193001 344571 271795 169522 235623 47280 292206 305324 291655 110971
16285 364432 279691 311771 409946 480405 177311 27610 246657 279378 222197 135022 194792
16274 194792 165998 123197 300084 391574 263768 398062 -151889 106548 116833 22577
16263 196403 -50546 385670 318624 54548 352002 201003 391772 -68935 260548 -294699
16252 201188 313628 -76327 207009 351971 494689 350341 89391 238411 -219463 150472
16241 316777 -76714 377068 227740 -238984 665992 -135712 456567 325455 26440 329174
16231 329174 136165 283862 118929 167194 215483 213362 -9379 304549 148672 -66558 122085
16219 248276 108965 21184 167709 46609 237834 153657 259005 605834 404126 61039
16208A37038n2928J15460q3495J7810h2728A18741a18270B84217a55794A50477
16197C69608A69355a11229b0939E49893B07342R5068K1859a42178F0756b0644
16186A08227f1366n1317A31874l7594M3916c00832a00616H6199N4444K36519F3212
16174C6594M56466A79557N3558p6275J10370h6286C65652q9752A23579J76270
16164B99849j28265e7492I6215c3087j44246I4416J63917a19796A30093c6517
16153f232j28906B90205c18689G9097K98410B5943d0750l8895n4240f1872n0824
16142a12696A13852L00445a27417A73017a22734A01041D0340a4883A26785J02642
16132B29427a84994C63894j02167a08216j18202g5130D6809a36019j8400C99923
$$ plain form
16208 137038 84110 199570 116075 133885 -82728 118741 -118270 284217 -155794 150477
16197 369608 169355 -111229 -20939 549893 207342 302410 324269 -142178 60756 -20644
16186 108227 -61366 -112683 131874 94280 138196 -300832 -100616 86199 140643 377162 63212
16174 36594 493060 179557 233115 156840 267210 -86286 365652 275900 123579 299849
16164 299849 171584 -57492 96215 -33087 -177333 94416 258333 -119796 130093 -36517
16153 -6232 -135138 290205 -318689 79097 377507 25943 -40750 -79645 -133885 -61872 -112696
16142 -112696 113852 414297 -127417 173017 -122734 101041 40340 -14883 126785 229427
16132 229427 -184994 363894 261727 -108216 -226418 -75130 46809 -136019 -154419 399923
16121b90284J2883D794P136k396Q1305d3276j62968G84K26105e1062k12251E9010
16108f8366o8410A07339b91703A33254f6732B87958b44460b2248A57724b26955
16097B34886a15577A46666K01853a98429C32192E0959h6162C4991J24752m7204
16087A12539M2747L4143B6670a65970J9326n0851M9610C1870J20934P9410b28979
16075A35157b330D21479A68688K05344j59474J39812G55b78726F4844f8313j17272
16064a85585a6021H7827d8224B34296a24839M5827i720k78096D33225h3262l338
16053h6600B166N0288g6382c5729k4680K7746E4486D105K47311C6086B849p14
16041B135J17713B8618K00881c34943a02894c3786A30541K5484e3698j78892j5703
$$ plain form
16121 -290284 -277401 4794 11930 9534 90839 -43276 -206244 784 226889 -51062 -263313 59010
16108 -68366 -136776 107339 -291703 133254 -66732 287958 -244460 -22248 157724 -226955
16097 234886 -115577 146666 348519 -198429 332192 50959 -86162 34991 159743 112539
16087 112539 155286 189429 26670 -165970 -146644 -197495 -147885 31870 152804 232214 -228979
16075 135157 -2330 421479 168688 374032 214558 354370 755 -278726 64844 -68313 -185585
16064 -185585 -16021 87827 -48224 234296 -124839 -79012 -9720 -287816 433225 -83262 -86600
16053 -86600 2166 52454 -76382 -35729 -60409 -32663 54486 4105 251416 36086 2849 2135
16041 2135 119848 28618 229499 -334943 -102894 -33786 130541 156025 -53698 -232590 -248293
16030b48293P2154f5675A226L50912c0072m9118A67840g4779A54855p0560C0328
16018b97743J20225J6411d1842j21003C7656J57053D5807b62982b1058B2740J62070
16007A84810a40133A8707J15225J83655I1686b03037B63592b4744j35895B4921
15996b65167p4118E547c3568m851k09676I8596K30868I8720h8345B92570b17420
15984C48503C8066G991Q3986f2636D01147A87808F869i2824J264B44302J06346
15973C50648i6191M5150G828c60808f3442A02825b97317A07581b38945E987J84180
15962A90167f010B53597j14111K4616c3259j85884N2955a0087I3442D4928J15928
15951A60856i4590c9936j71103a03057g881I6080d350k41433C7524N1538c78937
$$ plain form
16030 -248293 -176139 -65675 1226 352138 -30072 -79190 167840 -74779 154855 84295 30328
16018 -297743 -177518 -161107 -41842 -162845 37656 194709 45807 -262982 -21058 22740 184810
16007 184810 -140133 18707 133932 317587 91686 -203037 263592 -24744 -160639 24921
15996 -265167 -339285 5547 -33568 -38419 -248095 98596 329464 98720 -88345 292570 -217420
15984 348503 38066 7991 91977 -62636 401147 187808 6869 -92824 -91560 244302 350648
15973 350648 -96191 -51041 7828 -360808 -63442 102825 -297317 107581 -238945 5987 190167
15962 190167 -6010 253597 139486 164102 -33259 -219143 -166188 -10087 93442 44928 160856
15951 160856 -94590 -39936 -211039 -103057 -7881 96080 -4350 -245783 37524 89062 -378937
15939H2894a28187M2805B6734a53354r1661A35319b67440I8375N1845K8489b25251
15927c72297a50805B73346a68514A71131c91475f4904A2635a14017j93713A73067
15916I466b33865Q3054A39448a3005A25361a44185C7860M7497G944a13240m9706
15905a62946I1555J02380b31640h2639a5471B20961E8069c5119l7228l33258R6236
15894c09369B5531Q5628a80010B12956G3037a6005k06486A1823b58430A39005
15883a1920H3223b3003k37528A40061J8894d34696f7647l38088e3705m06A40886
15871C71985A09923J11792D3735a07660G8617c03943E0445J38470b14493A04445
15860C15458b07718A52782J37097i4014B37686h9473L3642K3816q6618M9470G5608
$$ plain form
15939 82894 -128187 -85382 26734 -153354 -245015 135319 -267440 98375 150220 178709 -225251
15927 -372297 -150805 273346 -168514 171131 -391475 -64904 12635 -114017 -307730 173067
15916 9466 -233865 -150811 139448 -13005 125361 -144185 37860 85357 7944 -113240 -162946
15905 -162946 91555 193935 -231640 -82639 -15471 220961 58069 -35119 -72347 -405605 -309369
15894 -309369 25531 111159 -180010 212956 73037 -16005 -222491 11823 -258430 139005
15883 -11920 83223 -23003 -260531 140061 158955 -434696 -67647 -405735 -53705 -54111 140886
15871 371985 109923 221715 43735 -107660 78617 -303943 50445 188915 -214493 104445
15860 315458 -207718 152782 289879 -94014 237686 -89473 -55831 -32015 -118633 -69163 75608
15848H6159P6856Q6997H3461b03628P4087E828b91671A55073c21923J17860K1977
15837a82086K2278A72168D8393K71217B2759d5206C745g7577A14044i606A47039
15825a68340a0709j76152C10376a51481l42523D5700L1017C5147d80714A72863
15814b8658H3893b47942H8926a83608A0854c79562a30261C9367d29108A51525
15803A44771P5030H5343j4157c58531J49143I7046C0809a29860a000B69863k7080
15792B42783b63535R7769q763F4584b10219O9529j16219a19535M2556A93878c07579
15780a02736c3642A38409n0158b09830A81931L6025a87796i3067I9297J00027
15770A99324J31357D6671I332c37782p5501a59865A68514e1599G3345A0644c06494
$$ plain form
15848 86159 163015 250012 83461 -203628 -129541 5828 -291671 155073 -321923 -204063 -182086
15837 -182086 -159808 172168 48393 319610 22759 -45206 3745 -77577 114044 -9606 147039
15825 -168340 -10709 -186861 310376 -151481 -494004 45700 76717 35147 -480714 172863
15814 -28658 83893 -247942 88926 -183608 10854 -379562 -130261 39367 -429108 151525
15803 144771 219801 85343 71186 -358531 -209388 97046 30809 -129860 -1000 269863 242783
15792 242783 -263535 -165766 -174529 64584 -210219 -140690 -256909 -119535 -76979 193878 -307579
15780 -102736 -33642 138409 88251 -209830 181931 217956 -187796 -93067 99297 199324
15770 199324 330681 46671 9332 -337782 -413283 -159865 168514 -51599 73345 10644 -306494
15758A67124C8483c853l0766A43988E7447a10708B59747r3952a96709R040b1833
15746a62004A02300R8912a69823A37018a74248n78O6357b1466C13267i5732A39835
15734b32847Q2082r7613Q7205j36524b1708D18730c45819J55266j8809O8431A8405
15722d9866o6878A70838k6969K32041G0656f1376j91708J5473C76K1694a87350
15710B08192A252e35490A6531i1116j19071J5502B81422a67445J8803I486b84781
15698f1461A92438E0375M51249A06453B7990K21890I1875c43767E6064a92661
15687E1590c8661j37634b961k05879A0182a68004d4367j63606D2120N7412c3656
15675A50714k4036f6570A17205k0788b17137e905C05736b23107j03669A55744
$$ plain form
15758 167124 38483 -3853 -34619 143988 57447 -110708 259747 165795 -196709 -187669 -21833
15746 -162004 102300 201212 -169823 137018 -174248 -174826 -108469 -21466 313267 -95732 139835
15734 -232847 -150765 -248378 -161173 -297697 -21708 418730 -345819 -190553 -209362 -140931 18405
15722 -49866 -116744 170838 143869 375910 70656 -61376 -253084 -237611 376 22070 -187350
15710 208192 1252 -535490 16531 -91116 -210187 -194685 281422 -167445 -148642 9486 -284781
15698 -61461 192438 50375 501624 106453 27990 249880 91875 -343767 56064 -192661
15687 51590 -38661 -176295 -2961 -208840 10182 -168004 -44367 -207973 42120 99532 -33656
15675 150714 126678 -66570 117205 96417 -217137 -5905 305736 -223107 -326776 155744
15664b06789e3281l09903O6469A01821a60107a2002b900j39943e1043A21167a70142
15652b66416Q9952B09435I8898K8763c73183H2757c22829B1326e2575B6573a06118
15640b49500b7254E2775a10717j41370A99446a97760g9528E0584b3820l34170
15630c57990q8533b4518D325R6643a70154E7297P2568b14991N3451j89505a16777
15618A41496b6957H4813i0808l244K9008b7111E3770J87888f7348a9643j50162
15607a69805q8112C65355F2486d6540q6642G4583B8820b14750M6248A76265a50300
15595C60990j77213E3933b6728A14573a0415j27889J2891L3569C70171F8450d5526
15583C46570A18242D9821M5301J43098a32309d6004I3308f5974l27048D3796J99664
$$ plain form
15664 -206789 -53281 -363184 -296715 101821 -160107 -12002 -2900 -142843 -51043 121167 -170142
15652 -266416 -176464 209435 98898 127661 -373183 82757 -322829 21326 -52575 26573 -106118
15640 -249500 -27254 52775 -110717 -252087 199446 -197760 -79528 50584 -23820 -357990
15630 -357990 -446523 -24518 4325 100968 -170154 57297 129865 -214991 -161540 -351045 -116777
15618 141496 -26957 84813 -90808 -94052 -65044 -27111 53770 241658 -67348 -19643 -169805
15607 -169805 -257917 365355 62486 -46540 -133182 74583 28820 -214750 -168502 176265 -150300
15595 360990 183777 53933 -26728 114573 -10415 -138304 -125413 -91844 370171 68450 -45526
15583 346570 118242 49821 95122 238220 -132309 -46004 93308 -65974 -393022 43796 243460
15572B43460f7675h830k24459k26951a81771L7633A76263h0222m008C52228a18569
15560d6951A5682L39951G5334J40113f7478D15968p1801b2786j69804E1422J34927
15549A86349b52172G5423c7949O267G2122d1999m599a8067A1523P5951f3000j7109
15537h0109B64398b25651A50354a64448j48802F3846O1666h5682A60064J82613
15527C42677A45441c41463E02756q0039a95727A59681A7583e4872j24843E3376
15516b12130g0130K3642I3562a88047j45749N2196A49522d11654a36193k58669
15506c94862A37151b95427b0344A63124K6286p0631a52400j21464A5244a25734
15495a28699O1588j90579B25840g5882H62M39502D9072a24049C11629h779B08093
$$ plain form
15572 243460 -67675 -8830 -233289 -460240 -181771 -144138 176263 -80222 -84230 352228 -118569
15560 -46951 15682 355633 75334 215447 -67478 415968 344167 -22786 -192590 51422 186349
15549 186349 -252172 75423 -37949 -31682 72122 -41999 -46598 -18067 11523 87474 -63000 -80109
15537 -80109 264398 -225651 150354 -164448 -313250 63846 125512 -85682 160064 342677
15527 342677 145441 -341463 502756 422717 -195727 159681 17583 -54872 -179715 53376
15516 -212130 -70130 -46488 93562 -188047 -333796 -281600 149522 -411654 -136193 -394862
15506 -394862 137151 -295427 -20344 163124 189410 118779 -152400 -273864 15244 -125734
15495 -128699 -67111 -257690 225840 -75882 862 440364 49072 -124049 311629 -8779 208093
15483F510J35954a06139d0448C73143I1994b0341j31984C2484J64329g8834j15669
15472a94503H7002k8890A2559e82107A39603a32799A84344h1642A12759b23661
15461E8720K27673a45112A54975K03094A08032m0886J56278b65862A04325J3555
15451A17880N7259p9433J54421D08L43928B6957J18652f2472k52390A08995c395
15439A10374e5259k08939i6070a9205A80689C5708f7116D80631f6120G3587J34434
15428B08021r9121A1175a75714E2945b193I6176g4271A24970b21384f9912B17373
15416a69024n2816g3914B59111l8108f3335q9009B6963J3850g8134A52169l1048
15405A21121m4205h168A74208b07266B9667g6886A4955D957b9086F0883J9167
$$ plain form
15483 6510 142464 -106139 -40448 373143 91994 -20341 -152325 32484 196813 -78834 -194503
15472 -194503 87002 58112 12559 -582107 139603 -132799 184344 -81642 112759 -223661
15461 58720 286393 -145112 154975 358069 108032 67146 223424 -265862 104325 117880
15451 117880 175139 95706 250127 408 344336 26957 145609 -62472 -314862 108995 -3395
15439 110374 -55259 -264198 -96070 -19205 180689 35708 -67116 480631 -66120 73587 208021
15428 208021 108900 11175 -175714 52945 -2193 96176 -74271 124970 -221384 -69912 217373
15416 -169024 -221840 -73914 259111 221003 -63335 -152344 26963 40813 -78134 152169 121121
15405 121121 76916 -8168 174208 -207266 29667 -76886 14955 4957 -29086 60883 80050
15394H0050a49598A8831i1512j02607b9735l2997I7736L06917D4281i1045c7980
15382b20379L9415K4824k70646b6264F8197a32143A66332J09029b97458C02803
15371a37812c2733A70028a54789E9320J22253c31458A37485a73027b0955B8771
15360F522J52264K55336f9087j63717D5504A3678a0658o4049k5974j56276C39330
15348B0542h1363B51456G0481f9861B51576i1796A34924C0864e9472j81642B39718
15336c9011p0269d3198A89163b64779A16280M93a25670a9164j85780A80661k9810
15325A50851F8826J4900a47388H4614J34474J83785I4791Q728k1137J22039e3490
15313F0125f8994A07239l1698b85571E45992E6560K76829a38680A04762f5781
$$ plain form
15394 80050 -149598 18831 -91512 -194119 -29735 -62732 97736 404653 44281 -91045 -37980
15382 -220379 -180964 -156140 -426786 -26264 68197 -132143 166332 275361 -297458 302803
15371 -137812 -32733 170028 -154789 59320 181573 -331458 137485 -173027 -20955 28771
15360 6522 158786 414122 -69087 -232804 45504 13678 -10658 -74707 -100681 -256957 339330
15348 20542 -81363 251456 70481 -69861 251576 -91796 134924 30864 -59472 -241114 239718
15336 -39011 -109280 -43198 189163 -264779 116280 116773 -125670 -19164 -204944 180661 150851
15325 150851 68826 83726 -147388 84614 219088 402873 94791 103519 82382 204421 -53490
15313 60125 -68994 107239 75541 -285571 545992 56560 333389 -138680 104762 -65781
15302g9613A8684O5891M7660H526a16884C19846F9865g7466r4479B5208K90924
15291C16132K8397a85904h1520D47445B6334J67356J90964a22522J1218e3672
15280f977A01179K47162b2959A45038m5653J24115q268a16445D7132K8350K70076
15269C45558j22430l6229m6333g4966B76164I4654J6729a63912c777D3599K38035
15258B81634a911n4082q7641C59718j00120j13586O0567K79000j68063O127J07187
15247D30830J364932M24027o2678L23918k39194E97179B65931n143k2730C3356
15236a11794B17694R0214k2569a20122B27985j02519C2878J41548k2671I776b52097
15224A91261M4859P534b4679H2985B4825L383f6175r5570l0801h0875q3742b6539
$$ plain form
15302 -79613 18684 84575 132235 8526 -116884 319846 69865 -77466 -171945 25208 316132
15291 316132 344529 -185904 -81520 447445 26334 193690 384654 -122522 -111304 -53672
15280 -6977 101179 348341 -22959 145038 99385 223500 215232 -116445 47132 75482 345558
15269 345558 223128 186899 140566 -74966 276164 94654 111383 -163912 -3777 43599 281634
15258 281634 -1911 -55993 -143634 359718 259598 146012 206579 485579 317516 323643 430830
15247 430830 1795762 2219789 2157111 2481029 2241835 597179 265931 260788 238058 33356
15236 -111794 217694 307908 285339 -120122 227985 125466 32878 174426 151755 9776 -252097
15224 191261 236120 243654 -24679 82985 24825 28208 -66175 -161745 -192546 -80875 -164617 -26539
15211A85865b1628C16414A37376K00436d32354a57831n621I0778J79019a42361
15200A88021l1448F4958B6593a35786c2658D10077c35169F1809b12357C4800a95339
15188B3478g4821A37844b6898H7321b4902C47259A30396J09478n1631J4347p3488
15177A29102n7367J72029j01990k2855l0102R3139g8970A65225L79527A52106
15166B73861j32993b37028A27916J35701A30568K3942A8546K19840m1484J50551
15156C47453a13718B71330I1175c0974B44240b9434j61306A68866d07956I495
15145B57237a49504E4844k2453J94356D3549K92533k1842J461K19806A47452M2296
15134A89748L5670d5042j6007B73558n4013k4879a90089I9470O7120E9324J66262
$$ plain form
15211 185865 -21628 316414 137376 337812 -432354 -157831 -163452 90778 269797 -142361
15200 188021 156573 64958 26593 -135786 -32658 410077 -335169 61809 -212357 34800 -195339
15188 23478 -74821 137844 -26898 87321 -24902 347259 130396 239874 188243 202590 129102
15177 129102 71735 243764 141774 118919 88817 181956 -78970 165225 544752 152106
15166 273861 140868 -237028 127916 263617 130568 154510 18546 238386 196902 347453
15156 347453 -113718 271330 91175 -30974 244240 -29434 -190740 168866 -407956 9495
15145 257237 -149504 54844 32391 226747 43549 336082 314240 315701 535507 147452 189748
15134 189748 225418 -45042 -61049 273558 219545 194666 -190089 99470 166590 59324 225586
15123B25586a6632C83491b22603A42328J09300A00551J93289F4128B1675K72139
15113B93814A40853P556Q104E4444a73610G5924J10832a60965A34594B4618L0339
15102E4957J1993K59745L5460A37862a1826H1129K43092j56764a73988A58933
15091D61449G0686J64611n4791M3434K51109c82410A61410a06068L7054B38835
15080I5287a09871b7944j4482B03374M9356d4840A25223a42814A59154p5474Q9640
15069A73320h2425n8229c1016C84680j76693R4700a74297B49631D9463M53408
15059E02871c39731A83545J26791I9120M2428n6953q24L11340G5044K07242A04438
15047A28286R4529k3865J70668A21410J03621F968L60345o0761q1011k8805M9045
$$ plain form
15123 225586 -16632 383491 -222603 142328 251628 100551 293840 64128 21675 293814
15113 293814 140853 148409 156513 54444 -173610 75924 186756 -160965 134594 24618 54957
15102 54957 66950 326695 362155 137862 -11826 81129 324221 167457 -173988 158933
15091 461449 70686 235297 180506 223940 475049 -382410 161410 -106068 -69014 238835
15080 95287 -109871 -27944 -42426 203374 252730 -44840 125223 -142814 159154 83680 173320
15069 173320 -82425 -140654 -31016 384680 207987 302687 -174297 249631 49463 502871
15059 502871 -339731 183545 310336 99120 141548 84595 83771 395111 75044 282286 104438
15047 128286 222815 198950 369618 121410 225031 6968 367313 306552 225541 196736 245781
15036B45781G7414M01951E9078K75207j01194A10074K22920i529B6092e9300B42350
15024A73623n1154j5342P4313K4495C8539O1753J66630M3945G3479p050J06703
15013A73132J26323b18673B39458J63078H2255L02926o6443G6908L65166A93319
15002B79626n4076o1031j641J0384J13405J49158g2256B64884J36277D4853M20036
14991D64889B5995K80300A18909K44865C9479K49216l5315A12909L48505E66f2719
14979A14530L24879k14702J28772d4702j00610D17857j00875J8463I9155N2254
14969A51409L21860q1426J73853A98291K17560A09920J29888L76169j37270p2841
14959D05866j69348H5303J6967N71179H9278L4762o492K6285B3802c6629D31284
$$ plain form
15036 245781 77414 479365 59078 334285 233091 110074 332994 -9529 26092 -59300 242350
15024 173623 122469 107127 181440 205935 38539 100292 266922 310867 73479 66429 173132
15013 173132 299455 -218673 239458 402536 82255 385181 318738 76908 442074 193319
15002 279626 225550 164519 162878 173262 286667 435825 -72256 264884 401161 44853 464889
14991 464889 25995 306295 118909 363774 39479 288695 253380 112909 461414 566 -62719
14979 114530 439409 224707 353479 -44702 -145312 417857 316982 335445 99155 151409
14969 151409 473269 391843 565696 198291 415851 109920 239808 615977 478707 405866
14959 405866 236518 85303 102270 673449 89278 124040 117548 143833 23802 -36629 431284
14947C34150L68543A75908J7751K36259A25230n2728L09090k2191O0326J02574
14937E22301A94110L63102k68866q683L9486p4009L14804A58721p3295J06267
14927A91693g7399A98477M67139A6601K85335J33947j42556K2316F3888c9848
14916C57250A75368J76825K8493h0000D30496J23957k37615f6760C81041K25614
14906F06655A65145L58033N1760j39246q8151J84767J98073i2179D64583F0752
14895D58849J56295k59823J25454k19601j00844J70749K47811k19673K724N9190
14885D21131R3976p4632q2719N86380D18014J45003j82178J19188m17K30664E4832
14873D28212A86327M69033j10932k8533q0756J20242k49887J04716J32558M9620
$$ plain form
14947 334150 702693 175908 193659 429918 125230 72502 381592 359401 419727 522301
14937 522301 194110 557212 288346 279663 319149 245140 559944 158721 85426 191693
14927 191693 -77399 198477 665616 16601 301936 435883 293327 315643 63888 -39848
14916 357250 175368 352193 380686 -80000 430496 554453 316838 -66760 381041 606655
14906 606655 165145 523178 574938 435692 347541 532308 730381 -92179 464583 60752
14895 458849 615144 355321 480775 261174 160330 331079 578890 359217 361941 421131
14885 421131 515107 440475 357756 944136 418014 563017 380839 500027 499610 730274 54832
14873 428212 186327 655360 544428 515895 435139 555381 305494 410210 542768 592388
14863E92388j70021r4286A23011L93744J20565o0611k31880M0979j30202P2439
14853C28045j8546j20703K76160F3113K56614A05715M52762j2828k44786L42499
14843F43362k74394j4760K3089L8817l4355n187p1867L23060k15072K19104k72279
14832C59518K470K27714k08481n814O1018j45360J76206N6020j26168J37162B30380
14820E14036j70251r7157O27506k62536l2657q194j28794m4022L5385j70294P22823
14809I85845D43250j13657M98737l05763K07469k10788B57499L78957K8135j57677
14799E06914P0170k81345J80538k0898k03336J35176n566P2850J84758B17499
14788F58769m5261j83296p1088M96753j02607k25752P5996n0060l6984j1602K71393
$$ plain form
14863 592388 422367 328081 123011 516755 637320 576709 344829 385808 255606 328045
14853 328045 309499 188796 464956 63113 319727 105715 558477 545649 300863 643362
14843 643362 368968 354208 377297 416114 381759 376572 304705 627765 412693 631797 359518
14832 359518 361988 589702 381221 375407 436425 291065 467271 523291 397123 534285 230380
14820 514036 343785 246628 874134 611598 578941 570747 441953 397931 433316 263022 985845
14809 985845 443250 329593 828330 522567 730036 519248 257499 636456 664591 506914
14799 506914 577084 295739 476277 455379 252043 387219 381653 454503 639261 217499
14788 658769 613508 430212 359124 855877 753270 527518 603514 553454 516470 504868 776261
14777G76261k85610K54533P5345n5897j25315J85564k32562q1744Q3322K1359
14767F15256R8439j99587K29543C28613L56598j54962m2047j32376A34823N22893
14757F57716M2640n3208j64220J06134P9515J06353J72570l16361j13905Q5298
14747F02532k4224L1934O5796K22749j55417K8870J5362k25277L54553j96824
14737G20054R4716k04339L7119j44625M57254k88809o5863J60357J08825C84167
14726F23435Q5395J1578N044k06958N00395l74693J78150J2465L356K25775J5516
14715A079458j69137N194j75862J54626R1740J20114r4541m6300Q9740J59098
14705A214130n69593J59159J63248R9646k31943m442j9375K07484j51004J18177
$$ plain form
14777 776261 490651 745184 820529 764632 639317 824881 592319 510575 593897 615256
14767 615256 713695 514108 743651 328613 685211 530249 488202 355826 134823 657716
14757 657716 700356 647148 482928 589062 668577 774930 947500 631139 517234 602532
14747 602532 578308 610242 676038 898787 743370 772240 787602 562325 916878 720054
14737 720054 814770 610431 647550 502925 960179 671370 605507 765864 874689 384167
14726 623435 708830 720408 725452 518494 1018889 644196 822346 834811 838167 1063942 1079458
14715 1079458 910321 915515 739653 894279 986019 1106133 1011592 965292 1055032 1214130
14705 1214130 644537 803696 966944 1066590 834647 830205 810830 1018314 867310 985487
14695I85487J36663k07586J22029p5845p3510j57819P9338L46510j72076Q0775
14685A063966J8097l71432M95032j90622m41942N49966l5889N8611j24298L75258
14675A396747j96470j69613M30394m20757K52674k43536o6288J52853O7557l55841
14665H47720L82472j24967k32558M10300L73871l23882j51751R6359k27304K27238
14655A277498K21276M9257k08248k38559M5152j02187K79195l26652P10352l66796
14645A340288q2115q3054j57585M19111o3733n4260j79496J32409m8084L74857
14635A598338m01914L55263j22233k5740R1177K22952l70130J55402J02124l78755
14625A226484K818J32789J541k54036L77367M25398o71968J15042K4440o1426
$$ plain form
14695 985487 1122150 914564 1036593 960748 887238 729419 808757 1155267 983191 1063966
14685 1063966 1082063 710631 1205663 1015041 573099 1123065 1087176 1145787 1021489 1396747
14675 1396747 1200277 1030664 1461058 1040301 1292975 1049439 983151 1136004 1203561 847720
14665 847720 1230192 1105225 872667 1282967 1656838 1332956 1181205 1277564 1050260 1277498
14655 1277498 1498774 1548031 1339783 1101224 1146376 1044189 1323384 996732 1707084 1340288
14645 1340288 1258173 1175119 1017534 1436645 1372912 1318652 1139156 1271565 1223481 1598338
14635 1598338 1196424 1551687 1429454 1403714 1494891 1717843 1347713 1503115 1605239 1226484
14625 1226484 1229302 1362091 1363632 1109596 1486963 1912361 1240393 1355435 1379875 1318449
14615A318449L17473j16570j15876Q4843j53902L96980j45171j96318K86371J82978
14605A859257j1134l65227n3455K00375N9356J4812r4269L72132j0482l98293
14595A573072L84520o1550j19549L66805j46086J328P8218j51988Q7807l38290
14585A674287M65007L7479n91358N77639k28919k14062K78273N6713M4217P3795
14575B173071J01645j0850K75154n67149P3703M79095j50303M1876r6462L62428
14565B682208M9083l32096M03401l00165K64319P8625K47957J5388K58346J19473
14555C486539L32842J68993K03535O09591Q80444J126560K126263M731999Q506228
14546B2172994J3400515M557838j7756820j0577089k777799j440992l437253j169434
$$ plain form
14615 1318449 1635922 1519352 1403476 1488319 1334417 1731397 1586226 1389908 1676279 1859257
14605 1859257 1848123 1482896 1429441 1629816 1689172 1703984 1609715 1981847 1971365 1573072
14595 1573072 1957592 1896042 1776493 2143298 1997212 1998540 2076758 1924770 2012577 1674287
14585 1674287 2139294 2176773 1585415 2163054 1934135 1720073 1998346 2055059 2099276 2173071
14575 2173071 2274716 2263866 2539020 1971871 2045574 2524669 2374366 2416242 2319780 2682208
14565 2682208 2731291 2399195 2802596 2502431 2766750 2845375 3093332 3108720 3367066 3486539
14555 3486539 3819381 3988374 4191909 4801500 5681944 6808504 8934767 13666766 22172994
14546 22172994 35573509 40131347 22374527 11797438 9019639 7578647 4141394 2971960
14538B971960j78702m54070k65985K18154j2499M91764m96047R0422J04192J77743
14528B646932k60134l6525L96713k9809n48302O03916L5905o0396o9873j06933
14518B571494M332K02100K12097j34455q9756J52064q9758J66309l25153L87931
14508C057205n2907m28977Q54720J81280l80829l90681L58540L64558k98479R353
14498C273783j42288J21324n9801M69379p9299m005L61896k24846K89819k96558
14488C709404J30640j84749j72696K40839M40118l06386M9819L62386j21491K98614
14478D446498o21193O66410n0050P7402l6909k18963M56967k21843J46310o9011
14468D575618p4002L77902J38421j55269k53446K40190r4743J79259p5445O36977
$$ plain form
14538 2971960 2793258 2339188 2073203 2291357 2278858 2770622 2274575 2364997 2469189 2646932
14528 2646932 2386798 2350273 2746986 2717177 2168875 2772791 2808696 2748300 2678427 2571494
14518 2571494 2575826 2777926 2990023 2855568 2765812 2917876 2828118 2994427 2669274 3057205
14508 3057205 3004298 2575321 3430041 3611321 3230492 2839811 3198351 3562909 3264430 3273783
14498 3273783 3131495 3252819 3193018 3662397 3583098 3579093 3940989 3716143 4005962 3709404
14488 3709404 3840044 3655295 3482599 3723438 4163556 3857170 3906989 4269375 4147884 4446498
14478 4446498 3825305 4491715 4441665 4519067 4482158 4263195 4720162 4498319 4644629 4575618
14468 4575618 4501616 4879518 5017939 4862670 4609224 4849414 4754671 4933930 4858485 5495462
14458E495462p3872l18363J20676j8173L85542J14938k6829j02462K41654J11460
14448E930033k54612L19452O1794L53596k92298J77867R7950P78J82764j70503
14438F406821j4913J60654L57400n2800J33709k62940M54865m4107J18131R7335
14428G354155k77720P73688m34343l670P10363M8945K9993K24529l32758J74650
14418H267832K27387p255J15391L04168L17906l3281M45521n85916N36969P9561
14408I668283P9938L41481K58473K24473J40043L6930J95807J07686J77718L24003
14398A1554835m1788K57525j03892M63348j19500O52057K59299J24965L76259
14389A3423108L03360k41035L59459M16439j21743N96746l06261M85567O9154
$$ plain form
14458 5495462 5421590 5103227 5223903 5205730 5591272 5706210 5679381 5576919 5818573 5930033
14448 5930033 5675421 5994873 6056667 6410263 6117965 6295832 6393782 6394560 6577324 6406821
14438 6406821 6391908 6552562 6909962 6857162 6990871 6727931 7182796 7138689 7256820 7354155
14428 7354155 7076435 7850123 7415780 7412110 8122473 8171418 8201411 8425940 8093182 8267832
14418 8267832 8495219 8487964 8603355 8907523 9225429 9192148 9637669 9051753 9588722 9668283
14408 9668283 9748221 10089702 10348175 10572648 10712691 10749621 10945428 11053114 11230832 11554835
14398 11554835 11513047 11770572 11666680 12130028 12010528 12662585 12921884 13046849 13423108
14389 13423108 13726468 13485433 13844892 14261331 14139588 14736334 14430073 14915640 14984794
14380A4984794O67227K02042Q0795N32435J59104L26996O39157J53737L01847
14371A8048134K86833K64274P34710k5052N45287L63562N22711K42241R21956
14362B1904656K03605P34898J13307K94080P78616O43367K27707P87069K5587
14353B5712892R35178O91549O47875Q43721P12645P50222O38702O62517R46105
14344C2541406N62040J263399Q37902O78250J047461J517045O69730J155605J372250
14335D1645088P91138J450109J676623Q55749J438256J785594J182443J724266
14327E2549266J815765J775055J719848J599731K163897K323601J955802K241326
14319F8144291K720896K617331K559674K681285L357437L220658L118014L403128
$$ plain form
14380 14984794 15652021 15854063 15934858 16467293 16626397 16953393 17592550 17746287 18048134
14371 18048134 18334967 18599241 19333951 19308899 19854186 20217748 20740459 20982700 21904656
14362 21904656 22108261 22843159 22956466 23250546 24029162 24672529 24900236 25687305 25712892
14353 25712892 26648070 27339619 27987494 28831215 29543860 30294082 30932784 31595301 32541406
14344 32541406 33103446 34366845 35204747 35882997 36930458 38447503 39117233 40272838 41645088
14335 41645088 42436226 43886335 45562958 46418707 47856963 49642557 50825000 52549266
14327 52549266 54365031 56140086 57859934 59459665 61623562 63947163 65902965 68144291
14319 68144291 70865187 73482518 76042192 78723477 82080914 85301572 88419586 91822714
14311I1822714L789299L837257M262312M139075M826789M826942N077524N542483
14303A28124395N640381O103700O364913P310890O509461P780437Q503633Q617597
14295A84955407Q947771R982768R724738J1072209J1348005J1580521J2543730
14288B60155149J3157612J3133502J4265201J3954218J5402447J4443830J4841775
14281C59353734J5068191J4811558J4306384J3393264J2502627J1526596J0277296
14274D51239650Q654257O473249L712270P23843j71751J643290j481009l628236
14266D67165563n819820q091361r527509j1372533j2632686j3238500j4948060
14259C91535094j4746730j5312877j5588517j5308883j5055649j4719057j3894721
$$ plain form
14311 91822714 95612013 99449270 103711582 107850657 112677446 117504388 122581912 128124395
14303 128124395 133764776 139868476 146233389 153544279 160053740 167834177 176337810 184955407
14295 184955407 193903178 203885946 213610684 224682893 236030898 247611419 260155149
14288 260155149 273312761 286446263 300711464 314665682 330068129 344511959 359353734
14281 359353734 374421925 389233483 403539867 416933131 429435758 440962354 451239650
14274 451239650 459893907 466367156 470079426 470803269 470631518 472274808 470793799 467165563
14266 467165563 461345743 453254382 443726873 432354340 419721654 406483154 391535094
14259 391535094 376788364 361475487 345886970 330578087 315522438 300803381 286908660
14252B86908660j2357562j2552496j2916152j1695537j1769035j0607955j0463613
14245B04546310r488105r073475q920550p931844p811889p498770o525979o462638
14237A40833060n696151o203527n268919n324147n018922m538799m346357l877866
14229A00558372m029861l709983l480104l337371l519245k539306l403413k535654
14221G4003435k448769k259443k204597k485921j926250k161081j729710j876640
14213E6911024j374721j949299j506268j938167j181734j163636j209339q38485
14205D5749375j734753j464184j208480j042657r47333o30358j167756r43814
14197C6610040j168341j010501o35811p32485r77120n81615j006947j015027m24769
$$ plain form
14252 286908660 274551098 261998602 249082450 237386913 225617878 215009923 204546310
14245 204546310 195058205 185984730 177064180 169132336 161320447 153821677 147295698 140833060
14237 140833060 135136909 128933382 123664463 118340316 113321394 108782595 104436238 100558372
14229 100558372 96528511 92818528 89338424 86001053 82481808 79942502 76539089 74003435
14221 74003435 71554666 69295223 67090626 64604705 62678455 60517374 58787664 56911024
14213 56911024 55536303 53587004 52080736 50142569 48960835 47797199 46587860 45749375
14205 45749375 44014622 42550438 41341958 40299301 39351968 38721610 37553854 36610040
14197 36610040 35441699 34431198 33795387 33062902 32085782 31504167 30497220 29482193 29057424
14188B9057424q81459q76516l57480n17817o23198o58834l41538q98124n96948
14179B3305510k96099l03254m89552m62109n63721l27739o43407n62029K70071
14170A9927671p36906n02090n3063p61009J29113n33318k88296m15356l60080
14161A6406666m42208Q6871m29895k56958l82700J3866n47558j49948n3020j78925
14151A4066191l95890k91079l90087k94100K23726k23247n24326L91744n57849
14142A2005083k30247j28422l81942J47539m96565k9159j39157M5722k68715k73223
14132A0250914j09851o9399m77929k6149O8031j11735j44154q8187l25684P8425
14122I044282l13446j69666q462j36555O9862k81054k73790M12277m47590l33372
$$ plain form
14188 29057424 28175965 27299449 26941969 26424152 25800954 25142120 24800582 23902458 23305510
14179 23305510 23009411 22706157 22216605 21754496 21190775 20863036 20219629 19657600 19927671
14170 19927671 19190765 18688675 18635612 17874603 18003716 17470398 17182102 16766746 16406666
14161 16406666 15964458 16051329 15621434 15364476 14981776 14995642 14448084 14298136 14245116 14066191
14151 14066191 13670301 13379222 12989135 12695035 12918761 12695514 12171188 12562932 12005083
14142 12005083 11774836 11646414 11264472 11412011 10915446 10886287 10747130 10792852 10524137 10250914
14132 10250914 10141063 10071664 9593735 9567586 9635617 9523882 9379728 9291541 8965857 9044282
14122 9044282 8730836 8561170 8552708 8416153 8486015 8204961 7931171 8343448 7895858 7562486
14112G562486R0295j63279l07099O19443n67858J84380j97410r1846k04020L49266
14102G274358n08675J448j63816J03979k71173O0999K72266k29940m35111L62991
14092F467326j36270k93108N1483k98305K32493n03647J26358P6564j15529j97449
14082E409916j87501Q4745J89479m61830K1097n6873O0660p258r1894k52593L68111
14071E076059n66812K5238J10483P4871j51702j61132J92584k35091P4224K61203
14061D699925j51269j1490k86669M2709j63991Q858K71666m04917J53108P0155
14051D228085j5501j46661j25971l92775K46155K31537n02511K07886J13809m44239
14041C399814L5455K83255j9560p1053O0185k95883p939k13845K09872k86112
$$ plain form
14112 7562486 7652781 7489502 7182403 7801846 7233988 7418368 7220958 7129112 6925092 7274358
14102 7274358 6765683 6767131 6603315 6707294 6436121 6497120 6769386 6539446 6104335 6467326
14092 6467326 6331056 6037948 6089431 5791126 6023619 5519972 5646330 5722894 5607365 5409916
14082 5409916 5222415 5307160 5496639 5034809 5055906 4999033 5059693 5052435 4960541 4707948 5076059
14071 5076059 4509247 4534485 4644968 4719839 4568137 4407005 4599589 4364498 4438722 4699925
14061 4699925 4548656 4537166 4250497 4293206 4129215 4138073 4409739 4004822 4157930 4228085
14051 4228085 4212584 4065923 3939952 3547177 3793332 4024869 3522358 3730244 3844053 3399814
14041 3399814 3435269 3718524 3698964 3627911 3688096 3392213 3384274 3170429 3380301 3094189
14031C094189j7696L66128J79624l21160J37070j80060Q8182j04320k78116Q0927
14021C044768k80869K95666j07051m0284m18255L25691k93574M16085j02442j82865
14011B656870N13035m73798p4111q3955l4961J92079j66286p5722n5903J0498
14001B407746L4746K9351L4767m0072J55218m3545q9698O9211J59369L311N3990
13990B774394R53356J340907L193010Q260167J3957598J1036210j3878783j2783840
13982A4853019n584375k518198j384035p99784l39586m31972k83937l51186K17011
13973C376957l57707L87549k71763k66797l06841L27035o0040J4603j71074o8507
13963B603415o318o6361N3717j63011j79816J2657p6963l06844M77937N4213J02266
$$ plain form
14031 3094189 3076493 3442621 3622245 3301085 3438155 3258095 3346277 3241957 2963841 3044768
14021 3044768 2763899 3059565 2952514 2912230 2493975 2819666 2526092 2942177 2839735 2656870
14011 2656870 3169905 2696107 2621996 2538041 2503080 2695159 2528873 2453151 2397248 2407746
14001 2407746 2442492 2471843 2506610 2466538 2621756 2578211 2488513 2557724 2717093 2720404 2774394
13990 2774394 3727750 5068657 8261667 16521834 30479432 41515642 27636859 14853019
13982 14853019 9268644 6750446 5366411 4566627 4227041 3795069 3511132 3159946 3376957
13973 3376957 3019250 3406799 3135036 2868239 2561398 2888433 2828393 2842996 2671922 2603415
13963 2603415 2597097 2530736 2584453 2421442 2241626 2254283 2177320 1870476 2348413 2402626 2504892
13952B504892l33594J50468o0727p3709k25447K06890J91488l57175p5649j58567
13942A768870K53156L02778j44722l47395L24736j40666Q0549Q6313N2669n34443
13932A701845L32053k04131l1281j04571O7611J11254j50590K6040j07738Q768
13922A649260J09204J29871n05844L84799j5756P7705k42799R3556L11337n73599
13912A417734L67509l30358K45329k49121L26039k43568p6605J29356j78293P8713
13902A486735n3937L9948Q8488M127j9232m17466K68305j20671K49377J5569l33844
13891A207399L78223m25581J79073J23257m1386O5203m1233j52333J04548l0600
13881A366570m3479J3841j55790j24898L0177R2128L51953j79826j01204L85746
$$ plain form
13952 2504892 2171298 2321766 2261039 2187330 1961883 2168773 2360261 2003086 1927437 1768870
13942 1768870 2022026 2324804 2180082 1832687 2157423 2016757 2097306 2183619 2236288 1701845
13932 1701845 2033898 1829767 1798486 1693915 1761526 1872780 1722190 1748230 1640492 1649260
13922 1649260 1758464 1888335 1382491 1767290 1751534 1829239 1586440 1679996 1991333 1417734
13912 1417734 1785243 1454885 1700214 1451093 1777132 1533564 1456959 1586315 1408022 1486735
13902 1486735 1432798 1472746 1561234 1565361 1546129 1128663 1396968 1276297 1525674 1541243 1207399
13891 1207399 1585622 1160041 1339114 1462371 1420985 1486188 1444955 1292622 1397170 1366570
13881 1366570 1323091 1336932 1181142 1056244 1086421 1178549 1530502 1350676 1249472 1635218
13871A635218n39172k6057K74437j91057J96210m80518m7039L78803Q2269q7150
13861A195944L59386o55829K14349n6834M4478l43102M53309q8380j5594j33892
13851I73835K02039m9841L2194j8183j27638L3049o5874J02203K81367K078j38900
13840A226329R4715l88472J64060j15027k6977K30224J70174l26656N684o0601
13830I73453J43084q4085r8791J70414k44102J23535j42130K00423j58634J93472
13820A076639k04491M2176L60537k27239m05749J61276j28710L08457m00797L58752
13810I40851J22437l10554K23278J62525l24932J54493j16893K86514l46722K91190
13800A082187l81672P1309R7979L16311l67290L35890j71018j87918K40656m2384
$$ plain form
13871 1635218 1096046 1069989 1344426 1153369 1349579 869061 822022 1200825 1283094 1195944
13861 1195944 1555330 899501 1113850 1057016 1101494 758392 1211701 1123321 1107727 973835
13851 973835 1175874 1126033 1158227 1140044 1012406 1045455 979581 1081784 1363151 1365229 1226329
13840 1226329 1321044 932572 1096632 981605 954628 1184852 1355026 1028370 1034054 973453
13830 973453 1116537 1032452 933661 1104075 859973 983508 841378 1041801 883167 1076639
13820 1076639 872148 914324 1274861 1047622 641873 803149 674439 982896 582099 940851
13810 940851 1063288 752734 976012 1138537 813605 968098 851205 1137719 790997 1082187
13800 1082187 700515 771824 869803 1186114 818824 1154714 983696 795778 1036434 994050
13790I94050l3881J44631k45440k42288K68644J18152k19584K24100l47993j56255
13780E04136L97428j73724k32786R7563M17130k52432K91535j61174j74134Q8978
13770H02520k3925k76974O83351m56808L58080m43289L4532M7881j90023L16669
13760H52014K21075r9371l86607L13578J17359l45424Q8210K5312J00924l78183
13750E08887K30577k24788K19108r1980K2331l964N1755j79799k09214N46700
13740H69613N3511k95651O880K26532j34997p3357R5457q5270j9934J85174l40889
13729D87069p4546K21823m9536M60050C52527P04898m14964k8207p0642N44401
13719A088013E10592J30070q4167M29077k66804k50641M4994L9900O480B13030
$$ plain form
13790 994050 960169 1104800 859360 617072 885716 1003868 784284 1008384 660391 504136
13780 504136 901564 727840 495054 592617 1009747 757315 1048850 887676 713542 802520
13770 802520 778595 501621 1184972 728164 1086244 642955 677487 725368 535345 852014
13760 852014 1073089 973718 587111 900689 1018048 672624 760834 786146 887070 508887
13750 508887 739464 514676 733784 641804 664135 660171 711926 532127 322913 869613
13740 869613 923124 627473 634353 860885 725888 652531 747988 662718 642784 827958 487069
13729 487069 412523 634346 584810 1044860 352527 1057425 642461 614254 543612 1088013
13719 1088013 510592 640662 556495 985572 718768 468127 513121 553021 559501 213030
13708I49687k76949k736k53432J91099j33001K70198k49178J94210p7901l7602
13698E74395J56326q3096M3083k27328J22377q3263j48330L38804k48944K29031
13688F73055j3110B14050K57130j2788P4393j16043L05086k9410K3178l05445
13678D10151m2643K62700B97305J37994j05335K78608K34233l82751L7643J07137
13668F04834j40321J1981A95210M92331L35867D68655o2907J68055R4047k08598
13658D59252J0455j36596L39946C07661L59928j14881Q8977k83639P9569K07808
13648F45423k94592L89429k34873P8887K8354A44211L22455K03669k3168L048
13638F50215B90311m8362L63993B62893L97841j57264B26806a43252C98527q2155
$$ plain form
13708 949687 672738 670002 416570 607669 474668 744866 495688 689898 611997 574395
13698 574395 730721 647625 690708 463380 585757 502494 354164 692968 444024 673055
13688 673055 659945 214050 471180 458392 532785 416742 721828 692418 715596 410151
13678 410151 367508 630208 297305 435299 329964 608572 842805 460054 497697 604834
13668 604834 464513 476494 195210 687541 1023408 468655 405748 573803 667850 459252
13658 459252 469707 333111 673057 307661 667589 552708 641685 358046 437615 645423
13648 645423 350831 740260 505387 584274 612628 144211 466666 670335 647167 650215
13638 650215 290311 241949 605942 262893 660734 503470 226806 -143252 398527 316372
13628C16372Q6921J99076B72456M3497K85542M5959R5258j56435J8183j39989
13618D64471K14373K76157B98033K68451p5790M2702j7421j35505K10555B64987
13607D30286j72690K47013p7605q1092J04634B457O24805k74258P8255J8309k00892
13596B48676j6491Q777M5069N06884k86457B37470N1890j10761L01859k27127
13586B53331J83382O8984k03713j44507K2036n0153K5683J92398m7446L39818
13576F39813j26398A49789F6426K04609J80360K4258A11808K76912J6190J13445
13566E18355P03k03428K17996j35102D3848K44740K14270j65648n6876O9385j17062
13555B32657K5948p7275J0326q2515A0608J46353L77285j35896j34040K286G4279
$$ plain form
13628 316372 403293 602369 272456 315953 601495 647454 742712 586277 604460 464471
13618 464471 678844 955001 298033 566484 490694 533396 515975 380470 591025 264987
13607 430286 257596 504609 427004 345912 450546 2457 627262 353004 431259 449568 248676
13596 248676 232185 240962 286031 792915 506458 237470 289360 178599 480458 253331
13586 253331 436713 505697 301984 157477 179513 129360 155043 347441 299995 639813
13576 639813 513415 149789 66426 271035 451395 475653 111808 388720 404910 518355
13566 518355 519058 315630 533626 398524 43848 288588 502858 337210 280334 349719 232657
13555 232657 258605 181330 191656 109141 10608 156961 534246 398350 264310 266596 74279
13543B59207j5060L26134J4814k49091A31719L79028k29989G0534K38277J28820
13533D37631O4852B30329k5573N9765L26603j84845j25753J37745o9229o2007
13523B87035K28613k32031O013P6175p9309N5380n0208Q4060j78241K50718K21893
13512F70098H3146M28851j14188C3028L26649N0595A99752M4574Q5459D1678K53011
13501B94689q0662J60716A83299I0100J85914F3799L13680N7768B6313L03828
13491C30141J64497C9406N05314k65173j06941K19112J1382A94468m4785K2790
13481A72473F8839K27572J80444K23154k18617B2943K71931M02986C08790k936
13471C05854B1469R8092J41459J69633a0726A51074K36503A23732m5184N8032
$$ plain form
13543 259207 244147 570281 585095 336004 131719 510747 280758 70534 308811 437631
13533 437631 502483 230329 204756 264521 591124 406279 280526 418271 349042 287035
13523 287035 515648 283617 289630 365805 286496 341876 291668 375728 197487 448205 670098
13512 670098 83146 511997 397809 33028 359677 410272 199752 244326 329785 41678 294689
13501 294689 214027 374743 183299 90100 276014 63799 377479 435247 26313 330141
13491 330141 494638 39406 544720 279547 172606 391718 403100 194468 149683 172473
13481 172473 68839 296411 476855 700009 481392 22943 294874 697860 308790 305854
13471 305854 21469 119561 261020 430653 -10726 151074 387577 123732 78548 136580
13461A36580o5353J87494J61866b0221A16675N3431K32299j05386R4271L8186
13451D29476n0940A88538K67405j68022J66344D9464a16833B47897J14391n1253
13441C11035j12049J27920G6253J69799K26381R392k13839R5222A54844J64683
13431C19527d3043B55788I6016k7565K26763D4185L16569h8969A18539J26090
13421B44629m7837a62695C61251A64066c6755q3554F4469B4763L71260j29801
13411B66222j0277O6466r1743G8890K99234a63716A83590J36930a15634B73662
13400C4226M73332D0289L79225A84362O5282A04894J49125Q2911l2319A2305L67488
13389C79793A23632N15956d8186G6133C888L38071j69394K03138j15004I8837
$$ plain form
13461 136580 71227 258721 420587 -20221 116675 170106 402405 297019 391290 429476
13451 429476 378536 188538 455943 287921 454265 49464 -116833 247897 362288 311035
13441 311035 198986 326906 76253 246052 472433 481825 267986 363208 154844 319527
13431 319527 -43043 255788 96016 68451 295214 44185 360754 -88969 118539 244629
13421 244629 196792 -162695 361251 164066 -36755 -120309 64469 24763 396023 266222
13411 266222 255945 322411 230668 78890 378124 -163716 183590 320520 -115634 273662
13400 34226 507558 40289 419514 184362 249644 104894 254019 336930 304611 12305 379793
13389 379793 123632 639588 -48186 76133 3888 341959 172565 375703 260699 98837
13378D27654E7305K7491J22419K65594k18382L99445j53524k13059A03049a07997
13367H1104a29466A91296R8937l0081k9390N1949E3870K78987B923J76977l0458
13356A49442J90982K8337A20353J11203M5456Q8223A02969m6337L90029g073B01264
13344D00296J68446c6014E21301m6198j80249A17929J20508j0786k0633R4809
13334C01827K89253B66930H3252L69619J8655B4292Q6302n934Q6478q1269L9169
13323A49038L7732K41051l4596A27847P6662M10487G8683K46560n710j04629K28513
13312D43417f6171D93456j49406n9453R4553p3347j20382E4122J00592j4656P8783
13301B18841D4933L72864j03701j28287K49513b14206C83503E2749J88660q7205
$$ plain form
13378 427654 57305 84796 207215 472809 254427 653872 500348 287289 103049 -107997
13367 81104 -129466 191296 290233 260152 230762 282711 53870 332857 2923 179900 149442
13356 149442 340424 368761 120353 231556 277012 365235 102969 56632 446661 -7073 201264
13344 400296 568742 -36014 521301 475103 294854 117929 238437 227651 207018 301827
13334 301827 591080 266930 83252 452871 471526 24292 110594 104660 191138 109869 149038
13323 149038 186770 427821 393225 127847 204509 614996 78683 325243 319533 214904 443417
13312 443417 -66171 493456 344050 284597 379150 305803 185421 54122 154714 140058 218841
13301 218841 44933 417797 314096 185809 435322 -214206 383503 52749 241409 154204
13291A54204a5468B94957L2962F5226J72312H2851d1513F0245d7099B85972N0081
13280C36053b09298A99721o9735a277j40491B97924A22688E0415J7261b8773C43273
13268a08312d0337j87150I5249J39137L9069A23544C0889J42802E532M52524A85717
13256D5273L9652K62361a5455B28126J00200A61383D1291J58946p0873b51514
13245C74349H0430L07024H361L37403a91103B94597M983r316J03203c9769B99194
13233D4554J93472d0602C70248H0514b4178D8019O2839P1172p4481a5102A34128
13221g3082q0096M7167B78011A15840a12049o3980M2392A50693b54042G5281K04827
13210B80108n6925m5207c0541A9827M0736J33836D5211J37493b8162n1810B55810
$$ plain form
13291 154204 -15468 294957 327919 65226 237538 82851 -41513 60245 -47099 285972 336053
13280 336053 -209298 199721 129986 -1277 -141768 297924 122688 50415 67676 -28773 343273
13268 -108312 -40337 -227487 95249 234386 273455 123544 30889 173691 5532 458056 185717
13256 45273 84925 347286 -15455 228126 328326 161383 41291 200237 129364 -251514
13245 374349 80430 387454 8361 345764 -191103 294597 299580 290264 393467 -39769 299194
13233 44554 238026 -40602 370248 80514 -24178 48019 110858 182030 107549 -15102 134128
13221 -73082 -153178 -106011 278011 115840 -112049 -176029 -133637 150693 -254042 75281 280108
13210 280108 223183 177976 -30541 19827 60563 194399 45211 182704 -28162 -79972 255810
13198H1232K88692j71385o2761m38J85844c7437B4720J69579c0150F814P6801
13187H3615a83415A75118J4904J11051r4255J8191H0119b05543A32203J77550
13177C09753q0867b4340j34755A70471d70352A15918N8898A7552J39077J3444
13167A70073a08265I616b66915A08481l0198J97355J29492E4357J0832m06d8558
13155F35614B71248Q357b33865C00405a55739O1851B13279H1219a2206G7160K31085
13144C08245a59974J5543B14951D1053L25840a04081K2284D4167f2502m6898A24585
13132A45421c0609B42925K84085c04742E7464A1835d699B71243c2543A33097B295
13120B12523b2352B66589p2508J24070a53468A0559c09004E90294C0540E689M45259
$$ plain form
13198 81232 369924 198539 135778 135340 321184 -37437 24720 194299 -30150 6814 83615
13187 83615 -183415 175118 190022 301073 206818 225009 80119 -205543 132203 309753
13177 309753 228886 -24340 -159095 170471 -470352 115918 174816 17552 156629 170073
13167 170073 -108265 9616 -266915 108481 78283 275638 405130 54357 65189 64783 -48558
13155 635614 271248 279605 -233865 300405 -155739 -93888 213279 81219 -12206 77160 308245
13144 308245 -159974 -144431 214951 41053 366893 -104081 -81797 44167 -62502 -109400 124585
13132 145421 -30609 242925 527010 -304742 57464 11835 -4699 271243 -32543 133097 2295
13120 212523 -22352 266589 194081 318151 -153468 10559 -309004 590294 30540 5689 450948
13109D50948n0686A86593a2331A74078J6862p2202j8113k4819R9786P1467j11542
13098A35517a32696e2342D1270R9698n5250J33908a76516H2376N9881i7771A04497
13086F0105J61392B1285a1506j91312A41515A5819K68545J08127e6188B26125
13075B02590K22564k07396b9777A25900a31704f0266D13644c5945B43972I0878
13064a66774B22723A08989K21449A54458j3522m9696J4466J46766a51457E6858
13053b1063A57653e0524D89861A43860B6370a42103d7730n3159B0988E12J64435
13042A64947N3853o9839K159a051j3990A12980J74745A01121A5199J64142n5592
13031A23749a98945A675J63109E3522K0585R704a16196D22533G2257e5144C07052
$$ plain form
13109 450948 400262 186593 -12331 174078 190940 118738 100625 75806 175592 247059 135517
13098 135517 -132696 -52342 41270 140968 85718 219626 -176516 82376 142257 -97771 104497
13086 60105 221497 21285 -11506 -202818 141515 15819 284364 392491 -56188 226125
13075 202590 425154 217758 -29777 125900 -131704 -60266 413644 -35945 243972 90878
13064 -166774 222723 108989 330438 154458 140936 91240 105706 252472 -151457 56858
13053 -21063 157653 -50524 489861 143860 26370 -142103 -47730 -100889 20988 512 164947
13042 164947 218800 148961 151120 -1051 -15041 112980 287725 101121 15199 179341 123749
13031 123749 -198945 1675 164784 53522 74107 83811 -116196 422533 72257 -55144 307052
13019C06017a7990B9292b0084H6903a53832C1516P592J77518f8178J7086A02884
13007B18009G5319J03713o1837J12037B1309J37688F6391J21700a76445g667j75370
12996a83037A25020L81479i4179A5599a61183l1681C22806A01259g5167l1184
12986a06351q6129C07275A0365e3093B94298A25458a61942A97208a37363B89973
12975B63195l8447E5109K68518b49A70043o4895A9412L1914g5568p2063A17753
12963F3525N698O3218a8511o3759B35383b69224c6677J5611C34541C4779J40104
12952A74883a0320j04805M1894j0142j09241Q1964f020D3044J21384J34074a78656
12940D672Q6768l6488K4140K4923m857l0908a28900D07609d0604C25839j01394
$$ plain form
13019 306017 -17990 29292 -20084 86903 -153832 31516 39108 216626 -68178 -51092 102884
13007 218009 75319 179032 117195 229232 21309 158997 66391 188091 -176445 -7667 -183037
12996 -183037 125020 506499 -94179 15599 -161183 -192864 322806 101259 -75167 -106351
12986 -106351 -192480 307275 10365 -53093 294298 125458 -161942 197208 -137363 289973
12975 263195 224748 55109 323627 -249 170043 105148 19412 51326 -75568 -147631 117753
12963 63525 69223 132441 -18511 -82270 235383 -269224 -36677 -21066 334541 34779 174883
12952 174883 -10320 -115125 -73231 -83373 -192614 -110650 -6020 43044 164428 298502 -178656
12940 4672 91440 54952 79092 104015 99158 68250 -128900 407609 -40604 325839 224445
12929B24445a8414E8465e4861A6883K0811O4138J3862m796D6942O2732L97932
12918E07606j62159p5618C9662a29954B44230B3140A1233a39600A63142J17451
12908B80593r1962G7333i6275A28051a27643N4040c6780n0870m4904c2882A24408
12896A90899f1313A69800b4040D08731A70216B9515Q390b97980A34946F5954P7754
12885A43708E7701e4964A5333N21856c1552l4223G5508k4974b5444k36980F4054
12873F2483e6325a6366B56982a7718I1968J2441a13565L1403C75725a4019l01818
12862c15837a36703J7868A42934k4156a33084L0220A29605N7842i9459A05365
12851G2853l4574b41998J06836L7451B27937M5425d8108B09352J26805D8428d68729
$$ plain form
12929 224445 -18414 58465 -54861 16883 37694 101832 115694 110898 46942 109674 507606
12918 507606 345447 269829 39662 -129954 244230 23140 11233 -139600 163142 280593
12908 280593 188631 77333 -96275 128051 -127643 -73603 -36780 -87650 -132554 -32882 124408
12896 190899 -61313 169800 -24040 408731 170216 29515 37905 -297980 134946 65954 143708
12885 143708 57701 -54964 15333 537189 -31552 -65775 75508 50534 -25444 -262424 64054
12873 62483 -56325 -16366 256982 -17718 91968 104409 -113565 -82162 375725 -14019 -315837
12862 -315837 -136703 -118835 142934 118778 -133084 -102864 129605 187447 -99459 105365
12851 72853 38279 -241998 -135162 -97711 227937 273362 -48108 209352 336157 48428 -468729
12839A90720a98860H6582K3115M0270m8943a41641I6254g245j23131A65051G1258
12827B32582g2207A6584c31812J03602f7890B30023o4327G9106C5973J59010J19297
12816C14280q9707J11793I0378m2909a54511m4773E45800A95784K43346B0654
12805F7922b02659A21030c6398H3628a49407B3493K5605b17113B62716A29193
12794A52491a90272H3389f1936C3681M58654j82473n0419d0662g326A60065h7992
12782D6781a66921l2915d7784m3494A56408a3969J332F9609c2373A90915J86643
12771C77558a18148B32140o7970n2508g2220C06100B9177a4284k18201J02985
12761a29500j14344f4830A07872d7901A27611J38574I7278m8138c29854B23927
$$ plain form
12839 190720 -198860 86582 109697 149967 101024 -141641 96254 -7245 -130376 165051 71258
12827 232582 -72207 16584 -331812 -228210 -67890 230023 165696 79106 35973 194983 314280
12816 314280 224573 336366 90378 47469 -154511 -199284 545800 195784 439130 20654
12805 67922 -202659 121030 -36398 83628 -149407 23493 49098 -217113 262716 129193
12794 152491 -190272 83389 -61936 33681 492335 309862 259443 -40662 -7326 160065 -87992
12782 46781 -166921 -199836 -47784 -91278 156408 -13969 -12637 69609 -32373 190915 377558
12771 377558 -118148 232140 164170 111662 -72220 306100 29177 -14284 -232485 -129500
12761 -129500 -243844 -64830 107872 -47901 127611 266185 97278 49140 -329854 223927
12750A38199J64606F2874c78542A4756D026J94267e2024A33052b06898F2881h6051
12738B17685r2113k3594j6076a54345E6456b93709n1966h2320B75963E2923B1492
12726g2422j33947G5512a93179A20286L33143i2403l665G0172g7087B57433a67590
12714c54056d3222B63604B7920L5201K7073A6460J01988J44281C8261K6154K5340
12703H9755a2838E7298J96867j14181k2556b2296A26312i800A98638a32540I9296
12691a13073D0648K50250j40787M7772J4420I879J85091C8025d6772A64809a77090
12679A19225L1337D3067N1173e8799a4061A62979B6715J9585K4115J23121O2858
12668B56394j10770K5257b5335B05945L8950c463B53552N0202A48835J68457A11694
$$ plain form
12750 138199 302805 62874 -378542 14756 4026 198293 -52024 133052 -206898 62881 -86051
12738 217685 125572 101978 85902 -154345 56456 -293709 -345675 -82320 275963 52923 21492
12726 -72422 -206369 75512 -193179 120286 453429 -92403 -96068 70172 -77087 257433 -167590
12714 -354056 -43222 263604 27920 63121 90194 16460 118448 262729 38261 64415 89755
12703 89755 -12838 57298 254165 139984 117428 -22296 126312 -9800 198638 -132540 99296
12691 -113073 40648 290898 150111 197883 212303 9879 194970 38025 -46772 164809 -177090
12679 119225 150562 43067 94240 -58799 -14061 162979 26715 46300 70415 193536 256394
12668 256394 145624 170881 -25335 205945 244895 -3463 253552 303754 148835 317292 111694
12656C77270A49631K24523A47663E522J96114p8729C4960M9416Q0199a18162C3000
12644a48653p9578Q238c3873A02742a05959j08275F7148a02408H393L0284M71376
12633E10053E8941M20015A54411L1944N7722p7171L11195l0916j85620a51723
12622A36581R2822n8606j9546L5863a7077C80566j09119a98463B78153e2643r8403
12611a51046D82393A86753o7314e786k5020A61193F8034i0917B232e2137j8718
12600g0855A32756l3762J25988K00357A36090J63160b802G3440a79980Q3987D5051
12588d604A62894K21850c22719g6803G9242a7172n0697j05345C79980h8368o2256
12577a50624m9781l1334g8689B84338E9611C160a89593A6902b21158O5430B20229
$$ plain form
12656 377270 149631 374154 147663 5522 201636 122907 34960 84376 164575 -118162 33000
12644 -148653 -228231 -219993 -33873 102742 -105959 -214234 67148 -102408 8393 38677 510053
12633 510053 58941 478956 154411 186355 244077 166906 478101 447185 261565 -151723
12622 136581 229403 170797 151251 187114 -17077 380566 271447 -198463 278153 -52643 -151046
12611 -151046 482393 186753 119439 -5786 -30806 161193 68034 -90917 2232 -52137 -70855
12600 -70855 132756 98994 224982 425339 136090 299250 -2802 73440 -179980 -95993 45051
12588 -4604 162894 384744 -322719 -76803 79242 -17172 -67869 -173214 379980 -88368 -150624
12577 -150624 -200405 -231739 -78689 284338 59611 3160 -189593 16902 -221158 -155728 220229
12565B38832H4534J1704c4361C22643b57123B58933a2694o224j49596F7155b2311
12553a57655C77299l5856h0613a5023C23383a30734b021r4115C08947b3452H3651
12541c00725A29342c5012A41223Q0445K88032e6936A04406a06857D6795d5630
12530C35806g514A20658r037a75261g9394A49767j8854a23733K4720b6604R09
12519b5695D800O8062k2154K64918A35763J48247a73665f633A62662e6442n1929
12508a08371K0062G4275J4518h6828B93752f297G5172g320H0776j5707K6979L4489
12496A26537a56514B08234a34418e4672K741A42856a25413B43068b95975A15495
12485B96650A00344f2075a5534A90101c95911C50677h3135B9670e7352A78130
$$ plain form
12565 238832 84534 96238 -34361 322643 -257123 258933 -12694 -18918 -168514 67155 -22311
12553 -157655 377299 341443 -80613 -15023 323383 -130734 -2021 -96136 308947 -23452 83651
12541 -300725 129342 -35012 141223 221668 509700 -56936 104406 -106857 46795 -45630
12530 335806 -7514 120658 111621 -175261 -79394 149767 130913 -123733 -99013 -26604 -25695
12519 -25695 4800 72862 50708 315626 135763 284010 -173665 -6633 162662 -56442 -108371
12508 -108371 -88309 74275 88793 -86828 293752 -6297 75172 -7320 80776 65069 92048 126537
12496 126537 -156514 208234 -134418 -54672 -51931 142856 -125413 243068 -295975 115495
12485 296650 100344 -62075 -15534 190101 -395911 350677 -83135 29670 -57352 178130
12474A05659L9982a68082B03185B5557J35893a12681l1248I7586a65126H7126
12463B50219b70122e6578l18399I4666a29417G5237a73340f4285D74d35371K15703
12452b19668B15968G9654N0587E4721B0384J8524j3653L49040A45254g7926h671
12440D1074J27534o0982e2852E2573j1567K92368f3193A41419c4591p7558k39477
12429c51626c2804j46372a9736B0079K29096r7030l7427j7687J63683c0938m97617
12418e28555e0901F5300a68798A33951p309m6592b5204k59543J37544A23648a90354
12406B10917B7615c1686D2633e2607K2043l0292l18827f7592B73506c2929A9489
12394f0647A92461a01535l4450G1390b5042B23771a08265C7731J8134Q8010J33463
$$ plain form
12474 105659 145641 -168082 203185 25557 161450 -112681 -143929 97586 -165126 87126
12463 250219 -270122 -56578 -374977 94666 -129417 75237 -173340 -64285 474 -435371 -219668
12452 -219668 215968 79654 130241 54721 20384 38908 25255 374295 145254 -77926 -8671
12440 41074 168608 107626 -52852 52573 41006 333374 -63193 141419 -34591 -112149 -351626
12429 -351626 -32804 -179176 -19736 20079 249175 152145 114718 97031 260714 -30938 -528555
12418 -528555 -50901 65300 -168798 133951 126642 80050 -25204 -284747 -147203 123648 -190354
12406 210917 27615 -31686 42633 -52607 -30564 -60856 -379683 -67592 273506 -32929 19489
12394 -60647 192461 -101535 -135985 71390 -25042 223771 -108265 37731 55865 143875 277338
12383B77338G1943K0154p629a63347g0608m878A19134L3124A5095Q7878c96278
12371A73671p2828j2313a17777c8165j25778F5962g8684C50779m0514J03611C2572
12359B71927A13046h4026A10425J4884d084k16267E2764k5256C635J35722d56702
12347f4078B53559G8170b89286a40470M9687q655A6301a50988C00576a80229C89573
12335A05675h9978J9994N195l4458C24881A41553g0348j12385d2565I0454M2192
12324A32646J44122a25035N1590k91732J07824B2988b5379H7306e4277B16529
12313B00033c1163A76704K13371j43353a37253O2934A76681l5882J14755d7180
12302i4779l7856A47236E3569f6918C7139b0802I9500b15609C56507b37557g9423
$$ plain form
12383 277338 71943 92097 84468 -163347 -70608 -75486 119134 152258 15095 102973 -396278
12371 173671 100843 88530 -117777 -38165 -163943 65962 -78684 350779 310265 413876 32572
12359 271927 113046 -84026 110425 125309 -4084 -220351 52764 27508 3635 139357 -456702
12347 -64078 253559 78170 -289286 -140470 -90783 -99438 16301 -150988 300576 -180229 389573
12335 105675 -89978 -69984 -64789 -99247 324881 141553 -70348 -182733 -42565 90454 132646
12324 132646 276768 -125035 -73445 -365177 -257353 22988 -25379 87306 -54277 216529
12313 200033 -31163 176704 390075 246722 -137253 -74319 176681 140799 255554 -47180
12302 -94779 -132635 147236 53569 -66918 37139 -20802 99500 -215609 356507 -237557 -79423
12290G8908g9637A05666n2718a29731d3070o039B32103d48308f652C6819A1652
12278B80189A588a77034B90069c52868e8380q152B27405a27401m839c5389G3598
12266A10526g0170D05724b96063d4341C42221a05787m525B67344a22419A23017
12255a37873H0970R5481b31807B80680A2411J98398j01534J73306d3758p0253
12245a14011r6568k35660P009B31493G9877L63050a36304e2297B05294a31982
12234G7364K60698G3642J20370M6555A13022b9358G3182a7916C18664a3988D74572
12222a38393D5548L54782n3786J99467A37139E2153b66541a32176C71456A67245
12211E6453Q6087J27099d4742C55950e108A58654L6915d5326p5609M9651F7622
$$ plain form
12290 78908 -79637 105666 52948 -129731 -43070 -49109 232103 -448308 -6652 36819 11652
12278 280189 1588 -177034 290069 -352868 -58380 -66532 227405 -127401 -132240 -35389 73598
12266 110526 -70170 405724 -296063 -44341 342221 -105787 -110312 267344 -122419 123017
12255 -137873 80970 176451 -231807 280680 12411 210809 109275 282581 -43758 -114011
12245 -114011 -210579 -446239 -439230 231493 79877 442927 -136304 -52297 205294 -131982
12234 77364 338062 73642 194012 240567 113022 -29358 73182 -17916 318664 -13988 474572
12222 -138393 45548 400330 346544 546011 137139 52153 -266541 -132176 371456 167245
12211 56453 142540 269639 -44742 355950 -5108 158654 195569 -45326 -120935 -71284 67622
12199A75601Q7786p6298E7182K26076K12583A77392Q8625J76123a62759G4332
12188I844a1719I0896m2737a06843l28455G4983k0007a81973f7231B24495J71815
12177C96310a72512f799A68710A9586R5896d3501C38224l4616G7289b37491B77503
12165B74097a59943j1618I5683c6311A84228C1924L01774H1807J46001H7494J61524
12154B49018b18353A58966j5708a5617A8326J85055B742a77595I5036K9035i056
12142d4179m1868D65962D8004b70975J8739c1880F5433a78313E6270b58631d3433
12130c05560B41545b5954j03674C6431J01199K0346D9531K25418G2659K43933
12120C16592a53387B31537L53800e3457H4199a06711c1959A80752d94A47550b66228
$$ plain form
12199 175601 263387 187089 57182 283258 495841 177392 266017 442140 -162759 74332
12188 9844 -11719 90896 48159 -106843 -435298 74983 54976 -181973 -67231 224495 396310
12177 396310 -172512 -6799 168710 19586 115482 -43501 338224 303608 77289 -237491 277503
12165 274097 -159943 -171561 95683 -36311 184228 31924 333698 81807 227808 87494 249018
12154 249018 -218353 158966 143258 -15617 18326 203381 2742 -177595 95036 124071 -9056
12142 -44179 -86047 465962 48004 -270975 -252236 -31880 65433 -178313 56270 -258631 -43433
12130 -305560 241545 -25954 -129628 36431 137630 157976 49531 274949 72659 316592
12120 316592 -153387 231537 585337 -53457 84199 -106711 -31959 180752 -494 147550 -266228
12108B94446c51991a43894j25678b9333A62878J6956e0942A53578Q0050H4542
12097d7813B57743c1901n0421B61173F0083a36913A37163i2867A1349R2612l3369
12086G0592J71682A20798a26101b9225C8491a02501E7673J8404K5700a34461K4818
12075a09643n1606j93124B1992J53766b59940L0137E8620a39304A10358K9964
12065A40322B3842a4843l62278I9957J61500r2431a15889D06638j68367H3864
12054A227159n87423E3980b8099j26561M6695A88912N2306D4003c43997a12850
12043B40774f2946j18465L6761A17441b89134P3671B0651R1078J5119N3178o6495
12032A13531K97159a85833J6786A51742b65796I9573f8970C4472g2838j2111k3422
$$ plain form
12108 294446 -351991 -143894 -269572 -29333 162878 179834 -50942 153578 233628 84542
12097 -47813 257743 -31901 -82322 261173 60083 -136913 137163 -92867 11349 103961 70592
12086 70592 242274 120798 -126101 -29225 38491 -102501 57673 76077 101777 -134461 -109643
12075 -109643 -161249 -354373 21992 175758 -259940 -229803 58620 -139304 110358 140322
12065 140322 23842 -14843 -377121 99957 261457 169026 -115889 406638 238271 83864
12054 1227159 639736 53980 -28099 -154660 -107965 188912 241218 44003 -343997 -112850
12043 240774 -62946 -181411 -144650 117441 -289134 -215463 20651 111729 126848 180026 113531
12032 113531 410690 -185833 -169047 151742 -265796 99573 -68970 34472 -72838 -84949 -108371
12021a08371F8159a23447B15928b6648B71699c24364B1235a82983a9427A51195
12010A15325J42278A1853d01951j04034h1904q942A04919l6047a19555e5993C84004
11998B5112i432j94614A10592Q5822a01780A15797J36215b21190C1816i6404A45926
11986a03880n3895g4088o9329e5939j52132f4544j11249d6113m8476B50346b6694
11974F4609A5044Q1128a16466j25816R4133j3169C14358c16543A35736C0558O258
11963C6816j6429L2704c03164B84432c66553J27527B69125a71280O5755l5726
11953a41251r6199L4550c042k89507A41953a08948B81151b46776A29197B9704
11942A15072a70270j59404J14417B6033b20j50749m09365A59368a67978B55494
$$ plain form
12021 -108371 68159 -123447 215928 -26648 271699 -324364 21235 -182983 -19427 151195
12010 115325 257603 11853 -401951 -505985 -81904 -90846 104919 68872 -119555 -55993 384004
11998 25112 -9432 -204046 110592 196414 -101780 115797 252012 -221190 31816 -96404 145926
11986 -103880 -157775 -74088 -143417 -55939 -208071 -64544 -175793 -46113 -94589 250346 -26694
11974 64609 15044 96172 -116466 -242282 -148149 -161318 314358 -316543 135736 30558 36816
11963 36816 20387 53091 -303164 284432 -366553 -239026 269125 -171280 -105525 -141251
11953 -141251 -237450 -202900 -3042 -292549 141953 -108948 281151 -246776 129197 29704
11942 115072 -170270 -329674 -215257 26033 -220 -150969 -560334 159368 -167978 255494
11931a11442A21927N4934b34523k05651A76095a47532a5772A55462k3568c81910
11920b5064J0682I8809j3978C0342R9681C8632L97226A12337b62751j33520I6606
11908A06213a78183A16988J23671j11362E9411c12977B04275f919C1105a19325
11897H0467a48744A1730a47049A40257J34803j06065b10707R5366H6381b5906
11886H9214a16559A29435b25482a318k23594e2251D4574a55369B67592D2221A8417
11874c92632J69158a04082p000M6594B3368a8907k50201A1863M2525K53850F1444
11862A20887a70744K4597A77625a70995g3086G9738a5495j02865j23422b8745
11851i354l86220a8861D6533a56438d7995B61110h4099K8145k6793n2278n5169
$$ plain form
11931 -111442 121927 176861 -234523 -440174 176095 -147532 -15772 155462 131894 -381910
11920 -25064 -14382 98809 84831 30342 130023 38632 435858 112337 -262751 -396271 96606
11908 106213 -178183 116988 240659 129297 59411 -312977 204275 -6919 31105 -119325
11897 80467 -148744 11730 -147049 140257 275060 168995 -210707 -115341 86381 -25906
11886 89214 -116559 129435 -225482 -1318 -224912 -52251 44574 -155369 267592 42221 18417
11874 -392632 -223474 -104082 -111082 -64488 23368 -18907 -269108 11863 54388 308238 61444
11862 120887 -170744 -146147 177625 -170995 -73086 79738 -15495 -118360 -241782 -28745
11851 -9354 -395574 -18861 46533 -156438 -47995 261110 -84099 -55954 -82747 -135025 -190194
11840a90194e0207F756g6354k59675a9071j49240B36960A03009b12413g4841B22489
11828G824i5045m1670B41409m5765a44123d8319j365l67318A34976b5417j5570
11817d0987j31624L6412e2624M345C01314a67837C94654h9343j37858a2659o7424
11806h0083o1728k56769Q2074C75317a63904E3528b11318G6414J28127b78318
11795d8092A72850g7118B8156a67348N6904k43193i0577B4015K5499a55661c769
11783b34530G7503f4972p311a4745L167m6991k04861J13299B5345K94863a20438
11771f3642k7675J9943g571A27851a32218A98603b23380H8212O8836h618G2028
11759a61402r6065a4330k77471f1128A50317k4868b78904g0298M335r6377L7812
$$ plain form
11840 -190194 -50207 6756 -76354 -336029 -19071 -168311 236960 103009 -212413 -74841 222489
11828 7824 -95045 -136715 241409 195644 -144123 -48319 -49684 -417002 134976 -25417 -40987
11817 -40987 -172611 -136199 -52624 -48279 301314 -167837 394654 -89343 -227201 -12659 -80083
11806 -80083 -141811 -398580 -316506 375317 -163904 53528 -211318 76414 204541 -278318
11795 -48092 172850 -77118 28156 -167348 -110444 -353637 -90577 24015 49514 -155661 -3769
11783 -234530 77503 -64972 -72283 -14745 -11578 -58569 -263430 -150131 25345 320208 -120438
11771 -63642 -91317 -71374 -7571 127851 -132218 198603 -223380 88212 157048 -8618 72028
11759 -161402 -257467 -14330 -291801 -61128 150317 125449 -278904 -70298 -65963 -162340 -124528
11748a24528J7390b3235j67922c9331m1721j62941C4615a25323j23591D8561c2138
11736I8001i808r1634l9455b407C2881h4388n2102O7588l7488K7654F1577j5472
11724D6105M0025c9820j35307G6235a58127B7044J48282a41320c6566l9247B81819
11712a49639b9203r9518a4675A2367J11724c1905A10656Q9951j5529d9857E8736
11700b52382I7876J13325b05015G0629f1487J8051l5068K1257A01736a85063a7866
11688A2398a90513c0638B4915M3432b26086A85359b57215P237B00933i4497o3290
11677a57787A703b69333K7422I9609g3481C74292A82757e4566D56490j93077E6924
11665A40829h5896A36166K3235a47012j723P0511B28396f1435N419C0208J79141
$$ plain form
11748 -124528 -107138 -23235 -191157 -39331 -81052 -243993 34615 -125323 -248914 48561 -32138
11736 98001 -9808 -101442 -140897 -2407 32881 -84388 -136490 -68902 -106390 -78736 61577 46105
11724 46105 86130 -39820 -175127 76235 -158127 27044 175326 -141320 -36566 -75813 281819
11712 -149639 -29203 -128721 -14675 12367 124091 -31905 110656 200607 185078 -49857 58736
11700 -252382 97876 211201 -205015 70629 -61487 -43436 -78504 -57247 101736 -185063 -17866
11688 12398 -190513 -30638 24915 68347 -226086 185359 -257215 -249978 200933 -94497 -157787
11677 -157787 1703 -269333 -241911 99609 -73481 374292 182757 -54566 456490 263413 56924
11665 140829 -85896 136166 159401 -147012 -148735 -78224 228396 -61435 -56016 30208 209349
11654B09349A6244b52861j22667N7622J17530E8457f2341a7216c61H13d9685A54658
11641a11399A71287E9490Q7051B7758J73578d8406B15539E3583J83359F4368K12086
11630B76454b53306C83914F7159g3249j97083H2062c44614J03348B77691C1469
11619a31124M9050A72024J49824a26884A55923K31437a37118H5732a84512I7385
11608A96941H8519P350b42665A1654a30756F6785j6422b52347A91307a69199f7637
11596A58427F3379A3654K8089N200f1100q2227K386e7050R522A4527Q1636J66612
11584B62775r2991c56064B1661f9176k1332j02611E1425K4264b11675D6950O4687
11573A11637c91715B93437I9770D9211J22135c59021f0199J9193j82926B9213
$$ plain form
11654 209349 16244 -252861 -375528 -317906 -200376 58457 -62341 -17216 -361 813 -49685 154658
11641 -111399 171287 59490 146541 27758 201336 -48406 215539 53583 236942 64368 276454
11630 276454 -253306 383914 67159 -73249 -270332 82062 -344614 -241266 277691 31469
11619 -131124 -82074 172024 321848 -126884 155923 387360 -137118 85732 -184512 97385
11608 196941 88519 95869 -242665 11654 -130756 66785 50363 -252347 191307 -169199 -67637
11596 158427 63379 13654 41743 46943 -61100 -143327 -140941 -57050 -47528 14527 96163 262775
11584 262775 169784 -356064 21661 -69176 -90508 -193119 51425 75689 -211675 46950 111637
11573 111637 -391715 293437 99770 49211 171346 -359021 -60199 -41006 -223932 29213
11562A55059O1506e4712r9380E659a26635A2737K16532A03142a23646A66688d8436
11550I319J29456l3658J28377o1458b03175o5705e3264J2318j55677M5143m783
11539a56263g4097A89302H4207l7908J9170A3495b8910A14506a61128A16779L1630
11528A48409L0959i1513k45675a41645A36364b43065e7516E06019c22169M0842
11518b81327B20802e5725A85044a30519H6290P6021A6399K97736A31463a25078
11507C19301A9277L84958a24219A12097e3402D6407Q3457L0322J28822a49477
11496C14540a27199I0739N6797a70439C44847I6910L2141J03188j04503J35286
11486B63022I9144b72427B26145b45167A20396J43989p5397J39442A50354c1452
$$ plain form
11562 155059 216565 -54712 -154092 5659 -126635 12737 229269 103142 -123646 166688 -48436
11550 9319 138775 105117 233494 172036 -203175 -268880 -53264 -40946 -196623 -151480 -156263
11539 -156263 -74097 189302 84207 46299 65469 13495 -28910 114506 -161128 116779 148409
11528 148409 179368 -91513 -337188 -141645 136364 -243065 -57516 506019 -322169 -281327
11518 -281327 220802 -55725 185044 -130519 86290 162311 16399 314135 131463 -125078
11507 319301 19277 404235 -124219 112097 -53402 46407 129864 160186 289008 -149477
11496 314540 -127199 90739 147536 -170439 344847 96910 129051 232239 127736 263022
11486 263022 99144 -272427 226145 -245167 120396 264385 188988 328430 150354 -31452
11475a23095C72495c7859k65033B44017g0300A78629g1112K596b2177G4410K56955
11464C31365F2244O7211K3903L36692B39991d6916k2230a4210A60261P8463j00015
11453A38709J38545A33706c40230c993A29263b87520B56254B6471O7907p91N8830
11442A52417a39583A15475h733A17702N3163a50941A02507J41957a16035D6053
11431G2356g3375L1413B83977A4639c4282A69096c6556B17039g214j50516E5199
11419A12290B7059L47391c1741D0403N781a97852A42936e0060k90486b3456C9865
11407b08770N6962o0627j83596H8602a69734c765o4712j43953i924G0413J3699
11396H4112K8165h8069L7025l7623A72537a41359B33570D7182b20211B05532A5797
$$ plain form
11475 -123095 372495 -37859 -302892 244017 -70300 178629 -71112 -68516 -22177 74410 331365
11464 331365 62244 129455 153358 490050 239991 -46916 -69146 -14210 160261 238724 138709
11453 138709 277254 133706 -340230 -3993 129263 -287520 256254 26471 94378 93587 152417
11442 152417 -139583 115475 -8733 117702 170865 -150941 102507 244464 -116035 46053
11431 72356 -73375 -41962 283977 14639 -34282 169096 -36556 217039 -7214 -157730 55199
11419 112290 27059 374450 -31741 40403 46184 -197852 142936 -50060 -340546 -23456 39865
11407 -208770 -151808 -212435 -396031 88602 -169734 -3765 -68477 -212430 -9924 70413 84112
11396 84112 112277 -88069 -51044 -88667 172537 -141359 233570 47182 -220211 205532 15797
11384b88335A01015k9770k0201J30739n7951O0199a33025A74911a11468d4644
11373B01138a0283j4017q2849k724E0935a60313B24826G6556J11318D7814b96105
11361D437e0711j52555B91026K8976a38235O3820c4188n0069Q120L4139A10243
11349a5500q2770J354A14524c57432J42918D4218c18283G8980L3912n3088b09758
11337a47460B08287b43017G486b18281j2345j67660C6859a47702C82324a12357
11326B58571E3697a95167B05804d94899a33264B41674d03828d7788L914j19732
11316a63606e4585B29562A86M37138j57853O8477b97120B36167C9134L80055A00182
11304B13126m3188P2607a9280k59262B49139C4264J33163c21832A30920F306a13089
$$ plain form
11384 -288335 101015 71245 51044 181783 123832 184031 -133025 174911 -111468 -44644
11373 201138 -10283 -24300 -107149 -109873 50935 -160313 224826 76556 187874 47814 -296105
11361 4437 -50711 -203266 291026 320002 -138235 -74415 -34188 -84257 -76137 -41998 110243
11349 -15500 -98270 -96916 114524 -357432 -214514 44218 -318283 78980 112892 59804 -209758
11337 -147460 208287 -243017 7486 -218281 -230626 -398286 36859 -147702 382324 -112357
11326 258571 53697 -195167 205804 -494899 -133264 241674 -403828 -47788 -43874 -163606
11316 -163606 -54585 229562 186 437324 279471 347948 -297120 236167 39134 419189 100182
11304 213126 169938 242545 -19280 -278542 249139 34264 167427 -321832 130920 6306 -113089
11292A68277J30217a17819L2579E508e7232n5084j17442A83603q550a94814e9611
11280A2864J52883n8738N5123P5922b57631A92945r6146a17617B89625E9244c61990
11268c84788A02423a05540B4945c7746B03450a38565a7377E9551L7955h3605r8694
11257a82299A1069b41459E3365e9292k87459C44715A18669a0856B2631i8870B4064
11245A40036O0375b02134g0616j94687a31667A12801D999J38729p0665P8023k895
11234A48191h331l03124B45251c86750a31938j44838j14286I4969J49706d4917
11223E7026J45802c81091a52808j57137i2051B26703J8990c3953n4155j3524F3623
11211A64874J58913h2862k96028h4384j93417A51847c12120G7741a63866L0649
$$ plain form
11292 168277 298494 -117819 -85240 5508 -57232 -112316 -229758 183603 175053 -194814 -59611
11280 12864 165747 107009 162132 238054 -257631 192945 96799 -117617 289625 59244 -361990
11268 -384788 102423 -105540 24945 -37746 203450 -138565 -17377 59551 97506 -83605 -182299
11257 -182299 11069 -241459 53365 -59292 -346751 344715 118669 -10856 22631 -98870 24064
11245 140036 200411 -202134 -70616 -265303 -131667 112801 4999 143728 73063 151086 148191
11234 148191 -8331 -311455 245251 -386750 -131938 -276776 -391062 94969 244675 -44917
11223 57026 202828 -381091 -152808 -309945 -92051 226703 245693 -33953 -88108 -101632 63623
11211 164874 323787 -82862 -378890 -84384 -277801 151847 -312120 77741 -163866 -133217
11201a33217r7707I74N1831J09318a13582A68732a08034l65661K18237g1410K8195
11190d3215q7901c6510m1484H7963h1781n1542L6807A8369b13829B08444J16067
11179C24511A04854D8716c22507I0902b0331k70539D30896a08553K8960c2311
11168A08130b77715I3066d521l40186K3630A14956A7213a50921k3130j1629B1850
11156b89050g322B5925L73991a26583b4855r8566L4588B19485g9796G8334a2785
11144B33039c0820m3646B0362P9177D6428a36513C51504F6947L7446d2546n79
11133d3125H6661K40104o8359M03219A44824C5643J12916o725J67206D3479c12737
11121b71234i8685I1793i114B4457Q7920B9817a78555a4792B63276b71225A47358
$$ plain form
11201 -133217 -230924 974 52805 162123 -113582 168732 -108034 -473695 -255458 -71410 -43215
11190 -43215 -131116 -36510 -77994 87963 -81781 -133323 -96516 18369 -213829 208444 324511
11179 324511 104854 48716 -322507 90902 -20331 -290870 430896 -108553 -79593 -32311
11168 108130 -277715 93066 -4521 -344707 -321077 114956 17213 -150921 -174051 -185680 21850
11156 -289050 -7322 25925 399916 -126583 -24855 -123421 -88833 219485 -79796 78334 -12785
11144 233039 -30820 -74466 20362 99539 46428 -136513 351504 66947 104393 -42546 -43125
11133 -43125 86661 326765 258406 661625 144824 35643 148559 141834 309040 43479 -312737
11121 -271234 -98685 91793 -9114 24457 112377 29817 -178555 -14792 263276 -271225 147358
11109C5716Q6718k3036L20623A39898c891H4814L6898K52501k4950D9104J10646
11098A59750j8969J79192j09181a60956C72438K06246H7244J15594b5902E5796
11087B24750P8981j51625D9747K50224j5929L6245c0344A42010J63390j42253
11077A63147h3996B55923E7776N74223B72888A33434P7369k716J80387n6623J11490
11066D43341L4669o5552j57568J243J18014j20689M14714j96984l921q1516K68979
11055F54730k56324J70423P2924C01916K77261B09923K10361j01600L04623L6768
11045F60075o8940J81156k96236L17101j43801K71464j08229j52220o7024K28786
11035H22132j56357L72812m76326M79521l58700R3723j48559k39625M63254j17510
$$ plain form
11109 35716 122434 99398 420021 139898 -3891 84814 121712 374213 349263 49104 159750
11098 159750 140781 319973 210792 -160956 372438 578684 87244 202838 -25902 55796
11087 224750 303731 152106 49747 299971 284042 320287 -30344 142010 305400 163147
11077 163147 -83996 255923 57776 631999 272888 133434 210803 208087 388474 331851 443341
11066 443341 478010 412458 254890 256133 374147 253458 668172 471188 467267 385751 654730
11055 654730 398406 568829 641753 301916 579177 209923 420284 318684 623307 660075
11045 660075 591135 772291 476055 793156 649355 920819 812590 660370 593346 822132
11035 822132 665775 1038587 562261 1041782 683082 776805 628246 388621 851875 734365
11025G34365J33623j82806J42391l558J77426m17119j26246j12640O31821m29763
11015E47494N6839j15235J32111K65251m38951L0914J99930q4320R6141r3094
11005E97080p0836q4291K30569k62283L08351P6771L1001C63391K01983J0002
10995E75376k7801K12266k1890j89185j29005L05690k16113L12166J95797k95656
10985G21645J51784K88526l64786M97766l42694N08505j59155J28434L24987j56184
10975A598828P53447J25061R2184j35963M12738j02113N9043k01825l10057j73150
10965B118193m28849k78141K08297n48842N5153j07883J56843n5695l71564L67405
10955A114917l51362k07213A55473K04967q7466q2390J29509o7128A23012K10520
$$ plain form
11025 734365 867988 685182 827573 824015 1001441 584322 458076 345436 977257 547494
11015 547494 604333 489098 621209 886460 447509 478423 678353 594033 690174 597080
11005 597080 526244 441953 672522 410239 718590 795361 826362 363391 565374 575376
10995 575376 547575 759841 737951 548766 419761 725451 509338 821504 1017301 721645
10985 721645 873429 1161955 797169 1294935 952241 1460746 1301591 1430025 1755012 1598828
10975 1598828 2352275 2477336 2569520 2433557 2846295 2744182 2803225 2601400 2291343 2118193
10965 2118193 1689344 1411203 1619500 1070658 1125811 1017928 1174771 1119076 747512 1114917
10955 1114917 763555 556342 155473 360440 272974 190584 320093 252965 123012 333532
10945C33532E1882L467N6624M51214h4400A54793a00906E0319f4845A59091o2311
10934I6780a07504E6927O2795L15447G1134b56090I5445b16779H8609L67842F0858
10922d97168b00778A09176a78888J5906k8317k2887b5006H514d0431C10123d247
10910A49037a42296J2996q7444b5762G060J59537D7403K4336c37891B22912G75
10898b41242a012A2164J31557d87604E7312d2694A42504i6962j75847e0872H4823
10886A91663C1907P9215b8707l3276k03777F2545a544F5392B1900b58514Q8557
10875a69957B7870a31393m7468A15905d16339A13834N1871a69619g1867A80550
10864E6674i5424c2590D6576l128b75660A28417b04579l9974k4135d335B4486
$$ plain form
10945 333532 51882 55349 111973 563187 -84400 154793 -100906 50319 -64845 159091 96780
10934 96780 -107504 56927 119722 435169 71134 -256090 95445 -216779 88609 456451 60858
10922 -497168 -200778 109176 -178888 -162982 -191299 -214186 -25006 8514 -40431 310123 -4247
10910 149037 -142296 -129300 -216744 -25762 7060 166597 47403 71739 -337891 222912 775
10898 -241242 -1012 12164 143721 -487604 57312 -42694 142504 -96962 -272809 -50872 84823
10886 191663 31907 111122 -28707 -61983 -265760 62545 -1544 65392 21900 -258514 -169957
10875 -169957 27870 -131393 -178861 115905 -416339 113834 165705 -169619 -71867 180550
10864 56674 -95424 -32590 46576 43448 -275660 128417 -204579 -244553 -268688 -4335 24486
10852c30221B4566g0984A80094a41203A32625J26989A04769b1579j37334c741
10841c1328B47098d13704b7437j42070e643B69180g4073B84682d28203C9121J8779
10830E7900c30226J19583B58466a43358l81843A81082b9722B01802m7105N9000
10820B13697H7533D0461b8263j1536j0196l16730A56862b05351q2413A55141b90629
10808A29613d04r1679M1378a47B12681b235A12431a83982B5243N0815b74669B9551
10795a12045d4081l8077D5088K2672l539c0493m01101J89571B21154a26039k2509
10784a48548D2437b65366A7235d3420M857C17652A01442i8517l1154r076L0022
10773a08725j15567C3314a03710B23121a82492O7889p1931I9220b91926Q8080
$$ plain form
10852 -330221 24566 -70984 180094 -141203 132625 259614 104769 -21579 -158913 -3741
10841 -31328 247098 -413704 -27437 -169507 -5643 269180 -74073 284682 -428203 39121 57900
10830 57900 -330226 -210643 258466 -143358 -525201 181082 -29722 201802 154697 213697
10820 213697 87533 40461 -28263 -39799 -49995 -366725 156862 -205351 -287764 155141 -290629
10808 129613 -404 -92083 -50705 -147 212681 -2235 112431 -183982 25243 76058 -274669 29551
10795 -112045 -44081 -82158 45088 67760 64221 -30493 -431594 -242023 221154 -126039 -148548
10784 -148548 42437 -265366 17235 -43420 -38563 317652 101442 -98517 -129671 -138747 -108725
10773 -108725 -224292 33314 -103710 223121 -182492 -114603 -186534 99220 -291926 -203846
10763b03846A46346c60790A2911M6419J76044G2321b07083d9301l119j50724A30922
10751C35897a71421M6755M3329j96678A58415P0290L1289m4486G9417c74661F0595
10739h6930A87084a42536C01549j07314f4288A51298a00742c0646j0130C14113
10728C19581a74585A58633K7143b62685J11011d7293k52536G3416a31377e3303
10717b22614Q3282q2582A63592b28184I1827J74308a06619B13795J50784b30497
10706a00234j36501a7346j65436A6759a97847j1802A05481b26665j45025Q2751
10696b88939A59773a46721C9676a80625l6464E6187b19074e4987B0706O3830B2104
10684b06734F3110b70726B69624A15156K09707J27680i7144A81734a60296j81966
$$ plain form
10763 -203846 146346 -360790 12911 59330 235374 72321 -207083 -49301 -52420 -203144 130922
10751 335897 -171421 -124666 -81337 -278015 158415 228705 259994 215508 79417 -374661 60595
10739 -86930 187084 -142536 301549 194235 -64288 151298 -100742 -30646 -40776 314113
10728 319581 -174585 158633 185776 -262685 -151674 -47293 -299829 73416 -131377 -53303
10717 -222614 -139332 -221914 163592 -228184 91827 266135 -106619 213795 364579 -230497
10706 -100234 -236735 -17346 -182782 16759 -197847 -209649 105481 -226665 -371690 -288939
10696 -288939 159773 -146721 39676 -180625 -217089 56187 -219074 -54987 20706 84536 22104
10684 -206734 63110 -270726 269624 115156 324863 452543 -97144 181734 -160296 -342262
10674c42262A2232a66521A43706b26754C150a16289j64466f2499b3510k88874
10664c12384A4275J92612J62465a8197C7153a09495A86882g1442j16211j6108
10654b03761E0317M6325b36033j24406a75520P7996b7226k26934a15214B67125
10643F6933a29215J0531I928a94606O1408j26511p3207e5270F0758K20701M232
10632B85691i1810j44860A43760F9414a11700k14579i3983L6172A59648O4070
10622B23718c97276H0663b6073a1636j66253j24710i5953G7588c11692b909l38890
10611c41799J34630B10158a95407p5220H6117J2107J68697F7817i4306K3841I6689
10599a31892A08984D4956a80723j45629D5527a91052l5147I6726g4900I3944B2690
$$ plain form
10674 -342262 12232 -166521 143706 -226754 3150 -116289 -280755 -62499 -23510 -312384
10664 -312384 14275 206887 369352 -18197 37153 -109495 186882 -71442 -187653 -203761
10654 -203761 50317 96642 -236033 -360439 -175520 -97524 -27226 -254160 -115214 267125
10643 66933 -129215 -118684 9928 -194606 -133198 -259709 -332916 -55270 60758 281459 285691
10632 285691 -91810 -236670 143760 69414 -111700 -326279 -93983 -57811 159648 223718
10622 223718 -397276 80663 -26073 -11636 -177889 -302599 -95953 77588 -311692 -2909 -341799
10611 -341799 -207169 210158 -195407 -270627 86117 98224 266921 67817 -94306 -70465 96689
10599 -131892 108984 44956 -180723 -326352 45527 -191052 -226199 96726 -74900 93944 22690
10587a02132B10710b50974B13244F4219b0057n6037A06214c27150g1373k3155
10577i4528j7016b2896j49021B4204b91695a9992j81509C29558o0346B208J35757
10566A37965d5951j30189d0144l13125O5025J31769N5034D586L13527h6660l29177
10555d15837A55180E1214J1273b60435j36382g6368k3953o4879k1875A95868o2609
10544A33259a806p692B0965i2077a3635p0384j52031A40711J67075e924j4854
10533b0778D7817g2786n3461p743p6803g1756j36282l8443d9790p0070j61521
10522b81381e0000j13922A02870A8231J22619L10487i1509c0945j5706j15528
10512a62179o048A32020c34671J45063I6144a3697p94H7568c18237R9649A48122
$$ plain form
10587 -102132 210710 -250974 213244 64219 -20057 -76094 106214 -327150 -71373 -94528
10577 -94528 -111544 -22896 -171917 24204 -291695 -19992 -201501 329558 269212 2208 137965
10566 137965 -45951 -176140 -40144 -353269 -288244 -156475 -101441 4586 318113 -86660 -415837
10555 -415837 155180 51214 62487 -260435 -396817 -76368 -100321 -165200 -187075 195868 133259
10544 133259 -1806 -9498 20965 -92077 -13635 -84019 -236050 140711 307786 -5924 -20778
10533 -20778 47817 -72786 -126247 -133990 -210793 -71756 -208038 -246481 -49790 -119860 -281381
10522 -281381 -50000 -163922 102870 18231 140850 451337 -91509 -30945 -46651 -162179
10512 -162179 -168227 132020 -334671 -189608 96144 -13697 -14491 87568 -318237 -218588 148122
10500b34121i2778q9887D2449K51238c4693a6138a309k90975A71258j5805b07141
10488i8578A42956J26601c017D4303d7880j48732m9019G9557C8410i2975A29365
10476A73745a49388A45116G624a09335M9377k28674A87720e4359j10595d0719
10465a80694g3394o0556A27251P1700f6728I9947L24106B4117d00526J43826J20266
10454a36434A58995n8931m0837B6217J62628a17949L34A67965A9013b05035B41004
10442a31131l306B77859h5958A42986b4377r0167E7917a28244h522A7622b06331
10430F5314J0048g3863c1555H7523d305j72284O9941l65013A65358b69796a1206
10418A79079a39889C3091K98948g2539F2846b36836b5351r1911A01820a83230
$$ plain form
10500 -234121 -92778 -182665 42449 293687 -34693 -16138 -1309 -292284 171258 155453 -207141
10488 -98578 142956 269557 -3017 44303 -47880 -196612 -245631 79557 38410 -92975 129365
10476 173745 -149388 145116 7624 -109335 -59958 -288632 187720 -54359 -164954 -40719
10465 -180694 -73394 -133950 127251 198951 -66728 99947 424053 24117 -400526 -256700 -136434
10454 -136434 158995 100064 59227 26217 188845 -117949 -117615 167965 19013 -205035 241004
10442 -131131 -134437 277859 -85958 142986 -24377 -114544 57917 -128244 -8522 17622 -206331
10430 65314 75362 -73863 -31555 87523 -4305 -176589 -106648 -471661 165358 -269796 -11206
10418 179079 -139889 33091 332039 -72539 62846 -236836 -25351 -117262 101820 -183230
10407a26795e3060H5561j6510b07354O792D6228J31657a31755F5337k5229J52255
10396A92363q3272P583N6602i9715C08078j13269M3761m9452a16547A73086b59411
10384b76989a00018H391L97228D3486K81999b656C19819g1837E7470K88287A04864
10372a22308A07519K76623A52556l9680L22302M14197C98736L9073j64907B2806
10361D37159A20630P0935b38899C53517q9067J68245A37406a83414A33132J39057
10351B72189K56000L50504C01573A41571O4460J45222C3447J30807e7690A55833
10340f5400A13875R3862R822j02783J32084C6200L18982F2194O8017K57833a269
10328g9599j47576C19824a41192M6788A98753F7592P5948j1537K57855d2499C52583
$$ plain form
10407 -126795 -53060 85561 69051 -207354 -200562 46228 177885 -131755 65337 40108 192363
10396 192363 109091 116674 173276 -99715 308078 194809 238570 189118 -116547 173086 -259411
10384 -276989 -100018 8391 405619 43486 325485 -2656 319819 -71837 57470 345757 104864
10372 -122308 107519 384142 152556 112876 435178 849375 398736 437809 272902 22806
10361 437159 120630 191565 -238899 353517 264450 432695 137406 -183414 133132 272189
10351 272189 528189 878693 301573 141571 206031 351253 33447 164254 -57690 155833
10340 -65400 113875 207737 217559 114776 246860 36200 355182 62194 130211 388044 -1269
10328 -79599 -227175 319824 -141192 -94404 198753 67592 143540 132003 389858 -42499 352583
10316A07532J44789a94807A02037M5351N6457o3833g5072A27823a42880I585a51670
10304D41469a87795I1843J0169a23454C54854B8722R4286c34405A01150m7112
10294E4038b49165A1948N27741a55148A6535d3662J9345l38941G7920e3034C3204
10282C59053c21736a46913k98788A65677H94b3472k3338h360E6641e6851B01964
10270a47056I7225c35639A16005e5892C7089b7144k35367a03280q612A3098j017
10259A2081L64673E7047J23933m01p0968R3491p0024L60298g4649F3056J2216
10248G5272B0232h2881C5193J95134f0098q9240b5435l5260k1924B83342a72297
10236C22472b68749B09242h6831m1260N5971c2598j04317n6898f9378k24810i8648
$$ plain form
10316 107532 252321 -194807 102037 147388 203845 140012 -75072 127823 -142880 9585 -151670
10304 441469 -187795 91843 102012 -123454 354854 28722 123008 -334405 101150 54038
10294 54038 -249165 11948 539689 -155148 16535 -43662 -24317 -363258 77920 -53034 33204
10282 359053 -321736 -146913 -445701 165677 894 -23472 -46810 -8360 56641 -56851 201964
10270 -147056 97225 -335639 116005 -55892 37089 -27144 -262511 -103280 -111892 13098 12081
10259 12081 376754 57047 180980 180579 109611 203102 133078 493376 -74649 63056 75272
10248 75272 20232 -82881 35193 230327 -60098 -149338 -25435 -60695 -82619 283342 -172297
10236 322472 -268749 209242 -86831 -128091 -72120 -32598 -136915 -193813 -69378 -294188 -98648
10224a50338f9706A45865b06461B58695a91871B03911a8497l6023C1340a61904
10213A399M36031a51599g4356l3777A47389i3126k17158f8291B27053G3873i9625
10201a33524B51439c2245A5540a77100A33905g0237a8229E8469a66931j47260
10191c14191C30290b49715J24750J6586A54202b01568A5886P4885b29041L9127
10181a89914B35660j126a8651j76083H8733f5040k7399B00760a30842O1574j49859
10170b19127G5358e9904G3298a82759b1240A54992a39779F7050c41534A99491
10159g129j59834m29055F538i0999j7183j35773D4016N0677b52250p8639H7859
10147b06820C23835B5946a48170c919A37570c93614i1877n8157N7874B48947F813
$$ plain form
10224 -150338 -69706 145865 -206461 258695 -191871 203911 -18497 -54520 31340 -161904
10213 1399 437430 -151599 -74356 -108133 147389 -93126 -310284 -68291 227053 73873 -99625
10201 -133524 251439 -32245 15540 -177100 133905 -70237 -18229 58469 -166931 -314191
10191 -314191 330290 -249715 -124965 -108379 154202 -201568 15886 90771 -229041 -189914
10181 -189914 235660 234534 -18651 -194734 88733 -65040 -92439 200760 -130842 -69268 -219127
10170 -219127 75358 -59904 73298 -182759 -21240 154992 -139779 67050 -341534 199491
10159 -7129 -166963 -596018 6538 -90999 -108182 -243955 44016 94693 -252250 -330889 87859
10147 -206820 323835 25946 -148170 -3919 137570 -393614 -91877 -150034 -92160 248947 6813
10135b79113J15489e3709b2611k48169i5195j18885e6381k3796j5395E3018a71328
10123b35239C39185B4945J35128K8355b59775j44383h7308b7366F035a60342k7045
10112a87387h9508B36286b31890e3866l9627J611p4557k9397j2783r7847B39963
10100b00490L8226L7806e1953A55043b89467a13243A0139c35786a13839F7722
10089A27572R6650j07339E0621g8414A8303e1004B14424b30643J05794l9369j21941
10078b86159O6698A60804a38245c9214j10989j79137g8656l22063A28239a69868
10067A46810h11l7911r2927G1351e7452k46834A12480b07839H7634a66780K0699
10056a46081B21672a85468A01478h7429E5479K8227c8896j34697j37621J27005
$$ plain form
10135 -279113 -163624 -53709 -22611 -270780 -95195 -214080 -56381 -80177 -95572 53018 -171328
10123 -235239 339185 24945 160073 188428 -259775 -404158 -87308 -27366 6035 -160342 -187387
10112 -187387 -89508 236286 -231890 -53866 -93493 -91882 -166439 -195836 -208619 -306466 239963
10100 -200490 -162264 -124458 -51953 155043 -289467 -113243 10139 -335786 -113839 67722
10089 127572 224222 116883 50621 -78414 18303 -51004 214424 -230643 -124849 -164218 -286159
10078 -286159 -219461 160804 -138245 -39214 -150203 -329340 -78656 -400719 128239 -169868
10067 146810 -811 -38722 -131649 71351 -57452 -304286 112480 -207839 87634 -166780 -146081
10056 -146081 221672 -185468 101478 -87429 55479 83706 -38896 -173593 -311214 -184209
10046a84209A79503e596j98179A69669J27301b07643a9199q042n037A84296a60858
10034a83379q5779i729A21844a92456B64361a99326M1984k0267B03030b75249
10023H0264k7372O458j267j5656J43173q4587b91249B04812H6224K05951I7949
10011a64437k4526o157i0099B4358F135b53546B2739a03552m3583A21736E3108
9999B1851I941a65269C81308j31399f3610r7456A56616a79879A11158m5773P7984
9988A43369m5496b53949n1660a38552l42054C8473M8940D1340c77643J59394Q2088
9977a36161k32735a69316A65642a40036f3651j70321h2803k0740o0690j79886
9967c44119D0032a11796k98902d6349C02383c06917G283a61028f8361C20105a31875
$$ plain form
10046 -184209 179503 -5596 -203775 169669 296970 -207643 -19199 -27241 -32278 184296 -160858
10034 -183379 -269158 -9729 121844 -192456 264361 -199326 -157342 -177609 203030 -275249
10023 80264 52892 59350 58083 42427 185600 101013 -291249 204812 86224 292175 97949
10011 -164437 -188963 -195120 -90099 24358 6135 -253546 22739 -103552 -147135 121736 53108
9999 21851 9941 -165269 381308 249909 -63610 -161066 156616 -179879 111158 65385 143369
9988 143369 97873 -253949 -305609 -138552 -480606 38473 87413 41340 -377643 -218249 -136161
9977 -136161 -368896 -169316 165642 -140036 -63651 -233972 -82803 -103543 -164233 -344119
9967 -344119 40032 -111796 -410698 -46349 302383 -306917 7283 -161028 -68361 320105 -131875
9955B0659a73497b5020C22082b99718R8397k57698J96784i627o3049a4695k06099
9944b20794A96767a49004A13222a83373M4661a7588l51515a22876K9523A4209
9933a02664j3265d513j71262g6920p4743f6889n3348J5688A43972n0119b50571
9921a26475d0912a1614j54052k34804a94059B5553b49648A10814b34552J9181
9911b15371h5588l54684a71878d2680k19966J23052M4635A29458M5979F3670a54141
9899c82018H5890h3239F7307B1602J6609L9521C0196b20336A27016a11216A21581
9887A37220Q7512a35081j12340Q9710B50325a54856O8275L6618j85202D2618a2808
9875A27036J4233c088k884k3121q8321j4072M0468A58620f7096m8840A89581d9392
$$ plain form
9955 20659 -173497 -25020 322082 -299718 -201321 -459019 -262235 -9627 -72676 -14695 -220794
9944 -220794 196767 -149004 113222 -183373 -138712 -17588 -369103 -122876 -93353 14209
9933 -102664 -115929 -4513 -175775 -76920 -151663 -66889 -120237 -104549 143972 93853 -250571
9921 -126475 -40912 -11614 -165666 -400470 -194059 25553 -249648 110814 -234552 -215371
9911 -215371 -85588 -440272 -171878 -42680 -262646 -139594 -94959 129458 175437 63670 -154141
9899 -382018 85890 -83239 67307 21602 38211 77732 30196 -220336 127016 -111216 121581
9887 137220 224732 -135081 -247421 -157711 250325 -154856 -86581 -49963 -235165 42618 -12808
9875 127036 141269 -3088 -5972 -29093 -117414 -131486 -91018 158620 -67096 -115936 189581 -49392
9862b41601m300N2818B24278b92870J05610f3361o4403H0411f0400n9413l3569
9851a53382d5216j0761j6503A4356c38405e0460A41653k6786O055a10574c6008
9839a71930B62749a20943d9276F4349b09709R0828I8594J5087e2308J652k93856
9828c44512J07409m8546J29148f2563j42318B82772B2893i7914c3984k58487I493
9816E7581P600b33590B6556b81118m78i7956L8534n0542A94268c05861H8378a29224
9803b9167k52904C2112b04592K1072o7274C5711c19997d4925A3302J60832a28411
9791A03885b33577a12371C1751M8574g9058l60C39556e6432m47818B53294A24570
9779d51235a45123P0337j91835A01986M794P481b58383A25488K04670b55617r6661
$$ plain form
9862 -241601 -245901 -193083 224278 -292870 -187260 -63361 -127764 80411 -60400 -119813 -153382
9851 -153382 -45216 -55977 -72480 14356 -338405 -50460 141653 114867 120922 -110574 -36008
9839 -171930 262749 -120943 -49276 64349 -209709 -118881 98594 113681 -52308 -50656 -344512
9828 -344512 -237103 -285649 -156501 -62563 -204881 282772 22893 -97914 -33984 -292471 9493
9816 57581 65181 -233590 26556 -281118 -281596 -97956 -59422 -109964 194268 -305861 88378 -129224
9803 -29167 -282071 32112 -204592 -183520 -250794 35711 -319997 -44925 13302 174134 -128411
9791 103885 -233577 -112371 31751 80325 -79058 -79418 339556 -56432 -504250 253294 124570
9779 -451235 -145123 -74786 -266621 101986 106780 114261 -258383 125488 330158 -255617 -352278
9768c52278f0432j06975r5542m5804A85636b12052B1492b92978J12010A1295J80396
9757A91691f4688B56602d6926a5573A19535B1831h6060L8391A31463a0549k09570
9746b20119D0755J95934c2188j83431L6334j1036j17530I8270a30548C09971C3430
9734b90656j11368a26376A05165c12243a23631Q981k92948A57620R6233F9486
9723B9080L4638a16903G234a0441j14932L8665d639j6346k00872n2606D1777O2087
9711A03864d8406j38372l42339f9246G80K546b14052F6717k8244O6573L7569J92294
9699C34909E6000b80370O8221G849b45494Q5058A23898b04970R4748r8811j4058
9688b23091A1267J13464E035a56343C0563h7062A61710b93575A636N6590j9988
$$ plain form
9768 -352278 -60432 -167407 -262949 -308753 185636 -212052 21492 -292978 -180968 11295 191691
9757 191691 -64688 256602 -46926 -15573 119535 21831 -86060 -47669 131463 -10549 -220119
9746 -220119 40755 236689 -32188 -215619 -179285 -190321 -307851 98270 -130548 309971 33430
9734 -290656 -402024 -126376 105165 -312243 -123631 -114650 -407598 157620 253853 69486
9723 29080 63718 -116903 7234 -10441 -125373 -86708 -4639 -20985 -221857 -274463 41777 103864
9711 103864 -48406 -186778 -529117 -69246 780 3326 -214052 66717 38473 105046 142615 334909
9699 334909 56000 -280370 -212149 7849 -245494 -160436 123898 -204970 -110222 -209033 -223091
9688 -223091 11267 124731 5035 -156343 30563 -87062 161710 -293575 1636 58226 38238
9677C8238b20989O6576N4738l02368J63338j7337A42290A0531J18905a80795j38202
9666c18997j19708m422J93407J8192A27938J7261a2011I5447j0030J1340b27674
9654D3943c58476a20302I6158c04282f8186C8802P6548c4544j69714E0677c2897
9642A15837k9685a7972k80072n2034J16769c1994B1032J5632H107K3819h5758
9630a1228C6340J6845e277n54034A0347b48686j00399J39760K7596a8639G3734
9618D9319J1867J37138a09774k4304K8302K3517H7402P3310b34728p7192a41178
9606a75609L1072A18090a7084C752c92594J81328a3044E0163R5226F3144d17407
9594A02737b5280l1397A04498b2820A95902a57085j43356G4783b1210B60970a12574
$$ plain form
9677 38238 -220989 -154413 -99675 -402043 -238705 -256042 142290 10531 129436 -180795 -318997
9666 -318997 -438705 -443127 -249720 -231528 127938 145199 -12011 95447 85417 96757 -227674
9654 43943 -358476 -120302 96158 -304282 -68186 38802 115350 -34544 -204258 50677 -32897
9642 115837 86152 -17972 -298044 -350078 -233309 -31994 21032 36664 8107 31926 -85758
9630 -11228 36340 53185 -5277 -559311 10347 -248686 -349085 -209325 -181729 -18639 73734
9618 49319 61186 198324 -109774 -134078 -105776 -82259 87402 160712 -234728 -311920 -141178
9606 -175609 -144537 118090 -17084 3752 -392594 -211266 -13044 50163 145389 63144 -417407
9594 102737 -25280 -56677 104498 -22820 195902 -157085 -300441 74783 -21210 260970 -112574
9582A11789m6934G365g4241k10906D2774J67346m7598f8447A03833h1728A31297
9570F6426a68125e0856H7587J9650M6643a26927j4463M9648a616k79273H1418
9558c95527g5299l6909B57918a31054d6777F9781q248J34455b66921R8901M0563
9547a27457C41924j22954e6914q1166K3474E503Q0474c28428a35380m6906A35174
9535B34564g6211L1722B05419n4012F873d6312r7672A9578d6873C54857B0701
9523a58982e9437K1803j43090d5921j10794A28831c73023J39167O7304c2199k71109
9512c03308A89873a75203j63357a28098l7525A7060b39887k239Q6587M3577C72201
9500A94666b4834A6256c66362a07175h028D0337g7078C4347K08055j18581b37469
$$ plain form
9582 111789 64855 7365 -74241 -285147 42774 210120 162522 -68447 103833 -81728 131297
9570 66426 -168125 -50856 87587 107237 153880 -126927 -141390 -91742 -1616 -280889 81418
9558 -395527 -75299 -112208 257918 -131054 -46777 69781 61533 195988 -266921 -168020 -127457
9547 -127457 341924 218970 -56914 -138080 -114606 5503 85977 -328428 -135380 -182286 135174
9535 234564 -76211 -44489 205419 151407 6873 -46312 -143984 19578 -46873 354857 20701
9523 -158982 -59437 -37634 -180724 -45921 -156715 128831 -373023 -233856 -166552 -32199 -303308
9512 -303308 189873 -175203 -338560 -128098 -165623 17060 -239887 -242126 -155539 -111962 372201
9500 194666 -24834 16256 -366362 -107175 -8028 40337 -77078 34347 242402 123821 -237469
9488c30041C7444a75206A53703n6772b16357H0710K06819b77284a2191C589M3898
9477D7487b01128B36297a90673A4397a44120C3632a97763A59439j1766c07967
9466B06491c8509A99441L3392h6512F059k744b33995f295m3776m55536b49965
9454b359l55977J60389A57072b13834b6315k06864F6618a39093j64830J0921d0066
9442E5277a61232D0742i9238J1870H3211b6052B2349a61999e6846j72008L7140
9431a91714B258a07499l8651d1528j52188C6845a72332b7634m73100b30508A02754
9419c40275A56667a03191l2667A21452b1702D0403i5542K4542A54333b17024A61528
9407A46102a64326b2446A82438b01467B5785a40157m17717c0836m49743J41218
$$ plain form
9488 -330041 37444 -175206 153703 96931 -216357 80710 287529 -277284 -12191 3589 47487
9477 47487 -201128 236297 -190673 14397 -144120 33632 -197763 159439 147673 -307967
9466 206491 -38509 199441 232833 -86512 6059 3315 -233995 -6295 -50071 -505607 -249965
9454 -2359 -358336 -197947 157072 -213834 -26315 -233179 66618 -139093 -303923 -293002 -40066
9442 55277 -161232 40742 -99238 -87368 83211 -26052 22349 -161999 -56846 -228854 -191714
9431 -191714 2258 -107499 -146150 -41528 -193716 36845 -172332 -27634 -500734 -230508 102754
9419 -340275 156667 -103191 -135858 121452 -21702 40403 -95542 -71000 154333 -217024 161528
9407 146102 -164326 -22446 182438 -201467 25785 -140157 -557874 -30836 -480579 -339361
9397c39361j4154M2680A55992L1120n4622J52905b64897A05281C2528L05349b22302
9385c07256g2671b2485j24172C7970a9829C244g1596a0407j40643e5835k25583
9374b81418g0135p3230I0560a23554A85564e0952A41439d4536A02039a97797k2141
9363b19938B67629a25165M2223A64638b07414G1041o267a2163A05971a30812A58029
9351D7070A946b47689a0782k01609d7071k2671c2235n23891a3191A18257i3463
9339a32287q926p3773J01318j03284b2059k14868a14328k70394J56561H0208b3971
9327i0226I4066O3486c3733C5R4125a42849m4935f4345j24752Q3067c728j08343
9315a12071B73181d0471B16924j04703a56094C07722j20234G6442n055e3110A8474
$$ plain form
9397 -339361 -353515 -310835 155992 187112 132490 285395 -264897 105281 32528 337877 -222302
9385 -307256 -72671 -22485 -146657 37970 -19829 3244 -71596 -10407 -151050 -55835 -281418
9374 -281418 -70135 -143365 90560 -123554 185564 -50952 141439 -44536 102039 -197797 -219938
9363 -219938 267629 -125165 -82942 164638 -207414 71041 64774 -12163 105971 -130812 158029
9351 47070 1946 -247689 -10782 -212391 -47071 -69742 -32235 -556126 -13191 118257 -93463
9339 -132287 -141213 -214986 -113668 -216952 -22059 -236927 -114328 -384722 -228161 80208 -23971
9327 -90226 94066 157552 -33733 35 94160 -142849 -187784 -64345 -189097 -106030 -3728 -112071
9315 -112071 273181 -40471 216924 112221 -156094 307722 187488 76442 71387 -53110 18474
9303A14789b94470j1374b6894j87635m092A43864e8916E1978Q1765k6241J01382
9292B08884h865E1783a55260b978l48364A86206a56915A10374a01654C93873A9349
9280F3318J59790a4852E8540K44355H3618d21220b3508p0567B0510G630h9273
9268d88642C03320b7819A01616a14521j03685a06818F2799b36382d771q9417o4836
9257a59024d1330A54150c39183G017K38203E9710a12937j11573g8985H6583b078
9245h1628E0420f9232a6488B15834a03328a8404D1324a78062k14134J76215r5404
9234c11385h8842L0893C18503c1899q6911C4986b88189i9244B0639a95720A75633
9222G0584d054D8144a3019k5473C90686a0857B31818d08233d3666p0454L3138
$$ plain form
9303 114789 -294470 -305844 -26894 -214529 -218621 143864 -58916 51978 133743 107502 208884
9292 208884 -8865 51783 -155260 -2978 -351342 186206 -156915 110374 -101654 393873 19349
9280 63318 223108 -14852 58540 302895 83618 -421220 -23508 -94075 20510 7630 -89273
9268 -488642 303320 -27819 101616 -114521 -218206 -106818 62799 -236382 -4771 -94188 -159024
9257 -159024 -41330 154150 -339183 7017 245220 59710 -112937 -224510 -78985 86583 -2078
9245 -81628 50420 -69232 -16488 215834 -103328 -18404 41324 -178062 -392196 -215981 -311385
9234 -311385 -88842 -57949 318503 -31899 -118810 34986 -288189 -99244 20639 -195720 175633
9222 70584 -4054 48144 -13019 -38492 390686 -10857 231818 -408233 -43666 -114120 -80982
9211h0982b637l79308B4446F63d02017J67324n3544a30516E4204c12211j8977
9200c31188J24151d0133g278j48283O2036I4091J78179a3780k17191A17174a24037
9188c60252f1153k69649a57604M7463j59966e3348j55143A67358b2288C74763
9177B10174e3502r799m4204B0889P8984b9646A02355A6195a52993D08278a93897
9165B67889m1056p2042g2967L3071j24008O2048j24735R5374o8336k3622A32961
9153B02192b14538a8518l5297B44056d3715j2690a0723r235j21847I1956a78674
9141a2115j48305L8462A49813b10114m8794h9878l47289J79792M5153L6403g5152
9129a96128c9173n6852j46369c9325k08758J11218b1535B24189I95K36197a67855
$$ plain form
9211 -80982 -2637 -381945 24446 663 -402017 -234693 -288237 -130516 54204 -312211 -331188
9200 -331188 -207037 -40133 -7278 -155561 -93525 94091 272270 -13780 -230971 117174 -124037
9188 -360252 -61153 -330802 -157604 -110141 -270107 -53348 -208491 167358 -22288 374763
9177 210174 -53502 -63301 -107505 20889 99873 -29646 102355 16195 -152993 408278 -193897
9165 267889 226833 154791 -72967 -39896 -163904 -101856 -226591 -131217 -199553 -223175 132961
9153 202192 -214538 -18518 -53815 244056 -43715 -56405 -10723 -19958 -141805 91956 -178674
9141 -12115 -160420 -121958 149813 -210114 -258908 -89878 -437167 -257375 -212222 -175819 -75152
9129 -196128 -39173 -96025 -242394 -39325 -248083 -136865 -21535 224189 995 237192 -167855
9117G608J11763C0764K87692c20852J04482B48749B5684a05252H5596A3233d010
9105D9061a97258o3446E545c81662A55831b04611E4114h729k79889A98163d4802
9093a28292L7860l3855e451C0850A5074a56625I2244e6252b7623B9855c6016C00434
9080a91492d315K133q015j4690p6251n5649o5754O6211B45650a70541q1771J12743
9068a39569k3301F9841d9236A09563b14535G3148g9123A0422K9459c03087E8220
9056F1742b21585a08254A27250a94418B15591c6100r6178A73988b88897j27999
9046d16896a04176l1447J32A08048j6993a65700d8905m9727j31912m3660b941
9034a36378C30333a37739d3751A17647a3888H1060n089a62336E17038a93728k79656
$$ plain form
9117 7608 119371 30764 318456 -320852 -216370 248749 25684 -105252 85596 13233 -4010
9105 49061 -197258 -260704 5545 -381662 155831 -204611 54114 -8729 -288618 198163 -44802
9093 -128292 -90432 -124287 -5451 30850 15074 -156625 92244 -56252 -27623 29855 -36016 300434
9080 -191492 -4315 -2182 -10197 -24887 -101138 -156787 -222541 -156330 245650 -170541 -252312 -139569
9068 -139569 -162870 69841 -49236 109563 -214535 73148 -79123 10422 39881 -303087 58220
9056 61742 -221585 -108254 127250 -194418 215591 -36100 -132278 173988 -288897 -416896
9046 -416896 -104176 -135623 -135491 108048 91055 -165700 -48905 -98632 -230544 -274204 -2941
9034 -136378 330333 -137739 -43751 117647 -13888 81060 75971 -162336 517038 -193728 -473384
9023d73384C27380b2540D9870J90911I4716j4079g146k27554I3877a36103q448
9012a44551M3758k4088F4373d540B6818a86785O0217B6885a68924F90307a71054
9000c7244B70933a34770m6022A3425b61836c7450o3727k49750C3824a98842g7795
8988A8971J32169b56409E6546R6181a35291A00325j870b15920F1599a068A14419
8976A53123b23218n6090a6827k23994o0682R5958P3843J4412j50254A19950a72813
8964A9519a39058A86579b83811n6360J33537j8738J0446m2213C2658c895o0156
8953f4051A09465b31602C79255b34304m9471J38300A80056a04277A19355a65456
8942f2C43137a89024C4551h3524o4543p2058c2393F3212J55448H3698a04382m7725
$$ plain form
9023 -473384 327380 -22540 49870 240781 94716 80637 -7146 -234700 93877 -136103 -144551
9012 -144551 -100793 -124881 64373 -4540 26818 -186785 -126568 26885 -168924 690307 -171054
9000 -37244 270933 -134770 -180792 13425 -261836 -37450 -101177 -350927 33824 -198842 -77795
8988 18971 151140 -256409 56546 152727 -135291 100325 98455 -215920 61599 -1068 114419
8976 153123 -223218 -279308 -16827 -240821 -301503 -205545 -131702 -117290 -267544 119950 -172813
8964 19519 -139058 186579 -283811 -340171 -206634 -225372 -214926 -257139 32658 -3895 -64051
8953 -64051 109465 -231602 379255 -234304 -283775 -145475 180056 -104277 119355 -165456
8942 -62 343137 -189024 34551 -83524 -148067 -220125 -32393 63212 218660 83698 -104382 -152107
8930a52107J7204A9335A316J27498J005K77044O65907J579268M070374K976829
8920I699241C069025A237530D22954M1140j72546I1857h7757m3553F4476J34247
8910A98723I7717K37228c5698n5357g395B5187L3264b06050p4193C06143J5777
8899C21920a42342e8273B56681a54264h474l7031j91814o8615C57488o8615b01285
8887C19462f4609C5207J73756M9091a9095l42416a29931b2415j48164A99259b11645
8875E7940e00280b41711j19374M6343b782k53940c5870k8457l27119B42131c91114
$$ plain form
8930 -152107 -134903 19335 1316 128814 129819 406863 1072770 2652038 6722412 9699241
8920 9699241 3069025 1237530 422954 464094 291548 91857 -87757 -131310 64476 198723
8910 198723 97717 334945 -35698 -91055 -7395 25187 58451 -206050 -280243 306143 321920
8899 321920 -142342 -58273 256681 -154264 -8474 -45505 -237319 -305934 357488 288873 -201285
8887 319462 -64609 35207 208963 258054 -19095 -361511 -129931 -22415 -170579 199259 -211645
8875 57940 -500280 -241711 -361085 -314742 -2782 -256722 -35870 -64327 -391446 242131 -391114
$$ [...]
##END NTUPLES=NMR SPECTRUM
##END=
