
##TITLE=AC1366_2140_7184965_qDGOeVsAB1
##JCAMPDX= 6.0         $$ Bruker NMR JCAMP-DX V2.0
##DATA TYPE= NMR SPECTRUM
##DATA CLASS= NTUPLES
##ORIGIN= BRUKER
##OWNER= Administrator
$$ 1.72 TOPSPIN		Version 2.1
$$ 2012-12-05 18:37:53.209 -0500  Administrator@X
$$ Compression mode = diff/dup
##.OBSERVE FREQUENCY= 400.02188249412
##.OBSERVE NUCLEUS= ^1H
##.ACQUISITION MODE= SIMULTANEOUS (DQD)
##.ACQUISITION SCHEME= undefined
##.AVERAGES= 64
##.DIGITISER RES= 22
##SPECTROMETER/DATA SYSTEM= spect
##.PULSE SEQUENCE= noesygpps1d.comp
##.SOLVENT NAME= COFFEE_meoh
##.SHIFT REFERENCE= INTERNAL, COFFEE_meoh, 1, 14.96094
##AUDIT TRAIL= $$ (NUMBER, WHEN, WHO, WHERE, PROCESS, VERSION, WHAT)
$$ ##TITLE= Audit trail, TOPSPIN		Version 2.1
$$ ##JCAMPDX= 5.01
$$ ##ORIGIN= Bruker BioSpin GmbH
$$ ##OWNER= Administrator
$$ $$ E:\/data/COFFEE/nmr/AC1366_2140_7184965_qDGOeVsAB1/12/pdata/1/auditp.txt
$$ ##AUDIT TRAIL=  $$ (NUMBER, WHEN, WHO, WHERE, PROCESS, VERSION, WHAT)
(   1,<2012-12-05 18:37:47.209 -0500>,<Administrator>,<X>,<go>,<TOPSPIN 2.1>,
      <created by zg
	started at 2012-12-05 18:26:18.166 -0500,
	POWCHK enabled, PULCHK disabled,
       configuration hash MD5:
       86 BA 57 50 F2 9D 5C 9B 26 00 A9 28 5F 66 2E 89
       data hash MD5: 64K
       6B 60 44 FB DE 2B 9D 69 70 95 48 02 7C 1D DA BA>)
(   2,<2012-12-05 18:37:50.397 -0500>,<Administrator>,<X>,<proc1d>,<TOPSPIN 2.1>,
      <Start of raw data processing
       efp LB = 0.3 FT_mod = 6 PKNL = 1 PHC0 = 0 PHC1 = 0 SI = 128K 
       data hash MD5: 128K
       F7 0E 8A 06 FB B7 57 15 6B CD 6D 2C F7 68 00 77>)
(   3,<2012-12-05 18:37:51.459 -0500>,<Administrator>,<X>,<proc1d>,<TOPSPIN 2.1>,
      <pk PHC0 = -76.3385 PHC1 = 0 
       data hash MD5: 128K
       42 C1 05 C8 ED 93 A1 EC 6E 7C D5 D0 F1 A2 5B 72>)
(   4,<2012-12-05 18:37:52.131 -0500>,<Administrator>,<X>,<proc1d>,<TOPSPIN 2.1>,
      <abs ABSG = 1 
       data hash MD5: 128K
       09 EB 78 38 FC EA CF 92 71 28 08 0E E7 62 F2 72>)
(   5,<2012-12-05 18:37:52.319 -0500>,<Administrator>,<X>,<proc1d>,<TOPSPIN 2.1>,
      <abs ABSG = 2 
       data hash MD5: 128K
       02 1D 0D C7 FC 25 17 C3 1E F6 58 C9 A1 5E 30 A1>)
(   6,<2012-12-05 18:37:52.491 -0500>,<Administrator>,<X>,<proc1d>,<TOPSPIN 2.1>,
      <abs ABSG = 3 
       data hash MD5: 128K
       48 51 10 9F F4 9A 80 C2 A9 1A D5 66 81 35 D0 A1>)
(   7,<2012-12-05 18:37:52.678 -0500>,<Administrator>,<X>,<proc1d>,<TOPSPIN 2.1>,
      <abs ABSG = 4 
       data hash MD5: 128K
       DD 97 ED 83 31 D4 CE EF CB 05 BD 0E 7E EF 15 DB>)
(   8,<2012-12-05 18:37:52.850 -0500>,<Administrator>,<X>,<proc1d>,<TOPSPIN 2.1>,
      <abs ABSG = 5 
       data hash MD5: 128K
       49 4F 74 9A AC 13 94 D2 35 DF 44 91 64 EF AC 29>)
$$ ##END=
$$ 
$$ $$ hash MD5
$$ $$ 34 CC 30 A9 CD A4 E6 28 42 FD D5 20 F0 44 49 FD
##$RELAX= 
##$RELAX= 
##$RELAX= 
##$RELAX= 
##$RELAX= 
##$RELAX= 
##$RELAX= 
##$RELAX= 
$$ Bruker specific parameters
$$ --------------------------
##$DU= <E:\>
##$EXPNO= 12
$$ [...]
150 150 150 150 150 150 150 150
##$TP07= 0
##$TPNAME0= <>
##$TPNAME1= <>
##$TPNAME2= <>
##$TPNAME3= <>
##$TPNAME4= <>
##$TPNAME5= <>
##$TPNAME6= <>
##$TPNAME7= <>
##$TPOAL= (0..7)
0.5 0.5 0.5 0.5 0.5 0.5 0.5 0.5
##$TPOFFS= (0..7)
0 0 0 0 0 0 0 0
##$TUNHIN= 0
##$TUNHOUT= 0
##$TUNXOUT= 0
##$USERA1= <user>
##$USERA2= <user>
##$USERA3= <user>
##$USERA4= <user>
##$USERA5= <user>
##$V9= 5
##$VALIST= <valist>
##$VCLIST= <CCCCCCCCCCCCCCC>
##$VD= 0
##$VDLIST= <DDDDDDDDDDDDDDD>
##$VPLIST= <PPPPPPPPPPPPPPP>
##$VTLIST= <TTTTTTTTTTTTTTT>
##$WBST= 1024
##$WBSW= 4
##$XGAIN= (0..3)
0 0 0 0
##$XL= 0
##$YL= 0
##$YMAX_a= 6221335
##$YMIN_a= -12503006
##$ZGOPTNS= <>
##$ZL1= 120
##$ZL2= 120
##$ZL3= 120
##$ZL4= 120
##$ABSF1= 14.96094
##$ABSF2= -5.597241
##$ABSG= 5
##$ABSL= 3
##$ALPHA= 0
##$AQORDER= 0
##$ASSFAC= 0
##$ASSFACI= 0
##$ASSFACX= 0
##$ASSWID= 0
##$AUNMP= <proc_prof1d_extract.lims>
##$AXLEFT= 0
##$AXNAME= <>
##$AXNUC= <1H>
##$AXRIGHT= 0
##$AXTYPE= 0
##$AXUNIT= <>
##$AZFE= 0.1
##$AZFW= 0.1
##$BCFW= 0
##$BC_mod= 0
##$BYTORDP= 0
##$COROFFS= 0
##$CY= 15
##$DATMOD= 1
##$DC= 0
##$DFILT= <>
##$DTYPP= 0
##$F1P= 0
##$F2P= 0
##$FCOR= 0.5
##$FTSIZE= 131072
##$FT_mod= 6
##$GAMMA= 0
##$GB= 0
##$INTBC= 1
##$INTSCL= 1
##$ISEN= 128
##$LB= 0.3
##$LEV0= 0
##$LPBIN= 0
##$MAXI= 10000
##$MC2= 0
##$MEAN= 0
##$ME_mod= 0
##$MI= 0
##$NCOEF= 0
##$NC_proc= -2
##$NLEV= 6
##$NOISF1= 0
##$NOISF2= 0
##$NSP= 0
##$NTH_PI= 0
##$NZP= 0
##$OFFSET= 14.96094
##$PC= 1
##$PHC0= -76.3385
##$PHC1= 0
##$PH_mod= 1
##$PKNL= yes
##$PPARMOD= 0
##$PPDIAG= 0
##$PPIPTYP= 0
##$PPMPNUM= 2147483647
##$PPRESOL= 1
##$PSCAL= 4
##$PSIGN= 0
##$PYNMP= <proc.py>
##$REVERSE= no
##$SF= 400.020009659282
##$SI= 131072
##$SIGF1= 0
##$SIGF2= 0
##$SINO= 400
##$SIOLD= 131072
##$SPECTYP= <>
##$SREGLST= <1H.CDCl3>
##$SSB= 0
##$STSI= 131072
##$STSR= 0
##$SW_p= 8223.68421052631
##$SYMM= 0
##$S_DEV= 0
##$TDeff= 65536
##$TDoff= 0
##$TI= <>
##$TILT= no
##$TM1= 0
##$TM2= 0
##$TOPLEV= 0
##$USERP1= <user>
##$USERP2= <user>
##$USERP3= <user>
##$USERP4= <user>
##$USERP5= <user>
##$WDW= 1
##$XDIM= 131072
##$YMAX_p= 392150016
##$YMIN_p= -12434
##$CURPLOT= <Network HP LaserJet P1505>
##$CURPRIN= <$Network HP LaserJet P1505>
##$DFORMAT= <normdp>
##$LAYOUT= <+/1D_H.xwp>
##$LFORMAT= <normlp>
##$PFORMAT= <normpl>
##$SURQMSG= 1
$$ End of Bruker specific parameters
$$ ---------------------------------
##NTUPLES= NMR SPECTRUM
##VAR_NAME=  FREQUENCY,     SPECTRUM/REAL,   SPECTRUM/IMAG
##SYMBOL=    X,             R,               I
##VAR_TYPE=  INDEPENDENT,   DEPENDENT,       DEPENDENT
##VAR_FORM=  AFFN,          ASDF,            ASDF
##VAR_DIM=   131072,        131072,          131072
##UNITS=     HZ,            ARBITRARY UNITS, ARBITRARY UNITS
##FACTOR=    0.0627417313425164, 1,          1
##FIRST=     8223.62146879497, -1393,        -50908
##LAST=      0,             -318,            -51934
##MIN=       0,             -12434,          0
##MAX=       8223.62146879497, 392150016,    0
$$ Real data points
##PAGE= N=1
##DATA TABLE= (X++(R..R)), XYDATA
$$ [...]
63881D62160l53M58J187K085L188M465N684O528P179Q379J0469J2797J4613J6089
63867E54928J7852J9923K1932K4056K6799K9937L2641L4719L6870L9571M2461
63856H81689M5062M7289M9008M9855M9939M9965N0151M9592M7337M3637L9582
63845A403106L5795L1982K7501K1924J5232P942Q30n804j2379j9174k5654l1077
63833A450224l5517l9625m3566m6833m9068n0493n1419n1857n1789n1243n0019
63822I28795m7737m4500m1078l8106l5373l2295k8873k5812k3670k2228k0860
63811E68263j9331j8024j7306j6946j6393j5584j5056j5045j4901j3820j1990
63800C93867j0415r619r118q294p253o484o162o193o576p211p557p016n618l976
$$ y = [462160, 461807, 462265, 463452, 465537, 468725, 473190, 478874, 485402, 492581, 500960, 511429, 524226, 538839, 554928, 572780, 592703, 614635, 638691, 665490, 695427, 728068, 762787, 799657, 839228, 881689, 926751, 974040, 1023048, 1072903, 1122842, 1172807, 1222958, 1272550, 1319887, 1363524, 1403106, 1438901, 1470883, 1498384, 1520308, 1535540, 1543482, 1544312, 1538508, 1526129, 1506955, 1481301, 1450224, 1414707, 1375082, 1331516, 1284683, 1235615, 1185122, 1133703, 1081846, 1030057, 978814, 928795, 881058, 836558, 795480, 757374, 722001, 689706, 660833, 635021, 611351, 589123, 568263, 548932, 530908, 513602, 496656, 480263, 464679, 449623, 434578, 419677, 405857, 393867, 383452, 373833, 364715, 356421, 349168, 342684, 336522, 330329, 323753, 316542, 308985, 301969, 296351, 292375]
63786B92375k650j882j778k254k813k875k418j921j661j501j413j681k316k822
63772B62390k790k413k095j918j842j958k137j818p03N22Q22J20o60q10n39l22
63756B43849j63J39M64N15L25K27L48M21J25n00j079j227q82k55M34R95J116N49
63738B45401l03l92Q96K830M018L914L124K354J780J555K077L257M196M224L811
63723B82742L920M707N550O058O358O515O402O147O084O048N354L675J525m44
63709C50641k105l537m488m649m214l689l262k764k241k061k311k529k277j725
63695C08789j331j099n96K48P86M67k63l90L88J295J551J406J626K325K805K541
63679C20548J720P86n0n82m53L99J423K026K327K904L933M967N594N831N851N758
$$ y = [292375, 289725, 287843, 286065, 283811, 280998, 278123, 275705, 273784, 272123, 270622, 269209, 267528, 265212, 262390, 259600, 257187, 255092, 253174, 251332, 249374, 247237, 245419, 244716, 245238, 246060, 246180, 245520, 244710, 244171, 243849, 243686, 243825, 244289, 244804, 245129, 245356, 245704, 246125, 246250, 245750, 244671, 243444, 242562, 242307, 242741, 243736, 244852, 245401, 245098, 244706, 245602, 248432, 252450, 256364, 259488, 261842, 263622, 265177, 267254, 270511, 274707, 278931, 282742, 286662, 291369, 296919, 302977, 309335, 315850, 322252, 328399, 334483, 340531, 345885, 349560, 351085, 350641, 348536, 344999, 340511, 335862, 331648, 327959, 324697, 321933, 319692, 317631, 315320, 312791, 310514, 308789, 307458, 306359, 305763, 306011, 306797, 307264, 307001, 306611, 306999, 308294, 309845, 311251, 312877, 315202, 318007, 320548, 322268, 323054, 323004, 322422, 321969, 322368, 323791, 325817, 328144, 331048, 334981, 339948, 345542, 351373, 357224, 362982]
63663C62982N670N669N417M314K295J14j476k491l278l816m012m358n470p001
63649C54559p853p574o780o013n014l589k317j741j379m28R42J830K011K196K888
63634C21738L729M176M209M101L991L945M062M383M888N590O341O665O385O210
63620C90413P062Q719J0018J0538J1196J2790J4800J6313J7407J8749K0395K1886
63608E60286K3234K4880K6704K7946K8206K7852K7279K6306K4445K1320J6820
63597H35278J1220N337J27l954o903q628q986q431q007q421r505j0756j2027j3467
63583G52877j5080j6591j7573j7591j6523j4838j3228j1826j0143p936n743m259
63571F01546l503k920k009o03J238L188M723N565O012O541P224P819Q279Q794
$$ y = [362982, 368652, 374321, 379738, 384052, 386347, 386461, 384985, 382494, 379216, 375400, 371388, 367030, 361560, 354559, 346706, 339132, 332352, 326339, 321325, 317736, 315419, 313678, 312299, 311871, 312813, 314643, 316654, 318850, 321738, 325467, 329643, 333852, 337953, 341944, 345889, 349951, 354334, 359222, 364812, 371153, 377818, 384203, 390413, 397475, 406194, 416212, 426750, 437946, 450736, 465536, 481849, 499256, 518005, 538400, 560286, 583520, 608400, 635104, 663050, 691256, 719108, 746387, 772693, 797138, 818458, 835278, 846498, 851835, 851962, 848008, 841105, 832477, 823491, 815060, 807053, 798632, 789127, 778371, 766344, 752877, 737797, 721206, 703633, 686042, 669519, 654681, 641453, 629627, 619484, 611548, 605805, 601546, 598043, 595123, 593114, 592511, 593749, 596937, 601660, 607225, 613237, 619778, 627002, 634821, 643100, 651894]
63557F51894R357R682R628R473R685J0596J2301J4630J7245J9985K3180K7364
63545H25020L2636L8460M3979M8061M8971M4692L4494K0274N816n646j3161j7555
63533A106041j9717j9879j8229j5570j2997j1134r982r417r524j0456j2224j4730
63521I42182j7811k1061k3782k5414k5971k5893k5424k4412k2729k0716j8956
63510F90013j7747j6897j5958j4528j2509j0268q451p446p068o963p086p467p658
63497E49967p020n701m740m863n561n829n420m865m409l677k465j350j097j726
63483D91244k403k211r42P72K066K587K667K764L010L411M144N233O085N940M761
63468E29128L214J764K11j732l825n517o447o653o514o550o984p367p034n928
$$ y = [651894, 661251, 670933, 680561, 690034, 699719, 710315, 722616, 737246, 754491, 774476, 797656, 825020, 857656, 896116, 940095, 988156, 1037127, 1081819, 1116313, 1136587, 1142403, 1136757, 1123596, 1106041, 1086324, 1066445, 1048216, 1032646, 1019649, 1008515, 998533, 989116, 979592, 969136, 956912, 942182, 924371, 903310, 879528, 854114, 828143, 802250, 776826, 752414, 729685, 708969, 690013, 672266, 655369, 639411, 624883, 612374, 602106, 593655, 586209, 579141, 572178, 565092, 557625, 549967, 542947, 537246, 532506, 527643, 522082, 516253, 510833, 505968, 501559, 497882, 495417, 494067, 492970, 491244, 488841, 486630, 485688, 486460, 488526, 491113, 493780, 496544, 499554, 502965, 507109, 512342, 518427, 524367, 529128, 532342, 534106, 534317, 532585, 528760, 523243, 516796, 510143, 503629, 497079, 490095, 482728, 475694, 469766]
63454D69766m610l457k401j538j236j345r92L49K164L731N109O646Q084R032R973
63439D99275J1863J4778J7801K0377K3006K6462L0926L6088M1301M5159M5505
63428H12541M0693L1018J8738O717k979r525j2966j3643j1948q406l696J629P337
63415H55510J3253J8905K3585K6755K8262K8145K6387K2811J7321J0427L486j995
63403A072852n559p990j0143j1985j3060j3410j3551j3931j4936j7035k0215k3508
63391I07529k5780k6864k7245k6916k5422k2981k0507j8376j6084j3507j1495
63380F72352j0664j0307r207p081m547k142kJ792L200M415N599O610P334Q017
63366F65369Q817R428R711J0386J2271J4974J7236J8688K0373K3136K6222K8270
$$ y = [469766, 465156, 461699, 459298, 457760, 456524, 455179, 454187, 454536, 456700, 460431, 465540, 472186, 480270, 489302, 499275, 511138, 525916, 543717, 564094, 587100, 613562, 644488, 680576, 721877, 767036, 812541, 853234, 884252, 902990, 909707, 906728, 897203, 884237, 870594, 858646, 850240, 846544, 848173, 855510, 868763, 887668, 911253, 938008, 966270, 994415, 1020802, 1043613, 1060934, 1071361, 1074847, 1072852, 1067293, 1059303, 1049160, 1037175, 1024115, 1010705, 997154, 983223, 968287, 951252, 931037, 907529, 881749, 854885, 827640, 800724, 775302, 752321, 731814, 713438, 697354, 683847, 672352, 661688, 651381, 642174, 635093, 630546, 628404, 628402, 630194, 633394, 637809, 643408, 650018, 657352, 665369, 674186, 683614, 693325, 703711, 715982, 730956, 748192, 766880, 787253, 810389, 836611, 864881]
63354H64881K9170L0068L1556L2704L2176K9680K5854K1135J5470R050K713k672
63342A121785o725r378j0607j0755j0689j1108j1877j2573j3465j5351j8439k1949
63330I68869k4939k6947k7737k7067k5093k2547k0024j7350j3969r766n089k51
63318G48090M571Q803J1121R864M062n466j5961k4119k8180k8747k7537k5648
63306F30853k3243k0395j7500j4897j2600j0667r437r155r482r674r265q417p616
63293D68505p110o716o186n572n107m873m788m839n086n328n137m359l439k999
63279C96966l125l313l068k488k126k314k708k637j880r43m36m79r10j746k963
63264C65830l973l996l074k194k110k481k515k057j608j472j410j169r47j100
$$ y = [864881, 894051, 924119, 955675, 988379, 1020555, 1050235, 1076089, 1097224, 1112694, 1121744, 1124457, 1121785, 1115060, 1105682, 1095075, 1084320, 1073631, 1062523, 1050646, 1038073, 1024608, 1009257, 990818, 968869, 943930, 916983, 889246, 862179, 837086, 814539, 794515, 777165, 763196, 753430, 748341, 748090, 752661, 761464, 772585, 782449, 786511, 781045, 765084, 740965, 712785, 684038, 656501, 630853, 607610, 587215, 569715, 554818, 542218, 531551, 522114, 512959, 503477, 493803, 484538, 476121, 468505, 461395, 454679, 448493, 442921, 437814, 432941, 428153, 423314, 418228, 412900, 407763, 403404, 399965, 396966, 393841, 390528, 387460, 384972, 382846, 380532, 377824, 375187, 373307, 372364, 371928, 371449, 370539, 368793, 365830, 361857, 357861, 354787, 352593, 350483, 348002, 345487, 343430, 341822, 340350, 338940, 337771, 336824, 335724]
63250C35724j577j822j333k60O36P48K47k34m20n87r59j294j271r98q71j080j506
63233C23143j942k221k145j561n68M08Q89P41K79q5k80m28l80J95J110J507R20
63216C19582M5j18M07P76O75O09Q78J098R99Q99J067J209R96O14M51O92J402K490
63198C34771L433L672L434L502L940L915L183K724L280M174M499M627N421O544
63184C91119O869O355O258P409R218J0579J0995J0646J0030R616R371Q708P408
63171E04581O328O414P217P353O454N607N646N968N487M003K069R6j904m015o227
63156E55077q362j0055j1108j1891j2901j3879j4005j3097j1977j1328j0863r970
63144D15641q642p319o231n408m956m854m743m272l526k806k236j762j379j097
$$ y = [335724, 334147, 332325, 330992, 330732, 331368, 332116, 332363, 332129, 331709, 331122, 330163, 328869, 327598, 326600, 325729, 324649, 323143, 321201, 318980, 316835, 315274, 314706, 315114, 316003, 316744, 317023, 316938, 316658, 316230, 315850, 316045, 317155, 318662, 319582, 319627, 319509, 319916, 320692, 321367, 321976, 322854, 323952, 324951, 325850, 326917, 328126, 329122, 329736, 330187, 330879, 332281, 334771, 338204, 341876, 345310, 348812, 352752, 356667, 359850, 362574, 365854, 370028, 374527, 379154, 384575, 391119, 397988, 404343, 410601, 418010, 427228, 437807, 448802, 459448, 469478, 479094, 488465, 497173, 504581, 510909, 517323, 524540, 531893, 538347, 543954, 549600, 555568, 561055, 565058, 567127, 567223, 565319, 561304, 555077, 546715, 536660, 525552, 513661, 500760, 486881, 472876, 459779, 447802, 436474, 425611, 415641, 406999, 399680, 393449, 388041, 383085, 378231, 373488, 369216, 365690, 362884, 360648, 358886, 357507, 356410]
63130C56410r49j087j471j470l02J781L421L651L042K778L077L146K515J690J464
63115C77696K067L079L948M466M916N648O511O914O571N899N469N434N694O202
63101D50514O788P117P247P785R038J0389J1076J1239J1507J1919J2018J1811
63089E68448J1686J1394J0111P728N277L576K193K24k408n049p245q985j0248
63076E86702j0847j0795j0389r957r716r788j0110j0362j0273r912r534r146q467
63063D57406p321n920m683l836l155k190q31L93Q02L91j09p4M14R83J555K265
63047D36090L005L494L664L673L685L845M280M775M780M145L621L993M858N048
63033D92956M304L673L936M423M052K912K023J799J561O22q07j988k503k489k284
$$ y = [356410, 355461, 354374, 352903, 351433, 351131, 352912, 356333, 359984, 363026, 365804, 368881, 372027, 374542, 376232, 377696, 379763, 382842, 386790, 391256, 396172, 401820, 408331, 415245, 421816, 427715, 433184, 438618, 444312, 450514, 457302, 464419, 471666, 479451, 488489, 498878, 509954, 521193, 532700, 544619, 556637, 568448, 580134, 591528, 601639, 609367, 614644, 618220, 620413, 620637, 618229, 613180, 605935, 596950, 586702, 575855, 565060, 554671, 544714, 534998, 525210, 515100, 504738, 494465, 484553, 475019, 465873, 457406, 450085, 444165, 439482, 435646, 432491, 430301, 429470, 429863, 430665, 431056, 430947, 430873, 431287, 432270, 433825, 436090, 439095, 442589, 446253, 449926, 453611, 457456, 461736, 466511, 471291, 475436, 479057, 483050, 487908, 492956, 497260, 500933, 504869, 509292, 513344, 516256, 518279, 520078, 521639, 522261, 521454, 519466, 516963, 514474, 512190]
63018E12190k088j845j482j184j255j564j454n12P76J606J953K646M276O514Q585
63003E27162J0103J1294J2610J4227J5770J6593J6521J6204J6369J6880J6964
62992F90697J6254J5112J4001J3136J2754J3059J3701J3889J3230J1979J0423
62981H38235Q630O955N895N043L062p00n200r014j1987j4791j7440j9304k0255
62968G69129k0841k1333k1487k1253k0881k0310j9160j7477j5827j4494j3234
62957E62832j1868j0600r608q861q402q273q154p744p451p883q571q169o294m307
62943D46647l639m150m764n105n525n962n808m879l752k938k387j964j924k531
62929C91319l492m110l954l212k381j789j445j304j386j554j438r38n96r88j745
$$ y = [512190, 510102, 508257, 506775, 505591, 504336, 502772, 501318, 500806, 501582, 503188, 505141, 507787, 512063, 518577, 527162, 537265, 548559, 561169, 575396, 591166, 607759, 624280, 640484, 656853, 673733, 690697, 706951, 722063, 736064, 749200, 761954, 775013, 788714, 802603, 815833, 827812, 838235, 846865, 853820, 859715, 864758, 867820, 867120, 861920, 852906, 840919, 826128, 808688, 789384, 769129, 748288, 726955, 705468, 684215, 663334, 643024, 623864, 606387, 590560, 576066, 562832, 550964, 540364, 530756, 521895, 513493, 505220, 497066, 489322, 481871, 473988, 465417, 457248, 450954, 446647, 443008, 438858, 434094, 428989, 423464, 417502, 411694, 406815, 403063, 400125, 397738, 395774, 393850, 391319, 387827, 383717, 379763, 376551, 374170, 372381, 370936, 369632, 368246, 366692, 365254, 364316, 363720, 362732, 360987]
62914C60987j804q18K83N08J00M4P21J661K487L275M006M287L977L592L704M244
62898C91254M775N252O084P391Q650R254R182Q871Q604Q280P782P183O491N561
62884D94614M448L556L098K611J429m66k424l893m858n531o025o414o754o962
62870D66429o991p126p706q508q856q467p718o957o101n175m719n109n882o194
62856C70920n763m942m116l416k869k381j749j070q58j279j525o46J059K173J822
62841C45360N87m41r12j099j105p41n6N92R56J087J053Q08M31J93L16P53J279
62824C49061J651J630J071J87n10o91n64n12n13k19L54O56L36j83j97L69Q79P95
62806C53600K47k56l75j84j2j32m75o48l74J78O22Q60J015J029O64p6r21j683
$$ y = [360987, 359183, 358365, 358648, 359156, 359256, 359300, 360021, 361682, 364169, 367444, 371450, 375737, 379714, 383306, 387010, 391254, 396029, 401281, 407365, 414756, 423406, 432660, 441842, 450713, 459317, 467597, 475379, 482562, 489053, 494614, 499062, 502618, 505716, 508327, 509756, 509290, 506866, 502973, 498115, 492584, 486559, 480145, 473391, 466429, 459438, 452312, 444606, 436098, 427242, 418775, 411057, 404100, 397999, 392824, 388105, 382996, 377114, 370920, 365157, 360215, 356099, 352683, 349814, 347433, 345684, 344614, 343756, 342477, 340952, 340306, 341365, 343538, 345360, 345947, 345506, 344594, 343495, 342390, 341649, 341593, 342185, 343141, 344228, 345281, 346089, 346520, 346713, 347029, 347782, 349061, 350712, 352342, 353413, 353600, 353090, 352399, 351835, 351323, 350810, 350591, 350945, 351601, 351937, 351754, 351557, 351926, 352805, 353600, 353847, 353591, 353216, 353032, 353020, 352888, 352413, 351765, 351391, 351569, 352191, 353051, 354066, 355095, 355759, 355683, 354762, 353079]
62788C53079k321k603k256j523j054r80o67K59J192J464J548K492M305N724N847
62773C64506N211M852M770M059K366O00q7L78J004R04J60n36p34n17j67R2O7l43
62755C86585r48j412j726k256l125l760l512k580j968k376l403m090m021l606
62741C47802l338l127k546j515m11L55O26L68k91r14j012o68m58n31k56Q02J995
62724C36881K343J919J713K165K676K678K492K705L283L740L836L761L846M395
62710C78433N471O674P409P663Q144R315J0727J1653J2180J3107J4823J6762J8097
62697E20458J8721J9296K0429K1936K3083K3530K3814K4686K6147K7458K7925
62686G77483K7290K5504K2653J9134J5355J1121N901j59o061j1001j5083j8704
$$ y = [353079, 350758, 348155, 345899, 344376, 343322, 342342, 341675, 341934, 343126, 344590, 346138, 348630, 352935, 358659, 364506, 369717, 374569, 379339, 383398, 385764, 386364, 386277, 386655, 387659, 388563, 388723, 388187, 387453, 386936, 386769, 386861, 386928, 386585, 385637, 384225, 382499, 380243, 377118, 373358, 369846, 367266, 365298, 362922, 359519, 355429, 351408, 347802, 344464, 341337, 338791, 337276, 336865, 337220, 337846, 338214, 337923, 337009, 335997, 335329, 334871, 334340, 334084, 334886, 336881, 339224, 341143, 342856, 345021, 347697, 350375, 352867, 355572, 358855, 362595, 366431, 370192, 374038, 378433, 383904, 390578, 397987, 405650, 413794, 423109, 433836, 445489, 457669, 470776, 485599, 502361, 520458, 539179, 558475, 578904, 600840, 623923, 647453, 671267, 695953, 722100, 749558, 777483, 804773, 830277, 852930, 872064, 887419, 898540, 904441, 904282, 898221, 887220, 872137, 853433]
62674H53433k1804k4123k5731k6873k7622k7981k8014k7578k6345k4358k2158
62663E70846k0115j8107j6110j4474j3302j2210j1106j0507j0503j0207q923p215
62651D18067n968n102m136l468l817m791n252m952m629m540m108l155k304j836
62637C60009j232k49M84M76J56J12K51K09J7j78n06j031j484j705j926k228k227
62620C48948j728j213j147j254j025n82m49o45o50k51P0l04j366k405k615j855
62604C31529q41m44q54j502j808j665j265q25n79o03o20l03J88L84L10N17J187
62587C22806J735J643J168Q78R62J267J624J731J235L25k56k34l07j084k006k121
62571C29366j579j403j907k257j769q14j10K48N81Q79Q39M21o2l72n39o22n32
$$ y = [853433, 831629, 807506, 781775, 754902, 727280, 699299, 671285, 643707, 617362, 593004, 570846, 550731, 532624, 516514, 502040, 488738, 476528, 465422, 454915, 444412, 434205, 425282, 418067, 412099, 406997, 402861, 399393, 395576, 390785, 385533, 380581, 375952, 371412, 367304, 364149, 361845, 360009, 358777, 358528, 359012, 359488, 359644, 359756, 360007, 360216, 360233, 360055, 359549, 358518, 357034, 355329, 353403, 351175, 348948, 347220, 346007, 344860, 343606, 342581, 341999, 341550, 340905, 340255, 340004, 340074, 339770, 338404, 335999, 333384, 331529, 330688, 330244, 329390, 327888, 326080, 324415, 323150, 322325, 321746, 321143, 320523, 320220, 320408, 320792, 321102, 321619, 322806, 324541, 326184, 327352, 328230, 329192, 330459, 332083, 333814, 335049, 335374, 335118, 334884, 334577, 333493, 331487, 329366, 327787, 326384, 324477, 322220, 320451, 319637, 319527, 319775, 320356, 321235, 322074, 322495, 322433, 322061, 321522, 320900, 320368]
62554C20368k18J39K80J48k7m7Jr3k85k70J16O49J012J149J210J285J374J543
62536C28334J909K424K809K738K148J383J011J334K069K608K669K475K391K535
62522C58837K884L461M249N152O148P315Q550R495J0008J0503J1513J2994J4380
62509D65489J5296J5900J6519J7159J7570J7578J7212J6530J5419J3597J0899
62498F39168P539M098J179r64k476l694m845n856o406o241n534m770m261l857
62484F03080l166j962k85J677L668N404O738P736Q475Q708P939N966L285P95r80
62469F57078k284l732n658p962j0479j3141j5724j7797j9040j9498j9296j8402
62457E04065j6929j5384j4273j3524j2710j1684j0636r538q057o113m206k952
$$ y = [320368, 320150, 320289, 320569, 320717, 320690, 320643, 320644, 320551, 320266, 319996, 320112, 320761, 321773, 322922, 324132, 325417, 326791, 328334, 330243, 332667, 335476, 338214, 340362, 341745, 342756, 344090, 346159, 348767, 351436, 353911, 356302, 358837, 361721, 365182, 369431, 374583, 380731, 388046, 396596, 406091, 416099, 426602, 438115, 451109, 465489, 480785, 496685, 513204, 530363, 547933, 565511, 582723, 599253, 614672, 628269, 639168, 646707, 650805, 651984, 651020, 648544, 644850, 640005, 634149, 627743, 621502, 615968, 611198, 606937, 603080, 599914, 597952, 597667, 599344, 603012, 608416, 615154, 622890, 631365, 640073, 648012, 653978, 657263, 658058, 657078, 654794, 651062, 645404, 637442, 626963, 613822, 598098, 580301, 561261, 541763, 522467, 504065, 487136, 471752, 457479, 443955, 431245, 419561, 408925, 399387, 391330, 385217, 381011, 378059]
62445C78059k468k316j900r98r8j23j406l037l627k831j591q60o04l39n4m2j78
62428C55587J5O16J078Q32j09j168j640j201j54Q03J174J020P21N25M88N85P22
62411C59894O81K87l57r62j325j423j253p65KQ23J403J683J892K214K482K425
62395C67701K204K320K853L206K937K455K456K938L445L968M844N837O239O092
62381D19495O420P806R445J0197J0076J0058J0744J1844J2785J3297J3423J3446
62369E49036J3750J4516J5566J6668J7768J8826J9763K0851K2791K5938K9729
62358G65202L3273L6378L9522M3033M6771N0477N3859N6258N6787N4982N1071
62347A287613M5510L8531L0240K0957J1324K167n741j2087j7229k1957k6880l2001
$$ y = [378059, 375591, 373275, 371375, 370377, 370279, 370156, 368750, 365713, 362086, 359255, 357664, 356804, 356200, 355861, 355807, 355765, 355587, 355602, 356218, 357296, 358128, 358019, 356851, 355211, 354010, 353856, 354659, 355833, 356853, 357574, 358099, 358587, 359172, 359894, 360575, 360862, 360505, 359543, 358218, 356795, 355542, 354777, 354779, 355602, 357005, 358688, 360580, 362794, 365276, 367701, 369905, 372225, 375078, 378284, 381221, 383676, 386132, 389070, 392515, 396483, 401327, 407164, 413403, 419495, 425915, 433721, 443166, 453363, 463439, 473497, 484241, 496085, 508870, 522167, 535590, 549036, 562786, 577302, 592868, 609536, 627304, 646130, 665893, 686744, 709535, 735473, 765202, 798475, 834853, 874375, 917408, 964179, 1014656, 1068515, 1124773, 1181560, 1236542, 1287613, 1333123, 1371654, 1401894, 1422851, 1434175, 1436342, 1430601, 1418514, 1401285, 1379328, 1352448, 1320447]
62335A320447l6720m0233m2086m2495m2010m0866l8859l6027l3104l0909k9477
62324I07661k8101k6231k4078k2329k1452k1295k1243k0787j9967j9168j8469
62313F64541j7505j6082j4608j3651j3233j2861j2127j1034r829q732p801o884
62301E20194n799m631l653k954k342j701j158p45k43M70J238J941K593K957K681
62286E08848K096K228L490M905N324M931M741M957M863M252L836M033M283M009
62272E66796L552L601M237N077O027P432R526J2109J4709J6946J8821K0748K3170
62259G12751K6163K9582L3452L7911M2672M7023N0521N3259N5267N6042N5004
62248A199647N2094M7457M0785L1725K0977J0369J353o246j3572k1012k7784l3195
$$ y = [1320447, 1283727, 1243494, 1201408, 1158913, 1116903, 1076037, 1037178, 1001151, 968047, 937138, 907661, 879560, 853329, 829251, 806922, 785470, 764175, 742932, 722145, 702178, 683010, 664541, 647036, 630954, 616346, 602695, 589462, 576601, 564474, 553440, 543611, 534879, 527078, 520194, 514395, 509764, 506111, 503157, 500815, 499114, 497956, 497211, 496968, 497438, 498676, 500617, 503210, 506167, 508848, 510944, 513172, 516662, 521567, 526891, 531822, 536563, 541520, 546383, 550635, 554471, 558504, 562787, 566796, 570348, 573949, 578186, 583263, 589290, 596722, 606248, 618357, 633066, 650012, 668833, 689581, 712751, 738914, 768496, 801948, 839859, 882531, 929554, 980075, 1033334, 1088601, 1144643, 1199647, 1251741, 1299198, 1339983, 1371708, 1392685, 1403054, 1404407, 1398161, 1384589, 1363577, 1335793, 1302598]
62236A302598l7654m1927m5887m8661m9818m9742m8819m6955m4140m0802l7344
62225H10849l3814l0323k7307k4927k2692k0187j7761j6009j4916j4009j3009
62214E75895j1838j0338q649p492p366p643p199n907m743m391m515m426l871k988
62200D84529k029j307r38m93N50K006L161L800M430N387O381P209Q190R541J0865
62185E41282J1681J2034J2186J2127J1939J2192J3357J4939J5712J4907J2888
62174F85244J0624Q836P729P357P929R575J1908J4286J6693J9972K4642K9783
62162H54578L3778L6059L7391L8324L8228L6265L2580K7878K2282J5377P309p69
62150A179280p557j2663j6764k0824k5144k9158l2178l4216l5808l7180l7940
$$ y = [1302598, 1264944, 1223017, 1177130, 1128469, 1078651, 1028909, 980090, 933135, 888995, 848193, 810849, 777035, 746712, 719405, 694478, 671786, 651599, 633838, 617829, 602913, 588904, 575895, 564057, 553719, 545070, 537578, 530212, 522569, 515370, 509463, 504720, 500329, 495814, 491388, 487517, 484529, 482500, 481193, 480255, 479762, 480312, 482318, 485479, 489279, 493709, 499096, 505477, 512686, 520876, 530417, 541282, 552963, 564997, 577183, 589310, 601249, 613441, 626798, 641737, 657449, 672356, 685244, 695868, 704704, 712433, 719790, 727719, 737294, 749202, 763488, 780181, 800153, 824795, 854578, 888356, 924415, 961806, 1000130, 1038358, 1074623, 1107203, 1135081, 1157363, 1172740, 1180049, 1179280, 1171723, 1159060, 1142296, 1121472, 1096328, 1067170, 1034992, 1000776, 964968, 927788, 889848]
62139H89848l7639l6199l3712l0284k6303k2448j9221j6670j4694j3195j1833
62128F27650j0091p877n640l686j806J94K106L822N711Q058J0503J2533J4121
62115F55598J5497J6661J7699J9169K1427K3660K4304K2408J8188J2463O215O45
62103H53934l227n313o337o768o480n752o010q761j3733j8636k1029k0349j7912
62090G13627j5137j2210q646m680j349R16L023O022R680J2878J5181J7246J9671
62077G56222K2228K4469K6506K8673L0772L2165L2542L2240L1820L1623L1647
62066A080907L1606L1060K9818K8330K7442K7534K7958K7563K5678K2435J8266
62055A378597J3487Q449L660n56m338p884j1068j3818j6665k0292k4531k8396
$$ y = [889848, 852209, 816010, 782298, 752014, 725711, 703263, 684042, 667372, 652678, 639483, 627650, 617559, 609682, 604042, 600356, 598550, 598744, 600850, 604672, 610383, 618441, 628944, 641477, 655598, 671095, 687756, 705455, 724624, 746051, 769711, 794015, 816423, 834611, 847074, 853289, 853934, 850707, 845394, 839057, 832289, 825809, 820057, 814047, 805286, 791553, 772917, 751888, 731539, 713627, 698490, 686280, 677634, 672954, 671605, 672521, 675544, 681566, 691246, 704124, 719305, 736551, 756222, 778450, 802919, 829425, 858098, 888870, 921035, 953577, 985817, 1017637, 1049260, 1080907, 1112513, 1143573, 1173391, 1201721, 1229163, 1256697, 1284655, 1312218, 1337896, 1360331, 1378597, 1392084, 1400533, 1404193, 1403637, 1399299, 1391415, 1380347, 1366529, 1349864, 1329572, 1305041, 1276645]
62043A276645l1240l3334l5163l6671l7581l7922l7758l6904l5393l3827l2687
62032H88165l1559k9744k7335k4977k2676j9810j6360j3240j1052r329p557o195
62020F68331n950o551p088p349p862q725r284r203r023r208r319q681p394o057
62006E56637m772l192j365J75J273K429M007N720P173Q356R246R407Q540P062
61992F10696N596M095K092l15k300l253l439l594m214n326o615p648q210q500
61978E69065q771q827q225p037n938n355m837l682j956n99m54j369k325k432j783
61963E05475j150q91m59P33K306L317L505L523L925M507M907N253N860O723P723
61948E55257Q967J0507J1940J2875J3651J5136J7697K0720K3382K5623K8115L1259
$$ y = [1276645, 1245405, 1212071, 1176908, 1140237, 1102656, 1064734, 1026976, 990072, 954679, 920852, 888165, 856606, 826862, 799527, 774550, 751874, 732064, 715704, 702464, 691412, 682083, 674526, 668331, 662381, 655830, 648742, 641393, 633531, 624806, 615522, 606319, 597296, 588088, 578769, 570088, 562694, 556637, 551865, 548673, 547308, 547483, 548756, 551185, 555192, 560912, 568085, 576441, 585687, 595094, 603634, 610696, 616292, 620387, 622479, 622164, 619864, 616611, 613172, 609578, 605364, 600038, 593423, 585775, 577565, 569065, 560294, 551467, 543242, 536205, 530267, 524912, 520075, 516393, 514437, 513838, 513384, 512015, 509690, 507258, 505475, 504325, 503434, 502975, 503708, 506014, 509331, 512836, 516359, 520284, 524791, 529698, 534951, 540811, 547534, 555257, 564224, 574731, 586671, 599546, 613197, 628333, 646030, 666750, 690132, 715755, 743870, 775129]
61936G75129L4474L6732L7747L8262L8975L9529L8965L6973L4255L1624K9192
61925A171857K6530K3264J9375J5117J0689N920M19n629j1115j4966j7237j8619
61913A205605j9105j7988j5094j1092o451j092M624R705J3804J7647K1471K4051
61901A226085K4201K2371J9603J5735R997K894m041j0223j6325k2435k7362l0217
61889A210283l1669l2922l4276l5193l5176l4028l1852k9249k7066k5546k4123
61878H69183k2387k0743j9708j9136j8545j7787j6850j5440j3335j0918q752o876
61866F78706m951k933j038P81K786M933O997R128J1786J5013J8314K1411K4639
61853G85572K8377L2564L7054M1982M7352N2488N6487N9122O0887O2166O2701
$$ y = [775129, 809603, 846335, 884082, 922344, 961319, 1000848, 1039813, 1076786, 1111041, 1142665, 1171857, 1198387, 1221651, 1241026, 1256143, 1266832, 1272752, 1273171, 1267542, 1256427, 1241461, 1224224, 1205605, 1186500, 1168512, 1153418, 1142326, 1135875, 1134783, 1139407, 1149112, 1162916, 1180563, 1202034, 1226085, 1250286, 1272657, 1292260, 1307995, 1317992, 1320886, 1316845, 1306622, 1290297, 1267862, 1240500, 1210283, 1178614, 1145692, 1111416, 1076223, 1041047, 1007019, 975167, 945918, 918852, 893306, 869183, 846796, 826053, 806345, 787209, 768664, 750877, 734027, 718587, 705252, 694334, 685582, 678706, 673755, 670822, 669784, 670565, 673351, 678284, 685281, 694409, 706195, 721208, 739522, 760933, 785572, 813949, 846513, 883567, 925549, 972901, 1025389, 1081876, 1140998, 1201885, 1264051, 1326752]
61842A326752O1922N9413N4945M8485M0383L1334K1874J2177K521o323j3572j9065
61830A620846k3029k5261k5128k2447j7918j2498o644m52N771J1376J5699J8276
61818A538591J8794J7005J2767O171k265j1603k0948k9989l8832m7201n4105n8506
61806A329879o0149n9604n7655n4879n1532m7573m2955l8154l4182l1672l0081
61795H21443k8203k5508k2554k0044j7975j5957j3976j2315j0999r765q714q410
61783F27023r022r788r723q795p885p628p753p640p043o051m868l911l690m147
61769E29079m437l899k925k327k157j824j168o32m16k37nj1k75l77j40J69M34
61752E08852Q48J265J192P38P80J741K845L152K717K196J804J365R38P95R84J371
$$ y = [1326752, 1388674, 1448087, 1503032, 1551517, 1591900, 1623234, 1645108, 1657285, 1659806, 1653483, 1639911, 1620846, 1597817, 1572556, 1547428, 1524981, 1507063, 1494565, 1487921, 1487469, 1493240, 1504616, 1520315, 1538591, 1557385, 1574390, 1587157, 1593328, 1591063, 1579460, 1558512, 1528523, 1489691, 1442490, 1388385, 1329879, 1269730, 1210126, 1152471, 1097592, 1046060, 998487, 955532, 917378, 883196, 851524, 821443, 793240, 767732, 745178, 725134, 707159, 691202, 677226, 664911, 653912, 644147, 635433, 627023, 618001, 608213, 598490, 589695, 581810, 574182, 566429, 558789, 551746, 545695, 540827, 536916, 533226, 529079, 524642, 520743, 517818, 515491, 513334, 511510, 510342, 509710, 509294, 509057, 509052, 509041, 508766, 508389, 508249, 508418, 508852, 509700, 510965, 512157, 512895, 513675, 515416, 518261, 521413, 524130, 526326, 528130, 529495, 530433, 531228, 532212, 533583]
61736E33583J881K300K278J882J724K087K424K180J668J577K019K606L056L152
61722E64417K642J794J586K598M073M859M867M823M950M871M616M756N491O431
61708F22774P198P612P344O219M807L880L301K236N39q90j283q22j27M02N89M68
61692F64247M22Q17J346J254K56j235k719l883m417m244l882l871l892l255k186
61677F34758j636j775j755j198q32j168j567j285o26l33m35m56k55l8J48K67K3
61660F21837o25r34n3J853L586M125L540K749K602L206M062M789N493O235O557
61645F69022O082N406N522O350O742O244N867O459P163O409M094J726M21l84j946
61630G35177m449o794p943q038p949q007p710o677n303m120l118k161j585j579
$$ y = [533583, 535464, 537764, 540042, 541924, 543648, 545735, 548159, 550339, 552007, 553584, 555603, 558209, 561265, 564417, 567059, 568853, 570439, 573037, 577110, 581969, 586836, 591659, 596609, 601480, 606096, 610852, 616343, 622774, 629972, 637584, 644928, 651147, 655954, 659834, 663135, 665371, 665910, 665020, 663737, 662915, 662788, 663190, 663779, 664247, 664669, 665486, 666832, 668086, 668342, 667107, 664388, 660505, 656088, 651844, 647962, 644091, 640199, 636944, 634758, 633122, 631347, 629592, 628394, 627562, 626394, 624827, 623542, 622916, 622583, 622148, 621692, 621437, 621399, 621547, 621814, 621837, 621212, 620278, 620225, 622078, 625664, 629789, 633329, 636078, 638680, 641886, 645948, 650737, 656230, 662465, 669022, 675104, 680510, 686032, 692382, 699124, 705368, 711235, 717694, 724857, 731266, 735360, 737086, 737507, 737123, 735177, 730728, 723934, 715991, 707953, 700004, 691997, 684287, 677610, 672307, 668187, 665069, 662908, 661323, 659744]
61616F59744j436l42J256K096J864J440J357J083J52j100k309l615m931n598n390
61601F44271n041n132n241m770l914l174k637k290k349k625k403j704j757l291
61587E97943n111n562m759m139m279m465m280m201m486m652m400m205m520n069
61573E33815n277m942m253l516l003k749k511k130j776j569j215n66r9k69o32
61558D99308l99L15O33L16J16O24J507K167K454K391J818P56k37n32q3O06R88
61541E12748Q11K37k31j74K42L82j38j001j570j554j203r13p90o24m06o12j708
61524E03496l351m627n206n661o403o905o570n743n202m981m583m056l954m273
61510D31981m349l923l498l404l262k688j973j642j798k179k503k520k106j537
$$ y = [659744, 658308, 657966, 659222, 661318, 663182, 664622, 665979, 667062, 667214, 666114, 663805, 660190, 655259, 649661, 644271, 639230, 634098, 628857, 624087, 620173, 616999, 614362, 612072, 609723, 607098, 604695, 602991, 601234, 597943, 592832, 587270, 582511, 578372, 574093, 569628, 565348, 561147, 556661, 552009, 547609, 543404, 538884, 533815, 528538, 523596, 519343, 515827, 512824, 510075, 507564, 505434, 503658, 502089, 500874, 500308, 500209, 499940, 499308, 498909, 499224, 499857, 500173, 500289, 500913, 502420, 504587, 507041, 509432, 511250, 512006, 511769, 511237, 511154, 511760, 512748, 513559, 513796, 513565, 513391, 513633, 514015, 513877, 512876, 511306, 509752, 508549, 507636, 506846, 506222, 505816, 505204, 503496, 500145, 495518, 490312, 484651, 478248, 471343, 464773, 459030, 453828, 448847, 444264, 440208, 436254, 431981, 427632, 423709, 420211, 416807, 413545, 410857, 408884, 407242, 405444, 403265, 400762, 398242, 396136, 394599]
61496C94599j314j508j585j103k49N41J103J436J342O09n43j446j540q79j25P0
61480C89408k51m15pN57O26K38n6j34m16j018j424j242q38q06j148j333j008l44
61462C80389K41N38P16J078J551J585Q30k33p06l81L4pj06M30J466K115J892J318
61444C92750J220J734K281K400K219K055J901J607J370J594K330L214M037M887
61430D25599N653N882N376M494L587K635J706J218J277J396J342J694K778L706
61416D68343L504K735K772L655M004L170K105J624J095l13k048k896k743k591
61402D82416l068l791m169m164m051l934l673l151k456j830j431j147p96m73m23
61387D43859n87o23m49m40q99j627k165k174j516l33P99J237R98O82N83L37k49
$$ y = [394599, 393285, 391777, 390192, 389089, 388840, 389381, 390484, 391920, 393262, 393871, 393328, 391882, 390342, 389463, 389338, 389408, 389157, 388742, 388735, 389292, 389918, 390156, 390100, 389966, 389550, 388532, 387108, 385866, 385028, 384222, 383074, 381741, 380733, 380389, 380630, 381168, 381884, 382962, 384513, 386098, 386928, 386695, 385989, 385608, 385642, 385635, 385529, 385959, 387425, 389540, 391432, 392750, 393970, 395704, 397985, 400385, 402604, 404659, 406560, 408167, 409537, 411131, 413461, 416675, 420712, 425599, 431252, 437134, 442510, 447004, 450591, 453226, 454932, 456150, 457427, 458823, 460165, 461859, 464637, 468343, 471847, 474582, 477354, 481009, 485013, 488183, 490288, 491912, 493007, 492694, 490646, 487750, 485007, 482416, 479348, 475557, 471388, 467224, 463173, 459239, 455566, 452415, 449959, 448129, 446698, 445551, 444755, 444282, 443859, 443272, 442649, 442200, 441760, 440861, 439234, 437069, 434895, 433379, 433046, 433845, 435082, 436080, 436762, 437345, 437682, 437433]
61370D37433n62Q0J424K524K805K504K150K066K257K503K530K331K201K346K662
61355D67254L092L866N064O245O869P001P186P760Q576R359J0006J0617J1465
61342E64360J2747J4194J5098J5050J4394J3595J2418J0323P561N198L904L214
61330F92056K206N33j442l212m517n382o053o809p673q341q442p839o706n430
61316F22949m460m014l825l456k860k475k638l121l440l362k902j983n40J074
61302E84947K173K455K457L061M559O306P340P207O173M699K877N70k037m292
61288F28495n644o177o297o057n206l912k929k661k473j371O83K619L478L380
61274E95928L154L344L855M404M985N819O968Q134Q931R352R781J0409J0845J0622
$$ y = [437433, 436871, 436951, 438375, 440899, 443704, 446208, 448358, 450424, 452681, 455184, 457714, 460045, 462246, 464592, 467254, 470346, 474212, 479276, 485521, 492390, 499391, 506577, 514337, 522913, 532272, 542278, 552895, 564360, 577107, 591301, 606399, 621449, 635843, 649438, 661856, 672179, 679740, 684938, 688842, 692056, 694262, 694795, 693353, 690141, 685624, 680242, 674189, 667380, 659707, 651366, 642924, 635085, 628379, 622949, 618489, 614475, 610650, 607194, 604334, 601859, 599221, 596100, 592660, 589298, 586396, 584413, 583873, 584947, 587120, 589575, 592032, 595093, 599652, 605958, 613298, 620505, 626678, 631377, 634254, 634824, 632787, 628495, 622851, 616674, 610377, 604320, 599114, 595202, 592273, 589612, 587139, 585768, 586451, 589070, 592548, 595928, 599082, 602426, 606281, 610685, 615670, 621489, 628457, 636591, 645522, 654874, 664655, 675064, 685909, 696531]
61260F96531R915R366R305R608J0317J1807J4071J6369J7979J8869J9266J8908
61248H62311J7253J4248J0432O378K442j078l994o449q744j0905j2728j4097j4967
61235H40102j5095j4244j2690j1174j0156r410q463p183n869m893m380m090l613
61222G28842k736j594m36N97J311J322M73p41j488j417q46k07L64Q43J111J142
61206G26540J163J428J895K284K406K391K543L010L676M395N313O698Q464J0204
61192G82410J1802J3734J6444J9631K2464K4448K5788K6926K7888K8110K6949
61181A026594K4433K1452J8993J7183J5478J3726J2428J1805J1235J0083Q562
61170A191972P197N886M090J671j073l978p015r975j2622j5047j7328j9121k0173
$$ y = [696531, 706446, 715812, 725117, 734725, 745042, 756849, 770920, 787289, 805268, 824137, 843403, 862311, 879564, 893812, 904244, 910622, 913064, 911986, 907992, 901543, 892799, 881894, 869166, 855069, 840102, 825007, 810763, 798073, 786899, 776743, 767333, 758870, 751687, 745818, 740925, 736545, 732455, 728842, 726106, 724512, 724076, 724673, 725984, 727306, 727779, 727038, 725550, 724133, 723287, 723080, 723444, 724287, 725398, 726540, 727703, 729131, 731026, 733310, 735716, 738107, 740650, 743660, 747336, 751731, 757044, 763742, 772206, 782410, 794212, 807946, 824390, 844021, 866485, 890933, 916721, 943647, 971535, 999645, 1026594, 1051027, 1072479, 1091472, 1108655, 1124133, 1137859, 1150287, 1162092, 1173327, 1183410, 1191972, 1199169, 1205055, 1209145, 1210816, 1209743, 1205765, 1198750, 1188775, 1176153, 1161106, 1143778, 1124657, 1104484]
61157A104484k0949k2070k3336k3969k3726k2949k1666j9561j6884j4497j2757
61146H82120j1066q924o719n040l779k371o88O85R11m69l083n769p334p443o616
61131H14415n449m110k569q82Q11K309L456M512O174Q808J1814J4305J6272J8418
61117H88284K0913K3113K4638K6011K7914L0313L2597L4176L4776L4515L3908
61106A211158L3504L3400L3333L3118L2595L1336K8942K5712K2405J9336J6179
61095A521018J2683Q931M916L34m955j0681j6373k1454k5328k7842k9610l1230
61083A380409l2434l2619l1958l1184l0466k9446k8231k7288k6336k4465k1615
61072A064367j8823j6761j4964j2900j0780q757o412l655j358l63l92n44l62P8
$$ y = [1104484, 1083535, 1061465, 1038129, 1014160, 990434, 967485, 945819, 926258, 909374, 894877, 882120, 871054, 862130, 855411, 850371, 846592, 844221, 843533, 844218, 845129, 844660, 841577, 835808, 828474, 821031, 814415, 808966, 804856, 802287, 801405, 802216, 804525, 807981, 812493, 818667, 827475, 839289, 853594, 869866, 888284, 909197, 932310, 956948, 982959, 1010873, 1041186, 1073783, 1107959, 1142735, 1177250, 1211158, 1244662, 1278062, 1311395, 1344513, 1377108, 1408444, 1437386, 1463098, 1485503, 1504839, 1521018, 1533701, 1542632, 1547548, 1547882, 1542927, 1532246, 1515873, 1494419, 1469091, 1441249, 1411639, 1380409, 1347975, 1315356, 1283398, 1252214, 1221748, 1192302, 1164071, 1136783, 1110447, 1085982, 1064367, 1045544, 1028783, 1013819, 1000919, 990139, 981382, 974970, 971315, 969957, 969594, 969202, 968658, 968296, 968374]
61058I68374P04J520K504L726N294O998Q405R419J0345J1497J3085J5313J7943
61045A075127K0123K1493K3048K5898K9495L2370L4363L6553L9125M1081M2251
61034A420927M3853M6486M9279N1525N3676N6081N8378O0730O4004O7993P1194
61023B044126P3236P5766P9965Q4820Q8943R2288R5082R7060R9184J04079J13169
61012C047718J25167J38956J55777J76577J99406K21987K45248K72117L04856
61003D887809L46269M01362M74521N66736O78703Q14437R78188J170565J392523
60994A1711113J649840J946756K278029K634208L003602L340269L520142L365036
60986C3448995K767336J818440P97798P464l97844m38834k21519J29315M50302
$$ y = [968374, 969078, 970598, 973102, 976828, 982122, 989120, 997525, 1006944, 1017289, 1028786, 1041871, 1057184, 1075127, 1095250, 1116743, 1139791, 1165689, 1195184, 1227554, 1261917, 1298470, 1337595, 1378676, 1420927, 1464780, 1511266, 1560545, 1612070, 1665746, 1721827, 1780205, 1840935, 1904939, 1972932, 2044126, 2117362, 2193128, 2273093, 2357913, 2446856, 2539144, 2634226, 2731286, 2830470, 2934549, 3047718, 3172885, 3311841, 3467618, 3644195, 3843601, 4065588, 4310836, 4582953, 4887809, 5234078, 5635440, 6109961, 6676697, 7355400, 8169837, 9148025, 10318590, 11711113, 13360953, 15307709, 17585738, 20219946, 23223548, 26563817, 30083959, 33448995, 36216331, 38034771, 38832569, 38840033, 38442189, 38003355, 37781836, 37911151, 38361453]
60977C8361453N24319J69689o17653j623419k539374l144112l387255l342788
60969B4400860l117888k800523k451854k110663j796415j516119j272552j066124
60961H268722q93126p47882o27055n29250m51598l89560l39511k99033k65345
60952C726362k35934k10315j89008j71004j54115j37483j21926j08073r5996q6498
60942B216010q0877p9082p9462q0379q0911q0188p7556p3524o9366o5540o1596
60931A387529n7485n3808n0681m7541m4299m1586l9557l7440l4640l1508k8670
60920I20314k6252k4157k2465k1197k0071j8793j7341j5807j4181j2409j0504
60909G17137q642p231o549o191n322l771k420k049k332k418k061j535r81n60p87
$$ y = [38361453, 38885772, 39055461, 38437808, 36814389, 34275015, 31130903, 27743648, 24400860, 21282972, 18482449, 16030595, 13919932, 12123517, 10607398, 9334846, 8268722, 7375596, 6627714, 6000659, 5471409, 5019811, 4630251, 4290740, 3991707, 3726362, 3490428, 3280113, 3091105, 2920101, 2765986, 2628503, 2506577, 2398504, 2302508, 2216010, 2135133, 2056051, 1976589, 1896210, 1815299, 1735111, 1657555, 1584031, 1514665, 1449125, 1387529, 1330044, 1276236, 1225555, 1178014, 1133715, 1092129, 1052572, 1015132, 980492, 948984, 920314, 894062, 869905, 847440, 826243, 806172, 787379, 770038, 754231, 740050, 727641, 717137, 708495, 701264, 694715, 688524, 683202, 679431, 677011, 674962, 672630, 670212, 668151, 666616, 665635, 665075, 664288]
60894F64288j848k906l020k513k503l241l932m105m140m226l903k956j976j611
60880F21408j853k399l029l293k618j231m05j049k468l207k936k698l332m455
60866E86435n229n507n704n924n836n303m568l750k707j575r00q61q04j22Q13
60851E38458J105N30l48r74j125n89O77K082K860L025L105K999K014K29j182j397
60835E51469q96m63p9O63J651K498L088L394L181K465J792J619J812K082K395
60820E76671K570K191J333P18O44N04n4l89k1K54n90k320l935n103o120o904p162
60803E52287p171p441p800p846p910q561r354r242q148p075o640o513o295n901
60789D46390n059l490j790j137j794k740l004k599j964j310q32p42q08n71j65
$$ y = [664288, 662440, 659534, 656514, 654001, 651498, 648257, 644325, 640220, 636080, 631854, 627951, 624995, 623019, 621408, 619555, 617156, 614127, 610834, 608216, 606985, 606580, 605531, 603063, 599856, 596920, 594222, 590890, 586435, 581206, 575699, 569995, 564071, 558235, 552932, 548364, 544614, 541907, 540332, 539432, 538571, 537767, 537645, 538458, 539563, 540093, 539745, 538771, 537646, 537057, 537734, 539816, 542676, 545701, 548806, 551805, 553819, 554048, 552866, 551469, 550573, 550110, 550031, 550694, 552345, 554843, 557931, 561325, 564506, 566971, 568763, 570382, 572194, 574276, 576671, 579241, 581432, 582765, 583483, 584127, 584631, 584577, 584188, 584167, 584421, 583831, 581511, 577576, 572473, 566353, 559449, 552287, 545116, 537675, 529875, 522029, 514119, 505558, 496204, 486962, 478814, 471739, 465099, 458586, 452291, 446390, 441331, 437841, 436051, 434914, 433120, 430380, 427376, 424777, 422813, 421503, 420671, 419929, 419121, 418550, 418385]
60774D18385j82m89j47J099K229K367K043K327L306M215M668N051N840P077Q430
60759D66219R466R930R968R902R752R297Q677Q429Q670Q768Q183P208O450N915
60745E86834N096L802K429J455R45N59j58j441l078m549n509o071o561p110p542
60730E59101p605p303p020p193p775q228q214q055q177q385q124p304o352n545
60716D53821m852m354m197m106l558k594j781j312p89j27J51r8j6J220L227M876
60700D35511N557N499N206N177N899P387Q819R238Q651P906P484P061O347N707
60686E31449N508N313M233J992p63l125m611n179n043m598m263m118l800l072
60672E09923k267j935k037j906j103P7J121J962K808L654M321M836N415O177P189
$$ y = [418385, 418203, 417714, 417567, 418666, 420895, 423262, 425305, 427632, 430938, 435153, 439821, 444872, 450712, 457789, 466219, 475685, 485615, 495583, 505485, 515237, 524534, 533211, 541640, 550310, 559078, 567261, 574469, 580919, 586834, 591930, 595732, 598161, 599616, 600561, 601120, 600962, 599521, 596443, 591894, 586385, 580314, 573753, 566643, 559101, 551496, 544193, 537173, 529980, 522205, 513977, 505763, 497708, 489531, 481146, 473022, 465718, 459366, 453821, 448969, 444615, 440418, 436312, 432754, 430160, 428379, 427067, 426278, 426151, 426302, 426204, 426188, 427408, 430635, 435511, 441068, 446567, 451773, 456950, 462849, 470236, 479055, 488293, 496944, 504850, 512334, 519395, 525742, 531449, 536957, 542270, 546503, 548495, 547732, 544607, 539996, 534817, 529774, 525176, 520913, 516795, 512995, 509923, 507656, 505721, 503684, 501778, 500675, 500752, 501873, 503835, 506643, 510297, 514618, 519454, 524869, 531046, 538235]
60657E38235Q618J0469J2303J3635J4606J5829J7553J9460K1416K3897K7373L1468
60645G54862L5112L7447L8439L8578L8049L6373L2961K7940K2104J5935R141J478
60633A088419o362j3236j8641k2775k5700k7232k7627k7571k7251k6141k4007
60622H41876k1564j9591j7932j5889j3330j0847r029p999p580p474p332p022o796
60609F89491o991p559q136q482q594q508q284q172q450r015r452r591r714j0046
60595E68497j0300j0033r309q596q042p272o139n218n085n294m755l154j427m88
60581D83385j20L62Q63P95L73O89K197L890M558M337M370N208O248O809P157Q161
60565E39282J0183J2760J5189J7195J8875K0288K1226K1319K0266J7961J4609
$$ y = [538235, 546853, 557322, 569625, 583260, 597866, 613695, 631248, 650708, 672124, 696021, 723394, 754862, 789974, 827421, 865860, 904438, 942487, 978860, 1011821, 1039761, 1061865, 1077800, 1086941, 1088419, 1082057, 1068821, 1050180, 1027405, 1001705, 974473, 946846, 919275, 892024, 865883, 841876, 820312, 800721, 782789, 766900, 753570, 742723, 733694, 725695, 718115, 710641, 703309, 696287, 689491, 682500, 674941, 666805, 658323, 649729, 641221, 632937, 624765, 616315, 607300, 597848, 588257, 578543, 568497, 558197, 548164, 538855, 530259, 522217, 514945, 508806, 503588, 498503, 493209, 488454, 485300, 483873, 483385, 483265, 483627, 484490, 485285, 485658, 486347, 488544, 492434, 496992, 501329, 505699, 510907, 517155, 523964, 531121, 539282, 549465, 562225, 577414, 594609, 613484, 633772, 654998, 676317, 696583, 714544, 729153]
60554G29153J0696O657K576j644n703q781j0155r830q292n771k146K337O646R731
60540G15474J1626J3406J5819J8262J9382J8481J5878J1996O831O88n207r521
60528H33115j2037j3449j4096j3560j1556q540n260k199L53K241L649M914N937
60515G69512O294O061N954O419P192Q080R488J1627J3802J5101J5460J5524J5833
60502I06347J6684J8415K1172K4633K8479L3051L9036M6665N5405O4089P1081
60491A325057P4915P5227P2617O7144N7602M3053K4447L933j6890l7044n5076
60480A634985o9282p8995q4652q6566q4718p9800p3335o6445n9335n2221m5785
60469H53851m0289l5216l0284k6152k3477k1823k0157j8106j6159j4782j3803
$$ y = [729153, 739849, 746506, 749082, 747438, 741735, 732954, 722799, 712969, 704677, 698906, 696760, 699097, 705743, 715474, 727100, 740506, 756325, 774587, 793969, 812450, 828328, 840324, 847155, 847843, 842636, 833115, 821078, 807629, 793533, 779973, 768417, 759877, 754617, 752418, 752771, 755012, 758661, 763575, 769512, 775806, 781867, 787821, 794240, 801432, 809512, 819000, 830627, 844429, 859530, 874990, 890514, 906347, 923031, 941446, 962618, 987251, 1015730, 1048781, 1087817, 1134482, 1189887, 1253976, 1325057, 1399972, 1475199, 1547816, 1614960, 1672562, 1715615, 1740062, 1743995, 1727105, 1690061, 1634985, 1565703, 1486708, 1402056, 1315490, 1230772, 1150972, 1077637, 1011192, 951857, 899636, 853851, 813562, 778346, 748062, 721910, 698433, 676610, 656453, 638347, 622188, 607406, 593603]
60458E93603j2742j1481j0367r632q830p320n355m082m055m406m112l431l224
60445E04566l403l235k838l014l628l563k505j498j301j339r06l08j65m07o48
60430D75808q46r37n19M47J187J032K58m90j023j397j488j427j774k589k893j889
60414D61460k02R03J181J349J675J622R18R4l01m14o88j182j533j398p56Q8P29
60397D63545R16O47M5o65j096r13k22M83Q53J008J263J714K197K457K355K080
60381D76667K038K296K281J498L41k79p8M31Q13J109J323J244R61R38J334J747
60365D94664J843J758J725J791J971K201K166J737J449J858K478K298J302N08
60351E19749L88M17L24N62J147J294P38L17N92J049J308J907L044L744L356K725
$$ y = [593603, 580861, 569380, 559013, 549381, 540551, 533231, 527876, 523794, 519739, 515333, 511221, 507790, 504566, 501163, 497928, 495090, 492076, 488448, 484885, 482380, 480882, 479581, 478242, 477336, 477028, 476863, 476456, 475808, 474962, 474025, 473506, 473953, 475140, 476172, 476430, 475940, 474917, 473520, 472032, 470605, 468831, 466242, 463349, 461460, 461258, 462161, 463342, 464691, 466366, 467988, 468906, 469000, 468699, 468285, 467597, 466415, 464882, 463484, 462728, 462816, 463545, 464461, 465108, 465153, 464488, 463392, 462479, 462257, 462740, 463593, 464601, 465864, 467578, 469775, 472232, 474587, 476667, 478705, 481001, 483282, 484780, 485121, 484842, 484764, 485195, 486008, 487117, 488440, 489684, 490645, 491583, 492917, 494664, 496507, 498265, 499990, 501781, 503752, 505953, 508119, 509856, 511305, 513163, 515641, 517939, 519241, 519749, 520137, 520554, 520878, 521440, 522587, 523881, 524619, 524936, 525528, 526577, 527885, 529792, 532836, 536580, 539936, 542661]
60335E42661K788K966K250J001K84J52k6j53K20N96R1r15j169m36L38O78J018
60318E52344J506J685J592J943K952L990M667N311O088O665P062P934R641J1780
60304F25160J3987J6444J9294K2335K5644K9668L4053L6982L6409L1950K5047
60293I16973J7315Q998o61j1665k2181k9699l3224l3693l2310k9407k5311k1171
60281G03964j7902j5133j2254r856q900q965q720p837p080o641n868m675l825
60268E86308l567l365l101l241l467k687r85p4r59k357k477j323j77L64N87N17
60252E59996j80j262j904j664q29Q4O72O68J45l94n45m35l73m03m74o89q92m98
60234E51023P09J931K179J638J512K535M139N200N204M530L821L367K964K320
$$ y = [542661, 545449, 548415, 550665, 551666, 551950, 552102, 552076, 551923, 552143, 552739, 552830, 551915, 550746, 550310, 550648, 551326, 552344, 553850, 555535, 557127, 559070, 562022, 566012, 570679, 575990, 582078, 588743, 595805, 603739, 613380, 625160, 639147, 655591, 674885, 697220, 722864, 752532, 786585, 823567, 859976, 891926, 916973, 934288, 943286, 942625, 930960, 908779, 879080, 845856, 812163, 779853, 750446, 725135, 703964, 686062, 670929, 658675, 648819, 639919, 630954, 622234, 614397, 607317, 600676, 594808, 590133, 586308, 582741, 579376, 576275, 573034, 569567, 566880, 565895, 565821, 564862, 562505, 560028, 558705, 558528, 558892, 559479, 559996, 559816, 558554, 556650, 554986, 554157, 554241, 554913, 555581, 555726, 555332, 554787, 554352, 553979, 553576, 553102, 552413, 551521, 551023, 551732, 553663, 555842, 557480, 558992, 561527, 565666, 570866, 576070, 580600, 584421, 587788, 590752, 593072]
60220E93072J498Q42N57M87L38j2l91m15J74J074J548J313J016J298J696J265
60204F05360J79k58N70J726K099J810J586J485J068M44J56K45J39l99q88q41m00
60187F14081j03k75p73j155j089p19n68r18j383j358p79j77kj34j86k8J22J07
60169F04663J30N35J350K172K584K525K129J442N19l42p93p69m03K79J219K061
60153F19301K490K756L367M266M855M866M710M712M536L779K744K192K534L563
60139F70671M869O175P340Q278Q975R604J0484J1738J2840J2821J1249Q776O257
60126G90077L547j80m946r440j2139j2556j1277r343p742o883o284n159l496k131
60112G02048j544j263p28j90j80n90q93j003j354k187l230m041m318l991l229
$$ y = [593072, 594570, 595412, 595969, 596456, 596794, 596782, 596391, 595976, 596150, 597224, 598772, 600085, 601101, 602399, 604095, 605360, 605539, 605281, 605851, 607577, 609676, 611486, 613072, 614557, 615625, 616069, 616225, 616470, 616609, 616210, 615322, 614481, 614081, 613978, 613703, 612930, 611775, 610686, 609967, 609399, 608481, 607098, 605740, 604961, 604784, 604782, 604648, 604462, 604434, 604556, 604663, 604793, 605328, 606678, 608850, 611434, 613959, 616088, 617530, 618049, 617707, 616914, 616145, 615742, 616021, 617240, 619301, 621791, 624547, 627914, 632180, 637035, 641901, 646611, 651323, 655859, 659638, 662382, 664574, 667108, 670671, 675540, 681715, 689055, 697333, 706308, 715912, 726396, 738134, 750974, 763795, 775044, 783820, 790077, 793624, 793444, 788498, 779058, 766919, 754363, 743086, 733743, 726001, 719118, 712834, 707675, 704179, 702048, 700504, 699241, 698513, 698323, 698143, 697553, 696660, 695657, 694303, 692116, 688886, 684845, 680527, 676536, 673307]
60097F73307k370j586p65J65R91J476J742K238L354N138P185Q835R761J0408J1526
60082G31405J3184J4604J4953J3934J1546P968L875K47k563n126p902j0465j2182
60069G73478j3131j3654j3523j2298j0306q470p253o482o105o307o761o619n686
60056F56883m977n517o954p908p606o634o017n986n951n423m579l790k997j915
60042E80629p67l03q32j574j348P3J660K257J796J158J026J232J266J093J033
60027E88399J035N83n35j851k884l778m872n978o603o797p156p962q789r030q514
60012E15268p477o257n117m120l177k322j812j753j798j596j233q04R6J719L262
59997D82879L537K601J808K056K826L245L207K965K462J777J557K267L379L980
$$ y = [673307, 670937, 669351, 668586, 668751, 669742, 671218, 672960, 675198, 678552, 683690, 690875, 699710, 709471, 719879, 731405, 744589, 759193, 774146, 788080, 799626, 807594, 811469, 811716, 809153, 804027, 796125, 785660, 773478, 760347, 746693, 733170, 720872, 710566, 702096, 694843, 688361, 682256, 675949, 669188, 662569, 656883, 651906, 646389, 639435, 631527, 623921, 617287, 611270, 605284, 599333, 593910, 589331, 585541, 582544, 580629, 579862, 579559, 578727, 577153, 575805, 575878, 577538, 579795, 581591, 582749, 583775, 585007, 586273, 587366, 588399, 589434, 590017, 589482, 587631, 584747, 580969, 576097, 570119, 563516, 556719, 549563, 541601, 532812, 523782, 515268, 507791, 501534, 496417, 492297, 489120, 486798, 484986, 483233, 481435, 479839, 478606, 477802, 477898, 479617, 482879, 486416, 489017, 490825, 492881, 495707, 498952, 502159, 505124, 507586, 509363, 510920, 513187, 516566, 520546]
59983E20546L908L705L669L583L196K504J655R41O81P44M80m56j504j910j803
59968E39939j958k639l266l289k794k134j419o34%J37k18n43k48O69J556J822
59952E24981J570J289J120Q16M02L00O63J108J289J301J234Q43J4q99j544k015
59936E32472k417k432j845j181j177j816k373k388k098j897j778j412n51O49J603
59921E11359J697R47J23J2O35J386J812J958K076K217K218J996J733J679J785
59906E33633J734J529J671K445L276L400K919K575K592K535K309K365K728K773
59892E68484K346K206K853L719M102M156M326M522M595M949N830O539O329N566
59878F30522N176N224N007M322L663L263K803K079J247L42p88k095l411m800o189
$$ y = [520546, 524454, 528159, 531828, 535411, 538607, 541111, 542766, 543707, 544388, 545132, 545612, 545156, 543652, 541742, 539939, 537981, 535342, 532076, 528787, 525993, 523859, 522440, 521806, 521806, 521943, 521725, 521182, 520934, 521603, 523159, 524981, 526551, 527840, 528960, 529776, 530178, 530478, 531141, 532249, 533538, 534839, 536073, 536916, 536930, 536031, 534487, 532472, 530055, 527623, 525778, 524597, 523420, 521604, 519231, 516843, 514745, 512848, 511070, 509658, 509107, 509756, 511359, 513056, 514003, 514126, 514138, 514773, 516159, 517971, 519929, 522005, 524222, 526440, 528436, 530169, 531848, 533633, 535367, 536896, 538567, 541012, 544288, 547688, 550607, 553182, 555774, 558309, 560618, 562983, 565711, 568484, 570830, 573036, 575889, 579608, 583710, 587866, 592192, 596714, 601309, 606258, 612088, 618627, 624956, 630522, 635698, 640922, 645929, 650251, 653914, 657177, 659980, 662059, 663306, 663648, 662860, 660765, 657354, 652554, 646365]
59863F46365o876o160m460l003k446k373k199j741q88N32K187L199L077K341J980
59848F29535K571M012N833P584R159J0762J2404J3665J4236J4406J4445J3795
59836G52407J1577P898M046J281mO2J267L085M571M780L164m31n642j1295j5798
59821G60968j8172j8622j8049j7312j6856j6653j6261j5291j3845j2264j0541
59810E87102q421o065m117k954k307j767j289j064j204j712k417k828k454j489
59796E47014q18j106k112l095l625l756l678l504l313l134k895k548k237k162
59782E09031k287k299j936j349r06p17n20j61R9M1j5L38Q22P84K34j04J24M52
59764E01631N43P31J266J695J615J339J222R38K04l65n6O92R05O28P91J604K194
$$ y = [646365, 639489, 633329, 628869, 625866, 623420, 621047, 618848, 617107, 616219, 616751, 618938, 622137, 625214, 627555, 629535, 632106, 636118, 641951, 649535, 658694, 669456, 681860, 695525, 709761, 724167, 738612, 752407, 763984, 771882, 775928, 777209, 777205, 777267, 778534, 781619, 786190, 790970, 794134, 793703, 788061, 776766, 760968, 742796, 724174, 706125, 688813, 671957, 655304, 639043, 623752, 609907, 597643, 587102, 578681, 572616, 568499, 565545, 563238, 561471, 560182, 559118, 557914, 556202, 553785, 550957, 548503, 547014, 546196, 545090, 542978, 539883, 536258, 532502, 528824, 525320, 522007, 518873, 515978, 513430, 511193, 509031, 506744, 504445, 502509, 501160, 500254, 499537, 499017, 498856, 498955, 498996, 498981, 499319, 500141, 500925, 501159, 501055, 501179, 501631, 502174, 502905, 504171, 505866, 507481, 508820, 510042, 510980, 511184, 510819, 510763, 511455, 512360, 512988, 513779, 515383, 517577]
59747E17577J988J492J373J541J581J434J260J064Q77R21J311J781J977J824J488
59732E39489J099O36jp05j000m64N45J036N63j96n06p16j554k716l086k306j235
59715E28883p09n67k06M41Q54N99j46o47k87P25J516J551J082M63l45j084r12
59698E31211M64J914K129J331P32P72R45J063J386J631J101p4r55j166j105p76
59682E40603L20J869K561J807N70nJ15M30P82J028O89l95j678k683l537m319m586
59665E33571m151l605l482l399k680j404k83J82R2n1K74J087J720J649J445K131
59649E23096L632M706M621L855K997J985Q95L26L12j26j593l269m020l813l297
59634E30307k667j818r68l53J89O59N40k14n89J93J326J431N12j20L48J439K293
$$ y = [517577, 519565, 521057, 522430, 523971, 525552, 526986, 528246, 529310, 530187, 531108, 532419, 534200, 536177, 538001, 539489, 540588, 541224, 541223, 540518, 539518, 539054, 539599, 540635, 541198, 541002, 540496, 539780, 538226, 535510, 532424, 530118, 528883, 528174, 527607, 527401, 527842, 528696, 529295, 529149, 528502, 528215, 528940, 530456, 532007, 533089, 533552, 533207, 532123, 531211, 531675, 533589, 535718, 537049, 537781, 538553, 539498, 540561, 541947, 543578, 544679, 544605, 543650, 542484, 541379, 540603, 540923, 542792, 545353, 547160, 547730, 547725, 547840, 548270, 549052, 550080, 550769, 550374, 548696, 546013, 542476, 538157, 533571, 529420, 525815, 522333, 518934, 516254, 514850, 514567, 514749, 514841, 514790, 515064, 516151, 517871, 519520, 520965, 523096, 526728, 531434, 536055, 539910, 542907, 544892, 545787, 546113, 546425, 546299, 544706, 541437, 537417, 533604, 530307, 527640, 525822, 524854, 524501, 524690, 525349, 525889, 525675, 525086, 525279, 526605, 528036, 528548, 528428, 528776, 530215, 532508]
59617E32508K522K140J343M75k69j042j970k758l040k766j948m76J366K691K975
59602E31751K763K851L073K607J286j22q13p05m04o30j471j973j110O70J623Q90
59586E40286l87q44p78j167j764j592q54p62j546k126j984j957k793m014m815
59571E12903n064m862l927k250p72n40j423k189j859o10N94R37L82l53m05M70
59555D91032J659K259J951J331J263J831K217J845J310J644K839L855M119M179
59541E23334M633N340O145P484R562J1752J3631J5856J8816K0844J9185J2984
59529F69566M475k961p226q134o613l862p90K208N034P549R580J1077J1917J1855
59515G03675J0899R477P845N786L218O63j523l821o675r391j0812j0964j1036
$$ y = [532508, 535030, 537170, 538513, 538988, 538719, 537677, 535707, 532949, 529909, 527143, 525195, 524719, 526085, 528776, 531751, 534514, 537365, 540438, 543045, 544331, 544209, 543396, 542691, 542287, 541657, 540186, 538213, 537103, 537773, 539396, 540286, 539899, 539055, 538277, 537110, 535346, 533754, 532900, 532138, 530592, 528466, 526482, 524525, 521732, 517718, 512903, 507839, 502977, 499050, 496800, 496028, 495488, 494065, 491876, 490017, 489407, 490001, 490938, 491320, 490967, 490562, 491032, 492691, 494950, 496901, 498232, 499495, 501326, 503543, 505388, 506698, 508342, 511181, 515036, 519155, 523334, 527967, 533307, 539452, 546936, 556498, 568250, 581881, 597737, 616553, 637397, 656582, 669566, 674041, 671080, 663854, 655720, 649107, 645245, 644455, 646663, 651697, 659246, 668826, 679903, 691820, 703675, 714574, 724051, 731896, 737682, 740900, 741563, 740040, 736219, 729544, 720153, 709341, 698377, 687341]
59502F87341j1723j2446j2371j1513j0528r934r659r178q105o870o452o992p240
59489E64330o065m030k592k134j896j531j439j523j053n0M32l8l92M06J898K961
59473E47284L349L566L781L719L380L084K868K495J959J557J456J537J679J928
59459E83642K400L214M520O336Q394J0219J1470J2316J3404J5253J7484J8987
59447G07639J9074J8267J7490J6820J5522J3096R587N047m86o293j1012j3777
59435G90974j4885j5143j5059j4805j4431j3746j2393j0370q182o271m626l081
59423F57982j504M12L028O085Q639J0081J0929J2204J4363J7142K0095K2906K5471
59410H07833K7939L0205L0902K7545J8768O486n004j2394j5552j6337j6089j4864
$$ y = [687341, 675618, 663172, 650801, 639288, 628760, 618826, 609167, 599989, 591884, 585014, 578562, 571570, 564330, 558265, 554235, 551643, 549509, 547613, 546082, 544643, 543120, 542067, 542017, 542449, 542411, 542019, 542425, 544323, 547284, 550633, 554199, 557980, 561699, 565079, 568163, 571031, 573526, 575485, 577042, 578498, 580035, 581714, 583642, 586042, 589256, 593776, 600112, 608506, 618725, 630195, 642511, 655915, 671168, 688652, 707639, 726713, 744980, 762470, 779290, 794812, 807908, 817495, 822542, 822056, 815763, 804751, 790974, 776089, 760946, 745887, 731082, 716651, 702905, 690512, 680142, 671960, 665689, 661063, 657982, 656478, 656890, 659918, 666003, 674642, 684723, 695652, 707856, 722219, 739361, 759456, 782362, 807833, 835772, 865977, 896879, 924424, 943192, 949678, 944674, 932280, 916728, 900391, 884302, 869438]
59398H69438j2449r217n944l619l633p309j4445k2677k8960l1782l1580k9400
59386F68423k6012k2190j8760j5880j3049j0213q148p166o298m612k682j724j745
59373E29944j656j054n76n48m37N1M65N90R43J699K050J409N14M82J263J902K119
59356E39160K611L826N280O358P161Q182R524J0881J2116J3503J5347J7585J9817
59343F71351K1625K2850K3604K4071K4268K4011K3150K1809K0181J8104J5089
59332I10113J1012O442J991k417p134j1817j5585j8128k0001k1615k2610k2627
59320G87624k2001k1233k0230j8654j6624j4608j2870j1430j0214q958p362n658
59308F17782m496l932l179j862p27l97j64J018K916M498N566O705P995R029J0097
$$ y = [869438, 856989, 847772, 841828, 838209, 834576, 827267, 812822, 790145, 761185, 729403, 697823, 668423, 642411, 620221, 601461, 585581, 572532, 562319, 554171, 547005, 540707, 536095, 533413, 531689, 529944, 528288, 527234, 526658, 526110, 525673, 525724, 526189, 526779, 527722, 529421, 531471, 532880, 533394, 533876, 535139, 537041, 539160, 541771, 545597, 550877, 557235, 564396, 572578, 582102, 592983, 605099, 618602, 633949, 651534, 671351, 692976, 715826, 739430, 763501, 787769, 811780, 834930, 856739, 876920, 895024, 910113, 921125, 927567, 929558, 927141, 920007, 908190, 892605, 874477, 854476, 832861, 810251, 787624, 765623, 744390, 724160, 705506, 688882, 674274, 661404, 649974, 639760, 630802, 623440, 617782, 613286, 609354, 606175, 604313, 603586, 603189, 603025, 604043, 606959, 611457, 617023, 623728, 631723, 640752, 650849]
59293F50849J2105J5147J8335K1210K4257K7619L0209L0399K6893J9043P503m981
59281H78588j4638j9437k0303j9327j7468j4557j0684o593k959J23K968N908Q920
59268G70541J1502J3181J4167J5139J6284J6998J6552J4666J1475P443L322l72
59256I10898l838p404j0673j3033j4771j6667j8404j8695j7271j5555j4696j4091
59244G45800j2624j0464q539o941m991k536j99J629L216M843O374P618Q631R540
59230G41357J0259J0521J0136R221Q048O590M473J723q63k653m265o802j0111
59217G77634j2824j4237j5041j5807j5932j4837j3272j2413j2266j1923j0973
59206F28109r793q625p288n773m522l937l990m281m346m005l569l450l488l066
$$ y = [650849, 662954, 678101, 696436, 717646, 741903, 769522, 799731, 830130, 857023, 876066, 883569, 878588, 863950, 844513, 824210, 804883, 787415, 772858, 762174, 755581, 752622, 752745, 755713, 761621, 770541, 782043, 795224, 809391, 824530, 840814, 857812, 874364, 889030, 900505, 907948, 911270, 910898, 907060, 899656, 888983, 875950, 861179, 844512, 826108, 807413, 790142, 774587, 759891, 745800, 733176, 722712, 714173, 707232, 702241, 699705, 699506, 701135, 704351, 709194, 715568, 723186, 731817, 741357, 751616, 762137, 772273, 781494, 789542, 796132, 800605, 802328, 801465, 798812, 794547, 787745, 777634, 764810, 750573, 735532, 719725, 703793, 688956, 675684, 663271, 651005, 639082, 628109, 618316, 609691, 602403, 596630, 592108, 588171, 584181, 579900, 575554, 571549, 567980, 564530, 561042, 557976]
59192E57976k000q78k11K17Q38J599K156K447K679L044L666M465M960M680L972
59177E89610L781M414N173N483N608N925O243O417O844P767Q754R567J0752J2560
59163F88898J4042J4233J3681J3713J4474J4832J4049J2480J0592Q326N671L023
59151H28014O42j666m055o361q488j0593j2582j3841j3784j2524j0791r252q127
59138G16592p326o857o807o915o409m750k464q05m46q61j093o21N50K092L457
59123F77337M303N031O328P990Q994R037R154J0231J1721J2582J2821J3203J3914
59110H02646J4474J4756J5092J5437J5248J4274J2909J1618J0416Q984P030M634
59098I47518K381R87N24K63m89j697k894l728m007l722l319l377l713l504k692
$$ y = [557976, 555976, 555098, 554887, 555104, 555942, 557541, 559697, 562144, 564823, 567867, 571533, 575998, 580958, 585638, 589610, 593391, 597805, 602978, 608461, 614069, 619994, 626237, 632654, 639498, 647265, 656019, 665586, 676338, 688898, 702940, 717173, 730854, 744567, 759041, 773873, 787922, 800402, 810994, 819320, 824991, 828014, 828656, 826990, 822935, 816574, 808086, 797493, 784911, 771070, 757286, 744762, 733971, 724719, 716592, 709266, 702409, 695602, 688687, 682278, 677528, 675064, 674259, 673813, 672952, 671859, 671238, 671788, 673880, 677337, 681640, 686671, 692999, 700989, 709983, 719020, 728174, 738405, 750126, 762708, 775529, 788732, 802646, 817120, 831876, 846968, 862405, 877653, 891927, 904836, 916454, 926870, 935854, 942884, 947518, 949899, 950886, 951410, 951673, 951184, 949487, 946593, 942865, 938858, 935136, 931817, 928440, 924727, 921223, 918531]
59083I18531k464l684n613p077q154r687j1580j2814j2946j2537j2051j1362j0454
59070G98108r795r654r637r169q112o845n890n429n033m177l163k980l841m515
59056G09868l829k308j530k144l378m258m472m170l718l648m163m688m458l462
59042F59642k309j332m29L88R32J207J295J045M38J24R21K796M853O197O491O020
59026F88279N620O150P484Q561Q986R879J2268J5235J6857J6568J5437J4306J3001
59013H38631J1321R529P672N421K854N69j145k409k995k433j032J86Q25J556L033
58998H71583N118P368R386J0535J0200Q689P074N878M687L273K091J230j11k434
58984I44567n024o965q508j0555j3164j5316j6079j5456j4092j2540j0867q771
$$ y = [918531, 916067, 912383, 906770, 899693, 891539, 881852, 870272, 857458, 844512, 831975, 819924, 808562, 798108, 788313, 778659, 769022, 759853, 751741, 744896, 739006, 733577, 728544, 724367, 721204, 718224, 714383, 709868, 706039, 703731, 702201, 700057, 696679, 692421, 687949, 683779, 680061, 676413, 672250, 667562, 663104, 659642, 657333, 656001, 655572, 655960, 656892, 658099, 659394, 660439, 660877, 661001, 661922, 664718, 669571, 675768, 682259, 688279, 693899, 700049, 707533, 716094, 725080, 734959, 747227, 762462, 779319, 795887, 811324, 825630, 838631, 849952, 859481, 867153, 872574, 875428, 875997, 874852, 872443, 869448, 867015, 865983, 866169, 866994, 868550, 871583, 876701, 884069, 893455, 903990, 914190, 922879, 929953, 935831, 940518, 943791, 945882, 947112, 947001, 944567, 939543, 932578, 924070, 913515, 900351, 885035, 868956, 853500, 839408, 826868, 816001, 807230]
58972H07230o069l073m11J502K667L362M004M997O408P869R042R971J0786J1407
58958H69692J1846J2335J2631J1740R039N224J397k344o450j0533j3565j5259
58946H85753j6105j6145j4991j3006j1224r797p827n037k492j163q23r08j436
58933G84799k492l706m946o717r108j1025j1262r912q191p148p017p364p502p022
58919F81387o238n706n278m250k565j101m20l6O58J472K003K512L500M851O044
58904F76833O982Q016R399J1014J2519J3587J4161J4567J5024J5132J4414J3350
58892H24998J3094J4075J5615J7208J9269K2192K5463K8346L0812L3135L5013
58881A079220L5665L4517L1385K6369K0059J3474P333J586m172j0121j6213k2217
$$ y = [807230, 801161, 798088, 797677, 799179, 801846, 805208, 809212, 814209, 820617, 828486, 837528, 847499, 858285, 869692, 881538, 893873, 906504, 918244, 927283, 932507, 933904, 931560, 925110, 914577, 901012, 885753, 869648, 853503, 838512, 825506, 814282, 804485, 796658, 791621, 789129, 787966, 787143, 786235, 784799, 782307, 778601, 773655, 766938, 757830, 746805, 735543, 725631, 717440, 710292, 703275, 695911, 688409, 681387, 675149, 669443, 664165, 659915, 657350, 656249, 655829, 655793, 656451, 657923, 659926, 662438, 665938, 670789, 676833, 683815, 691831, 701230, 712244, 724763, 738350, 752511, 767078, 782102, 797234, 811648, 824998, 838092, 852167, 867782, 884990, 904259, 926451, 951914, 980260, 1011072, 1044207, 1079220, 1114885, 1149402, 1180787, 1207156, 1227215, 1240689, 1248022, 1249608, 1245436, 1235315, 1219102, 1196885]
58869A196885k7509l1253l3074l3253l2178l0101k7509k5039k2810k0452j8014
58858H95693j6206j5430j5270j5235j5337j5648j5966j6242j6635j6848j6154
58847G20722j4459j2542j0852q985o810n192m875n423n932o038n574m182k117
58834F27741o56o97j577k166k451k973l379k853j671j027j395k173k807l251l241
58819E95424k287o47O42R84Q13P97J120J763K712L604L781L139K382K098J922
58804F18247J045o68k467l478l448k770k006j424r75n73l16l74p28j022p25M51
58788E98769K101L255L299K736K674L569M838N697N971N921N798N728N717N536
58774F61609M897L867K731J459k26k150l605m136l957l399k583j779j456j659
$$ y = [1196885, 1169376, 1138123, 1105049, 1071796, 1039618, 1009517, 982008, 956969, 934159, 913707, 895693, 879487, 864057, 848787, 833552, 818215, 802567, 786601, 770359, 753724, 736876, 720722, 706263, 693721, 682869, 673884, 667074, 661882, 657007, 651584, 645652, 639614, 634040, 629858, 627741, 627085, 626388, 624811, 622645, 620194, 617221, 613842, 610989, 609318, 608291, 606896, 604723, 601916, 598665, 595424, 593137, 592490, 593132, 594116, 594929, 595726, 596846, 598609, 601321, 604925, 608706, 611845, 614227, 616325, 618247, 619292, 618624, 616157, 612679, 609231, 606461, 604455, 603031, 602056, 601483, 601167, 600793, 600065, 599043, 598318, 598769, 600870, 604125, 607424, 610160, 612834, 616403, 621241, 626938, 632909, 638830, 644628, 650356, 656073, 661609, 666506, 670373, 673104, 674563, 674337, 672187, 668582, 664446, 660489, 657090, 654507, 652728, 651272, 649613]
58760F49613j860j759j587j352n04J076K528L038L034L592M956O336O965O809
58746F80885O313N953O027O545P232P785Q049Q027P959Q277R099R827R806R303
58732G91087R215R752J0164R930R429R204R305R660J0253J0604R948Q414P173
58719I14138O897O881O259N327M890N119N800P005Q581R581R197P831O441N097
58705A009044L076J66k983n687p855r847j2182j5220j8663k1625k3471k4292k4361
58692H46100k3665k2327k0748j8918j6319j3114j0601r684r590r023q027p622
58680F76462q032q355p953p209o825o928o988o270m513k376q24R7J200K654L519
58665F17659L412L617N466Q361J0540J1295J1206J0655R411P562N703M065K406
$$ y = [649613, 647753, 645994, 644407, 643055, 642551, 643627, 646155, 649193, 652227, 655819, 660775, 667111, 674076, 680885, 687198, 693151, 699178, 705723, 712955, 720740, 728789, 736816, 744775, 753052, 762151, 771978, 781784, 791087, 800302, 810054, 820218, 830148, 839577, 848781, 858086, 867746, 877999, 888603, 898551, 906965, 914138, 921035, 927916, 934175, 939502, 944392, 949511, 955311, 962316, 970897, 980478, 989675, 997506, 1003947, 1009044, 1012120, 1012286, 1009303, 1003616, 995761, 985914, 973732, 958512, 939849, 918224, 894753, 870461, 846100, 822435, 800108, 779360, 760442, 744123, 731009, 720408, 710724, 701134, 692111, 684084, 676462, 668430, 660075, 652122, 644913, 638088, 631160, 624172, 617902, 613389, 611013, 610189, 610286, 611486, 614140, 617659, 621071, 624688, 630154, 638515, 649055, 660350, 671556, 682211, 691622, 699184, 704887, 708952, 711358]
58652G11358Q45m3j07Q7p8p19j577k219k264j812j418j318j073m11K04M01O59
58635G00515J458K188J918Q42K6o6M2j83p35j366j830j944j881k087k522k538
58619F91837j954j412j048K21L111O564R177J1175J3536J5818J6568J5612J4221
58606G93426J2958J1069Q228N401L400J829M4j806l255m346n419o565p565q054
58592G99345p661o450n092m177l459k352p90R60K986N360P471Q618R107R800J0758
58577H24424J1228J0881J0055Q969P586O226N354M756L890L025L155M682O952
58564I11183R180J1090J2637J3931J5372J7190J8848J9493J8875J7327J5104J2414
58552A092644R691P130M360J205j786m319p092j0527j3555j4939j5133j5414j5802
$$ y = [711358, 712203, 712160, 712053, 712140, 712062, 711343, 709766, 707547, 705283, 703471, 702053, 700735, 699662, 699251, 699455, 699856, 700515, 701973, 704161, 706079, 706921, 706947, 706881, 706923, 706740, 706005, 704639, 702809, 700865, 698984, 696897, 694375, 691837, 689883, 688471, 687423, 687644, 690755, 697319, 706496, 717671, 731207, 747025, 763593, 779205, 793426, 806384, 817453, 825681, 831082, 834482, 836311, 836355, 834549, 831294, 826948, 821529, 814964, 807399, 799345, 791684, 785234, 780142, 775965, 772506, 770154, 769364, 770324, 773310, 778670, 786141, 794759, 803866, 813666, 824424, 835652, 846533, 856588, 865557, 873143, 879369, 884723, 889479, 893369, 896394, 899549, 904231, 911183, 920363, 931453, 944090, 958021, 973393, 990583, 1009431, 1028924, 1047799, 1065126, 1080230, 1092644, 1102335, 1109465, 1113825, 1115030, 1113244, 1108925, 1101833, 1091306, 1077751, 1062812, 1047679, 1032265, 1016463]
58539A016463j5460j4656j4506j4984j4919j4037j3303j3097j2691j1717j0637
58528H66456r515p809n667m000k947j690k3J291K037K982M399N545N958O018N882
58513H68917N230M378M142M317L801K673K429L548M541M311L869M575O017O923
58499I29671P108P272P555P432O556M962K849O33j363l490o292r248j1043j1447
58485I31155j1689j2417j2585j1169q783o628m826k797n60J395K953M198M866
58472H73113M711M072L386K562J278m30k358m398o258p351p391o761o019n382
58458H42774m833m278l513k464j441o40L61J920L463M135M036L852L525K469R60
58443H50326k1l29p44j444j697j235n82J63J446K969L683L475L451M174M893N013
$$ y = [1016463, 1001003, 986347, 971841, 956857, 941938, 927901, 914598, 901501, 888810, 877093, 866456, 856941, 849132, 843465, 839465, 836518, 834828, 834805, 836096, 838133, 841115, 845514, 851059, 857017, 863035, 868917, 874147, 878525, 882667, 886984, 890785, 893458, 895887, 899435, 903976, 908287, 912156, 916731, 922748, 929671, 936779, 944051, 951606, 959038, 965594, 970556, 973405, 974038, 972675, 969185, 962893, 953645, 942602, 931155, 919466, 907049, 894464, 883295, 874512, 867884, 863058, 860261, 859701, 861096, 864049, 868247, 873113, 877824, 881896, 885282, 887844, 889122, 888692, 886334, 881936, 875678, 868327, 860936, 854175, 848156, 842774, 837941, 833663, 830150, 827686, 826245, 825605, 825966, 827886, 831349, 835484, 839520, 843372, 846897, 849366, 850326, 850305, 849976, 849232, 847788, 846091, 844856, 844274, 844437, 845883, 848852, 852535, 856010, 859461, 863635, 868528, 873541]
58427H73541M968N164N326N431O071P397Q859J0299J2058J3679J3998J3032J2357
58414I92180J2868J3489J2710J0258O664K447j580m291n374n651n923o287o700
58401A014810p092o810n195k829r63K61J583K854L204K968L357M128L683J835
58387A015794K10n14j448k940l573k706j759j869k327k362k460k807k556j664
58373I87019j408j902j386P94K779L225L425M740O203O590O787P994R419R895
58359A044174J0196J1641J3695J4939J5163J4766J3439J1144R134Q213P324N465
58347A179293L591K961L029K767K650L490M661N283N951P545R464J0706J1529
58334A252920J2586J3609J4330J5298J6459J6562J5373J4659J5437J6161J5318
$$ y = [873541, 878509, 883673, 888999, 894430, 900501, 907898, 916757, 927056, 939114, 952793, 966791, 979823, 992180, 1005048, 1018537, 1031247, 1041505, 1048169, 1050616, 1049036, 1044745, 1039371, 1033720, 1027797, 1021510, 1014810, 1007718, 1000908, 995713, 992884, 991921, 992182, 993765, 996619, 999823, 1002791, 1006148, 1010276, 1013959, 1015794, 1016004, 1015490, 1014042, 1011102, 1007529, 1004823, 1003064, 1001195, 998868, 996506, 994046, 991239, 988683, 987019, 985611, 983709, 982323, 983117, 985896, 989121, 992546, 997286, 1003489, 1010079, 1016866, 1024860, 1034279, 1044174, 1054370, 1066011, 1079706, 1094645, 1109808, 1124574, 1138013, 1149157, 1158291, 1166504, 1173828, 1179293, 1182884, 1185845, 1188874, 1191641, 1194291, 1197781, 1202442, 1207725, 1213676, 1221221, 1230685, 1241391, 1252920, 1265506, 1279115, 1293445, 1308743, 1325202, 1341764, 1357137, 1371796, 1387233, 1403394, 1418712]
58323A418712J3872J3234J2773J1459J0121R878J0039R701R724J0935J2144J2165
58311A554757J2091J3235J4615J4855J4877J6218J8224J9402K0038K1060K1907
58300A741279K1818K1641K2080K1918K0325J8958J9325K0081J9593J9040K0110
58289A966168K1740K2290K2848K5115K7942K9368L0289L2616L5544L7180L8181
58278B289281M0166M2185M2515M2451M4437M7781M9987N1098N3000N5646N7677
58267B816224N9574O2630O5951O8017O9803P2972P6556P9013Q1536Q5643Q9485
58256C627404R0731R0938R2784R5223R5961R6543R9828J04566J07706J10163J14883
58245D726730J21099J26231J31632J40477J51567J61282J70184J81449J94376
$$ y = [1418712, 1432584, 1445818, 1458591, 1470050, 1480171, 1490049, 1500088, 1509789, 1519513, 1530448, 1542592, 1554757, 1566848, 1580083, 1594698, 1609553, 1624430, 1640648, 1658872, 1678274, 1698312, 1719372, 1741279, 1763097, 1784738, 1806818, 1828736, 1849061, 1868019, 1887344, 1907425, 1927018, 1946058, 1966168, 1987908, 2010198, 2033046, 2058161, 2086103, 2115471, 2145760, 2178376, 2213920, 2251100, 2289281, 2329447, 2371632, 2414147, 2456598, 2501035, 2548816, 2598803, 2649901, 2702901, 2758547, 2816224, 2875798, 2938428, 3004379, 3072396, 3142199, 3215171, 3291727, 3370740, 3452276, 3537919, 3627404, 3718135, 3809073, 3901857, 3997080, 4093041, 4189584, 4289412, 4393978, 4501684, 4611847, 4726730, 4847829, 4974060, 5105692, 5246169, 5397736, 5559018, 5729202, 5910651, 6105027]
58236F105027K05898K17100K31456K47984K63055K77719K96049L17455L38055
58227H499798L58541L83025M11266M39884M70207N06605N48177N90755O35981
58218A2844239O89348P50423Q14807Q84584R66405J060193J161004J271310J399605
58209B1841918J547663J712146J898487K119298K379359K677555L024146L439911
58201D0640483L938299M527640N232908O095062P147004Q412762R931376J1751457
58193I7676991J3894441J6351610J9118534K2185155K5469971K8789639L1850816
58186B55337157L4102019L4484176L1523542K4117351J2585771j008908j3762406
58179C77378702k3376363k9002153l1035531l0396676k8009178k4640907k0863414
$$ y = [6105027, 6310925, 6528025, 6759481, 7007465, 7270520, 7548239, 7844288, 8161743, 8499798, 8858339, 9241364, 9652630, 10092514, 10562721, 11069326, 11617503, 12208258, 12844239, 13533587, 14284010, 15098817, 15983401, 16949806, 18009999, 19171003, 20442313, 21841918, 23389581, 25101727, 27000214, 29119512, 31498871, 34176426, 37200572, 40640483, 44578782, 49106422, 54339330, 60434392, 67581396, 75994158, 85925534, 97676991, 111571432, 127923042, 147041576, 169226731, 194696702, 223486341, 255337157, 289439176, 323923352, 355446894, 379564245, 392150016, 391141108, 377378702, 354002339, 325000186, 293964655, 263567979, 235558801, 210917894, 190054480]
58172A90054480j7023948j3353753j0198247q079559p400987q046075r331743
58165A16620168j0424036j0828464j0528700r766790q783207p731789o710337
58158E1846845n778905m956348m239374l628293l122637k705628k353353k053646
58150B3008661j802325j589010j401806j240198j109014j003482r12462q32585
58142A3117779p67124p13761o64930o18296n76436n37604m96698m54326m15808
58133G872796l81826l48386l15320k86694k63257k42257k24484k14048k10720
58124E385804k09131k05816k01199j94874j85184j73627j63803j55712j46299
58115C750159j35628j27024j21112j15033j07838j01570r6619r0944q4345p9009
$$ y = [190054480, 173030532, 159676779, 149478532, 141398973, 133997986, 125951911, 116620168, 106196132, 95367668, 84838968, 75072178, 66288971, 58557182, 51846845, 46067940, 41111592, 36872218, 33243925, 30121288, 27415660, 25062307, 23008661, 21206336, 19617326, 18215520, 16975322, 15866308, 14862826, 13950364, 13117779, 12350655, 11636894, 10971964, 10353668, 9777232, 9239628, 8742930, 8288604, 7872796, 7490970, 7142584, 6827264, 6540570, 6277313, 6035056, 5810572, 5596524, 5385804, 5176673, 4970857, 4769658, 4574784, 4389600, 4215973, 4052170, 3896458, 3750159, 3614531, 3487507, 3366395, 3251362, 3143524, 3041954, 2945335, 2854391, 2770046, 2691037]
58105B691037p5401p1787o8047o5739o4379o1780n8184n5847n4591n2007m8073
58094B015202m5263m3868m1536l7846l5058l3783l1939k8796k6216k5135k4361
58083A641401k3508k3702k4751k5037k4692k5543k7476k8250k7331k6562k6566
58072A357983k6008k4855k4728k5393k4584k2170k0833k1519k1750j9790j7179
58061A109174j5720j4957j4157j3922j4270j3769j2121j1191j2055j3286j3468
58050I60258j3166j3104j2606j1218r924r530r559r676j0379j1400j1442j0320
58038H27934r476r615r749r317r106r327q962p921p712q894j0014j0063r975j0498
58024F97305j0708r864q961r027r505r520r248q928q041o550n474n285n154m585
$$ y = [2691037, 2615636, 2543849, 2475802, 2410063, 2345684, 2283904, 2225720, 2169873, 2115282, 2063275, 2015202, 1969939, 1926071, 1884535, 1846689, 1811631, 1777848, 1745909, 1717113, 1690897, 1665762, 1641401, 1617893, 1594191, 1569440, 1544403, 1519711, 1494168, 1466692, 1438442, 1411111, 1384549, 1357983, 1331975, 1307120, 1282392, 1256999, 1232415, 1210245, 1189412, 1167893, 1146143, 1126353, 1109174, 1093454, 1078497, 1064340, 1050418, 1036148, 1022379, 1010258, 999067, 987012, 973726, 960258, 947092, 933988, 921382, 910164, 900240, 890710, 881151, 871475, 861096, 849696, 838254, 827934, 818458, 808843, 799094, 789777, 780671, 771344, 762382, 754461, 746749, 737855, 727841, 717778, 707803, 697305, 686597, 676733, 667772, 658745, 649240, 639720, 630472, 621544, 613503, 606953, 601479, 596194, 591040, 586455]
58010E86455m285m515m257l001j851j779k155k019j452q14J11J338K322L081M380
57995E71559O207P477P822Q076Q433P878O164M560L704K571N80j076j391j168
57981F31396j434j838j890k252l369m218l878l175l334m144m734n128n739o322
57967E79941o647p248q281q673p610n958m968m473l573k350j637j722k299l099
57953E11403l781l860l477l432l798l596k521j773k208k854k462j397p37n16n2
57938D74939P36J598K737M162N136N358N829P254Q494Q021O229M807M335L970
57924E43605L191K360J649P00m59j248j489j783k791m513o394p806q617r385j0618
57909D96402j1806j1850j0635r285q644q417q197q180q353q101p356p017p458
$$ y = [586455, 582170, 577655, 573398, 570397, 568546, 566767, 564612, 562593, 561141, 560327, 560438, 561776, 564098, 567179, 571559, 577766, 585243, 593065, 601141, 609574, 617452, 623616, 628176, 631880, 634451, 635031, 633955, 632564, 631396, 629962, 628124, 626234, 623982, 620613, 616395, 612517, 609342, 606008, 601864, 597130, 592002, 586263, 579941, 573294, 566046, 557765, 549092, 541482, 535524, 530556, 526083, 522510, 520160, 518523, 516801, 514502, 511403, 507622, 503762, 500285, 496853, 493055, 489459, 486938, 485165, 482957, 480103, 477641, 476244, 475507, 474991, 474939, 475675, 477273, 480010, 484172, 489308, 494666, 500495, 507749, 516243, 524264, 530493, 535300, 539635, 543605, 546796, 549156, 550805, 551505, 551046, 549798, 548309, 546526, 543735, 539222, 532828, 525022, 516405, 507020, 496402, 484596, 472746, 462111, 452826, 444182, 435765, 427568, 419388, 411035, 402934, 395578, 388561, 381103]
57896C81103p682o915n942n781o006n531m240k782j449l42J25p4n4P62J679J943
57880C38814K119L016M069M145L348K714K536K233J489M23q84k067k212j084L1
57865C58690j88j317k067k181k148j735m36J070J638J540K047L309M216M381M507
57850C71326M754M417L569L456M533N548N285M105L050K314J415K33q89j656k078
57835D09382k464l347m904o390o741n800m424l324k502j888j705j947k140k019
57821C59787j902k031j960j013Q76K997M423M704M197L698L676L995M423M976
57807C90846N524N471M345K326j81l036n950q118r007r143r386r748r660r075
57793C35208q444p836o936n837n086m902n021n168n107m425l023j612r91j004
$$ y = [381103, 373421, 366506, 360564, 354783, 348777, 343246, 339006, 336224, 334775, 334433, 334558, 334484, 334430, 335192, 336871, 338814, 340933, 343949, 348018, 352163, 355511, 358225, 360761, 362994, 364483, 364906, 364022, 361955, 359743, 358659, 358690, 358502, 357185, 355118, 352937, 350789, 349054, 348618, 349688, 351326, 352866, 354913, 358222, 362438, 366819, 371326, 376080, 380497, 384066, 387522, 392055, 397603, 402888, 406993, 410043, 412357, 413772, 414005, 413116, 411460, 409382, 406918, 403571, 398667, 392277, 385536, 379736, 375312, 371988, 369486, 367598, 365893, 363946, 361806, 359787, 357885, 355854, 353894, 352881, 353757, 356754, 361177, 365881, 370078, 373776, 377452, 381447, 385870, 390846, 396370, 401841, 406186, 408512, 408331, 405295, 399345, 391227, 382220, 373077, 363691, 353943, 344283, 335208, 326764, 318928, 311992, 306155, 301069, 296167, 291146, 285978, 280871, 276446, 273423, 271811, 270820, 269816]
57779B69816q82m27lL69J021J786K112K113K515L458M159M023L380K856K671K705
57763C01672K756K591K161J790J599R76o94k893m372m718m690m940n211n003m289
57748B76735l297k259j594j723k427k914k770k397k417l034m025m887n069m527
57734B33395l985m074m411m199l450k757k020n90J285K342K006J122N84K77RL55
57718B15889J685L075L289K450J763J846K124J887J158M18Oj9J63J90k29r40j408
57701B33347j287p64k71L6L09N78N93K36j33j03K46O25J160K063K798K423J044
57684B42900KJ99J086J883K878M674O933R030J1247J4234J7728K1097K4800K9983
57670C88674L6760M4129N1606N9628O8100P5466P9112P5722O1829L6302L136k9613
$$ y = [269816, 268934, 268507, 268504, 268873, 269894, 271680, 273792, 275905, 278420, 281878, 286037, 290060, 293440, 296296, 298967, 301672, 304428, 307019, 309180, 310970, 312569, 313545, 312851, 309958, 305586, 300868, 296178, 291238, 286027, 281024, 276735, 273438, 271179, 269585, 267862, 265435, 262521, 259751, 257354, 254937, 251903, 247878, 242991, 237922, 233395, 229410, 225336, 220925, 216726, 213276, 210519, 208499, 207909, 209194, 211536, 213542, 214664, 215248, 215525, 215534, 215889, 217574, 220649, 223938, 226388, 228151, 229997, 232121, 234008, 235166, 235584, 235590, 235571, 235734, 235924, 235695, 234755, 233347, 232060, 231296, 231025, 231061, 231370, 231948, 232541, 232777, 232644, 232541, 232787, 233412, 234572, 236635, 239433, 241856, 242900, 242902, 243101, 244187, 246070, 248948, 253622, 260555, 269585, 280832, 295066, 312794, 333891, 358691, 388674, 425434, 469563, 521169, 580797, 648897, 724363, 803475, 879197, 941026, 977328, 980464, 950851]
57658I50851n4807o9828p5659p4333o8234o0208n2474m5505l8827l2421k6728
57647C51827k1834j7607j4277j2110j0717r349p733o184n112m701m777m689l758
57634B28979k098o11J12L42M62L57j1j58K27O62N97K38N6j29q40k057l194l769
57616B19165l608k699j384m82n93j328j720j346p19n90j144j798j744p84L02N24
57600B00052j89r79j187r60o50l27j50n18j405k062j937j463j413j904k458k765
57584A79685k796k545k049j573j350j338j375j413j421j407j652k426l368l691
57570A51281l231k662k424k148j518r23p13n36r6J37l01q88p64J3O92R34R55Q34
57552A38642N13L21P51J720K606K980K873K474K041J854J807J364M18j49N33K031
$$ y = [950851, 896044, 826216, 750557, 676224, 607990, 547782, 495308, 449803, 410976, 378555, 351827, 329993, 312386, 298109, 285999, 275282, 265933, 258200, 252016, 246904, 242203, 237426, 232737, 228979, 226881, 226270, 226382, 226724, 227186, 227543, 227532, 227374, 227601, 228263, 228860, 229098, 229154, 229025, 228185, 226128, 222934, 219165, 215557, 212858, 211474, 210992, 210399, 209071, 207351, 206005, 205286, 204696, 203552, 201754, 200010, 199226, 199528, 200052, 199863, 198884, 197697, 196737, 196087, 195760, 195610, 195092, 193687, 191625, 189688, 188225, 186812, 184908, 182450, 179685, 176889, 174344, 172295, 170722, 169372, 168034, 166659, 165246, 163825, 162418, 160766, 158340, 154972, 151281, 148050, 145388, 142964, 140816, 139298, 138375, 137662, 137126, 137030, 137167, 136866, 135978, 135214, 135227, 135919, 136853, 137808, 138642, 139155, 139476, 140227, 141947, 144553, 147533, 150406, 152880, 154921, 156775, 158582, 159946, 160364, 160215, 160748, 162779]
57536A62779L018K862K169J810K057K648L098K938K115J201Q21Q59O24l24j774
57521A86901l169l938l732k791j887j542j459j070m14K8R2P4K63P29J343J696
57505A71124J316L85j92J32P62Q62N42M60O44N84K25l2j87n73j042j058o94o87
57487A72571j341k062k232j907j500j290j383j754k117k187k060j950j686r95
57473A48107j55K01q5o40j272k052k745k869k410j881j549j213p90m52j19N02
57457A30578J197J304P41K66M42R05J028P68M79L31K86L14L36J81j43m02m54l46
57439A37811r3K85M97K13l74p34p38p33q24o89k52J16K97O70J347J727J359O90
57421A40575M64P01Q20N40J46j14l32o23q01o05j83o1n50j173j058k8R75R29m3
$$ y = [162779, 165797, 168659, 170828, 172638, 174695, 177343, 180441, 183379, 185494, 186695, 187516, 188375, 188999, 188675, 186901, 183732, 179794, 176062, 173271, 171384, 169842, 168383, 167313, 166899, 166927, 167019, 167093, 167356, 168085, 169428, 171124, 172440, 172825, 172633, 172765, 173527, 174389, 174931, 175391, 176035, 176619, 176844, 176812, 176625, 176052, 175010, 173952, 173258, 172571, 171230, 169168, 166936, 165029, 163529, 162239, 160856, 159102, 156985, 154798, 152738, 150788, 149102, 148107, 147952, 148153, 148068, 147428, 146156, 144104, 141359, 138490, 136080, 134199, 132650, 131437, 130647, 130195, 130076, 130578, 131775, 133079, 133820, 134086, 134528, 135433, 136461, 137229, 137708, 138039, 138325, 138639, 138975, 139156, 139013, 138611, 138157, 137811, 137718, 138003, 138500, 138713, 138339, 137605, 136867, 136134, 135310, 134621, 134369, 134485, 134782, 135452, 136799, 138526, 139885, 140575, 141039, 141740, 142560, 143100, 143246, 143132, 142800, 142177, 141376, 140771, 140588, 140527, 139977, 138804, 137746, 137718, 138693, 139622, 139579]
57402A39579q63p49J19J056J519J323O84R5j38j53j14J26N71P01K21k30R8P71
57384A44616P58J70K89J598K889K814J497J22m84l70n8m9m09o14k14M33O28M78
57366A54094P28J429J758J346P87N09J73l27l54L56R90Q54M47N08Q64J050J291
57349A66503J911K406K178J632J532J693J388O81L41O06J021J303J499J479J161
57334A87334J037J534K048J671P15M18J129J888J944J608J372J150Q55P92J050
57319B06545J234J249J583K333K728K141J051L94M51R19J609K398K859K581J795
57304B31870J171J116J595K407L220L528L112K407K029K035K073K086K364K864
57290B63877L142L104L236L833M438M504M270M367M821N050M919N052N833O604
$$ y = [139579, 138716, 137967, 138086, 139142, 140661, 141984, 142668, 142763, 142625, 142472, 142358, 142484, 143055, 143756, 143977, 143747, 143845, 144616, 145374, 145544, 145833, 147431, 150320, 153134, 154631, 154753, 154269, 153899, 153841, 153792, 153383, 152769, 152555, 152988, 153616, 154094, 154822, 156251, 158009, 159355, 160142, 160651, 160824, 160497, 160143, 160499, 161489, 162343, 162790, 163298, 164162, 165212, 166503, 168414, 170820, 172998, 174630, 176162, 177855, 179243, 179924, 180265, 180871, 181892, 183195, 184694, 186173, 187334, 188371, 189905, 191953, 193624, 194339, 194757, 195886, 197774, 199718, 201326, 202698, 203848, 204703, 205495, 206545, 207779, 209028, 210611, 212944, 215672, 217813, 218864, 219258, 219709, 220628, 222237, 224635, 227494, 230075, 231870, 233041, 234157, 235752, 238159, 241379, 244907, 248019, 250426, 252455, 254490, 256563, 258649, 261013, 263877, 267019, 270123, 273359, 277192, 281630, 286134, 290404, 294771, 299592, 304642, 309561, 314613, 320446, 327050]
57276C27050O470N491M513L929L324K385J524J271J526J768J723J478J160Q62
57262C64474P02P11Q00J017J596K469K986K571J504O40M53P60J342K232L272L910
57246C91439L811L350L119L176L162L012L044L325L460L279L295M045N196N835
57232D42548N605N029M709M683M782N044N452N731N805O077O789P527P833P963
57218E25577Q320Q598Q211P471P340Q107R100R782J0260J0601J0564J0291J0413
57205F44635J1072J1632J1714J1745J2053J2229J2007J1932J2516J3340J3723
57194G78598J3761J3927J4171J4212J4338J5062J6259J7337J8023J8347J8264
57183I52299J7987J8391K0123K2541K4353K5288K6221K7721K9293L0294L0864
$$ y = [327050, 333520, 339011, 343524, 347453, 350777, 353162, 354686, 355957, 357483, 359251, 360974, 362452, 363612, 364474, 365176, 365887, 366687, 367704, 369300, 371769, 374755, 377326, 378830, 379470, 379923, 380683, 382025, 384257, 387529, 391439, 395250, 398600, 401719, 404895, 408057, 411069, 414113, 417438, 420898, 424177, 427472, 431517, 436713, 442548, 448153, 453182, 457891, 462574, 467356, 472400, 477852, 483583, 489388, 495465, 502254, 509781, 517614, 525577, 533897, 542495, 550706, 558177, 565517, 573624, 582724, 592506, 602766, 613367, 623931, 634222, 644635, 655707, 667339, 679053, 690798, 702851, 715080, 727087, 739019, 751535, 764875, 778598, 792359, 806286, 820457, 834669, 849007, 864069, 880328, 897665, 915688, 934035, 952299, 970286, 988677, 1008800, 1031341, 1055694, 1080982, 1107203, 1134924, 1164217, 1194511, 1225375]
57172A225375L1609L2801L4172L5170L5365L4843L4200L3898L3764L3415L2938
57161A597550L2720L2808L2932L3011L3095L3014L2581L2094L2103L2769L3843
57150A958520L5102L6315L7052L7166L7283L8124L9463M0416M0726M1050M1965
57139B383182M3335M4736M5895M6654M7118M7869M9363N1057N1814N1297N0338
57128B912658M9714M9265M8551M7792M7720M8815N1017N3875N6772N9238O1233
57117C486650O2977O4575O6111O8085P1306P6236Q2768R0675R9955J10682J22923
57106D402943J36888J52986J71763J93987K20593K52412K90156L34869L87839
57097F544436M49461N18579N93403O72569P54479Q36082R13075R81029J035491
$$ y = [1225375, 1256984, 1289785, 1323957, 1359127, 1394492, 1429335, 1463535, 1497433, 1531197, 1564612, 1597550, 1630270, 1663078, 1696010, 1729021, 1762116, 1795130, 1827711, 1859805, 1891908, 1924677, 1958520, 1993622, 2029937, 2066989, 2104155, 2141438, 2179562, 2219025, 2259441, 2300167, 2341217, 2383182, 2426517, 2471253, 2517148, 2563802, 2610920, 2658789, 2708152, 2759209, 2811023, 2862320, 2912658, 2962372, 3011637, 3060188, 3107980, 3155700, 3204515, 3255532, 3309407, 3366179, 3425417, 3486650, 3549627, 3614202, 3680313, 3748398, 3819704, 3895940, 3978708, 4069383, 4169338, 4280020, 4402943, 4539831, 4692817, 4864580, 5058567, 5279160, 5531572, 5821728, 6156597, 6544436, 6993897, 7512476, 8105879, 8778448, 9532927, 10369009, 11282084, 12263113, 13298604]
57088A3298604J071513J084125J069411J025191R52730Q59809P60481O67467N82922
57079B1372253M98093M02736K92637J67330K4248j40599l26029n22310p14805
57070B1053554q89875j037684j151981j229268j268452j271166j242112j188241
57062A1774775j116445j031899r38844q42256p47554o58749n77753n05498m42626
57053D913151l88886l42847l02976k68644k39682k15372j94375j75537j58418
57044B626414j43029j29328j16978j05596r5066q5628p7488p0444o3951n7611
57034A681295n1563m6327m2237l8976l5805l2200k8171k3917j9436j4550q924
57023A339189j943P073J8237L1072M5386O1667Q0280J00711J21462J38929J45337
$$ y = [13298604, 14370117, 15454242, 16523653, 17548844, 18501574, 19361383, 20121864, 20789331, 21372253, 21870346, 22273082, 22565719, 22733049, 22757297, 22616698, 22290669, 21768359, 21053554, 20163679, 19125995, 17974014, 16744746, 15476294, 14205128, 12963016, 11774775, 10658330, 9626431, 8687587, 7845331, 7097777, 6439028, 5861275, 5355777, 4913151, 4524265, 4181418, 3878442, 3609798, 3370116, 3154744, 2960369, 2784832, 2626414, 2483385, 2354057, 2237079, 2131483, 2036417, 1950789, 1873301, 1802857, 1738906, 1681295, 1629732, 1583405, 1541168, 1502192, 1466387, 1434187, 1406016, 1382099, 1362663, 1348113, 1339189, 1337246, 1344319, 1362556, 1393628, 1439014, 1500681, 1580961, 1681672, 1803134, 1942063, 2087400]
57012B087400J30112Q7365K3427m4742j00042j34318j48620j48033j37988j23283
57002A491278j07351r1674p6706o3189n1935m2880l5327k8855k3281j8248j3607
56991I38225r851p444o009m876l866k926j521P18L087M330L758J392k424o818
56977I05775j0456j2755j4506j6402j7577j6756j4431j2500j1859j1553j0412
56966G56568q424o238m149j922Q69M388Q049J0767J2180J3202J4597J5419J3882
56953H29188R530L623k398p774j1940j4385j5264j5172j4234j2236r609p304n555
56940G26470l718j446R00L224O016R440J2936J6089J9023K1630K3169K2918K0485
56927H77136J5327P129k951j2308j8900k2612k4268k4271k2850k0763j8791j6925
$$ y = [2087400, 2217512, 2304877, 2328304, 2283562, 2183520, 2049202, 1900582, 1752549, 1614561, 1491278, 1383927, 1292253, 1215547, 1152358, 1100423, 1057543, 1022216, 993361, 970080, 951832, 938225, 928374, 920930, 914921, 910045, 906179, 903253, 901732, 902450, 905537, 909867, 913625, 915017, 912593, 905775, 895319, 882564, 868058, 851656, 834079, 817323, 802892, 790392, 778533, 766980, 756568, 748144, 741906, 737757, 735835, 736704, 741092, 749141, 759908, 772088, 785290, 799887, 815306, 829188, 838718, 842341, 839943, 832169, 820229, 805844, 790580, 775408, 761174, 748938, 739329, 732025, 726470, 722752, 721306, 722206, 725430, 731446, 740886, 753822, 769911, 788934, 810564, 833733, 856651, 877136, 892463, 899592, 896641, 884333, 865433, 842821, 818553, 794282, 771432, 750669, 731878, 714953]
56915G14953j4733j2290j0072q327p060o312n923n343m212k871j823r55J35J380
56901F36547K418L358M731O621Q380R410R883J0440J1417J2646J3885J5213J6782
56888G61731J8365J9517K0138K0400J9932J7609J2688N861j368p976j3526j7380
56876H55991j8894j8433j7208j5804j3676j0444o775l512m36L385Q400J4233K0208
56863G97035K5805L0812L5428M0030M4356M7004M5895L9343K7002J0404p160k1900
56851A114054l1408l5529l5574l3007k8882k3897j8457j2675o564r1O898J4518
56839I09386K2539L0578L8678M7283N6415O5235P2426P6476P5233O5956M6961
56828A507166J9832j0287l7120n6483o7698p2255p1643o6731n8738m9639m0940
$$ y = [714953, 700220, 687930, 677858, 669531, 662471, 656159, 650236, 644893, 640681, 637810, 635987, 635032, 635167, 636547, 638965, 642323, 647054, 653675, 662055, 671465, 681348, 691788, 703205, 715851, 729736, 744949, 761731, 780096, 799613, 819751, 840151, 860083, 877692, 890380, 896241, 894873, 886897, 873371, 855991, 837097, 818664, 801456, 785652, 771976, 761532, 754757, 751245, 750809, 754194, 762594, 776827, 797035, 822840, 853652, 889080, 929110, 973466, 1020470, 1066365, 1105708, 1132710, 1143114, 1135954, 1114054, 1082646, 1047117, 1011543, 978536, 949654, 925757, 907300, 894625, 888061, 887970, 894868, 909386, 931925, 962503, 1001181, 1048464, 1104879, 1170114, 1242540, 1319016, 1394249, 1460205, 1507166, 1526998, 1516711, 1479591, 1423108, 1355410, 1283155, 1211512, 1144781, 1086043, 1036404, 995464]
56817I95464l2619k3954j4975o343J864J0191J8713K6806L4152M1112M7698N2661
56805A150770N3795M8781L6096J6246p411k9837m6897n6976o0558n9309n5406
56794I89294n0556m5019l8208l0420k3038j6835j1201n556m45L634P502J2340
56782G91492J8050K3431K7355K8856K6578J9445Q016n481j8403k8666l5054l7618
56770H18001l7646l6574l4864l2300k9043k5669k2469j9419j6745j4750j3171
56759E35351j1404r408p757o811o369o246o463o738o422n247l754k698k295k315
56745D51424k508k720k756k464j994j692j749j973k030j802j464j176r31p88r29
56730D24448j309j496j266j081j420j887j711r93o48r54j125o16J8R4j35n4L07
$$ y = [995464, 962845, 938891, 923916, 917573, 919437, 929628, 948341, 975147, 1009299, 1050411, 1098109, 1150770, 1204565, 1253346, 1289442, 1305688, 1298277, 1268440, 1221543, 1164567, 1104009, 1044700, 989294, 938738, 893719, 855511, 825091, 802053, 785218, 774017, 768461, 768016, 771650, 779152, 791492, 809542, 832973, 860328, 889184, 915762, 935207, 943223, 937742, 919339, 890673, 855619, 818001, 780355, 743781, 708917, 676617, 647574, 621905, 599436, 580017, 563272, 548522, 535351, 523947, 514539, 506782, 499971, 493602, 487356, 480893, 474155, 467733, 462486, 458732, 456034, 453739, 451424, 448916, 446196, 443440, 440976, 438982, 437290, 435541, 433568, 431538, 429736, 428272, 427096, 426165, 425377, 424448, 423139, 421643, 420377, 419296, 417876, 415989, 414278, 413285, 412637, 411683, 410558, 409942, 409960, 410054, 409919, 409865, 410172]
56713D10172N19N37N66N52M51O22J205J507P62o78j729j961j879j866j744j415
56697D05621j259j562k076k387k370k126j777j459j264j097q33o36q53j507k149
56682C82266k265j769j042n92o00p39n98k61k64p81j307j308r39p43q71j004r25
56665C66258q30j016j475j844j752j260q33p54o84k47J99J1o15p38p8N99P70Q78
56647C56589J265J353P16J51N87J519J724J163R38J505K145K290K241K240J912
56632C78338J151O68J072K027K856L437L877L811K885J676J309J987K563J918
56618D09575K92j136j673j582j273p43QN66O22M97O35Q35N95L7j79J35M52L03
56600D07966k90j247k557l812m327m026l606l506l386k885k211j616r92l88k59
$$ y = [410172, 410691, 411228, 411794, 412346, 412797, 413419, 414624, 416131, 416893, 416215, 414486, 412525, 410646, 408780, 407036, 405621, 404362, 402800, 400724, 398337, 395967, 393841, 392064, 390605, 389341, 388244, 387411, 386775, 385922, 384415, 382266, 380001, 378232, 377190, 376598, 375998, 375259, 374661, 374400, 374136, 373355, 372048, 370740, 369801, 369058, 368187, 367183, 366258, 365428, 364412, 362937, 361093, 359341, 358081, 357248, 356494, 355810, 355563, 355762, 355773, 355158, 354420, 354342, 354941, 355711, 356589, 357854, 359207, 359923, 360074, 360661, 362180, 363904, 365067, 366005, 367510, 369655, 371945, 374186, 376426, 378338, 379489, 380157, 381229, 383256, 386112, 389549, 393426, 397237, 400122, 401798, 403107, 405094, 407657, 409575, 409867, 408731, 407058, 405476, 404203, 403460, 403468, 404034, 404656, 405153, 405788, 406623, 407218, 407255, 407076, 407211, 407663, 407966, 407676, 406429, 403872, 400060, 395733, 391707, 388101, 384595, 381209, 378324, 376113, 374497, 373505, 373117, 372858]
56585C72858o58q99n82k71m73o83j91P16J193J069P17J41q42j737j623l81J083
56568C69437J901K019J918K059K585L212L492L451L706M704O143P478Q524R121
56554D29750Q809P406N590M277L709L597L721L826L407K276J045M00K37L4l33
56539D77751p41j330k197k980l351l513l671l683l754m723o753q502q632p531
56525D16390o449n629m580l655l731m552m854m233l556l388l321k927k299j427
56511C61789k12P32M28r92k163k195j628j360j489j533j140k82O60R16J24j000
56495C50655j463j385j628k178k042q94L19P07M43O5k40l77j59K11K04k29n63
56478C41446n82n98o58l80K43P04Q29R80J219J092N05l5k60m05m88j72M15P56
$$ y = [372858, 372200, 371301, 370719, 370448, 369975, 369292, 369101, 369817, 371010, 372079, 372796, 372937, 372095, 370358, 368735, 368354, 369437, 371338, 373357, 375275, 377334, 379919, 383131, 386623, 390074, 393780, 398484, 404627, 412105, 420629, 429750, 438559, 445965, 451555, 455832, 459541, 463138, 466859, 470685, 474092, 476368, 477413, 477813, 478050, 478084, 477751, 477010, 475680, 473483, 470503, 467152, 463639, 459968, 456285, 452531, 447808, 441055, 432553, 423921, 416390, 409941, 404312, 399732, 396077, 392346, 387794, 382940, 378707, 375151, 371763, 368442, 365515, 363216, 361789, 361577, 362309, 362737, 361745, 359582, 357387, 355759, 354399, 352910, 351377, 350237, 349955, 350615, 351531, 351655, 350655, 349192, 347807, 346179, 344001, 341959, 341065, 341384, 342091, 342534, 342599, 342359, 341982, 341823, 342034, 342238, 342009, 341446, 340864, 340266, 339608, 339228, 339471, 340175, 341004, 341984, 343203, 344295, 344800, 344765, 344505, 344100, 343612, 343440, 343855, 344611]
56460C44611R81J811L063L355J914k16j435j376p95l26n0J23K47L60M33M94P34
56443C53928J157J282P58J00K2K40j17r83j351q98m56n68o88k70L69P33Q18O27
56425C54703j05j195j802j424n50N9R6l87j061j159j23J367J976J531J246J820
56409C54992K459K222J281L03m55q73p01j30J64M3J37O54R09M55k90r43j701k460
56391C56066k557j952j563j751j634o61K84L46J33N81J282J142K03m18k3J063
56375C50541K111K513K113J498J539K205K553K163J742J792J682Q14k53p04o53
56360C71656n70l35J86L65l91j560k182k131j886j589j103n74k28M6L01K87O4
56343C60356K02P84R90L22n06n87K8Q34J715K464K430J503P02Q09J184R20L85
$$ y = [344611, 345592, 347403, 350466, 353821, 355735, 355519, 354084, 352708, 351913, 351587, 351537, 351660, 351907, 352267, 352700, 353194, 353928, 355085, 356367, 357125, 357225, 357247, 357487, 357370, 356387, 355036, 354138, 353682, 353114, 352426, 352156, 352525, 353258, 354076, 354703, 354598, 353403, 351601, 350177, 349627, 349686, 349782, 349395, 348334, 347175, 347052, 348419, 350395, 351926, 353172, 354992, 357451, 359673, 360954, 361257, 360802, 359929, 359228, 359098, 359262, 359305, 359442, 360096, 361005, 361460, 361170, 360227, 358526, 356066, 353509, 351557, 349994, 348243, 346609, 345948, 346232, 346578, 346711, 347292, 348574, 349716, 349919, 349501, 349478, 350541, 352652, 355165, 357278, 358776, 360315, 362520, 365073, 367236, 368978, 370770, 372452, 373266, 373013, 372309, 371656, 371086, 370751, 370937, 371302, 370911, 369351, 367169, 365038, 363152, 361563, 360460, 359886, 359658, 359704, 360005, 360292, 360356, 360558, 361342, 362332, 362654, 362148, 361561, 361589, 362423, 364138, 366602, 369032, 370535, 371237, 372046, 373230, 374150, 374535]
56326C74535M82J046J153N97Oj73J39J018K273L126L018K320J618Q58j10p92p60
56309C90354n15p61j355j728j793j609q97K62R54O84M53J414L012L655K822J449
56293C96401M71O3R8M46P98Q84Q09P25N49L78O14J214J527J320J201J530J800
56276D10828J703J729K036J889J085P22J521K512K591K199K207K275J842J622
56262D36761K469L612L770L306L481M172M189L460L175L791M616N231N923O627
56248D94583O805O434O014N692N324N150N388N604N436N456O237P132P186O658
56234E79099O309N895M765L345K445J680K03j397j780j099q36j486k181k532l127
56219E89303l984m254l730l256l216k990k206j397r99p55m24k52m41q24j152j208
$$ y = [374535, 375017, 376063, 377216, 377813, 377819, 377646, 377785, 378803, 381076, 384202, 387220, 389540, 391158, 392016, 391906, 391114, 390354, 389839, 389078, 387723, 385995, 384202, 382593, 381696, 381958, 382912, 383596, 384049, 385463, 388475, 392130, 394952, 396401, 396872, 396935, 397033, 397479, 398277, 399161, 399970, 400695, 401244, 401622, 402236, 403450, 404977, 406297, 407498, 409028, 410828, 412531, 414260, 416296, 418185, 419270, 419992, 421513, 424025, 426616, 428815, 431022, 433297, 435139, 436761, 439230, 442842, 446612, 449918, 453399, 457571, 461760, 465220, 468395, 472186, 476802, 482033, 487956, 494583, 501388, 507822, 513836, 519528, 524852, 530002, 535390, 540994, 546430, 551886, 558123, 565255, 572441, 579099, 585408, 591303, 596068, 599413, 601858, 603538, 603741, 602344, 600564, 599465, 598629, 597143, 594962, 592430, 589303, 585319, 581065, 577335, 574079, 570863, 567873, 565667, 564270, 563271, 562516, 562092, 561840, 561399, 560575, 559423, 558215]
56203E58215q46m08o31j479j792q74K94N37L01P69J875K623K779K874K985K905
56187E70127K978L457L547K511J141P64J278J675J884K557L527M051M188M538
56173F08223M999N151N224N387M886L400K284K766L872L958L396L672M739N421
56159F67378N648O071O256N624N360O857Q964R517Q967R577J1412J2364J2116
56146G76111J2798J5267J7788J9229K0803K3620K6879K9558L1931L4608L7807
56135A046399M2140M8405N6221O4512P3366Q3539R4100J02595J07568J08844J05590
56124A933279R6701Q3519O9800N8484N0312M5294M2959M0973L6196K7812J7491
56113B502820O593m368j3723j9252k1411k3480k8004l5368m5730n9226p3741q5410
$$ y = [558215, 557369, 556961, 556330, 554851, 553059, 552185, 552479, 553016, 553317, 554086, 555961, 558584, 561363, 564237, 567222, 570127, 573105, 576562, 580109, 582620, 583761, 584525, 585803, 587478, 589362, 591919, 595446, 599497, 603685, 608223, 613222, 618373, 623597, 628984, 633870, 637270, 639554, 642320, 646192, 650150, 653546, 657218, 661957, 667378, 673026, 679097, 685353, 690977, 696337, 703194, 712158, 721675, 730642, 740219, 751631, 763995, 776111, 788909, 804176, 821964, 841193, 861996, 885616, 912495, 942053, 973984, 1008592, 1046399, 1088539, 1136944, 1193165, 1257677, 1331043, 1414582, 1508682, 1611277, 1718845, 1827689, 1933279, 2029980, 2113499, 2183299, 2241783, 2292095, 2337389, 2380348, 2421321, 2457517, 2485329, 2502820, 2509413, 2505045, 2491322, 2472070, 2450659, 2427179, 2399175, 2363807, 2318077, 2258851, 2185110, 2099700]
56101B099700r2217r4840r3830q8824q0881p2478o4433n5590m6140l8249l2709
56090A339509k7875k2715j8109j4463j0949p733o007n198l168J98K754L915N358
56077A235517P379Q170P559P719R198R985R632J0420J3037J5066J5292J5708J7499
56064A382181J8885J8789J8924K0232K0926K0056J9489K0316K0865K0280K0363
56053A601306K1798K2272K0602J9030J9128J9192J8112J8029K0369K2991K4048
56042A826877K5198K8115L1298L3145L4842L7424L9333L9684M0488M2988M5224
56031B224616M5949M7214N0227N2563N2565N2690N5233N8385N9932O1172O3785
56020B824331O6415O7756O9487P2877P6040P7781Q0420Q5510R0678R4038R7675
$$ y = [2099700, 2007483, 1912643, 1818813, 1729989, 1649108, 1576630, 1512197, 1456607, 1410467, 1372218, 1339509, 1311634, 1288919, 1270810, 1256347, 1245398, 1237665, 1231658, 1226460, 1223292, 1223490, 1226244, 1230159, 1235517, 1242896, 1251066, 1258625, 1266344, 1275542, 1285527, 1295159, 1305579, 1318616, 1333682, 1348974, 1364682, 1382181, 1401066, 1419855, 1438779, 1459011, 1479937, 1499993, 1519482, 1539798, 1560663, 1580943, 1601306, 1623104, 1645376, 1665978, 1685008, 1704136, 1723328, 1741440, 1759469, 1779838, 1802829, 1826877, 1852075, 1880190, 1911488, 1944633, 1979475, 2016899, 2056232, 2095916, 2136404, 2179392, 2224616, 2270565, 2317779, 2368006, 2420569, 2473134, 2525824, 2581057, 2639442, 2699374, 2760546, 2824331, 2890746, 2958502, 3027989, 3100866, 3176906, 3254687, 3335107, 3420617, 3511295, 3605333, 3703008]
56009C703008J03339J08902J12658J16853J23253J29640J34460J40430J49628
56000D822171J59528J67864J76705J87848J99112K09244K21284K36930K52984
55991F633670K67498K83620L03070L22242L39439L59169L84293M11071M37357
55982I741429M67995N06176N47576N89557O37778O96470P60932Q27376R01358
55973A5676647R88243J084742J188672J307228J446531J603640J778883J984511
55965B7059097K230524K514972K840429L226517L693431M249449M910793N717078
55957E6442290O709902P914371R359595J1092800J3147591J5520928J8203335
55950A38390812K1191887K4429354K7752399L0894316L3383515L4272928L2096603
$$ y = [3703008, 3806347, 3915249, 4027907, 4144760, 4268013, 4397653, 4532113, 4672543, 4822171, 4981699, 5149563, 5326268, 5514116, 5713228, 5922472, 6143756, 6380686, 6633670, 6901168, 7184788, 7487858, 7810100, 8149539, 8508708, 8893001, 9304072, 9741429, 10209424, 10715600, 11263176, 11852733, 12490511, 13186981, 13947913, 14775289, 15676647, 16664890, 17749632, 18938304, 20245532, 21692063, 23295703, 25074586, 27059097, 29289621, 31804593, 34645022, 37871539, 41564970, 45814419, 50725212, 56442290, 63152192, 71066563, 80426158, 91518958, 104666549, 120187477, 138390812, 159582699, 184012053, 211764452, 242658768, 276042283, 310315211, 342411814]
55943C42411814K5541954J4577780R97497j2318057k2873669k9555770l2573422
55936B86208127l2793557l1172342k8512154k5398626k2204923j9151286j6372745
55929A10602494j3938462j1850894j0076085q581475p336542o298227n422419
55922D7098390m683420m065939l547450l104200k725444k406471k134864j896918
55914B2533684j689924j515079j364801j228935j107057j003061r13224q30522
55906A2881081p55455o92093o37927n87317n40735n01463m67108m32983m00144
55897G865856l71945l46343l19482k93329k72060k54026k34763k14851j97744
55888E361313j82577j66091j49037j34019j19367j01611q1840o3430m5652k5521
$$ y = [342411814, 367953768, 382531548, 383529045, 371210988, 348337319, 318781549, 286208127, 253414570, 222242228, 193730074, 168331448, 146126525, 126975239, 110602494, 96664032, 84813138, 74737053, 66155578, 58819036, 52520809, 47098390, 42414970, 38349031, 34801581, 31697381, 28971937, 26565466, 24430602, 22533684, 20843760, 19328681, 17963880, 16734945, 15627888, 14624827, 13711603, 12881081, 12125626, 11433533, 10795606, 10208289, 9667554, 9166091, 8698983, 8266000, 7865856, 7493911, 7147568, 6828086, 6534757, 6262697, 6008671, 5773908, 5559057, 5361313, 5178736, 5012645, 4863608, 4729589, 4610222, 4508611, 4426771, 4363341, 4317689, 4292168]
55878D292168m051J5019L0679M3069M8400M1423K1997n778l9457p8101j17621
55867D247747j51634j76668j92617j99182j96255j86690j74512j60944j45644
55858B663601j30329j17366j06066r4334q2847p3894o7241o0917n5035n1107m8544
55847A775921m5461m2141m0250l9382l7667l5134l3338l2385l1172k9788k8920
55836A380283k7892k5963k4415k4593k5172k4126k2170k1275k1114k0079j8642
55825A124842j8477j9170j8958j7947j7706j8314j8647j8770j9368j9645j8455
55814I19385j6621j5530j4439j1944r057p799p703o693m762l692l733l476k585
55801H11351j910j264K16J866K210J473J079J206J099J015J373R35j509m545n993
$$ y = [4292168, 4288117, 4303136, 4333815, 4376884, 4425284, 4466707, 4488704, 4482926, 4443469, 4365368, 4247747, 4096113, 3919445, 3726828, 3527646, 3331391, 3144701, 2970189, 2809245, 2663601, 2533272, 2415906, 2309840, 2215506, 2132659, 2058765, 1991524, 1930607, 1875572, 1824465, 1775921, 1730460, 1688319, 1648069, 1608687, 1571020, 1535886, 1502548, 1470163, 1438991, 1409203, 1380283, 1352391, 1326428, 1302013, 1277420, 1252248, 1228122, 1205952, 1184677, 1163563, 1143484, 1124842, 1106365, 1087195, 1068237, 1050290, 1032584, 1014270, 995623, 976853, 957485, 937840, 919385, 902764, 887234, 872795, 860851, 851794, 843995, 836292, 829599, 824837, 821145, 817412, 813936, 811351, 809441, 808177, 808393, 810259, 812469, 813942, 815021, 816227, 817326, 818341, 819714, 820649, 819140, 814595, 808602]
55786H08602o470q087j0422j1102r982r467j0782j2994j5605j8966k1950k2401
55774F50374k0344j7989j6222j3814j0494p918o869o062m514k906j854j012m70
55761E39906r91k229k781k478k613l451l641k740k174k896m006m573n097o252
55747D93984p631q586r138r388r207q859q856q887q132o774n869n615n113l942
55733C87987k692j813j287j420k500l704l888l403l629m730n493n436n258n135
55719C37599m359k996k156k252k516k545k751k920k057j21J639K500L020L585
55705C23670L723L266K725K121P94j131k621l443m554o308p751q234q295q348
55691B85614p835o455m932l907l157k494k339k709k770k056j175p41m55J53R53
$$ y = [808602, 802132, 794045, 783623, 772521, 762539, 753072, 742290, 729296, 713691, 694725, 672775, 650374, 630030, 612041, 595819, 582005, 571511, 563593, 556724, 550662, 546148, 543242, 541388, 540376, 539906, 538915, 536686, 533905, 531427, 528814, 525363, 521722, 518982, 516808, 513912, 509906, 505333, 500236, 493984, 486353, 477767, 468629, 459241, 450034, 441175, 432319, 423432, 415300, 408526, 402657, 397042, 391929, 387987, 385295, 383482, 382195, 380775, 378275, 374571, 370683, 367280, 363651, 358921, 353428, 347992, 342734, 337599, 333240, 330244, 328088, 325836, 323320, 320775, 318024, 315104, 313047, 312926, 314565, 317065, 320085, 323670, 327393, 330659, 333384, 335505, 336299, 335168, 332547, 329104, 324550, 318242, 310491, 302257, 293962, 285614, 277779, 271324, 266392, 262485, 259328, 256834, 254495, 251786, 249016, 246960, 245785, 245044, 244589, 244742, 245695]
55676B45695J594J925J664M92j185k383k729k730k757k641k396k331k317j892
55662B28009j205q52p24j81O48R24O52Q63J920K968L410L699M218M524M299L991
55646B57163L950L755K897J449k28j749k607k663k673l432m476m720m258m202
55632B38206m813n205n082n170n641n622m739l787l275k715j880j422j626j739
55618A85490j284p75n56j65N24P08K3p18q98j094j802k317j913j217j284k041
55602A70681k649k809k766k488j747p42N6M44M66J46l52p13q09p38m33J99P48
55585A56494O55J40j0L33M68J01k35j72m5j70m63q73j310j058O31L200N115N721
55567A68522N638N234M077K185M86m71r87j106m64L25j97k170l895m318m452n327
$$ y = [245695, 247289, 249214, 250878, 251370, 250185, 247802, 245073, 242343, 239586, 236945, 234549, 232218, 229901, 228009, 226804, 225952, 225228, 225047, 225695, 226619, 227271, 228134, 230054, 233022, 236432, 240131, 244349, 248873, 253172, 257163, 261113, 264868, 267765, 269214, 268986, 267237, 264630, 261967, 259294, 255862, 251386, 246666, 242408, 238206, 233393, 228188, 223106, 217936, 212295, 206673, 201934, 198147, 194872, 192157, 190277, 188855, 187229, 185490, 184206, 183431, 182875, 182710, 183234, 183942, 183965, 183247, 182349, 181255, 179453, 177136, 175223, 174006, 172722, 170681, 168032, 165223, 162457, 159969, 158222, 157480, 157536, 157980, 158446, 158592, 158240, 157527, 156718, 155980, 155547, 155746, 156494, 157149, 157289, 157279, 157612, 158080, 158181, 157946, 157774, 157729, 157559, 157096, 156223, 154913, 153855, 154486, 157686, 162801, 168522, 174160, 179394, 183471, 185656, 186142, 185671, 184684, 183578, 183114, 183439, 183242, 181072, 177177, 172859, 168407, 163080]
55551A63080o133n667m281k981j781m01L97j64j246j381o83n95j690k998l439
55536A30037k892j871r62o03q11j168j342j351j120l73O32J076P13K94L89O24
55520A21272N84N72Q15Q74O32Q13J698K205J388m6p37n60l71n23p08q50j078j261
55502A24719j410k026l123l658k926j945k180l397m014l362k291j684j459j180
55488I0064o59J10R67J421J110L53j76j71L12J159J992K171J614J186J622K539
55472A05614L036K790J936N79q35j319m68P48J208J051R91Q48J5j116j493r78
55456A12607m60m07l73J1M69N32j1j019j810j477k5J267J388Q95P80P89R7q96
55438A12357j016k59J87j27m07k26k16q15j555j961k108j909r13O53J627J276
$$ y = [163080, 156947, 151280, 146999, 144018, 142237, 141836, 142233, 142069, 140823, 139442, 138759, 138164, 136474, 133476, 130037, 127145, 125274, 124312, 123709, 122898, 121730, 120388, 119037, 117917, 117544, 118176, 119252, 119965, 120259, 120648, 121272, 121856, 122428, 123243, 124117, 124749, 125562, 127260, 129465, 130853, 130807, 130070, 129510, 129139, 128616, 127908, 127058, 125980, 124719, 123309, 121283, 118160, 114502, 111576, 109631, 107451, 104054, 100040, 96678, 94387, 92703, 91244, 90064, 89405, 89515, 90482, 91903, 93013, 93366, 93190, 93019, 93331, 94490, 96482, 98653, 100267, 101453, 103075, 105614, 108650, 111440, 113376, 113955, 113120, 111801, 111333, 112081, 113289, 114340, 115331, 116179, 116194, 115078, 113585, 112607, 112147, 111740, 111367, 111378, 111847, 112379, 112368, 111349, 109539, 108062, 108037, 109304, 110692, 111587, 112367, 113156, 113253, 112357, 111341, 111082, 111269, 111142, 110735, 110509, 110293, 109478, 107923, 105962, 103854, 101945, 101032, 101685, 103312, 104588]
55422A04588K34l91k48L69J123J709J780J387J109J336J694J476N00o88j356j254
55406A13368p71m57l72k31j47n84j385j660j111o59j026j497j047lN54M64L00
55389A03736M7o32j133m84Q88J517J089P51J038J096M11j83K6N23O53O19O43K68
55371A10873o01j042n21N5k97j011r11o1N15M68K92J41l03q31p13J03P93Q92R01
55352A08742J300J632J126r1r91q39k3M26P5n21o47m03m15q12j056q04l34P5N35
55333A06975R44O82m83j601j476k03R17J016M62p5n83j281j782j433m01L11J11
55316A02100l92k37O03J249J122N45J13K8K46P46J259J185K94p56j133q05l90
55299A05777k08n6J84L42L61M33O77J042J472J810J637P74j61k60N17J257J261
$$ y = [104588, 104822, 104431, 104183, 104552, 105675, 107384, 109164, 110551, 111660, 112996, 114690, 116166, 116666, 115978, 114622, 113368, 112597, 112140, 111768, 111537, 111390, 110806, 109421, 107761, 106650, 105991, 104965, 103468, 102421, 102418, 102972, 103436, 103736, 103783, 103151, 102018, 101534, 102422, 103939, 105028, 105779, 106817, 107913, 108324, 108141, 108167, 108690, 109343, 109962, 110605, 110873, 110272, 109230, 108709, 108764, 108467, 107456, 106545, 106484, 106999, 107467, 107759, 107900, 107597, 106766, 106053, 106156, 106949, 107841, 108742, 110042, 111674, 112800, 112709, 111718, 110879, 110856, 111282, 111357, 110836, 110189, 109786, 109371, 108559, 107503, 106699, 106365, 106440, 106975, 107919, 108601, 108118, 106517, 105041, 104838, 105755, 106771, 107233, 107158, 106575, 105294, 103512, 102079, 101678, 101989, 102100, 101708, 101471, 102074, 103323, 104445, 104990, 105103, 105131, 105377, 106123, 107382, 108567, 108861, 108105, 106972, 106167, 105777, 105569, 105513, 105697, 106039, 106400, 106833, 107510, 108552, 110024, 111834, 113471, 114245, 114084, 113824, 114341, 115598, 116859]
55282A16859P53K85m4m40q66r88n23M33J289J263J83j124j603j071j68O02J105
55265A15945J044J05j193j690j052k84k60n10p8R19J490J235P57P02J040J376
55249A19546J441J091K70p63j453j439r37m83l74m10k09L26R05J190J109P29l
55232A20536j080k049k224j443l95J07mo4M17J096J144K19j058j697j338m54M14
55215A12127J122J537J218R1r82r89j25L97o6q04q48k16L45L82O1k66l71j32L75
55196A12856P79P44L83K18N95J274J611J175J18r39j399j081k39O12R65O86K12
55179A18570J39N05Q09Q33R50J314J326N02n19o87l7L56n0n43l29L65P88O70L87
55160A25349L42O41J061J135N12n09j157j000m26m8j3r4j42j71j75j71k31l53
$$ y = [116859, 117612, 117897, 117853, 117413, 116547, 115559, 115036, 115469, 116758, 118021, 118204, 117080, 115477, 114406, 114238, 114840, 115945, 116989, 117094, 115901, 114211, 113159, 112875, 112615, 112105, 112027, 112946, 114436, 115671, 116428, 117130, 118170, 119546, 120987, 122078, 122348, 121585, 120132, 118693, 117756, 117273, 116899, 116489, 116280, 116606, 117511, 118701, 119810, 120539, 120536, 119456, 117407, 115183, 113740, 113345, 113452, 113448, 113384, 113801, 114897, 116041, 116260, 115202, 113505, 112167, 111713, 112127, 113249, 114786, 116004, 116095, 115113, 114124, 113999, 114396, 114330, 113526, 112678, 112462, 112807, 113189, 113250, 112984, 112613, 112481, 112856, 113635, 114379, 114762, 114980, 115575, 116849, 118460, 119635, 119753, 118814, 117415, 116334, 116095, 116707, 117672, 118358, 118570, 118709, 119214, 120023, 120856, 121806, 123120, 124446, 124948, 124429, 123742, 123705, 124061, 124011, 123468, 123139, 123504, 124292, 124962, 125349, 125691, 126332, 127393, 128528, 129040, 128531, 127374, 126374, 125948, 125900, 125887, 125793, 125651, 125480, 125305, 125134, 124903, 124550]
55142A24550m00l24k61l14m43o01p53o65m9Q91J423J053J20n95p66p68j070j567
55124A19461j623q41K52O29kp52p36k51j45l92k02N26R05N10Q7L42R02J099J098
55105A20867J354J567J137L64J85P79J294J094N25K22K92M66O21P33O79L47j26
55088A32400m79n05j08N66J020O95l31j248j340p66k56j93l37l82l84n31p98j086
55070A25937j412j726j706j108k03M61O76O64N27J44m15p59p78q39j132j220o58
55053A16453K74R09J060J049J049R13O32M12L64M50P17J142J275O00o84j659j620
55036A23336o84N31J502J966J885J443Q78J98o90j594k033j714q76r9J66k6r8
55019A24091M38J255J419N72m68p41l44l0K6K58O69O77R2m70l57M12J354J939
$$ y = [124550, 124150, 123826, 123565, 123251, 122808, 122207, 121454, 120789, 120740, 121631, 123054, 124107, 124227, 123632, 122866, 122098, 121028, 119461, 117838, 116997, 117249, 117878, 117876, 117124, 116388, 116137, 115992, 115600, 115398, 115924, 116829, 117339, 117426, 117768, 118670, 119769, 120867, 122221, 123788, 124925, 125289, 125474, 126253, 127547, 128641, 129166, 129388, 129680, 130146, 130767, 131500, 132179, 132526, 132400, 131921, 131416, 131308, 131874, 132894, 133589, 133258, 132010, 130670, 129904, 129648, 129455, 129118, 128736, 128352, 127821, 127023, 125937, 124525, 122799, 121093, 119985, 119782, 120243, 120919, 121583, 122110, 122254, 121839, 121080, 120302, 119463, 118331, 117111, 116453, 116727, 117636, 118696, 119745, 120794, 121707, 122339, 122751, 123115, 123565, 124282, 125424, 126699, 127299, 126615, 124956, 123336, 122652, 123183, 124685, 126651, 128536, 129979, 130857, 131055, 130365, 128771, 126738, 125024, 124148, 124049, 124215, 124189, 124091, 124529, 125784, 127203, 127775, 127307, 126566, 126222, 126192, 126218, 126476, 127145, 127822, 127914, 127444, 127087, 127499, 128853, 130792]
55001A30792J777R39J01q5J78K36P0K60Q78J247R71M88L36M61N74N30K24l22o51
54982A39004k54N88J036Q55N62M05R5k99k63L9k55j173j518p26J25M0k34M94J780
54963A40301K208J518P20L15j92r93j459j224p85o27m71J46J064J626J451Q02
54947A44400L31M58R70J291J191R02N20j64j039j444r93j45M83Q66J113R10J16
54930A49766n50k10J000K182K817L049L031K806K712L225M344N608O619P181P161
54915B00741O728O405O422O210N121L260J141j078l303m961n602n746o149o560
54901B02629o185n208m690m939n101m521l523k489j266Q8Q61O12r0m40m21n06
54885A64811p42o76m2Q94J604J783J678J947K999M493N751O560P169P658P822
$$ y = [130792, 132569, 133508, 133609, 133524, 133702, 133938, 134008, 134268, 135146, 136393, 137364, 137852, 138188, 138649, 139223, 139753, 139977, 139655, 139004, 138750, 139338, 140374, 141229, 141791, 142196, 142291, 141992, 141729, 141768, 141513, 140340, 138822, 138096, 138221, 138261, 138027, 138521, 140301, 142509, 144027, 144747, 145062, 144870, 143877, 142418, 141194, 140409, 139782, 139311, 139457, 140521, 142147, 143598, 144400, 144731, 145189, 146159, 147450, 148641, 149543, 150063, 149899, 148860, 147416, 146423, 146278, 146761, 147627, 148740, 149650, 149766, 149216, 149006, 150006, 152188, 155005, 158054, 161085, 163891, 166603, 169828, 174172, 179780, 186399, 193580, 200741, 207469, 213874, 220296, 226506, 231627, 234887, 236028, 234950, 231647, 226686, 221084, 215338, 209189, 202629, 196444, 191236, 186546, 181607, 176506, 171985, 168462, 165973, 164707, 164795, 165656, 166268, 166178, 165738, 165317, 164811, 164069, 163393, 163351, 164245, 165849, 167632, 169310, 171257, 174256, 178749, 184500, 191060, 198229, 205887, 213709]
54870B13709P606P077N957L846R92j675l496m600n383n951o262o375o295n969
54856A93181n530n229n004m543l810l150k775k579k440k371k339k289k343k428
54842A46351k006p70N02O64k09q15m01L71O10L69R7k12o05n83K22J129J030j68
54824A45576j359j558r08k77k05m46m41k3M56P31R64J305J411R59L63L23P60R29
54806A48560N74K28J58r8p71j267j019l45J09K35K80K30Oj69k7K72M36M67M54
54787A48313L14J03J48M64M58j51o22k6J433K598K753K226J688J490J655K068
54771A64912K466K648K734L029L643M489N536O796Q125R180R588R068P715O183
54757B46112N167M446K967J85l176o061q186r639j0033r029p371o282n881n165
$$ y = [213709, 221315, 228392, 234349, 238195, 239187, 237512, 234016, 229416, 224033, 218082, 211820, 205445, 199150, 193181, 187651, 182422, 177418, 172875, 169065, 165915, 163140, 160561, 158121, 155750, 153411, 151122, 148779, 146351, 144345, 143575, 144077, 144741, 144532, 143717, 143316, 143687, 144297, 144666, 144763, 144551, 143946, 143363, 143585, 144714, 145744, 145576, 144217, 142659, 141751, 141474, 141269, 140823, 140382, 140359, 140815, 141546, 142510, 143815, 145226, 146185, 146548, 146871, 147631, 148560, 149134, 149362, 149520, 149422, 148651, 147384, 146365, 146020, 146129, 146364, 146644, 146874, 146880, 146711, 146684, 146956, 147392, 147859, 148313, 148627, 148730, 148878, 149342, 149800, 149649, 149027, 149001, 150434, 153032, 155785, 158011, 159699, 161189, 162844, 164912, 167378, 170026, 172760, 175789, 179432, 183921, 189457, 196253, 204378, 213558, 223146, 232214, 239929, 246112, 251279, 255725, 258692, 258877, 255701, 249640, 241454, 231815, 221782, 212753, 205382, 199100, 193219, 188054]
54743A88054l694k293j737j624j162l90R1J85L54P67R74O47J28R2P20J427J454
54726A83993P39J26N31J989L674M851N534O099O590O673O209N494M799L890K257
54711B43448j34k589m369n487o483p517q054p632o494n167l844k560j709j737
54697A79672k410k938k966k828k765k468j740j030q21q20m08K82M49j51p52o16
54681A57690m9J25k66o56o33l16J29P67J450J677J199L57m24j123j700j694q91
54664A55642K2K11j02k9M13J64j146k337k135q10L85Q64R86J055R33O20M55N96
54646A55787Q21R66J056R71N17k2kO58J131P25j47n28k47p5n30j126j081m71j18
54627A58285m80j074j168p07j74J15K70M07M20K44K2j16j22Q8N28Q13L87o86j591
$$ y = [188054, 184360, 182067, 180330, 178706, 177544, 177154, 177245, 177430, 177784, 178551, 179525, 180172, 180300, 180392, 181112, 182539, 183993, 184732, 184858, 185389, 187378, 191052, 195903, 201437, 207536, 214126, 220799, 227008, 232502, 237301, 241191, 243448, 243314, 240725, 236356, 230869, 224386, 216869, 208815, 201183, 194689, 189522, 185678, 183118, 181409, 179672, 177262, 174324, 171358, 168530, 165765, 163297, 161557, 160527, 159706, 158886, 158478, 158760, 159209, 159058, 158306, 157690, 157641, 157766, 157500, 156844, 156211, 155895, 156024, 156791, 158241, 159918, 161117, 161474, 161050, 159927, 158227, 156533, 155642, 155664, 155875, 155773, 155744, 156157, 156321, 155175, 152838, 150703, 149893, 150278, 151142, 152128, 153183, 154116, 154736, 155191, 155787, 156608, 157574, 158630, 159601, 160118, 160096, 160094, 160752, 161883, 162608, 162461, 161933, 161686, 161611, 161081, 159955, 158874, 158403, 158285, 157805, 156731, 155563, 154856, 154682, 154797, 155067, 155474, 155894, 156138, 156160, 156044, 155922, 156010, 156538, 157351, 157738, 157052, 155461]
54608A55461j662j064k53P00J702K129J441K06l41J85R61J197J038R78J051J033
54592A64762R28P87M28j76n34k35L62N08J07k23m4M32Q29J062J131Q90L07l25
54574A70996o78o87l90J70P15P22J05m29j39P20J180P96J27j44K8L15N55O69M98
54555A75129J52J22O19J083R41M80M36Q10Q83L32l53p07q13p21j30Q82J476J058
54537A81679L49N54J745K715K493J403M78L83J095K079K519J827K99r42j094n57
54521A97025k98n63p35m45j79m62r89j065o21j94rK84Q12J057N93j68m80k72q7
54502A93204j95k41Q2N07N42Q3m98p72o64m48l82l36K7O64J015P34K12P8L30M64
54482A94406K88Q6J03L37Q28J549K068J912J354J212J680K034J751J320J416J887
$$ y = [155461, 153799, 152735, 152482, 153182, 154884, 157013, 158454, 158660, 158319, 158504, 159465, 160662, 161700, 162678, 163729, 164762, 165690, 166477, 166905, 166729, 166195, 165960, 166322, 166830, 166937, 166714, 166670, 167102, 167931, 168993, 170124, 171014, 171321, 170996, 170318, 169631, 169241, 169411, 170126, 170848, 170953, 170524, 170385, 171105, 172285, 173081, 173208, 173064, 173092, 173407, 173962, 174631, 175129, 175281, 175403, 176022, 177105, 178046, 178526, 178962, 179772, 180655, 180987, 180634, 179927, 179114, 178393, 178263, 179145, 180621, 181679, 182028, 182582, 184327, 187042, 189535, 190938, 191416, 191799, 192894, 194973, 197492, 199319, 199618, 198676, 197582, 197025, 196727, 196164, 195429, 194984, 194805, 194343, 193354, 192289, 191668, 191474, 191465, 191749, 192561, 193618, 194211, 194043, 193563, 193291, 193204, 193009, 192768, 192850, 193357, 193899, 193982, 193484, 192712, 192048, 191600, 191218, 190882, 190909, 191573, 192588, 193322, 193534, 193612, 193942, 194406, 194694, 194780, 194883, 195220, 196048, 197597, 199665, 201577, 202931, 204143, 205823, 207857, 209608, 210928, 212344, 214231]
54466B14231K084J857J604J597J723J824J848J752J529J251Q46J20p76j191p31
54451B29568M5J45o76j611j729r64r7J02l28o89n88n03j059j909k100j518j149
54434B14940j540j883j284k29J43k85n81k67J63K74L29O49J010J035P03J81m52
54417B12906j031j161n87M05J116J008J88n68m85L72J069Q85J14m76o96q70j021
54400B11168p60n3N41N99L08O0k6K1K07M21M08J66R9N01J026R79J13j015j530
54381B13233j084j53N28P65Q78J003Q34K16m91r77j451k060k241j330L54J674
54365B09698J882J180J93m78l22O90J659J433m7j555j945j290m82k21o02j233
54349B08560j492j046k81K8l76j063j535j666j456r81o07p09j049j033o86o10
$$ y = [214231, 216315, 218172, 219776, 221373, 223096, 224920, 226768, 228520, 230049, 231300, 232146, 232266, 231490, 230299, 229568, 229613, 229758, 229082, 227471, 225742, 224778, 224681, 224783, 224455, 223766, 223178, 222675, 221616, 219707, 217607, 216089, 214940, 213400, 211517, 210233, 210004, 210147, 209862, 209281, 209014, 209177, 209451, 209780, 210429, 211439, 212474, 213177, 213358, 212906, 211875, 210714, 210127, 210532, 211648, 212656, 212844, 212276, 211791, 212163, 213232, 214117, 214231, 213755, 213059, 212189, 211168, 210408, 210355, 210896, 211495, 211803, 211863, 211837, 211858, 212065, 212486, 212894, 213060, 213159, 213660, 214686, 215665, 215778, 214763, 213233, 212149, 211996, 212524, 213289, 214167, 215170, 216004, 216220, 215729, 214752, 213301, 211241, 209000, 207670, 208024, 209698, 211580, 212760, 212953, 212475, 212153, 212843, 214502, 215935, 215888, 214333, 212388, 211098, 210616, 210395, 209793, 208560, 207068, 206022, 205741, 205769, 205393, 204330, 202795, 201129, 199673, 198692, 198085, 197376, 196327, 195294, 194608, 193998]
54333A93998q64p20N8O28K73n48j031j207j472j521p86L79R84P36K86J48J63J25
54315A89629J35J72mk77q7P39J560J670J134N46K23Mk89n22m33l3K60j3p59j300
54295A92355j098l51L43P59J057J170P43j94r93j104p14l63k41j74j26k32m22
54278A90415l96m3L23L07j62p98j216j175p34k88l16q99j565j742j352q22m76
54261A79061j85K45N93M45j59o49o33l89m44q38j098q74l09K55O46Q57Q96Q48
54243A78268Q99J053R56L14o07j148r94m25J89P93J359J568J190N12j8l73p71
54226A82765j053q64m16m06r53j272p14L46J059J090O46k1o19o69m2N49K12r72
54208A78666k001k167j715j272j084r60o25J2P00R71O48J84K00P50J326J543J426
$$ y = [193998, 193134, 192414, 192472, 193100, 193373, 192825, 191794, 190587, 189115, 187594, 186808, 187187, 188171, 188907, 189193, 189341, 189504, 189629, 189764, 189936, 189932, 189655, 189568, 190307, 191867, 193537, 194671, 195217, 195440, 195444, 195155, 194633, 194200, 194167, 194427, 194414, 193655, 192355, 191257, 190906, 191249, 192008, 193065, 194235, 194978, 194784, 193791, 192687, 191973, 191610, 191369, 191195, 191069, 190837, 190415, 190019, 189976, 190299, 190606, 190444, 189646, 188430, 187255, 186521, 186233, 185917, 185018, 183453, 181711, 180359, 179537, 179061, 178876, 179121, 179714, 180159, 180000, 179351, 178718, 178329, 177885, 177047, 175949, 175075, 174766, 175021, 175667, 176524, 177420, 178268, 179167, 180220, 181176, 181490, 180883, 179735, 178741, 178316, 178505, 179298, 180657, 182225, 183415, 183927, 183909, 183536, 182765, 181712, 180848, 180432, 180026, 179073, 177801, 177087, 177433, 178492, 179582, 180228, 180207, 179588, 178919, 178877, 179426, 179638, 178666, 176665, 174498, 172783, 171511, 170427, 169467, 168842, 168854, 169554, 170525, 171173, 171357, 171557, 172307, 173633, 175176, 176602]
54191A76602J130P57M12J38k36q00j262j271r34o14l63p8Pl79q50p23j15J30k41
54172A71310m41J15Q71R92N91M97J098J907K170J587N38k48m07l03m51p10n52
54155A78564j8K83J87J61L47K56k31l75L48J390J917J772J152R0j108j554q16
54138A82365K81O98N93P50J131J028M07j0nj26o24j027j023r10r07p48k92O7m6
54119A81602m28o23l92K45J085J707J815J705J928K323J967M10j483k353j842
54104A87666q64n05r69j669k062k146k140j966j417p22l93l33K54J658K903K731
54088A80026J096r10k277k619j879l87R41J273Q19M36L83K41K9L67J332K142K325
54071A83338K331K527K462J749R24O54O57K22n88j101j104j006j008q06k45L08
$$ y = [176602, 177732, 178489, 178901, 179039, 178803, 178003, 176741, 175470, 174536, 173922, 173559, 173481, 173488, 173109, 172259, 171536, 171421, 171551, 171310, 170869, 170984, 171855, 172847, 173438, 173935, 175033, 176940, 179110, 180697, 181235, 180987, 180580, 180277, 179826, 179116, 178564, 178546, 178829, 179016, 179177, 179524, 179780, 179549, 179174, 179522, 180912, 182829, 184601, 185753, 185843, 184735, 183181, 182365, 182646, 183344, 183937, 184687, 185818, 186846, 187253, 187243, 187238, 187112, 186488, 185461, 184438, 183528, 182621, 181873, 181581, 181648, 181602, 181174, 180551, 180159, 180404, 181489, 183196, 185011, 186716, 188644, 190967, 192934, 193344, 191861, 189508, 187666, 186802, 186297, 185328, 183659, 181597, 179451, 177311, 175345, 173928, 173206, 172813, 172480, 172734, 174392, 177295, 180026, 181122, 180212, 177935, 175316, 173437, 173050, 173991, 175264, 176083, 176519, 176902, 177143, 177172, 177539, 178871, 181013, 183338, 185669, 188196, 190658, 192407, 193331, 193985, 194642, 194864, 194276, 193175, 192071, 191065, 190057, 189251, 189006, 189314]
54055A89314L96J0l57j15Q56J873J984J080K05L39J233J887J851J520J292J178
54039B04546J168J313J353R18K92L56J460K874L766M205M736N319N389M837M280
54024B46812M229M423M265L581K745K178J940J741J255N39R3L52J071J514J297
54009B78035P18L3j067k744m169m253l222k600l339m553m728l612k288j676j633
53994B38902j550j193p61m63l39l82o10j019j381j245l95O75J097O01j95o76r16
53977B30150j201j343r98k86M75J285K153K660K575K581L521N126O404P174Q117
53962B68393R353J0230J0810J2239J4994J7869J9483J9807J9251J7114J2313N250
53950D37106k277q890j4282j8160j9740j8733j6076j3248j1216j0127r477q368
$$ y = [189314, 189710, 189720, 189363, 189248, 190104, 191977, 193961, 195041, 195246, 195585, 196818, 198705, 200556, 202076, 203368, 204546, 205714, 207027, 208380, 209298, 209590, 209946, 211406, 214280, 218046, 222251, 226987, 232306, 237695, 242532, 246812, 251041, 255464, 259729, 263310, 266055, 268233, 270173, 271914, 273169, 273708, 273801, 274153, 275224, 276738, 278035, 278753, 278786, 277719, 274975, 270806, 266553, 263331, 260731, 257392, 252839, 248111, 244499, 242211, 240535, 238902, 237352, 236159, 235398, 234935, 234596, 234214, 233604, 232585, 231204, 229959, 229564, 230239, 231336, 231937, 231742, 231066, 230150, 228949, 227606, 226608, 226322, 226797, 228082, 230235, 232895, 235470, 238051, 241572, 246698, 253102, 260276, 268393, 277746, 287976, 298786, 311025, 326019, 343888, 363371, 383178, 402429, 419543, 431856, 437106, 434829, 425939, 411657, 393497, 373757, 355024, 338948, 325700, 314484, 304357, 294880, 286512]
53938B86512o189l338j004Q6K88M00P09R75R68O76K51J6L17J143J913K013J452
53921B87188Q63Q07J273J849K258K569K944L329L491L419L494M124N196O009N955
53906C34768N204M596M726N216N147M184K935K072J506P53k10j013j623k309k942
53891C63010l068k811k955l781m560m712m753n371o139o023m921l753l149k909
53877C04105k790k903l097k779j862j270j834l059l578k744j293l88m62j078j666
53862B73302k078k463k840l020k916k701k492k148j574j026q15p84m75J82P37
53847B48889Q03M50o0o05j086j313j220j023r34q42n02R3O22O98J34r02j896k304
53829B39002k027j492j135r29o08k34k39q17j515j681j201n12J36R84K133K950
$$ y = [286512, 280323, 276985, 275981, 276067, 276355, 276755, 277464, 278439, 279407, 280083, 280334, 280350, 280667, 281810, 283723, 285736, 287188, 288051, 288858, 290131, 291980, 294238, 296807, 299751, 303080, 306571, 309990, 313484, 317608, 322804, 328813, 334768, 339972, 344568, 349294, 354510, 359657, 363841, 366776, 368848, 370354, 371107, 370897, 369884, 368261, 365952, 363010, 359942, 357131, 354176, 350395, 345835, 341123, 336370, 330999, 324860, 318837, 313916, 310163, 307014, 304105, 301315, 298412, 295315, 292536, 290674, 289404, 287570, 284511, 280933, 278189, 276896, 276508, 276046, 274968, 273302, 271224, 268761, 265921, 262901, 259985, 257284, 254792, 252644, 251070, 250044, 249229, 248445, 247970, 248152, 248889, 249692, 250142, 250082, 249477, 248391, 247078, 245858, 244835, 243901, 243059, 242557, 242650, 243272, 243970, 244104, 243202, 241306, 239002, 236975, 235483, 234348, 233419, 232811, 232577, 232338, 231521, 230006, 228325, 227124, 226612, 226748, 227732, 229865, 232815]
53813B32815K664J479M47K20M64P05J048J580J730J075L26O20J926L064L386L560
53797B57109M403N744O840P294P111O457N798N831O687P612P887P671P529P573
53783C51546P789Q684J0687J3029J4141J3250J0842P444K926k565p783j1289j2870
53770D05831j3435j3737j3746j3253j2426j1578j0681r391p557n581m245m021
53758B86180m508m746m199l278k669k458k282k110k256k565k325j298k68n8l52
53743B50808j97N58J026N35n44j393j604j104O3J445K138J747J125J407K405K733
53727B61148J700K86r8O43J375J281P04M88R19J546J899K115K720L826M767M769
53711B90088L950L255L358L910M059L405K185Q25l80j234j720k081k576l057l049
$$ y = [232815, 235479, 236958, 237405, 237625, 238089, 238794, 239842, 241422, 243152, 244227, 244553, 245173, 247099, 250163, 253549, 257109, 261512, 267256, 274096, 281390, 288501, 294958, 300756, 306587, 313274, 320886, 328773, 336444, 343973, 351546, 359335, 368019, 378706, 391735, 405876, 419126, 429968, 437412, 440338, 437773, 429990, 418701, 405831, 392396, 378659, 364913, 351660, 339234, 327656, 316975, 307584, 300027, 294446, 290201, 286180, 281672, 276926, 272727, 269449, 266780, 264322, 262040, 259930, 257674, 255109, 252784, 251486, 251218, 251160, 250808, 250611, 251169, 252195, 252730, 252186, 250793, 249189, 248085, 248148, 249593, 251731, 253478, 254603, 256010, 258415, 261148, 262848, 263134, 263036, 263679, 265054, 266335, 267039, 267527, 268446, 269992, 271891, 274006, 276726, 280552, 285319, 290088, 294038, 297293, 300651, 304561, 308620, 312025, 314210, 315035, 314655, 313421, 311701, 309620, 307044, 303987, 300938]
53696C00938k324j207k77J93M05O97J067J119N40m25j156j338j166q87m55J39
53680B95863O20P91Q49R27O94n6o91l55P02J216N47n30r61p12l93j74J86N34K98
53661B99355o52j775k476k522j819l99J188J975J460J40j067j657j648j182m37
53646B88484K71O73P50N73J45l96o25k94J31m0p64j194p56J73Q72J158J342J553
53628B92056J597J373J055Q52Q66J159J688K158K244K072K136K658L218L240K723
53613C21095K257K367K928L267K858J957J434J791K484K554J860J216J252J659
53599C50979J957K386L376M390M238K656Q39M5J73J89l87r70q53j42L76J24p42
53582C68634j575j895j773j654j844k179k155j419k39N25K22p88j437j197p15
$$ y = [300938, 298614, 297407, 297130, 297323, 297728, 298425, 299492, 300611, 301151, 300726, 299570, 298232, 297066, 296179, 295724, 295863, 296483, 297274, 298123, 299050, 299744, 299688, 298997, 298642, 299344, 300560, 301107, 300577, 299616, 298904, 298511, 298337, 298523, 299057, 299355, 298703, 296928, 294452, 291930, 290111, 289712, 290900, 292875, 294335, 294475, 293408, 291751, 290103, 288921, 288484, 288755, 289428, 290178, 290751, 290896, 290500, 289875, 289581, 289712, 289672, 288908, 287714, 286958, 287131, 288003, 289161, 290503, 292056, 293653, 295026, 296081, 296933, 297799, 298958, 300646, 302804, 305048, 307120, 309256, 311914, 315132, 318372, 321095, 323352, 325719, 328647, 331914, 334772, 336729, 338163, 339954, 342438, 344992, 346852, 348068, 349320, 350979, 352936, 355322, 358698, 363088, 367326, 369982, 370821, 370866, 371039, 371228, 370841, 369871, 369018, 368876, 369252, 369376, 368634, 367059, 365164, 363391, 361737, 359893, 357714, 355559, 354140, 353901, 354426, 354648, 353860, 352423, 351226, 350511]
53567C50511q07j233j092j97O88J029J166J472J690J554J512K127L147L730L443
53552C68740K589J739J403J843K747L257K878K175K098K775L557M004M197M224
53538D08226M060M042M667N828O803P218P399P675P947Q165Q587R272R864J0198
53524E09951J0626J1439J2466J3517J4655J5746J6330J6346J6482J7329J8724
53513F73611K0263K1892K3497K4579K4966K5340K6290K7325K7550K6926K6050
53502I48289K5088K3810K2456K1562K1067K0463J9834J9796K0369K0757K0495
53491A183986J9999J9780J9825J9916J9947J9690J8891J7723J6638J5632J4392
53480A386419J3177J2754J3201J3638J3431J2787J1843J0113P500M934L197J805
$$ y = [350511, 349704, 348471, 347379, 347182, 347870, 348899, 350065, 351537, 353227, 354781, 356293, 358420, 361567, 365297, 368740, 371329, 373068, 374471, 376314, 379061, 382318, 385196, 387371, 389469, 392244, 395801, 399805, 404002, 408226, 412286, 416328, 420995, 426823, 433626, 440844, 448243, 455918, 463865, 472030, 480617, 489889, 499753, 509951, 520577, 532016, 544482, 557999, 572654, 588400, 604730, 621076, 637558, 654887, 673611, 693874, 715766, 739263, 763842, 788808, 814148, 840438, 867763, 895313, 922239, 948289, 973377, 997187, 1019643, 1041205, 1062272, 1082735, 1102569, 1122365, 1142734, 1163491, 1183986, 1203985, 1223765, 1243590, 1263506, 1283453, 1303143, 1322034, 1339757, 1356395, 1372027, 1386419, 1399596, 1412350, 1425551, 1439189, 1452620, 1465407, 1477250, 1487363, 1494863, 1499797, 1502994, 1504799]
53468A504799j68k641m845o651q691j1326j4181j6621j8134j8560j8446j8883
53456A365652k0356k2063k3027k3478k4345k5700k6653k6719k6294k5736k4827
53445A096454k3429k1904k0680j9908j9673j9826j9569j7990j5325j2901j1475
53434H93774j0351q585o237l926j748M64K384L507M118N092O791Q807J0748J2669
53420I17507J4593J6341J7970J9877K2095K3976K4990K5527K6440K7984K9661
53409A166961L1077L2432L4057L5833L7386L8652L9999M1820M4172M6767M9149
53398A598305N0981N2316N3592N5150N6783N7939N8369N8358N8374N8642N9049
53387B217858N9169N8393N6365N3475N0514M7761M4751M1184L7594L4657L2161
$$ y = [1504799, 1504631, 1501990, 1497145, 1490494, 1481803, 1470477, 1456296, 1439675, 1421541, 1402981, 1384535, 1365652, 1345296, 1323233, 1300206, 1276728, 1252383, 1226683, 1200030, 1173311, 1147017, 1121281, 1096454, 1073025, 1051121, 1030441, 1010533, 990860, 971034, 951465, 933475, 918150, 905249, 893774, 883423, 874838, 868601, 864675, 862927, 863391, 865775, 869282, 873400, 878492, 885283, 894090, 904838, 917507, 932100, 948441, 966411, 986288, 1008383, 1032359, 1057349, 1082876, 1109316, 1137300, 1166961, 1198038, 1230470, 1264527, 1300360, 1337746, 1376398, 1416397, 1458217, 1502389, 1549156, 1598305, 1649286, 1701602, 1755194, 1810344, 1867127, 1925066, 1983435, 2041793, 2100167, 2158809, 2217858, 2277027, 2335420, 2391785, 2445260, 2495774, 2543535, 2588286, 2629470, 2667064, 2701721, 2733882]
53376B733882K9283K5781K2334J9551J7093J4120J0287O019J772k747q479j5962
53364B852934k4538l2846m0135m6716n2921n8198o1750o3721o5043o6192o6777
53353B274097o6424o5472o4460o3491o2362o1086n9881n8898n8116n7398n6495
53342A600014n5213n3678n2223n0897m9322m7114m4279m1086l7873l4918l2294
53331A101117k9748k7014k4274k1929j9890j7549j4689j1947r988q671p366n841
53319I02211m343l034j849p66J86J196K457L788M789N481O406P979J0028J2061
53305I46590J3749J5026J5968J6800J7839J9257K0873K2343K3551K4709K6060
53294A162765K7545K8858K9823L0563L1230L1691L1645L1012L0017K8869K7529
$$ y = [2733882, 2763165, 2788946, 2811280, 2830831, 2847924, 2862044, 2872331, 2878350, 2880122, 2877375, 2868896, 2852934, 2828396, 2795550, 2755415, 2708699, 2655778, 2597580, 2535830, 2472109, 2407066, 2340874, 2274097, 2207673, 2142201, 2077741, 2014250, 1951888, 1890802, 1830921, 1772023, 1713907, 1656509, 1600014, 1544801, 1491123, 1438900, 1388003, 1338681, 1291567, 1247288, 1206202, 1168329, 1133411, 1101117, 1071369, 1044355, 1020081, 998152, 978262, 960713, 946024, 934077, 924089, 915418, 908052, 902211, 897868, 894834, 892985, 892219, 892405, 893601, 896058, 899846, 904635, 910116, 916522, 924501, 934529, 946590, 960339, 975365, 991333, 1008133, 1025972, 1045229, 1066102, 1088445, 1111996, 1136705, 1162765, 1190310, 1219168, 1248991, 1279554, 1310784, 1342475, 1374120, 1405132, 1435149, 1464018, 1491547]
53283A491547K5854K3792K1405J8850J6418J4404J2870J1574J0168Q297N649K255
53271A663083j244m042o042p962j0343j2926j5268j7536k0152k3006k5634k7980
53259A490948l0330l2550l4101l4951l5774l6969l8046l8300l7617l6233l4263
53248A101814l1992l0230k9554k9451k8971k8156k7981k8756k9494k9301k8607
53237G79321k8307k8273k7581k5928k3906k1927j9766j7336j5148j3638j2646
53226E44865j1891j1333j0755r642q016o796o625o854o444n502m986n081m968
53213D45972m305l924m570n746o389o205n722n348m953m344l667l251l244l451
53199C80853l538l388l207l191l241l211l236l468l666l561l429l715m135l899
$$ y = [1491547, 1517401, 1541193, 1562598, 1581448, 1597866, 1612270, 1625140, 1636714, 1646882, 1655179, 1660828, 1663083, 1661839, 1657797, 1651755, 1643793, 1633450, 1620524, 1605256, 1587720, 1567568, 1544562, 1518928, 1490948, 1460618, 1428068, 1393967, 1359016, 1323242, 1286273, 1248227, 1209927, 1172310, 1136077, 1101814, 1069822, 1039592, 1010038, 980587, 951616, 923460, 895479, 866723, 837229, 807928, 779321, 751014, 722741, 695160, 669232, 645326, 623399, 603633, 586297, 571149, 557511, 544865, 532974, 521641, 510886, 501244, 493228, 486432, 479807, 472953, 466509, 461007, 456021, 450940, 445972, 441667, 437743, 433173, 427427, 421038, 414833, 409111, 403763, 398810, 394466, 390799, 387548, 384304, 380853, 377315, 373927, 370720, 367529, 364288, 361077, 357841, 354373, 350707, 347146, 343717, 340002, 335867, 331968]
53185C31968k947k157k092k302k236k037j919j488m51N60O93L0p32j368k041k414
53169C09067j871o65M2l56j122j151l39M44M09l71j131j239p70k79n0N7J3n60
53151C00128j609k301k059j472j432j769j633r75n97p08n84J11O70M88K3n3O0
53134B86288k86j128j851j997j617j018n47m13m72m26l67p19j420j716j157k88
53118B70866J12N2M9K53M11M00J69n06j645k606k765k396k161j949j044M85J499
53101B59224J266L56k88n67r20j360j475j176q14o44n94n58n52n58n33m99m00
53084B49908L5R31J814J941J192K88l8J62K83K0l41m39l26l32n76q27q44o77n73
53065B51601n95o32p01j009j557j921j720j120o05l41j08J46J72r7l42l39k24
$$ y = [331968, 329021, 326864, 324772, 322470, 320234, 318197, 316278, 314790, 314339, 314899, 315592, 315622, 314890, 313522, 311481, 309067, 307196, 306531, 306573, 306217, 305095, 303944, 303605, 304049, 304458, 304087, 302956, 301717, 300947, 300668, 300618, 300675, 300688, 300128, 298519, 296218, 294159, 292687, 291255, 289486, 287853, 286878, 286281, 285573, 284989, 285100, 285770, 286258, 286281, 286228, 286288, 286002, 284874, 283023, 281026, 279409, 278391, 277844, 277431, 276959, 276533, 276166, 275447, 274027, 272311, 271154, 270866, 270978, 271030, 271079, 271332, 271743, 272143, 272312, 271806, 270161, 267555, 264790, 262394, 260233, 258284, 257240, 257725, 259224, 260490, 260846, 260558, 259991, 259071, 257711, 256236, 255060, 254246, 253602, 253008, 252450, 251898, 251340, 250807, 250308, 249908, 249943, 250874, 252688, 254629, 255821, 256109, 256071, 256233, 256516, 256536, 256195, 255756, 255430, 255098, 254522, 253695, 252851, 252174, 251601, 251006, 250374, 249673, 248664, 247107, 245186, 243466, 242346, 241741, 241400, 241292, 241438, 241610, 241513, 241171, 240832, 240608]
53048B40608o6L82J108J497J062K10l12m14m93n14j65K29m5q06r45j06O15K61
53030B42106n57o85j55J34lM6M34O34N48P89J524J930J336K01n17n40l67n05j002
53011B45351j544j719j332p25n05q26j123p97K2O21M17n13j480j687r27J38O00
52994B33971K21m67q80q55m66J22N34M52J56L27J108J832J946J638J248O00n24
52977B40963j686k165j828j130m57P3L48L74M89J006J658J863J507J038Q03O65
52961B43521L77m8l84l94L8P09J077O80l96j584k322k249j327n8N99J27q44j239
52943B36283r53r17j636k371k160j183m82n31p39m03L09O27J64o74j232j231q22
52926B22049k90J13J67j22l49r5M67O54J54n01n50Q7P61P92O6r06j357r04j0M29
$$ y = [240608, 240542, 240924, 242032, 243529, 244591, 244801, 244489, 244075, 243582, 243068, 242903, 243132, 243087, 242281, 241336, 241230, 241845, 242106, 241549, 240864, 240709, 240843, 240840, 240886, 241320, 241954, 242502, 243291, 244815, 246745, 248081, 248282, 247765, 247225, 246858, 246353, 245351, 243807, 242088, 240756, 240031, 239526, 238700, 237577, 236780, 236802, 237423, 237840, 237327, 235847, 234160, 233233, 233371, 233971, 234192, 233725, 232845, 231990, 231524, 231646, 232180, 232632, 232788, 233115, 234223, 236055, 238001, 239639, 240887, 241487, 240963, 239277, 237112, 235284, 234154, 233697, 233770, 234118, 234492, 234981, 235987, 237645, 239508, 241015, 242053, 242856, 243521, 243898, 243850, 243466, 243072, 243110, 243819, 244896, 245576, 245180, 243596, 241274, 239025, 237698, 237640, 238239, 238366, 237522, 236283, 235330, 234413, 232777, 230406, 228246, 227063, 226581, 226050, 225311, 224908, 225217, 225844, 226008, 225334, 224102, 222871, 222049, 221759, 221872, 222039, 221917, 221568, 221473, 221940, 222594, 222748, 222247, 221697, 221784, 222545, 223337, 223403, 222497, 221140, 220236, 220226, 220655]
52906B20655Q8m31m48LN08R49J381J554J205O05L12M26O30Q30J221J754K108K162
52888B35512K101K047K011K089K208J897R15j07m15l93j114k548l334k617j147
52873B37105o8M08M75q2j299k268k074j103m27k36J62R04J213O44j98m59M3R68
52855B33708J976K843L335L235K409R08p68j742j577r51r41j738k492k485j824
52840B33896r86l03k9l18q66j055p44m44n13o67n57l30k73k89j56Q0L07O58J124
52821B28535J256O97k00p30o27r8O86J601K297K481K496L032M173N261N788O005
52805B62653O344O589N923L745L30l270n934p278p699p648p084n922m740m377
52791B31632m812n042m266k784j444o58k68m6R7J88J68k5j68J94J080J757J557
$$ y = [220655, 220743, 220312, 219864, 219867, 220375, 221324, 222705, 224259, 225464, 226069, 226381, 226807, 227437, 228267, 229488, 231242, 233350, 235512, 237613, 239660, 241671, 243760, 245968, 247865, 248780, 248673, 248258, 247865, 246751, 244203, 240869, 238252, 237105, 237037, 237445, 237920, 237838, 236539, 234271, 232197, 231094, 230667, 230431, 230593, 231497, 232710, 233354, 233156, 232697, 232740, 233708, 235684, 238527, 241862, 245097, 247506, 248414, 247646, 245904, 244327, 243376, 242435, 240697, 238205, 235720, 233896, 232910, 232607, 232578, 232260, 231394, 230339, 229595, 229151, 228638, 227971, 227414, 227084, 226811, 226522, 226366, 226446, 226753, 227411, 228535, 229791, 230488, 230288, 229558, 228931, 228833, 229519, 231120, 233417, 235898, 238394, 241426, 245599, 250860, 256648, 262653, 268997, 275586, 281509, 285254, 285584, 282314, 276380, 269102, 261403, 253755, 246671, 240749, 236009, 231632, 226820, 221778, 217512, 214728, 213284, 212626, 212358, 212312, 212409, 212597, 212765, 212740, 212572, 212766, 213846, 215603, 217160]
52774B17160P94M05P23J145J058N97K94L80O45P37M11l26j119j498j303p95k77
52757B19031K26P25J024Q48K03n90j069r01q3Q97J336R05J0o23o61l45m3J66M29
52738B21485P52Q83O09J13j19J60O55R03Q33P60Q71J086J299J491J508J154N89
52721B35032K89L79L41k99j292j966k060j840j619j533j696k103k358j919p59
52706B16597M81J082Q32K8p83j049n77J97N87M40K91O24J181J293O50m03j254
52689B20217j473r70j7Q90J327J246Q94N37K78J29J46M04Q65J276J324R46M79
52672B28498L26N26P42P19N58M95N28L94n8o12q03l74M64J228J614J631J402R96
52654B38274N78M09N18O37O83J020J806K438K153J083M1o87j626k966l920l674
$$ y = [217160, 217954, 218359, 219082, 220227, 221285, 221882, 222176, 222556, 223201, 223938, 224349, 224023, 222904, 221406, 220103, 219308, 219031, 219257, 219982, 221006, 221854, 222057, 221467, 220398, 219497, 219414, 220311, 221647, 222552, 222562, 221939, 221278, 220933, 220890, 221056, 221485, 222237, 223120, 223729, 223842, 223723, 223883, 224538, 225441, 226274, 227034, 227905, 228991, 230290, 231781, 233289, 234443, 235032, 235321, 235700, 236041, 235742, 234450, 232484, 230424, 228584, 226965, 225432, 223736, 221633, 219275, 217356, 216597, 217078, 218160, 218992, 219020, 218237, 217188, 216611, 216808, 217395, 217835, 218126, 218750, 219931, 221224, 221874, 221471, 220217, 218744, 217774, 217757, 218647, 219974, 221220, 222114, 222651, 222929, 223058, 223204, 223608, 224473, 225749, 227073, 228019, 228498, 228824, 229350, 230092, 230811, 231369, 231864, 232392, 232786, 232728, 232116, 231313, 230939, 231403, 232631, 234245, 235876, 237278, 238274, 238852, 239261, 239779, 240416, 241099, 242119, 243925, 246363, 248516, 249599, 249640, 248953, 247327, 244361, 240441, 236767]
52638B36767k486j296n53m0M28P91J118J663K378K770K472J786J507K228L680
52623B53213M727M214K052o97k878m152m659m354l229j879j142j102j102p43l28
52608B37941j73q9J19K00r4m53m04J4L35L52K78L04L26K33J79L89Q01J112J189
52589B42559J317J794K299K012O41r62j594j088l42r6j52l4K60M96O50O52J31
52572B48543r92j939j824p79J89M78L61K28N0j90k07P6K73J38l0J5o1m98p17l9
52552B43075J050J246J73j054j331q86n66m50M4R62J645J738J599J482J022kr88
52535B48759j177o64j38J74O24J262J528J044K05l13k48K75J048J729J851J339
52519B57298Q09Q88J374J597J487J688K492L219L063K187J576J855K595K877K324
$$ y = [236767, 234281, 232985, 232432, 232392, 232820, 233611, 234729, 236392, 238770, 241540, 244012, 245798, 247305, 249533, 253213, 257940, 262154, 264206, 263509, 260631, 256479, 251820, 247466, 244237, 242358, 241216, 240114, 239012, 238269, 237941, 237768, 237679, 237798, 237998, 237904, 237451, 237047, 237061, 237396, 237748, 238026, 238330, 238656, 238889, 239068, 239457, 240258, 241370, 242559, 243876, 245670, 247969, 249981, 250622, 249660, 248066, 246978, 246636, 246540, 246388, 246354, 246614, 247110, 247760, 248412, 248543, 247551, 245612, 243788, 243009, 243198, 243676, 244037, 244265, 244315, 244125, 243918, 243994, 244267, 244405, 244375, 244390, 244329, 243831, 243114, 243075, 244125, 245371, 245544, 244490, 243159, 242273, 241707, 241257, 241301, 242263, 243908, 245646, 247245, 248727, 249749, 249747, 248759, 247582, 246918, 246780, 246954, 247578, 248840, 250368, 251412, 251617, 251304, 251056, 251331, 252379, 254108, 255959, 257298, 258107, 258995, 260369, 261966, 263453, 265141, 267633, 270852, 273915, 276102, 277678, 279533, 282128, 285005, 287329]
52504B87329J458R98R06L28j335l439m549l991k597j729j812k195k231k017j952
52489B63172j987j676q92j05J74O0J35O18J029Q77M25L92R34J467J575J587J895
52472B69680K150J689O07k20k64J27M63Q36J548K314K439J766J005R44J563K058
52456B88705J699N53o39j289j522j897k628l283l365k945k470k136j686r02n7
52441B66138L59K25m9j8K86M74L34J04R9K31R3m84j173j501j304p85k73m1k04
52422B62511o62j133j347j196o68J73J079J630J597J190Q10O95R05J507K471L477
52406B73039M085M134L850L620L830M752O227P472P607O442M454K073o21l420
52392C27544n668o712o423n178l571k283j817k030k218j942j441j050o50j18J45
$$ y = [287329, 288787, 289785, 290691, 291019, 289684, 286245, 281696, 277705, 275108, 273379, 271567, 269372, 267141, 265124, 263172, 261185, 259509, 258617, 258512, 258686, 258746, 258881, 259499, 260528, 261405, 261830, 262222, 263156, 264623, 266198, 267785, 269680, 271830, 273519, 274126, 273906, 273642, 273769, 274232, 275068, 276616, 278930, 281369, 283135, 284140, 285084, 286647, 288705, 290404, 290957, 290318, 289029, 287507, 285610, 282982, 279699, 276334, 273389, 270919, 268783, 267097, 266195, 266138, 266497, 266722, 266673, 266655, 266941, 267415, 267749, 267853, 267952, 268183, 268276, 267792, 266619, 265118, 263814, 263029, 262756, 262715, 262511, 261849, 260716, 259369, 258173, 257505, 257678, 258757, 260387, 261984, 263174, 263984, 264679, 265584, 267091, 269562, 273039, 277124, 281258, 285108, 288728, 292558, 297310, 303537, 311009, 318616, 325058, 329512, 331585, 330964, 327544, 321876, 315164, 308741, 303563, 299992, 297709, 295892, 293862, 291644, 289702, 288261, 287211, 286561, 286443, 286588]
52377B86588k12o39k31R60J867J821J299R97Q91O60M67P10J191J272P83K84L05
52360B99013O64P67L17m40j058j351j494j669j753j487q97l41jL73J018J679J879
52343B95219J571J174R95R25Q01P28R50J547K364L133L537L397K881K454K462
52328C24138K893L560M371N253N969O286O289O249O137N579M463L353K984L340
52314C90864L625L284K705K635L060L197K582J725J371J524J634J512J504J755
52300D22977J912J765J722K138K545K192J253Q05J345J950J442Pj029r28l23j12
52284D39661l08l94k47p5K13Q29J482J675J617K053L053L753L656L401L643L865
52268D67877L208K034J606K322L246L547L496L671L948L895L596L476L538L383
$$ y = [286588, 286376, 285737, 285506, 286466, 288333, 290154, 291453, 292450, 293341, 294001, 294468, 295178, 296369, 297641, 298424, 298708, 299013, 299677, 300444, 300761, 300321, 299263, 297912, 296418, 294749, 292996, 291509, 290612, 290271, 290270, 290643, 291661, 293340, 295219, 296790, 297964, 298959, 299884, 300685, 301413, 302363, 303910, 306274, 309407, 312944, 316341, 319222, 321676, 324138, 327031, 330591, 334962, 340215, 346184, 352470, 358759, 365008, 371145, 376724, 381187, 384540, 387524, 390864, 394489, 397773, 400478, 403113, 406173, 409370, 411952, 413677, 415048, 416572, 418206, 419718, 421222, 422977, 424889, 426654, 428376, 430514, 433059, 435251, 436504, 437309, 438654, 440604, 442046, 442053, 441024, 440096, 439773, 439661, 439353, 438959, 438712, 438637, 438850, 439679, 441161, 442836, 444453, 446506, 449559, 453312, 456968, 460369, 464012, 467877, 471085, 473119, 474725, 477047, 480293, 483840, 487336, 491007, 494955, 498850, 502446, 505922, 509460, 512843]
52254E12843K908K556K799L583M352M516L990L271K854K653K262J730J562J813
52240E53692J835J266P15R72J937K907L575M092M406M293L968M008M565N155N339
52225F02725N125M736M506M867N877O692O285M800L519L284L678M049M452N094
52211F69689N601N611N535N910O425O367N836N604N882N988N299L934K416J230
52197G41327P67J134J940K665L261L895M301M072L561L666M458M876M166K922
52183G87011K146J904J522O33o06j982l232l852l637l265l657m709n328m820l725
52168G54403l039l093l409l336k643j710j231j475j772j081P58K701L560L149
52154G41782K180J362Q54M20k14r87j389r15K10J022Q32N8k99J74J019J644J838
$$ y = [512843, 515751, 518307, 521106, 524689, 529041, 533557, 537547, 540818, 543672, 546325, 548587, 550317, 551879, 553692, 555527, 556793, 557508, 558480, 560417, 563324, 566899, 570991, 575397, 579690, 583658, 587666, 592231, 597386, 602725, 607850, 612586, 617092, 621959, 627836, 634528, 640813, 645613, 649132, 652416, 656094, 660143, 664595, 669689, 675290, 680901, 686436, 692346, 698771, 705138, 710974, 716578, 722460, 728448, 733747, 737681, 740097, 741327, 742094, 743228, 745168, 747833, 751094, 754989, 759290, 763362, 766923, 770589, 775047, 779923, 784089, 787011, 789157, 791061, 792583, 793216, 792610, 790628, 787396, 783544, 779907, 776642, 772985, 768276, 762948, 758128, 754403, 751364, 748271, 744862, 741526, 738883, 737173, 735942, 734467, 732695, 731614, 732372, 735073, 738633, 741782, 743962, 745324, 746178, 746598, 746384, 745397, 744008, 743093, 743303, 744325, 745157, 745215, 744916, 745090, 746109, 747753, 749591]
52137G49591J589Q69j71j197k057k841l440l423k705j906j650j665j127K22J841
52122G31930L257M623O177P637Q499Q594Q096P206O210N562N447N395M790L696
52108H17119K767K339K083J650J167R13R27J271K251L945N780P006P504P720P891
52093H72333P833P487P181P080O680N212K548n26k970m371n072n496n490m565
52079H87864k701n30J382L058M583N460N057L581J963Q20K7n50o75l47j77n77
52063I08238j041q80l59l76j147j932k117j911j695j349o20K18N85J95q16k137
52047H92856l355m000m003l904m201m596m298l091j642o60j70K24Q55J920L520
52032H65455N370O729P008O366N420M559L871L510L706M331M893N007M638L971
$$ y = [749591, 751180, 752049, 751878, 750681, 748624, 745783, 742343, 738920, 736215, 734309, 732659, 730994, 729867, 730089, 731930, 735187, 739810, 745987, 753624, 762123, 770717, 778813, 786019, 792229, 797791, 803238, 808633, 813423, 817119, 819886, 822225, 824308, 825958, 827125, 828038, 828965, 830236, 832487, 836432, 842212, 849218, 856722, 864442, 872333, 880166, 887653, 894834, 901914, 908594, 913806, 916354, 915828, 912858, 908487, 903415, 897919, 892429, 887864, 885163, 884633, 886015, 889073, 893656, 899116, 904173, 907754, 909717, 910537, 910564, 910014, 909339, 908992, 908815, 908238, 907197, 906317, 905958, 905582, 904435, 902503, 900386, 898475, 896780, 895431, 894811, 895029, 895614, 895809, 894993, 892856, 889501, 885501, 881498, 877594, 873393, 868797, 864499, 861408, 859766, 859106, 858936, 859160, 860015, 861935, 865455, 870825, 877554, 884562, 890928, 896348, 900907, 904778, 908288, 911994, 916325, 921218, 926225, 930863, 934834]
$$ [...]
##END NTUPLES=NMR SPECTRUM
##END=
