
##TITLE=AC1366_2140_7184965_qDGOeVsAB1
##JCAMPDX= 6.0         $$ Bruker NMR JCAMP-DX V2.0
##DATA TYPE= NMR SPECTRUM
##DATA CLASS= NTUPLES
##ORIGIN= BRUKER
##OWNER= Administrator
$$ 1.72 TOPSPIN		Version 2.1
$$ 2012-12-07 18:04:45.786 -0500  Administrator@X
$$ Compression mode = diff/dup
##.OBSERVE FREQUENCY= 400.02188249412
##.OBSERVE NUCLEUS= ^1H
##.ACQUISITION MODE= SIMULTANEOUS (DQD)
##.ACQUISITION SCHEME= undefined
##.AVERAGES= 8
##.DIGITISER RES= 22
##SPECTROMETER/DATA SYSTEM= spect
##.PULSE SEQUENCE= zg30
##.SOLVENT NAME= COFFEE_meoh
##.SHIFT REFERENCE= INTERNAL, COFFEE_meoh, 1, 14.98509
##AUDIT TRAIL= $$ (NUMBER, WHEN, WHO, WHERE, PROCESS, VERSION, WHAT)
$$ ##TITLE= Audit trail, TOPSPIN		Version 2.1
$$ ##JCAMPDX= 5.01
$$ ##ORIGIN= Bruker BioSpin GmbH
$$ ##OWNER= Administrator
$$ $$ E:\/data/COFFEE/nmr/AC1366_2140_7184965_qDGOeVsAB1/30/pdata/1/auditp.txt
$$ ##AUDIT TRAIL=  $$ (NUMBER, WHEN, WHO, WHERE, PROCESS, VERSION, WHAT)
(   1,<2012-12-07 18:04:38.684 -0500>,<Administrator>,<X>,<go>,<TOPSPIN 2.1>,
      <created by zg
	started at 2012-12-07 18:03:25.648 -0500,
	POWCHK enabled, PULCHK disabled,
       configuration hash MD5:
       86 BA 57 50 F2 9D 5C 9B 26 00 A9 28 5F 66 2E 89
       data hash MD5: 64K
       42 23 A5 4F 01 9F 25 91 60 B9 36 E0 56 0B 58 27>)
(   2,<2012-12-07 18:04:41.384 -0500>,<Administrator>,<X>,<proc1d>,<TOPSPIN 2.1>,
      <Start of raw data processing
       efp LB = 0 FT_mod = 6 PKNL = 1 PHC0 = 0 PHC1 = 0 SI = 32K 
       data hash MD5: 32K
       5D 3B 8F E0 98 EB 80 DB 0D 1D 2E 6B D6 51 B0 19>)
(   3,<2012-12-07 18:04:41.783 -0500>,<Administrator>,<X>,<proc1d>,<TOPSPIN 2.1>,
      <pk PHC0 = 97.61353 PHC1 = 0 
       data hash MD5: 32K
       79 73 A4 2B 88 83 38 0A 8B 4C BC FB 9F D3 F2 25>)
(   4,<2012-12-07 18:04:41.982 -0500>,<Administrator>,<X>,<proc1d>,<TOPSPIN 2.1>,
      <abs ABSG = 1 
       data hash MD5: 32K
       B5 D5 B8 02 F3 4D 51 0B 89 F1 AF 7F E8 7F 7B 99>)
(   5,<2012-12-07 18:04:42.115 -0500>,<Administrator>,<X>,<proc1d>,<TOPSPIN 2.1>,
      <abs ABSG = 2 
       data hash MD5: 32K
       4E AB D2 EE 8D A2 27 24 DB C1 81 71 65 99 51 28>)
(   6,<2012-12-07 18:04:42.248 -0500>,<Administrator>,<X>,<proc1d>,<TOPSPIN 2.1>,
      <abs ABSG = 3 
       data hash MD5: 32K
       E9 45 E3 9C FA 8A 3D DB 4E 5E 50 32 DB 97 6C 7C>)
(   7,<2012-12-07 18:04:42.381 -0500>,<Administrator>,<X>,<proc1d>,<TOPSPIN 2.1>,
      <abs ABSG = 4 
       data hash MD5: 32K
       59 F3 03 13 51 EF 99 AD B3 E9 1D FE E6 32 B9 B4>)
(   8,<2012-12-07 18:04:42.528 -0500>,<Administrator>,<X>,<proc1d>,<TOPSPIN 2.1>,
      <abs ABSG = 5 
       data hash MD5: 32K
       D8 5D 3D 63 F3 51 91 2F 79 8A ED 58 AE 8D 7E 51>)
$$ ##END=
$$ 
$$ $$ hash MD5
$$ $$ CD 01 C7 64 9E CB 24 2C 60 F2 93 2F BD 1A 43 B3
##$RELAX= 
##$RELAX= 
##$RELAX= 
##$RELAX= 
##$RELAX= 
##$RELAX= 
##$RELAX= 
$$ Bruker specific parameters
$$ --------------------------
##$DU= <E:\>
##$EXPNO= 30
##$NAME= <AC1366_2140_7184965_qDGOeVsAB1>
##$PROCNO= 1
$$ [...]
150 150 150 150 150 150 150 150
##$TP07= 0
##$TPNAME0= <>
##$TPNAME1= <>
##$TPNAME2= <>
##$TPNAME3= <>
##$TPNAME4= <>
##$TPNAME5= <>
##$TPNAME6= <>
##$TPNAME7= <>
##$TPOAL= (0..7)
0.5 0.5 0.5 0.5 0.5 0.5 0.5 0.5
##$TPOFFS= (0..7)
0 0 0 0 0 0 0 0
##$TUNHIN= 0
##$TUNHOUT= 0
##$TUNXOUT= 0
##$USERA1= <user>
##$USERA2= <user>
##$USERA3= <user>
##$USERA4= <user>
##$USERA5= <user>
##$V9= 5
##$VALIST= <valist>
##$VCLIST= <CCCCCCCCCCCCCCC>
##$VD= 0
##$VDLIST= <DDDDDDDDDDDDDDD>
##$VPLIST= <PPPPPPPPPPPPPPP>
##$VTLIST= <TTTTTTTTTTTTTTT>
##$WBST= 1024
##$WBSW= 4
##$XGAIN= (0..3)
0 0 0 0
##$XL= 0
##$YL= 0
##$YMAX_a= 644071
##$YMIN_a= -547927
##$ZGOPTNS= <>
##$ZL1= 120
##$ZL2= 120
##$ZL3= 120
##$ZL4= 120
##$ABSF1= 14.98509
##$ABSF2= -5.573092
##$ABSG= 5
##$ABSL= 3
##$ALPHA= 0
##$AQORDER= 0
##$ASSFAC= 0
##$ASSFACI= 0
##$ASSFACX= 0
##$ASSWID= 0
##$AUNMP= <proc_prof1d_extract_pilot.lims>
##$AXLEFT= 0
##$AXNAME= <>
##$AXNUC= <1H>
##$AXRIGHT= 0
##$AXTYPE= 0
##$AXUNIT= <>
##$AZFE= 0.1
##$AZFW= 0.1
##$BCFW= 0
##$BC_mod= 0
##$BYTORDP= 0
##$COROFFS= 0
##$CY= 15
##$DATMOD= 1
##$DC= 0
##$DFILT= <>
##$DTYPP= 0
##$F1P= 0
##$F2P= 0
##$FCOR= 0.5
##$FTSIZE= 32768
##$FT_mod= 6
##$GAMMA= 0
##$GB= 0
##$INTBC= 1
##$INTSCL= 1
##$ISEN= 128
##$LB= 0
##$LEV0= 0
##$LPBIN= 0
##$MAXI= 10000
##$MC2= 0
##$MEAN= 0
##$ME_mod= 0
##$MI= 0
##$NCOEF= 0
##$NC_proc= -8
##$NLEV= 6
##$NOISF1= 0
##$NOISF2= 0
##$NSP= 0
##$NTH_PI= 0
##$NZP= 0
##$OFFSET= 14.98509
##$PC= 1
##$PHC0= 97.61353
##$PHC1= 0
##$PH_mod= 1
##$PKNL= yes
##$PPARMOD= 0
##$PPDIAG= 0
##$PPIPTYP= 0
##$PPMPNUM= 2147483647
##$PPRESOL= 1
##$PSCAL= 4
##$PSIGN= 0
##$PYNMP= <proc.py>
##$REVERSE= no
##$SF= 400.02
##$SI= 32768
##$SIGF1= 0
##$SIGF2= 0
##$SINO= 400
##$SIOLD= 32768
##$SPECTYP= <>
##$SREGLST= <1H.CDCl3>
##$SSB= 0
##$STSI= 32768
##$STSR= 0
##$SW_p= 8223.68421052631
##$SYMM= 0
##$S_DEV= 0
##$TDeff= 65536
##$TDoff= 0
##$TI= <>
##$TILT= no
##$TM1= 0
##$TM2= 0
##$TOPLEV= 0
##$USERP1= <user>
##$USERP2= <user>
##$USERP3= <user>
##$USERP4= <user>
##$USERP5= <user>
##$WDW= 1
##$XDIM= 32768
##$YMAX_p= 452801846
##$YMIN_p= -1287195
##$CURPLOT= <Network HP LaserJet P1505>
##$CURPRIN= <$Network HP LaserJet P1505>
##$DFORMAT= <normdp>
##$LAYOUT= <+/1D_H.xwp>
##$LFORMAT= <normlp>
##$PFORMAT= <normpl>
##$SURQMSG= 1
$$ End of Bruker specific parameters
$$ ---------------------------------
##NTUPLES= NMR SPECTRUM
##VAR_NAME=  FREQUENCY,     SPECTRUM/REAL,   SPECTRUM/IMAG
##SYMBOL=    X,             R,               I
##VAR_TYPE=  INDEPENDENT,   DEPENDENT,       DEPENDENT
##VAR_FORM=  AFFN,          ASDF,            ASDF
##VAR_DIM=   32768,         32768,           32768
##UNITS=     HZ,            ARBITRARY UNITS, ARBITRARY UNITS
##FACTOR=    0.250966925370066, 1,           1
##FIRST=     8223.43324360094, 1901,         -156664
##LAST=      0,             145209,          -32107
##MIN=       0,             -1287195,        0
##MAX=       8223.43324360094, 452801846,    0
$$ Real data points
##PAGE= N=1
##DATA TABLE= (X++(R..R)), XYDATA
$$ [...]
19536a65734l2649o8057J04310d3651k9161D5424D613b47907j7896A47691a08721
19524c83081a43324A18422a76033O6513C1319a76968B49088a82768a8234l0347
19514d8581j29746e713r0547m9231j3526A1144j906b66692Q8340e5106j79056
19503b34162b4394A16878J677h1684C560b47895f184k60619H5834B1740b8694
19491F0845B6057a47466f0664A06665b2913n0373G3158J9210B701a23470J4047
19480a09423G4485a71081C1980J79448a79840A9199c06257A18917b29051f9547
19469A34354k2095Q6064k633a14142F8258c8395A69340d12711a66181b5558b770
19457a67743E9874a46468E928c9769A45216N365b47460A36465a10777E7515F431
$$ y = [-165734, -198383, -266440, -162130, -43651, -72812, 45424, 4613, -247907, -265803, 147691, -108721, -383081, -143324, 118422, -176033, -109520, 31319, -176968, 249088, -182768, -18234, -48581, -178327, -5713, -96260, -145491, -159017, 11144, 9238, -266692, -178352, -55106, -234162, -24394, 116878, 118555, -81684, 3560, -247895, -6184, -266803, 85834, 21740, -28694, 60845, 26057, -147466, -60664, 106665, -22913, -73286, 73158, 92368, 2701, -123470, -109423, 74485, -171081, 31980, 211428, -179840, 19199, -306257, 118917, -229051, -69547, 134354, 112259, 198323, 195690, -114142, 68258, -38395, 169340, -412711, -166181, -25558, -2770, -167743, 59874, -146468, 5928, -39769, 145216, 150581, -247460, 136465, -110777, 57515, 6431]
19445B5082P7783c51898a26212D4056K2319b9906B5717a52046k16318a23910N8986
19434f4924q0900D80652A95160g2496q3086D8232G168a0613j27300I7810D1891
19422b67196B68905h7977j17604l4670J17196M1497j00993E9160f08363B921Q5333
19411H8254d4217k2185C9246L5861j7005a5603A6234J23731a75300O0783j52284
19400b66801L5140a12003A51879c30243D98938c01555H9102A4527a31898m7158
19390a79056g172G0303K46568e3775H4965a15430B49022A12547h7862D59599I9172
19378A23423n1634A1337c14147A9401h3260k97117B58335c46722n0736h3672q4370
19367a68042d0179m6163I9523h0586j13769g5245A0442N5203e3740l65467E3380
$$ y = [25082, 102865, -351898, -126212, 44056, 66375, -29906, 25717, -152046, -368364, -123910, -64924, -145824, 480652, 195160, -72496, -155582, 48232, 7168, -10613, -137913, 97810, 41891, -267196, 268905, -87977, -205581, -240251, -123055, -81558, -182551, 59160, -608363, 2921, 88254, -44217, -66402, 39246, 75107, 58102, -15603, 16234, 139965, -175300, -114517, -266801, -231661, -112003, 151879, -330243, 498938, -301555, 89102, 14527, -131898, -179056, -7172, 70303, 316871, -53775, 84965, -115430, 249022, 112547, -87862, 459599, 99172, 123423, 71789, 11337, -314147, 19401, -83260, -380377, 258335, -346722, -397458, -83672, -168042, -40179, -86342, 99523, -80586, -194355, -75245, 10442, 65645, -53740, -419207, 53380]
19355b54071e9084k21034K5393m3623i0572B0925M0239h2577q3748b8673j7223
19344d5896j51289F8578f642j52654d788l03571G0734a08112A93118a91206C1844
19332B55115g5258K1540a9071f867A79363C8785d4680A35189F6697L20573i3789
19320e953k26391e2153B43867A8269J4974J06448a63081c2475l13074A28935b18858
19308B38481b88316J6267j47568E4022a62398L0812e6115A24065f9124I0686C4379
19296b36177D8587a76437a4430B22731a73366A60538A164R3720b977I6236c75103
19284a30341C3059R5866J1970c3173A0253a47448a8072j60718m3481A33341k6629
19273A06712C2158a21949j94820a16273e1148k52607k00148G0423J66084E0752
$$ y = [-254071, -59084, -280118, -254725, -298348, -90572, 20925, 61164, -82577, -166325, -28673, -45896, -197185, 68578, -6642, -159296, -4788, -308359, 70734, -108112, 193118, -191206, 31844, 255115, -75258, -53718, -19071, -6867, 179363, 38785, -44680, 135189, 66697, 387270, -93789, -5953, -232344, -52153, 243867, 18269, 33243, 139691, -163081, -32475, -345549, 128935, -218858, 238481, -288316, -272049, -419617, 54022, -162398, -131586, -56115, 124065, -69124, 90686, 34379, -236177, 48587, -176437, -14430, 222731, -173366, 160538, 1164, 94884, -2977, 96236, -375103, -130341, 33059, 128925, 140895, -33173, 10253, -147448, -18072, -178790, -222271, 133341, 106712, 32158, -121949, -316769, -116273, -51148, -303755, -503903, 70423, 236507, 50752]
19262b24893g2223j41716i2104l8325J9863m19082G3010J2559O9245b41333e6592
19250c94959D287a97770h413o3641a4388B85479A4252L43166a0394I2455a45422
19238a14401A72899b63270d8197k91674J22217A93474q509h5871A84354c01597
19227c6940A06763J00825C4038a13772R906j29051l4277M7963h3842A75819c57931
19215A6833K8542J4815b87156j44368a85235j18021a09252F8075c423m0232A62998
19203a07080j15436A6583e9035A40401b38944E0504h7316j0076j26453C9175b13229
19191A37093a59441F3475O6103g778k78597e8141l15473I7870O4388I937c79851
19179c1214j01359B01356D7035a72401j90380g9554B64618H6990c6317k5699j01909
$$ y = [-224893, -72223, -213939, -92104, -130429, -110566, -529648, 73010, 85569, 154814, -241333, -56592, -394959, 4287, -197770, -8413, -72054, -14388, 285479, 14252, 357418, -10394, 92455, -145422, -114401, 172899, -263270, -48197, -339871, -217654, 193474, 184965, -85871, 184354, -301597, -36940, 106763, 207588, 34038, -113772, -103866, -232917, -267194, -219231, -83842, 175819, -357931, 16833, 45375, 60190, -287156, -431524, -185235, -303256, -109252, 68075, -3423, -43655, 162998, -107080, -222516, 16583, -59035, 140401, -238944, 50504, -87316, -97392, -223845, 39175, -213229, 137093, -159441, 63475, 129578, -7778, -286375, -58141, -373614, 97870, 162258, 9937, -379851, -31214, -132573, 201356, 47035, -172401, -362781, -79554, 264618, 86990, -36317, -62016, -163925]
19168a63925p23d9168k32961j65754a81104B24409H0985a63271d71A01547k4510
19157G7037b12491B14219b85006c9951B4483e6621j8008j55330C69190r4052g2031
19145b01520N0307C04928b52807g8518B05050B0852d5352k53443c3530l8619E17324
19133b59234E0461K7458b57902c4550q6453A74579a43005k37633J65320J0562
19123b04756J01053F1861J51013a54609A13982b23036J00880D1576g2593k00929
19113b73522J20951n4229i8511B20149g0220K7862A5032J03930a25529L2051B0214
19101g4390k2826j82102B87680a86989O6501J1443G3780c2720j17893n5697Q8373
19090a17937j36673D2024a66978q5885A22356O3642a60035p8943f5151D6005J04990
$$ y = [-163925, -164648, -49168, -282129, -447883, -181104, 224409, 80985, -163271, -471, 101547, 77037, -212491, 214219, -285006, -39951, 24483, -56621, -74629, -229959, 369190, 275138, -72031, -201520, -151213, 304928, -252807, -78518, 205050, 20852, -45352, -298795, -33530, -72149, 517324, -259234, 50461, 77919, -257902, -34550, -121003, 174579, -143005, -380638, -215318, -204756, -103703, 61861, 212874, -154609, 113982, -223036, -122156, 41576, -72593, -273522, -152571, -206800, -98511, 220149, -70220, -42358, 15032, 118962, -125529, -93478, 20214, -74390, -97216, -279318, 287680, -186989, -120488, -109045, 73780, -32720, -150613, -206310, -117937, -254610, 42024, -166978, -252863, 122356, 185998, -160035, -238978, -65151, 46005, 150995]
19079A50995a82043B25027E0297b44491f4967k33516a24574A59753b23993A68454
19068d10842d7286k7508m4134B64803a55324E4654a94151D9282a66919f3788K9687
19057c4101j65807A66564c39149C93939j69100a62824G9279M8036a40698M3046
19047i7652l9184j57104B18719c20303d1671B22197c90589A4603a88402c5347
19036C27850d04863e6242j90611R5741j3327g5552J1715J2441A16868J1605N7893
19025A86366c96633H5203L8273g7808k34383A88750m6969A1799a90543A1234h885
19013c3032r8100C08096A194b7056g411K78j40129j47984a34350h419I2902d55712
19000B74922b4001A13936J13979A3728f6050E4452N2852i9012L7223H7700C51
$$ y = [150995, -182043, 225027, 50297, -244491, -64967, -298483, -124574, 159753, -223993, 168454, -410842, -47286, -74794, -118928, 264803, -155324, 54654, -194151, 49282, -166919, -63788, -34101, -199908, 166564, -339149, 393939, 224839, -162824, 79279, 127315, -140698, -97652, -136836, -293940, 218719, -320303, -41671, 222197, -390589, 14603, -188402, -35347, 327850, -404863, -56242, -246853, -151112, -164439, -75552, -63837, -51396, 116868, 128473, 186366, -396633, 85203, 123476, -77808, -312191, 188750, 141781, 11799, -190543, 11234, -8885, -33032, -131132, 308096, 1194, -27056, -7411, -7133, -147262, -295246, -134350, -8419, 92902, -455712, 274922, -24001, 113936, 227915, 13728, -66050, 54452, 107304, -99012, -61789, 87700, 351]
18988b82754a21203e401A1997K97732a53726G1353b08330B20475M3770F689e8097
18976b10470g0130K1726B74425B1010d42457a51862a669l6645k40134F1871a61902
18964a6053C6878L6558a619q6640D6956c19824B61331i5729j35010H8764b12631
18952b74266N3677C15223F3909f504A56471l7496D4258g2975k04901j35556F1468
18940a53461B81056B0161a9333G8634a12622J0445j21693J464O5431P6264A46466
18928b8111M056I5920D1317K388b03787A88770r2076k5947a99714C27023d5094
18916i2614b1913C8773c15922a49961B77842c18773f3505p4615c1167k75191A62475
18904A4808N9036a38023e7459I1041l2368c84078a27261a2721j0287D1076e6492
$$ y = [-282754, -121203, -5401, 11997, 309729, -153726, 71353, -208330, 220475, 264245, 6689, -58097, -210470, -70130, -48404, 274425, 21010, -442457, -151862, -1669, -38314, -278448, 61871, -161902, -16053, 36878, 73436, -1619, -88259, 46956, -319824, 261331, -95729, -230739, 88764, -212631, -274266, -220589, 315223, 63909, -6504, 156471, 118975, 44258, -72975, -277876, -413432, 61468, -153461, 281056, 20161, -19333, 78634, -112622, -102177, -223870, -222406, -156975, -80711, 146466, -28111, -24055, 95920, 41317, 43705, -203787, 188770, 96694, 70747, -199714, 327023, -45094, -92614, -21913, 38773, -315922, -149961, 277842, -318773, -63505, -138120, -31167, -306358, 162475, 14808, 73844, -138023, -57459, 91041, 58673, -384078, -127261, -12721, -23008, 41076, -56492]
18892a88380A1846h2508A47744o5355J95019a83714a0421k02845e4079m9156j33023
18881b36258A0945J97661G4149c5242F2121a6238j88176B7670h7545b3461j99450
18870b22911A32087a77225d7203G2511b86075a35992O0939k07547Q6170B70557
18859A0762J42211b89863C4628d12118J55970Q5691A02897J0613a28597p250d5232
18847a91303c82A2496N6699a26833l2595g9378r8913q0311C2205J10873a00294
18835b71420E8813K2494J0190h488C1384a58549q0024D2101c2423F3391b30260
18823a57478p9164K4912n1921B32940i7709l52524i9984A33271J70461a14937
18812e6666k30712I908J06877a22849C1872a17408a4211c192G5334A1740b10666
$$ y = [-188380, 11846, -82508, 147744, 82389, 277408, -183714, -10421, -213266, -54079, -103235, -236258, 10945, 208606, 74149, -35242, 62121, -16238, -204414, 27670, -87545, -23461, -222911, 132087, -177225, -47203, 72511, -286075, -135992, -75053, -282600, -196430, 270557, 10762, 152973, -289863, 34628, -412118, -256148, -170457, 102897, 113510, -128597, -135847, -45232, -191303, -382, 12496, 69195, -126833, -159428, -79378, -178291, -258602, 32205, 143078, -100294, -271420, 58813, 81307, 91497, -8488, 31384, -158549, -238573, 42101, -32423, 63391, -230260, -157478, -236642, -211730, -263651, 232940, -97709, -450233, -99984, 133271, 303732, -114937, -56666, -287378, 9908, 116785, -122849, 31872, -117408, -14211, -3192, 75334, 11740, -210666]
18800G8685h481r449j96204d3759j8143p1972B9220Q3520Q8068i4864l768K480
18788i6152A51185a3031E2087b08981E8992b08191N6368A23658a08823C28942
18777E0529b8145m4263k3810B0751K09112E8202b57105j78893a13732l049j33264
18766b50045A08882O6076M2972a7106k72545H1647d6340j40627B13639J05887
18756C19526e9442A24509l4680a27699B3467a53493a0403j73008A44091c09628
18745a50369A234b37005a2539r7508J7370k2307B39126c82351C79433j31062j08328
18734A40043a96657A71194c31900D96924a83850i1453H6272h7117G4528f3382
18723a35507A75237L7648B2784K4322c01950C51028a03580j34574I7678j2241
$$ y = [78685, -8481, -17930, -214134, -43759, -61902, -133874, 29220, 112740, 200808, -94864, -98632, -96152, 151185, -13031, 52087, -208981, 58992, -208191, -151823, 123658, -108823, 328942, 50529, -28145, -72408, -96218, 20751, 229863, 58202, -257105, -435998, -113732, -116781, -250045, 108882, 174958, 217930, -17106, -289651, 81647, -46340, -186967, 213639, 319526, -59442, 124509, 89829, -127699, 23467, -153493, -10403, -183411, 144091, -309628, -150369, 1234, -237005, -12539, -110047, -92677, -114984, 239126, -382351, 379433, 248371, 140043, -196657, 171194, -331900, 496924, -183850, -91453, 86272, -87117, 74528, -63382, -135507, 175237, 212885, 22784, 47106, -301950, 351028, -103580, -238154, 97678, 85437]
18713H5437c04752B54019d2404A33334d51265a75995N1123f1465l55427h3698
18702B09056E2259a18096F9942b11689b8250j81277b1904B17764a81093j58847
18692c39940d5350A04480O2985b1235k9347G8633b40042H0205a57906F1177a67721
18680c7523m352j74045B15641b19425b2662F6640h4318j27826K0987C44793F1265
18668d11669e1168G2661L68342i7136A61051h9974p0124B431a67766A36545D4744
18656G0568J16773a79899L6755j98052H3828H759a18297M7473B78262d0956k15660
18645b56616o3454J34549H7639b8633k21823P6374Q2620O519F0249k5365H598
18633a69534j30289h8338A18083a48445A9375b75106A71798h9408b8906p266j84179
$$ y = [85437, -304752, 254019, -42404, 133334, -451265, -175995, -124872, -61465, -416892, -83698, 209056, 52259, -118096, 69942, -211689, -28250, -209527, -21904, 217764, -181093, -339940, -45350, 104480, 167465, -21235, -50582, 78633, -240042, 80205, -157906, 61177, -167721, -37523, -41875, -215920, 215641, -219425, -22662, 66640, -84318, -212144, -191157, 344793, 61265, -411669, -51168, 72661, 441003, -97136, 161051, -89974, -160098, 2431, -167766, 136545, 44744, 70568, 187341, -179899, -143144, -341196, 83828, 8759, -118297, -70824, 278262, -40956, -256616, -320070, -185521, 87639, -28633, -250456, -174082, -91462, -84943, 60249, 34884, 8598, -169534, -299823, -88338, 118083, -148445, 19375, -275106, 171798, -89408, -28906, -36172, -220351]
18622b20351q8561P1727N5527g3492c0377D8310a59059a5518I6724d1752F5428
18610G443L2756c32360A34836a50324C687a72319B845J50071e387j29224E811
18598a50069l2327a7280A71487c26770J42781A4592K02344K37030a78749j25015
18588c03764B2375L22973E248a85378Q1964q1766e2578j81235J1498e6020j17143
18577a73163B66530b65135a8845A09547a38139A41127P2405a01385d90n2791C52941
18565f612j33205j65931i4851D4669b8837C15884A38263a87120c2563q8981A01646
18553g2166D7399a0506B9926K97114a91628L4438O8864j64929A91968c91463B40172
18541G5066a10426F241K16580b19979E41528A5593a17708k33773d8811N524B6642
$$ y = [-220351, -308912, -237185, -181658, -73492, -30377, 48310, -159059, -15518, 96724, -41752, 65428, 7443, 40199, -332360, 134836, -150324, 3687, -172319, 2845, 152916, -5387, -134611, 5811, -150069, -182396, -17280, 171487, -326770, -183989, 14592, 216936, 453966, -178749, -303764, 22375, 345348, 5248, -185378, -103414, -185180, -52578, -233813, -222315, -56020, -173163, 266530, -265135, -18845, 109547, -138139, 141127, 213532, -101385, -490, -53281, 352941, -6612, -139817, -305748, -94851, 44669, -28837, 315884, 138263, -187120, -32563, -121544, 101646, -72166, 47399, -10506, 29926, 327040, -191628, -157190, -88326, -253255, 191968, -391463, 240172, 75066, -110426, 6241, 222821, -219979, 541528, 15593, -117708, -351481, -48811, -43287, 26642]
18529c4438A22107b162j5466B4364b28774D7188c6015C639a14789j16977N4814
18518a76952c9301A80957a72824B39234p6741L2648a08148c1261k33362L5043
18508b29580K6020J1507b4615A19740N3172a87363k65079b7234G3237L8461e897
18496c09906a16811D6007d21510J91282O4630E0423b93069a03381E1808L0059
18486H1867a82393B48472C3082J80270e04090b15436A45363g689A89762a27834
18475a38000l50203a49884a8847q6702A47785l828B1117a6047H6983f8273B46573
18463E4879r255c7487E7355A0312K66708o1459c2093p7735D715L353b67567r5966
18451c63533J12822C48056b42637k5781G9135a26485F1245b07811k24994A64350
$$ y = [-34438, 122107, -2162, -17628, 24364, -228774, 47188, -36015, 3639, -114789, -231766, -176952, -39301, 180957, -172824, 239234, 162493, 195141, -108148, -31261, -264623, -229580, -203560, -192053, -24615, 119740, 172912, -187363, -452442, -27234, 73237, 111698, -5897, -309906, -116811, 46007, -421510, -230228, -165598, 50423, -293069, -103381, 51808, 81867, -182393, 248472, 33082, 213352, -504090, -215436, 145363, -7689, 189762, -127834, -138000, -488203, -149884, -18847, -105549, 147785, 143957, 21117, -16047, 86983, -68273, 246573, 54879, 45624, -37487, 57355, 10312, 277020, 215561, -32093, -109828, 4715, 8068, -267567, -363533, -250711, 348056, -242637, -268418, 79135, -126485, 61245, -207811, -432805, 164350]
18440A06873c17529H5470b61404j8103b3866B88817a32893A76785B8376J33162
18430A61538a56110A79348B147K0555d61879A30722m3511a60302L9195D3809h6620
18418e9632m8340j14618A13281a92987n5341M9621j03685B44183d2456q6304b992
18406c1493o7223k00044c9716k05875A02448n0549f6069B95450F6166R4968J05256
18395B66390K7631a10746j08275l2415E634L4649i1433k04272B60983b12053C8930
18383A30832n4889C0414b03944b1586k80359D7420J01952l9634a3257j65245N3681
18372a24821j57652J9623b661I7820A6086J5518a85759E4402J84273a99302j2335
18361b11637N7583A29626a54053H927L5588J08488J52D7375b46345P2576Q3322
$$ y = [106873, -317529, 85470, -261404, -279507, -23866, 288817, -132893, 176785, 28376, 161538, -156110, 179348, 2147, 22702, -461879, 130722, 87211, -160302, -121107, 43809, -86620, -59632, -107972, -222590, 113281, -192987, -248328, -198707, -302392, 244183, -42456, -128760, -2992, -31493, -98716, -298760, -39716, -245591, 102448, 51899, -66069, 295450, 66166, 161134, 266390, 294021, -110746, -219021, -251436, 5634, 40283, -91433, -295705, 260983, -212053, 38930, 130832, 75943, 30414, -203944, -21586, -301945, 47420, 149372, 109738, -13257, -178502, -124821, -282473, -262850, -2661, 97820, 16086, 31604, -185759, 54402, 238675, -199302, -211637, -154054, 129626, -154053, 8927, 44515, 153003, 153155, 47375, -246345, -173769, -90447]
18350i0447i888H6577c08607g7293l11588j1582G1091e5495j83512a16190b8972
18338F9733q438e7626a8965q5652l3778B018J7017J49374J34754a40105j05594
18327b45699A99060B9358b62905A18531d549j03409j76388m6488J42047h2448
18316a44680C04244A31344J15975j03508Q1249m4106h7165o557H7762J31695L6269
18305B55726c55584A91183b14084e5638r0389o2248Q0022E7962P3554o1516O2
18294G0062e892j94290i7266G3991J82378e1186b0746M752D620J58019B964b11947
18281a99384B09476c936B54130b5177G5187a45423J0472O55L7664B2456a38624
18269B25791E1008O8479A9113a51545A02275L09437d31079a59489B30355K7330
$$ y = [-90447, -9888, 86577, -308607, -77293, -388881, -400463, 71091, -55495, -239007, -116190, -28972, 69733, 61295, -57626, -18965, -104617, -138395, 2018, 19035, 168409, 303163, -140105, -245699, 199060, 29358, -262905, 118531, -4549, -107958, -284346, -330834, -188787, -82448, -144680, 304244, 131344, 247319, 143811, 225060, 180954, -87165, -93722, 87762, 219457, 255726, -355584, 191183, -214084, -55638, -146027, -208275, -128253, 57962, 131516, 70000, 70062, -5892, -200182, -97266, 73991, 256369, -51186, -20746, -15994, 4620, 162639, 2964, -211947, -199384, 209476, -3936, 254130, -25177, 75187, -145423, -134951, -134296, -96632, 22456, -138624, 225791, 51008, 119487, 19113, -151545, 102275, 411712, -431079, -159489, 230355, 257685]
18259B57685a19826E1388J28733J01150O0424A42294b43482A29161K06879A25615
18248F1695a14335b0841q0904M2088p7681l3388A99474I4279R7171C7073c68589
18236b35919f4559A99287f5203r3498O2406j65908C40528g0795r4015G2814L4639
18225A07453M1827a69547k7481Q4229j974k689A22899a65899A14930a79577c6924
18213H1200k5713B5544b51038k7637E4994a11639A06866Q5798b03174D429P3727
18202G8156a2197A36982M4389C8296g0764B9324J13804Q5401j00617R856j2892
18191A24876b27479L2028P0979f1320A65933h8082k38092i3518k48489A37494
18180c1696k05473a8572j87249k23629C01016b23828C50268a00258c382j24130
$$ y = [257685, -119826, 51388, 180121, 281271, 341695, 142294, -243482, 129161, 336040, 125615, 61695, -114335, -20841, -101745, -59657, -137338, -170726, 199474, 94279, 191450, 37073, -368589, -235919, -64559, 199287, -65203, -158701, -96295, -262203, 340528, -70795, -164810, 72814, 107453, 149280, -169547, -197028, -112799, -114773, -117462, 122899, -165899, 114930, -179577, -36924, 81200, 55487, 25544, -251038, -278675, 54994, -111639, 106866, 192664, -203174, 4429, 78156, -12197, 136982, 181371, 38296, -70764, 29324, 143128, 228529, 127912, 137768, 124876, -227479, -195451, -124472, -61320, 165933, -88082, -326174, -93518, -342007, 137494, -31696, -237169, -18572, -205821, -429450, 301016, -223828, 350268, -100258, -3382, -127512]
18170a27512B19787c01900b6838p2173j03377G3876a44672K7853B9156J30208
18160A59364J46887i7397F9588a70151a4257A76204b69649p0765A25697h859j41225
18149a50084P201J9668q1254g4103B03754j00085d8635A14896a54128j86737C90452
18137D42551h1423m6339Q219k9593C5063g7476A41991a42160K5794j6896f3790
18125G2164a79200h4686j7032M4979A40920c89354J66884F847h9504C69416e9597
18113b39996h65j67717A0140L2851a84376A1309e4488b4132D8031N6012N5902
18102A59945d24844B56274a45053f8271E2735r564j6698a52859O707N6707A36761
18090a60013A23439d0831n0890F2903b18286m4766c4316H9226k305K455b5609
$$ y = [-127512, 219787, -301900, -26838, -99011, -202388, 73876, -144672, -116819, 29156, 159364, 306251, -97397, 69588, -170151, -14257, 176204, -269649, -340414, 125697, -8859, -150084, -142883, -123215, -204469, -74103, 203754, 103669, -48635, 114896, -154128, -340865, 390452, 442551, -81423, -127762, -119543, -149136, 35063, -77476, 141991, -142160, -116366, -133262, -63790, 72164, -179200, -84686, -101718, -56739, 140920, -389354, -222470, 6847, -89504, 369416, -59597, -239996, -865, -168582, 10140, 42991, -184376, 11309, -54488, -24132, 48031, 104043, 159945, -424844, 256274, -145053, -68271, 52735, 43171, 26473, -152859, -146152, -89445, 136761, -160013, 123439, -40831, -91721, 62903, -218286, -263052, -34316, 89226, 86921, 89376, -25609]
18078B9399d71605c830j85780c1437p3073j50848J0385O9459f0438l55506A7602
18066d32388H84M40910q3004F6116J54821J93275a21331j56641p6688E4766h2255
18054I6823J02053K6337a92102N7760M7910H4754J07655a37576B85177A1419K86380
18043B97799A22447n7830B4541a75135A57147b44131a16061m1035j0039J8271
18033a48864G2557R8476c2121p5723B13779D9139b43287G0854a64334l1664J1093
18022a84905D568a56118J8757j04190A15655N6546k0635L0460p709a29947E3852
18010A3133J23903A8210D196R7761a13365A30931b32549o532I4406r401b30340
17998A21320O1639p8416m8966L57781a11612R312E120K73166a59644E1731a29804
$$ y = [29399, -471605, -3830, -189610, -31437, -104510, -255358, -244973, -175514, -60438, -415944, 17602, -432388, 884, 441794, 358790, 66116, 220937, 414212, -121331, -277972, -354660, 54766, -82255, 96823, 198876, 225213, -192102, -134342, -86432, 84754, 192409, -137576, 285177, 11419, 297799, 122447, 64617, 24541, -175135, 157147, -244131, -116061, -157096, -167135, -148864, 72557, 171033, -32121, -107844, 213779, 49139, -243287, 70854, -164334, -195998, -184905, 4568, -156118, -137361, -241551, 115655, 172201, 151566, 182026, 174317, -129947, 53852, 13133, 137036, 18210, 4196, 101957, -113365, 130931, -232549, -239081, 94406, 85005, -230340, 121320, 182959, 104543, 55577, 413358, -111612, -102300, 5120, 278286, -159644, 51731, -129804]
17986A70298a44435A66391d83589K01761g2360k74649E6258a48107k03034B65581
17975d05191A97113d2331q7092j06475m7225G0278J45859j07520I860P5197a02113
17963e2763k56199a4428A59102N0699b37511g0201E006M5459f8713A25179J65162
17952B90341a22398A32013a10592a1432j36422C5241b36681f9366A53221b30036
17941g3336D0558j8467g5376n6401j04074B09862G3775b95040J32273H0122l7858
17930D2264d2232I7539b81432h7481B7063a50521d1008p0108C88415A23685J30929
17919B54614k8200c72445a25990A88630P4171a1152E6328L21652a44788B18335
17908H2602b76840G186a95937D354K19018B316K52376C8062a80318g9063B76017
$$ y = [170298, -144435, 166391, -483589, -281828, -72360, -347009, 56258, -148107, -351141, 265581, -405191, 197113, -42331, -129423, -235898, -283123, 70278, 216137, 108617, 9860, 85057, -102113, -52763, -308962, -14428, 159102, 209801, -237511, -70201, 5006, 50465, -68713, 125179, 290341, -122398, 132013, -110592, -11432, -147854, 35241, -236681, -69366, 153221, -230036, -73336, 40558, 22091, -75376, -131777, -235851, 209862, 73775, -295040, -162767, 80122, 42264, -42232, 97539, -281432, -87481, 27063, -150521, -41008, -111116, 388415, 123685, 254614, 226414, -372445, -125990, 188630, 262801, -11152, 56328, 377980, -144788, 218335, 82602, -276840, 7186, -195937, 4354, 223372, 2316, 254692, 38062, -180318, -79063, 276017]
17896A31a43005H6473d0075j12580A90321H112Q5590m5726K48551c1799C6129
17884d12025F9072N4326b11498h4639a9650j01498k01514A96531C0257J26849
17874A57106h7772B37670l6483b29204E579d2070B21862C4637J44901q2465J30416
17863B27489O9539a51832k0449C50068A14182C2885j0384f8488H8213C9518c04929
17851A22042L3979n5363N0678g0395I8568C4833a10988j35429a11499H973K32907
17840B41880j18366N219g7065k02733A56795b19429B1612g1809B39721a18267
17829b86072g514j22659k19485I4940l3591J18895p0511k918O7779p3228a87669
17817a38356A67991l6917m7064P5479e923k48309J07616Q362d2967j39141A70931
$$ y = [131, -143005, 86473, -40075, -152655, 190321, 8112, 93702, 47976, 296527, -31799, 36129, -412025, 69072, 123398, -211498, -84639, -19650, -121148, -322662, 196531, 30257, 157106, -87772, 237670, 201187, -229204, 5579, -42070, 221862, 34637, 179538, 97073, 227489, 297028, -151832, -172281, 350068, 114182, 32885, 22501, -68488, 88213, 39518, -304929, 122042, 156021, 100658, 151336, -70395, 98568, 34833, -110988, -246417, -111499, 8973, 241880, 123514, 128733, -77065, -279798, 156795, -219429, 21612, -71809, 239721, -118267, -286072, -7514, -130173, -349658, 94940, 61349, 180244, 109733, 106815, 174594, 101366, -187669, -138356, 167991, 131074, 84010, 159489, -5923, -254232, -146616, -138254, -42967, -182108, 170931]
17805A08604J39304h1985n9373G3254a2881j64559b6613A02311b31081C40349
17794C472a18877A82031j6159a36971A37689d12528f5204D26182b54521p5009
17784c29530P0312B00055I7481i596D55708j91146a65415O2416L2494A86580g4549
17772B69094f892C69991E9761a17265A01864L83796d4525j24902A04640l2784
17762G1856i5677L7707B74137d41957I8901B8864a42924B5858c76300A33235c691
17750A8058J53953a15401D759M1921i1234F4122h2552M718A69676b3408k28082
17739b51490G7664i8933b5745j45011C17870f7739I7147c8107F9724J20371a57547
17727A54833F90N3095b61546A66005c10075B76165K9978A26819k8269b28601h8978
$$ y = [108604, 247908, -81985, -141358, 73254, -12881, -177440, -26613, 102311, -231081, 340349, 3472, -118877, 182031, 165872, -136971, 137689, -412528, -65204, 426182, -254521, -329530, -259218, 200055, 97481, -9596, 455708, 264562, -165415, -102999, -70505, 186580, -74549, 269094, -6892, 369991, 59761, -117265, 101864, 485660, -44525, -169427, 104640, 71856, -95677, -57970, 274137, -441957, 98901, 28864, -142924, 25858, -376300, 133235, -3691, 18058, 172011, -115401, 4759, 46680, -91234, 64122, -82552, -77834, 169676, -23408, -251490, 77664, -98933, -25745, -170756, 317870, -67739, 97147, -38107, 69724, 190095, -157547, 154833, 690, 53785, -261546, 166005, -310075, 276165, 306143, 126819, 98550, -228601, -88978]
17715A81329b5265k99621A29649a62717O6382B96647J09707N1672j92824A13060
17704A58935e1071B4845J2433k60R2466P5935J13310b20671A97629i1801b8374
17692B42956G8049A8492g6926A64073d8824l07248i0643l07611a29404a0640k64801
17681b75441A76732p0483R6001I2849J9823J08657p7556a36141H5609a00644j1235
17670a11879B41683b3879B17301a24555A70286a5573j15174K4902D3821K43185
17660B87006I9112c9012m5299B59785j28799B891a71308O6515A86636c75959d460
17648E6755c4843B28429D1601N6038J63428a95519B52319m9441G1419f7258j58991
17637b26249j0373c2682m2399C37801c4233k5722C5088Q5173a00645b8281I154
$$ y = [181329, -25265, -324886, 129649, -162717, -96335, 296647, 406354, 458026, 265202, 113060, 158935, -51071, 24845, 37278, 37018, 129484, 205419, 318729, -220671, 197629, -91801, -28374, 242956, 78049, 18492, -76926, 164073, -48824, -356072, -90643, -398254, -129404, -10640, -275441, 176732, 106249, 202250, 92849, 112672, 221329, 143773, -136141, 85609, -100644, -111879, 241683, -23879, 217301, -124555, 170286, -15573, -130747, -105845, 43821, 287006, 99112, -39012, -84311, 259785, 130986, 2891, -171308, -104793, 186636, -375959, -4460, 56755, -34843, 228429, 41601, 97639, 261067, -195519, 252319, 202878, 71419, -67258, -226249, -236622, -32682, -75081, 337801, -34233, -59955, 35088, 120261, -100645, -28281, 9154]
17625F2362b01027A77538a51008M662B12054q5857c22963a07821c3060J2127A98953
17613A04941K54790d0140A04840J35408a33940f420A98844r1375J01657G8877
17602a25630j54086A12896K18763g7478a172C6311c00624h4265p2397I1988e9794
17590a12435B9324L0496K5982j3545L44141f2792j49691E849N3821N9984L48922
17579D68576A83296g1602H5102c4247E109O0753a72893m302K845B8535b8228j42163
17567a70391A87832A896J89594B5045i7901h254A31996F5986J05330l1461F3069
17555C56622b42978A06194A2375e5234E33546B35025r2128Q2893r2983R0865E2933
17543b2568A41123K5866J12128a5182A07268A7834J50138b54140A66624J36597
$$ y = [62362, -201027, 177538, -151008, -146346, 212054, 126197, -322963, -107821, -33060, -20933, 198953, 104941, 359731, -40140, 104840, 240248, -133940, -6420, 198844, 107469, 209126, 78877, -125630, -279716, 112896, 331659, -77478, -1172, 36311, -300624, -84265, -156662, 91988, -59794, -112435, 29324, 59820, 85802, 72257, 416398, -62792, -212483, 5849, 59670, 119654, 468576, 183296, -71602, 85102, -34247, 5109, 65862, -172893, -177195, -174350, 28535, -28228, -170391, 187832, 1896, 191490, 25045, -97901, -8254, 131996, 65986, 171316, 139855, 63069, 356622, -242978, 106194, 12375, -55234, 533546, 235025, 142897, 225790, 132807, 223672, 52933, -22568, 141123, 166989, 279117, -15182, 107268, 17834, 167972, -254140, 166624, 303221]
17533C03221A48340b2500A31925K18019A31386K5785m5887K16298A60842B6691
17522A10307C0592b31079j51254B09096J0980D916K8890L7044C0839K86153d89415
17510E7705a94315E05644B46901a96428p012E0086L9532h7360m1491E485K86629
17499B92114A41775B321K0854J9186A2786e9133A78811O2955H9641D3930M22494
17488D66424B00335L8702e6845A72455O7805K33056G3273L00817A54267G3300
17477C73774B7195a58900E7919J60341K4093m3736L9084c05235D83928l0024C9232
17465B56205j22007J54738H7546J35004q1568f5251A07326O2782D5655M97919
17455E43574k02982A60734k723K23189H9086J64692j7693A06575J17560m8576
$$ y = [303221, 148340, -22500, 131925, 349944, 131386, 157171, 111284, 327582, 160842, 26691, 110307, 30592, -231079, -382333, 209096, 220076, 4916, 33806, 70850, 30839, 316992, -489415, 57705, -194315, 505644, 246901, -196428, -203440, 50086, 89618, -87360, -128851, 5485, 292114, 141775, 2321, 23175, 42361, 12786, -59133, 178811, 241766, 89641, 43930, 466424, 200335, 239037, -56845, 172455, 240260, 473316, 73273, 374090, 154267, 73300, 373774, 27195, -158900, 57919, 218260, 242353, 198617, 237701, -305235, 483928, 453904, 39232, 256205, 134198, 288936, 87546, 222550, 140982, -65251, 107326, 170108, 45655, 543574, 340592, 160734, 158011, 381200, 89086, 253778, 236085, 106575, 224135, 175559]
17445A75559K17996j44209a63232B08929a75036Q4607B89692R543A26627l0672
17435I5955m1138L90802a4618A45120o4665g8391A08940a0851C52569b083C64014
17423C29371j55749P0024j9967J1848m8599a03977B51594J16847A64753a04910
17412B38589j07388J41216P5951a2814C4904g1495j76539D01723l3320o5155H9151
17400A63562d0724A76196q8064K46473k2275r6838d0107m3479C50732d6610G8974
17388A08570P9212K38247k06513J14924P7727n4153i2614D94924A275K53100j06685
17377A47690m886P5442p1613e2681A71471Q2228I7543c468A03669C3027a8852
17365C85082C7976J86698n2117N1786b0084j7770C46006o1329A31872J1717K03274
$$ y = [175559, 393555, 249346, -163232, 208929, -175036, -90429, 289692, 299235, 126627, 95955, 54817, 445619, -14618, 145120, 80455, -78391, 108940, -10851, 352569, -2083, 364014, 329371, 173622, 243646, 223679, 235527, 186928, -103977, 251594, 368441, 164753, -104910, 238589, 131201, 272417, 348368, -12814, 34904, -71495, -248034, 401723, 368403, 303248, 89151, 163562, -40724, 176196, 88132, 334605, 312330, 215492, -40107, -83586, 350732, -46610, 78974, 108570, 187782, 426029, 219516, 334440, 412167, 358014, -92614, 494924, 1275, 254375, 147690, 142804, 218246, 146633, -52681, 171471, 253699, 97543, -3468, 103669, 33027, -18852, 385082, 37976, 224674, 172557, 224343, -20084, -37854, 346006, 284677, 131872, 143589, 346863]
17354C46863e9588A76299K76073a11593q0323O4200C29945c2932G51h213A75849
17342A88632K6570j1764M8186I8782K72455j83513b66367C52839A25915b03B70761
17330a1432C94478m2589e9409j80884B83595J85888j06975A31532K05539A14238
17319f954B65604k3890C0840Q7382m6080K45277a60780q4011D8781J36019d1333
17307C25467j42808n2416L9310L84749k33009a1804B2101J55536J63546r3651
17297B47532F6315L03043r0549j0250A2123b4858j23531B34682a15494C01538
17286e3366B80361a04789A64143j3075L75801k18167c3827E9226J1360k7609J52905
17275A95882i8186c6312J3362D80331a49030A33796i274B99141m9926M1934j41098
$$ y = [346863, -59588, 176299, 452372, -111593, -191916, -127716, 329945, -32932, 751, -8213, 175849, 188632, 215202, 203438, 251624, 98782, 371237, 187724, -266367, 352839, 125915, -203, 270761, -11432, 394478, 351889, -59409, -240293, 283595, 469483, 362508, 131532, 337071, 114238, -6954, 265604, 241714, 30840, 118222, 72142, 317419, -160780, -244791, 48781, 184800, -41333, 325467, 182659, 130243, 169553, 554302, 321293, -11804, 22101, 177637, 341183, 247532, 66315, 369358, 278809, 268559, 12123, -24858, -148389, 234682, -115494, 301538, -53366, 280361, -104789, 164143, 151068, 526869, 308702, -33827, 59226, 70586, 42977, 195882, -98186, -36312, -22950, 480331, -149030, 133796, -9274, 299141, 249215, 291149, 150051]
17264A50051L03823D1464L03441m6409j29934L01232A12947J61982p7325J31339
17254C28943K63407A11415B4125m522J25142R8023E8934i545B03642K39762a77064
17242A86083a27240C51076J47676B12075n5751L92856k47577d1149r9752E76655
17231B23420j01577J2523N5768k9982Q3N0581j03497j3309P8347R3632h7847D08426
17218B28377G3297f6554A13713J64822F6812N0712m2913P5957a24732C35226o157
17207C29069R0155A77060O0672N2751r9196b2864B80822p0749n8263Q2519K908
17196B37237F7610j9387j3197M43877m2783D1933K82581Q3918E0404a17640B78542
17184C23225c7603C58368L4920E8295K38138p2619P6526r5191J4590K34510H4971
$$ y = [150051, 453874, 41464, 344905, 298496, 168562, 469794, 112947, 274929, 197604, 328943, 592350, 111415, 24125, 19603, 144745, 242768, 58934, -9545, 203642, 443404, -177064, 186083, -127240, 351076, 498752, 212075, 156324, 549180, 301603, -41149, -140901, 576655, 223420, 121843, 134366, 190134, 160152, 160235, 210816, 107319, 94010, 172357, 265989, -87847, 408426, 228377, 73297, -66554, 113713, 278535, 66812, 117524, 74611, 150568, -124732, 335226, 329069, 419224, 177060, 237732, 290483, 191287, -22864, 280822, 210073, 151810, 234329, 237237, 67610, 48223, 35026, 478903, 436120, 41933, 324514, 408432, 50404, -117640, 278542, 323225, -37603, 358368, 393288, 58295, 296433, 223814, 300340, 205149, 219739, 454249, 84971]
17172E32519j79055P8828o9386r8269O412j7722J06563K61774l08201c3763D21297
17160b081B52402m3939J74687A09264Q3827G650J5095K54449J24108g430E67267
17148C95387A0880a3746A70164L07467A52110J20854J23626C8177M09962j95837
17138B52302l272K36040A18059K15900A04008L2101c1113D08211B02162K86676
17128D88838k05267D2082O46927j70521p4147B05041N3822A04033L81113k01618
17118B83528K2469K13536A93489E6866L38559K9277K19340B19807L09500B63909
17107E61272m3378j06936J10581j59687j05171q4029J68856I6784J28527L70149
17097E95460J07652k47712p9645K2441K23303A24497M92011B82156J93604q8308
$$ y = [532519, 353464, 432292, 362906, 264637, 271049, 253327, 359890, 621664, 313463, -33763, 421297, -2081, 252402, 208463, 383150, 109264, 193091, 7650, 22745, 277194, 401302, -7430, 567267, 395387, 10880, -13746, 170164, 477631, 152110, 272964, 396590, 38177, 448139, 252302, 249030, 485070, 118059, 333959, 104008, 136109, -31113, 408211, 202162, 488838, 283571, 42082, 689009, 518488, 444341, 205041, 258863, 104033, 485146, 283528, 305997, 519533, 193489, 56866, 395425, 424702, 644042, 219807, 529307, 263909, 561272, 517894, 410958, 521539, 361852, 256681, 172652, 341508, 96784, 225311, 595460, 703112, 455400, 375755, 398196, 621499, 124497, 616508, 282156, 475760, 387452]
17087C87452K0979L33916k25819n0232n4694N9323m179r0525j15532J56360Q0222
17076D97271p1409m3587Q548J90809k56997K1181K73734j95691j59889M07905
17066F71875A20028K16550J56564Q1383k55170J87845J13919j57482K1029r1590
17056C93076J50218J05975j87540j4236j63549K59910o444j55370K24950l8730
17046E68260j01891j3093r2642J15929j93622K95266j47566K09137k2230k51770
17036C65778r287L22101K9759j5360l11820R8647B07804L74359l0609j49784N12289
17025I14059D49542J32920J41534j97843Q8496J350j46701J58705n2757j1350
17015E63896j1355K10703l43008j38837l6166O67452C12616J70539Q4573L13082
$$ y = [387452, 408431, 742347, 516528, 466296, 411602, 470925, 466746, 376221, 260689, 417049, 497271, 425862, 382275, 390823, 581632, 324635, 345816, 619550, 423859, 263970, 671875, 120028, 336578, 493142, 574525, 319355, 507200, 621119, 463637, 484666, 393076, 543294, 649269, 461729, 447493, 283944, 543854, 537410, 382040, 606990, 568260, 466369, 453276, 360634, 476563, 282941, 578207, 430641, 639778, 617548, 365778, 356491, 678592, 708351, 692991, 381171, 479818, 207804, 582163, 551554, 401770, 914059, 449542, 582462, 723996, 526153, 614649, 615999, 469298, 628003, 575246, 563896, 552541, 763244, 420236, 281399, 245233, 912685, 312616, 483155, 567728, 880810]
17005H80810j1966j45149j19312P8484p9098J81692k97079N20949l75334K21761
16995H55758m04467J68558L59007k64973n034j15054K2094K27692D15431L50379
16985G65810K14727k72263P5600J70091o6609R6171j51205k53419J85676J40777
16975I05356j9230K5107O0942j55162L8j19081J81412j6174K08857k96067K94773
16964A070771k11318k50428O10841F02479N39282k91373Q2244K60869m66349K99711
16954A026863k25116K86454n7006M06586k76468l0174k03909j5755M55627k01413
16944A165689j29425k13402J0571j41810L00034j2102J57804J90536j31701L46796
16934A542990m1846j52218k41255J75532J81920q6891j89273o7328K50266l17859
$$ y = [880810, 868844, 723695, 604383, 682867, 603769, 785461, 488382, 1009331, 633997, 855758, 451291, 619849, 978856, 713883, 708849, 593795, 615889, 843581, 415431, 765810, 980537, 708274, 783874, 953965, 887356, 983527, 832322, 578903, 764579, 905356, 886126, 911233, 972175, 817013, 817051, 697970, 879382, 863208, 1072065, 775998, 1070771, 859453, 609025, 1219866, 602479, 1141761, 850388, 932632, 1193501, 727152, 1026863, 801747, 1088201, 1031195, 1437781, 1161313, 1131139, 927230, 911475, 1367102, 1165689, 1036264, 822862, 833433, 691623, 991657, 979555, 1137359, 1327895, 1196194, 1542990, 1501144, 1348926, 1107671, 1283203, 1465123, 1378232, 1188959, 1121631, 1371897, 1054038]
16924A054038K99332N076l21110N39607q6919k75332j34037N57864m94019M22807
16914A567307Q4371l13392k8493K72405l01716L09488n5465J9792L62103j37130
16904A779270j78684j30133K26466m74000N40847R5234N9024k07626j93621K23564
16894A740341M11144m18902k85091K09942k93757O07435O9997l65095K02468r0387
16884A788095L43889p5754k25416j06052L93689M961L76327m93374K30986r2561
16874B144790M5317J56711K4950l78993L68925J00238j30265p5898n6769L00535
16864B499541j62574J34492R2737l63610K37983K85135n1211k61002N94875j00066
16854B906300l39246J15500N15266J46482m32878K52448J02679j30473J40365
$$ y = [1054038, 1353370, 1358446, 1037336, 1576943, 1490024, 1214692, 1080655, 1638519, 1144500, 1567307, 1651678, 1338286, 1309793, 1582198, 1280482, 1589970, 1534505, 1554297, 1916400, 1779270, 1600586, 1470453, 1696919, 1222919, 1763766, 1859000, 1918024, 1710398, 1516777, 1740341, 2151485, 1732583, 1447492, 1657434, 1363677, 1971112, 2041109, 1676014, 1878482, 1788095, 2131984, 2056230, 1830814, 1724762, 2118451, 2123412, 2499739, 2006365, 2237351, 2144790, 2190107, 2346818, 2371768, 1992775, 2361700, 2461938, 2331673, 2255775, 2199006, 2499541, 2336967, 2471459, 2564196, 2200586, 2438569, 2723704, 2672493, 2411491, 3006366, 2906300, 2567054, 2682554, 3197820, 3344302, 2911424, 3163872, 3266551, 3136078, 3276443]
16845C276443j23802M11040l04235Q0247M510j61529M52908j74305K28475K77548
16835C967300N2429M2592J44657k47055L63615j08214K43745p1842R4271K0078
16825D501576m6224K64798M0269j7005J89051J56993k4772K54692k59143L55363
16815E415598K67049k6694J82235l19002N76526l94863K89016L26245J45555j11395
16805F350270L79484J29878L02303K34315o186o5190K56602L45450J12545K47301
16795H286772N635N8001N39311J20384J99853K97341N11556j02633L49386K22227
16785A0487833L75170O7436O12750M5620Q07273J76885L70420J82137K78492J056567
16775A4460583j6086O10427J48753L13744R97261R38960L46662L55526P75113
$$ y = [3276443, 3152641, 3563681, 3259446, 3339693, 3344203, 3182674, 3635582, 3461277, 3689752, 3967300, 4019729, 4062321, 4206978, 3959923, 4323538, 4215324, 4459069, 4387227, 4481498, 4501576, 4455352, 4720150, 4760419, 4743414, 4932465, 5089458, 5064686, 5319378, 5060235, 5415598, 5682647, 5655953, 5838188, 5519186, 6095712, 5700849, 5989865, 6316110, 6461665, 6350270, 6729754, 6859632, 7161935, 7396250, 7390064, 7324874, 7581476, 7926926, 8039471, 8286772, 8292407, 8350408, 8889719, 9010103, 9209956, 9507297, 10018853, 9916220, 10265606, 10487833, 10863003, 10930439, 11543189, 11588809, 12396082, 12572967, 12943387, 13125524, 13404016, 14460583, 14444497, 15054924, 15203677, 15517421, 16514682, 17453642, 17800304, 18155830, 18930943]
16766A8930943P68657N52985P18725P03080Q18666Q96464R01440J506409P23258
16757B6520627J073437J281273J427853J094629J323150J290176K040753J654435
16749C7706333J914019K050767J990591K095999K343515K782754K402846L147387
16741E6434211L205586L371052L787164L437158M307310M313587M960127M987345
16733H8803540N405837N929753O373017O292018P128535O991627P328920P505409
16725A41758656P654322P737312P671045P516687O782563N841176M642376L765553
16717A93369690K692934J358140o31301j120866k619979m567268n397598o135532
16709A76948220o796640p502287p565502p692046p859101q291873p018510p359788
$$ y = [18930943, 19699600, 20252585, 20971310, 21674390, 22493056, 23389520, 24290960, 25797369, 26520627, 27594064, 28875337, 30303190, 31397819, 32720969, 34011145, 36051898, 37706333, 39620352, 41671119, 43661710, 45757709, 48101224, 50883978, 53286824, 56434211, 59639797, 63010849, 66798013, 70235171, 74542481, 78856068, 83816195, 88803540, 94209377, 100139130, 106512147, 112804165, 119932700, 126924327, 134253247, 141758656, 149412978, 157150290, 164821335, 172338022, 179120585, 184961761, 189604137, 193369690, 196062624, 197420764, 196789463, 195668597, 193048618, 188481350, 183083752, 176948220, 170151580, 162649293, 155083791, 147391745, 139532644, 131240771, 124222261, 116862473]
16701A16862473o858202o692116o494702o005076n307790m856568n254890m067915
16693G1325214m101223m015017l952817l115504l028574k999159k416512k529900
16685D5166508j918877k541618j845022k151625k191052r23801k051660j362708
16677C0180145j003812j515186o29350j709460o55702j147456r26190p81492q86018
16668B0925479r93553o69635o20715n72874r21834n42215p61685J1097q82599
16659A4971466p23828l78117m62521m67440l5849p84327j5844o16423l4361n79835
16649A0872921n50980r1203m36506k44616q1245m76046n2066l82385k08182J149
16639H350841j88569k16644k07687k94672m43079k13548J99998j33479m8438n17989
$$ y = [116862473, 110004271, 103312155, 96817453, 90812377, 85504587, 80648019, 75393129, 71325214, 67223991, 63208974, 59256157, 56140653, 53112079, 50112920, 47696408, 45166508, 43247631, 40706013, 38860991, 36709366, 34518314, 33594513, 31542853, 30180145, 29176333, 27661147, 27031797, 25322337, 24666635, 23519179, 22592989, 21811497, 20925479, 19931926, 19262291, 18641576, 18068702, 17146868, 16604653, 15842968, 15854065, 14971466, 14247638, 13869521, 13407000, 12939560, 12903711, 12119384, 12103540, 11487117, 11452756, 10872921, 10321941, 10230738, 9794232, 9549616, 9468371, 8992325, 8940259, 8557874, 8349692, 8350841, 8162272, 7945628, 7737941, 7443269, 7000190, 6786642, 6986640, 6853161, 6804723, 6286734]
16629F286734M6005N8182l95512k84992J32866L111k86312J16546j36892o58689
16619D881047L15329O6022l50511o63161K16546j61468L35157l68148m2344j45309
16609D083160O9955l66454J84391o4452n3612k71111L88026k45125m02065L17495
16599C640208l49228j13712J8437J06973k70907L52418l02913Q2776o7995l40965
16589B755092M8344M2546k05870R712r3287o2510m8025R9148j14980M47956n18192
16578B359934m1279L54668m62519K40604n96073O47163l98011P7045O6168j94521
16568B053179j36116O6692k00211L21337l12286K12062k5743K05788l78444J47284
16558A953542j25817l10145L15678j33107j37420J60861l86750L13242Q0376K7546
$$ y = [6286734, 6332739, 6390921, 5995409, 5710417, 5843283, 5846394, 5560082, 5676628, 5539736, 4881047, 5196376, 5262398, 4911887, 4248726, 4465272, 4303804, 4638961, 4270813, 4228469, 4083160, 4153115, 3786661, 3971052, 3906600, 3852988, 3581877, 3969903, 3724778, 3322713, 3640208, 3290980, 3177268, 3195705, 3302678, 3031771, 3384189, 3081276, 3164052, 3096057, 2755092, 2803436, 2845982, 2640112, 2649824, 2556537, 2494027, 2446002, 2545150, 2430170, 2878126, 2359934, 2318655, 2673323, 2210804, 2451408, 1855335, 2502498, 2104487, 2181532, 2247700, 2053179, 1917063, 1983755, 1783544, 2104881, 1792595, 2004657, 1978914, 2184702, 1806258, 1953542, 1827725, 1517580, 1833258, 1700151, 1562731, 1723592, 1336842, 1650084, 1730460, 1758006]
16548A758006m44920K34237j15866J73142j53204k30684L74977J0502k23506p9628
16538A303056K68915k36060j09191j13026J70840K11301o85528O10136o6548k32005
16528A121890J9968J04749J4850k14265J46544o0388m2548q8587K27062j71307
16518A057968k3050n9068j25618K67721j28610j86005k0406M84006k03557J16881
16508A180262j45390M5886j85433K1574o0643l2354q4247K08783J532k28967J66696
16497H87699j19093k952J51582j50863J63202j1982L27010D74894K89427j10166
16487F54155M94020k19165k17052J81857k64490L87951A56252M49398M06800l88163
16477F24287M03372j6243l89506j04139M22542k56539P4397O384k9922r5685J35631
$$ y = [1758006, 1313086, 1547323, 1431457, 1604599, 1451395, 1220711, 1595688, 1606190, 1382684, 1303056, 1571971, 1335911, 1226720, 1113694, 1284534, 1495835, 810307, 1420443, 1353895, 1121890, 1141858, 1246607, 1261457, 1047192, 1193736, 1133348, 1090800, 1002213, 1229275, 1057968, 1034918, 975850, 850232, 1117953, 989343, 803338, 782932, 1266938, 1063381, 1180262, 1034872, 1080758, 895325, 916899, 856256, 823902, 739655, 948438, 949970, 721003, 887699, 768606, 765654, 917236, 766373, 929575, 917593, 1244603, 474894, 764321, 654155, 1148175, 929010, 711958, 893815, 629325, 1017276, 156252, 605650, 1012450, 624287, 1027659, 1011416, 621910, 517771, 940313, 683774, 758171, 764555, 734633, 638948, 774579]
16466G74579l01681J23781J15347J13177k60840K71062l54209M59420k88488l9699
16456F12449J720k9956j14298J96604n7930M91162C88382K68168j31678o4594
16446D60278J14740n0861j50097J24020j4943J19423J09066k76209P8379l9194
16436D74602N33711l45859j99679P8200j91014L16546k08978Q0769N6144l3279
16426E61163j78766r756M3566J00146j28696N4863R0858k63506L48739j96541
16416D22070M46352k67027j43210K1058J19235l7955K3281A56806L22330B16564
16405C38075J37594r0498P1514p5739O7349j06545A64212K55794J77935L4993
16395F32934I7727K27871r7163K1761M26564k93054M9969K1912j61323L15705
$$ y = [774579, 472898, 596679, 712026, 825203, 564363, 835425, 481216, 940636, 652148, 612449, 614169, 584213, 469915, 666519, 608589, 1099751, 388382, 656550, 524872, 460278, 575018, 524157, 374060, 498080, 483137, 602560, 711626, 435417, 513796, 474602, 1008313, 662454, 462775, 540975, 349961, 666507, 457529, 538298, 594442, 561163, 382397, 372641, 416207, 516353, 387657, 442520, 533378, 269872, 618611, 422070, 868422, 601395, 458185, 479243, 598478, 560523, 583804, 156806, 479136, 216564, 338075, 475669, 385171, 456685, 380946, 448295, 341750, 164212, 420006, 597941, 632934, 97727, 325598, 228435, 250196, 676760, 383706, 433675, 455587, 294264, 609969]
16385F09969q4484J2052j11930o6833O1253M7308R883p4356j28897J81119n0365
16374D04719r9689N4319L2505o7555M8043l8798k057L6672j10361J80356j03400
16363C34754p3719J47445G2317Q7428J14944o3529J29898J1073A68562L52804
16353E21366A62940K9863A9556L18905J45041k25882m2534K45858k13188O9852
16343C17608j00023K71720o9256Q7461k44410J01020q3490K2598J65645J08142
16333E77015B28626q7859M9508n4006L17857j02763J0030K2263G2436K04365H0821
16321C33416a6114D32063o5600I4263M47118G7876J66046K5676L04941j67922
16311D06617j5732A30640K12337c7649o6585B48630a40850C43134N1923e993G1825
$$ y = [609969, 525485, 537537, 425607, 358774, 420027, 467335, 477218, 402862, 273965, 455084, 404719, 305030, 359349, 391854, 324299, 372342, 333544, 331487, 368159, 257798, 438154, 334754, 261035, 408480, 72317, 159745, 274689, 211160, 341058, 352131, 168562, 521366, 162940, 192803, 19556, 338461, 483502, 257620, 215086, 460944, 247756, 317608, 217585, 489305, 420049, 507510, 263100, 364120, 280630, 303228, 468873, 577015, 228626, 140767, 190275, 136269, 454126, 351363, 361393, 383656, 72436, 276801, 80821, 333416, -16114, 432063, 366463, 94263, 541381, 77876, 243922, 269598, 574539, 406617, 390885, 130640, 342977, -37649, -104234, 248630, -140850, 343134, 395057, -5993, 71825]
16299a10178D9453J19568o3931K44445G5234L60984A78384J9772K11890k00767
16289B09279p0288N5481K15810A04708J27699J90626k08084J7521c0846A95722
16278A76164M51108A50192L44425k29382F3068c7575C45465a4101D72838A32940
16267B40772a09512C80304f169A85254J97862j35260l3777J24812J05845g3581
16256B1886Q7494R6244b14582E23665k61423L6679L1623b99030C0659m582L11641
16245C37718A40887N8972a65192A09084b09435D6727e4167b5702A04669b04409
16234f7161G500K19617H9333J82482F5397a49757q1738j77154C76894A21923J94634
16223C16557a20238j70509C57316j40884K09278K3280k04651q6894A1467L29766
$$ y = [-110178, 49453, 169021, 105090, 349535, 75234, 436218, 178384, 198156, 410046, 209279, 138991, 194472, 410282, 104708, 232407, 423033, 214949, 232470, -30846, 195722, 176164, 627272, 150192, 494617, 265235, 63068, -37575, 345465, -14101, 472838, 132940, 240772, -109512, 380304, -6169, 185254, 383116, 247856, 214079, 338891, 444736, -73581, 21886, 109380, 205624, -214582, 523665, 262242, 298921, 330544, -299030, 30659, 26077, 337718, 140887, 199859, -165192, 109084, -209435, 46727, -54167, -25702, 104669, -204409, -67161, 7500, 227117, 89333, 271815, 65397, -149757, -231495, -408649, 376894, 121923, 316557, -120238, -290747, 357316, 216432, 425710, 448990, 244339, 157445, 11467, 341233]
16213C41233b58291g4190a6871H2670Q8055q4367M72794A26504K12599K33b6241
16201D4182J47724I1288b7236C5349j0837c5925j89980A26532b09029l9391B16443
16189D00573j61742A4312K76711r8402a17025m853C73310A36687J68072H8216
16178C08850A38456P6375J06530K00325a8198A13315K27119a47251B35704d573
16167D3569R6995P8937a31082r5738A1352i5856L0203a2502n5655A05486o037
16156I9449J83715c48053D1991J06955P48m007K5272f8778A04869d6555n5102
16145a01657A62706a723C7702j180j0487a80271e3345G9715B665b24662A60157
16133C44442A21040b25229B05846D2141b17462C08632c222m5685a9671F5202d8998
$$ y = [341233, -258291, -74190, -16871, 82670, 170725, 86358, 559152, 126504, 339103, 339336, -26241, 44182, 191906, 91288, -27236, 35349, 24512, -35925, -225905, 126532, -209029, -248420, 216443, 400573, 238831, 14312, 291023, 192621, -117025, -121878, 373310, 136687, 304759, 88216, 308850, 138456, 214831, 321361, 521686, -18198, 113315, 340434, -147251, 235704, -4573, 43569, 140564, 219501, -131082, -226820, 11352, -95856, -65653, -12502, -68157, 105486, 99449, 283164, -348053, 41991, 148946, 149694, 145687, 170959, -68778, 104869, -46555, -101657, 162706, -1723, 37702, 36522, 26035, -180271, -53345, 79715, 2665, -224662, 160157, 344442, 121040, -225229, 205846, 42141, -217462, 308632, -3222, -48907, -19671, 65202, -48998]
16121A73032b82604C1211h3965c4316B82821A4109O9082j20e5413A56922d5484
16109A12247B4885a73026a0183D03609A35143b93200c271j01213A938K32749c53505
16097A10522J43826k1403f1938n1466e2036D89634F4251c398F7161c1573B793
16085a73505A10624l8372n880M2571b99661A03674J29916b17723C48658H2711
16074H4629O0939d22802A59268K33078a25644C58845C6832K44203C4283Q6957
16064A21240d5311A97591p9277a52744f2764j59833G0190b2744o5767A29146p492
16053A21654J07857o4308h6184A2242J38817a3827k38595d2399p6969A9716J08880
16042A28596l7681a57690P6557j03899A90443A9328g1746E2992O92a92300D53840
$$ y = [173032, -282604, 31211, -83965, -34316, 282821, 14109, 83191, 83071, -55413, 156922, -45484, 112247, 24885, -173026, -10183, 403609, 135143, -293200, -3271, -104484, 1938, 234687, -353505, 110522, 254348, 232945, -61938, -113404, -52036, 489634, 64251, -3398, 67161, -31573, 2793, -173505, 110624, 72252, 66372, 108943, -299661, 103674, 233590, -217723, 348658, 82711, 84629, 145568, -422802, 159268, 392346, -125644, 358845, 36832, 281035, 34283, 121240, -45311, 197591, 118314, -152744, -62764, -222597, 70190, -22744, -88511, 129146, 121654, 229511, 165203, -86184, 12242, 151059, -13827, -252422, -42399, -119368, 19716, 128596, 90915, -157690, -81133, -185032, 190443, 19328, -71746, 52992, 53684, -192300, 453840]
16030b1594B02178l6540B4385a83987k0958B1170b61661A71344j5262O099a9565
16018E7941L27236A20672d4097A2443a71273B59626H0185c5546r0526B26645p6156
16007A50489h5427C0022a82571A76337D8327J04480b991m416j55968I6356Q6715
15996A83071d13234b1951E6469a37623F0109Q906a38153o2648C26339j14247j8156
15985A93936H4906b59264E1667J40817L09810A24783a57639g0232j06103I0539
15974B52165b63052F8354a01690j48065A40982C667h8969j31549F9406a08151
15963A79463o534n6328m9447g8311D01744C1405c36891E1878c0111I7521O0618
15952A58139h7487L4340l629j92280E8572a30898M1335r7041k3489A90546f1126
$$ y = [-21594, 202178, 165638, 24385, -183987, -204945, 21170, -261661, 171344, 156082, 162181, -19565, 57941, 385177, 120672, -44097, 12443, -171273, 259626, 80185, -35546, -126072, 226645, 150489, -85427, 30022, -182571, 176337, 48327, 152807, -2991, -7407, -163375, 96356, 183071, -413234, -21951, 56469, -137623, 60109, 69015, -138153, -200801, 326339, 212092, 193936, 84906, -259264, 51667, 192484, 502294, 124783, -157639, -70232, -176335, 90539, 252165, -263052, 68354, -101690, -249755, 140982, 3667, -88969, -220518, 69406, -108151, 179463, 172929, 116601, 67154, -78311, 401744, 31405, -336891, 51878, -30111, 97521, 158139, -87487, -53147, -56776, -249056, 58572, -130898, -89563, -186604, -210093, 190546, -61126]
15940b57521e3162k5894J5272A1403J53220B0566M8913a7542j8178B4217b20701
15928B50194d22109a2629j9142B5868J02070m7295b39871i3310j33255L6386c4208
15916a05746q5912d6289C02943B9896e2457k60754F2922a30283C2662K43582b1421
15904d7803j21087j35959N9957g1409j12029D044a3955B7097J5640c44887J35555
15893b09332N4586p5926E3134g0444m4859a7105k53309M655a1582C31204e72967
15881c4070p860l2022q6616k09480m377a71012q1423B05864c35003k4568g005
15869d4688J9515k38260H0421a10981d6393m7834A0607b03382A04899J64816b45337
15857a57701A07963L479J54696a80263h9722B0500b37789A03057A0501h6501L9260
$$ y = [-257521, -53162, -79056, -63784, 11403, 164623, 20566, 69479, -17542, -35720, 24217, -220701, 250194, -422109, -12629, -31771, 25868, 127938, 80643, -239871, -93310, -226565, -190179, -34208, -105746, -191658, -46289, 302943, 29896, -52457, -313211, 62922, -130283, 32662, 276244, -21421, -47803, -168890, -304849, -244892, -71409, -183438, 4044, -13955, 27097, 42737, -344887, -209332, -154746, -230672, 53134, -70444, -115303, -17105, -270414, -265759, -11582, 331204, -572967, -34070, -41930, -73952, -160568, -370048, -374425, -171012, -252435, 205864, -335003, -359571, -7005, -44688, -25173, -263433, 80421, -110981, -46393, -94227, 10607, -203382, 104899, 269715, -245337, -157701, 107963, 111442, 266138, -180263, -89722, 20500, -237789, 103057, 10501, -86501, -47241]
15846d7241j25039B24563n7603d84947b30184B081Q0878D267J32190A5957P1452
15835H7409L1493J68440a09736M7484A72898r089a21304o2213a0638A86860J0959
15824A97819b20475A42622c250j38740M000k44873B01625b75064A12777C4470
15813h9389L5522G6943J63254a59236f1600k69169B7a47653P0706B4071f9122
15801c21362B57706j15253L0541a34174j77390C27718a30150a7494A8839J3814
15791C2653Q2047A7764e8150B22682F2219c11005J46305E8764a96133l55623g8392
15779E9810c7749k4465l35451B64251a04577d8712B16431a48278r8357A24664
15768d2775a5789p552j32286A7773L44117g397D54311j21981P4366a60325k23257
$$ y = [-47241, -172280, 224563, 166960, -484947, -230184, 2081, 82959, 4267, 136457, 15957, 87409, 118902, 287342, -109736, -62252, 172898, 163809, -121304, -183517, -10638, 186860, 197819, -220475, 142622, -3250, -141990, -137990, -382863, 201625, -275064, 112777, 34470, -89389, -53867, 76943, 240197, -159236, -61600, -330769, 27, -147653, -76947, 24071, -69122, -321362, 257706, 142453, 172994, -134174, -311564, 327718, -130150, -17494, 18839, 32653, 114700, 17764, -58150, 222682, 62219, -311005, -164700, 58764, -196133, -551756, -78392, 59810, -37749, -62214, -397665, 264251, -104577, -48712, 216431, -148278, -246635, 124664, -42775, -15789, -23341, -155627, 17773, 361890, -7397, 454311, 332330, 406696, -160325, -383582]
15757c83582g9276a3884A92988B7953K26394b97171a37064B54664p9690d8484
15746A93153c4902b959C162J40352P1811b1500d394l2574l94381a02620j79100
15735b81720d393I8252c2292Q787A54297K7825c7529A92333b49360j7815j14111
15724c81286D8443c08030A35161a47775m8446n3320A90594k4677m6090R968c87807
15712b32084O6005F1575A224b08146A1999a19855m3441c7180C09378C5921l908
15701C2013a70362G3710h1711L8055C29698B9845p587M6529E306b85506F6140
15689a65970m088e5007j14456N576p1311J05790H4476a34312j285k26504A15153
15677A3983g4900j56336I8908M7569l6640D3387P0227a80701A50220N777i1867
$$ y = [-383582, -79276, -13884, 192988, 27953, 254347, -297171, -137064, 254664, 174974, -48484, 193153, -34902, -2959, 3162, 143514, 215325, -21500, -4394, -36968, -431349, -102620, -281720, -4393, 98252, -32292, -23505, 154297, 182122, -37529, 192333, -249360, -267175, -381286, 48443, -308030, 135161, -147775, -196221, -249541, 190594, 165917, 119827, 129795, -387807, -232084, -166079, 61575, 1224, -208146, 11999, -119855, -163296, -37180, 309378, 35921, 32013, -170362, 73710, -81711, -43656, 329698, 29845, 22258, 68787, 5306, -285506, 66140, -165970, -170058, -55007, -169463, -163887, -235198, -129408, 84476, -134312, -135597, -362101, 115153, 13983, -74900, -231236, 98908, 146477, 109837, 43387, 113614, -180701, 150220, 155997, -91867]
15665A7061P5523f411k60325G7432a07826G4802J22107d03668i240j35628j68529
15654c13397E19946B50589c14300e7438j02946B19450a09808A27628L0368b66429
15643a27861A96125b19607J03370j86840d2170k61491A40826b20237B08298b96070
15632C5830c12482B72531b71771I0119B8396h88A93405a98587A33082E0096J0168
15621F0264L20346a54627j59487a47639F9516j0366K83337a99333A23324N355
15611A28679J42503c07446a2302G4703a28955A3826a82451B5760K58706j17835
15601A66631c41689g2730b8622A37981c60558G5394b7314B10059C4542N7662J50354
15590B42558I1724g5154A43636C2436L57254a50074A52509p4608c02590J13489
$$ y = [17061, 92584, -6411, -266736, 77432, -107826, 74802, 196909, -403668, -9240, -144868, -313397, 519946, 250589, -314300, -57438, -160384, 219450, -109808, 127628, 157996, -266429, -127861, 196125, -219607, -116237, -303077, -42170, -303661, 140826, -220237, 208298, -296070, 35830, -312482, 272531, -271771, 90119, 28396, -888, 193405, -198587, 133082, 50096, 60264, 380610, -154627, -314114, -147639, 69516, 59150, 342487, -199333, 123324, 128679, 271182, -307446, -12302, 74703, -128955, 13826, -182451, 25760, 284466, 166631, -341689, -72730, -28622, 137981, -360558, 75394, -27314, 210059, 34542, 92204, 242558, 91724, -75154, 143636, 32436, 389690, -150074, 152509, 77901, -302590, -189101]
15580a89101e339A31211c6055B17612b91441A30557e0151B54778I6343e8499C3927
15568a27259B1763f6412j1929j26609A47896c6749j0267A64270G8174J09866a22863
15556B84215g6776a1114k00486h6171B48651J56454g4854H5574J87527d7891k23213
15545b71104A79831f9338a0450k25739a16901B03978A7807N709K06617a3512C9263
15533C9566b53400j5331R5900M6003K9310B71095j30110c03217A06582A2989a55176
15521d8043E7302a14569I6634J39167M9265c16692A36159D3464b7481l22473j4280
15510c64234B18316b7979B02102d660A67009a17447M2589A326a20148B29324a16914
15498f7963H5221a65183l75547g4692j44042B75505A2989a9694G3301k8803a57418
$$ y = [-189101, -5339, 131211, -36055, 217612, -291441, 130557, -50151, 254778, 96343, -58499, 33927, -127259, 21763, -66412, -78341, -204950, 147896, -36749, -47016, 164270, 78174, 188040, -122863, 284215, -76776, -11114, -211600, -86171, 248651, 405105, -74854, 85574, 273101, -47891, -271104, 179831, -69338, -10450, -236189, -116901, 203978, 17807, 23516, 230133, -13512, 39263, 39566, -253400, -268731, -172831, -126828, -97518, 271095, 140985, -303217, 106582, 12989, -155176, -48043, 57302, -114569, 96634, 235801, 285066, -316692, 136159, 43464, -27481, -349954, -364234, 218316, -27979, 202102, -4660, 167009, -117447, -74858, 1326, -120148, 229324, -116914, -67963, 85221, -165183, -540730, -74692, -218734, 275505, 12989, -19694, 73301, 44498, -157418]
15486B2145J26567D7494J37568C7295P5823J43658h0810H0216r39a44316A41136
15474a0490C07108b59728J8859B17365n2892K79393b48919A21380b16173c5714
15463a88282b4826C88012b8965C3488a73115N3617M0707B07751J35491H1534r1
15452H1443b6725C08680f5155a9330D17163c4214j02274L0849o0781B68006h1876
15440e3490J073j28309j81660A01164a31368K1489g233A70177a71133B28665F4090
15428I5320J1547P9089K16200a00911R540D4523i8622a6612B3404b4812q7739
15417a12551j6072M0461I7632j8525M0802J48707j27801o5177C5351O0160m1800
15406E3711d24076B9880M12728F1373R4380a10568j19499B12644L0072H2164J70071
$$ y = [22145, 148712, 47494, 185062, 37295, 113118, 256776, -80810, 80216, 79277, -144316, 141136, -10490, 307108, -259728, -240869, 217365, 164473, 443866, -248919, 121380, -216173, -35714, -188282, -24826, 388012, -28965, 33488, -173115, -119498, -78791, 207751, 343242, 81534, 81443, -26725, 308680, -65155, -19330, 417163, -34214, -136488, -105639, -166420, 268006, -81876, -53490, -52417, -180726, -362386, 101164, -131368, -109879, -7233, 170177, -171133, 228665, 64090, 95320, 106867, 185956, 402156, -100911, -91371, 44523, -98622, -16612, 23404, -24812, -112551, -128623, -88162, 97632, 79107, 119909, 268616, 140815, 75638, 35351, 95511, 53711, -424076, 29880, 442608, 61373, 155753, -110568, -230067, 212644, 242716, 82164, 252235]
15395B52235e7274m932K7114A34898b7084B46382a38319J5317B15397j9838b16628
15383B0877J21864o8582f9178A07532a45847b0965F4172b76394B86989j27847
15373A59142b43623A53911B5271b65254B8120J2367J625a93516O6098j47241e1194
15361E6908K32034a40528E5491j69b26154A21477M2195F3445k2917J04313b31553
15349a82560C5904e6854R223C10598B7192L28065j06982b89254a00486B33669
15338g2040k37861d091G8574a7830k18685H1756b47073C1659p377e1236a6646
15326i6699H621b4697B36955a23192N1903B60285o1553J61545f0467B25949p353
15315B18596d7811a0092C41560n0785j11006m9692l8392O4192b4467A12999D2993
$$ y = [252235, -57274, -62206, -35092, 134898, -27084, 246382, -138319, -123002, 215397, 195559, -216628, 20877, 142741, 74159, -69178, 107532, -145847, -20965, 64172, -276394, 286989, 159142, -243623, 153911, 25271, -265254, 28120, 40487, 42112, -193516, -127418, -274659, -51194, 56908, 288942, -140528, 55491, 55322, -226154, 121477, 163672, 63445, 40528, 144841, -231553, -182560, 35904, -56854, -47631, 310598, 27192, 355257, 248275, -289254, -100486, 233669, -72040, -309901, -4091, 78574, -17830, -236515, 81756, -247073, 31659, 24282, -51236, -16646, -96699, 8621, -24697, 236955, -123192, -71289, 260285, 198732, 360277, -60467, 225949, 218596, -47811, -10092, 341560, 290775, 179769, 130077, 91685, 155877, -24467, 112999, 42993]
15303I7594l3833L6547J47302F0903e16386A94196a28143N5052B71524b3815E46367
15291H5400K03217G0803L1449k7041J66227I4870a28120J6882a8299H7839m3692
15280D4147J74165F9919J54236p120C8731O7331g1622B18926O2743H7300e8202
15268B07639j03661D022M31768c4469H7711A089O9044J99129a18356a4413B03812
15256C98255O2512a47116B13524e4167A93470K1449o1580L06667Q20296J059089
15246B339391j54634l54522J57984r45753E08894L1184D4002J73927m7780a94676
15235b62220H9818J2275m4907K09676q5387d38746B23181Q9391b354l6425k67911
15224c06690B78165j33893a12116A03388K2552c460j312C8166K66002a33919d011
$$ y = [97594, 63761, 100308, 247610, 60903, -516386, 194196, -128143, -73091, 271524, -23815, 546367, 85400, 288617, 70803, 102252, 75211, 241438, 94870, -128120, -111238, -18299, 87839, 44147, 218312, 69919, 224155, 217035, 38731, 106062, -71622, 218926, 281669, 87300, -58202, 207639, 103978, 4022, 435790, -34469, 87711, 1089, 70133, 269262, -118356, -14413, 203812, 398255, 460767, -147116, 213524, -54167, 193470, 214919, 153339, 460006, 1280302, 2339391, 2184757, 1830235, 1988219, 1042466, 508894, 540078, 44002, 217929, 170149, -194676, -262220, 89818, 102093, 57186, 266862, 181475, -438746, 223181, 312572, -2354, -38779, -306690, 278165, 144272, -112116, 103388, 125940, -3460, -4772, 38166, 304168, -133919, -4011]
15212C18114C8879L42423C7805c8004k73223B75461n0400o6410C2655J73597A2169
15200C21041d7916B01081K06620A13889d8449A40256J6385H589K82972a2123B12362
15188F3491K92440A67782K96955A10622b9239R085B17153J35502I4182K0022a9533
15176A70372L8834h926C79859B7504b20673A62980o4244e9930J4701C12950o0210
15165B52740n8408J28051c07141A6186K01632J15916j49450J51219E1161K3520
15155G4681a41244B61879a47194B7652f3031f385B44180A07494c5258j03558B38382
15143H9226c56359C1220i650B077P8904J29888B9318g5219B77767E2429L09881
15132C62310j63364K3283J70023c081D4563M5982J25731O9439J3964j00130J18020
$$ y = [318114, 38879, 381302, 37805, -38004, -311227, 275461, 225061, 158651, 32655, 206252, 12169, 321041, -47916, 201081, 407701, 113889, -48449, 140256, 156641, 8589, 291561, -12123, 212362, 63491, 355931, 167782, 464737, 110622, -29239, -20154, 217153, 352655, 94182, 114204, -19533, 170372, 209206, -8926, 379859, 27504, -220673, 162980, 98736, -59930, -45229, 312950, 252740, 194332, 322383, -307141, 16186, 217818, 333734, 184284, 335503, 51161, 74681, -141244, 261879, -147194, 27652, -63031, -6385, 244180, 107494, -35258, -138816, 238382, 89226, -356359, 31220, -9650, 2077, 80981, 210869, 29318, -75219, 277767, 52429, 362310, 198946, 222229, 392252, -3081, 44563, 90545, 216276, 285715, 299679, 199549, 317569]
15121C17569m0570m4474I9769l7972h9891D9214a41880F4782c6878B02812a58252
15109i9699H1541a25281n4288A97659J7081c4752B24810n7816K69731B9920K48706
15098B78626N5240p7572E3556K8574K3840d8056E7255a8714E64143C7612L60273
15087C97885a82375A49244j7012J77304F5976M4179l3882K0676J33707n1193p8974
15076A00489k3092l700K78154A58738Q5107E8420g7194B37440n5208p256J48587
15065C23563F8329K36849O7039J58779j74280A7132K93070J29859A63462p379
15055A56083K7415k84O58a64380j65060A94524m1620p2982a13384a5144G3040
15043A48680J77861K1068r5109J21144C9261K94510a4576D18645A19969J70051
$$ y = [317569, 276999, 232525, 99769, 61797, -89891, 49214, -141880, 64782, -36878, 202812, -158252, -99699, 81541, -125281, -179569, 197659, 214740, -34752, 224810, 166994, 436725, 29920, 278626, 333866, 256294, 53556, 82130, 105970, -48056, 57255, -18714, 564143, 37612, 397885, -182375, 149244, 132232, 309536, 65976, 110155, 76273, 96949, 230656, 179463, 100489, 77397, 73697, 351851, 158738, 243845, 58420, -77194, 237440, 182232, 174976, 323563, 68329, 305178, 372217, 530996, 356716, 17132, 310202, 440061, 163462, 156083, 183498, 183214, 183872, -164380, -329440, 194524, 152904, 79922, -113384, -15144, 73040, 148680, 326541, 347609, 252500, 373644, 39261, 333771, -14576, 418645, 119969, 290020]
15033B90020K04097L5708A97855L22624B1510K75108P8457j60724H4385L29267
15023D13652A95109r0132K95552j42980c6454H522J26994J41330K68623A27376
15012A76239B8650L77177A07979J29976K9014b8018B56345e5505C50064A01120
15001A79621K1170K4117k1619K21787k3425B1994J44471L14835B14146L9165I0377
14989B71635K01324k10184j02733Q6043G2273K98354J13716A57372J16857A26340
14978B97481n2441J38190j32266P4657Q209H1481K04022c9935B31669o8561K17208
14967C80316I9208N56754B57945J72090J43241j51848A86500q1048C2140J84908
14957B17048K12438j39897O1168K0551A01123J00597q2600K17014G6104J34388
$$ y = [290020, 494117, 529825, 197855, 520479, 21510, 296618, 375075, 214351, 84385, 413652, 195109, 104977, 400529, 257549, -36454, 8522, 135516, 276846, 545469, 127376, 176239, 28650, 405827, 107979, 237955, 266969, -28018, 256345, -55505, 350064, 101120, 179621, 200791, 224908, 203289, 425076, 401651, 21994, 166465, 481300, 214146, 253311, 90377, 271635, 472959, 262775, 160042, 246085, 72273, 370627, 484343, 157372, 274229, 126340, 297481, 245040, 383230, 250964, 325621, 333830, 81481, 285503, -39935, 231669, 163108, 380316, 99208, 655962, 257945, 430035, 573276, 421428, 186500, 105452, 32140, 217048, 429486, 289589, 350757, 371308, 101123, 201720, 119120, 336134, 76104, 210492]
14947B10492L5202A00443P1555n9946D3328L45041L0424A24066M37720I7543J91651
14936B89194J74431j57349O6730r9589j421A10210R2856J72175J60367l7293B36742
14924D52915I2338M74164j54050m9503J84073n7124j31685F1121L27886j24659
14914B64348J2027p5233H7218M96561A84578J69567K7034b6585A81487K50196
14904D31683K56061k20575j49871o3326K15952J30340B17355J50784a8745E656
14893B45321J80247A27128B2507N29873P1513j20239A28772K66257J86750j85703
14883C96076j78441K05466J28226B62316J75040A59320P1395A03098K16189K49293
14873E68580a9309C02138L51699B13923L80892k91214M78867l04304n9236K3405
$$ y = [210492, 245694, 100443, 171998, 112052, 43328, 388369, 418793, 124066, 561786, 97543, 289194, 463625, 306276, 373006, 273417, 271996, 110210, 203066, 375241, 535608, 498315, 236742, 452915, 92338, 566502, 412452, 362949, 547022, 489898, 358213, 61121, 389007, 264348, 276375, 201142, 87218, 583779, 184578, 354145, 381179, -26585, 181487, 431683, 687744, 467169, 317298, 253972, 469924, 600264, 217355, 368139, -18745, 5656, 245321, 425568, 127128, 22507, 552380, 623893, 503654, 128772, 395029, 581779, 396076, 217635, 423101, 551327, 262316, 437356, 159320, 230715, 103098, 319287, 568580, -19309, 302138, 653837, 213923, 594815, 303601, 782468, 478164, 418928, 442333]
14863D42333K45780B1962M84304i5582E69307A72888L53854M3948j00711j74941
14853B95038j21175J24140P7351k7950K27080k12162K4914J85267o3230B35412
14842B94543o7086J98858q3641N3941P7113J00465k7645l3740j46618L98311B51071
14830B55711M15921m6973F9135M95479A77965N75479r3546k81622l6958J0316
14820C51634p833J70920m7564k4595K21400J57513B61402L14546k47621K17424
14810E45751L70j63500P4645p2127n2812L29595C15660M59442k11991J30634J8384
14799G12129R1644C22820Q0503K85590j84158n6607k6979j0328j24108L80064
14789F66797k48157M00422k92924j20404R4210M0885K13532p1435l31619J95733
$$ y = [442333, 688113, 21962, 506266, -95582, 569307, 172888, 526742, 570690, 469979, 295038, 173863, 298003, 375354, 347404, 574484, 362322, 387236, 572503, 509273, 235412, 294543, 227457, 426315, 342674, 396615, 473728, 574193, 546548, 512808, 366190, 764501, 251071, 255711, 671632, 624659, 69135, 564614, 177965, 753444, 659898, 378276, 341318, 351634, 343801, 514721, 467157, 442562, 663962, 821475, 261402, 575948, 328327, 545751, 546121, 382621, 457266, 385139, 332327, 661922, 315660, 775102, 563111, 693745, 712129, 803773, 322820, 403323, 688913, 504755, 448148, 421169, 410841, 286733, 666797, 418640, 819062, 526138, 405734, 499944, 540829, 754361, 682926, 351307, 547040]
14779E47040j60200N2727K29533k9408N20601m76692K3101P2965j13377l2591
14769F33699J72208N8235r7292r8204Q776J43609B60304P38512p0332k29749J18807
14758H17542k28718n9725J60649Q3834R5620l69666L43160K07290l50209j42670
14748E57107J39046k6780R9832K2363j30971j37455J36691K47706j35489o2208
14738G09842k576M43846n40461J80955R9386k14576J76441q4798M8262L6544R513
14727H62378p8551J14275k12469M12860l50679M11691k71822J67300j70194P6230
14717I61019k73932K21302J46386D86752L71313k89636M84669j45205j62758J82433
14707I27568m0713J50969j39696o5538O7012J72558L3335j74071j74946j32981
$$ y = [547040, 386840, 439567, 669100, 639692, 1160293, 683601, 706702, 779667, 666290, 633699, 805907, 864142, 766850, 668646, 677422, 821031, 260304, 998816, 928484, 698735, 817542, 588824, 529099, 689748, 773582, 869202, 499536, 842696, 1049986, 699777, 557107, 696153, 669373, 769205, 791568, 660597, 523142, 659833, 907539, 772050, 709842, 707266, 1151112, 610651, 791606, 890992, 676416, 852857, 768059, 816321, 852865, 862378, 783827, 898102, 685633, 1098493, 747814, 1159505, 887683, 1054983, 884789, 961019, 687087, 908389, 1054775, 486752, 858065, 568429, 1053098, 907893, 745135, 927568, 886855, 1037824, 898128, 832590, 899602, 1072160, 1105495, 931424, 756478, 623497]
14697F23497P02823l08461j53952M9992p8692J93076j80211K26057P4961j89895
14687I59195J17161C96127N17293K34171l01134K25242l09964J34517k0513L75864
14677A251603q7405K04844j7878L4871n56700M54766K49363l26559j68695L41447
14667A379657l35948K69838j64735n3060o3434M4212j06914L3215k70904K54025
14657I85952L12221J57322j57131o7740K1391n4843K76207m07300O86591n09750
14647A242920k94018L29605J24384J05941k68359M6791L71024l77314j27246M27443
14637A581171j71757k04131K13544J26556R0371l77939O7434K13184j87251J20225
14627A471407k93659K59946J58563k0399J37451j44237r2629k90543M09641N3038
$$ y = [623497, 1326320, 1017859, 863907, 913899, 835207, 1028283, 848072, 1074129, 1149090, 959195, 1076356, 396127, 913420, 1147591, 846457, 1071699, 761735, 896252, 875739, 1251603, 1164198, 1369042, 1351164, 1386035, 829335, 1284101, 1533464, 1206905, 1038210, 1379657, 1043709, 1313547, 1148812, 1095752, 1032318, 1076530, 969616, 1002831, 731927, 985952, 1298173, 1455495, 1298364, 1230624, 1252015, 1197172, 1473379, 1066079, 1752670, 1242920, 948902, 1278507, 1402891, 1508832, 1240473, 1287264, 1658288, 1280974, 1153728, 1581171, 1409414, 1205283, 1418827, 1545383, 1635754, 1257815, 1325249, 1538433, 1351182, 1471407, 1177748, 1437694, 1596257, 1575858, 1713309, 1569072, 1476443, 1185900, 1595541, 1648579]
14617A648579k29949k41180J70133N410N18033n36118M39148j96994J16081l78672
14607A314471L37887o4544O074J46917R0914j09296L04103m918k05607J97508
14597B013509k18810J68219j78379j11342k93138L65886k25205K82642j05369
14588A698013K08435l7906R3433K05442m5219k33084p1246J72298O5765m396K59174
14577B310709l05975J68009P6963l8869m3692K19960k05012J62198m9487k4834
14567B269970Q5816j7609j9367J62518L15994m8913K58928m52881M51979j13496
14557B892939M04193j33611K63242K37321K71582L48040R90467O28033K221315
14548H123521L074273P912372J4193084Q207281j7087270j0582516m368201m519002
$$ y = [1648579, 1418630, 1177450, 1347583, 1352993, 1871026, 1334908, 1774056, 1577062, 1693143, 1314471, 1652358, 1587814, 1593888, 1740805, 1831719, 1722423, 2026526, 2021608, 1816001, 2013509, 1794699, 1962918, 1784539, 1673197, 1380059, 1745945, 1520740, 1803382, 1698013, 1906448, 1868542, 1961975, 2167417, 2122198, 1889114, 1817868, 1990166, 2055931, 2051535, 2310709, 2004734, 2172743, 2249706, 2210837, 2167145, 2387105, 2182093, 2344291, 2294804, 2269970, 2355786, 2338177, 2318810, 2481328, 2797322, 2748409, 3007337, 2554456, 3006435, 2892939, 3297132, 3163521, 3426763, 3664084, 3935666, 4283706, 5274173, 5902206, 8123521, 11197794, 19110166, 33303250, 41510531, 24423261, 13840745, 9472544, 4953542]
14540D953542j717427m90212l21499j63920J3598K686L50481j01833k98577L70380
14530B597219l80802p9818L90882j72520K12133j83952k48455L72712q2109K15169
14520B640459r2741o2785J0886M78772l02110K20991K04385l03027n0053J68247
14510B913024L34721l38284K37695l64698J57063J26344L31690j41465m57630
14501B798460M60357J6326P5795J128m9979j93864J66708J03145Q3947j64728
14491C297295M33813p6300j15365K4177M23928r9292K46020l77135R5492J42354
14481C994987K02827o5177l06268K64240l4990l87486Q52660k72208J99565n2874
14471D395276R5870J86926n9110K52424o15354J81892L51100J25218j46532m7587
$$ y = [4953542, 3236115, 2745903, 2424404, 2260484, 2274082, 2276768, 2627249, 2525416, 2226839, 2597219, 2216417, 2136599, 2527481, 2354961, 2567094, 2383142, 2134687, 2507399, 2425290, 2640459, 2547718, 2484933, 2495819, 2974591, 2672481, 2893472, 3097857, 2794830, 2744777, 2913024, 3247745, 2909461, 3147156, 2782458, 2939521, 3065865, 3397555, 3256090, 2798460, 3258817, 3275143, 3350938, 3352066, 3302087, 3108223, 3274931, 3378076, 3462023, 3297295, 3731108, 3654808, 3539443, 3563620, 3987548, 3888256, 4134276, 3757141, 3852633, 3994987, 4197814, 4132637, 3826369, 4090609, 4055619, 3668133, 4520793, 4248585, 4448150, 4395276, 4491146, 4678072, 4618962, 4871386, 4256032, 4437924, 4789024, 4914242, 4767710, 4720123]
14461D720123M77073j65513K61093J84350k74458L30424l14208K34953K04152
14452E657989j42454J46952K72874j93026K14516n4552K13728k96002K73704k46608
14442E847121P00705n72491O31258m29269K37558J96318j91650M25821J15186
14433F960557j64966N80153J18645k44293L41168n05375L47799P1873K45319n696
14423G745184Q3312P8953J54116K74547K1366q3785J61086N23065j45119m1512
14413H771213L90294K96057J22718n10210N94921j08691K97064J3268K40487M56289
14403A0563410l30171L81628J031K92662L84962j18527L09985J98534L14454j4995
14393A1982973N15284J521J38667J69560Q9128M64095K26316l244M28393K88031
$$ y = [4720123, 5197196, 5031683, 5292776, 5477126, 5202668, 5533092, 5218884, 5453837, 5657989, 5515535, 5662487, 5935361, 5742335, 5956851, 5902299, 6116027, 5820025, 6093729, 5847121, 6547826, 5975335, 6606593, 6177324, 6414882, 6611200, 6419550, 6845371, 6960557, 6795591, 7375744, 7494389, 7250096, 7591264, 7085889, 7433688, 7505561, 7750880, 7745184, 7828496, 7907449, 8061565, 8336112, 8357478, 8273693, 8434779, 8957844, 8812725, 8771213, 9161507, 9457564, 9580282, 9070072, 9664993, 9556302, 9853366, 9866634, 10107121, 10563410, 10233239, 10614867, 10615898, 10908560, 11293522, 11174995, 11484980, 11683514, 11997968, 11982973, 12498257, 12499778, 12638445, 12808005, 12897133, 13361228, 13587544, 13584300, 14012693, 14300724]
14383A4300724K49424J30259O86043j6920L15127J0766Q06111q4275L43419N39742
14373A7280420p1355K76707M01913J113891l00583N0548P01973K07627N92191
14364B0253332R29973R7059N67725R4652N30782L97138Q73002L48763L81131K97266
14354B4770823J008038N27802L71488R41097Q12755N84401P49365L19765R46691
14345C1032225P89338N57246J172792Q46629O27806Q85049J134253J370731N92657
14336C9008726J445034J074736J423578R06592J403700J649464J104859J598574
14328D9615263J398139J768131J735725J872033J630621K047594J905375K210660
14320F4183541K654803J950445K426610K866259K794466K339494L252396L025996
$$ y = [14300724, 14550148, 14680407, 15366450, 15349530, 15664657, 15675423, 16481534, 16397259, 16740678, 17280420, 17209065, 17485772, 17887685, 19001576, 18700993, 18751541, 19453514, 19661141, 20253332, 21183305, 21280364, 21848089, 21942741, 22473523, 22870661, 23743663, 24092426, 24473557, 24770823, 25778861, 26306663, 26678151, 27619248, 28432003, 29016404, 29765769, 30085534, 31032225, 31821563, 32378809, 33551601, 34398230, 35026036, 35911085, 37045338, 38416069, 39008726, 40453760, 41528496, 42952074, 43858666, 45262366, 46911830, 48016689, 49615263, 51013402, 52781533, 54517258, 56389291, 58019912, 60067506, 61972881, 64183541, 66838344, 68788789, 71215399, 74081658, 76876124, 79215618, 82468014, 85494010]
14312H5494010L623139L254467L918991L584822M198102M688130M415409N206980
14304A18384050N136832N393083N685061O277671O427127P019907P137307P891323
14296A69352361Q274364Q192923R134591R511208J0071550J1064377J0966558
14289B36567932J1591735J2483129J2522688J3241678J4005112J3866843J4415795
14282C28694912J4413633J4401787J4197365J4085820J3550226J2678077J1772857
14275D23794677J0536562Q882384N787207K795258Q67850J37908k215461l423756
14267D47162629l043328o017916q123105r882650j1368907j2343246j3401305
14260C82982172j4489439j4810600j4922045j4607390j5270630j4485524j4197256
$$ y = [85494010, 89117149, 92371616, 96290607, 99875429, 104073531, 108761661, 113177070, 118384050, 123520882, 128913965, 134599026, 140876697, 147303824, 154323731, 161461038, 169352361, 177626725, 185819648, 194954239, 204465447, 214536997, 225601374, 236567932, 248159667, 260642796, 273165484, 286407162, 300412274, 314279117, 328694912, 343108545, 357510332, 371707697, 385793517, 399343743, 412021820, 423794677, 434331239, 443213623, 449000830, 451796088, 452663938, 452801846, 450586385, 447162629, 444119301, 438101385, 429978280, 420095630, 408726723, 396383477, 382982172, 368492733, 353682133, 338760088, 324152698, 308882068, 294396544, 280199288]
14253B80199288j2250483j2337999j2367088j2482940j1379083j0667913r997937
14246A98715845r744406r050041q270413p971137p672897p499495o437249o678280
14238A35391927n456530n437454n308721n367294m754326m350323m364833l429551
14230I6922895m123948l641797l415515l319039l080554k498330l265421k683886
14222G0894405k289240k454689k126423k060505j958967k459098j587184j789125
14214E4169174j412179j430312j639594j827875r87939j788277j165343j129690
14206D2787965r95311j333435r39291j203599j333295l79115n12881j349188r09532
14197C3832318j313034o66764r95525o33822q43371l96064j242930l86672o22202
$$ y = [280199288, 267948805, 255610806, 243243718, 230760778, 219381695, 208713782, 198715845, 188971439, 179921398, 171650985, 163679848, 156006951, 148507456, 142070207, 135391927, 129935397, 124497943, 119189222, 113821928, 109067602, 104717279, 100352446, 96922895, 92798947, 89157150, 85741635, 82422596, 79342042, 76843712, 73578291, 70894405, 68605165, 66150476, 64024053, 61963548, 60004581, 57545483, 55958299, 54169174, 52756995, 51326683, 49687089, 47859214, 46871275, 45082998, 43917655, 42787965, 41792654, 40459219, 39519928, 38316329, 36983034, 36603919, 36091038, 34741850, 33832318, 32519284, 31852520, 30856995, 30223173, 29379802, 28983738, 27740808, 27354136, 26731934]
14188B6731934n38742p03265o56872k88415n95373r51227j24755o00216m83832
14179B1789237m82312m02041p39944k82876k90181k29748m80902l58333o07272
14170A7915628o6769q37325M3162l54245q1834m70496m36373K4220o73072j22983
14160A4939913l31762j28813m46732k33722P8582l88227l00790k36082k8048m12018
14150A2512301j68620j05747k6282m34623Q6223l97371l22208j61646o5768n77591
14140A0338668J75811R952k19552k24525P3514m03775o1654m63718P6152J18010
14130I418883p3393l6854j55855l21307m29334K52514q9408m08046j05336q5114
14120G966750j2576j93471Q490M0365l86787m4725K7435l10866q958k903m3149
$$ y = [26731934, 26193192, 25489927, 24833055, 24544640, 23949267, 22998040, 22873285, 22273069, 21789237, 21306925, 20904884, 20164940, 19882064, 19591883, 19362135, 18881233, 18522900, 17915628, 17848859, 17011534, 17054696, 16700451, 16618617, 16148121, 15711748, 15735968, 15062896, 14939913, 14608151, 14479338, 14032606, 13798884, 13877466, 13489239, 13188449, 12952367, 12924319, 12512301, 12343681, 12237934, 12211652, 11777029, 11863252, 11465881, 11143673, 10982027, 10916259, 10338668, 10514479, 10524431, 10304879, 10080354, 10153868, 9750093, 9688439, 9224721, 9300873, 9418883, 9345490, 9308636, 9152781, 8831474, 8402140, 8654654, 8565246, 8157200, 8051864, 7966750, 7954174, 7760703, 7769193, 7809558, 7422771, 7378046, 7405481, 7094615, 7085657, 7082754, 7039605]
14109G039605n0337m21809K91358n89131L54389k36935k61988J31327m381l68354
14099E883744O45296l50389j89484R5967l08072K73695m36560K94626m44980Q1095
14089E544938l3026j07474L81231o61241m0620J05869k99820J24980n7656J8708
14079D975889q6945k36779K53090q8074j97186J00729j50051l80102N31371l03834
14069D418108q8657k74696K37528k67424L60065j28356k24706J66994k16024K16897
14059D199729j81906J3911j22264k79948l41487M96546K89451m87731o8024p8203
14049C440074O5806K65448M0343k25111l2501n4954k63413L18021l95475J41882
14039C300120J3616k66022Q8425l109J45019m5806k65785L04093Q025k02099o8602
$$ y = [7039605, 6989268, 6567459, 6858817, 6269686, 6624075, 6387140, 6125152, 6256479, 6252098, 5883744, 6529040, 6178651, 5989167, 6085134, 5777062, 6050757, 5614197, 5908823, 5463843, 5544938, 5511912, 5404438, 5785669, 5124428, 5083808, 5189677, 4889857, 5014837, 4957181, 4975889, 4888944, 4652165, 4905255, 4817181, 4619995, 4720724, 4570673, 4190571, 4721942, 4418108, 4329451, 4054755, 4292283, 4024859, 4384924, 4256568, 4031862, 4198856, 3982832, 4199729, 4017823, 4031734, 3909470, 3629522, 3288035, 3784581, 4074032, 3586301, 3518277, 3440074, 3505880, 3771328, 3811671, 3586560, 3554059, 3499105, 3235692, 3553713, 3158238, 3300120, 3313736, 3047714, 3136139, 3133030, 3278049, 3232243, 2966458, 3270551, 3278576, 3076477, 3007875]
14028C007875o8805M5743k07055L29155j8349k32287m47002N67302n0074l21317
14018B605186J17478l51367J70442L25395o51332N24648q7707l64629J64330J29817
14008B582261p0107l12873j14740N43925l59735K36218j46954l07464K27668j29180
13998B149019M3044J3789k07830J86235j74775J30418K89657o803R05311O95992
13988D024057K630958O365000J4184237J3878593j2783210j3370698n536352k697393
13980F695192j345290r03908n72982j44857n82435J02121l6507k72052n50996
13971B388286K83355R901j00109j3629n17325L49409J28671n42043l9350M83309
13961B430475m29037K24296k49527K16271j50687p7052J02458K16809j89925P138
$$ y = [3007875, 2939070, 2984813, 2777758, 3106913, 3088564, 2856277, 2409275, 2976577, 2926503, 2605186, 2722664, 2371297, 2541739, 2867134, 2215802, 2740450, 2652743, 2288114, 2452444, 2582261, 2512154, 2199281, 2084541, 2628466, 2268731, 2504949, 2357995, 2050531, 2278199, 2149019, 2192063, 2205852, 1998022, 2184257, 2009482, 2139900, 2429557, 2422754, 3328065, 4024057, 6655015, 13020015, 27204252, 41082845, 28299635, 14928937, 9392585, 6695192, 5349902, 4445994, 3873012, 3728155, 3145720, 3247841, 3211334, 2939282, 2388286, 2671641, 2681542, 2581433, 2567804, 2050479, 2399888, 2528559, 1986516, 1947166, 2430475, 2001438, 2225734, 1976207, 2192478, 2041791, 1964739, 2067197, 2284006, 2094081, 2101219]
13951B101219o0305k59350o8108K62078q5233N9672k27187J13850L27775n01178
13941A663233L44176j71304l54041M10233J95644l62321L42287l77561j81392
13932A508954K06510j90783O3708j56598K92205l00992J14768j95907J08795j1553
13922A439107L86773l51034k4891L94998j71814l14772J44326K358j65256O3658
13912A403453j47464J51445k62280P2269J54585O7735k93954N9494L13382k15979
13902A302686Q6396o5597r7246J14761J79325j92904o4830L6945J6803j33082
13892A183257J76873L18392o09839K08505P1068j48630r3073o9160R1680K02895
13882A331968j1028k34145K66939q3620j72708J85900k80831j00808K95489l0323
$$ y = [2101219, 2040914, 1781564, 1713456, 1975534, 1890301, 1949973, 1722786, 1836636, 2164411, 1663233, 2007409, 1836105, 1482064, 1892297, 2087941, 1725620, 2067907, 1690346, 1508954, 1715464, 1524681, 1588389, 1431791, 1723996, 1423004, 1537772, 1341865, 1450660, 1439107, 1825880, 1474846, 1449955, 1844953, 1673139, 1358367, 1502693, 1505051, 1339795, 1403453, 1255989, 1407434, 1145154, 1217423, 1372008, 1439743, 1145789, 1205283, 1518665, 1302686, 1389082, 1323485, 1226239, 1341000, 1520325, 1327421, 1262591, 1299536, 1316339, 1183257, 1360130, 1678522, 1068683, 1277188, 1348256, 1199626, 1106553, 1037393, 1129073, 1331968, 1320940, 1086795, 1353734, 1270114, 1097406, 1283306, 1002475, 901667, 1197156, 1166833]
13872A166833L4267k86325M36513o38127O58131k15714r054J74942F01942O06583
13862A208525j83594j20013j05554L58959R7252m5067n34511K68303o8921K57451
13852A132830k57844J13214Q9154k60808p7119M62369l13954K84055N6841l81871
13842H46867L8368j54085Q9253j57037J24437J7459R4182j32049P139L02188j22171
13831I54551D72921M83439j56010L3491K81279l11771J63539K04380n25931M68899
13821A114236n13463L14660l9665J53516l29413J90232q4630J1552R8768l2080
13811H83713k37308J43285Q0392K38100l63772K8882N54735l08608k02460J2350
13801H29309L9764O7556q2946l4230j94876p4520L10054m21656N07600k05099
$$ y = [1166833, 1201100, 914775, 1351288, 713161, 1371292, 1155578, 1146524, 1321466, 601942, 1208525, 1024931, 904918, 799364, 1158323, 1255575, 1210508, 675997, 944300, 875379, 1132830, 874986, 988200, 1077354, 816546, 739427, 1201796, 887842, 1171897, 1228738, 846867, 885235, 731150, 820403, 663366, 787803, 805262, 899444, 767395, 774534, 1076722, 954551, 472921, 956360, 800350, 833841, 1115120, 803349, 966888, 1171268, 645337, 1114236, 600773, 915433, 875768, 1029284, 699871, 890103, 805473, 817025, 915793, 883713, 646405, 789690, 870082, 1108182, 744410, 773292, 1328027, 1019419, 816959, 829309, 869073, 936629, 853683, 819453, 624577, 550057, 860111, 438455, 946055, 740956]
13791G40956j51817K46226j67565o5238J01256K39700j74204L01161k56476j00078
13781G13921J17873l53127K23968J6085l24501K73628J85326k71664L3595Q1158
13771F96262J41034P8030l30486M7842P5414j35740j43805M98262l33151n2856
13761E40806j08870J42573k7525J95484k5273k70312J25361K40143j76090L5278
13751F71575L8877O2010j04415R6623j50563k14636L33838J07492n5498j73864
13741F11439j511K54817E2312Q18458C72128L58775j94597M83405j97034l84822
13731D37855Q8829K01900l07150J44440l8674J57452k6777J28931k67498k884
13721E16424R0102R4850j17011L2286R8346k02873J41291j16485r0461k9084J36083
$$ y = [740956, 589139, 835365, 667800, 602562, 703818, 943518, 769314, 1070475, 813999, 713921, 831794, 478667, 702635, 718720, 394219, 667847, 853173, 581509, 615104, 696262, 837296, 915326, 584840, 632682, 708096, 572356, 428551, 926813, 593662, 540806, 431936, 574509, 546984, 742468, 717195, 446883, 572244, 812387, 636297, 671575, 710452, 772462, 668047, 764670, 614107, 399471, 733309, 840801, 785303, 611439, 609928, 864745, 52312, 870770, 372128, 730903, 536306, 1019711, 822677, 437855, 526684, 728584, 421434, 565874, 527200, 684652, 657875, 786806, 519308, 516424, 606526, 701376, 584365, 616651, 714997, 512124, 653415, 536930, 446469, 417385, 553468]
13710E53468j07143l633K29102P9029l05342Q5975j40041L07020k39841j9859
13700D38735N06458m66113j33380K39823k29645R3592g0228B84967K06929K24801
13690G16697k59314j15606K13505K11438j21632j86287j58260J67927R378K28370
13680G06216l40583j11691M6571J14769J80592B43641K32950q4856j30632j21111
13670A39992M25354K41387B55388J84388L43960C48792N6207Q2368J28469A81794
13659C32933L39738j77188j2511O0916k08043J22481L43324l52340j4574O2026
13649D96762k16287P1302q937K26510K7953L9550J640B31835K96286j4003j07279
13638D06839m7571J90947j14501Q2238l3124J7045j85100O0199r9241l5101O7646
$$ y = [553468, 446325, 442692, 671794, 750823, 445481, 531456, 391415, 698435, 458594, 438735, 945193, 479080, 345700, 585523, 355878, 449470, -70228, 284967, 491896, 716697, 457383, 341777, 555282, 766720, 645088, 458801, 300541, 468468, 477846, 706216, 365633, 253942, 300513, 415282, 595874, 243641, 476591, 391735, 261103, 139992, 565346, 806733, 255388, 439776, 783736, 348792, 404999, 487367, 615836, 181794, 332933, 672671, 495483, 482972, 543888, 335845, 458326, 801650, 449310, 434736, 496762, 280475, 351777, 342840, 569350, 597303, 636853, 638493, 231835, 528121, 514118, 406839, 359268, 550215, 435714, 517952, 484828, 501873, 316773, 376972, 277731, 242630, 310276]
13627C10276j15727K19512N8917E8918L85480k17530R5080R4804J00656p673k37088
13616B72647K61725k37739J45392N7991j35197J78720p2343A50600L35086J10399
13606E96085j03123A53535K96937J92019A16780K5440N32222j00830J8747o257
13596E86102A77967L42633B00523J83618j22870K37952o0016J28450B34737K96020
13586E30757A13558K6964R6142A0772N39059A67009J68288K6928K96641k38274
13576D20592j58946J46614j83435H2305L39414j11998r9382l7183K48848A67936
13565D04681Q9821J13951B82883A04303J46061M537O8987D5548N3589J26850J5513
13554B41500K58139J10506B04156J61593A62420J40018I908J92129F8666N7270
$$ y = [310276, 194549, 414061, 472978, 58918, 444398, 226868, 321948, 416752, 517408, 509735, 272647, 534372, 296633, 442025, 500016, 364819, 543539, 471196, 150600, 485686, 596085, 492962, 153535, 450472, 642491, 116780, 142220, 674442, 573612, 592359, 586102, 177967, 520600, 200523, 384141, 261271, 499223, 439207, 567657, 234737, 530757, 113558, 140522, 236664, 10772, 549831, 167009, 335297, 362225, 658866, 420592, 261646, 408260, 224825, 82305, 421719, 309721, 210339, 173156, 422004, 167936, 404681, 494502, 608453, 282883, 104303, 250364, 254901, 323888, 45548, 99137, 225987, 241500, 499639, 610145, 204156, 365749, 162420, 302438, 9908, 202037, 68666, 125936]
13544A25936L60121k38832J45498A20202K17547F4560M03481n597A70543J86979
13534C57522j30167j913j10467J76878K84883B21644M2085o525J18791N3814J09760
13523E39569j95501J07711B2209O11419B20787j7352L45061j03805A65548J88437
13513C53985J39556J52978j18484k3653q3938j26778J0606A00912K89089j44943
13503B45058I9030D6610J68940K4982f4401A67572B0283J35457J70547l9360q2773
13492B04154n8071q482E3198a81090F9998J72212K7756J9459R8181C1159L91862
13481D23021p1663F2187L92088k24210A96K20348f0751A26002R0720F0760J29594
13470A90354N7261K07234A70809L67519E8759K07072J56507j18721b6558n373
$$ y = [125936, 486057, 247225, 392723, 120202, 337749, 64560, 468041, 462444, 170543, 357522, 227355, 225442, 114975, 291853, 576736, 221644, 263729, 257204, 375995, 429809, 539569, 344068, 451779, 22209, 633628, 220787, 203435, 548496, 444691, 165548, 353985, 493541, 646519, 528035, 504382, 420444, 293666, 304272, 100912, 390001, 245058, 99030, 46610, 215550, 240532, -64401, 167572, 20283, 155740, 326287, 286927, 204154, 146083, 137601, 53198, -181090, 69998, 242210, 269966, 289425, 387606, 31159, 423021, 351358, 62187, 454275, 230065, 196, 220544, -60751, 126002, 216722, 60760, 190354, 247615, 454849, 170809, 538328, 58759, 265831, 422338, 303617, -26558, -31931]
13460c1931I2845K19813l5492K9580A06519J33266b05664j89426A22362M6248
13450A68610M8976A04014P349b8718D15292p0766n6480K6055q5792F6323K95305
13439C61628E4381K11301N5520A22057M95497B68111c5361C72567G3769J41845
13429B15614l3000K89617K2802E7470A1878b04632m5857B39483J34706A50822
13418C55925j58740c5850A95565J04955F7708N7723K43373l8078J36874k25933
13408B41667K7172P7619h6622C17605r866H7008a59684F08565B61364r830b72847
13396D61332k21414c5221D56474a4408B42770K14136A20470a84178B39588q3710
13386A55878C7235L77859E8251K48375j33176r737c0046A91604D7848J22245C5791
$$ y = [-31931, 92845, 312658, 277166, 306746, 106519, 239785, -205664, -395090, 122362, 168610, 217586, 104014, 111363, -28718, 415292, 344526, 288046, 314101, 228309, 66323, 361628, 54381, 265682, 321202, 122057, 617554, 268111, -35361, 372567, 73769, 215614, 182614, 472231, 495033, 57470, 11878, -204632, -250489, 239483, 374189, 150822, 355925, 197185, -35850, 195565, 300520, 67708, 125431, 368804, 330726, 467600, 241667, 268839, 346458, -86622, 317605, 307739, 87008, -159684, 608565, 261364, 251534, -272847, 461332, 239918, -35221, 456474, -14408, 242770, 456906, 120470, -184178, 239588, 155878, 37235, 415094, 58251, 306626, 173450, 163713, -30046, 191604, 47848, 170093, 35791]
13374D28033j16879A08402J52740A8556M9150J30608F5395L95660r0853j09444
13364B60758K53153j37496j54347I3718N5449J55808P0389j58114O8514p7007
13354B08757A01448K93424A5564N3333J50274B4160R8945K36394D3485M14628
13344D58113j1422j88591A08651J8168J09774o5944o0794P166A8397K12426a47913
13332B27322P1352h2973D43346m0908k1248a45617m1489A75340h9028B52910L909
13321B56819q94G3920N1323M641P9310g3474A26701J05205L69345k73343j09309
13310B18599L52026A52293P2042b3152A89233a42987B57874r4660m4256j0381
13300A08577J38283J08946a23514C08593A05440o955D5896l722J27196a32208
$$ y = [428033, 311154, 108402, 261142, 18556, 67706, 198314, 65395, 461055, 370202, 260758, 513911, 376415, 222068, 93718, 149167, 304975, 375364, 217250, 285764, 208757, 101448, 394872, 15564, 68897, 219171, 24160, 123105, 359499, 43485, 458113, 446691, 258100, 108651, 126819, 236593, 170649, 109855, 117021, 18397, 230823, -147913, 227322, 298674, -82973, 443346, 402438, 381190, -145617, -187106, 175340, -89028, 252910, 256819, 255925, 73920, 125243, 129884, 209194, -73474, 126701, 231906, 601251, 327908, 218599, 570625, 152293, 224335, -23152, 189233, -142987, 257874, 163214, 118958, 108577, 246860, 355806, -123514, 308593, 105440, 98485, 45896, 42174, 169370, -132208]
13289B37161A16453K08244j22042F93P6646h2142A34408K07278l9725j35976R5765
13278B61750q5701P3025J83964q3631c711A24359N7255a8163A16359J79588A45035
13266b7445A17499b12606j05650B4743a16594A11695D438a60463C69541A5605
13255A36409a41689B47538o240e4923A74126J48718H2949K01989p6647l1318a6865
13243A68998b01426A79226G1919G022f9998B28404J29989N0156A50032n0928J64546
13232B63650F4976g7175D2846a9274k17915B73769R8089f0136B95569a61477j6640
13221a78117E21309C0105K05468r4144b1288i235A40989l5100d4763k05747a6957
13209g1776A25512B7901N22979B37740e391I5778a13112A12811b93655B81245
$$ y = [237161, 116453, 324697, 202655, 693, 77339, -82142, 134408, 341686, 301961, 165985, 261750, 176049, 249074, 433038, 349407, -3711, 124359, 181614, -18163, 116359, 295947, 145035, -27445, 117499, -212606, -318256, 24743, -116594, 111695, 4438, -160463, 369541, 15605, 136409, -141689, 247538, 241298, -54923, 174126, 322844, 82949, 284938, 208291, 176973, -16865, 168998, -201426, 179226, 71919, 7022, -69998, 228404, 358393, 408549, 150032, 99104, 263650, 64976, -77175, 42846, -19274, -237189, 273769, 371858, -60136, 295569, -161477, -178117, 521309, 30105, 235573, 141429, -21288, -9235, 140989, 105889, -44763, -250510, -16957, -71776, 125512, 27901, 550880, 237740, -5391, 95778, -113112, 112811, -293655, 281245]
13198I6506K0410J8945a3457C6755a71068C3748J87190a60538I109J1801L07321
13187C28231j60634n9231K44421a57463A69856b42029a04864l1503c8410j00241
13177a38651G4291J29345d05953a02960l8090E8536Q8762C9678L50179H5422L1595
13166A17017J98170A25994f8425a6923j2256F3166Q8459l1591J94496g4865K8769
13155d6096H9340J48457P8939k6784c2501B14296n2853j8714i741B18832a37292
13143F07404f4403B93275j24556a06201A72084d8861A78089R5246A15412j2196
13133A03216b65321Q4582A69128L6553h9764B72489j25361c74566A2530J19104
13123A31634K1288F5602a78661A28216a26368C67651b4432A71118i7696A7061
$$ y = [96506, 116916, 135861, -13457, 36755, -171068, 33748, 220938, -160538, 9109, 20910, 328231, 167597, 108366, 352787, -157463, 169856, -242029, -104864, -136367, -38410, -138651, 74291, 203636, -405953, -102960, -141050, 58536, 147298, 39678, 389857, 85422, 117017, 315187, 125994, -68425, -16923, -29179, 63166, 151625, 120034, 314530, -74865, -46096, 89340, 237797, 316736, 289952, -32501, 214296, 161443, 142729, -9741, 218832, -137292, 607404, -64403, 293275, 168719, -106201, 172084, -48861, 178089, 273335, 115412, 103216, -265321, -180739, 169128, 205681, -89764, 272489, 147128, -374566, 12530, 131634, 152922, 65602, -178661, 128216, -126368, 367651, -24432, 171118, -97696, 17061]
13112B35092B9426K1514L40506j54462m2737d09412B16082I248M5061K9488B9640
13100F1314a43888D13Q7886L149C6763a40973b7939B27191C0457a31177H9893
13088A00949h0977A07372e4666j39961C46143e8723j00642B57978D7930Q1719
13078A29649K76975C4885A4592N18465A490L91695E7784B1862m542J15413D721
13066a5506d601A82909b56860C91188i3406k55501A33032i7007A41543o9608a61813
13054A76190a40216e7082H7062c4618B45591e49759K24475h111j36399A52144
13043A24816A096P1569J00982P117b24647B38335J92268g7262J2581B1821N9714
13032H1535N5078J19520B7127O487J79948J28944A54392m4251J76765a98535K6613
$$ y = [235092, 29426, 50940, 391446, 236984, 194247, -409412, 216082, 9248, 54309, 83797, 29640, 61314, -143888, 413, 88299, 91448, 36763, -140973, -27939, 227191, 30457, -131177, 89893, 100949, -80977, 107372, -54666, -194627, 346143, -58723, -159365, 257978, 47930, 129649, 406624, 34885, 14592, 533057, 1490, 393185, 57784, 21862, 17320, 132733, 4721, -15506, -4601, 182909, -256860, 391188, -93406, -348907, 133032, -97007, 141543, 71935, -161813, 176190, -140216, -57082, 87062, -34618, 245591, -549759, -325284, -8111, -144510, 152144, 124816, 1096, 72665, 173647, 180764, -224647, 238335, 430603, -77262, -64681, 21821, 81535, 136613, 256133, 27127, 33614, 213562, 342506, 154392, 110141, 286906, -198535, -171922]
13021a71922B49235i5278C83720f4387B00698a00392B41855h7589D8552K28690
13011B77242a90079B54429D2268K66827a27637j6753b7745B2354b52355a6502
13000b19043a4515A3625l864M7187N6112a42994c0935o3677A29289f7137C00568
12988e794C4394a43744A35010M1550F4280K94846b6298j68719B23182j929a79997
12976E1043K2840j4854b20383C16201H5720P2899a55417A15557a28735A79956
12965A76270F3624M18667j25900A70089F1660Q637j520h0956n5124A95477R5106
12954B90583B0335i1813A99747a35035b32B0987K95796B5048D350K26867r2569
12943A38648D555a72728B859a42567J3639j5895b9179C3452a70649Q4314D46768
$$ y = [-171922, 249235, -95278, 383720, -64387, 200698, -100392, 241855, -87589, 48552, 277242, -190079, 254429, 42268, 309095, -127637, -144390, -27745, 22354, -252355, -16502, -219043, -14515, 13625, 9761, 56948, 113060, -142994, -30935, -94612, 129289, -67137, 300568, -5794, 34394, -143744, 135010, 176560, 64280, 359126, -26298, -195017, 223182, 221253, -179997, 51043, 73883, 59029, -220383, 316201, 85720, 158619, -155417, 115557, -128735, 179956, 176270, 63624, 482291, 356391, 170089, 61660, 70297, 68777, -80956, -136080, 195477, 290583, 20335, -91813, 199747, -135035, -232, 20987, 316783, 25048, 4350, 231217, 138648, 4555, -172728, 2859, -142567, -128928, -144823, -29179, 33452, -170649, -86335, 446768]
12931A14612m0706J17054J09249r9694p0908a31775B41150C7271J40670a89268
12920G0564e5842o9023A08233k3638k3765a48731B54292J4615G8621J57956b02845
12908c8773l1883B79377B3161a93523g0948k9788j01845I3362N9530K1934c66054
12896a12427B46612a29064M0459E7713N8632L03035F8294f6028D9555J09743e4244
12884a2168A68199G153M7770g7281A6243f4393k519P838j58291A63870b92363
12872b73702i8431l8791c0411k7836A74028G7404A2200J44999L6573i4097L156
12861i0941B61209B4251J57988p8845D6141b28180Q4201O3159b5312J1098j92614
12850b06828B18215a06954C41676j03030Q9555H6350N534C5708L62024f7957A91675
$$ y = [114612, 73906, 190960, 300209, 200515, 129607, -131775, 241150, 37271, 177941, -189268, 70564, -55842, -124865, 108233, 84595, 60830, -148731, 254292, 268907, 78621, 236577, -202845, -38773, -70656, 279377, 23161, -193523, -70948, -100736, -202581, 93362, 152892, 174826, -366054, -112427, 246612, -129064, -88605, 57713, 116345, 419380, 68294, -66028, 49555, 159298, -54244, -12168, 168199, 7153, 54923, -77281, 16243, -64393, -66912, -59074, -217365, 163870, -292363, -273702, -98431, -137222, -30411, -58247, 174028, 77404, 12200, 157199, 193772, -94097, -90941, 261209, 24251, 182239, 103394, 46141, -228180, -143979, -80820, -25312, -14214, -206828, 218215, -106954, 341676, 238646, 328201, 86350, 91884, 35708, 397732, -67957, 191675]
12838F9088a73796A96211f6508A47657a04196B5749a26848E8980a12309k2719
12828a35028G7678K69338a41150e1386j98102b2637C20305e7965B72842C0254
12817a54069K7943B28055g2145J433j1535k149A87902c70505a68599h136B48803
12805b2255A54319a11749B16709a04562B98764b7888j04422k12866a4559C8302
12794C8450K30974l8590J6220b41504F8835j5765A1470g0721j1755A84918o0935
12783A23983L3423C0866n984b60451g8348m1857n3166P8113C6564p169J81592
12772B10987E2935M2490a0308B16159f4387l20079a39734A36741L0608a01920
12761B82154b70831A25719m0634A8818b36705h8233H4014K36579e8428A84963
$$ y = [69088, -173796, 196211, -66508, 147657, -104196, 25749, -126848, 58980, -112309, -135028, 77678, 347016, -141150, -51386, -249488, -22637, 320305, -57965, 272842, 30254, -154069, -126126, 228055, -72145, -70712, -82247, -84396, 187902, -370505, -168599, -8136, 248803, -22255, 154319, -111749, 216709, -104562, 298764, -27888, -132310, -345176, -14559, 38302, 38450, 269424, 230834, 247054, -241504, 68835, 53070, 11470, -70721, -82476, 184918, 123983, 157406, 30866, 24882, -260451, -78348, -120205, -173371, -95258, 36564, 29395, 210987, 52935, 95425, -10308, 216159, -64387, -384466, -139734, 136741, 167349, -101920, 282154, -270831, 125719, 85085, 18818, -236705, -88233, 84014, 320593, -58428, 184963]
12750e9367a1568j39606B93392r81C7660K55654L4193b21038G2190b21644A17024
12738d121H8598f1374k55312C11954l7731C3605a65254C40116j5961d4647j84055
12727b28702Q0680B8679P985K84636C9386a02312j1278I1494h1213A53846J4812
12716A68658i0926n0382p4343j58214A04760j9842a66963D11196b609D8368a06611
12704C455f6195C60531j44245c7863j37192A65349a25306A03230J18260b8553
12693F8322d9260a1842B65023a01580A73515b06173l02441C41038c1524D6128
12682a1737B33002h045F43280k40035b10588g7581n6012A21967N1788J88867C313
12670C63047A26255a56491D33790A18705b0846A28764L57238H0478k2970d0722
$$ y = [-59367, -11568, -151174, 293392, 292411, 37660, 293314, 327507, -221038, 72190, -221644, 117024, -4121, 88598, -61374, -316686, 311954, 274223, 33605, -165254, 340116, 324155, -44647, -228702, -148022, 28679, 36664, 321300, 39386, -102312, -113590, 91494, -81213, 153846, 168658, -90926, -141308, -215651, -373865, 104760, 84918, -166963, 411196, -2609, 48368, -106611, 3455, -66195, 360531, 216286, -37863, -175055, 165349, -125306, 103230, 221490, -28553, 68322, -49260, -11842, 265023, -101580, 173515, -206173, -508614, 341038, -31524, 46128, -11737, 233002, -8045, 643280, 403245, -210588, -77581, -133593, 121967, 173755, 362622, 3313, 363047, 126255, -156491, 433790, 118705, -20846, 128764, 486002, 80478, 57508, -40722]
12659E1813J18430j9628d2784A16019J08547A09912J17063b17473A85552l7612
12649A47940g4770B92736r8915I1782f0087B24082b77185g3880j39597A7514K12361
12638B29875i2400l26101J69284B74095N4656J7015g3112A36638N9217G8493L53234
12627D31727L0695N2829p8305A66720Q188K34597j79339D5633A5208J92843L8223
12616B46274G8150L18171A22109a5691l28613F4113J560e7673B04971m5276b45475
12604A73543a3113A46050c69178C36250A01998L05169J88471B74366n8856J99786
12594D15296D4066a05100I2001M2N9924B6161p139f5801H0141k9729b29552C2037
12581a49248D7549a69903B33137j16000D8770O9462a42200j01187B55304E6614
$$ y = [51813, 170243, 150615, -42784, 116019, 224566, 109912, 226975, -217473, 185552, 147940, -74770, 292736, 193821, 91782, -60087, 224082, -277185, -73880, -213477, 17514, 229875, -92400, -418501, -249217, 274095, 328751, 345766, -73112, 136638, 195855, 78493, 431727, 462422, 515251, 436946, 166720, 174908, 409505, 230166, 45633, 15208, 208051, 246274, 78150, 396321, 122109, -15691, -344304, 64113, 65673, -57673, 204971, 159695, -245475, 173543, -13113, 146050, -369178, 336250, 101998, 407167, 595638, 274366, 215510, 415296, 44066, -105100, 92001, 92043, 151967, 26161, 19022, -65801, 80141, 50412, -229552, 32037, -149248, 47549, -169903, 233137, 117137, 48770, 118232, -142200, -243387, 255304, 56614]
12570C36197A63482c7353E0763K11031H9067R6817a2120C45241b45118F5881a90774
12558F6102J48476c9506A96980D1660b0330l88n1204j50864R9179B92193b99759
12546B05742C4655K8469b99100A00376O5448J39008g8815l9679L3245E5050a54005
12534g9373D2800K41209k3317f1568p5926k1792H3464b50634E7925K8395A6057
12522G6511j1715d04179J72970A33493B2335b19654A48966m8970d7099l93633
12512d40732E0343L166d2604o6589B9927b72539g8851C43287h6741a4422k38379
12501b52801A60855a08944j32457A55006c5796l1596j43853R6459r9958L9039
12491a75705c4785F8585a33602A55929g292B79135K7644m9420N217h8518p530
$$ y = [336197, 163482, -37353, 50763, 261794, 89067, 185884, -12120, 345241, -245118, 65881, -190774, 66102, 214578, -39506, 196980, 41660, -20330, -20718, -71922, -222786, -123607, 292193, -299759, 205742, 34655, 63124, -299100, 100376, 165824, 304832, -78815, -118494, -85249, 55050, -154005, -79373, 42800, 284009, 260692, -61568, -137494, -159286, 83464, -250634, 57925, 86320, 16057, 76511, 64796, -404179, -231209, 133493, 22335, -219654, 148966, 99996, -47099, -440732, 50343, 53509, -42604, -109193, 29927, -272539, -78851, 343287, -86741, -14422, -252801, 160855, -108944, -241401, 155006, -35796, -67392, -211245, -114786, -214744, -175705, -34785, 68585, -133602, 155929, -7292, 279135, 306779, 257359, 262576, -88518, -96048]
12480i6048B02591J8994a23488L4404A28854d0618E5413c63516G7858K66905H1235
12468f4803B39320a68999o7330G4550a60003B85700A16246L97489E2688b49592
12457B05643I4270C2114O3047R909a8798B4157K385a99687I453f2885k81003A98386
12444A44869g3258J8752C11914b82040C71279F3830a74736L0874A98173A2310
12433f39535C06581B1117L8032a56185B5911a1279B43264j20245f3997A2069b30988
12421A56706J38457o4130a46894C87751a31850M7796G5812K3623a81062A00763
12410c42448A0792N4479g2905A02507k1513K34377a95649F3492A0688K90602a13110
12398f6560l15276A09862e28161a50967B23054E4634K23229a20072M9297j93008
$$ y = [-96048, 202591, 221585, -123488, -89084, 128854, -40618, 55413, -363516, 77858, 344763, 81235, -64803, 239320, -168999, -236329, 74550, -160003, 285700, 116246, 513735, 52688, -249592, 205643, 94270, 32114, 95161, 105070, -18798, 24157, 26542, -199687, 9453, -62885, -343888, 198386, 144869, -73258, -54506, 311914, -282040, 371279, 63830, -174736, -143862, 198173, 12310, -639535, 306581, 21117, 59149, -156185, 25911, -11279, 243264, 123019, -63997, 12069, -230988, 156706, 295163, 231033, -146894, 387751, -131850, -84054, 75812, 99435, -181062, 100763, -342448, 10792, 65271, -72905, 102507, 80994, 315371, -195649, 63492, 10688, 301290, -113110, -66560, -381836, 109862, -528161, -150967, 223054, 54634, 277863, -120072, -70775, -263783]
12388b63783e0857J3820A33782a45605M7325b2257j24997M1383c2537j33071B55866
12376a07347j1369A61945c30569c8484p0889d9650J7810H5786a58265D4223J07539
12365A51762a80107b876j8839l88352d2053r5381G179a94506A86080b02643d3965
12353a14108K5552A16031d12409A51424A7462a21957j54720g2719C336a73361
12342f0145N006B32334a04278C3796K59828N4613A55627a59279D1448a21340I9360
12330A63784F1833Q8305N9176c46160d5047A28466N2280r490C4970c5272a1917
12318A23839K1259B9841a67682j16051h4210m9109q3043G9191D766a53496A15086
12306a38431A71276g109D2564f8233A11576c34667d7983A02559k7478g364G7839
$$ y = [-263783, -50857, -37037, 133782, -145605, -98280, -22257, -147254, -105871, -32537, -165608, 255866, -107347, -118716, 161945, -330569, -38484, -109373, -49650, -31840, 85786, -158265, 44223, 151762, -180107, -2876, -21715, -410067, -42053, -137434, 7179, -194506, 186080, -202643, -43965, -114108, -88556, 116031, -412409, 151424, 17462, -121957, -276677, -72719, 3336, -173361, -60145, -55139, 232334, -104278, 33796, 293624, 348237, 155627, -159279, 41448, -121340, 99360, 163784, 61833, 150138, 209314, -346160, -45047, 128466, 180746, 171256, 34970, -35272, -11917, 123839, 145098, 29841, -167682, -283733, -84210, -133319, -216362, 79191, 4766, -153496, 115086, -138431, 171276, -7109, 42564, -68233, 111576, -334667, -47983, 102559, 75081, -7364, 77839]
12294E1653K28424i2102I2700K14983b18303E4250A1965a94302B59226I0882m1588
12283D9294f344A6297K8540c10544A56011J29972a9761k94640a09242D2264J98850
12272B41114b94974D8418K37329c40031d9515e865F449R0739a27273A26123i8236
12260C34586a4285B43537f219A02408g5180j32113B66492i3553B34353E6223J19793
12249A76016G5541h362C0767b66841A44313l5320r36B779d0712G6738b06708A3941
12236D7491j9416N3276a69441D1659K08075j15366n5661a38405B02939H9948l372
12225H6576R0641D3250O9033J24339J23337J4668A26074F0817J41005K33631A50072
12213B38461R4214a53442f8634m4356e0066A70929B933f7724C78849D0132J41017
$$ y = [51653, 280077, -92102, 92700, 307683, -218303, 54250, 11965, -194302, 259226, 90882, 49294, -6344, 16297, 44837, -310544, 156011, 285983, -19761, -314401, -109242, 42264, 241114, -294974, 48418, 285747, -340031, -49515, -5865, 6449, 97188, -127273, 126123, -98236, 334586, -14285, 243537, -6219, 102408, -75180, -207293, 266492, -93553, 234353, 56223, 176016, 75541, -8362, 30767, -266841, 144313, 108993, 108057, 2779, -40712, 76738, -206708, 13941, 47491, 28075, 81351, -169441, 41659, 249734, 134368, 78707, -138405, 202939, 89948, 86576, 177217, 43250, 112283, 236622, 359959, 374627, 126074, 60817, 201822, 435453, 150072, 238461, 332675, -153442, -68634, -112990, -50066, 170929, 2933, -67724, 378849, 40132, 181149]
12202A81149D1752g1987C7386J28373K09285j26135l7105M7930J1129L9738Q0465
12191C91066j9103n5190D4534a84299E5561a37171A99094b29465A47539F6937
12180A0908J51616A172O49K46864O0950b85669a29254N0207C4975J90440a70377
12168B76210G8183O4087d32077A39446a191A46313J46652a09557A19184p091h2618
12156c1661C72297E3869J71002a11144d5173A16445j087g2670C59432F0927j0707
12145E0220A0886d4649A76710B835N7546K14543Q1056A43911n8834b46196B17896
12133a52215A77317h5371G8121J7711d3321B86770A7600b00896k2902G7294Q5889
12122A63183A7788g6618A11725g1296B15996g7579B1704a88254k54837f9733j72523
$$ y = [181149, 41752, -71987, 37386, 165759, 375044, 248909, 211804, 259734, 270863, 310601, 391066, 371963, 316773, 44534, -184299, 55561, -137171, 199094, -229465, 147539, 66937, 10908, 162524, 1172, 1821, 248685, 309635, -285669, -129254, -79047, 34975, 225415, -170377, 276210, 78183, 142270, -432077, 139446, -1191, 146313, 292965, -109557, 119184, 112093, -82618, -31661, 372297, 53869, 224871, -111144, -45173, 116445, 115358, -72670, 359432, 60927, 50220, 10886, -44649, 176710, 2835, 60381, 274924, 355980, 143911, 85077, -246196, 217896, -152215, 177317, -85371, 78121, 95832, -43321, 286770, 17600, -200896, -223798, 77294, 163183, 17788, -76618, 111725, -71296, 215996, -77579, 21704, -188254, -443091, -69733, -242256]
12111b42256A1183J60911D1743a52204B72457d7381j44806H3217J725e9899g249
12099b00066D6451b5156k6354B04195a7462k03301q1590D3327b54389A29627N4628
12088A84255b86159F9617K17918D208a59475k03619h6269j64079G9379R5479D4085
12076A76214i5814B08127C5085a94714B13430G7746N106A2469K2561Q264R2395
12065A35689L0581a02144A87544e4029l92653f7068r0741d8446A88588C6067Q96377
12054I32444C60203a17289D66224b5789q3771Q813L390C5283K28540a84161g4436
12042b3185j43624I9802k5563c4775B49685c82984a38250N3285j0223B95633b57815
12030A82290E0047J07482h3611A76004a07792j45838A96326C5599d2686a9770
$$ y = [-242256, 11183, 172094, 41743, -152204, 272457, -47381, -192187, 83217, 84942, -59899, -7249, -200066, 46451, -25156, -51510, 204195, -17462, -220763, -302353, 43327, -254389, 129627, 184255, -286159, 69617, 287535, 4208, -159475, -363094, -86269, -250348, 79379, 174858, 44085, 176214, -95814, 208127, 35085, -194714, 213430, 77746, 82852, 12469, 35030, 43294, 135689, 166270, -102144, 187544, -54029, -446682, -67068, -157809, -48446, 188588, 36067, 932444, 360203, -117289, 466224, -25789, -109560, -100747, -97357, 35283, 263823, -184161, -74436, -23185, -166809, 99802, 74239, -34775, 249685, -382984, -138250, -84965, -95188, 295633, -257815, 182290, 50047, 157529, -83611, 176004, -107792, -253630, 196326, 35599, -42686, -19770]
12019f3019A27905i0078B21111H8975a02319A60737J4966d9717b1218k11278E2386
12007D6898K87395c22534d4050B47843C4409d4338a9199k73630A50477E7461b2226
11995B00474Q2330c10582c7741j50901L2497B60908c62289a41540m35832A70992
11984F6936b4873E9058J65678H094J77471E8151N3392J00633h119l68385B07676
11972a18686b0358C5100J1849c88545c245j11693l2772l6268k24621D2894A3444
11960d1283j94539O0225k69289B87916H7233h6915A27010l9688b51315Q2113A07448
11948e0108A30300a15684r1754j54641A65988m3532n2591b40938B01218h9363
11937A61622a9049E9566J75111G2749b56263A07226j3223a71261K798D2608c42467
$$ y = [-63019, 127905, -90078, 221111, 88975, -102319, 160737, 175703, -49717, -21218, -232496, 52386, 46898, 334293, -322534, -44050, 247843, 34409, -44338, -19199, -292829, 150477, 57461, -22226, 200474, 282804, -310582, -37741, -188642, -156145, 260908, -362289, -141540, -577372, 170992, 66936, -24873, 59058, 224736, 8094, 185565, 58151, 111543, 212176, -8119, -376504, 207676, -118686, -20358, 35100, 46949, -388545, -3245, -114938, -147710, -183978, -408599, 42894, 13444, -41283, -235822, -175597, -444886, 287916, 87233, -86915, 127010, 87322, -251315, -169202, 107448, -50108, 130300, -115684, -207438, -362079, 165988, 122456, 69865, -240938, 201218, -89363, 161622, -19049, 59566, 234677, 72749, -256263, 107226, 94003, -171261, -168463, 42608, -342467]
11925b03590a094k6964G8709a14667l6399m0931i0775l9430c3178a0485A38041
11913g4838m6098B1574d3263B07056e5623A70206o0184b8679B61521H2248J71955
11902B54203H2598J12799b67058a1575j03901I7206b6294j76378J5606j79906
11892c66972H8332b70666E0540b22083A24327E1881g1189j70742A05644Q5757
11882A91401K434D1706Q762c33258J44440F7352L7968i3126c639D15580a83098
11870A05807m0690a8121P433j11030A7473J05344c16144a41539A68600B4189a18779
11858a25040D5223e7342j11645r9664C9308P5699g9694F0675K0794a40214j7046
11847a57260I2508O8724c21787A16416A2778a25732A09269f89j14449A25056F2470
$$ y = [-203590, -1094, -28058, 78709, -114667, -151066, -191997, -90775, -130205, -33178, -10485, 138041, -74838, -120936, 21574, -43263, 207056, -55623, 170206, 110022, -28679, 261521, 82248, 254203, 82598, 195397, -267058, -11575, -115476, 97206, -26294, -202672, -187066, -366972, 88332, -270666, 50540, -222083, 124327, 51881, -71189, -241931, 105644, 191401, 193835, 41706, 50468, -333258, -188818, 67352, 105320, -93126, -3639, 415580, -183098, 105807, 65117, -18121, -10688, -121718, 17473, 122817, -316144, -141539, 168600, 24189, -118779, -125040, 45223, -57342, -168987, -268651, 39308, 115007, -79694, 60675, 81469, -140214, -157260, 92508, 161232, -321787, 116416, 12778, -125732, 109269, -689, -115138, 125056, 62470]
11835C1620K4714i8841B55771i137k70648a8331j67656E9574f2003H1275a95839
11823b2367r9251k5444D1061A027a62319M9259b072k58149J16952O5701b942o9922
11811g2864n3213l96936C4866a01802M687M615D8740f684I928a60107b7923p1736
11799i9659C10944A6221J74774a19829N0925G6727b32707A91509a40390A7804
11788A05217a23569A864b86895A41323n0795e2658A36366c0622r8444q5513D7644
11776i2849j42333a09016M7042p7759k6218A15691c15792e142j67532P3877B32888
11764b22041H2118e21976C90167F5102d0242q607j86499C5234c31731A16378c31266
11752c12851Q6370R1605A51725C1116b30829b1740j23038O4354C6299M8826a17885
$$ y = [31620, 56334, -98841, 255771, -9137, -279785, -18331, -185987, 59574, -62003, 81275, -195839, -22367, -121618, -147062, 41061, 1027, -162319, -113060, -2072, -260221, -143269, -77568, -2942, -72864, -126077, -523013, 34866, -101802, -97115, -92500, 48740, -6684, 9928, -160107, -27923, -99659, 310944, 16221, 190995, -119829, -68904, 76727, -232707, 191509, -140390, 17804, 105217, -123569, 1864, -286895, 141323, 90528, -52658, 136366, -30622, -129066, -214579, 47644, -92849, -235182, -109016, -61974, -139733, -165951, 115691, -315792, -5142, -172674, -98797, 232888, -222041, 82118, -521976, 390167, 65102, -40242, -48849, -235348, 35234, -331731, 116378, -331266, -312851, -226481, -134876, 151725, 31116, -230829, -21740, -144778, -80424, 36299, 85125, -117885]
11740b64689O2660g4359B18482a12989c4208j76353c4771E3753a44792k0639j64183
11729c29614A55945m7382J91525e00318D1533a43056A54607k5452f3426K5305
11719c8121B49146q2997c2282H2562C3269a34764B64779I5798d45469A82557g2979
11707f994m14621B3873b76633R6094J373j254B72648j12402f9083A01146c619
11695f1241b8360A13650j9344a4429j24373d8168J814J2695j28382B06359d9501
11683A56867A1946b2731D65560G2022L09694i5477K8461l11856A00340i9919l7
11672i9956A9636i5634n4723B78203r2233c114j87536K8533A44035a32847B66618
11660d3723o5284m3838A30125f5414E570L09708a40248N8560B2864J43865e8870
$$ y = [-264689, -202029, -74359, 218482, -112989, -34208, -210561, -34771, 53753, -144792, -165431, -329614, 155945, 108563, 300088, -500318, 41533, -143056, 154607, 129155, -63426, -38121, 249146, 166149, -32282, 82562, 33269, -134764, 264779, 95798, -445469, 182557, -72979, -6994, -421615, 23873, -276633, -180539, -179166, -180420, 272648, 160246, -69083, 101146, -3619, -61241, -28360, 113650, 94306, -14429, -138802, -48168, -46354, -33659, -162041, 206359, -49501, 156867, 11946, -22731, 465560, 72022, 381716, -95477, -67016, -378872, 100340, -99919, -99956, 19636, -95634, -150357, 278203, 185970, -3114, -190650, -162117, 144035, -132847, 266618, -43723, -109007, -152845, 130125, -65414, 5570, 315278, -140248, -81688, 22864, 166729, -58870]
11648g6632K1424I7J93172a06787A19122A355a39214D1908R1686i1965A21877
11636A91062g0284k3142d2134F2238J07057o3775b15633A6630K61686a18278F7559
11624A6227a78203h2944a2543C4092A5408d6854k37414J30077L8008B68170D5169
11612d19190K09537E4651R6408n7417a33012q1163B2993J45974a11168k45480
11602c56648C626a23276a9319B31049a50336A07684r800b69396o083L7187f1902
11590h1657K0939C83275a75478m2473d9590C068h475q6340r8271A3776d5427A01037
11577i5888P716A27235K5856b40508B28652J5638f9044A6187P551a15982b8547
11565I6894b84622E4574D501g4355D9831J30175J14253d4361j94584b6860A0238
$$ y = [-76632, -55208, 97, 193269, -106787, 119122, 1355, -139214, 41908, 133594, -91965, 121877, 191062, -70284, -93426, -42134, 62238, 169295, 105520, -215633, 16630, 278316, -118278, 67559, 16227, -178203, -82944, -12543, 34092, 15408, -46854, -284268, -154191, -116183, 268170, 45169, -419190, -209653, 54651, 151059, 93642, -133012, -214175, 22993, 168967, -111168, -356648, 3626, -123276, -19319, 231049, -150336, 107684, 97884, -269396, -275479, -238292, -61902, -81657, -60718, 383275, -175478, -217951, -49590, 3068, -8475, -94815, -193086, 13776, -45427, 101037, -95888, -88172, 127235, 153091, -240508, 228652, 244290, -69044, 16187, 23738, -115982, -28547, 96894, -284622, 54574, 4501, -74355, 49831, 180006, 294259, -44361, -238945, -26860, 10238]
11553C4369j2832J40677J67826A09963e5664H686R7976b38207B25640a3992A57014
11541b86531a03130M5473H4344a66910A40823a52198r4443C69700H1660J58848
11531B40508f6747A73179a50897A88978J6385I9002J04821c5662J5308B83862
11520a13637D700a21081M8512J4958G0994c05631B29003O6792A47070D973c79882
11508F3092Q5834C5772J92385b21759o4287C39495A50845C4041J53686h6613a4515
11496C5601K17685c3453B17249R4585j16821b0497j00556I9900b96540C09793
11485A02834f0147A27615B416K85903Q1339D4224i754r7488K1983p9109A93874
11473A603J62731f7479A4001J09738a19050B28631M6315P191b3376A98181O6187
$$ y = [34369, 21537, 162214, 330040, 109963, -55664, 8686, 106662, -238207, 225640, -13992, 157014, -286531, -103130, -57657, 84344, -166910, 140823, -152198, -246641, 369700, 81660, 240508, -66747, 173179, -150897, 188978, 205363, 99002, 203823, -35662, -20354, 283862, -113637, 4700, -121081, -72569, -57611, 70994, -305631, 229003, 295795, 147070, 4973, -379882, 63092, 148926, 35772, 228157, -221759, -286046, 339495, 150845, 34041, 187727, -86613, -14515, 35601, 253286, -33453, 217249, 311834, 195013, -20497, -121053, 99900, -296540, 309793, 102834, -60147, 127615, 2416, 288319, 369658, 44224, -9754, -107242, -85259, -164368, 193874, 1603, 164334, -67479, 14001, 123739, -119050, 228631, 274946, 282137, -23376, 198181, 264368]
11462B64368i6851J13Q539I7416a75991B98606f6645a3788A23556A8252Q5049
11451A03301a50936b6238A49856d7157E3313h6828B09537a63704A28899j0991
11441A17908b9041A93645b81733A61035d606C28245a07815I5472j1225C4644L46140
11430C80784a06849E0010a7083C80114a83040A75452a80207b9142q7916A85813
11419c1983j81886D3739r146b5505j83106F8026M130K0986j0144N225c0369j41991
11407a72360D9784R3116J1383a88919A90228a51093D103f5329n6285A10625f9224
11395i0062G3826K3517O881l3336a33986j22345J9579A23337e04879B12995r3347
11384A19648h7822B12354A6131b8521A31874c25851I7076J80644a05617A71016
$$ y = [264368, -96851, -96738, -88199, 97416, -175991, 298606, -66645, -13788, 123556, 18252, 103301, -150936, -26238, 149856, -47157, 53313, -86828, 209537, -163704, 128899, 117908, -29041, 193645, -281733, 161035, -4606, 328245, -107815, 95472, 84247, 34644, 380784, -106849, 50010, -17083, 380114, -183040, 175452, -180207, -29142, -117058, 185813, -31983, -213869, 43739, 34593, -25505, -208611, 68026, 72156, 93142, 82998, 88223, -30369, -172360, 49784, 142900, 154283, -188919, 190228, -151093, 4103, -65329, -121614, 110625, -69224, -90062, 73826, 97343, 104224, 70888, -133986, -256331, -236752, 123337, -504879, 212995, 119648, -87822, 212354, 16131, -28521, 131874, -325851, 97076, 277720, -105617, 171016]
11373a44643B07034I6812A5393a33278A54634j3837b07568F3738g9074B81600
11362a25035j25937B1853a16518L2231B18879f9653Q800n1392d0454B52319a95400
11350a68811h0113k15159J13278B4149a23533A38949d3004I5046A8935R7263D1933
11338g6220K6072D4760c18306a20453p6768F6525J19933q3600a8462k23707J02792
11327a39377L6541C10006a23147B30565n0059K4575d5277C025h0353A49108c8156
11315c49369a67464B16037h1268r2250A03675C8873O3209a41950j4761A07380
11304C7730h6422p1341C03948b63011A57665f1688j06950a634C3745N5487A0531
11292d37021J52619Q4260j60128F9017g7292H5833a87498C41281b07562O1344
$$ y = [-144643, 207034, 96812, 15393, -133278, 154634, 140797, -207568, 63738, -79074, 281600, -125035, -250972, 21853, -116518, -84287, 218879, -69653, -60853, -112245, -40454, 252319, -195400, -168811, -80113, -295272, -181994, 24149, -123533, 138949, -43004, 95046, 18935, 116198, 41933, -76220, -50148, 44760, -318306, -120453, -197221, 66525, 186458, 102858, -18462, -242169, -139377, -102836, 310006, -123147, 230565, 180506, 205081, -45277, 3025, -80353, 149108, -38156, -349369, -167464, 216037, -81268, -173518, 103675, 38873, 102082, -141950, -156711, 107380, 37730, -86422, -157763, 303948, -263011, 157665, -61688, -168638, -1634, 33745, 89232, 10531, -437021, -284402, -200142, -360270, 69017, -77292, 85833, -187498, 341281, -207562, -146218]
11282a46218C9024a62879G0218L11570D8570K17448b06506k63368d2563j39670
11272a82233Q3977I7391Q3657f148A21773B9690M9216L6791a54451E9511c02424
11260b6690C4935a12782k03772J50915D55273b47287k3359g0027j64790A859c53222
11248B8300b86106i1406m7384A21667i9677c9174A29865a60856C09635j35842
11238A73793a12643j15087G5513N8178b66495D6808C030a77675J4303c0433I307
11226b04573D0122b9728f301B45960a95406A21529a02429q2101l5531M165B2637
11214A19058a82072A01925a58242j42807f4173o0839q9892B73903I6846l8072
11204E8774j6287C824K40458a25267j41671i1426J9565C31377A6286Q5426A99
$$ y = [-146218, 39024, -162879, 70218, 381788, 48570, 266018, -206506, -469874, -42563, -182233, -98256, 97391, 181048, -6148, 121773, 29690, 78906, 115697, -154451, 59511, -302424, -26690, 34935, -112782, -316554, -165639, 455273, -247287, -270646, -70027, -234817, 1859, -353222, 28300, -286106, -91406, -138790, 121667, -99677, -39174, 129865, -160856, 309635, 173793, -112643, -227730, 75513, 133691, -266495, 46808, 3030, -177675, -163372, -30433, 9307, -204573, 40122, -29728, -6301, 245960, -195406, 121529, -102429, -184530, -220061, -215896, 22637, 119058, -182072, 101925, -158242, -301049, -64173, -125012, -214904, 273903, 96846, 58774, 42487, 3824, 244282, -125267, -266938, -91426, -71861, 331377, 16286, 101712, 199]
11192i643H0022b15347B03070g1359l04814J52462j08910a48254A46630a62402
11181A3639N9399p423c4021g157A61434a72792O8548M6531a8211o2644P278A52213
11168a32494O74f4765C34843G7119e7685R156d507l19772a14206e957n163B6159
11155G996A06a12592k6850q2657K6003F5501D916K92528E8622a06517B13148j6951
11143A96197b4614j39756a5099l86879g7170H7901K1863b2274l48213c2302k27888
11132b60190m0581D3791K25226B6711K4083i7301B63368j21345N3757b73883a12651
11120A33173E1424J54122L5741g9314b286A0092b04116j1002B962K73203Q5888
11109C62053A08607B3453J07207K80422a66645C65925A720N9356L2476L1385l7045
$$ y = [-9643, 80022, -215347, 203070, -71359, -376173, -223711, -332621, -148254, 146630, -162402, 13639, 73038, 65615, -34021, -7157, 161434, -172792, -104244, -57713, -18211, -80855, -73577, 152213, -132494, -131820, -64765, 334843, 77119, -57685, -48529, -4507, -324279, -114206, -5957, -11120, 26159, 7996, 106, -112592, -139442, -222099, -196096, 65501, 4916, 297444, 58622, -106517, 213148, 196197, -24614, -164370, -15099, -401978, -77170, 87901, 109764, -22274, -370487, -32302, -260190, -300771, 43791, 269017, 26711, 50794, -97301, 263368, 142023, 195780, -273883, -112651, 133173, 51424, 205546, 241287, -79314, -2286, 10092, -204116, -215118, 2962, 276165, 362053, 108607, 23453, 130660, 411082, -166645, 365925, 1720, 61076, 93552, 124937, 87892]
11098H7892K10593L7665J1781b9970A32673J45028j22824p5287J28719K91380
11088D99689j12627d193r1199A89947E9434O8496J89912l4285K19300A08817M3474
11077A52291a00016A54520K0525a5121D96481A79146N8676K02329j45623j9569
11067B74959p4792J88139F8322J38359k3197f3486D58545A96648L40649J64222
11057G01519k64572j18271A55693J53157J99439K70012k49520j49451L45266J22668
11047H47264p5748k79028L71250J1667k43199J22675j32467L76756m30007j987
11037E67176k2968M17954m48091J41139K99519m75346K74992Q3319C25772j03960
11027B21812N03879j84561K15616k57687k6099K61645L0171k08996J29276j25322
$$ y = [87892, 298485, 336150, 347931, -29970, 132673, 277701, 154877, 79590, 208309, 499689, 387062, -4193, -95392, 189947, 59434, 127930, 317842, 283557, 502857, 108817, 152291, -100016, 154520, 175045, -15121, 496481, 179146, 237822, 440151, 294528, 274959, 200167, 388306, 68322, 206681, 183484, -63486, 458545, 196648, 537297, 701519, 436947, 318676, 155693, 308850, 508289, 778301, 528781, 379330, 724596, 847264, 771516, 492488, 863738, 875405, 632206, 754881, 622414, 999170, 569163, 567176, 544208, 962162, 514071, 655210, 954729, 479383, 754375, 837694, 325772, 221812, 725691, 541130, 756746, 499059, 472960, 734605, 764776, 555780, 685056, 559734]
11017E59734J34063n0973k38032L02280N6843k90678L0432J7410j31268k9428
11007C60383L24724J6390B05258N4687K72557j23802A76926M18872Q378j45039
10997D59137J96720J06065l14838A70167Q4038L62808j39367k9795K59598l7655
10987F69794Q270k0089R367L6572l34268O61281R4802K08261m6701K42998K40198
10976A770485q2194L29829n60O70472P3909j26125O1033q079j58332l45055l16417
10965A868966l57950j79812k79110M0410m51742N1553Q8814Q6540o4352j66903
10955F36414j78838O2303k05981I1633K77220K02173J47642D0304O8998K04690
10945C13992C4097L08555A01993J57656b48043H5242e2682l5146b4950n7922A16702
$$ y = [559734, 693797, 642824, 404792, 707072, 763915, 473237, 503669, 521079, 389811, 360383, 685107, 701497, 205258, 259945, 532502, 408700, 176926, 595798, 604176, 459137, 655857, 761922, 447084, 170167, 254205, 617013, 477646, 447851, 707449, 669794, 678064, 657975, 667342, 703914, 369646, 1030927, 1125729, 1333990, 1287289, 1530287, 1770485, 1688291, 2018120, 2017560, 2688032, 2761941, 2635816, 2696849, 2688770, 2530438, 2185383, 1868966, 1511016, 1331204, 1052094, 1092504, 640762, 692315, 781129, 867669, 803317, 636414, 457576, 519879, 313898, 91633, 368853, 571026, 718668, 40304, 109302, 313992, 34097, 342652, 101993, 259649, -248043, 85242, -52682, -87828, -24950, -82872, 116702]
10933C93429a51661J6480B63028H9429c40993a23400A33571F0165a06676B96991
10922I6089a9463I3293B8501k854J41246F543O3234b86327B50453a75232M1782
10911a33450R019N4045b5946B00407K23048d8101j38950m1450B37142A883K13952
10900B15835a0353k6118I2266B6100b62497a02416k4522A56461c56674a26655
10889a14775J1994A70604E3840a90867C5562L0502d1877l7574D04723b79001K9069
10878b49932d0605q0905K8166j84107g0529A1456b21227n9538Q3910f1797l2809
10867i4606j56406j10525J05831J27107A85092H202c75455A15420b18051j1779
10857b29830e5198l0779B38361E4025L2728b10805i275j97415f7829D13i1083
$$ y = [393429, -151661, -135181, 263028, 89429, -340993, -123400, 133571, 60165, -106676, 296991, 96089, -19463, 93293, 28501, 25647, 166893, 6543, 69777, -286327, 250453, -175232, -133450, -124431, -70386, -25946, 200407, 423455, -48101, -187051, -228501, 237142, 1883, 215835, -10353, -36471, 92266, 26100, -262497, -102416, -126938, 156461, -356674, -126655, -114775, -102781, 170604, 53840, -190867, 35562, 66064, -41877, -79451, 404723, -279001, -249932, -40605, -121510, -93344, -277451, -70529, 11456, -221227, -280765, -196855, -61797, -94606, -251012, -361537, -255706, -128599, 185092, 8202, -375455, 115420, -218051, -229830, -55198, -85977, 238361, 54025, 86753, -210805, -9275, -206690, -67829, 413, -91083]
10845f5271K5623p4618N2168m2293k18164h6517j60110O2327a4853f569C47425
10833B61810J047b72790O8143A68587j1935B161b43944B76242d9476r0919B81766
10821a08637j50174N4999C0004J76876b36302d4077o3948M5854A59131d7840A79360
10809A92701e4356d11m8256j72248i765n6387B8631b30321d9433l3244b4169j36298
10797a60467A42072g912A08212c18891k78029b83115K2728B79234A25165b61219
10786B51781f3895j07938D7607a91904M2060a4279k40776F6074b95627g3725n6634
10775a30359r0831K9354K2227B06708I6638a53707b320A02651j9403p586b67656
10763a23852B6367a26202K752D4240b8596E3685b15612e4461A55577f9021J9834
$$ y = [-65271, -39648, -114266, -62098, -104391, -322555, -86517, -246627, -184300, -14853, -6569, 347425, 261810, 262857, -272790, -204647, 168587, 156652, 2161, -243944, 276242, -49476, -140395, 281766, -108637, -258811, -203812, 30004, 206880, -236302, -44077, -108025, -62171, 159131, -47840, 179360, 192701, -54356, -411, -48667, -220915, -9765, -66152, 28631, -230321, -49433, -82677, -24169, -160467, 142072, -7912, 108212, -318891, -596920, -283115, -260387, 279234, 125165, -261219, 251781, -63895, -171833, 47607, -191904, -149844, -14279, -255055, 66074, -295627, -73725, -130359, -221190, -191836, -169609, 206708, 96638, -153707, -2320, 102651, 83248, 75662, -267656, -123852, 26367, -126202, -123450, 44240, -28596, 53685, -215612, -54461, 155577, -69021, -49187]
10752d9187j52324c9668A35597a40224B8360N8899c8580F1181a30665c6152q6270
10741a22422m191A15551f9477l20727a86915C09502f4581j53720c2379m4477A74138
10729a66249k19045A33804d30516A51340G0707a76925A06647a18871H743a92288
10718F7324c4503G1656N819J00548a50417B30289a5827A7885Q7166J92250a54496
10706a39129k0334O5237j81627a9881C83779c27668a08073j36035i5186A55070
10695b11257m808f2702A25439b27919A89436a62969M2640l1980E8722b28159P4247
10684a53912D2875b05285R8142G1365N7934b01752A1710a31897n42784i9535j5794
10673a15329k12558e8691K553k08325B03172i9814I9360l4907b0022B27419j732
$$ y = [-49187, -201511, -39668, 135597, -140224, 28360, 87259, -38580, 61181, -130665, -36152, -122422, -126613, 115551, -69477, -390204, -186915, 309502, -64581, -218301, -32379, -76856, 174138, -166249, -385294, 133804, -430516, 151340, 70707, -176925, 106647, -118871, 8743, -192288, 67324, -34503, 71656, 77475, 178023, -150417, 230289, -15827, 17885, 105051, 297301, -154496, -139129, -159463, -94226, -275853, -19881, 383779, -327668, -108073, -244108, -95186, 155070, -211257, -216065, -62702, 125439, -227919, 189436, -162969, -120329, -152309, 58722, -228159, -153912, 42875, -205285, -107143, 71365, 129299, -201752, 11710, -131897, -674681, -99535, -115329, -327887, -58691, -56138, -264463, 203172, -99814, 99360, 64453, -20022, 227419, 225687]
10662B25687B5752a62550g0905a8468n6214j18172P7229j19271K9578a9032f992
10650b09410j24953c5106n3540k9738A72696P1072q3162J27547a12526M8451C1409
10638B94520A044b23929i907j2679j89581f170j61629l3061g2875j4735I3472
10626g9783K3791l9629A13552K24623a48006L8877k01969J07304B08774d7770
10615A69180J1677d9102A91259f3237p1226j07206A87472a62303c9984k43051
10605b83035h1317A44299b8855j34865b5055j39158B39391b11021B46283c3016
10594B56026f3611J5081A57475d15153a52427H9708P1227D4756O1790b21576A01734
10582E7855J78060I0805J94647b16595I1230e3894j27330b440q8273J4900C6434
$$ y = [225687, 25752, -162550, -70905, -18468, -74682, -192854, -115625, -234896, -205318, -19032, -6992, -209410, -334363, -35106, -88646, -118384, 172696, 243768, 160606, 288153, -112526, -64075, 31409, 294520, 1044, -223929, -9907, -22586, -212167, -6170, -167799, -200860, -72875, -87610, 93472, -79783, -55992, -95621, 113552, 338175, -148006, -109129, -311098, -203794, 208774, -47770, 169180, 180857, -49102, 191259, -63237, -134463, -241669, 187472, -162303, -39984, -283035, -81317, 144299, -28855, -163720, -25055, -164213, 239391, -211021, 246283, -33016, 256026, -63611, -48530, 157475, -415153, -152427, 89708, 160935, 44756, 106546, -221576, 101734, 57855, 235915, 90805, 285452, -216595, 91230, -53894, -181224, -2440, -90713, -75813, 36434]
10570a94810a933j47785k69641A18981J00839h2351E0330K67823A15387a55555
10559E9879b65112A12789a40893D7058a83377A69667f5891j34768a1409q7989
10549i9398M2727C4973h7719r331j76585Q2784r5932g5082b8033k15832r6668
10538c40533e0963a9442I8274e0741q8262k08200J62147F0615J34145r5446P285
10527A06599i8535D7667e8213j68318n0558h2167m2099M7164j50647c2652B44719
10515a10877M2814A84019q0055a50593A73690f515m08670a32919j4042a4066A85593
10503a0152j82001j8770g0358D4905b40306a00997D4108j4431d91573a54630k892
10492a57522A74770D2567A1478J23567b27949C20684A9139J82857g1910K642B18710
$$ y = [-194810, -1933, -149718, -419359, 118981, 219820, -82351, 50330, 318153, 115387, -155555, 59879, -265112, 112789, -140893, 47058, -183377, 169667, -65891, -200659, -11409, -99398, -56671, 34973, -87719, -97050, -273635, -190851, -286783, -75082, -28033, -243865, -340533, -50963, -19442, 98274, -50741, -139003, -347203, -185056, 60615, 194760, 99314, 106599, -98535, 47667, -58213, -226531, -277089, -82167, -124266, -77102, -227749, -32652, 244719, -110877, -68063, 184019, 103964, -150593, 173690, -6515, -415185, -132919, -146961, -14066, 185593, -10152, -192153, -210923, -70358, 44905, -240306, -100997, 44108, 29677, -491573, -154630, -157522, 174770, 42567, 11478, 135045, -227949, 320684, 19139, 201996, -71910, -69268, 218710]
10480h3559A56084b89575a08123a6741j3214H4367D1994O3675a93351A41087n7048
10469H4039h4674o8532c1789A95683N1952j01745R5213b81641J19333a4247k15354
10458b29601A43567a46501D5291a29002B61676a44611A6681R8107b21530C71299
10447a67996p5748A91457I1699g9712B22737e49163b27459C12221b95995H2248
10436G5288q73f6413Q609l51020E18520j86397a03321M7083A84057a7501k21509
10425b39010C921J02270Q7143b96083F0957J33940a22331r4141A14300n3682N039
10414F5657a81834E2233b5857D59549N5198a06696k53502J58173n2730e441k14828
10403b20269g9693C11467A51388a30989K3899D0933J48228K880A0136d7421H9818
$$ y = [-83559, 156084, -289575, -108123, -16741, -29955, 84367, 41994, 105669, -193351, 141087, 84039, -84674, -153206, -31789, 195683, 247635, 145890, 241103, -281641, -162308, -14247, -229601, 143567, -146501, 45291, -129002, 261676, -144611, 16681, 114788, -221530, 371299, -167996, -243744, 191457, 91699, -79712, 222737, -549163, -227459, 312221, -295995, 82248, 75288, 74415, -66413, -57804, -408824, 518520, 332123, -103321, -56238, 184057, -17501, -239010, 3921, 106191, 193334, -296083, 60957, 194897, -122331, -216472, 114300, 60618, 65657, -181834, 52233, -25857, 459549, 514747, -106696, -360198, -202025, -254755, -5441, -220269, -79693, 311467, 151388, -130989, -107090, 40933, 189161, 192041, 10136, -47421, 89818]
10391a26888A30399K37216L80290o2816G2905J04782J72048a11847q5996B73915
10380C75914A32323a6456A8412J65507a91258d465C89819j94047c6967p1429G2113
10368D23164A61136J52559L13399k52927J60922k39055L510H3833K2497K94159
10358D00489A07321D3251K93600j14300G741L02825j540L18131j50989K44985
10348G21153B02255q5529f0109I335a61267D63092c5669C82789r7755O1875A34000
10336B18762r5011c8356C54300j58444Q1634c70322f7662A73240l8493g0434E29968
10324A92501K64631A63691c2597D54330h4552B53531E8797K17055A6061J0858
10314B6919p340b18871A03242P2127b2116j12273j69854A42496c9586J2182k56380
$$ y = [-126888, 130399, 367615, 747905, 685089, 72905, 177687, 349735, -111847, -197843, 273915, 375914, 132323, -16456, 18412, 183919, -191258, -4465, 389819, 195772, -36967, -108396, 72113, 423164, 161136, 313695, 627094, 374167, 535089, 296034, 299544, 83833, 106330, 400489, 107321, 43251, 336851, 222551, 7741, 310566, 309026, 627157, 476168, 721153, 202255, 116726, -60109, 9335, -161267, 463092, -35669, 382789, 285034, 346909, 134000, 218762, 123751, -38356, 354300, 195856, 277490, -370322, -67662, 173240, 134747, -70434, 529968, 192501, 457132, 163691, -32597, 454330, -84552, 253531, 58797, 275852, 16061, 26919, 19579, -218871, 103242, 175369, -22116, -134389, -304243, 142496, -39586, -27404, -283784]
10303b83784O9979A40481b85429k42374A24185O2038B9158N3497i5718A12393
10292C7327J97847a37719A15949n817D4707a90317e9163H402a01066B7703a90288
10280A52704b27973A60620a27534d4624k40588D5678c0942C35198a26029k9299
10270a55328A49832o9023b67120h7020p7803A4009m443L9248d2418A94735a10361
10258B73483a93565E326M23677H2997P2230R1378c88458C9024a19784j62095N4242
10247b27637F8433J86332A23076c0021k02088A63074c41077B3851P2448a33064
10236b65969K9592B30566i1293r2343B05424a8207F6449d1140b059A93100J41092
10225C34192j15645b75291J34611G1283c8553C1840b58348l0967J00796D6259
$$ y = [-283784, -213805, 140481, -285429, -527803, 124185, 186223, 29158, 82655, -95718, 112393, 37327, 235174, -137719, 115949, 110132, 44707, -190317, -59163, 8402, -101066, 27703, -190288, 152704, -227973, 160620, -127534, -44624, -285212, 45678, -30942, 335198, -126029, -155328, 149832, 80809, -267120, -87020, -164823, 14009, 9566, 48814, -42418, 194735, -110361, 273483, -193565, 5326, 429003, 82997, 155227, 246605, -388458, 39024, -119784, -281879, -227637, 68433, 254765, 123076, -30021, -232109, 163074, -341077, 23851, 96299, -133064, -265969, -236377, 230566, -91293, -183636, 205424, -18207, 66449, -41140, -2059, 193100, 334192, 218547, -275291, -140680, 71283, -38553, 31840, -258348, -289315, -188519, 46259]
10214A51766c04225q6400F1767a5595n2952h628j48798A79853o5723B4047K52466
10203B76513A12548i0353j43236L3560C6457A4270J99565a0099B32824K61502
10193D94326A32546K9580m0460a14106E8112A1502c24123A60227B1529b76702
10182f6793C0539a47876b1496n4059C4579b0974B27492c66528i0752k04645f9575
10170A3862d43602e0051r3641B21769c5923C33689a48031N6941j53499K1796A25972
10158D4618a04508A00660b99409J43748f7219D3403c18116a03244j56215A83533
10147b00837A47963k1130J41987g4445L6216H4261d5978K499k25293a24622A61946
10135a71499A44733c79209C5259b56437M9147k43655h0946m3292B11193f1023
$$ y = [151766, -304225, -390625, 61767, -15595, -68547, -8628, -157426, 179853, 114130, 24047, 276513, 112548, -90353, -233589, -200029, 36457, 14270, 213835, -10099, 232824, 494326, 132546, 162126, 121666, -114106, 58112, 11502, -324123, 160227, 21529, -276702, -66793, 30539, -147876, -21496, -75555, 34579, -20974, 227492, -366528, -90752, -295397, -69575, 13862, -443602, -50051, -143692, 221769, -35923, 333689, -148031, -91090, -244589, -222793, 125972, 44618, -104508, 100660, -299409, -155661, -67219, 43403, -318116, -103244, -259459, 183533, -200837, 147963, 126833, 268820, -74445, -38229, 84261, -45978, -43479, -268772, -124622, 161946, -171499, 144733, -379209, 35259, -256437, -207290, -450945, -80946, -124238, 211193, -61023]
10124i3545j12571d6222H0963k1550b04804f3966A00584H058K1761d68535A49855
10112F9790a86689E6591P5526a65530C42997F7668O9009o2333J73189f5012l0627
10101i5639E1036A6554L0288b69342B79771a99885K72k6335A35511b30460h1485
10089C43350d01248J22655A03958a92197a6423P146j33875F2574d39138a68425
10078a72572B76345c73152P6526Q5479k61317a9433k1848n1885m5136B83513P8326
10067C61839b24527a8889P476q6232A33326d53285h2410p9981L0645A01845M7412
10056A49257C6621K44195e02999K03713h0696K7104j3916B36384a51887B36467
10045C13793m6126a80275C3023c6508j36205A47021d46566C5980a2750l2521D0746
$$ y = [-93545, -206116, -46222, 80963, 59413, -204804, -63966, 100584, 8058, 29819, -468535, 149855, 69790, -186689, 56591, 132117, -165530, 342997, 67668, 136677, 74344, 247533, -65012, -95639, 51036, 16554, 46842, -269342, 279771, -199885, -199613, -225948, 135511, -230460, -81485, 343350, -401248, -278593, 103958, -192197, -16423, -9277, -143152, 62574, -439138, -168425, -172572, 276345, -373152, -296626, -211147, -472464, -19433, -41281, -93166, -138302, 283513, 361839, -224527, -18889, -11413, -97645, 133326, -453285, -82410, -162391, -131746, 101845, 149257, 36621, 280816, -502999, -299286, -80696, -53592, -67508, 236384, -151887, 236467, 313793, 267667, -180275, 33023, -36508, -172713, 147021, -446566, 35980, -12750, -45271, 40746]
10033A99643a61326j41295A08849e1921A72944a39203H0701a65931M7627k37413
10023c55717B91349a33876N9967D3340a77695d3792C20660j49597d16136J77086
10013b39050P1587p1008j32160B82186f6659B11613D4641a37686A00855a02820
10002B0846a2353j17230d2519F7777M6414A1070b56970B0018b40091E6849a61586
9990C3799a41153N018O266j23289H1647Q2301a41132p5526M4772A80043a23109
9978c8349A31119A8660h277E7371c1790m3826B11576H6235J49874N4129k2454
9967B67784a06607A92162a5214d183j05723B7518K35464i3573A56138c10985g7163
9955a71204j10629a2898k33214E2065J60852a32516I7153a78421C36145c39100
$$ y = [199643, -161326, -302621, 108849, -51921, 172944, -139203, 80701, -165931, -118304, -355717, 291349, -133876, -73909, 43340, -177695, -43792, 320660, 171063, -416136, -239050, -167463, -238471, -370631, 282186, -66659, 211613, 44641, -137686, 100855, -102820, 20846, -12353, -129583, -42519, 67777, 114191, 11070, -256970, 20018, -240091, 56849, -161586, 33799, -141153, -136135, -129869, -253158, 81647, 163948, -141132, -216658, -171886, 180043, -123109, -38349, 131119, 18660, -8277, 57371, -31790, -75616, 211576, 86235, 236109, 290238, 267784, -106607, 192162, -15214, -4183, -109906, 27518, 262982, -93573, 156138, -310985, -77163, -171204, -281833, -12898, -246112, 52065, 212917, -132516, 97153, -178421, 336145, -339100]
9944d9749A27616g70o8438b9811q6256k88247b01113P9712N2878K7191a4417A03022
9931b75748J6924j02413a66934k73381B8286J42160b56569J03485f9554n1275
9921a20829A58903b51549g208H4639A8374a45433j7164O5299B84902a13518k64961
9910c78479d9160m21778b957j49037O0119o8843a7096p8664N361k83613J10151
9899b63861b3660B9415d8443p3703A14700c66919A25459b3628q1914j82381a20
9887b56008A5827h6539M51A27651o0480h8873k49168l3337A12562e7439o1637
9876a19076G5426c62467A07697a686j08633b9570K148n9613j18207d0649h425
9864E4313b8181n17273i2118n0237A66062a11347k6144A4121a06396b0806r2070
$$ y = [-49749, 127616, -770, -69208, -29811, -116067, -404314, -201113, -121401, -68523, -41332, -14417, 103022, -275748, -258824, -361237, -166934, -440315, 28286, 170446, -256569, -153084, -69554, -120829, 158903, -251549, -7208, 84639, 18374, -145433, -162597, -97298, 284902, -113518, -378479, -49160, -470938, -2957, -151994, -91875, -160718, -17096, -95760, -90399, -374012, -263861, -23660, 29415, -48443, -122146, 114700, -366919, 125459, -23628, -105542, -287923, -120, -256008, 15827, -86539, -86088, 127651, 67171, -88873, -338041, -371378, 112562, -57439, -119076, 75426, -362467, 107697, -1686, -110319, -29570, -27422, -87035, -205242, -40649, -8425, 54313, -28181, -545454, -92118, -142355, 166062, -111347, -137491, 14121, -106396, -20806, -112876]
9853a12876j39483G7311d1390A27309m5420a68566j88374G4985L7830M5792b46407
9841a19282D942h6466l88077I5051a6172j51658A9210e07248a24808e4323A9119
9829A77585b15719k62025K09020C3820d8420C017a45432B47874C9903J1161a758
9817F2759i5904K8796D976L95107q0878i4395b5936j35117l1679j58927a68252
9805C0664L242a09458B920K68050b3774j51939O5666K5242L1659C12702a93096
9793b17602B44557A1823a41768j44128I4126K9961J51867o3582I6384C7745a3195
9781F70b96461i5264k3531q556K0818r0058C0911g46B7318L36719b54013a727
9768b27607q2786B5645J2778b82442J7930j02414a59992A33659a64344j13292
$$ y = [-112876, -252359, 77311, -41390, 127309, 81889, -168566, -356940, 74985, 112815, 158607, -246407, -119282, 4942, -86466, -474543, 95051, -16172, -167830, 19210, -507248, -124808, -54323, 19119, 177585, -215719, -477744, -268724, 33820, -48420, 3017, -145432, 247874, 39903, 51064, -1758, 62759, -95904, -67108, 4976, 400083, 319205, -94395, -25936, -161053, -192732, -351659, -168252, 30664, 33906, -109458, 2920, 270970, -23774, -175713, -110047, -84805, -53146, 312702, -193096, -217602, 244557, 11823, -141768, -285896, 94126, 124087, 275954, 212372, 96384, 37745, -13195, 670, -296461, -95264, -118795, -127351, -106533, -196591, 30911, -746, 27318, 364037, -254013, -1727, -227607, -310393, 25645, 38423, -282442, -264512, -366926, -159992, 133659, -164344, -277636]
9758b77636e1042l95655h8127D8091d7668k39235B09939a10770C59944d0865A34439
9746G1077J44260E2561B366a82838j07489a2528A42782K3751c6635k07894C7490
9734b84100D9558c2857j30478A04428a35409j17510K4348N3753P4800j09057A71690
9722A54107b46638l21580b10528O2025k07396A29167l157k9157a71823A14011
9711I5733f122j25143N6696j44498M3918E4491a58947e3022j23588D9494a19347
9699A33330c55877A9459L78677a06412K4476C3736J16167g0698j9537D2838c689
9687A78635b6962A49002K08434a04225L569K9617A37221D5099d10675C8880K5831
9676F4711b7240D59558H5119j6767f9097j0752I4795c0335K219j20117L0522o3923
$$ y = [-277636, -51042, -446697, -88127, 48091, -47668, -286903, 209939, -110770, 359944, -40865, 134439, 71077, 215337, 52561, 2366, -182838, -290327, -12528, 142782, 166533, -36635, -244529, 37490, -284100, 49558, -32857, -163335, 104428, -135409, -252919, -228571, -174818, -100018, -209075, 171690, 154107, -246638, -568218, -210528, -148503, -355899, 129167, 126010, 96853, -171823, 114011, 95733, -6122, -131265, -74569, -219067, -175149, 54491, -158947, -53022, -176610, 49494, -119347, 133330, -355877, 19459, 398136, -106412, -81936, 33736, 149903, -70698, -90235, 42838, -3689, 178635, -26962, 149002, 357436, -104225, -100656, -71039, 137221, 45099, -410675, 38880, 64711, -27240, 459558, 85119, 68352, -69097, -79849, 94795, -30335, -28116, -148233, -117711, -181634]
9664a81634Q2918n3888g0041k11277J23907C6158K39543f777j02411p015k15114
9653c31317J24616b7514j25165A37767b3646o8412A47952a79556D1160a26381
9642A01364b89493a39218A61323i8908J2538B07479a8712k28536C03386A40572
9631a29844m8117B21475a19612l32093B4147g9740C6038K337b8270j34903d8203
9619d6349k04043B16062a45257l554a4007k25531Q6810F0436b5050B21059d0795
9607B55242b06459L6973A8738K35020b60461g2342D50176c82760j8065b6747l76771
9596d03518h132j80356A2711J50596k4036d37225a24373r219l21318b02161R6408
9585a05753b4179k57925K0986J11934F5674g4063K5377D3065a57031I8046B6065
$$ y = [-181634, -98716, -152604, -70041, -281318, -157411, 36158, 275701, -6777, -109188, -116203, -331317, -206701, -27514, -152679, 137767, -23646, -92058, 147952, -179556, 41160, -126381, 101364, -289493, -139218, 161323, -98908, -86370, 207479, -18712, -247248, 303386, 140572, -129844, -177961, 221475, -119612, -451705, 24147, -79740, 36038, 38375, -28270, -163173, -48203, -46349, -250392, 216062, -145257, -148811, -14007, -239538, -152728, 60436, -25050, 221059, -40795, 255242, -206459, -169486, 18738, 253758, -260461, -72342, 450176, -382760, -400825, -26747, -403518, -8132, -188488, 12711, 163307, 139271, -437225, -124373, -133592, -454910, -202161, -105753, -24179, -282104, -261118, -149184, 65674, -74063, -48686, 43065, -157031, 98046, 26065]
9573D26143a7388l69605J86133R2563b2992n4464D52892f1040J8305A62714b70796
9561a09058p8767e6242A9021i1930a122B47860b97558a41423K1927j65311J20154
9550a64653M017A36742b68930H2437a53579j9929g7317C25907H670a48427h356
9538b48511a8842k22404I932R9113e2456H2184K89304j76898O4546D2821M2091
9527H4912C0731A0680J11052D4304b46062g288j9273k22671f275j61352a0884
9515b20714g3308o0735e4397A04896i337o7852L7933F1058b50273B17302C461
9503a83888J3248O9773k99921a84785e8046k02598A68035a32614o1972d6250k5985
9492g2235j9533j36390A29045A2868j687K62081a28570d4575m66538b18779F2288
$$ y = [426143, -17388, -386993, -200860, -108297, -22992, -77456, 452892, -61040, -42735, 162714, -270796, -109058, -187825, -56242, 19021, -91930, -1122, 247860, -297558, -141423, -119496, -284807, -164653, -160636, 136742, -268930, 82437, -153579, -173508, -77317, 325907, 8670, -148427, -8356, -248511, -18842, -241246, 9932, 109045, -52456, 82184, 371488, 194590, 259136, 42821, 84912, 30731, 10680, 121732, 44304, -246062, -7288, -26561, -249232, -6275, -167627, -10884, -220714, -73308, -134043, -54397, 104896, -9337, -77189, -39256, 61058, -250273, 217302, 3461, -183888, -170640, -100867, -400788, -184785, -58046, -260644, 168035, -132614, -194586, -46250, -72235, -91768, -228158, 129045, 12868, 11181, 273262, -128570, -44575, -511113, -218779, 62288]
9480A4487J94108g23A82101p5281a305j12446b3001A989L37767r4200p8706b8993
9467a97350L2837A82805c24662A50348A0141R4458K40200i6481q5030b5166o3773
9456h8939k0233H2315a16966K5063A02041a99375E2010M3397h9357A81185a53635
9444d081k31115A49703d2227k23150A96303a80350h6486r49A28624b10145L5473
9433a74672h5983E1277R5529d4854B17618M2947b03742j54487L8185e4470n5156
9422a09626e2756k22349Q7866E0009b26743A42276K1767j1192b23638Q2403k85142
9411d26377e5612A6737b53098p5905c6781A628a15557b6725j64321o1634r3809
9400c46489A34418k3069A7137a97994Q5313j02004i7076j4249A59447i4690A31960
$$ y = [14487, 208595, -723, 182101, 106820, -1305, -113751, -23001, 1989, 339756, 245556, 166850, -28993, -197350, -164513, 182805, -324662, 150348, 10141, 104599, 344799, -96481, -181511, -25166, -88939, -109172, 82315, -116966, -91903, 102041, -199375, 52010, 95407, -89357, 181185, -153635, -4081, -235196, 149703, -42227, -265377, 196303, -180350, -86486, -87435, 128624, -210145, -174672, -85983, 51277, 146806, -44854, 217618, 260565, -203742, -358229, -320044, -54470, -109626, -52756, -275105, -187239, 50009, -226743, 142276, 164043, 152851, -223638, -141235, -426377, -55612, 16737, -253098, -329003, -36781, 1628, -115557, -26725, -191046, -252680, -346489, 134418, 111349, 17137, -197994, -112681, -214685, -97076, -111325, 159447, -94690, 131960]
9388f9239m0639n8499g4311C12018c7727A56281b29344b2854j25402j67485j16080
9377d31821b2719D0779A8350a0968C2953b32383k2717A2711e9505e746o1829C35459
9364b08767N6823L6852n8305c2773j0339l31801a16162D8932l924e1392A76186
9352f0729C0819A3015a1601k02552A11373a42431N2545k49682k4583E3411c74997
9340d21274a48288m3381Q2589A51403b09612B28856a69520h3586o7013N9871m8401
9329a39129F02885e6923j39571B97947a05464j12213a4329j96091A63506b43978
9318A87539a12826L0704d0167F7143a19992j23455j2634A24153i5924D386c10530
9306A0158b05746J199B30581e29909a61301A14710a4579j06722L6611B19114b07440
$$ y = [-69239, -109878, -168377, -74311, 312018, -37727, 156281, -229344, -22854, -148256, -315741, -431821, -22719, 40779, 18350, -10968, 32953, -232383, -255100, 12711, -59505, -5746, -67575, 335459, -208767, -151944, -115092, -173397, -32773, -43112, -374913, -116162, 48932, 45008, -51392, 176186, -60729, 30819, 13015, -11601, -214153, 111373, -142431, -89886, -339568, -364151, 53411, -374997, -421274, -148288, -191669, -109080, 151403, -209612, 228856, -169520, -83586, -150599, -90728, -139129, 602885, -56923, -196494, 297947, -105464, -217677, -14329, -210420, 163506, -243978, 187539, -112826, -82122, -40167, 67143, -119992, -243447, -256081, 124153, -95924, 4386, -310530, 10158, -205746, -204547, 230581, -529909, -161301, 114710, -14579, -121301, -84690, 219114, -207440]
9294A20725a51899j04282a15389j95025A02031H794b29741B84688I6781b20701
9283b56205J7448B91313A26598a09919A1961b71371j17734a90383A31046c7263
9272a36157B03443B8951a62531A88613b91699j77621A1184b72908I5815a53285
9261b43124b5602j88630j97836i83A79326N7009a07727F9469a64693P9489J1160
9250g4044L6547A90688e2237H1850b74448A10755d9967A0702N8219g8666j81991
9239b60657B1331K6577O7860m053f2587r7254E6069i2648l70093B8887h7579o7569
9227a55148b4401B09941b90723C22954a82909b0097A0158h1272c5323B34606j00299
9216A34307f3113k3548A58231k6946b71722i0019C10165a73677h6706r6049M3850
$$ y = [120725, -151899, -256181, -115389, -310414, 102031, 8794, -229741, 284688, 96781, -220701, -256205, -238757, 291313, 126598, -109919, 11961, -271371, -389105, -190383, 131046, -37263, -136157, 203443, 28951, -162531, 188613, -291699, -469320, 11184, -272908, 95815, -153285, -243124, -25602, -214232, -412068, -983, 179326, 236335, -107727, 69469, -164693, -85204, -74044, -37497, 190688, -52237, 81850, -274448, 110755, -49967, 10702, 68921, -78666, -260657, 21331, 47908, 115768, 111715, -62587, -159841, 56069, -92648, -462741, 28887, -87579, -155148, -24401, 209941, -290723, 322954, -182909, -20097, 10158, -81272, -35323, 234606, 134307, -63113, -86661, 158231, 131285, -271722, -90019, 310165, -173677, -86706, -182755, -138905]
9205a38905n1178Q4075D4286a25345k8119H9073c19999j23351a19080I8585l4787
9194F3798a93073k70500J52979a13940A41780a89537D490a46592B39340J23138
9184C62478f206A97958a92205i4346q3917C798d93949J80353c6104A70890b78961
9172c93636A80466C3987p181L0022e7353l9407n8673K7132a8886F8804J31306
9161B00110b33932A16555e5656A54607B4621a10629O215B3109n008H4b9822k84420
9149c14242d1658k01510Q5892B28265c62152C0244a99929B93103b45945e8923
9138A34637a43673k08616p404J77558B41465G3390c12403f438j27364j35336h1891
9126a35981E077d2882E2573a85350e7080C62909c05162A38737c5659q4948q5997
$$ y = [-138905, -190083, -106008, 44286, -125345, -153464, 89073, -319999, -443350, -119080, 98585, 63798, -193073, -463573, -310594, -113940, 141780, -189537, 4490, -146592, 239340, 362478, -6206, 197958, -192205, -94346, -178263, 3798, -493949, -313596, -36104, 170890, -278961, -393636, 180466, 33987, 26806, 56828, -57353, -96760, -155433, -128301, -18886, 68804, 200110, -233932, 116555, -55656, 154607, 24621, -110629, -104414, 23109, 18101, 84, -29822, -314242, -41658, -243168, -157276, 228265, -362152, 30244, -199929, 293103, -245945, -58923, 134637, -143673, -352289, -359693, -182135, 241465, 73390, -312403, -6438, -133802, -269138, -81891, -135981, 5077, -42882, 52573, -185350, -57080, 362909, -305162, 138737, -35659, -120607, -206604]
9115b06604E2287J11673K1650a98887A80940o5863B0084K19030o8099b2572k5166
9104d7738B51453G3808c7094j15712I6707k3806O6732a56021M5204j968d5040
9092B7143b56973G5168a70178k38836k57442B76728b78883c5621m26190A15290
9081a01912n6052j5054H0019c20240N8941A66683G8583a11804A12915d54202e2317
9069b7446j94565E7133a12874j39594b6473j93208B42480b61983C29135b06547
9058b91930A56675M1067l9665h2414m7862M0829B1613K36480b7690k12085C3946
9046B708J19523J73187b10293C0968l590a9332l05948A0423c24939a09273j47981
9035b57254B61745B2390e3697r2027E13148B8361c0239F5775A9129J37824c09143
$$ y = [-206604, 52287, 163960, 185610, -198887, 180940, 115077, 20084, 239114, 171015, -22572, -47738, 251453, 73808, -37094, -152806, 96707, 72901, 139633, -156021, -110817, -112785, -45040, 27143, -256973, 75168, -170178, -409014, -666456, 276728, -278883, -35621, -461811, 115290, -101912, -157964, -173018, 80019, -320240, -261299, 166683, 78583, -111804, 112915, -454202, -52317, -27446, -222011, 57133, -112874, -252468, -26473, -219681, 242480, -261983, 329135, -206547, -291930, 156675, 197742, 158077, -82414, -130276, -89447, 21613, 258093, -27690, -239775, 33946, 2708, 122231, 295418, -210293, 30968, 27378, -19332, -325280, 10423, -324939, -109273, -257254, 261745, 22390, -53697, -145724, 513148, 28361, -30239, 65775, 19129, 156953, -309143]
9023h2394A97475a85629f957j9940j95462F7016B6826n130a88811j65415f8559
9011c70555A49502a00487D99939i5734i835D6061a99826H8640b96384D03O0225
9000F0628a46799h644k15205F2963J15419g2418r9453D3618J88750a69442A26015
8988A71917a50181F7797K06248H7490a28873A70043G488L1121d1413k79656f7484
8976f8852e7j05350j45346P7179C93801h8749b943m4005A9381d9473a2253j6237
8964b8490k87489k5576A55114b65855a18671B07851o8324f0618A66610B0787a47804
8952f3973C4996a88142A6818a85937L5009B70503Q2455h4527k9490j56155G6009
8940g9933B24235M9090a91457N1003f4392A13994K0265a15874A83878a18186I2124
$$ y = [-82394, 197475, -185629, -6957, -26897, -222359, 67016, 26826, 21696, -188811, -354226, -68559, -370555, 149502, -100487, 499939, -95734, -9835, 46061, -199826, 88640, -296384, 403, 60628, -146799, -8644, -223849, 62963, 178382, -72418, -171871, 43618, 232368, -169442, 126015, 171917, -150181, 67797, 274045, 87490, -128873, 170043, 7488, 38609, -41413, -321069, -67484, -68852, -57, -105407, -250753, -173574, 393801, -88749, -2943, -46948, 19381, -49473, -12253, -28490, -315979, -341555, 155114, -265855, -118671, 207851, 139527, -60618, 166610, 20787, -147804, -63973, 34996, -188142, 16818, -185937, -150928, 270503, 352958, -84527, -114017, -270172, 76009, -79933, 224235, 273325, -191457, -140454, -64392, 113994, 134259, -115874, 183878, -118186, 92124]
8928A55879f1206A91671L32990A53597O93294J535320M974766L23571A951271
8918G99538B18424K17735g0939j53998B48416B0439c03628F9667J50526J1583
8908B31776g7915D1961a09501j68484d6816n4831k35646c0436j89869L9538q8097
8897b68864I489a72170j9058j32336A58254F4371L0452d7881r6208A4965J81637
8886A96602D4563j2105c41212a665A31817k6622a00440A43576a0982A57065i4966
$$ y = [155879, -61206, 191671, 524661, 153597, 846891, 2382211, 7356977, 7680548, 1951271, 799538, 218424, 436159, -70939, -224937, 248416, 20439, -303628, 69667, 220193, 231776, -77915, 41961, -109501, -277985, -46816, -101647, -337293, -30436, -220305, -180767, -268864, 9489, -172170, -191228, -323564, 158254, 64371, 94823, -47881, -144089, 14965, 196602, 44563, 32458, -341212, -1665, 131817, 105195, -100440, 143576, -10982, 157065, -94966]
$$ [...]
##END NTUPLES=NMR SPECTRUM
##END=
