
##TITLE=AC1366_2140_7184965_qDGOeVsAB1
##JCAMPDX= 6.0         $$ Bruker NMR JCAMP-DX V2.0
##DATA TYPE= NMR SPECTRUM
##DATA CLASS= NTUPLES
##ORIGIN= BRUKER
##OWNER= Administrator
$$ 1.72 TOPSPIN		Version 2.1
$$ 2012-12-07 18:17:37.062 -0500  Administrator@X
$$ Compression mode = diff/dup
##.OBSERVE FREQUENCY= 400.02188249412
##.OBSERVE NUCLEUS= ^1H
##.ACQUISITION MODE= SIMULTANEOUS (DQD)
##.ACQUISITION SCHEME= undefined
##.AVERAGES= 64
##.DIGITISER RES= 22
##SPECTROMETER/DATA SYSTEM= spect
##.PULSE SEQUENCE= noesygpps1d.comp
##.SOLVENT NAME= COFFEE_meoh
##.SHIFT REFERENCE= INTERNAL, COFFEE_meoh, 1, 14.96085
##AUDIT TRAIL= $$ (NUMBER, WHEN, WHO, WHERE, PROCESS, VERSION, WHAT)
$$ ##TITLE= Audit trail, TOPSPIN		Version 2.1
$$ ##JCAMPDX= 5.01
$$ ##ORIGIN= Bruker BioSpin GmbH
$$ ##OWNER= Administrator
$$ $$ E:\/data/COFFEE/nmr/AC1366_2140_7184965_qDGOeVsAB1/32/pdata/1/auditp.txt
$$ ##AUDIT TRAIL=  $$ (NUMBER, WHEN, WHO, WHERE, PROCESS, VERSION, WHAT)
(   1,<2012-12-07 18:17:31.642 -0500>,<Administrator>,<X>,<go>,<TOPSPIN 2.1>,
      <created by zg
	started at 2012-12-07 18:06:12.894 -0500,
	POWCHK enabled, PULCHK disabled,
       configuration hash MD5:
       86 BA 57 50 F2 9D 5C 9B 26 00 A9 28 5F 66 2E 89
       data hash MD5: 64K
       66 E8 40 9D FA 09 26 32 E4 50 C9 64 EE C1 0F 60>)
(   2,<2012-12-07 18:17:34.398 -0500>,<Administrator>,<X>,<proc1d>,<TOPSPIN 2.1>,
      <Start of raw data processing
       efp LB = 0.3 FT_mod = 6 PKNL = 1 PHC0 = 0 PHC1 = 0 SI = 128K 
       data hash MD5: 128K
       C2 C0 72 E9 4F D2 2F 4C C7 B1 25 32 4D 3D 07 6D>)
(   3,<2012-12-07 18:17:35.374 -0500>,<Administrator>,<X>,<proc1d>,<TOPSPIN 2.1>,
      <pk PHC0 = -78.84338 PHC1 = 0 
       data hash MD5: 128K
       E9 36 29 97 90 0D C9 C5 A0 F1 2D 5E B0 3E 89 E7>)
(   4,<2012-12-07 18:17:36.092 -0500>,<Administrator>,<X>,<proc1d>,<TOPSPIN 2.1>,
      <abs ABSG = 1 
       data hash MD5: 128K
       94 2F 39 B7 11 3B 93 9F 2E 85 DB A5 E5 D4 50 73>)
(   5,<2012-12-07 18:17:36.278 -0500>,<Administrator>,<X>,<proc1d>,<TOPSPIN 2.1>,
      <abs ABSG = 2 
       data hash MD5: 128K
       9A D1 52 12 E8 7C 94 9C D2 37 71 16 DC B8 49 E1>)
(   6,<2012-12-07 18:17:36.424 -0500>,<Administrator>,<X>,<proc1d>,<TOPSPIN 2.1>,
      <abs ABSG = 3 
       data hash MD5: 128K
       DF AA B5 F7 52 9C B5 16 A5 E7 1A 7E 74 A2 66 F1>)
(   7,<2012-12-07 18:17:36.597 -0500>,<Administrator>,<X>,<proc1d>,<TOPSPIN 2.1>,
      <abs ABSG = 4 
       data hash MD5: 128K
       F1 24 26 8E 8F 06 D7 77 C4 95 06 5E 1B 6A B0 C3>)
(   8,<2012-12-07 18:17:36.743 -0500>,<Administrator>,<X>,<proc1d>,<TOPSPIN 2.1>,
      <abs ABSG = 5 
       data hash MD5: 128K
       DC 99 0D 39 34 8D 4F 7D 79 25 3D 12 C3 70 E4 58>)
$$ ##END=
$$ 
$$ $$ hash MD5
$$ $$ A8 A5 96 5B 17 09 EA 2F 9F 77 5E 88 47 0B 13 C9
##$RELAX= 
##$RELAX= 
##$RELAX= 
##$RELAX= 
##$RELAX= 
##$RELAX= 
##$RELAX= 
##$RELAX= 
$$ Bruker specific parameters
$$ --------------------------
##$DU= <E:\>
##$EXPNO= 32
$$ [...]
##$TP07= 0
##$TPNAME0= <>
##$TPNAME1= <>
##$TPNAME2= <>
##$TPNAME3= <>
##$TPNAME4= <>
##$TPNAME5= <>
##$TPNAME6= <>
##$TPNAME7= <>
##$TPOAL= (0..7)
0.5 0.5 0.5 0.5 0.5 0.5 0.5 0.5
##$TPOFFS= (0..7)
0 0 0 0 0 0 0 0
##$TUNHIN= 0
##$TUNHOUT= 0
##$TUNXOUT= 0
##$USERA1= <user>
##$USERA2= <user>
##$USERA3= <user>
##$USERA4= <user>
##$USERA5= <user>
##$V9= 5
##$VALIST= <valist>
##$VCLIST= <CCCCCCCCCCCCCCC>
##$VD= 0
##$VDLIST= <DDDDDDDDDDDDDDD>
##$VPLIST= <PPPPPPPPPPPPPPP>
##$VTLIST= <TTTTTTTTTTTTTTT>
##$WBST= 1024
##$WBSW= 4
##$XGAIN= (0..3)
0 0 0 0
##$XL= 0
##$YL= 0
##$YMAX_a= 6015233
##$YMIN_a= -11476847
##$ZGOPTNS= <>
##$ZL1= 120
##$ZL2= 120
##$ZL3= 120
##$ZL4= 120
##$ABSF1= 14.96085
##$ABSF2= -5.597332
##$ABSG= 5
##$ABSL= 3
##$ALPHA= 0
##$AQORDER= 0
##$ASSFAC= 0
##$ASSFACI= 0
##$ASSFACX= 0
##$ASSWID= 0
##$AUNMP= <proc_prof1d_extract.lims>
##$AXLEFT= 0
##$AXNAME= <>
##$AXNUC= <1H>
##$AXRIGHT= 0
##$AXTYPE= 0
##$AXUNIT= <>
##$AZFE= 0.1
##$AZFW= 0.1
##$BCFW= 0
##$BC_mod= 0
##$BYTORDP= 0
##$COROFFS= 0
##$CY= 15
##$DATMOD= 1
##$DC= 0
##$DFILT= <>
##$DTYPP= 0
##$F1P= 0
##$F2P= 0
##$FCOR= 0.5
##$FTSIZE= 131072
##$FT_mod= 6
##$GAMMA= 0
##$GB= 0
##$INTBC= 1
##$INTSCL= 1
##$ISEN= 128
##$LB= 0.3
##$LEV0= 0
##$LPBIN= 0
##$MAXI= 10000
##$MC2= 0
##$MEAN= 0
##$ME_mod= 0
##$MI= 0
##$NCOEF= 0
##$NC_proc= -2
##$NLEV= 6
##$NOISF1= 0
##$NOISF2= 0
##$NSP= 0
##$NTH_PI= 0
##$NZP= 0
##$OFFSET= 14.96085
##$PC= 1
##$PHC0= -78.84338
##$PHC1= 0
##$PH_mod= 1
##$PKNL= yes
##$PPARMOD= 0
##$PPDIAG= 0
##$PPIPTYP= 0
##$PPMPNUM= 2147483647
##$PPRESOL= 1
##$PSCAL= 4
##$PSIGN= 0
##$PYNMP= <proc.py>
##$REVERSE= no
##$SF= 400.020009698495
##$SI= 131072
##$SIGF1= 0
##$SIGF2= 0
##$SINO= 400
##$SIOLD= 131072
##$SPECTYP= <>
##$SREGLST= <1H.CDCl3>
##$SSB= 0
##$STSI= 131072
##$STSR= 0
##$SW_p= 8223.68421052631
##$SYMM= 0
##$S_DEV= 0
##$TDeff= 65536
##$TDoff= 0
##$TI= <>
##$TILT= no
##$TM1= 0
##$TM2= 0
##$TOPLEV= 0
##$USERP1= <user>
##$USERP2= <user>
##$USERP3= <user>
##$USERP4= <user>
##$USERP5= <user>
##$WDW= 1
##$XDIM= 131072
##$YMAX_p= 399624040
##$YMIN_p= -11972
##$CURPLOT= <Network HP LaserJet P1505>
##$CURPRIN= <$Network HP LaserJet P1505>
##$DFORMAT= <normdp>
##$LAYOUT= <+/1D_H.xwp>
##$LFORMAT= <normlp>
##$PFORMAT= <normpl>
##$SURQMSG= 1
$$ End of Bruker specific parameters
$$ ---------------------------------
##NTUPLES= NMR SPECTRUM
##VAR_NAME=  FREQUENCY,     SPECTRUM/REAL,   SPECTRUM/IMAG
##SYMBOL=    X,             R,               I
##VAR_TYPE=  INDEPENDENT,   DEPENDENT,       DEPENDENT
##VAR_FORM=  AFFN,          ASDF,            ASDF
##VAR_DIM=   131072,        131072,          131072
##UNITS=     HZ,            ARBITRARY UNITS, ARBITRARY UNITS
##FACTOR=    0.0627417313425164, 1,          1
##FIRST=     8223.62146879497, -1303,        -53229
##LAST=      0,             182,             -52867
##MIN=       0,             -11972,          0
##MAX=       8223.62146879497, 399624040,    0
$$ Real data points
##PAGE= N=1
##DATA TABLE= (X++(R..R)), XYDATA
$$ [...]
63894E31098j9826j7348j5433j3199j0529q208o689n556m288k918j780j071p21
63881D23532l56M48J632K666L429M516O205P686Q157Q178R060J1092J3413J5450
63867E15108J7419J9382K0948K2245K4210K7320L0742L3363L5190L7097L9485
63856H22509M1743M3025M3213M3024M3267M3929M4079M2799M0108L6762L3260
63845A277718K9411K4871J9653J4005Q139K234l538r132j4554j9674k4311k8630
63833A276192l3050l7569m1423m3711m4378m4369m4685m5338m5333m3801m1036
63822H11499l8180l5974l4140l2031k9447k6667k4044k1903k0469j9594j8847
63811E10203j8106j7691j7619j7251j6156j4844j3969j3288j2157j0803j0138
$$ y = [531098, 511272, 493924, 478491, 465292, 454763, 446555, 439866, 434310, 430022, 427104, 425324, 424253, 423532, 423176, 423624, 425256, 427922, 431351, 435867, 442072, 449758, 457915, 466093, 475153, 486245, 499658, 515108, 532527, 551909, 572857, 595102, 619312, 646632, 677374, 710737, 745927, 783024, 822509, 864252, 907277, 950490, 993514, 1036781, 1080710, 1124789, 1167588, 1207696, 1244458, 1277718, 1307129, 1332000, 1351653, 1365658, 1373797, 1376031, 1372493, 1363361, 1348807, 1329133, 1304822, 1276192, 1243142, 1205573, 1164150, 1120439, 1076061, 1031692, 987007, 941669, 896336, 852535, 811499, 773319, 737345, 703205, 671174, 641727, 615060, 591016, 569113, 548644, 529050, 510203, 492097, 474406, 456787, 439536, 423380, 408536, 394567, 381279, 369122, 358319, 348181]
63800C48181j0313j0302r154p058m963l680l486m098m821n073m885m586m156l316
63786B68290k242j509j381j596j895k253k525k526k444k600k772k429j698j287
63772B39133j330j159n62l36j086k159k478j875j031n15m54p26q99m21N58R53
63756B25613J7j482k091j425l67K91N35N06N2p03j081n99L83J136J414J459J428
63739B25086J277J130J301J770K028J741J348J568K320K713K267J678J903K865
63725B50995L733M197M738N620O411O764O956P239P287O780O044N520M978L869
63711C31131K229O49n72j699l020m436n606o140n736m498l154k575k945l637l852
63696B86139l250k002n82N16J081J276J389J556J766J931J791J144M12M94J584
$$ y = [348181, 337868, 327566, 318412, 311354, 306391, 302711, 299225, 295127, 290306, 285233, 280348, 275762, 271606, 268290, 266048, 264539, 263158, 261562, 259667, 257414, 254889, 252363, 249919, 247319, 244547, 242118, 240420, 239133, 237803, 236644, 236082, 235746, 234660, 232501, 230023, 228148, 227117, 226602, 226148, 225422, 224523, 224102, 224660, 225613, 225630, 224148, 222057, 220632, 220265, 220556, 221091, 221597, 221649, 220946, 219865, 219266, 219649, 220785, 222199, 223658, 225086, 226363, 227493, 228794, 230564, 232592, 234333, 235681, 237249, 239569, 242282, 244549, 246227, 248130, 250995, 254728, 258925, 263663, 269283, 275694, 282458, 289414, 296653, 303940, 310720, 316764, 322284, 327262, 331131, 333360, 334009, 333437, 331738, 328718, 324282, 318676, 312536, 306800, 302302, 299148, 296573, 293628, 289991, 286139, 282889, 280887, 280305, 280821, 281902, 283178, 284567, 286123, 287889, 289820, 291611, 292755, 293167, 293661, 295245]
63681B95245K509K011N01l30L11J438J885J844K153K759K884K414K182K797L931
63666C24534M943N503N405M481L162K455K684K743J398r43k675l139l313m150
63652C43088n278n851n849n755n591n124m602m348l962k872j477p86r33j044o47
63637B88969j52K59J122K574L803M200M305M856N619N945N830N642N301M638M214
63622C47125M800O253P696Q684R394R883J0061J0426J1751J3901J5791J6824J7708
63609D90297J9339K1530K3385K4536K5504K6953K8868L0410L0429K8215K3986
63598G73452J8569J2751P035J863k293n199o914p663p830q003q637r668j0756
63585G46707j1856j3217j4887j6534j7752j8209j7669j6314j4865j3807j2600
$$ y = [295245, 297754, 299765, 300266, 299936, 300247, 301685, 303570, 305414, 307567, 310326, 313210, 315624, 317806, 320603, 324534, 329477, 334980, 340385, 344866, 348028, 350483, 353167, 355910, 357308, 356365, 353690, 350551, 347238, 343088, 337810, 331959, 326110, 320355, 314764, 309640, 305038, 300690, 296728, 293856, 292379, 291593, 290660, 289616, 288969, 288817, 289076, 290198, 292772, 296575, 300775, 305080, 309936, 315555, 321500, 327330, 332972, 338273, 342911, 347125, 351925, 358178, 365874, 374558, 383952, 393835, 403896, 414322, 426073, 439974, 455765, 472589, 490297, 509636, 531166, 554551, 579087, 604591, 631544, 660412, 690822, 721251, 749466, 773452, 792021, 804772, 811807, 813670, 811377, 806178, 799264, 791601, 783771, 775768, 767131, 757463, 746707, 734851, 721634, 706747, 690213, 672461, 654252, 636583, 620269, 605404, 591597, 578997]
63574E78997j0363p329m800l473k654j450M6J342K512L907N328O282O746P035
63560E82126P183P129P288Q211R612J0498J0397R965J0221J1523J3512J5749J8241
63547G21655K1368K5415L0095L4790L9255M3509M6607M6041L9418K6989J1976
63536A087118j697j1679j7501j9692j9223j7213j4550j1720r194p561p088p523
63524I42477q640j0653j3760j7551k1273k4389k6567k7485k7150k6168k5137k3945
63512F89759k2183k0042j8113j6405j4375j2035j0225r476r240q735p988p515
63500E33427p371p180o812o461o139n613m848m108l655l577l858m261m340l901
63486D61303l336l053k794k003p81K64J052K192L818N052N090M323L839M163M971
$$ y = [578997, 568634, 561305, 556505, 553032, 550378, 548928, 548974, 550316, 552828, 556735, 562063, 568345, 575091, 582126, 589309, 596438, 603726, 611937, 621549, 632047, 642444, 652409, 662630, 674153, 687665, 703414, 721655, 743023, 768438, 798533, 833323, 872578, 916087, 962694, 1008735, 1048153, 1075142, 1087118, 1085421, 1073742, 1056241, 1036549, 1017326, 1000113, 985563, 973843, 964649, 957088, 950000, 942477, 933837, 923184, 909424, 891873, 870600, 846211, 819644, 792159, 765009, 738841, 713704, 689759, 667576, 647534, 629421, 613016, 598641, 586606, 576381, 566905, 557665, 548930, 540942, 533427, 526056, 518876, 512064, 505603, 499464, 493851, 489003, 484895, 481240, 477663, 473805, 469544, 465204, 461303, 457967, 454914, 452120, 450117, 449336, 449600, 450652, 452844, 456662, 461714, 466804, 471127, 474966, 479129, 484100]
63471D84100N675N710M559K222l05j796k184k662m154o170p531p825p611p445
63457D54583p259o748n903m933l924k881j952j334j005p86n97l87J84J595L802
63442D22455O081P833R254J0935J3028J5250J7605K0527K4277K8660L3414L8333
63430F47652M2637M4553M2122L4601K3182J0448q89r127j3870j5418j4056j0160
63418G81675m615J433P423J3417J9246K4153K7519K9397K9905K8624K5164J9968
63406A003309J3999P856J789l673p752j0102j1085j1356j1545j2195j3479j5062
63394I30704j6697j8818k1872k5197k7227k7138k5654k3998k2634k1321j9832
63383F80316j8063j5831j3179j0686q948p792o440m494k343n99N64J399K290L584
$$ y = [484100, 489775, 495485, 500044, 502266, 501961, 500165, 497981, 495319, 491165, 484995, 477464, 469639, 462028, 454583, 447324, 440576, 434673, 429740, 425816, 422935, 420983, 419649, 418644, 417858, 417261, 416874, 417058, 418653, 422455, 428536, 436369, 445623, 456558, 469586, 484836, 502441, 522968, 547245, 575905, 609319, 647652, 690289, 734842, 776964, 811565, 834747, 845195, 844306, 835179, 821309, 805891, 791835, 781675, 777060, 778493, 785916, 799333, 818579, 842732, 870251, 899648, 929553, 958177, 983341, 1003309, 1017308, 1025164, 1026953, 1023280, 1015528, 1005426, 994341, 982985, 971440, 959245, 945766, 930704, 914007, 895189, 873317, 848120, 820893, 793755, 768101, 744103, 721469, 700148, 680316, 662253, 646422, 633243, 622557, 613609, 605817, 599377, 594883, 592540, 591941, 592505, 593904, 596194, 599778]
63369E99778N411P445Q976R570R619J0040J1319J3026J4399J5219J5999J7347
63357G38148J9395K1854K4403K6860K9110L0975L2216L2503L1439K8695K4227
63346A039825J8432J2014N670j56n163q926j1045j1646j1518j1449j1650j2149
63334I92239j3402j5893j9144k1884k3451k4445k5587k6500k6184k4307k1438
63323G50004j8141j4489j0428o048j411L490Q256J1685J1991P675j244j2520k2472
63310G06348k8146k9077k7022k4230k1935k0118j8174j5738j3131j1041r789r150
63298D78797q817q600q099o953n704n650p086q444q081o428n213m965m640l742
63284C86375l271m016n099n141m109l136k900l005k832k305j784j560j574j548
$$ y = [599778, 605189, 612634, 621610, 631180, 640799, 650839, 662158, 675184, 689583, 704802, 720801, 738148, 757543, 779397, 803800, 830660, 859770, 890745, 922961, 955464, 986903, 1015598, 1039825, 1058257, 1070271, 1075941, 1075785, 1070622, 1061696, 1050651, 1039005, 1027487, 1016038, 1004388, 992239, 978837, 962944, 943800, 921916, 898465, 874020, 848433, 821933, 795749, 771442, 750004, 731863, 717374, 706946, 700898, 699487, 702977, 711233, 722918, 734909, 742584, 741340, 728820, 706348, 678202, 649125, 622103, 597873, 575938, 555820, 537646, 521908, 508777, 497736, 487947, 478797, 469980, 461380, 453281, 446328, 440624, 434974, 427888, 419444, 411363, 404935, 399722, 394757, 390117, 386375, 383104, 379088, 373989, 368848, 364739, 361603, 358703, 355698, 352866, 350561, 348777, 347217, 345643, 344095]
63270C44095j405j497k141l034l523l468l325l330l164k638k115j925j822j476
63256C09232j050r03r99j037r03o83m56l52n59j000j286j254j228j401j439j024
63240B93658n34n81j113j495j401j114r26p08k65J94J97l80r97r06K5R98J089
63223B85741K71n51n72J20Q06R10M76N7K07P93R96L63l47J4J401K495K386J477
63205B97043N54k41r85j273o61O26J955K890L174K651J789J677K783M114M359
63190C20455L604L153L830N168O219O479O064N538N538O256P247Q040Q616Q966
63176D05173Q729P809O921O793P197P424P342P105O314M597K827K456L508M289
63162D88484L415J134j601m250o435p645p892p996q538r196r564r920j0456j0530
$$ y = [344095, 342690, 341193, 339052, 336018, 332495, 329027, 325702, 322372, 319208, 316570, 314455, 312530, 310708, 309232, 308182, 307279, 306280, 305243, 304340, 303657, 303201, 302849, 302290, 301290, 300004, 298750, 297522, 296121, 294682, 293658, 293124, 292543, 291430, 289935, 288534, 287420, 286494, 285786, 285521, 285715, 285912, 285532, 284535, 283629, 283654, 284652, 285741, 286012, 285461, 284889, 285009, 285815, 286725, 287201, 287258, 287465, 288258, 289254, 289617, 289270, 289284, 290685, 293180, 295566, 297043, 297597, 297356, 296371, 295098, 294437, 295063, 297018, 299908, 303082, 305733, 307522, 309199, 311982, 316096, 320455, 324059, 327212, 331042, 336210, 342429, 348908, 354972, 360510, 366048, 372304, 379551, 387591, 396207, 405173, 413902, 421711, 428632, 435425, 442622, 450046, 457388, 464493, 470807, 475404, 478231, 480687, 484195, 488484, 491899, 493033, 491432, 487182, 480747, 473102, 465210, 457214, 448676, 439480, 429916, 419996, 409540, 399010]
63148C99010r590q314p849q117p918o683n199m414m297m200l809l294k877k619
63134C19830k476k345k107j757j375r19k01P29J444J555J277J270J890K710K996
63119C22521K577K103K349L431M656N114M454L221K473K840L943M862N200N371
63105C75115N820O367O615O641O928P711Q781R754J0336J0459J0428J0724J1416
63092D87095J1927J1679J0704R375P821O139M707L669K373P2k847n141o243o793
63078E34537p527q420r120r615j0059j0435j0736j1004j1000j0311r018p760o920
63065D12612o251n509m851m309l561k614k036k016j836r41J12N54P17J473K708
63050C84252L394L116K537K231K058J947K403L644M919N361N180N317O055O598
$$ y = [399010, 389420, 381106, 373257, 365140, 357222, 350539, 345340, 340926, 336629, 332429, 328620, 325326, 322449, 319830, 317354, 315009, 312902, 311145, 309770, 308851, 308650, 309379, 310823, 312378, 313655, 314925, 316815, 319525, 322521, 325098, 327201, 329550, 332981, 337637, 342751, 347205, 350426, 352899, 355739, 359682, 364544, 369744, 375115, 380935, 387302, 393917, 400558, 407486, 415197, 423978, 433732, 444068, 454527, 464955, 475679, 487095, 499022, 510701, 521405, 530780, 538601, 544740, 549447, 553116, 555489, 555561, 552714, 547573, 541330, 534537, 527010, 518590, 509470, 499855, 489796, 479361, 468625, 457621, 446621, 436310, 427292, 419532, 412612, 406361, 400852, 396001, 391692, 388131, 385517, 383481, 381465, 379629, 378688, 378800, 379354, 380071, 381544, 384252, 387646, 390762, 393299, 395530, 397588, 399535, 401938, 405582, 410501, 415862, 421042, 426359, 432414, 439012]
63036D39012O172N048M197M155M535M625M145L385K786K584K727K885K629J857
63022D90742J009O07N74L26m38j392k085k360k215j624p49P0P96J755K971L919
63006D91906M302M635N539O868Q083R184J0508J1846J2528J2450J2268J2403J2534
62993F15054J2277J1812J1513J1391J1275J1160J1064J0795J0158R265Q413P760
62981G41937P132O082M128J311j561l685n365p808j1503j5334j7739j8430j8401
62968F60764j8494j8614j8305j7476j6286j4821j3201j1795j0951j0566j0121
62957E00134r134p541n733m344l854m243m948n307n114m758m777n340o112o650
62943D22279o847o915o953o696n833m599l693l523l661l344k423j544j331j725
$$ y = [439012, 445184, 450232, 454429, 458584, 463119, 467744, 471889, 475274, 478060, 480644, 483371, 486256, 488885, 490742, 491751, 492358, 492932, 493258, 492820, 491428, 489343, 486983, 484768, 483144, 482395, 482465, 483261, 485016, 487987, 491906, 496208, 500843, 506382, 513250, 521333, 530517, 541025, 552871, 565399, 577849, 590117, 602520, 615054, 627331, 639143, 650656, 662047, 673322, 684482, 695546, 706341, 716499, 725764, 734177, 741937, 749069, 755151, 759279, 760590, 759029, 755344, 749979, 742171, 730668, 715334, 697595, 679165, 660764, 642270, 623656, 605351, 587875, 571589, 556768, 543567, 531772, 520821, 510255, 500134, 491000, 483459, 477726, 473382, 469528, 465285, 460337, 455030, 449916, 445158, 440381, 435041, 428929, 422279, 415432, 408517, 401564, 394868, 389035, 384436, 380743, 377220, 373559, 370215, 367792, 366248, 364917, 363192]
62929C63192k237k557k656k444j838j058n69n65q36j184j642k119k158j455m23
62914C39451J47J0k99j96K73O37P17Q45J404K327L141L505L565L779M362N071
62898C68739N510N644N813O296O999P648Q189Q794R427R690R212Q093O648M939
62884D71641K879Q45m74j086k013l977o167p080o452n540n373n615n505n132n113
62869D15838n539n944o012n711m966l901l192l466m354m795m325l446k715k161
62855C55311j787j853k268k309j522m74l5k15k77J25N65N76K66rj11r7M3L40O88
62836C46957Q81Q84R04J193J714K097J982J444R23P30P41P47Q49J280J913K235
62820C67474J883J041K31j66k16l54r66j909k522k322j583r87q08q14r12j340
$$ y = [363192, 360955, 358398, 355742, 353298, 351460, 350402, 349833, 349268, 348432, 347248, 345606, 343487, 341329, 339874, 339451, 339598, 339608, 339309, 339113, 339386, 340023, 340740, 341585, 342989, 345316, 348457, 351962, 355527, 359306, 363668, 368739, 374249, 379893, 385706, 392002, 399001, 406649, 414838, 423632, 433059, 442749, 451961, 460054, 466702, 471641, 474520, 475365, 474891, 473805, 471792, 467815, 461648, 454568, 448116, 442576, 437203, 431588, 426083, 420951, 415838, 410299, 404355, 398343, 392632, 387666, 383765, 380573, 377107, 372753, 367958, 363633, 360187, 357472, 355311, 353524, 351671, 349403, 347094, 345572, 345098, 345063, 344848, 344571, 344696, 345261, 345837, 346103, 346094, 345983, 345886, 345929, 346269, 346957, 347838, 348722, 349626, 350819, 352533, 354630, 356612, 358056, 358979, 359709, 360450, 361197, 362046, 363326, 365239, 367474, 369357, 370398, 370629, 370463, 370247, 369893, 368927, 367018, 364496, 362174, 360591, 359604, 358796, 357982, 357070, 355730]
62804C55730k032k367k043j714k113k778k463q80O98R55jj078j639j854j947j859
62788C32615j633j539j606j505j088o30l31J00R73K033K736K935K997L285L814
62773C43156M378M706M507L675K560J743J430J286R94P17P10P13J69q99j660j383
62757C66802m07J57l23j338j900j645j131j164k026l276m174m268l764l292l258
62742C34993l444l273k470j354n70o17j477k524k889k238j165n51n39m15L82J505
62726C13354K147K012J548J366J645K014J941J277M88K27O87J503K359L283M245
62711C40096M920N143N298N784O387O651O746P375Q825J0629J2283J3757J5135
62698D49029J6270J7074J7805J8676J9527K0232K1130K2587K4273K5374K5404
$$ y = [355730, 353698, 351331, 349288, 347574, 345461, 342683, 340220, 339340, 340038, 340993, 340992, 339914, 338275, 336421, 334474, 332615, 330982, 329443, 327837, 326332, 325244, 324614, 324283, 324383, 325356, 327389, 330125, 333060, 336057, 339342, 343156, 347534, 352240, 356747, 360422, 362982, 364725, 366155, 367441, 368435, 369152, 369862, 370575, 370744, 369845, 368185, 366802, 366395, 366552, 366229, 364891, 362991, 361346, 360215, 359051, 357025, 353749, 349575, 345307, 341543, 338251, 334993, 331549, 328276, 325806, 324452, 323882, 323265, 321788, 319264, 316375, 314137, 312972, 312421, 311882, 311467, 311849, 313354, 315501, 317513, 319061, 320427, 322072, 324086, 326027, 327304, 327792, 328019, 328706, 330209, 332568, 335851, 340096, 345016, 350159, 355457, 361241, 367628, 374279, 381025, 388400, 397225, 407854, 420137, 433894, 449029, 465299, 482373, 500178, 518854, 538381, 558613, 579743, 602330, 626603, 651977, 677381]
62687F77381K4409K2432J9373J5518J1617Q063M352j42n079r392j2546j5043j7497
62674G23446j9747k1334k2433k3647k4911k5301k4209k2183k0194j8455j6604
62663D84428j4765j3627j3290j2802j1322r297p909p606p716p445o598n383m045
62650C62623k990k697l098l407k943j931j121q16p52p60r98j394j424p19L66J125
62634C39064J291J173J167J349J571J716J732J504Q65j93j299j915j895j661j652
62619C42817j739j532j086q63r84j052q47o67o79n54j66o5o18j129o64M69R99
62602C31640N17L3M33J217J354P48R4k75o08r34q28j36O34R36Q46Q43J129J511
62584C39154J805K023K093J698O36p59j792k074j774j271q00n76q51j529j940
$$ y = [677381, 701790, 724222, 743595, 759113, 770730, 778793, 783145, 783003, 777924, 768532, 755986, 740943, 723446, 703699, 682365, 659932, 636285, 611374, 586073, 561864, 539681, 519487, 501032, 484428, 469663, 456036, 442746, 429944, 418622, 409325, 401416, 393810, 386094, 378649, 372051, 366668, 362623, 359633, 356936, 353838, 350431, 347488, 345557, 344436, 343620, 342868, 342108, 341110, 339716, 338292, 337573, 337939, 339064, 340355, 341528, 342695, 344044, 345615, 347331, 349063, 350567, 351432, 351239, 349940, 348025, 346130, 344469, 342817, 341078, 339546, 338460, 337597, 336613, 335561, 334714, 334047, 333368, 332814, 332648, 332583, 331965, 330836, 330172, 330641, 331640, 332157, 332190, 332623, 333840, 335194, 335942, 336036, 335761, 335153, 334219, 333391, 333255, 333889, 334825, 335671, 336514, 337643, 339154, 340959, 342982, 345075, 346773, 347409, 346650, 344858, 342784, 341010, 339739, 338939, 338363, 337512, 335983, 334043]
62569C34043j469m38J14l72j342j840j519p92k11qj56n48j042j429j492j192p85
62552C19522o38q89j370j911k472k883k729j771l46Q97J536J467Q39J45P7P88
62536C10262J616J944J991K131K000J130J57J93J048J382Q13N84J538K736K970
62521C32495K628K971M263N708O803P635Q139Q165Q153Q857J0349J2008J3472
62508D31646J4818J5904J6273J5874J5182J4468J3530J2188J0517Q463N818K760
62496E77441m7k105l468m456n300o142p014p678p771p200o196m979l663k339j048
62481E08035L80K139M197O308Q119R138R029Q222P740P961Q016O920M864K699
62467E93767O64j620m205o804r460j2289j4714j5895j5955j5823j5897j5788j5337
$$ y = [334043, 332574, 332136, 332250, 331878, 330536, 328696, 327177, 326385, 326174, 326166, 326010, 325462, 324420, 322991, 321499, 320307, 319522, 318884, 317995, 316625, 314714, 312242, 309359, 306630, 304859, 304513, 305410, 306946, 308413, 309252, 309397, 309474, 310262, 311878, 313822, 315813, 317944, 319944, 321074, 321231, 321424, 322472, 323854, 324667, 325251, 326789, 329525, 332495, 335123, 338094, 342357, 348065, 354868, 362503, 370642, 378807, 386960, 395817, 406166, 418174, 431646, 446464, 462368, 478641, 494515, 509697, 524165, 537695, 549883, 560400, 568863, 574681, 577441, 577394, 575289, 571821, 567365, 562065, 555923, 548909, 541231, 533460, 526260, 520064, 515085, 511422, 509083, 508035, 508415, 510554, 514751, 521059, 529178, 538316, 547345, 555567, 563307, 571268, 579284, 586204, 591068, 593767, 594431, 592811, 588606, 581802, 572342, 560053, 545339, 529444, 513489, 497666, 481769, 465981, 450644]
62454D50644j4882j4357j3213j1462r847q701p504n945m452l357k473j854j981
62441C50616k692k940k265j486j344j376q96j32M80J208K183K466J200q69k152
62426C42001k120j393m29P17J595J648J218J170J478J311N30MK46Q08J253J692
62410C51729J986J537L62n44n72m00p89j255q83O2M73J84L26J647L310L941L290
62393C64404K291J741J575J462J563K225L243L946M066M078M496N202N730O005
62379D12027O420P217Q155Q792Q924Q768Q797R391J0529J1889J3244J4593J5830
62366E44576J6624J6882J7130J8075J9950K2501K5512K8955L2752L6719M0756
62355H20432M4819M8721N2142N4824N6496N6718N5070N1517M6346L9757L1761
$$ y = [450644, 435762, 421405, 408192, 396730, 386883, 378182, 370678, 364733, 360281, 356924, 354451, 352597, 350616, 347924, 344984, 342719, 341233, 339889, 338513, 337617, 337485, 337965, 339173, 341356, 343822, 345022, 344153, 342001, 339881, 338488, 338059, 338776, 340371, 342019, 343237, 344407, 345885, 347196, 347726, 347730, 347976, 348784, 350037, 351729, 353715, 355252, 355614, 355070, 354498, 354098, 353309, 352054, 351171, 351233, 351706, 351890, 352216, 353863, 357173, 361114, 364404, 366695, 368436, 370011, 371473, 373036, 375261, 378504, 382450, 386516, 390594, 395090, 400292, 406022, 412027, 418447, 425664, 433819, 442611, 451535, 460303, 469100, 478491, 489020, 500909, 514153, 528746, 544576, 561200, 578082, 595212, 613287, 633237, 655738, 681250, 710205, 742957, 779676, 820432, 865251, 913972, 966114, 1020938, 1077434, 1134152, 1189222, 1240739, 1287085, 1326842, 1358603]
62344A358603K2567J2867L573m711j1956j8490k4495k9769l4048l7462m0317m2490
62332A153872m3466m3110m1901m0171l7662l4277l0820k8245k6491k4717k2586
62321G80426k0619j9282j8403j7702j7274j7222j7277j7123j6854j6742j6714
62310E85214j6287j5040j3091j1123r866r445r261q684p650o425n050l493k184
62297D67615j788k329k993l034k469j696q36K01J277K056K499K956L749M759N520
62282D75487N657N212M581M180M193M486M725M612M231M046M375M963N412N888
62268E42048O866Q231R325J0116J1466J3843J6539J8905K1560K5380K9864L3758
62256G47901L6996M0704M5211M9438N2569N5044N7188N7942N5875N0866M3909
$$ y = [1358603, 1381170, 1394037, 1397610, 1392899, 1380943, 1362453, 1337958, 1308189, 1274141, 1236679, 1196362, 1153872, 1110406, 1067296, 1025395, 985224, 947562, 913285, 882465, 854220, 827729, 803012, 780426, 759807, 740525, 722122, 704420, 687146, 669924, 652647, 635524, 618670, 601928, 585214, 568927, 553887, 540796, 529673, 519807, 510362, 501101, 492417, 484767, 478342, 473292, 469799, 467615, 465827, 463498, 460505, 457471, 455002, 453306, 452470, 452671, 453948, 456004, 458503, 461459, 465208, 469967, 475487, 481144, 486356, 490937, 495117, 499310, 503796, 508521, 513133, 517364, 521410, 525785, 530748, 536160, 542048, 548914, 557145, 566470, 576586, 588052, 601895, 618434, 637339, 658899, 684279, 714143, 747901, 784897, 825601, 870812, 920250, 972819, 1027863, 1085051, 1142993, 1198868, 1249734, 1293643]
62245A293643L5684K6166J5448M307o142j4995k1974k7600l2749l7792m2351m6055
62233A145590m9031n1341n2408n1596m9050m5514m1543l7396l3433l0108k7511
62222F76659k5319k3079k0436j7359j4437j2572j1989j1884j1398j0559r740q743
62210D99144p262n823n339n765o152o021n740n424m495k787j193n69o41o13k87
62195D41033J08P20J875L346M576N526O693Q259R891J1326J2531J3242J3055J2250
62181E44431J1837J2452J3602J4409J4574J4217J3217J1400R258P807P627Q437
62169F83268R699J1270J3357J6181J9800K4014K8334L2261L5618L8382M0222M0544
62157I92950L9008L5675L0581K3763J5820P969J025n269j1451j7318k2224k6153
$$ y = [1293643, 1329327, 1355493, 1370941, 1375248, 1369106, 1354111, 1332137, 1304537, 1271788, 1233996, 1191645, 1145590, 1096559, 1045218, 992810, 941214, 892164, 846650, 805107, 767711, 734278, 704170, 676659, 651340, 628261, 607825, 590466, 576029, 563457, 551468, 539584, 528186, 517627, 507887, 499144, 491882, 486059, 480720, 474955, 468803, 462782, 457042, 451618, 447123, 444336, 443143, 442574, 441933, 441320, 441033, 441141, 441861, 443736, 447082, 451658, 457184, 463877, 472136, 482027, 493353, 505884, 519126, 532181, 544431, 556268, 568720, 582322, 596731, 611305, 625522, 638739, 650139, 659397, 667204, 674831, 683268, 692967, 704237, 717594, 733775, 753575, 777589, 805923, 838184, 873802, 912184, 952406, 992950, 1031958, 1067633, 1098214, 1121977, 1137797, 1145766, 1146791, 1141522, 1130071, 1112753, 1090529, 1064376]
62145A064376k9717l3111l5785l7280l7863l7957l7449l5905l3253k9973k6723
62134F89360k3938k1567j9156j6394j3649j1625j0358q987o814m131j659M68K564
62121E54114M591O248P854J0281J3713J7154J9616K1322K3094K4826K5256K3251
62109G51320J8862J3112P273K422q26k571l386l727l924m801p550j2376j7685
62096G36143k1351k2647k2335k1159j9138j6324j3274j0364p354m122j183J128
62084E78020L387O357R805J2808J4987J6859J9004K1450K3850K5802K7037K7729
62072G87095K8516K9767L0964L1289L0731L0091K9927L0113L0373L0573L0406
62061A119845K9477K8011K6817K6120K4981K2283J7951J2730P185J497l998q701
$$ y = [1064376, 1034659, 1001548, 965763, 928483, 890620, 852663, 815214, 779309, 746056, 716083, 689360, 665422, 643855, 624699, 608305, 594656, 583031, 572673, 563686, 556872, 552741, 551082, 551550, 554114, 558705, 564953, 572807, 583088, 596801, 613955, 633571, 654893, 677987, 702813, 728069, 751320, 770182, 783294, 790567, 792989, 792163, 789592, 786206, 782479, 778555, 773754, 766204, 753828, 736143, 714792, 692145, 669810, 648651, 629513, 613189, 599915, 589551, 582197, 578075, 576892, 578020, 581407, 587764, 597569, 610377, 625364, 642223, 661227, 682677, 706527, 732329, 759366, 787095, 815611, 845378, 876342, 907631, 938362, 968453, 998380, 1028493, 1058866, 1089439, 1119845, 1149322, 1177333, 1204150, 1230270, 1255251, 1277534, 1295485, 1308215, 1315400, 1316897, 1312899, 1304198]
62049A304198j2341j5273j8093k1202k4749k8703l2721l6082l8027l8325l7549
62038A001133l6650l6167l5830l4932l3017l0242k7281k4872k3219k1698j9475
62027F77750j6538j3794j1862j0247q247o235n281n620o320o576o555o746p172
62014E66557p594p945q150p979p456p034o951o720n655l700j377Q05K637M079
62000E03517N267O472P819R067R819R851R159P949O621N450M239K604O36j144
61986E87326k566l999n494o480o706o896p831r196r981r785q995p950o617n113
61972D89717l870l125k669k230j809j528j424j427j366j047m85L0L70Q90J921
61957D71948L133L811L757L521L689M265M897N371N797O459P594R175J0937J2696
$$ y = [1304198, 1291857, 1276584, 1258491, 1237289, 1212540, 1183837, 1151116, 1115034, 1077007, 1038682, 1001133, 964483, 928316, 892486, 857554, 824537, 794295, 767014, 742142, 718923, 697225, 677750, 661212, 647418, 635556, 625309, 617062, 610827, 605546, 599926, 593606, 587030, 580475, 573729, 566557, 558963, 551018, 542868, 534889, 527433, 520399, 513448, 506728, 501073, 497373, 495996, 496801, 499438, 503517, 508784, 515256, 523075, 532142, 541961, 551812, 560971, 568920, 575541, 580991, 585230, 587834, 588470, 587326, 584760, 580761, 575267, 568787, 562081, 555185, 547354, 538158, 528177, 518392, 509397, 501447, 494830, 489717, 485847, 482722, 480053, 477823, 476014, 474486, 473062, 471635, 470269, 469222, 468737, 468767, 469137, 470027, 471948, 475081, 478892, 482649, 486170, 489859, 494124, 499021, 504392, 510189, 516648, 524242, 533417, 544354, 557050]
61943E57050J4574J6772J9257K1898K4713K7755L0837L3665L6131L8237L9784
61932H60673M0471M0211L9134L7317L4848L2038K9244K6489K3525K0234J6619
61921A200803J2434P279J206n071j0728j5335j8729k0637k0724j8980j5850j1970
61909A083698p737l136K058P807J3571J8548K2156K4258K4989K4469K2602J9183
61897A252466J4206Q056J292n682j2557j8846k4033k8019l1049l3219l4441l4971
61885A053203l5353l5560l4793l2530k9403k6553k4520k3135k2144k1361k0520
61874G47331j9551j8699j7884j6375j3772j0919q978p836o361m096j713K71K170
61861F23588M230O092P661R581J2330J5497J8671K2324K7052L2365L7147M1096
$$ y = [557050, 571624, 588396, 607653, 629551, 654264, 682019, 712856, 746521, 782652, 820889, 860673, 901144, 941355, 980489, 1017806, 1052654, 1084692, 1113936, 1140425, 1163950, 1184184, 1200803, 1213237, 1220516, 1221722, 1216651, 1205923, 1190588, 1171859, 1151222, 1130498, 1111518, 1095668, 1083698, 1075961, 1072825, 1074883, 1082690, 1096261, 1114809, 1136965, 1161223, 1186212, 1210681, 1233283, 1252466, 1266672, 1274728, 1276020, 1270338, 1257781, 1238935, 1214902, 1186883, 1155834, 1122615, 1088174, 1053203, 1017850, 982290, 947497, 914967, 885564, 859011, 834491, 811356, 789212, 767851, 747331, 727780, 709081, 691197, 674822, 661050, 650131, 641153, 633317, 626956, 622860, 621147, 621418, 623588, 627818, 633910, 641571, 651152, 663482, 678979, 697650, 719974, 747026, 779391, 816538, 857634]
61849H57634M4891M9019N3170N6872N9982O2301O3183O2000N8792N4188M8688
61838A470720M2260L4603K5674J5878N810m014j3068k0609k5854k8429k8482k6293
61826A448196k2017j5907q624j046O151J2593J7927K1669K3310K2490J9030J2967
61814A536739M681m961j4822k4133l2898m1431m9362n5471n8811n9695n9196n7856
61802A082784n5431n1782m7434m3069l8979l5209l1776k8547k5298k2136j9497
61791F83626j7465j5522j3355j1468j0504j0290j0179j0093j0492j1276j1495
61780E51487j0512q904p796p511p357o593n245l914l046k583k249k008k077k444
61766D79248k636k198j436j241j960k789k663j576n12j83l17l22p6K54O68J118
$$ y = [857634, 902525, 951544, 1004714, 1061586, 1121568, 1183869, 1247052, 1309052, 1367844, 1422032, 1470720, 1512980, 1547583, 1573257, 1589135, 1594945, 1590931, 1577863, 1557254, 1531400, 1502971, 1474489, 1448196, 1426179, 1410272, 1401648, 1400602, 1406753, 1419346, 1437273, 1458942, 1482252, 1504742, 1523772, 1536739, 1541420, 1536459, 1521637, 1497504, 1464606, 1423175, 1373813, 1318342, 1259531, 1199836, 1140640, 1082784, 1027353, 975571, 928137, 885068, 846089, 810880, 779104, 750557, 725259, 703123, 683626, 666161, 650639, 637284, 625816, 615312, 605022, 594843, 584750, 574258, 562982, 551487, 540975, 532071, 524275, 516764, 509407, 502814, 497569, 493655, 490609, 488026, 485777, 483769, 481692, 479248, 476612, 474414, 472978, 471737, 469777, 466988, 464325, 462749, 462237, 462054, 461737, 461415, 461339, 461593, 462261, 463379]
61750D63379J160M72l91l68Q48K410L262L110K364J629J426J899K523K470J648
61735D87841R99J338K238K599K125J693K182L432M466M477L456K084J134R75J468
61720E22507K241K977L470L734L995M415M807M975N218O018P115P571O977N977
61706E91997N176M246K711R82j83q30j502k103k001j152k28L74P83Q82K56r00
61690E98508j716j812j759k045k330k181j847j711j582j149o76o16q57r67r07
61675E76353r62j106j020o90m89o26q57q75o65m53m44o40p55m34L76J317J993
61658E70023K315K424K436K421K464K616K857L180L605L991M130M091M245M786
61644F15584N432N864O255P007Q092Q906Q886Q059O908N825M782L463J662m78
$$ y = [463379, 464539, 465011, 464620, 464252, 465100, 467510, 470772, 473882, 476246, 477875, 479301, 481200, 483723, 486193, 487841, 488840, 490178, 492416, 495015, 497140, 498833, 501015, 504447, 508913, 513390, 516846, 518930, 520064, 521039, 522507, 524748, 527725, 531195, 534929, 538924, 543339, 548146, 553121, 558339, 564357, 571472, 579043, 586020, 591997, 597173, 601419, 604130, 605112, 604929, 604099, 602597, 600494, 598493, 597341, 597113, 597487, 598270, 599152, 599408, 598508, 596792, 594980, 593221, 591176, 588846, 586665, 584818, 583107, 581525, 580376, 579700, 579084, 578227, 577260, 576353, 575391, 574285, 573265, 572575, 572086, 571460, 570603, 569728, 569063, 568610, 568166, 567526, 566771, 566337, 566713, 568030, 570023, 572338, 574762, 577198, 579619, 582083, 584699, 587556, 590736, 594341, 598332, 602462, 606553, 610798, 615584, 621016, 626880, 633135, 640142, 648234, 657140, 666026, 674085, 680993, 686818, 691600, 695063, 696725, 696247]
61630F96247k544m133n119n746o390p131p618p565p196o881o424n276l521j968
61616F18735j067m11K85N44O6m09k01Mr43k802m207m672m962n513n752n364m937
61599E78394m834m490l465k222j245k83P56J047j12k133l796m557m506l692k375
61584E42487j436j568k301k669k533k492k839l418m197n130n628n119m058l532
61570D95567l802m085l807l329l191l343l399l125k451j435l89K70M65M71M96
61555D64913N54P07J021J269J119O65M22P80J615K412K535J665K81n25k30L36
61539D79539K0j014j403l92J174J924J482O06K07N47J126J111N1j681l252m179
61523D75866m603m880n160n422n589n637n660n804n934n632m803m046l941m175
$$ y = [696247, 693703, 689570, 684451, 678705, 672315, 665184, 657566, 650001, 642805, 635924, 629500, 624224, 620703, 618735, 617668, 617257, 617542, 618086, 618152, 617743, 617542, 617546, 616603, 613801, 609594, 604922, 599960, 594447, 588695, 583331, 578394, 573560, 569070, 565605, 563383, 562138, 561855, 562611, 563658, 563546, 561413, 557617, 553060, 548554, 544862, 542487, 541051, 539483, 537182, 534513, 531980, 529488, 526649, 523231, 519034, 513904, 508276, 503157, 499099, 495567, 491765, 487680, 483873, 480544, 477353, 474010, 470611, 467486, 465035, 463600, 463211, 463481, 463946, 464417, 464913, 465467, 466174, 467195, 468464, 469583, 470248, 470670, 471450, 473065, 475477, 478012, 479677, 479958, 479433, 479203, 479539, 479559, 478545, 477142, 476750, 477924, 479848, 481330, 481936, 482143, 482690, 483816, 484927, 484978, 483297, 480045, 475866, 471263, 466383, 461223, 455801, 450212, 444575, 438915, 433111, 427177, 421545, 416742, 412696, 408755, 404580]
61509D04580l918k988k047j649j702j920k267k671k855k741k643k778k873k500
61495C69028j642p79n29j196k399l201k914j811p68k06J93P39J246J429J368J285
61479C59843J194J014P90N52J88l54q41r59o38j72n3n59j355j671j128k69J38
61462C55720J08K31N61M30m48j402j664j310q77n64k60m7p0j03K52Q79J187Q47
61444C53470K58Q6N52J329J985K421K787L121L223K964K589K532L003L824M602
61429C88746M899M442L426K558K404K714K709K061J253R31J234J903K684L427
61415D25391L996M258M109L512K706K201K249K368J867P78k06p81j395k382l361
61400D45310l835l847l620l085k289j795k024k509k484j983j636j578j375r97
$$ y = [404580, 400662, 397674, 395627, 393978, 392276, 390356, 388089, 385418, 382563, 379822, 377179, 374401, 371528, 369028, 367386, 366607, 366078, 364882, 362483, 359282, 356368, 354557, 353789, 353583, 353776, 354515, 355761, 357190, 358558, 359843, 361037, 362051, 362841, 363393, 363581, 363227, 362386, 361427, 360789, 360617, 360564, 360005, 358650, 356979, 355851, 355582, 355720, 355828, 356059, 356620, 357050, 356602, 355200, 353536, 352226, 351349, 350785, 350525, 350478, 350408, 350305, 350557, 351436, 352623, 353470, 353728, 353814, 354366, 355695, 357680, 360101, 362888, 366009, 369232, 372196, 374785, 377317, 380320, 384144, 388746, 393645, 398087, 401513, 404071, 406475, 409189, 411898, 413959, 415212, 416143, 417377, 419280, 421964, 425391, 429387, 433645, 437754, 441266, 443972, 446173, 448422, 450790, 452657, 453435, 453229, 452448, 451053, 448671, 445310, 441475, 437628, 434008, 430923, 428634, 426839, 424815, 422306, 419822, 417839, 416203, 414625, 413250, 412253]
61386D12253r65j377j619j385j250j620j851j140J63R30Q02N43Q08J341J549J272
61370D08454O91j4n77o25j19M91Q24J011J275J435J256J018J214J850K519L059
61354D23762L673M433N124N615N975O266O506O835P363P976Q667R809J1558J3208
61340E26770J3835J3490J2954J2441J1425R865Q544P864P275O310N266M268K647
61327F42954N2k647m468n660o943q058q199p516o993o956o770o024n078m317l716
61312E59661l301l252l371l085k221j296q77j008j321j304n83O90J863K565L245
61297E46405M379N524N828N241M406L472J954k62k566m350n366n394m404l120
61283E51747k579k828k866k085j078o90q58p84J58J860L548M407M534M995O377
$$ y = [412253, 411288, 409911, 408292, 406907, 405657, 404037, 402186, 401046, 401209, 402139, 402941, 403484, 404292, 405633, 407182, 408454, 409145, 409131, 408554, 407929, 407810, 408301, 409125, 410136, 411411, 412846, 414102, 415120, 416334, 418184, 420703, 423762, 427435, 431868, 436992, 442607, 448582, 454848, 461354, 468189, 475552, 483528, 492195, 502004, 513562, 526770, 540605, 554095, 567049, 579490, 590915, 600780, 609324, 617188, 624463, 630773, 636039, 640307, 642954, 643006, 640359, 635891, 630231, 623288, 615230, 607031, 599515, 592522, 585566, 578796, 572772, 567694, 563377, 559661, 556360, 553108, 549737, 546652, 544431, 543135, 542258, 541250, 539929, 538625, 538042, 538732, 540595, 543160, 546405, 550784, 556308, 562136, 567377, 571783, 575255, 577209, 576947, 574381, 570031, 564665, 559271, 554867, 551747, 549168, 546340, 543474, 541389, 540311, 539621, 538763, 537979, 538137, 539997, 543545, 547952, 552486, 557481, 563858]
61268E63858P701P644O629O492Q047J0085J1037J0587R364Q140P661Q267R268
61255F74780R630R693J1063J4270J7654J9326J9194J8246J6782J4468J1365P826
61243H44297L856m38m206o630q048r452j1109j2461j3129j3275j3079j2527j1632
61230G32167j0429q976p653p037p064o828n731m350l536l229k848k330j924j417
61216F58815m97L82M66r8l86o7J92j96r34j245o69O21J950K602K433J929J486
61199F66784J060P55J174K563M194N320O305P986J0313J2602J4776J7279J9900
61186G71011K1772K2735K3558K4618K5211K4618K3010K0927J8573J6166J4362
61175A006561J3657J3678J3570J2971J2144J1289J0057P916M946K048J51r23k428
$$ y = [563858, 571559, 579203, 585832, 592324, 600371, 610456, 621493, 632080, 641444, 649584, 657245, 665512, 674780, 684410, 694103, 705166, 719436, 737090, 756416, 775610, 793856, 810638, 825106, 836471, 844297, 848153, 847715, 843509, 836879, 828831, 819379, 808270, 795809, 782680, 769405, 756326, 743799, 732167, 721738, 712762, 705109, 698072, 691008, 684180, 678449, 674099, 670563, 667334, 664486, 662156, 660232, 658815, 658318, 658700, 659166, 659068, 658682, 658615, 658807, 658611, 657677, 656432, 655763, 656384, 658334, 660936, 663369, 665298, 666784, 667844, 668599, 669773, 672336, 676530, 681850, 688155, 696141, 706454, 719056, 733832, 751111, 771011, 792783, 815518, 839076, 863694, 888905, 913523, 936533, 957460, 976033, 992199, 1006561, 1020218, 1033896, 1047466, 1060437, 1072581, 1083870, 1093927, 1101843, 1106789, 1108837, 1108988, 1108065, 1105637]
61162A105637n200q586j1343j3307j5393j7945k0076k0888k0738k0659k0941k0923
61150I09638k0037j8509j6944j5512j3855j1657r126o826n124l919k958k213j905
61137G81053k235l182m474n727o634p092p107o627n606m122k326l63J504K912
61123G29974L824M758O179P873R398J0939J3099J5970J9058K2019K4697K6627
61111H94415K7465K7926K9166L1026L2104L1923L1771L2644L3672L3522L2342
61100A237976L1129K9973K8182K5650K2901K0044J6714J2816Q517L810j197n930
61088A430585j0081j4171j8598k2651k5416k7085k8365k9090k8725k7824k7585
61077A170994k7996k7721k6009k3622k1629k0234j8988j7407j5227j2683j0617
$$ y = [1105637, 1100437, 1091851, 1080508, 1067201, 1051808, 1033863, 1013787, 992899, 972161, 951502, 930561, 909638, 889601, 871092, 854148, 838636, 824781, 813124, 803998, 797172, 792048, 788129, 785171, 782958, 781053, 778818, 775636, 771162, 765435, 758801, 751709, 744602, 737975, 732369, 728247, 725921, 725558, 727062, 729974, 733798, 738556, 744735, 752608, 762006, 772945, 786044, 802014, 821072, 843091, 867788, 894415, 921880, 949806, 978972, 1009998, 1042102, 1074025, 1105796, 1138440, 1172112, 1205634, 1237976, 1269105, 1299078, 1327260, 1352910, 1375811, 1395855, 1412569, 1425385, 1433902, 1437712, 1436515, 1430585, 1420504, 1406333, 1387735, 1365084, 1339668, 1312583, 1284218, 1255128, 1226403, 1198579, 1170994, 1142998, 1115277, 1089268, 1065646, 1044017, 1023783, 1004795, 987388, 972161, 959478, 948861]
61066I48861r683r523r250q526p515o170m421k743j577m35J438L727N372O101
61052I05656O606P340Q215R354J1073J3085J4764J6232J8210K0762K3181K5088
61040A079566K6765K8475L0363L2844L6068L9258M1638M3773M6791N0512N3759
61029A509812N6329N9189O2770O6546P0318P4383P8282Q0913Q2187Q3205Q4705
61018B308639Q6734Q9914R5545J04129J15186J28422J43726J60353J77884J97791
61008C608323K22225K52201K89499L39394M07733M95523O00540P24409Q73527
60999G813374J053183J267538J526076J839410K201512K582809K945207L246787
60991B4475896L410914L305851K809653J941405R23865P6992l80744m38209k26974
$$ y = [948861, 939178, 929655, 920405, 911879, 904364, 898194, 893773, 891030, 889453, 889018, 890456, 894183, 899555, 905656, 912262, 919602, 927817, 937171, 948244, 961329, 976093, 992325, 1010535, 1031297, 1054478, 1079566, 1106331, 1134806, 1165169, 1198013, 1234081, 1273339, 1314977, 1358750, 1405541, 1456053, 1509812, 1566141, 1625330, 1688100, 1754646, 1824964, 1899347, 1977629, 2058542, 2140729, 2223934, 2308639, 2395373, 2485287, 2580832, 2684961, 2800147, 2928569, 3072295, 3232648, 3410532, 3608323, 3830548, 4082749, 4372248, 4711642, 5119375, 5614898, 6215438, 6939847, 7813374, 8866557, 10134095, 11660171, 13499581, 15701093, 18283902, 21229109, 24475896, 27886810, 31192661, 34002314, 35943719, 36867584, 36944576, 36563832, 36125623, 35898649]
60982C5898649J00548M05392N21243K70944m12910j386855k352762l039688l344436
60973B6660125l324698l099179k769637k405384k052376j735026j458221j218898
60965H596706j015571q46749p07270n91403m96646m21584l62633l15513k77717
60956C561620k47343k21508j97926j76380j57000j38775j21198j05517r2694q1799
60946B021480p2127o5125o2230o2136o2267o1884o1687o1197n8887n4692n0456
60935A348792m7605m5868m4398m2960m1620m0240l8605l6652l4486l2440l0865
60924I13053k9523k7602k4841k2112k0338j9327j8348j7378j6930j6885j6372
60913F83397j4783j2357r764p595o150n316m666l946l370l179l208l114k784k274
$$ y = [35898649, 35999197, 36404589, 36925832, 37196776, 36783866, 35397011, 33044249, 30004561, 26660125, 23335427, 20236248, 17466611, 15061227, 13008851, 11273825, 9815604, 8596706, 7581135, 6734386, 6027116, 5435713, 4939067, 4517483, 4154850, 3839337, 3561620, 3314277, 3092769, 2894843, 2718463, 2561463, 2422688, 2301490, 2195973, 2103279, 2021480, 1949353, 1884228, 1821998, 1759862, 1697595, 1635711, 1574024, 1512827, 1453940, 1399248, 1348792, 1301187, 1255319, 1210921, 1167961, 1126341, 1086101, 1047496, 1010844, 976358, 943918, 913053, 883530, 855928, 831087, 808975, 788637, 769310, 750962, 733584, 716654, 699769, 683397, 668614, 656257, 646493, 638898, 632748, 627432, 622766, 618820, 615450, 612271, 609063, 605949, 603165, 600891]
60899F00891j601q66k99j7M0j27n38q88q46p19j187k185k811k666k413k608k852
60882E78308k709k580k860k888j901m29L30K39J95M92L84n51j635k071j970j973
60866E58381k377l052l797m418m672m479m068l734l530l292k847k193j575j379
60852E12968j758k378k719k621k336k090j742j004J38J244J683J235M21N5K55
60837E01351K22p27k026k291q94J318L016L770M121M609N230N726N952N813N210
60822E40400M347L691L389K968K012Q32J0m47r12j296j200q76j084j826k271k271
60806E45466k862m580o338o963o933p419q368q904r097r745j0592j0387q914p481
60792D36883p031p022o665n978n106l724j932p49r31j890k464k157j225k01K39
$$ y = [600891, 599290, 598424, 598125, 598108, 598148, 598021, 597483, 596595, 595749, 595030, 593843, 591658, 588847, 586181, 583768, 581160, 578308, 575599, 573019, 570159, 567271, 565370, 564941, 565271, 565510, 565705, 566197, 566581, 566030, 564395, 562324, 560354, 558381, 556004, 552952, 549155, 544737, 540065, 535586, 531518, 527784, 524254, 520962, 518115, 515922, 514347, 512968, 511210, 508832, 506113, 503492, 501156, 499066, 497324, 496320, 496458, 497702, 499385, 500620, 501041, 501096, 501351, 501573, 500846, 498820, 496529, 495635, 496953, 499969, 503739, 507860, 512469, 517699, 523425, 529377, 535190, 540400, 544747, 548438, 551827, 554795, 556807, 557639, 557649, 557202, 556290, 554994, 553794, 552918, 551834, 550008, 547737, 545466, 542604, 538024, 531686, 524723, 517790, 510371, 502003, 493099, 484002, 474257, 463665, 453278, 444364, 436883, 429852, 422830, 416165, 410187, 405081, 401357, 399425, 398676, 397745, 395855, 393391, 391234, 390009, 389808, 390047]
60777C90047l05j245j460q76n80r71r47L43K085L126L625M223M573M117L646M448
60761D13849O276P615P866P851Q230Q742R158R646R937R316P844O601O290O455
60747E25676O462O340O108N221L502J900J504K088K373J589J46j202k271l277
60733E56159m216m801n049n536o749q280r130q914q332q131q146p797p196p026
60719D56856p468p923p817p181o333n440m555l666k711j767j226j366j827j871
60705C95705j195j68P34J354J786K243K944L873M732N429O329P632Q803R183Q945
60690D58329Q755Q667Q113O956N740M762L697K307Q91k33j103j741j996k058k481
60675D98605l424m349m763m778m672m400l899l373k905k190j025L03J383K075
$$ y = [390047, 389742, 388497, 387037, 386161, 385581, 384610, 383663, 384006, 386091, 389217, 392842, 397065, 401638, 405755, 409401, 413849, 420125, 427740, 435606, 443457, 451687, 460429, 469587, 479233, 489170, 498486, 506330, 512931, 519221, 525676, 532138, 538478, 544586, 549807, 553309, 555209, 556713, 558801, 561174, 562763, 562909, 561707, 559436, 556159, 551943, 547142, 542093, 536557, 529808, 521528, 512398, 503484, 495152, 487021, 478875, 471078, 463882, 456856, 449388, 441465, 433648, 426467, 420134, 414694, 410139, 406473, 403762, 401995, 400769, 399403, 397576, 395705, 394510, 394342, 395076, 396430, 398216, 400459, 403403, 407276, 412008, 417437, 423766, 431398, 440201, 449384, 458329, 467084, 475751, 483864, 490820, 496560, 501322, 505019, 507326, 508217, 507984, 506881, 505140, 503144, 501086, 498605, 495181, 490832, 486069, 481291, 476619, 472219, 468320, 464947, 462042, 459852, 458827, 459130, 460513, 462588]
60661D62588K395K481K907M360O660Q712R860J0748J2281J4370J6350J8182K0407
60648E92301K3179K6158K9171L2325L5427L7950L9621M0538M0630L9456L6599
60637I73355L1964K5739J8283R968R19q741j8143k5610l0069l2168l3327l3866
60625H78304l2939l0280k6971k4215k2010j9618j6715j3646j0908q787p314o202
60613F58699n055l862l134l327m285n358n948n922n787o392q095j0056j0863j0097
60599E70518q905q726r772j1051j1553j1023r846q594p642o928o149n278m623
60586D60428m231l669k715j867j660j826j661j078n89k99L42J617K922L458L233
60571D52405L084L790N373P184Q639R824J1309J3295J5238J6526J7202J7552J7329
$$ y = [462588, 464983, 467464, 470371, 474731, 481391, 490103, 499963, 510711, 522992, 537362, 553712, 571894, 592301, 615480, 641638, 670809, 703134, 738561, 776511, 816132, 856670, 897300, 936756, 973355, 1005319, 1031058, 1049341, 1059309, 1060228, 1051487, 1033344, 1007734, 977665, 945497, 912170, 878304, 845365, 815085, 788114, 763899, 741889, 722271, 705556, 691910, 681002, 672215, 664901, 658699, 653644, 649782, 646648, 643321, 639036, 633678, 627730, 621808, 616021, 609629, 601534, 591478, 580615, 570518, 561613, 552887, 543115, 532064, 520511, 509488, 499642, 491048, 483406, 476478, 470329, 465051, 460428, 456197, 452528, 449813, 447946, 446286, 444460, 442799, 441721, 441132, 440833, 441175, 442792, 445714, 449172, 452405, 455489, 459279, 464652, 471836, 480475, 490299, 501608, 514903, 530141, 546667, 563869, 581421, 598750]
60558E98750J6005J3596J0566P012K824j290m002m969n361o205o911o216l934
60545F09865q60K539O273R854J2390J3782J4915J6243J6924J5754J2549Q098L262
60532G41588j445n656q962j1062j1858j1470j0196q382o309m187k166k05J878
60519F61568L951N356N596N084M743M893N110N241N818P189Q816R928J0526J1202
60505G55021J2241J3348J4251J5187J6837J9960K4994L1694L9182M6450N2854
60494A042019N8096O1933O4031O3956O1071N4660M4396L0653J4339l406k1281
60483A470467l7847n1858o2575o9739p3381p3713p1140o6249n9965n3495m7763
60472H02742m2780l7914l2942k8419k4856k1972j9160j6295j3778j1934j0779
$$ y = [598750, 614755, 628351, 638917, 645929, 648753, 647463, 643461, 638492, 633131, 626926, 620015, 613799, 609865, 609005, 611544, 617817, 627671, 640061, 653843, 668758, 685001, 701925, 717679, 730228, 738326, 741588, 740143, 734487, 725525, 714463, 702605, 691135, 680939, 672557, 666248, 662061, 659895, 659690, 661568, 665519, 670875, 676471, 681555, 686298, 691191, 696301, 701542, 707360, 714549, 723365, 733293, 743819, 755021, 767262, 780610, 794861, 810048, 826885, 846845, 871839, 903533, 942715, 989165, 1042019, 1100115, 1162048, 1226079, 1290035, 1351106, 1405766, 1450162, 1480815, 1495154, 1491748, 1470467, 1432620, 1380762, 1318187, 1248448, 1175067, 1101354, 1030214, 963965, 904000, 850505, 802742, 759962, 722048, 689106, 660687, 635831, 613859, 594699, 578404, 564626, 552692, 541913]
60461E41913j0106r555q759p741o905o423n923n090m297m137m625n261n643n597
60447D51851m939l709k439j627j125n32pn0n67q87p17l64j1M63P65J97j242k457
60429D32603k520j750j131j070j346j740k062j847p73O73J544J517J125R30R28
60414D25081Q49O03K30k54p46j045j036q07m56nM66Q17J032J252J446J320P01
60397D29448j10n25k25N91J396J733J589J489K027L138L948L738K817K122J958
60382D55134J686Q53L4P0Q48J540J837K261L132L954M197M168M580N520O347O543
60366E02704O263O029O160O496O544N971N038M366M082L481J875l82k158k810
60352E53659k801l004l706m432m508l685k295r24J51J114K210L337M259N009N736
$$ y = [541913, 531807, 522252, 513493, 505752, 498847, 492424, 486501, 481411, 477114, 472977, 468352, 463091, 457448, 451851, 446912, 443203, 440764, 439137, 438012, 437480, 437473, 437423, 436856, 435969, 435252, 434888, 434877, 435340, 436105, 436302, 435060, 432603, 430083, 428333, 427202, 426132, 424786, 423046, 420984, 419137, 418364, 419037, 420581, 422098, 423223, 424153, 425081, 425930, 426533, 426763, 426509, 425763, 424718, 423682, 422875, 422419, 422414, 422880, 423697, 424729, 425981, 427427, 428747, 429448, 429338, 428813, 428588, 429179, 430575, 432308, 433897, 435386, 437413, 440551, 444499, 448237, 451054, 453176, 455134, 456820, 457673, 457707, 457777, 458625, 460165, 462002, 464263, 467395, 471349, 475546, 479714, 484294, 489814, 496161, 502704, 508967, 514996, 521156, 527652, 534196, 540167, 545205, 549571, 553653, 557134, 559009, 558627, 556469, 553659, 550858, 547854, 544148, 539716, 535208, 531523, 529228, 528304, 528455, 529569, 531779, 535116, 539375, 544384, 550120]
60337E50120O239O050N088L894L081K684K179J089m46j671j937j493j362k220
60323E71295l631m611m737m279l575k761j979j309n22N65J592K135K576L735N583
60308E60077P239Q457J0182J3027J6144J8578K0989K4952L0699L6448L9894L9546
60296H26232L4929K6707J6754P027k207j2098k2675l1552l6057l6077l3671l0415
60284G06897k6388k1707j7475j4502j2213r830p890p444q126q294p171n670m791
60271E55396m278l474k613k286k275j882j178q88j086r61o2J021J568J646J738
60256E40386J937J956J506M47j132k661l339k979k385k435l101l643l504k692
60242E18361j534m66J16J68O1Q8J22j5j06J65P35J371K139L153M082M404M150
$$ y = [550120, 556359, 562409, 567497, 571391, 574472, 577156, 579335, 580424, 579978, 578307, 576370, 574877, 573515, 571295, 567664, 563053, 558316, 554037, 550462, 547701, 545722, 544413, 543891, 544456, 546048, 548183, 550759, 554494, 560077, 567316, 575773, 585955, 598982, 615126, 633704, 654693, 679645, 710344, 746792, 786686, 826232, 861161, 887868, 904622, 911649, 909442, 897344, 874669, 843117, 807060, 770983, 737312, 706897, 680509, 658802, 641327, 626825, 614612, 604782, 596892, 589448, 581322, 573028, 565857, 560187, 555396, 551118, 547644, 545031, 542745, 540470, 538588, 537410, 536522, 535436, 534475, 534413, 535434, 537002, 538648, 540386, 542323, 544279, 545785, 546232, 545100, 542439, 539100, 536121, 533736, 531301, 528200, 524557, 521053, 518361, 516827, 516361, 516477, 516645, 516706, 516794, 516916, 516901, 516795, 516960, 517695, 519066, 521205, 524358, 528440, 532844, 536994]
60225E36994L845L733L506K864J868P07m67j368j692j500j164q25l22K72N79N60
60209E47590P05J278J821J854J639J748K134K229J813J279J004J009J262J845
60195E69210K537K677J778J66j233j655j060o6M97K23m66o89p8P21P29j70j086
60178E72035j184o83n06j103j882j938j118j80J21j28j88M06J317J814J545Q35
60162E69163K85K55O01Q61O52Q1l03LR18J896K504K750K792K586K060J463J247
60145E89814J536J979K249K563L431M931O466P390P806Q453R847J1686J3244J4104
60131F85499J4269J3655J1934Q975N145R70l289p437j0918j2957j3199j1994j0024
60118F70629p849n882m451l620l029k200j083j66L3m06q74r13p38r42j754k758
$$ y = [536994, 540839, 544572, 548078, 550942, 552810, 553517, 553050, 551682, 549990, 548490, 547326, 546501, 546179, 546451, 547030, 547590, 548295, 549573, 551394, 553248, 554887, 556635, 558769, 560998, 562811, 564090, 565094, 566103, 567365, 569210, 571747, 574424, 576202, 576368, 575135, 573480, 572420, 572354, 572851, 573074, 572608, 571919, 571841, 572562, 573291, 573121, 572035, 570851, 570168, 569662, 568559, 566677, 564739, 563621, 563441, 563562, 563434, 563246, 563652, 564969, 566783, 568328, 569163, 569448, 569703, 570304, 571165, 571817, 571898, 571595, 571598, 572516, 574412, 576916, 579666, 582458, 585044, 587104, 588567, 589814, 591350, 593329, 595578, 598141, 601572, 606503, 612969, 620359, 628165, 636618, 646465, 658151, 671395, 685499, 699768, 713423, 725357, 734332, 739477, 740447, 737158, 729721, 718803, 705846, 692647, 680653, 670629, 662780, 656898, 652447, 648827, 645798, 643598, 642515, 642349, 642382, 641976, 641102, 640189, 639451, 638509, 636755, 633997]
60102F33997l411l623l639l535l095k193j080j80L31O29J037J770K851M165N612
60087F29636P170Q838J0522J2014J3099J3665J3686J3088J1675R319O267L046
60075G52025n0l199o489r288j0750j0988j1152j1943j2594j1831r637p360o127
60062F40617n784n515m962m440m347m786n595o521p336p873p918p209n797m334
60048E58200l626l754l976l709l252l208l464l233k081m87P20J258J489J813K175
60033E34865K243J927J530J372J382J207O59r3p72j267j619j920k315l009m151
60018E30039n686p312q519q799q033o750n722n173m616l634k609k318k856l365
60004D54647k994j859p85k96j72N5N13J022J402J547J428J263J492K234K940K985
$$ y = [633997, 630586, 626963, 623324, 619789, 616694, 614501, 613421, 613241, 613572, 614201, 615238, 617008, 619859, 624024, 629636, 636806, 645644, 656166, 668180, 681279, 694944, 708630, 721718, 733393, 742712, 748979, 752025, 751975, 748776, 742287, 732999, 722249, 711261, 700109, 688166, 675572, 663741, 654104, 646744, 640617, 634833, 629318, 624356, 619916, 615569, 610783, 605188, 598667, 591331, 583458, 575540, 568331, 562534, 558200, 554574, 550820, 546844, 543135, 539883, 536675, 533211, 529978, 527897, 527410, 528130, 529388, 530877, 532690, 534865, 537108, 539035, 540565, 541937, 543319, 544526, 545185, 545092, 544320, 543053, 541434, 539514, 537199, 534190, 530039, 524353, 517041, 508522, 499723, 491690, 484940, 479218, 474045, 469429, 465795, 463186, 460868, 458012, 454647, 451653, 449794, 449009, 448713, 448541, 448596, 449109, 450131, 451533, 453080, 454508, 455771, 457263, 459497, 462437, 465422]
59988D65422K541K385K812L272L243K933K757K627K268J875J881K251K530K534
59974E01331K376J961R37o71k244l133l134k456j546r99j154j680j900j592j127
59959D84969p90m43J3K79Q6l39n51m27j97j08k30m12l55J29P99J174J074P75N75
59940D86021M23J38l06p79j096j112r56j101j846k656k553j275K71R54M90n44
59924D74073j376j537j090n82m52m21J84J345K197K173J775J784K207K467K270
59909D85017J801J365J219J512J991K093J660J166R61P94N51Q53K046L226L221
59894E09476K353K092L005M047M109L361K657K456K749L428M194M557M413M266
59880E57163M514M869M884M622M378M117L772L739M414N221M865K731l60k979
$$ y = [465422, 467963, 470348, 473160, 476432, 479675, 482608, 485365, 487992, 490260, 492135, 494016, 496267, 498797, 501331, 503707, 505668, 506605, 505934, 503690, 500557, 497423, 494967, 493421, 492422, 491268, 489588, 487688, 486096, 484969, 484179, 483736, 483749, 484028, 484114, 483775, 483224, 482797, 482600, 482492, 482262, 481850, 481495, 481624, 482423, 483597, 484671, 485446, 486021, 486444, 486582, 486276, 485497, 484401, 483289, 482333, 481232, 479386, 476730, 474177, 472902, 473173, 474127, 474617, 474073, 472697, 471160, 470070, 469488, 469036, 468615, 468799, 470144, 472341, 474514, 476289, 478073, 480280, 482747, 485017, 486818, 488183, 489402, 490914, 492905, 494998, 496658, 497824, 498785, 499579, 500130, 500983, 503029, 506255, 509476, 511829, 513921, 516926, 520973, 525082, 528443, 531100, 533556, 536305, 539733, 543927, 548484, 552897, 557163, 561677, 566546, 571430, 576052, 580430, 584547, 588319, 592058, 596472, 601693, 606558, 609289, 608929, 605950]
59866F05950m392m844m891m809m532l942l104k255j550q34J78J419K333K464K057
59851E79248J879K433L632N241P321R868J2367J4062J4689J4596J4102J3071J1167
59838G03676Q277M652R61j727k425j081J235L160L794K637n91n402j0103j2817
59824F94246j3150j2460j2193j2393j2159j1156j0124r919j0511j1131j1091j0236
59812E57723q812p248n967n142m536l828l088k611k308j741r59p01j384k306k509
59797E04583k060j803k020k187k026j913k106k335k448k651k794k266j096l35
59783D76543o91j449j540j098j035j515j833j586r88j28J039J901J445k57j686
59768D67122j564l42N38M18j58n31p35j083j411j080K65K061L145K841J609M78
$$ y = [605950, 601558, 596714, 591823, 587014, 582482, 578540, 575436, 573181, 571631, 570797, 570975, 572394, 574727, 577191, 579248, 581127, 583560, 587192, 592433, 599754, 609622, 621989, 636051, 650740, 665336, 679438, 692509, 703676, 711953, 716605, 717566, 715839, 713414, 712333, 713568, 716728, 720522, 723159, 722568, 717166, 707063, 694246, 681096, 668636, 656443, 644050, 631891, 620735, 610611, 600692, 590181, 579050, 567959, 557723, 548911, 541663, 535696, 530554, 526018, 522190, 519102, 516491, 514183, 512442, 511483, 510782, 509398, 507092, 504583, 502523, 500720, 498700, 496513, 494487, 492574, 490468, 488133, 485685, 483034, 480240, 477974, 476878, 476543, 475852, 474403, 472863, 471765, 470730, 469215, 467382, 465796, 464808, 464680, 465719, 467620, 469065, 468808, 467122, 465558, 465216, 465754, 466172, 466014, 465483, 464748, 463665, 462254, 461174, 461439, 463500, 466645, 469486, 471095, 471573]
59752D71573l5j15M7O48J703K607K671J992J314J125J204J198J161J309J458J197
59736D91057N88K26M82J031J357J358J211R91Q19J004J550J790J134o2r68j460
59720E02108j997k549k527j913j398j213q02pM50K23P1O04J238J213Q88R73J228
59703D96590R78M31L42P13R16Q60R57J147R93O52P38J202J402J210J095J049M90
59686E11765n80j351j410j214j061n95K97R98J068R70J253J666J626J087L96l56
59670E14559j328k515l610m211m036l210k382k142k249k002j324r42j282j810
59656D81516j734r57%O41Q17P90J056J817K589K776K545K600L072L299K818J912
59640E05557J007J48o92j359j870k484l183l487l025j861k68J337K307K214J506
$$ y = [471573, 471538, 471423, 471470, 472118, 473821, 476428, 479099, 481091, 482405, 483530, 484734, 485932, 487093, 488402, 489860, 491057, 491645, 491871, 492353, 493384, 494741, 496099, 497310, 498301, 499120, 500124, 501674, 503464, 504598, 504536, 503568, 502108, 500111, 497562, 495035, 493122, 491724, 490511, 489709, 489702, 490152, 490375, 490446, 491050, 492288, 493501, 494389, 495362, 496590, 497568, 497999, 498341, 499054, 499970, 500830, 501787, 502934, 503927, 504579, 505317, 506519, 507921, 509131, 510226, 511275, 511765, 511185, 509834, 508424, 507210, 506149, 505554, 505851, 506849, 507917, 508887, 510140, 511806, 513432, 514519, 514915, 514559, 513231, 510716, 507106, 502895, 498859, 495649, 493267, 491125, 488876, 486874, 485550, 484608, 483326, 481516, 479782, 478825, 478825, 479466, 480283, 481073, 482129, 483946, 486535, 489311, 491856, 494456, 497528, 500827, 503645, 505557, 506564, 506712, 506020, 504661, 502791, 500307, 497124, 493637, 490612, 488751, 488483, 489820, 492127, 494341, 495847]
59625D95847J020R50J016J468K785M295M461K985J372Q09O35k60j674k722l359
59610E09628m000m282l414j476N31J787K092J654J149J521K847L780L069J268
59596E16154M0LL13J74k53n11n26l76j10P6qj15J47N74M70m85j880l176m126m659
59576E01726m763m585m269l758l085k695l022l777m111l517k216q11J31K70k66
59561D61252q45r38o14j96L45J172K020K438K447K414K376K030J398R74J095J591
59545D78959K114K497K748K988L431M214N380P092R532J2364J4844J6739J8471
59532E81373J9621J8100J2089K793n873j0657j1327r707p345m605j258K662O478
59519E92344R173J0247J0320J0445J0915J1171J0754R771Q336O298L715R72j760
$$ y = [495847, 496867, 497817, 498833, 500301, 503086, 507381, 511842, 514827, 516199, 517008, 517643, 517383, 515709, 512987, 509628, 505628, 501346, 497932, 496456, 496987, 498774, 500866, 502520, 503669, 505190, 508037, 511817, 514886, 516154, 516194, 516197, 516510, 516684, 516431, 515920, 515394, 515018, 514908, 514984, 514976, 514861, 515008, 515582, 516052, 515567, 513687, 510511, 506385, 501726, 496963, 492378, 488109, 484351, 481266, 478571, 475549, 471772, 467661, 464144, 461928, 461117, 461248, 461518, 461252, 460407, 459469, 458855, 458659, 459004, 460176, 462196, 464634, 467081, 469495, 471871, 473901, 475299, 476273, 477368, 478959, 481073, 483570, 486318, 489306, 492737, 496951, 502331, 509423, 518955, 531319, 546163, 562902, 581373, 600994, 619094, 631183, 633976, 628103, 617446, 606119, 596412, 589067, 584462, 583204, 585866, 592344, 601517, 611764, 622084, 632529, 643444, 654615, 665369, 675140, 683476, 689774, 693489, 694461, 692701]
59506F92701m597p270r015r565r707j0356j1421j2048j1708j0720r758r229q956
59493E68351q351p051n464m373l922l398k270r91m25p35j312j554j286n90L54
59478E26983J247J854K345L130M281N378O000O156O037N566M501K909J243m2p13
59463E76875o11L39J688K535K477K260K973M670O423P650Q760J0329J2335J4507
59449F53210J6786J9066K0903K2005K2591K2863K2411K0499J6696J1068M227k637
59437H49688q303j2542j6002j8831k0170j9546j7944j6622j5633j4362j2943j1918
59425F64872j0999r368p000m604k382k5K272L992N498P845J1305J5186J9122K3318
59411G19032K7458L0785L3320L5239L4674K8264J5392M20j0857j6197j7199j5965
$$ y = [692701, 688104, 680834, 671819, 662254, 652547, 642191, 630770, 618722, 607014, 596294, 586536, 577307, 568351, 560000, 552949, 547485, 543112, 539190, 535792, 533522, 532531, 532106, 531371, 530059, 528505, 527219, 526629, 526983, 528230, 530084, 532429, 535559, 539840, 545218, 551218, 557374, 563411, 568977, 573478, 576387, 577630, 577588, 576875, 576264, 576603, 578291, 580826, 583303, 585563, 588536, 593206, 599629, 607279, 616039, 626368, 638703, 653210, 669996, 689062, 709965, 731970, 754561, 777424, 799835, 820334, 837030, 848098, 852325, 849688, 841385, 828843, 812841, 794010, 773840, 754294, 736350, 719728, 704095, 689733, 676790, 664872, 653873, 644505, 637505, 632901, 630519, 630494, 632766, 636758, 642256, 650101, 661406, 676592, 695714, 719032, 746490, 777275, 810595, 845834, 880508, 908772, 924164, 924584, 913727, 897530, 880331, 864366]
59399H64366j3339r851o188k524R30K310j293j0617k2377l1626l5622l5090l2392
59386F66687k9276k6198k2933j9364j5792j2654j0126q124o604n565m828m050
59374E01173l084k134j423r18m86k05k56n42o15j66N01P71N02K29M00P92R74J091
59356D96604J605K410K944L199L926N459P065P996Q619R831J1761J3800J5663
59343E90882J7573J9457K0760K1315K1640K2051K2104K1360K0153J9009J7726
59332H14030J5669J2693R139N009K4n376r921j2783j4472j5945j7442j8666j9656
59319G42303k0638k1279k0963j9745j8315j6833j4719j1849r158p519o605n494
59307E69186l970k582j711j181o10K83J720L748O133Q612J1155J3792J6458J9187
$$ y = [864366, 851027, 841176, 834988, 832464, 833394, 835704, 834411, 823794, 801417, 769791, 734169, 699079, 666687, 637411, 611213, 588280, 568916, 553124, 540470, 530344, 522220, 515616, 510051, 505223, 501173, 498089, 495955, 494532, 493614, 493128, 492923, 492667, 492125, 491510, 491344, 491845, 492616, 493118, 493347, 493747, 494539, 495513, 496604, 498209, 500619, 503563, 506762, 510688, 516147, 523212, 531208, 539827, 549658, 561419, 575219, 590882, 608455, 627912, 648672, 669987, 691627, 713678, 735782, 757142, 777295, 796304, 814030, 829699, 842392, 851531, 856540, 856564, 851188, 841267, 828484, 814012, 798067, 780625, 761959, 742303, 721665, 700386, 679423, 659678, 641363, 624530, 609811, 597962, 588804, 581285, 574680, 569186, 565216, 562634, 560923, 559742, 559132, 559415, 561135, 564883, 571016, 579628, 590783, 604575, 621033, 640220]
59293F40220K2170K5297K7874K8919K7366K2040J2412M5j1489j9097k2360k2701
59281G30696k1220j8307j4753j1634r020o065k607M38K504M105N777P330Q656
59268F75900J0311J2554J4555J5395J5362J5472J5980J6092J5037J2818R882O491
59256H35849K616j700o015r707j2569j4956j7125j8670j9034j8277j6877j5015
59244F88520j2702j0419q809p707o312m373k450q76O99K467M014N085O074P314
59230F60525Q507R229R453R251Q629P854P273O543M825K091o84k970n307p905
59216G17314r782j0263j0318j1280j2850j3646j3221j2269j1210r921q754q480
59204E85320q994r181q382p085n831m456k892j874k044k842l066k365j579j519
$$ y = [640220, 662390, 687687, 715561, 744480, 771846, 793886, 806298, 806343, 794854, 775757, 753397, 730696, 709476, 691169, 676416, 664782, 655762, 649697, 647090, 647528, 650032, 654137, 659914, 667244, 675900, 686211, 698765, 713320, 728715, 744077, 759549, 775529, 791621, 806658, 819476, 829358, 835849, 838465, 836765, 830750, 821043, 808474, 793518, 776393, 757723, 738689, 720412, 703535, 688520, 675818, 665399, 656590, 648883, 642571, 638198, 635748, 634872, 635571, 638038, 642052, 647137, 653211, 660525, 669032, 678261, 687714, 696965, 705594, 713448, 720721, 727264, 732089, 734180, 733496, 730526, 725219, 717314, 707532, 697269, 686951, 675671, 662821, 649175, 635954, 623685, 612475, 602554, 593800, 585320, 576326, 567145, 558763, 551678, 545847, 541391, 538499, 536625, 534581, 531739, 528673, 526308, 524729, 523210]
59190E23210j906j751n75J041K151K431K274K107K066K260K834L563L872L593
59176E47170L293L475L906M176M448N088N865O270O352O595P089P529Q041R105
59162F28402J0613J1733J2082J2268J2828J3271J2811J1538J0150Q730O685L874
59150G54985J034j183l022m991o956q411r347j0156j0778j0658r697q569p870
59137F64381p468p024o535n994n145m070l458l572l533k471r13k1K00P78K015
59122F17170L147L908N112P241R502J0987J1811J2571J3378J4068J4676J5123
59110G38694J5061J4555J4216J4156J3603J2198J0821J0253R777Q211N840M154
59098H71539L872M197M026K980J286n71k010k761l194l738m120l757k815k172
$$ y = [523210, 521304, 519553, 518978, 520019, 522170, 524601, 526875, 528982, 531048, 533308, 536142, 539705, 543577, 547170, 550463, 553938, 557844, 562020, 566468, 571556, 577421, 583691, 590043, 596638, 603727, 611256, 619297, 628402, 639015, 650748, 662830, 675098, 687926, 701197, 714008, 725546, 735696, 744426, 751111, 754985, 756019, 754836, 751814, 746823, 739867, 731456, 722109, 711953, 701175, 690517, 680820, 672251, 664381, 656913, 649889, 643354, 637360, 632215, 628145, 624687, 621115, 617582, 615111, 614198, 614177, 614377, 615155, 617170, 620317, 624225, 629337, 636578, 646080, 657067, 668878, 681449, 694827, 708895, 723571, 738694, 753755, 768310, 782526, 796682, 810285, 822483, 833304, 843557, 853334, 861545, 867385, 871539, 875411, 879608, 883634, 886614, 887900, 887329, 885319, 882558, 879364, 875626, 871506, 867749, 864934, 862762]
59084H62762k331k975l632m225m905n839p226r085j0940j2145j2501j2298j1800
59071G62860j1140j0558j0236r916r180q174p501p333p072o146m724l445k654
59058F64781k179j697j117o20m76q36j673k769l733m199m158l996l964l820l308
59043F26236k771k714k913k660j887j256r75l76R57K444L386L849M175M216L784
59028F33495L249L117L354L777M568N857P280Q592J0195J2308J4160J4802J4344
59015G39098J3607J2916J2063J1112J0312R341P515M685J379j742l978m504l147
59002H08657j033M10J053J903L489N260O584P476Q128Q409Q147P401O310N004
58988H77198L639K252O41j281l225m919o484q059r486j0758j2204j3701j4380
$$ y = [862762, 860431, 857456, 853824, 849599, 844694, 838855, 831629, 822544, 811604, 799459, 786958, 774660, 762860, 751720, 741162, 730926, 721010, 711830, 703656, 696155, 688822, 681750, 675604, 670880, 667435, 664781, 662602, 660905, 659788, 659168, 658692, 657856, 656183, 653414, 649681, 645482, 641324, 637328, 633364, 629544, 626236, 623465, 620751, 617838, 615178, 613291, 612035, 611060, 610684, 611641, 614085, 617471, 621320, 625495, 629711, 633495, 636744, 639861, 643215, 646992, 651560, 657417, 664697, 673289, 683484, 695792, 709952, 724754, 739098, 752705, 765621, 777684, 788796, 799108, 808449, 815964, 820649, 822028, 820286, 816308, 811804, 808657, 807624, 808034, 809087, 810990, 814479, 819739, 826323, 833799, 841927, 850336, 858483, 865884, 872194, 877198, 880837, 883089, 883730, 882449, 879224, 874305, 867821, 859762, 850276, 839518, 827314, 813613, 799233]
58975G99233j3818j2770j1877j0419p517m013j574k84J265L568N483O166O279
58962G59722O747P608Q646J0002J1496J2312J2047J1242J0342Q919O511L449J25
58949H69168l689p994j1676j3451j3458j2976j2712j2133j0578q341o278m724
58937G51158l289j734o99j193l363o210q555r924j0325r860q973q473q607q562
58923F61391p607o311n758n880n642m704l841l646l758l562k830j553J31J665
58909F08095K441K632K987L795M730N686O979Q629J0223J1624J3035J4240J4651
58896G09747J4165J3302J2297J0973R586Q924R312J0361J1936J4511J8243K2418
58884H65775K6235K9412L1807L3091L3064L1679K8673K3925J8241J2895Q220L507
$$ y = [799233, 785415, 772645, 760768, 750349, 742832, 738819, 737245, 736961, 738226, 741794, 747277, 753443, 759722, 766469, 774077, 782723, 792725, 804221, 816533, 828580, 839822, 850164, 859083, 865594, 869043, 869168, 865479, 857485, 845809, 832358, 818900, 805924, 793212, 781079, 770501, 762160, 755882, 751158, 747869, 746135, 745436, 744243, 740880, 734670, 726115, 716191, 705866, 696006, 687033, 678560, 669953, 661391, 653784, 647473, 641715, 635835, 630193, 625489, 621648, 618002, 614244, 610682, 607852, 606299, 606430, 608095, 610536, 613168, 616155, 619950, 624680, 630366, 637345, 645974, 656197, 667821, 680856, 695096, 709747, 723912, 737214, 749511, 760484, 770070, 778994, 788306, 798667, 810603, 825114, 843357, 865775, 892010, 921422, 953229, 986320, 1019384, 1051063, 1079736, 1103661, 1121902, 1134797, 1143017, 1146524]
58872A146524j614o682j1505j6563k1851k6346k9207l0593l0816k9633k7016k3794
58860H90904k0841j8314j6144j4605j3846j3577j3614j4026j4518j4561j4439
58849G22419j5030j6108j6127j4375j2032j0245q533o307m647m848o059o179m737
58836E97192l296l028l383l313k531j335k26O4r38k578l534l354k872k853k990
58821E61025k660j961j434j144n98M62J671K481K752K748K702K582K307J932J453
58806E74318O95l31j183j492j529j786k186k249j897j490j106o02l08p57j593
58791E56504j692o96M28Q43R98J688K722L273L148L019L536M740O097O836O549
58776E97993N658N010M804M427L424K104Q77k96j483k327k469k018j302n65j07
$$ y = [1146524, 1144910, 1138228, 1126723, 1110160, 1088309, 1061963, 1032756, 1002163, 971347, 941714, 914698, 890904, 870063, 851749, 835605, 821000, 807154, 793577, 779963, 765937, 751419, 736858, 722419, 707389, 691281, 675154, 660779, 648747, 638502, 629969, 623662, 619015, 614167, 608108, 601929, 597192, 593896, 590868, 587485, 584172, 581641, 580306, 580080, 580144, 579206, 576628, 573094, 569740, 566868, 564015, 561025, 558365, 556404, 554970, 553826, 553228, 553690, 555361, 557842, 560594, 563342, 566044, 568626, 570933, 572865, 574318, 575013, 574682, 573499, 572007, 570478, 568692, 566506, 564257, 562360, 560870, 559764, 559162, 558854, 558097, 556504, 554812, 554116, 554544, 555387, 556385, 558073, 560795, 564068, 567216, 570235, 573771, 578511, 584608, 591444, 597993, 603651, 608661, 613465, 617892, 621316, 623420, 624297, 624001, 622518, 620191, 617722, 615704, 614402, 613837, 613730]
58761F13730k43q52j374j418r23J10J360J885J080m4J96J857L294L719M263N807
58745F32447P298P450O788O601O856O650O170O533P918R196R522R199Q865Q699
58731G40192Q613Q635Q871R368J0015J0422J0250R746R473R321Q482O752N092
58718H55232M336M140L830L530L704M222M760N557O870Q106Q399P772P006O508
58704I33972N975M870K776m39m362q248j1773j5061j7865j9611k0552k1801k3573
58691H04308k4497k3452k1106j8683j6318j3735j1525j0299r390p829o145n697
58679F35632o646p887q678r007q668p422n959n237m933l877k032o27r7O88K588
58664E67838M869O402P296Q455J0038J1132J0843R216P054N139L664K410J246
$$ y = [613730, 613487, 612635, 611261, 609843, 608920, 609030, 610390, 612275, 613355, 613311, 613507, 615364, 618658, 622377, 626640, 632447, 639745, 647195, 653983, 660584, 667440, 674090, 680260, 686793, 694711, 703907, 713429, 722628, 731493, 740192, 748805, 757440, 766311, 775679, 785694, 796116, 806366, 816112, 825585, 834906, 843388, 850140, 855232, 859568, 863708, 867538, 871068, 874772, 878994, 883754, 889311, 896181, 904287, 912686, 920458, 927464, 933972, 939947, 944817, 947593, 947154, 942792, 934544, 922771, 907710, 889845, 870234, 849682, 827881, 804308, 779811, 756359, 735253, 716570, 700252, 686517, 674992, 664693, 655303, 647474, 641329, 635632, 628986, 621099, 612421, 603414, 594746, 587324, 581365, 576128, 571195, 567318, 565286, 564659, 564562, 565250, 567838, 572707, 579109, 586405, 594860, 604898, 616030, 626873, 636089, 643143, 648282, 651946, 654356, 655602]
58651F55602K42o44j478j982j805j254j128j581j913j702j425j539j770j810j894
58636F33919k075j804q27K36Q63J370K046K459K335K229K470K357J399M13L72
58621F47762R37J196J132J303J815K637M126O181P730Q281R077J1376J4337J6012
58607G33902J5841J4778J3521J2047J0398Q561O018K654m51k310l448m733n698
58594H01080n573n159n808p103p414o384n028l695j935j49O29O92J589L821O252
58579G65815P984R286J0428J1034J0901J0234R006P220N600M786M119K687J141
58566H60241Q81J828K833M014O587J0398J3714J5763J7414J9002J9518J8510J6924
58553A007627J5334J3100J0021P114M847K187j646n734q709j0413j1509j2418
$$ y = [655602, 655844, 655200, 653722, 651740, 649935, 648681, 647553, 645972, 644059, 642357, 640932, 639393, 637623, 635813, 633919, 631844, 630040, 629213, 629449, 630312, 631682, 633728, 636187, 638522, 640751, 643221, 645578, 646977, 647390, 647762, 648699, 649895, 651027, 652330, 654145, 656782, 660908, 667089, 674819, 683100, 692177, 703553, 717890, 733902, 749743, 764521, 778042, 790089, 800487, 809048, 815066, 817720, 817269, 814959, 811511, 806778, 801080, 795507, 790348, 784540, 777437, 770023, 763639, 758611, 754916, 752981, 752832, 753461, 754153, 755742, 759563, 765815, 773799, 783085, 793513, 804547, 815448, 825682, 834688, 841908, 847508, 852294, 856413, 859100, 860241, 861122, 862950, 865783, 869797, 876384, 886782, 900496, 916259, 933673, 952675, 972193, 990703, 1007627, 1022961, 1036061, 1046082, 1053196, 1058043, 1060230, 1058584, 1052850, 1044141, 1033728, 1022219, 1009801]
58541A009801j3318j4311j5038j4907j4043j3246j2882j2725j2817j3379j3904
58530H59231j3514j2296j1018r644p547n157l698l145k116p5J959L259M282N299
58516H05820N751N525N368N424M888L647K745K675K721K541K846L795M312L876
58502H61934L599M544O201P524Q380R077R442R215Q547P503N723L034k73l899
58488I40551p436r927j0665j0394j0480j1023j1065j0450r773q729o433l479j589
58475H29108r32J75K445M582N544N768N558M328K299Q27K06r00k879m247m320
58460H47562m641o300p813p370n554m100l345k451j095M39J900K826K671K030
58446H14759K400L890M672L635J973J074N09n30j393j078M8J145K366M092N699
$$ y = [1009801, 996483, 982172, 967134, 952227, 938184, 924938, 912056, 899331, 886514, 873135, 859231, 845717, 833421, 822403, 812759, 805212, 800055, 796357, 793212, 791096, 791021, 792980, 796239, 800521, 805820, 811571, 817096, 822464, 827888, 832776, 836423, 839168, 841843, 844564, 847105, 849951, 853746, 858058, 861934, 865533, 870077, 876278, 883802, 892182, 901259, 910701, 919916, 928463, 935966, 941689, 944723, 944450, 940551, 933115, 923188, 912523, 902129, 891649, 880626, 869561, 859111, 849338, 840609, 834176, 830697, 829108, 828176, 828351, 830796, 835378, 840922, 846690, 852248, 856576, 858875, 859702, 859908, 859008, 856129, 851882, 847562, 842921, 836621, 828808, 821438, 815884, 811784, 808439, 805988, 804893, 805332, 807232, 810058, 812729, 814759, 817159, 821049, 825721, 829356, 831329, 832403, 832912, 832382, 830989, 829911, 829959, 831104, 833470, 837562, 843261]
58431H43261O319O041N344M343L422L485M621N662N947O386P923J0158J2328J4292
58417I39532J5792J6061J4947J3118J0559O490J496k170l427l685m290m577l770
58404I96076k864k996l493l219k491k139j859r62L72J767L491N506O845O883O082
58389A006999M725K352p44l191m453n411o332o244n169m666n153n010l594k616
58375I61493l069l267j777Q6P11R31K131L637M211M449N495O932P911Q788R881
58360A008543J0277R698R707J1230J2715J2655J2016J2178J2411J1584J0423R904
58348A143341R189P471O015O085O596O088N385N948P232P969Q485R624J0888J1656
58334A251972J2607J4068J4852J4529J4695J6105J6974J6165J5380J5889J6024
$$ y = [843261, 849580, 855621, 860965, 865308, 868730, 872215, 876836, 882498, 888445, 894831, 902754, 912912, 925240, 939532, 955324, 971385, 986332, 999450, 1010009, 1016499, 1017995, 1015825, 1012398, 1008713, 1004423, 999846, 996076, 993212, 990216, 986723, 983504, 981013, 978874, 977015, 976053, 976425, 978192, 981683, 987189, 994034, 1000917, 1006999, 1011724, 1014076, 1013332, 1010141, 1005688, 1000277, 993945, 987701, 982532, 977866, 972713, 967703, 964109, 961493, 958424, 955157, 953380, 953466, 954177, 955108, 957239, 960876, 965087, 969536, 975031, 981963, 989874, 998662, 1008543, 1018820, 1028518, 1038225, 1049455, 1062170, 1074825, 1086841, 1099019, 1111430, 1123014, 1133437, 1143341, 1152530, 1160001, 1166016, 1172101, 1178697, 1184785, 1190170, 1196118, 1203350, 1211319, 1219804, 1229428, 1240316, 1251972, 1264579, 1278647, 1293499, 1308028, 1322723, 1338828, 1355802, 1371967, 1387347, 1403236, 1419260]
58323A419260J4545J3530J4720J5913J4506J2014J1304J1680J0650Q618P809Q270
58311A562819Q661R453J1657J3898J4399J4344J5836J8045J8918J9055K0297K2049
58299A749431K2606K2517K3192K3791K2982K1971K2324K2762K1711K0817K2139
58288A996243K4137K4469K4374K6022K7958K7847K7401K9628L3289L5154L5668
58277B312190L7274L9135L8978L8278L9979M2732M3155M2258M3677M6921M8468
58266B773045M8493N0442N4635N8171O0573O3797O7357O9129P0227P3484P7996
58255C467349Q0779Q2627Q6521R1502R4226R5261R7671J00893J02518J04413J10049
58244D513809J17379J21765J24424J30236J38719J45464J51236J60845J73761
$$ y = [1419260, 1433805, 1447335, 1462055, 1477968, 1492474, 1504488, 1515792, 1527472, 1538122, 1546740, 1554549, 1562819, 1571480, 1580933, 1592590, 1606488, 1620887, 1635231, 1651067, 1669112, 1688030, 1707085, 1727382, 1749431, 1772037, 1794554, 1817746, 1841537, 1864519, 1886490, 1908814, 1931576, 1953287, 1974104, 1996243, 2020380, 2044849, 2069223, 2095245, 2123203, 2151050, 2178451, 2208079, 2241368, 2276522, 2312190, 2349464, 2388599, 2427577, 2465855, 2505834, 2548566, 2591721, 2633979, 2677656, 2724577, 2773045, 2821538, 2871980, 2926615, 2984786, 3045359, 3109156, 3176513, 3245642, 3315869, 3389353, 3467349, 3548128, 3630755, 3717276, 3808778, 3903004, 3998265, 4095936, 4196829, 4299347, 4403760, 4513809, 4631188, 4752953, 4877377, 5007613, 5146332, 5291796, 5443032, 5603877, 5777638]
58235E777638J84815J93696K04864K18514K30789K42562K58470K77446K94055
58226G882849L09179L29320L55205L81510M07889M39472M76204N13070N51360
58217A1646058N97972O53081P10756P72298Q46001R33028J027406J130969J253672
58208A9571241J398062J559538J743642J966277K235073K549379K921549L378441
58200C7323202L938915M612342N423261O411755P602836R003679J0641355J2575472
58192I7532817J4864609J7549740K0664183K4183135K7907683L1425071L4190178
58185B68317416L5542206L4570494L0159674K1593127R441123m153252j6320926
58178C79149862k4888510k9232289l0022812k8386625k5359164k1886306j8916313
$$ y = [5777638, 5962453, 6156149, 6361013, 6579527, 6810316, 7052878, 7311348, 7588794, 7882849, 8192028, 8521348, 8876553, 9258063, 9665952, 10105424, 10581628, 11094698, 11646058, 12244030, 12897111, 13607867, 14380165, 15226166, 16159194, 17186600, 18317569, 19571241, 20969303, 22528841, 24272483, 26238760, 28473833, 31023212, 33944761, 37323202, 41262117, 45874459, 51297720, 57709475, 65312311, 74315990, 84957345, 97532817, 112397426, 129947166, 150611349, 174794484, 202702167, 234127238, 268317416, 303859622, 338430116, 368589790, 390182917, 399624040, 395470788, 379149862, 354261352, 325029063, 295006251, 266619626, 241260462, 219374156, 200457843]
58171B00457843j7150527j6637927j6744314j6646796j5901340j4577145j2971892
58164H9827902j1319090r737411q303004p064122o015511n122516m367963l747933
58156C4150352l239770k808969k439728k131771j874628j650343j455775j298485
58148A7250883j173415j064352r65934q84825q20345p61703p03974o50809o01515
58139I624011n50295m98504m53774m16492l79699l42476l11153k87064k65070
58130F119484k45006k32811k28912k25918k19471k11883k03973j92719j78423
58121D180368j65483j54704j42804j30220j21245j15710j08736r9619r2898q9723
58111B959226q6091q0797p7347p6486p4379o9893o6474o5199o2811n8497n5829
$$ y = [200457843, 183307316, 166669389, 149925075, 133278279, 117376939, 102799794, 89827902, 78508812, 68771401, 60468397, 53404275, 47388764, 42266248, 37898285, 34150352, 30910582, 28101613, 25661885, 23530114, 21655486, 20005143, 18549368, 17250883, 16077468, 15013116, 14047182, 13162357, 12342012, 11580309, 10876335, 10225526, 9624011, 9073716, 8575212, 8121438, 7704946, 7325247, 6982771, 6671618, 6384554, 6119484, 5874478, 5641667, 5412755, 5186837, 4967366, 4755483, 4551510, 4358791, 4180368, 4014885, 3860181, 3717377, 3587157, 3465912, 3350202, 3241466, 3141847, 3048949, 2959226, 2873135, 2792338, 2714991, 2638505, 2564126, 2494233, 2427759, 2362560, 2299749, 2241252, 2185423]
58100B185423n6093n6090n4371n3439n3876n2467m8235m4452m2523l9616l4582
58089A649679l0646k9715k9164k6845k4542k3932k3508k2037k0969k1242k1397
58078A375682k0772k0923k2221k2698k1762k1334k2026k1975k0802k0725k2310
58067A138134k3100k1942k0737k0399j9095j6206j4087j3995j3960j2633j1688
58056I50292j2360j3103j2724j2588j3616j4207j3217j2194j2557j3238j2944
58045H07544j2233j1706j0620q881p897q048p838o807o572p623q007o731n605
58032F98976o074o939p002p222q378r164q627q182r160j0440j0391r379q529p829
58018E81660o992o562o746o736o305o372o980o726n197l942l930m170l820l529
$$ y = [2185423, 2129330, 2073240, 2018869, 1965430, 1911554, 1859087, 1810852, 1766400, 1723877, 1684261, 1649679, 1619033, 1589318, 1560154, 1533309, 1508767, 1484835, 1461327, 1439290, 1418321, 1397079, 1375682, 1354910, 1333987, 1311766, 1289068, 1267306, 1245972, 1223946, 1201971, 1181169, 1160444, 1138134, 1115034, 1093092, 1072355, 1051956, 1032861, 1016655, 1002568, 988573, 974613, 961980, 950292, 937932, 924829, 912105, 899517, 885901, 871694, 858477, 846283, 833726, 820488, 807544, 795311, 783605, 772985, 764104, 756207, 748159, 740321, 733514, 726942, 719319, 711312, 704581, 698976, 692902, 685963, 678961, 671739, 663361, 654197, 645570, 637388, 628228, 617788, 607397, 598018, 589489, 581660, 574668, 568106, 561360, 554624, 548319, 541947, 534967, 528241, 523044, 519102, 515172, 511002, 507182, 503653]
58004E03653l562k958j676j264k116k405j201k26q52j670q86Q71K014K502L041
57989D93265L369L104K917L361L806L790M005M818N290M795M060L576K642J037
57975E43835j77n32r86j860j969r63m34j357k520k870l279m413n012m171l327
57960E09965l963n079m982m068l713l824l531l188l675m644n131n058m763m033
57946D50313k928k350k505k160p15M46J01p75o85J65R71K092L946N521N907O109
57930D63453P367Q853R003Q050P224O402M715K719J850K094K071J122l19j998
57916E22606l924n590o508p154q132r030r287r412r962j0189r210p786p272p506
57902D11644p432p181p697q711q866p814o601o016n897n969o097n778m594l074
$$ y = [503653, 500091, 497133, 495457, 494193, 492077, 489672, 488471, 488245, 487393, 485723, 484837, 485708, 487722, 490224, 493265, 496634, 499738, 502655, 506016, 509822, 513612, 517617, 522435, 527725, 532520, 536580, 540156, 542798, 543835, 543658, 543126, 542140, 540280, 538311, 537348, 536914, 535557, 533037, 530167, 526888, 522475, 517463, 513292, 509965, 506002, 500923, 495941, 491873, 488160, 484336, 480805, 477617, 473942, 469298, 464167, 459109, 454346, 450313, 447385, 445035, 442530, 440370, 439655, 440101, 440202, 439427, 438742, 438907, 439878, 441970, 445916, 451437, 457344, 463453, 470820, 479673, 488676, 496726, 503950, 510352, 515067, 517786, 519636, 521730, 523801, 524923, 524604, 522606, 518682, 513092, 506584, 499430, 491298, 482268, 472981, 463569, 453607, 443418, 434208, 426422, 419150, 411644, 404212, 397031, 389334, 380623, 371757, 363943, 357342, 351326, 345429, 339460, 333363, 327585, 322991, 319917]
57888C19917k156j904j724j434j148n37P03J994K587K759L168L501K927J724J128
57873C31505J589K177J814M21j166j936j571q93j001j764j955j191n42o51n50
57858C24286O68K284L260L886M807N414M896L914L660L876L516K781K722L250
57844C73220L260K612K305K636K738K090J192N80J75k25p85j814l301m429m482
57829C75772l984l953m359m385l925l599l479k987k040j157m10O77K122L336M062
57814C51691M625N205N681O139O812P463P442O336M080P27l292o964r467j0858
57800C75620j1552j1580j1060j0753j1223j1829j1442r870p844o019m779m477
57788B63192m932n163m467l399k839k627k074j252p17m20J6M32N28P60J735L080
$$ y = [319917, 317761, 315857, 314133, 312699, 311551, 311014, 311717, 313711, 316298, 319057, 322225, 325726, 328653, 330377, 331505, 333094, 335271, 337085, 337506, 336340, 334404, 332833, 331940, 330939, 329175, 327220, 326029, 325487, 324836, 324286, 324954, 327238, 330498, 334384, 339191, 344605, 349501, 353415, 357075, 360951, 364467, 367248, 369970, 373220, 376480, 379092, 381397, 384033, 386771, 388861, 390053, 390633, 390808, 390583, 389798, 387984, 384683, 380254, 375772, 371788, 367835, 363476, 359091, 355166, 351567, 348088, 345101, 343061, 341904, 341494, 342171, 344293, 347629, 351691, 356316, 361521, 367202, 373341, 380153, 387616, 395058, 401394, 405474, 406201, 402909, 395945, 386478, 375620, 364068, 352488, 341428, 330675, 319452, 307623, 296181, 286311, 278467, 272448, 267669, 263192, 258260, 253097, 248630, 245231, 242392, 239765, 237691, 236439, 235722, 235302, 235318, 235750, 236278, 237038, 238773, 241853]
57772B41853L972M316M404L964K738J573J591K560L246L097K420J327j25j164
57758B75772j078n05o30j354j710j763k431l573l965l334k669k340j562k06N48
57743B49200J25k86M53J665J834N90j130k362k788k556k048j661j469j245q17
57728B37505j18R42K182K925K654J769J119J027J287J804K413K496J665N67R8
57713B60335Q5j78m75L8J161J661J062K21l9K23Q60K095L806N378O609P870R125
57696B99837R721R472R009Q672P922O268L949J307j707m912p462q643q655q152
57682C16626p442o419n012l314j461N79L198O949J1802J6964K1817K6794L2809
57669D13890M0183M8589N7578O6363P3301P6118P2240N8966L4889K844k9587n4538
$$ y = [241853, 245825, 250141, 254545, 258509, 261247, 262820, 264411, 266971, 270217, 273314, 275734, 277061, 276936, 275772, 274694, 274189, 273559, 272205, 270495, 268732, 266301, 262728, 258763, 255429, 252760, 250420, 248858, 248652, 249200, 249325, 249039, 249492, 251157, 252991, 253581, 252451, 250089, 247301, 244745, 242697, 241036, 239567, 238322, 237505, 237387, 238329, 240511, 243436, 246090, 247859, 248978, 250005, 251292, 253096, 255509, 258005, 259670, 260237, 260335, 260420, 260242, 259767, 259805, 260966, 262627, 263689, 263910, 263871, 264094, 264954, 267049, 270855, 276233, 282842, 290712, 299837, 309558, 319030, 328039, 336711, 344633, 350901, 354850, 356157, 354450, 349538, 342076, 333433, 324778, 316626, 309184, 302765, 297753, 294439, 292978, 293557, 296755, 303704, 315506, 332470, 354287, 381081, 413890, 454073, 502662, 560240, 626603, 699904, 776022, 848262, 907228, 942117, 944961, 915374, 860836]
57657H60836o9067p5051p5001p0045o1658n2500m4506l7679l1546k6413k2412
57646B94958j8735j4840j1399r202p905o684n390m365l689l181k669j931q10L77
57632B04535J124J427J567J297J98j253k003j878j615j456r61l39n58j704k558
57617A95823k333j677j427j560j848k422l032k930k072j401j360j291q10m82m53
57602A70725J89J717K760K188Q42J89K37R5k69k81j77p09j717k278k073j644j363
57585A68431j160j107j497k243k885l129k940k392j809j701k095k279j771j076
57571A40347r56j370j697j671j424j054o55n72j001j555j654j144k28Q00J507
57556A27673J469Q10J90j24n40j235j599j142l43L3K4K13P68J309J513J342Q88
$$ y = [860836, 791769, 716718, 641717, 571672, 510014, 457514, 413008, 375329, 343783, 317370, 294958, 276223, 261383, 249984, 240782, 232877, 226193, 220803, 216438, 212749, 209568, 206899, 204968, 204158, 204535, 205659, 207086, 208653, 209950, 210148, 208895, 206892, 205014, 203399, 201943, 200982, 200643, 200085, 198381, 195823, 193490, 191813, 190386, 188826, 186978, 184556, 181524, 178594, 176522, 175121, 173761, 172470, 171660, 171178, 170725, 170914, 172631, 175391, 177579, 178421, 178610, 178847, 178942, 178673, 178392, 178215, 177506, 175789, 173511, 171438, 169794, 168431, 167271, 166164, 164667, 162424, 159539, 156410, 153470, 151078, 149269, 147568, 145473, 143194, 141423, 140347, 139391, 138021, 136324, 134653, 133229, 132175, 131520, 130948, 129947, 128392, 126738, 125594, 125366, 126166, 127673, 129142, 129952, 130142, 130018, 129478, 128243, 126644, 125502, 125159, 125192, 125216, 125429, 126197, 127506, 129019, 130361, 131249]
57539A31249L58Pr6j4L73J100J620J239K01m60k97K00O80J355J990J729N50k40
57521A41544K38J165J395J108J101J313J170Q67J042J586J792J469J102J085J411
57506A59388J832J806P58r70k029j533j55Q87J299J563J935K411L094L810L917
57491A78013L312K928L378L746K794Q91l90k12Q98K020K473J815K33j273j911
57476A98715k047k450l010l108k842k801k942k746k336k436l164l723l331j926
57462A59853j07J134R76k87j302j206n93l64l96k04p6l48l63N35J526J351L28
57445A60457j85k7k60j136j692j509j267j274r60k29J04k31l69K70J043J149O89
57428A54573J35l59o55m64RQ8l23m89L4P12Q38L30n15j294j394n03O51Q93K02
$$ y = [131249, 131607, 131614, 131518, 131504, 131877, 132977, 134597, 135836, 136037, 135577, 135280, 135480, 136160, 137515, 139505, 141234, 141784, 141544, 141782, 142947, 144342, 145450, 146551, 147864, 149034, 149901, 150943, 152529, 154321, 155790, 156892, 157977, 159388, 161220, 163026, 163784, 162814, 160785, 159252, 159097, 159984, 161283, 162846, 164781, 167192, 170286, 174096, 178013, 181325, 184253, 187631, 191377, 194171, 195062, 194672, 194460, 195358, 197378, 199851, 201666, 201899, 200626, 198715, 196668, 194218, 191208, 188100, 185258, 182457, 179515, 176769, 174433, 171997, 168833, 165110, 161779, 159853, 159746, 160880, 161856, 161569, 160267, 159061, 158468, 158104, 157708, 157504, 157428, 157080, 156717, 157252, 158778, 160129, 160457, 160272, 160245, 159985, 158849, 157157, 155648, 154381, 153107, 152147, 151918, 152022, 151791, 151422, 151692, 152735, 153884, 154573, 154708, 154349, 153694, 153230, 153239, 153327, 153004, 152515, 152549, 153261, 154099, 154429, 153914, 152620, 151226, 150723, 151374, 152267, 152469]
57409A52469l04r5J27j72n56p25j145j862j853n45R87J371P24J12o9j23l4M21
57391A48728Q85Q00M50O27J328J764J612J477J848K337K276J626R32O86R31J309
57375A69616J374R37K29l53o39p56q41q81q25p33p67r70j156j070o96k58R6M15
57357A62722O94P60O18O05R40J370J545J483J377J216R53Q40J152J757K303K571
57341A82906K382J602O09K36O87J108Q58O22J272K234K186J046k2m43p14r83n78
57324A95008O52J722J842J364R08M53j66o07n22j05L00O16P99P44O70R48J379
57307B06005J423J172J252J612J486P86L61M63L02k98j72J278K744K752J774J286
57291B24226J557J842K140L152M638N350M800L986M081N206O704P759P704O401
$$ y = [152469, 152165, 152070, 152197, 152025, 151469, 150744, 149599, 147737, 145884, 145339, 146326, 147697, 148421, 148533, 148464, 148341, 148307, 148728, 149613, 150413, 150863, 151490, 152818, 154582, 156194, 157671, 159519, 161856, 164132, 165758, 166690, 167376, 168307, 169616, 170990, 171927, 172156, 171803, 171164, 170408, 169567, 168686, 167861, 167128, 166361, 165391, 164235, 163165, 162469, 162211, 162307, 162722, 163416, 164176, 164794, 165399, 166339, 167709, 169254, 170737, 172114, 173330, 174283, 175123, 176275, 178032, 180335, 182906, 185288, 186890, 187499, 187735, 188422, 189530, 190388, 191010, 192282, 194516, 196702, 197748, 197726, 197283, 196569, 195586, 195008, 195660, 197382, 199224, 200588, 201496, 201949, 201783, 201176, 200654, 200549, 200849, 201465, 202264, 203008, 203678, 204626, 206005, 207428, 208600, 209852, 211464, 212950, 213736, 214097, 214560, 214862, 214564, 214392, 215670, 218414, 221166, 222940, 224226, 225783, 227625, 229765, 232917, 237555, 242905, 247705, 251691, 255772, 260978, 267682, 275441, 283145, 289546]
57277B89546M671L678L704L903L383K122P87Jr6P7p6o73j194j262j269j810k716
57260C02776l146k602j336J25J387K174K380K184J840J412R61Q00J189J841K214
57245C14199K271K513L271M271M981N182N057M892M729M374L807L451L714M342
57231C71054M669M581M647N152N601N502N094M882M920N011N152N282N163M918
57217D41628N188O153O955O822O266O332O999P331O964O421O046N622N218N384
57203E29329O225P050P353P447P722P948P777P458P432P609P632P604Q004Q816
57189F35406R346R119Q623Q811R946J1242J1766J1465J1090J1270J1941J2590
57177G62615J2817J2619J2381J2616J3395J4172J4422J4420J4782J5377J5385
$$ y = [289546, 294217, 297895, 301599, 305502, 308885, 311007, 311794, 311795, 311699, 311776, 311700, 311027, 309833, 308571, 307302, 305492, 302776, 299630, 297028, 295692, 295817, 297204, 299378, 301758, 303942, 305782, 307194, 308155, 308955, 310144, 311985, 314199, 316470, 318983, 322254, 326525, 331506, 336688, 341745, 346637, 351366, 355740, 359547, 362998, 366712, 371054, 375723, 380304, 384951, 390103, 395704, 401206, 406300, 411182, 416102, 421113, 426265, 431547, 436710, 441628, 446816, 452969, 459924, 466746, 473012, 479344, 486343, 493674, 500638, 507059, 513105, 518727, 523945, 529329, 535554, 542604, 549957, 557404, 565126, 573074, 580851, 588309, 595741, 603350, 610982, 618586, 626590, 635406, 644752, 653871, 662494, 671305, 681251, 692493, 704259, 715724, 726814, 738084, 750025, 762615, 775432, 788051, 800432, 813048, 826443, 840615, 855037, 869457, 884239, 899616, 915001]
57166I15001J4536J3604J3309J3500J3805J4342J5148J5496J4694J3233J2374
57155A069042J2799J4100J5401J5975J5588J4891J5134J6818J8899J9912J9626
57144A248185J8892J8232J7495J6689J6195J6001J5591J4753J3921J3466J3306
57133A422726J3291J3464J3793J4121J4544J5324J6391J7337J7945J8341J8652
57122A595929J9030J9964K1942K4684K7250K9033L0333L1926L4524L8526M3746
57111A916887M9402N4931O0791O7989P6904Q7179R8629J11482J25847J41811J60195
57100B952047J82416K09355K41192K78533L22788L74945M34638N00919N73192
57091F070025O50689P31458Q12438Q90398R62533J026263J078660J115868J133188
$$ y = [915001, 929537, 943141, 956450, 969950, 983755, 998097, 1013245, 1028741, 1043435, 1056668, 1069042, 1081841, 1095941, 1111342, 1127317, 1142905, 1157796, 1172930, 1189748, 1208647, 1228559, 1248185, 1267077, 1285309, 1302804, 1319493, 1335688, 1351689, 1367280, 1382033, 1395954, 1409420, 1422726, 1436017, 1449481, 1463274, 1477395, 1491939, 1507263, 1523654, 1540991, 1558936, 1577277, 1595929, 1614959, 1634923, 1656865, 1681549, 1708799, 1737832, 1768165, 1800091, 1834615, 1873141, 1916887, 1966289, 2021220, 2082011, 2150000, 2226904, 2314083, 2412712, 2524194, 2650041, 2791852, 2952047, 3134463, 3343818, 3585010, 3863543, 4186331, 4561276, 4995914, 5496833, 6070025, 6720714, 7452172, 8264610, 9155008, 10117541, 11143804, 12222464, 13338332, 14471520]
57082A4471520J125846J089018J016556R01436P41097N44013L28848J14015r2677
57073B0239672k93482m90899o79899q49225r87835j089186j151272j175213j164575
57064A2358086j125119j064077r88919r06277q21478p38567o60356n88377n23121
57055D941795m64606m12677l66816l26175k90101k58388k30767k06514j84954
57046B200797j66017j49709j35335j21894j09216r8058q8898q1208p4136o7398
57036A108928o1095n5150m9415m4081l9428l5172l0552k5197j9361j3144n989
57025G30344K660J2652K3778L6670N2212P0323R0283J11448J30859J39284J23296
57014A523809P6149P579o0062j07463j29955j34630j29791j19459j05503r0349
$$ y = [14471520, 15597366, 16686384, 17702940, 18604376, 19345473, 19889486, 20218334, 20332349, 20239672, 19946190, 19455291, 18775392, 17926167, 16938332, 15849146, 14697874, 13522661, 12358086, 11232967, 10168890, 9179971, 8273694, 7452216, 6713649, 6053293, 5464916, 4941795, 4477189, 4064512, 3697696, 3371521, 3081420, 2823032, 2592265, 2385751, 2200797, 2034780, 1885071, 1749736, 1627842, 1518626, 1420568, 1331670, 1250462, 1176326, 1108928, 1047833, 992683, 943268, 899187, 859759, 824587, 794035, 768838, 749477, 736333, 730344, 733004, 745656, 769434, 806104, 858316, 928639, 1018922, 1130370, 1261229, 1400513, 1523809, 1599958, 1607537, 1547475, 1440012, 1310057, 1175427, 1045636, 926177, 820674, 730325]
57004G30325p6236o3883n3180m4291l7299l1693k6884k2764j9227j5799j2253
56993C26816r117p021n883n127m369l508k483j310j19J231L239O001Q550R427
56979C16327P882M238o75n936j0483j3376j4414j4229j3462j2217j0470q654p258
56966B17273o060m290j734Q73K805M334O259Q788J1321J3301J4699J5547J5477
56953B98593J3913J0511N234j449q188j3108j5224j5348j5054j4779j3567j0740
56941B20794p141m201k259m33K039M933P673J0252J3083J6217J9151K1327K2394
56928C23829K1849J8894J3025M766m393j2763j9100k2840k4079k3444k1768j9695
56916B34281j7588j5595j3690j1790r988q621p905p610p264o600n644m555l685
$$ y = [730325, 654089, 590206, 537026, 492735, 455436, 423743, 396859, 374095, 354868, 339069, 326816, 317699, 310678, 304795, 299668, 295299, 291791, 289308, 287998, 287879, 289110, 292349, 298350, 306900, 316327, 324209, 328447, 327772, 321836, 311353, 297977, 283563, 269334, 255872, 243655, 233185, 224531, 217273, 211213, 206923, 205189, 206062, 208867, 213201, 219460, 228248, 239569, 252870, 267569, 283116, 298593, 312506, 323017, 328251, 326802, 318614, 305506, 290282, 274934, 259880, 245101, 231534, 220794, 213653, 209452, 207193, 206760, 208799, 213732, 221405, 231657, 244740, 260957, 280108, 301435, 323829, 345678, 364572, 377597, 382363, 377970, 365207, 346107, 323267, 299188, 275744, 253976, 234281, 216693, 201098, 187408, 175618, 165630, 157009, 149104, 141494, 134230, 127630, 121986, 117431, 113746]
56903A13746l494m062m765m889m414l731k858j580l03P0n97j262r30M58K637N732
56887H9758R608J3207J5491J6706J7704J8172J6616J2379O807J938j275l030l613
56874B10468l052j604K16K230M733P818J0952J3505J5503J7602K0404K4115K8736
56861C51626L4197L9998M5065M8149M8230M4364L5681K2176N637j0676k3635l1587
56849F09225l4511l3493l0121k5805k1144j5928r905l283L566J0576J7983K5978
56837D93138L4571M3570N2571O1004O8210P3188P4239O9159N6205L5214Q313k0062
56825A049320m4404o0668o8275o9460o6625o0800n2575m3322l4638k6997j9737
56814E01819j2123l959M677J3562K2244L0215L7257M3350M8205N0868M9550M2070
$$ y = [113746, 110252, 106190, 101425, 96536, 92122, 88391, 85533, 83953, 83650, 83720, 83123, 81861, 80931, 81389, 84026, 89758, 99366, 112573, 128064, 144770, 162474, 180646, 197262, 209641, 216448, 218386, 217111, 214081, 210468, 207416, 205812, 206028, 208258, 212991, 220809, 231761, 245266, 260769, 278371, 298775, 322890, 351626, 385823, 425821, 470886, 519035, 567265, 611629, 647310, 669486, 675123, 664447, 640812, 609225, 574714, 541221, 511100, 485295, 464151, 448223, 438318, 435035, 438601, 449177, 467160, 493138, 527709, 571279, 623850, 684854, 753064, 826252, 900491, 969650, 1025855, 1061069, 1069382, 1049320, 1004916, 944248, 875973, 806513, 739888, 679088, 626513, 583191, 548553, 521556, 501819, 489696, 485737, 490414, 503976, 526220, 556435, 593692, 637042, 685247, 736115, 785665, 827735]
56802H27735K7387P227j4261l2997m6951n5647n8906n7017n1543m4753l8133l2044
56790D30097k6466k1246j5885r987l990J372O183J1132J6263K0857K4408K6694
56778D59432K6749K3018J5055M322p121j7868k6802l2652l4808l4070l1789k8755
56766C14711k5452k2662k0824j9183j6627j3299j0528r132q557p924p099o418
56754A47006n902n268m457l665k995k385j878j662j764j977k121k225k310k215
56740A06182j859j584j820k401k603j986q80J26P84R69L71r87k152j947l77J212
56724I1048J590P94k60q40q10l79R4K86J41r9k17k36k37j37J35M25M57J38l90
56705I1503q58j044q79n49l78n99j184j861k281k324k242k326k421k095j430j167
$$ y = [827735, 855122, 862349, 848088, 815091, 768140, 712493, 653587, 596570, 545027, 500274, 462141, 430097, 403631, 382385, 366500, 356513, 352523, 353895, 360078, 371210, 387473, 408330, 432738, 459432, 486181, 509199, 524254, 528576, 521455, 503587, 476785, 444133, 409325, 375255, 343466, 314711, 289259, 266597, 245773, 226590, 209963, 196664, 186136, 177004, 168447, 160523, 153424, 147006, 141104, 135836, 131379, 127714, 124719, 122334, 120456, 118794, 117030, 115053, 112932, 110707, 108397, 106182, 104323, 102739, 100919, 98518, 95915, 93929, 93049, 93175, 93959, 94928, 95299, 94312, 92160, 90213, 89836, 91048, 92638, 93432, 93172, 92332, 91522, 91143, 91237, 91523, 91664, 91565, 91348, 91112, 90875, 90738, 90873, 91298, 91755, 91893, 91503, 90645, 89601, 88722, 88173, 87795, 87196, 86012, 84151, 81870, 79546, 77304, 74978, 72557, 70462, 69032, 67865]
56689F7865j712k477k685k462k449k634k414j711j153j051r47m90k9L6j2L93J395
56672D7463K689L880M573M548M154M161M915N909O449O428O162N848N482N086
56658A17747M647M103L604L506L810L909L282K226J463J205J002N10k4k05j31
56643A50654l03r45j605j653j087n36m15m93m52m26m97k29P18J738J923J435J393
56626A49220K300L391L764L348K534J552O05K9j25k34m42l30L93J322J790J579
56610A70696J006N92P98J559K057J494J80q03j139j633k721l633l580k893k317
56595A59663j858j162m21j24k84n87r51j363j533j320j078j072r94n61l8L79J023
56578A47719J940K299J511L64K7M60P92Q58J168J674J761J432J368J774K151K260
$$ y = [67865, 66153, 63676, 60991, 58529, 56080, 53446, 51032, 49321, 48168, 47117, 46170, 45680, 45651, 45687, 45675, 46068, 47463, 50152, 54032, 58605, 63153, 67307, 71468, 76383, 82292, 88741, 95169, 101331, 107179, 112661, 117747, 122394, 126497, 130101, 133607, 137417, 141326, 144608, 146834, 148297, 149502, 150504, 151014, 150990, 150785, 150654, 150351, 149406, 147801, 146148, 145061, 144525, 144110, 143617, 143165, 142739, 142242, 142013, 142731, 144469, 146392, 147827, 149220, 151520, 154911, 158675, 162023, 164557, 166109, 166714, 166743, 166618, 166384, 165942, 165612, 166005, 167327, 169117, 170696, 171702, 172294, 173092, 174651, 176708, 178202, 178382, 177579, 176440, 174807, 172086, 168453, 164873, 161980, 159663, 157805, 156643, 156222, 156098, 155814, 155227, 154276, 152913, 151380, 150060, 148982, 147910, 146916, 146355, 146317, 146696, 147719, 149659, 151958, 153469, 153833, 153860, 154320, 155112, 155970, 157138, 158812, 160573, 162005, 163373, 165147, 167298, 169558]
56562A69558K392K621K714K947L985N719P147P624P479P118O436N419M558M109
56548B39826L626K727J804J409J462J487J320J064O57j22j281k509l407l680l272
56533B41111k500j911j831k155k553k833l082l518m138m521m172l196k305k017
56519B00379k118k158k076k070k187k376k619k747k517k146k162k358j748j43
56505A70954J089P46m59j015q56j074j783j888r74rK30J63M03P97R35P99M51j76
56487A68333q28j039q64p63o78j18O81P64j1o21m84k81n64o94PR55J244J052J079
56468A67170J204Q36K05J41P12J091Q33L94K88M42O21Q73J252J494J303P74L15
56451A79948K24L52K76j76n99m06M32J308J680J592J341R78L65m10r40q81l07
$$ y = [169558, 171950, 174571, 177285, 180232, 184217, 189936, 197083, 204707, 212186, 219304, 225740, 231159, 235717, 239826, 243452, 246179, 247983, 249392, 250854, 252341, 253661, 254725, 255382, 255260, 253979, 251470, 248063, 244383, 241111, 238611, 236700, 234869, 232714, 230161, 227328, 224246, 220728, 216590, 212069, 207897, 204701, 202396, 200379, 198261, 196103, 194027, 191957, 189770, 187394, 184775, 182028, 179511, 177365, 175203, 172845, 171097, 170954, 172043, 172789, 172330, 171315, 170459, 169385, 167602, 165714, 164740, 164731, 164961, 165124, 165527, 166324, 167259, 168058, 168509, 168333, 167505, 166466, 165602, 164839, 164161, 164043, 164724, 165488, 165477, 164856, 164372, 164091, 163527, 162833, 162840, 163795, 165039, 166091, 167170, 168374, 169210, 169415, 169556, 170268, 171359, 172192, 172586, 172874, 173316, 173937, 174810, 176062, 177556, 178859, 179633, 179948, 180172, 180524, 180800, 180624, 180025, 179619, 180051, 181359, 183039, 184631, 185972, 186950, 187315, 186905, 185965, 185084, 184777]
56434A84777L09N64N87P79J052P71k88j292j257k60Q32J545K018K223J868J124
56418A95352O11N40N31M02M03N65N54L67M18P08O38rn93m78K43J123J849K086
56400B05310J460K26o89o33J09Q97J405J557J302Q35N22L68P6k36l5P08J367J669
56382B16218K118K971L579L308K473J781J326P60P6l57l07J42P90J484K221L059
56366B41642L719L491K162P50M82J120J310N53k65n18p30j386k001k021j717j462
56350B45129j006j23P82J395K035K827L156K640J924J741J855J673J336J426K038
56335B68828K758L186L006K102R64L72K98j43j296k356k596k268j796j080j67
56320B69812L61L84O22J355J753J312Q39J078J408R92K48J1Q2k01o33n46N2P54
$$ y = [184777, 185086, 185650, 186237, 187016, 188068, 188839, 188551, 187259, 186002, 185742, 186574, 188119, 190137, 192360, 194228, 195352, 195963, 196503, 197034, 197436, 197839, 198404, 198958, 199325, 199743, 200451, 201089, 201080, 200487, 200009, 200252, 201375, 203224, 205310, 206770, 206996, 206307, 205674, 205783, 206680, 208085, 209642, 210944, 211779, 212301, 212669, 212745, 212509, 212474, 213182, 214549, 216218, 218336, 221307, 224886, 228194, 230667, 232448, 233774, 234534, 234610, 234253, 233946, 234088, 234878, 236362, 238583, 241642, 245361, 248852, 251014, 251764, 252246, 253366, 254676, 255229, 254964, 254446, 253716, 252330, 250329, 248308, 246591, 245129, 244123, 244000, 244782, 246177, 248212, 251039, 254195, 256835, 258759, 260500, 262355, 264028, 265364, 266790, 268828, 271586, 274772, 277778, 279880, 280844, 281216, 281514, 281371, 280075, 277719, 275123, 272855, 271059, 269979, 269812, 270173, 270557, 271179, 272534, 274287, 275599, 276438, 277516, 278924, 279916, 280164, 280175, 280257, 280056, 279423, 278877, 278929, 279683]
56302B79683J510K186K147J273N81P71J068O28R3L92R82Q10K27L07R20J192J291
56285B96061J958K633K004L43n41J83J434K039J988J647J075N53O24J241J755
56270C14997J931K092K256K044J551J359J687K228K807L394L643L304K919L254
56256C49466M200N003N317N231M698L909L746M750O032O402O169O507P465P973
56242D26868P693P399P483P519P372P463P689P305O124M875M053L348K398J355
56228E08944N83K85M29N32j46j646l033l669m038m609m798m090l256l155l225
56213D75108k591j789j780k070j554o39n35r89o96L51R73J005J387K109K099J290
56197D71679Q49J174J458J419J713K393K726K678K966L445L224K427K104K260
$$ y = [279683, 281193, 283379, 285526, 286799, 287380, 288151, 289219, 289847, 289940, 290332, 291314, 292124, 292351, 292658, 293578, 294770, 296061, 298019, 300652, 302656, 302999, 302458, 302641, 304075, 306114, 308102, 309749, 310824, 311377, 312001, 313242, 314997, 316928, 319020, 321276, 323320, 324871, 326230, 327917, 330145, 332952, 336346, 339989, 343293, 346212, 349466, 353666, 358669, 363986, 369217, 373915, 377824, 381570, 386320, 392352, 398754, 404923, 411430, 418895, 426868, 434561, 441960, 449443, 456962, 464334, 471797, 479486, 486791, 492915, 497790, 501843, 505191, 507589, 508944, 509527, 509812, 510241, 510773, 510627, 508981, 505948, 502279, 498241, 493632, 488834, 484744, 481488, 478333, 475108, 472517, 470728, 468948, 466878, 465324, 464685, 464150, 463161, 462465, 462816, 463789, 464794, 466181, 468290, 470389, 471679, 472528, 473702, 475160, 476579, 478292, 480685, 483411, 486089, 489055, 492500, 495724, 498151, 500255, 502515]
56183E02515J808P11K87J070K116K719L117L289K840K310K763L830M066L382L149
56168E39972L655L663K869K558L170L466K945K909M180N661O199O164O178O060
56154E99649N868O379P630Q584Q988R922J1713J3121J3440J3702J4868J6531J8342
56141G48737K1016K4807K8620L1724L5017L9548M5088N1075N7757O5496P3996
56130A222881Q2730R0997R7213R9524R7497R1994Q3506P2367O0519N0848M4336
56119B094412L9754L6153L3293K9584K2564J2316J894o479j3157j8484k1584k3080
56107B187186k6224l3502m4115n5982o7825p8061q4230q5358q2919p8201p0874
56096A479895o1395n2170m4775l8219l1566k5864k1891j8406j4434j1034r035
$$ y = [502515, 504323, 505034, 505321, 506391, 508507, 511226, 514343, 517632, 520472, 522782, 525545, 529375, 533441, 536823, 539972, 543627, 547290, 550159, 552717, 555887, 559353, 562298, 565207, 569387, 575048, 581247, 587411, 593589, 599649, 605517, 611896, 619526, 628110, 637098, 647020, 658733, 671854, 685294, 698996, 713864, 730395, 748737, 769753, 794560, 823180, 854904, 889921, 929469, 974557, 1025632, 1083389, 1148885, 1222881, 1305611, 1396608, 1493821, 1593345, 1690842, 1782836, 1866342, 1938709, 1999228, 2050076, 2094412, 2134166, 2170319, 2203612, 2233196, 2255760, 2268076, 2269970, 2263491, 2250334, 2231850, 2210266, 2187186, 2160962, 2127460, 2083345, 2027363, 1959538, 1881477, 1797247, 1711889, 1628970, 1550769, 1479895, 1418500, 1366330, 1321555, 1283336, 1251770, 1225906, 1204015, 1185609, 1171175, 1160141, 1151106]
56085A151106p218m614k333j332m95J185K739L335M141O101P972Q509Q577R281
56071A186954R987R991J0164J1219J2351J3151J4636J6891J8158J7875J8045J9843
56059A359265K1550K1710K1580K2372K2916K2220K1648K2296K2878K2388K2074
56048A602897K2653K2464K0703J9499K0353K1568K1684K2251K4570K6919K7810
56037A853371K8804L1230L3341L3722L4202L6326L8365L8871L9661M1971M3418
56026B253282M2404M1799M4357M8121N0313N2048N5030N7364N7168N6829N9115
56015B817830O2534O5006O8349P4413Q0492Q3721Q6400R1846R8503J03298J07221
56004C739613J12325J17033J19816J23602J30982J39083J44849J51030J60921
$$ y = [1151106, 1143888, 1139274, 1136941, 1135609, 1135114, 1136299, 1139038, 1142373, 1146514, 1152615, 1160587, 1169096, 1177673, 1186954, 1196941, 1206932, 1217096, 1228315, 1240666, 1253817, 1268453, 1285344, 1303502, 1321377, 1339422, 1359265, 1380815, 1402525, 1424105, 1446477, 1469393, 1491613, 1513261, 1535557, 1558435, 1580823, 1602897, 1625550, 1648014, 1668717, 1688216, 1708569, 1730137, 1751821, 1774072, 1798642, 1825561, 1853371, 1882175, 1913405, 1946746, 1980468, 2014670, 2050996, 2089361, 2128232, 2167893, 2209864, 2253282, 2295686, 2337485, 2381842, 2429963, 2480276, 2532324, 2587354, 2644718, 2701886, 2758715, 2817830, 2880364, 2945370, 3013719, 3088132, 3168624, 3252345, 3338745, 3430591, 3529094, 3632392, 3739613, 3851938, 3968971, 4088787, 4212389, 4343371, 4482454, 4627303, 4778333, 4939254]
55995D939254J71820J80188J88663K00915K14242K24614K34480K47972K63001
55986F865149K76084K90260L09991L32979L55467L80602M12696M48656M84464
55977A0156348N24443N74025O29426O85422P47136Q22442R09054J001730J105886
55968A7155912J230907J376725J541333J734651J970238K251167K580629K978407
55960C2819969L469843M068408M788500N663606O728889P998309R485618J1236067
55952H6259209J3309475J5745131J8562630K1746542K5151779K8424518L1054945
55945B40254229L2443496L1805103K8119025K0574099R433104l522297j5646170
55938C43460589k4761249l0045053l1900484l1266230k9083365k6115025k2911323
$$ y = [4939254, 5111074, 5291262, 5479925, 5680840, 5895082, 6119696, 6354176, 6602148, 6865149, 7141233, 7431493, 7741484, 8074463, 8429930, 8810532, 9223228, 9671884, 10156348, 10680791, 11254816, 11884242, 12569664, 13316800, 14139242, 15048296, 16050026, 17155912, 18386819, 19763544, 21304877, 23039528, 25009766, 27260933, 29841562, 32819969, 36289812, 40358220, 45146720, 50810326, 57539215, 65537524, 75023142, 86259209, 99568684, 115313815, 133876445, 155622987, 180774766, 209199284, 240254229, 272697725, 304502828, 332621853, 353195952, 362629056, 359106759, 343460589, 318699340, 288654287, 256753803, 225487573, 196404208, 170289183, 147377860]
55931A47377860j9798756j6932443j4387282j2197447j0347485q788809p480550
55924E7445088o395608n497401m741966m102137l566626l118003k732573k398960
55916B4891814k116717j878097j668317j481792j321796j185604j064429r56158
55908A3218904q64310p85987p13565o46574n89904n42053m96667m53843m18715
55899G707286l90296l62450l34502l10728k90611k69480k47740k29929k15471
55890E056079j99324j80991j64354j49515j33029j15300r9582q4503o5614m3561
55880C820306k2983m207J6049L6266N0078N4295M9638L4205M398l6864q0023j17840
55868C803318j48563j70545j80951j80864j75267j66731j54412j39612j26405
$$ y = [147377860, 127579104, 110646661, 96259379, 84061932, 73714447, 64925638, 57445088, 51049480, 45552079, 40810113, 36707976, 33141350, 30023347, 27290774, 24891814, 22775097, 20897000, 19228683, 17746891, 16425095, 15239491, 14175062, 13218904, 12354594, 11568607, 10855042, 10208468, 9618564, 9076511, 8579844, 8126001, 7707286, 7316990, 6954540, 6620038, 6309310, 6018699, 5749219, 5501479, 5271550, 5056079, 4856755, 4675764, 4511410, 4361895, 4228866, 4113566, 4013984, 3929481, 3863867, 3820306, 3797323, 3793116, 3809165, 3845431, 3895509, 3949804, 3999442, 4033647, 4038045, 4001181, 3921158, 3803318, 3654755, 3484210, 3303259, 3122395, 2947128, 2780397, 2625985, 2486373, 2359968]
55859B359968j15957j05730r5126q6575q0316p3411o5010n7723n2717m8116m3166
55848A536121l9614l7962l6419l4334l2864l1768k9382k6101k4020k3045k1196
55837A199416j8730j7881j8508j8161j6621j6201j7319j7909j7462j7564j8208
55826A004852j7678j6368j6452j7554j6961j4630j3585j4685j5381j4550j4187
55815H32821j5075j5001j2790j0381r275q304o431m597l456k093k54R03J152J551
55801G48770J869O52j522k112o41N77N42J031K901M357M257M037M849N597N205
55786G80369M220K928M47l065n889p653j0234j4582j9068k2084k3870k4727k3960
55773F32832k1735j9560j7744j4781j0315o273l934k401j143j405l658o040o912
$$ y = [2359968, 2244011, 2138281, 2043155, 1956580, 1876264, 1802853, 1737843, 1680120, 1627403, 1579287, 1536121, 1496507, 1458545, 1422126, 1387792, 1354928, 1323160, 1293778, 1267677, 1243657, 1220612, 1199416, 1180686, 1162805, 1144297, 1126136, 1109515, 1093314, 1075995, 1058086, 1040624, 1023060, 1004852, 987174, 970806, 954354, 936800, 919839, 905209, 891624, 876939, 861558, 847008, 832821, 817746, 802745, 789955, 779574, 770299, 761995, 755564, 750967, 747511, 745418, 745164, 746067, 747219, 748770, 750639, 751291, 749769, 747657, 747016, 747593, 748135, 749166, 752067, 756424, 760681, 764718, 769567, 775164, 780369, 784589, 787517, 787964, 784899, 779010, 771357, 761123, 746541, 727473, 705389, 681519, 656792, 632832, 611097, 591537, 573793, 559012, 548697, 542424, 538490, 536089, 534946, 533541, 529883, 523843, 516931]
55760E16931o880o885o432n138m052l933m047l895m338n797p225q064r257j1131
55746D29857j2196j1464j0097r363q691p178n418m364l781l123k693k775k826
55733C45888k480k135j812r14K66L51j004k461l159l784m761n243m875m728n372
55718C03777n710m897l801l392l109k090o79L88J125J754K136K447L155L818L260
55703B98182J476j90j171k268l701m547m726n497p058p811o965n863n573n243
55689B39045m131l271l585m053l381j979q68o2O51P45J66Q0J097K123K109J516
55673B26202Q74m63k725m440m377l443l135l360l205k705k322j781q68l11n84
55658A93357q54l67K43K39J81Q04J653K115K625L539M014L370K445K308K683K934
$$ y = [516931, 510051, 503166, 496734, 491596, 487544, 483611, 479564, 475669, 471331, 465534, 458309, 450245, 440988, 429857, 417661, 406197, 396100, 386737, 378046, 370868, 365450, 361086, 357305, 354182, 351489, 348714, 345888, 343408, 341273, 339461, 338547, 338813, 339164, 338160, 335699, 332540, 328756, 323995, 318752, 313877, 309149, 303777, 298067, 293170, 289369, 285977, 282868, 280778, 280099, 280487, 281612, 283366, 285502, 287949, 291104, 294922, 298182, 299658, 299468, 298297, 296029, 292328, 287781, 283055, 277558, 270500, 262689, 255724, 249861, 244288, 239045, 234914, 231643, 228058, 224005, 220624, 218645, 217777, 217715, 218366, 219111, 219277, 219357, 220454, 222577, 224686, 226202, 227076, 226613, 223888, 219448, 215071, 211628, 208493, 205133, 201928, 199223, 196901, 195120, 194252, 193941, 193357, 192503, 192136, 192379, 192618, 192799, 193603, 195256, 197371, 199996, 203535, 207549, 210919, 213364, 215672, 218355, 221289]
55642B21289L362M098L989K201j11j309j559k094l119l939m401m756m858m667
55628B04126m785n299n122l680k205j918k090j345J01J070J429J863K492L085
55614A87722L828M475L765J227j442k461k495l273m679n256m860m672m870m415
55600A62594l020j578o10O6K53m41j386j412n78J0Q6M69J411K120K184K153K488
55583A64809K967L359L714L860L528L090L349M537O185P944R831J1740J3459J5050
55569B57422J6685J8190J9203J9439J8333J5034R472K969k877p582j1580j5215
55557C39493j8474k1067k2253k1323j8846j6504j5118j3833j1942j0197r310q509
55545A52117o936n342m819m855m252l169k637k646k453k215k646l401l460k866
$$ y = [221289, 224651, 228749, 232738, 234939, 234828, 233519, 231960, 229866, 226747, 222808, 218407, 213651, 208793, 204126, 199341, 194042, 188920, 185240, 183035, 181117, 179027, 177682, 177783, 178853, 180282, 182145, 184637, 187722, 191550, 196025, 199790, 201017, 199575, 197114, 194619, 191346, 186667, 181411, 176551, 171879, 167009, 162594, 159574, 157996, 157386, 157452, 157705, 157264, 155878, 154466, 153888, 153898, 153984, 154453, 155864, 157984, 160168, 162321, 164809, 167776, 171135, 174849, 178709, 182237, 185327, 188676, 193213, 199398, 207342, 217173, 228913, 242372, 257422, 274107, 292297, 311500, 330939, 349272, 364306, 373778, 376747, 373870, 366288, 354708, 339493, 321019, 299952, 277699, 256376, 237530, 221026, 205908, 192075, 180133, 169936, 160626, 152117, 145181, 139839, 135020, 130165, 125913, 122744, 120107, 117461, 115008, 112793, 110147, 106746, 103286, 100420]
55531A00420k514k485k087j364j055j164j020o58p60j228j236o46r1K73Q35J362
55515H6582J110K31j91L16J097J475J464J294J170J428K166K759K558J846J269
55500A06574P82M3n88n15ML01M83J045J705J785J318P07j92j442k112j434k95
55483A08169p8n42n05o8k64q44n68L78M54m49n34R34K233J661j87j633k015j624
55465A04518p26L21Q36N77J22oM1J32M88R62Q78J16m78l07P5j33p85j094o57K26
55445A05106R89J278J196J123J114Q06J56k19l0L3n85j254j177q15j035j463j102
55428A04121j41M20O29J325K197J887K91j018r58r3P40J532K355K916L207L482
55412A22892L358K275R02N36R34M62j231k535k447k002k253k613k291j835j997
$$ y = [100420, 97906, 95421, 93334, 91970, 90915, 89751, 88731, 88073, 87313, 86085, 84849, 84203, 84112, 84385, 85220, 86582, 87692, 87923, 87732, 88048, 89145, 90620, 92084, 93378, 94548, 95976, 98142, 100901, 103459, 105305, 106574, 107356, 107399, 106811, 106296, 106300, 106601, 107084, 108129, 109834, 111619, 112937, 113644, 113452, 112010, 109898, 108464, 108169, 108091, 107549, 107044, 106976, 106712, 105868, 105300, 105678, 106132, 105683, 105149, 106083, 108316, 109977, 109790, 108157, 106142, 104518, 103792, 104113, 104949, 105526, 105648, 105642, 105683, 105815, 106303, 107265, 108143, 108259, 107781, 107474, 107549, 107416, 106631, 105537, 104880, 105106, 106095, 107373, 108569, 109692, 110806, 111612, 111768, 111549, 111519, 111552, 110967, 109713, 108536, 107721, 106686, 105223, 104121, 103980, 104400, 105029, 106354, 108551, 110438, 110729, 109711, 108753, 108660, 109400, 110932, 113287, 116203, 119410, 122892, 126250, 128525, 129427, 129963, 130897, 131359, 130128, 127593, 125146, 123144, 120891, 118278, 115987, 114152, 112155]
55397A12155k289j950j328j151j293j283j209j206r18l39k52r20j375q86j58l8
55381I5560m9N39J132P11l55q10m49k16n64r65r73p94o04j90N90J496K103K043
55363I8205J250K18k29J79Q63J180J110Q42L01m59q86n34L06R47J042O80J42k02
55345A04955j38Q0J07J74P28J396J220J41p37p42n16p62j089q01q1L55K28k41
55327A04277p32q13j60Q63J385J119N50j20j123j958j473K51J403P87n52j110
55311A02594j041j181j108P3J697K148J257M46N14P58M55j20m81p04r91j222j234
55294A01860r86l86M65R90P90M12O87J391J480O65j34j95J25K26K24N28J004J172
55276A10318R00M71Q9k75o17q07p42n02k31lJ76K80K34N5j20k22l61n57n22rP53
$$ y = [112155, 109866, 107916, 106588, 105437, 104144, 102861, 101652, 100446, 99528, 99189, 98937, 98017, 96642, 95756, 95598, 95560, 95511, 96050, 97182, 97893, 97538, 96728, 96279, 96063, 95499, 94534, 93561, 92767, 92163, 91973, 92563, 94059, 96162, 98205, 99455, 99673, 99444, 99623, 100486, 101666, 102776, 103618, 103919, 103460, 102574, 102040, 102346, 103293, 104335, 105015, 105157, 104955, 104817, 104897, 105004, 105178, 105906, 107302, 108522, 108663, 107926, 107184, 106668, 105906, 104817, 104016, 103935, 104290, 104518, 104277, 103545, 102732, 102572, 103435, 104820, 105939, 106489, 106369, 105246, 103288, 101815, 102066, 103469, 104256, 103704, 102594, 101553, 100372, 99264, 99337, 101034, 103182, 104439, 104885, 105399, 106157, 106612, 106492, 106011, 105307, 104316, 103094, 101860, 100874, 100488, 100953, 101943, 102733, 103145, 103832, 105223, 106703, 107368, 107234, 107039, 107164, 107390, 107614, 108142, 109146, 110318, 111218, 111689, 111778, 111503, 110886, 110079, 109337, 108835, 108604, 108601, 108777, 109057, 109291, 109346, 109226, 109004, 108643, 108086, 107564, 107555, 108308]
55255A08308J281J435J387J110M06n12j030q31k11M02P98Q06K58o71j487j816
55239A09633j580q71m4K82o8l57O6O15K10r77j687j405q37m84q0L11J22l72m0
55220A02437J143J645P05l48k09L90J98l22K5R23J028K42k22J57O79P76O18L28
55202A10193k16p11o35j25J66J21J66L72L89K42L61Q10J215J380J296P15m60j633
55184A13646k051j775j306o51L66J171R47j9n34j15N71Q89R02P80M60M7j96l55
55166A12777n79m00P21K211K737J982J017P21P87O67N02N64O11L73Q8M6M0k28
55148A24637p17j313k072k776k805j923q21l59n50o94l95j3j35q19j496j582j138
55131A05029o74l44K77J288J880J278n5r06p85k11L24P89J003N71l03p13j90O97
$$ y = [108308, 109589, 111024, 112411, 113521, 113927, 113415, 112385, 111554, 111343, 111745, 112543, 113349, 113607, 112936, 111449, 109633, 108053, 107182, 107138, 107420, 107352, 106995, 107061, 107676, 107886, 106909, 105222, 103817, 102980, 102496, 102416, 102727, 102849, 102477, 102437, 103580, 105225, 105930, 105582, 105373, 105763, 105961, 105639, 105664, 106587, 107615, 107857, 107635, 107792, 108471, 109247, 109865, 110193, 109977, 109266, 108631, 108506, 108672, 108793, 108959, 109331, 109720, 109962, 110323, 111133, 112348, 113728, 115024, 115739, 115279, 113646, 111595, 109820, 108514, 107863, 108229, 109400, 110347, 110328, 109794, 109679, 110250, 111139, 112041, 112821, 113281, 113328, 113132, 112777, 112198, 111798, 112519, 114730, 117467, 119449, 120466, 121187, 121974, 122641, 123143, 123707, 124318, 124691, 124779, 124825, 124865, 124637, 123920, 122607, 120535, 117759, 114954, 113031, 112210, 111851, 111301, 110607, 110212, 110199, 110064, 109245, 107749, 106167, 105029, 104355, 104011, 104288, 105576, 107456, 108734, 108679, 107773, 106988, 106777, 107101, 107890, 108893, 109464, 109161, 108448, 108258, 108955]
55113A08955J214J347J408J360R83L71j82m60k59N49J550J902J322N41L00L49
55097A21250Qo30q33m73k63o28j027q48m14m47q25o99J35P17K58o76r36m28r3
55078A13148l76o77n45m79r23j275p01M20Q33J34o60m22P23J681J598N73o84j554
55060A10814j790j327k09J118J792J389N94L88O23L31n08o89L08J167N43r14j442
55043A12188o06M16P25O37P18R65J190J410J502J135L34l88o33m26M9O07Q73N20
55025A21216k54q72j046r14o08j63J58M3l85o73o43m09O5Q61J594J580P37k27
55007A20060n76k40L20N99M41J83K86O48N90j72r77j076n40K11J179K244K527
54990A25707J416j03m40M15R33L53m13m37p4k0j60m1L27P91J430J999J702K70
$$ y = [108955, 110169, 111516, 112924, 114284, 115267, 115638, 115456, 114996, 114737, 115286, 116836, 118738, 120060, 120601, 120901, 121250, 121258, 120628, 119795, 119322, 119059, 118431, 117404, 116556, 116142, 115695, 114870, 114171, 114306, 115023, 115281, 114605, 113669, 113241, 113148, 112772, 112095, 111550, 111071, 110148, 108873, 108172, 108592, 109425, 109559, 108899, 108477, 109200, 110881, 112479, 113052, 112368, 110814, 109024, 107697, 107488, 108606, 110398, 111787, 112381, 112769, 113392, 113723, 113215, 112526, 112834, 114001, 114544, 113630, 112188, 111582, 111998, 112723, 113360, 114078, 115043, 116233, 117643, 119145, 120280, 120614, 120226, 119593, 119167, 119216, 119823, 120696, 121216, 120962, 120090, 119044, 118130, 117522, 117359, 117517, 117560, 117175, 116502, 115859, 115450, 115515, 116376, 117970, 119550, 120287, 120060, 119484, 119244, 119564, 120163, 120604, 120787, 121073, 121721, 122311, 122139, 121162, 120086, 119546, 119757, 120936, 123180, 125707, 127123, 127020, 126580, 126995, 127928, 128281, 127868, 127431, 127357, 127337, 127177, 127136, 127463, 128254, 129684, 131683, 133385, 133655]
54972A33655j288j715r61j4M03L61K18J84L05M58L92N9j98m7L95P06O92N62O45
54953A34812R91J294J269J065J029J000K51j401k900l001j735k59N79P78N51J2
54937A34335m74m66j02J19K82Q88J756J985J294N35M57Q13J142J644K614L615
54921A50437L900L424K920L132M227N697O767P132P342P958Q509P925O030L753
54907B29153J718m46l047n533p309q427q979q511o928n160m175l789l295k769
54893A62503k791l205l150k321j351p97m85j02J92Q3k04p3O64J440J627J472J901
54876A55403L271M821N748O289P039P693P459O572O111O221N795M247K388Q93
54862B29950q15l312n806p149p403p247o601n160l747l620m557n039m379l462
$$ y = [133655, 132367, 130652, 129691, 129677, 130080, 130441, 130659, 130843, 131148, 131606, 131998, 132057, 131859, 131812, 132207, 132913, 133605, 134167, 134812, 135803, 137097, 138366, 139431, 140460, 141460, 141711, 140310, 137410, 134409, 132674, 132415, 132994, 133772, 134323, 134335, 133861, 133395, 133293, 133412, 133694, 134582, 136338, 138323, 139617, 140152, 140609, 141422, 142564, 144208, 146822, 150437, 154337, 157761, 160681, 163813, 168040, 173737, 180504, 187636, 194978, 202936, 211445, 219370, 225400, 229153, 230871, 230425, 227378, 221845, 214536, 206109, 197130, 188619, 181691, 176531, 172356, 168567, 165272, 162503, 159712, 156507, 153357, 151036, 149685, 148888, 148403, 148301, 148493, 148576, 148372, 148299, 148963, 150403, 152030, 153502, 155403, 158674, 163495, 169243, 175532, 182571, 190264, 197723, 204295, 210406, 216627, 222422, 226669, 229057, 229950, 229135, 225823, 220017, 212868, 205465, 198218, 191617, 186457, 182710, 179090, 174533, 169494, 165115, 161653]
54848A61653l103k940k497k185k484k892k675k104k059k526k461j270L13J178
54834A33948J081N10k63j267k160k220j272nR15J510J889J632N35n80o84L3M87
54817A34089L45L48R10J420J234N53j16n63o27p5P87J114N82j55m37l73k95j78
54799A38563q6l63q82q75j25N01M10K67P73J336J062L34J60M39K89k34j63O33
54781A42039J077N78j28k34K7O1o6J38Q21J778K781L621M065M111M022M051M313
54764A73055M928N851O605O681O336O432P250P912P356N580L520J820J74k016
54750B41484m611o690p589p662p692p739p167n858m673m314m271l538k024o13
54736A67043o5m29j354k356k783k142o66Q38J703J763J155L03o3N84J931L101
$$ y = [161653, 158550, 155610, 153113, 150928, 148444, 145552, 142877, 140773, 138714, 136188, 133727, 132457, 132770, 133948, 135029, 135539, 135276, 134009, 131849, 129629, 128357, 128352, 129267, 130777, 132666, 134298, 134833, 134253, 133569, 133602, 134089, 134434, 134782, 135692, 137112, 138346, 138899, 138783, 138220, 137593, 137518, 138305, 139419, 140001, 139846, 139409, 139036, 138741, 138563, 138477, 138114, 137232, 136357, 136232, 136733, 137143, 137410, 138183, 139519, 140581, 140915, 141075, 141514, 141803, 141569, 141406, 142039, 143116, 143694, 143566, 143332, 143359, 143420, 143354, 143492, 144313, 146091, 148872, 152493, 156558, 160669, 164691, 168742, 173055, 177983, 183834, 190439, 197120, 203456, 209888, 217138, 225050, 232406, 237986, 241506, 243326, 243500, 241484, 236873, 230183, 222594, 214932, 207240, 199501, 192334, 186476, 181803, 177489, 173218, 169680, 167656, 167043, 166978, 166549, 165195, 162839, 160056, 157914, 157248, 158086, 159789, 161552, 162707, 163010, 162947, 163531, 165462, 168563]
54720A68563L671M022M636N429N948N907N401M772M316L954L177J539p71l026
54706B17538m629n571o238o889p279o806n240l316k176k115k316j998j338q79
54692A60748o46m60n57j142j649j345m94j07n62j236j588j740j848j659j091n95
54676A44029n56p33o75l21J51O76J154J263Q08J40j62O2M01M03L6l49m13j52J19
54657A45881R6k03m93m54k0M93N42r8r16j102n16M7j50q88j281p97L33J369J593
54638A43436Q72k0k3R09J576J052o0m91l6M00K18k59n70o61m99M9P18Q36J35q81
54618A46701j639k030k086j632o58L45Q81J011J111J226J082O21K57M22J013J394
54602A48019J045K13k80P6R58J620J631J060K70k15J1P36J148Q00K37J91M72K92
$$ y = [168563, 172234, 176256, 180892, 186321, 192269, 198176, 203577, 208349, 212665, 216619, 219796, 221335, 220564, 217538, 212909, 207338, 201100, 194211, 186932, 180126, 174886, 171570, 169394, 167279, 164963, 162965, 161627, 160748, 160102, 159642, 159085, 157943, 156294, 154949, 154455, 154348, 153786, 152550, 150962, 149222, 147374, 145715, 144624, 144029, 143473, 142740, 142065, 141744, 141895, 142571, 143725, 144988, 145796, 145936, 145774, 145836, 146237, 146640, 146676, 146327, 145914, 145762, 145881, 145977, 145774, 145281, 144827, 144807, 145300, 145842, 145744, 144828, 143726, 143210, 143257, 143107, 142219, 140938, 140141, 140474, 141843, 143436, 144308, 144288, 144265, 145174, 146750, 147802, 147742, 147251, 147215, 147615, 147833, 147574, 147004, 146343, 145844, 145893, 146611, 147447, 147582, 146701, 145062, 143032, 140946, 139314, 138656, 139001, 139882, 140893, 142004, 143230, 144312, 144933, 145190, 145612, 146625, 148019, 149064, 149277, 148997, 149073, 150031, 151651, 153282, 154342, 154612, 154397, 154408, 155144, 156292, 157092, 157329, 157520, 157992, 158284]
54584A58284m67j059r46m30m0J06J12kj60j59O4L23M40L47l8o71j102q12J40J123
54564A55053J657J724J395P02p4m54l63j77p5J62N24N36Km76k08O11J070O28l41
54545A61896r93p96Q3J020J517J582J532J558J670J820J849J458O73K03P54J939
54529A77765K462J632J93o77p21n82p14q82o33MM87L04m29j029r49l86J11M29
54511A76385Q40J227R94L1q12p32j01J8o86j375j198l52K46K9o94j162q75O8J139
54492A72990J812J931J660J132L21n81r41l03P87J144M34k56J76J362K077J997
54476A85742J941K428L003L176L071K820K174J245Q09J290K100K517K535K292
54462B17143J497K33n22j21O05M70l65r18j043j294j492q54M49J226Q76Jp50j314
$$ y = [158284, 157817, 156758, 155812, 155382, 155342, 155448, 155560, 155558, 155398, 155239, 155303, 155626, 156066, 156413, 156375, 155704, 154602, 153790, 153930, 155053, 156710, 158434, 159829, 160531, 160457, 160003, 159640, 159463, 159388, 159550, 160074, 160610, 160612, 160136, 159928, 160539, 161609, 162237, 161896, 160903, 160107, 160190, 161210, 162727, 164309, 165841, 167399, 169069, 170889, 172738, 174196, 174869, 175072, 175826, 177765, 180227, 181859, 182052, 181375, 180654, 180072, 179358, 178476, 177843, 177847, 178334, 178638, 178209, 177180, 176231, 175845, 175956, 176385, 177225, 178452, 179446, 179477, 178665, 177933, 177832, 177850, 177164, 175789, 174591, 174239, 174485, 174514, 173820, 172658, 171783, 171851, 172990, 174802, 176733, 178393, 179525, 179846, 179265, 178324, 178021, 178808, 179952, 180386, 180130, 180306, 181668, 183745, 185742, 187683, 190111, 193114, 196290, 199361, 202181, 204355, 205600, 206409, 207699, 209799, 212316, 214851, 217143, 218640, 218873, 218351, 218230, 218835, 219305, 218940, 218022, 216979, 215685, 214193, 213339, 213788, 215014, 215890, 215891, 215141, 213827]
54444B13827j571j185m19m9j77j21K35J07p76j556j574j305j332j326q13j53L9
54427B01851j96n34j065j796k075j374k99K2n71j120p75L19J332J547Q93j5m46
54410A95698k87r4l30q46j203j123n95J04M83M13N20J388K435K446J332L69L83
54393B01093P06M92N1J21N87P83N36J59j88m23k93J42J99n84j695k290k173j598
54375A95625o86K96O69J73l79j68L86L47j68k12M79J201J502J597J583J145L21
54358B03711k83k96K6L78O58N36m80k176l478l527k555j427p60o79r74j160p74
54341A86740P9O46L13o95j570j756j444j287j712k432k690k111j123m03r9Q8K56
54324A70800J97j22m28n30m73k86R7N36O91M38Q9N9M59J048J424J301P61K11n8
$$ y = [213827, 212256, 211071, 210652, 210603, 210426, 210305, 210540, 210647, 209871, 208315, 206741, 205436, 204104, 202778, 201965, 201812, 201851, 201655, 201121, 200056, 198260, 196185, 194811, 194512, 194534, 193963, 192843, 192068, 192387, 193719, 195266, 196159, 196144, 195698, 195411, 195317, 194987, 194141, 192938, 191815, 191220, 191324, 191807, 192220, 192740, 194128, 196563, 199009, 200341, 200710, 201093, 201799, 202291, 202342, 202463, 203050, 203833, 204369, 204528, 204340, 203917, 203624, 203766, 203965, 203381, 201686, 199396, 197223, 195625, 194939, 195235, 195904, 196077, 195698, 195530, 195916, 196263, 196095, 195883, 196362, 197563, 199065, 200662, 202245, 203390, 203711, 203428, 203132, 203158, 203536, 204194, 204730, 204250, 202074, 198596, 195069, 192514, 191087, 190327, 189648, 188674, 187514, 186740, 186819, 187465, 187778, 187083, 185513, 183757, 182313, 181026, 179314, 176882, 174192, 172081, 170958, 170555, 170456, 170544, 170800, 170997, 170875, 170447, 169917, 169444, 169158, 169255, 169791, 170482, 170920, 171009, 171068, 171527, 172575, 173999, 175300, 176061, 176272, 176214]
54305A76214j89l73l91R4Q12J002L91l51l87K78R58J203J179J148R27J98q36j502
54287A80375j457j136j131j367j333r76q28j118j344r80j99M52P12N80L9o73p73
54270A68843L52K057K753J598m12j450q01N19J089O15q9m20o43j102j349p20N24
54253A71364J325J156N26R4j18k84k68j1O3m12j056j108l66O10J136R74L84j86
54235A73823n33r03j524j978j581m70L26K09k37l10k65o94j274j131j76P08Q51
54218A64841M58Jl98q06j138j224r80m22K43N91L00m95j291j591j121PJ143J468
54200A59586Q61J18J0L99O97P50P52O25J58l96n10j60J18p5o44j272j622j332
54182A58063m44L52L36l12p59o06k08O6K95O11Q95J021J050R62N81j03q29j370
$$ y = [176214, 176025, 175652, 175261, 175355, 176167, 177169, 177560, 177209, 176822, 177100, 178058, 179261, 180440, 181588, 182515, 182713, 181877, 180375, 178918, 177782, 176651, 175284, 173951, 172975, 172147, 171029, 169685, 168705, 168506, 168958, 169670, 170250, 170289, 169616, 168843, 169195, 171252, 174005, 175603, 175191, 173741, 172940, 173459, 174548, 175163, 175074, 174654, 174011, 172909, 171560, 170840, 171364, 172689, 173845, 174371, 174465, 174347, 174063, 173795, 173784, 173847, 173435, 172379, 171271, 170905, 171515, 172651, 173625, 174009, 173823, 173290, 172387, 170863, 168885, 167304, 166834, 167160, 167369, 167132, 166822, 166557, 165863, 164589, 163458, 163282, 163990, 164841, 165299, 165300, 164902, 164096, 162958, 161734, 160754, 160332, 160575, 161166, 161466, 160971, 159680, 158089, 156968, 156975, 158118, 159586, 160447, 160565, 160575, 160974, 161671, 162421, 163173, 163798, 163956, 163560, 163050, 162890, 163008, 162933, 162289, 161017, 159395, 158063, 157619, 157971, 158307, 157995, 157236, 156630, 156422, 156488, 156783, 157394, 158289, 159310, 160360, 161322, 161903, 161800, 160971, 159601]
54164A59601j663j627j165m08L61R82J384J341P24m5k99MJ99j26n27l26M63J160
54146A60033J211P15K43L11R08J510J586J121N37J52j35m87p53n65J39Q98J157
54129A68581Q76N03L11M7n04r64q18k75l7k82m60j86L51R53J641K097J718O07
54111A74159k44k75j04l94q21q55p52q26m96P58K003J772J84j114j123m80j36
54094A71256j76k79m56q29j269j571j549r76P7Q80P71K22L84J466K402K254J250
54077A73857J50n49n80J15R55J059M28J38Q40J765J862J273Q99Q74M63o05j515
54060A81429j435o46j53l52o15k72L53M56M2K0Q07J562J356M71j47k27j60M2P53
54041A83284J727K096J593J027J234K162L215L964M281M215L985L771L533L286
$$ y = [159601, 157938, 156311, 155146, 154738, 155099, 156081, 157465, 158806, 159530, 159485, 159186, 159190, 159389, 159263, 158736, 158410, 158873, 160033, 161244, 161959, 162202, 162513, 163421, 164931, 166517, 167638, 168175, 168327, 168192, 167705, 166952, 166387, 166526, 167424, 168581, 169457, 169960, 170271, 170318, 169814, 168850, 168032, 167757, 167720, 167438, 166978, 166792, 167143, 168096, 169737, 171834, 173552, 174159, 173915, 173640, 173536, 173142, 172321, 171466, 170714, 169888, 169392, 170150, 172153, 173925, 174109, 172995, 171872, 171392, 171256, 171080, 170801, 170345, 169516, 168247, 166676, 165127, 164151, 164228, 165108, 165879, 166101, 166485, 167951, 170353, 172607, 173857, 174007, 173458, 172878, 172993, 173948, 175007, 175435, 175573, 176413, 178178, 180040, 181313, 182212, 183086, 183549, 182944, 181429, 179994, 179348, 179195, 178843, 178228, 177956, 178309, 178765, 178807, 178827, 179634, 181196, 182552, 183023, 182876, 182649, 182489, 182531, 183284, 185011, 187107, 188700, 189727, 190961, 193123, 196338, 200302, 204583, 208798, 212783, 216554, 220087, 223373]
54027B23373L368L891M237L785K957K702L019K994K349J844J925J998J539R27
54013B60908O20K81n63j621k232k224j914j636j682k188k759k708k060j710k195
53998B36317k841k680j695o67k71p48j985l347l823k980j462k30L43L21k41r96
53982B13015j183m73L71M27j74n78m81k88j68K68J222K265K820K761K342J941
53966B24087J884K316L104M023N013O207P780R887J2524J5302J7545J8897J9623
53953C48192K0045J9755J7669J2980O044j673q499j3467j6419j7470j6782j4931
53941C35444j2921j1336r812p831n717m232l457k837k158j632j144l09O73J104
53927B73835Q17L78J44K4J59Q30J607J701J416J912L196L762K884J849J949K600
$$ y = [223373, 226741, 230632, 234869, 238654, 241611, 244313, 247332, 250326, 252675, 254519, 256444, 258442, 259981, 260908, 261528, 261809, 261246, 259625, 257393, 255169, 253255, 251619, 249937, 247749, 244990, 242282, 240222, 238512, 236317, 233476, 230796, 229101, 228434, 228163, 227415, 225430, 222083, 218260, 215280, 213818, 213588, 213931, 214252, 214011, 213015, 211832, 211359, 211730, 212157, 211983, 211405, 210924, 210636, 210468, 210736, 211958, 214223, 217043, 219804, 222146, 224087, 225971, 228287, 231391, 235414, 240427, 246634, 254414, 264301, 276825, 292127, 309672, 328569, 348192, 368237, 387992, 405661, 418641, 424685, 423012, 414513, 401046, 384627, 367157, 350375, 335444, 322523, 311187, 301375, 293544, 287827, 283595, 280138, 277301, 275143, 273511, 272367, 272058, 272731, 273835, 274652, 275030, 275174, 275198, 275357, 276187, 277794, 279495, 280911, 282823, 286019, 289781, 292665, 294514, 296463, 299063]
53911B99063K725K739L633M931N276M566L904L676L235K405J847J800J703J331
53897C42834J112J051M66q39k147k929l493m125m463m220l790l584l425l176l306
53882C05966m205n340n832n567n158m922m518l636k537j729j419j451j599j726
53868B56327j682j328p61l69m68r63j527k001k366k474k185j764j670j855j777
53853B33137j281r00r40r25m29R6L0k99p2O37Q78K85l43k71J15M4m00n16k85n50
53833B28011j695k819k766j674p43o30p92o54n47q88j189p68J2K57P7M39J439
53816B15070J957J407P07Q41J422J484R94P26J042J566J875J858J571J225J158
53801B34903J484K005K670L683M909N706N690N231M847M617M554M867N485N899
$$ y = [299063, 301788, 304527, 308160, 313091, 318367, 322933, 326837, 330513, 333748, 336153, 338000, 339800, 341503, 342834, 343946, 344997, 345463, 344624, 342477, 339548, 336055, 331930, 327467, 323247, 319457, 315873, 312448, 309272, 305966, 301761, 296421, 290589, 285022, 279864, 274942, 270424, 266788, 264251, 262522, 261103, 259652, 258053, 256327, 254645, 253317, 252556, 252187, 251719, 250756, 249229, 247228, 244862, 242388, 240203, 238439, 236769, 234914, 233137, 231856, 230956, 230016, 229091, 228662, 228758, 228788, 228489, 228417, 229054, 229932, 230217, 229874, 229603, 229718, 229762, 229362, 228846, 228561, 228011, 226316, 223497, 220731, 219057, 218314, 217684, 216892, 216238, 215691, 214803, 213614, 212846, 212858, 213115, 213192, 213631, 215070, 217027, 218434, 219141, 219982, 221404, 222888, 223882, 224608, 225650, 227216, 229091, 230949, 232520, 233745, 234903, 236387, 238392, 241062, 244745, 249654, 255360, 261050, 266281, 271128, 275745, 280299, 285166, 290651, 296550]
53787B96550N990O327P161P879Q074Q419R640J1327J2572J3170J3209J2065Q952
53774D21335M176j075n998j0300j3467j4922j4828j3891j2527j0949r747r415
53762C08392r480q986p755o389n259m319l666l317k762j645o63p21j443j703j416
53747B48868j571k390k831k135p65M66J203J244M80n35r41p57q16j299j410p81
53731B36030j05J31M41J218J848J676J073P61P66P05N96O35O95O43P48J235J798
53714B50894K071K185K425K782L249M121N431O526O719O075N110M030K783J553
53700C05954O95K81R5q3m08r92j670j987j689j070o33o12q73j076r24m98l58q71
53682B93281j472j210j33N65J36p24q86k70L05K96j04m76o13n31m61p13j222j483
$$ y = [296550, 302540, 308867, 316028, 323907, 331981, 340400, 350040, 361367, 373939, 387109, 400318, 412383, 421335, 425511, 424436, 418438, 408138, 394671, 379749, 364921, 351030, 338503, 327554, 317807, 308392, 298912, 289926, 282171, 275782, 270523, 266204, 262538, 259221, 256459, 254814, 254151, 253430, 251987, 250284, 248868, 247297, 244907, 242076, 239941, 239176, 239642, 240845, 242089, 242569, 242034, 241093, 240336, 239520, 238221, 236811, 236030, 235925, 236056, 236497, 237715, 239563, 241239, 242312, 243073, 243839, 244544, 245140, 245775, 246470, 247113, 247861, 249096, 250894, 252965, 255150, 257575, 260357, 263606, 267727, 273158, 279684, 286403, 292478, 297588, 301618, 304401, 305954, 306649, 306930, 307025, 306942, 306534, 305542, 303872, 301885, 300196, 299126, 298493, 297881, 297008, 295932, 295008, 294510, 294152, 293281, 291809, 290599, 290466, 291031, 291167, 290443, 289557, 289287, 289592, 289888, 289784, 289308, 288695, 288164, 287703, 286990, 285768, 284285]
53664B84285j205p78p12q70p16k52j29p40j623k030j853j580j461j104k05P12
53648B69739P68rn66j57O79R66N83J96J90L53M15L17K6l52m36n6L06J66j03J81
53628B73206Q04R39N96P71J912L166L562L132K489J951J623J769K529L498M044
53613C05991L872L159K421K227K639K983K677K135K196K738K770K024J418J631
53599C40881K133K168J795J366P27k38r07o25K44P46O05L68M56O95P74O22K87
53582C52097j94o83r25p61l64k05o60j478j918j647j223j272j523j297o98m56
53566C36793o64o50k10L2k15l38J89J019J592J864J918J637J196J196J748K131
53550C49238J857J459J648K309K950L539M241M829N016M952M900M796M646M789
$$ y = [284285, 283080, 282302, 281590, 280720, 280004, 279752, 279623, 278883, 277260, 275230, 273377, 271797, 270336, 269232, 269027, 269739, 270507, 270498, 269932, 269775, 270454, 271420, 272003, 272199, 272389, 272742, 273157, 273474, 273500, 273148, 272712, 272656, 272962, 273128, 273025, 273206, 274010, 274949, 275545, 276316, 278228, 281394, 284956, 288088, 290577, 292528, 294151, 295920, 298449, 301947, 305991, 309863, 313022, 315443, 317670, 320309, 323292, 325969, 328104, 330300, 333038, 335808, 337832, 339250, 340881, 343014, 345182, 346977, 348343, 349070, 348832, 347925, 347300, 347544, 348290, 348895, 349263, 349719, 350414, 351188, 351810, 352097, 351903, 351220, 350295, 349534, 349170, 348965, 348305, 346827, 344909, 343262, 342039, 340767, 339244, 337947, 337249, 336793, 336129, 335479, 335269, 335301, 335086, 334748, 334937, 335956, 337548, 339412, 341330, 342967, 344163, 345359, 347107, 349238, 351095, 352554, 354202, 356511, 359461, 363000, 367241, 372070, 377086, 382038, 386938, 391734, 396380, 401169]
53536D01169N330N774N830N980O713P713Q410Q895R583J0432J1086J1467J1678
53523E10060J1661J1563J1953J3168J4799J6301J7640J8848J9561J9719K0100
53512F85373K1402K3224K4723K5784K6673K7064K6449K5288K4554K4274K3513
53501I58321K1979K0622K0288K0536K0367J9617J9100J9440K0189K0337J9606
53490A180402J8839J8854J9244J8937J7745J6529J5764J4955J3735J2641J2177
53479A359822J2003J1582J0963J0233R054P392O000N288M446K472m85l604o551
53466A428615r334j1632j3255j4696j6338j7681j8345j9067k0608k2301k3035
53455A242323k3115k3759k5033k5830k5675k5140k4485k3356k1950k1104k0966
$$ y = [401169, 406499, 412273, 418103, 424083, 430796, 438509, 446919, 455814, 465397, 475829, 486915, 498382, 510060, 521721, 533284, 545237, 558405, 573204, 589505, 607145, 625993, 645554, 665273, 685373, 706775, 729999, 754722, 780506, 807179, 834243, 860692, 885980, 910534, 934808, 958321, 980300, 1000922, 1021210, 1041746, 1062113, 1081730, 1100830, 1120270, 1140459, 1160796, 1180402, 1199241, 1218095, 1237339, 1256276, 1274021, 1290550, 1306314, 1321269, 1335004, 1347645, 1359822, 1371825, 1383407, 1394370, 1404603, 1413657, 1421049, 1427049, 1432337, 1436783, 1439255, 1438770, 1435166, 1428615, 1419281, 1407649, 1394394, 1379698, 1363360, 1345679, 1327334, 1308267, 1287659, 1265358, 1242323, 1219208, 1195449, 1170416, 1144586, 1118911, 1093771, 1069286, 1045930, 1023980, 1002876, 981910]
53444I81910k0796k0236j9626j8859j7340j5357j4144j3943j3309j1090q059n706
53432H03445m266k902j146P83K769N004P434R587J1095J2090J3087J4510J6278
53419H87768J7901J9066K0044K1296K2899K4661K6501K8310K9765L0798L1880
53408A160889L3344L4774L5771L6859L8804M1368M3681M5594M7625M9809N1675
53397A620193N3261N4924N6233N6339N5582N5358N6154N6960N7013N6794N6669
53386B235480N5867N3647N0492M7263M3979M0304L6616L3632L1351K9102K6296
53375B684029K2821J8989J5415J2400R175M553j459p538j3021j8975k6579l5253
53363B664557m3327m9885n5044n8980o1717o3571o4932o5744o5879o5634o5181
$$ y = [981910, 961114, 940878, 921252, 902393, 885053, 869696, 855552, 841609, 828300, 817210, 809151, 803445, 799179, 796277, 795131, 795914, 798683, 803687, 811121, 820708, 831803, 843893, 856980, 871490, 887768, 905669, 924735, 944779, 966075, 988974, 1013635, 1040136, 1068446, 1098211, 1129009, 1160889, 1194233, 1229007, 1264778, 1301637, 1340441, 1381809, 1425490, 1471084, 1518709, 1568518, 1620193, 1673454, 1728378, 1784611, 1840950, 1896532, 1951890, 2008044, 2065004, 2122017, 2178811, 2235480, 2291347, 2344994, 2395486, 2442749, 2486728, 2527032, 2563648, 2597280, 2628631, 2657733, 2684029, 2706850, 2725839, 2741254, 2753654, 2762829, 2767382, 2765923, 2758385, 2745364, 2726389, 2699810, 2664557, 2621230, 2571345, 2516301, 2457321, 2395604, 2332033, 2267101, 2201357, 2135478, 2069844, 2004663]
53352B004663o3963o1533n8744n7095n6887n6887n6008n4462n3089n2147n1165
53341A382683m9554m7094m4095m1212l8957l7245l5608l3768l1718k9392k6617
53330I67423k3573k0854j8807j7037j4885j2274r793p881o292m598k908j672q59
53317H25990J14J487K803L721M628N978P519Q777R878J1192J2535J3474J4276
53304I22372J5599J7389J8986K0271K1808K3707K5353K6457K7507K8764K9718
53293A177931K9960K9852K9891L0071L0231L0375L0173K8936K6597K4103K2295
53282A490415K0922J9315J7378J5339J3130J0676Q331O343M290J684j237l880
53270A602706o199q550j0977j3278j5546j8114k1020k4030k6984k9791l2199l4016
$$ y = [2004663, 1940700, 1879167, 1820423, 1763328, 1706441, 1649554, 1593546, 1539084, 1485995, 1433848, 1382683, 1333129, 1286035, 1241940, 1200728, 1161771, 1124526, 1088918, 1055150, 1023432, 994040, 967423, 943850, 922996, 904189, 887152, 872267, 859993, 850200, 842319, 836027, 831429, 828521, 826849, 825990, 826104, 827591, 830394, 834115, 838743, 844721, 852240, 861017, 870895, 882087, 894622, 908096, 922372, 937971, 955360, 974346, 994617, 1016425, 1040132, 1065485, 1091942, 1119449, 1148213, 1177931, 1207891, 1237743, 1267634, 1297705, 1327936, 1358311, 1388484, 1417420, 1444017, 1468120, 1490415, 1511337, 1530652, 1548030, 1563369, 1576499, 1587175, 1595506, 1601849, 1606139, 1607823, 1606586, 1602706, 1596507, 1587957, 1576980, 1563702, 1548156, 1530042, 1509022, 1484992, 1458008, 1428217, 1396018, 1362002]
53258A362002l5340l6290l6708l6440l5722l4928l4190l3478l2827l2235l1611
53247I82233l0994l0505l0042k9428k8894k8769k8646k7738k6267k5464k5749
53236F69737k5908k4838k3082k1698k0465j8480j5887j3738j2405j1326j0172
53225D71738r167q329p414o624o400o503o222n530n056m908m510l818l637m340
53211C89280n133n136m502l943l738l717l831m173m678n146n434n403m926m046
53197C25474k988j955j164r89j648k689l298l201k901k871k987k915k640k333
53183B90895k051j809j649j445r93m66m54j217k162k448j900j104p06q87j385
53168B70219j707j397m54M61N05m20j378j294j68Q91R18J46m49l87o6L6o4j78
$$ y = [1362002, 1326662, 1290372, 1253664, 1217224, 1181502, 1146574, 1112384, 1078906, 1046079, 1013844, 982233, 951239, 920734, 890692, 861264, 832370, 803601, 774955, 747217, 720950, 695486, 669737, 643829, 618991, 595909, 574211, 553746, 535266, 519379, 505641, 493236, 481910, 471738, 462571, 454242, 446828, 440204, 433804, 427301, 421079, 415549, 410493, 405585, 401075, 397257, 393620, 389280, 384147, 379011, 374509, 370566, 366828, 363111, 359280, 355107, 350429, 345283, 339849, 334446, 329520, 325474, 322486, 320531, 319367, 318378, 316730, 314041, 310743, 307542, 304641, 301770, 298783, 295868, 293228, 290895, 288844, 287035, 285386, 283941, 282948, 282482, 282028, 280811, 278649, 276201, 274301, 273197, 272491, 271604, 270219, 268512, 267115, 266661, 267122, 267627, 267207, 265829, 264535, 264367, 265258, 266176, 266322, 265873, 265486, 265420, 265456, 265392, 265214]
53150B65214l34n06m05P4M95M62K40K96M52R5p64j298q73J60R45J061P36L60J28
53131B66538Q6K49M74L43n23j888k862k786k031j505j460j352r62q33j266j586
53115B48636j095k13M9m76r85r08n04k57l05n60r04j168j299j503j824j759q37
53098B34088M59J075P39K82L90P50P52M44L10N00P67Q87P04P7q10j279q84j81
53080B39070k12j140j889j416RJ096R90L0q42j058o85m2N32P01K93m36j012j268
53062B32721j443j609j393n76K53J35j104k481k808j915p30j84j97Q1J091K225
53046B22066K549J895R52K88j24m13l70J50P19O64j14r65j192p42k21j91n32o36
53028B23783k62J11L5j40J73P45P91K57k8L54P54N42N7j11j23m47q68p46l9N92
$$ y = [265214, 264880, 264374, 263969, 264043, 264538, 265000, 265240, 265536, 265988, 266083, 265319, 264021, 263148, 263308, 264253, 265314, 266050, 266410, 266538, 266624, 266873, 267347, 267690, 267167, 265279, 262417, 259631, 257600, 256095, 254635, 253283, 252321, 251488, 250222, 248636, 247541, 247328, 247377, 246901, 245916, 245008, 244504, 244247, 243942, 243382, 242478, 241310, 240011, 238508, 236684, 234925, 234088, 234547, 235622, 236361, 236643, 237033, 237783, 238535, 238979, 239289, 239789, 240556, 241443, 242147, 242224, 241414, 240135, 239251, 239070, 238858, 237718, 235829, 234413, 234422, 235518, 236508, 236538, 235696, 234638, 233953, 233911, 234443, 235144, 235437, 235001, 233989, 232721, 231278, 229669, 228276, 227700, 227953, 228088, 226984, 224503, 221695, 219780, 219050, 218866, 218669, 218750, 219841, 222066, 224615, 226510, 227462, 227750, 227626, 227213, 226843, 226993, 227712, 228376, 228262, 227297, 226105, 225363, 225142, 224951, 224419, 223783, 223521, 223632, 223667, 223527, 223700, 224445, 225236, 225493, 225465, 225819, 226573, 227115, 227172, 227061, 226938, 226491, 225623, 224877, 224838, 225430]
53008B25430O24J28n23r55r30n64k85l41n21o23q03j129j258j014q43j150j506
52991B13737j231m64K3r1m18n72m80p4P08J553J916J597Q55Lp05r54n95J13P22
52972B15643R65O86j59j099j186q1J346K010J828J402J003N96M03N65N98J55j22
52955B24553M54J197Q01o16j598j508j209j384j555j267j013j262j575j412r98
52940B11608o82k63L57N93M6o66p40l42j79l27k62K35Q61J290J346R01J46l56
52922B13566l65m03j000j763j844j113k36L30P08R73Q01Rr49j354r50j69K99J49
52904B06689l00m49o2M95P10M50K9j58K8M14O92P09N97O29R91J666K375K643K238
52885B20386J670J825K767L372K634R91l02p93j063j533j943k097k226k319j949
$$ y = [225430, 226054, 226182, 225659, 224704, 223774, 223210, 222925, 222584, 222063, 221440, 220637, 219508, 218250, 217236, 216393, 215243, 213737, 212506, 212042, 212065, 211974, 211556, 210984, 210504, 210430, 211138, 212691, 214607, 216204, 217059, 217062, 216357, 215403, 214808, 214921, 215643, 216608, 217294, 217135, 216036, 214850, 214769, 216115, 218125, 219953, 221355, 222358, 222954, 223357, 223922, 224520, 224675, 224553, 225007, 226204, 227005, 226389, 224791, 223283, 222074, 220690, 219135, 217868, 216855, 215593, 214018, 212606, 211608, 210926, 210663, 211020, 211613, 211659, 210993, 210253, 209911, 209732, 209405, 209143, 209378, 210239, 211529, 212875, 213776, 213922, 213566, 213201, 212798, 211798, 210035, 208191, 207078, 206842, 207172, 207880, 208853, 209654, 209663, 208714, 207360, 206410, 206241, 206540, 206689, 206389, 205940, 205878, 206373, 207083, 207533, 207562, 207404, 207432, 207846, 208538, 209247, 209844, 210473, 211464, 213130, 215505, 218148, 220386, 222056, 223881, 226648, 230020, 232654, 233645, 233343, 232550, 231487, 229954, 228011, 225914, 223688, 221369, 219420]
52870B19420j071m15n98j346j910j863j222k24P17J218J336J488J765J770J293
52855B20358P16N45R06J578K091J832O03q22j375j078r93j691k525k769k552k194
52839B12630j550o39k32q92j938k169j330j73O49J094J309J346J247J046P86P18
52823B11902J116J664J542N27n04p01l74l96q74j086m97P37K092L022L232L028
52807B24430L224M245N664O835P457P150N186J478k664n644p145p844q023p394
52793B26955o096m758l573k247r63m36q27j374j449j282j280j292r81n03l08m84
52777A99102o43m01J58N57M79K95P06J736K445K060J044M28L98K73j81l40K11
52760B08327R24R96L32n73j336j860k037j676p86K20P25M33k30m82q4L44J90k87
$$ y = [219420, 218349, 217934, 217336, 215990, 214080, 212217, 210995, 210771, 211488, 212706, 214042, 215530, 217295, 219065, 220358, 221074, 221619, 222525, 224103, 226194, 228026, 228629, 227807, 226432, 225354, 224361, 222670, 220145, 217376, 214824, 212630, 211080, 210441, 210209, 209317, 207379, 205210, 203880, 203707, 204356, 205450, 206759, 208105, 209352, 210398, 211184, 211902, 213018, 214682, 216224, 216751, 216247, 215546, 215172, 214776, 213902, 212816, 212319, 213056, 215148, 218170, 221402, 224430, 227654, 231899, 237563, 244398, 251855, 259005, 264191, 265669, 263005, 257361, 250216, 242372, 234349, 226955, 220859, 216101, 212528, 210281, 209318, 208882, 208055, 206681, 205232, 203950, 202670, 201378, 200397, 199894, 199586, 199102, 198459, 198058, 198216, 198773, 199252, 199547, 200253, 201989, 204434, 206494, 207538, 207966, 208364, 208637, 208456, 208116, 208327, 209251, 210247, 210579, 210006, 208670, 206810, 204773, 203097, 202311, 202531, 203256, 203689, 203459, 202977, 202893, 203237, 203427, 203140]
52742B03140l73Q5N89Q14R51J185J371J317R96M45j91n22k41L87Q14R52J185J641
52724B14545J908J678J132N17k33j145j862k004j679j348j224j038m84K44M82
52709B09489j66j215j762j560j212j128q51L5R26Q84jp04o40j72K58O28Q54N76
52691B04239k38j048j342j078l90N44J231J189P34Q22J741K630K692K183J711
52676B15620J241M85k80n40l99l86n55n06j61J21K01L24N98Q07Q40Q73R93R75
52658B20251N96o6o90q73l88M91J056R69Q01J275K070K058Q69m99r98q42r85j707
52640B23388k409k545k149j449o20NJ03p5J81J073J901K073K079K855M420N785
52624B34616O153N607M480K727L01k192l729l806k921k180k379l329m033l747
$$ y = [203140, 202767, 202852, 203441, 204255, 205206, 206391, 207762, 209079, 210075, 210520, 210329, 209807, 209566, 209953, 210767, 211719, 212904, 214545, 216453, 218131, 219263, 219780, 219547, 218402, 216540, 214536, 212857, 211509, 210285, 209247, 208763, 209007, 209489, 209323, 208108, 206346, 204786, 203574, 202446, 201595, 201630, 202556, 203440, 203439, 202735, 202095, 201923, 202181, 202809, 203663, 204239, 204001, 202953, 201611, 200533, 200143, 200687, 201918, 203107, 203841, 204663, 206404, 209034, 211726, 213909, 215620, 216861, 217346, 217066, 216526, 216127, 215741, 215186, 214680, 214519, 214640, 214841, 215165, 215763, 216570, 217410, 218283, 219276, 220251, 220847, 220781, 220091, 219218, 218830, 219321, 220377, 221346, 222147, 223422, 225492, 227550, 228419, 227920, 226922, 226080, 225095, 223388, 220979, 218434, 216285, 214836, 214216, 214221, 214324, 214249, 214430, 215503, 217404, 219477, 221556, 224411, 228831, 234616, 240769, 246376, 250856, 253583, 253884, 251692, 247963, 244157, 241236, 239056, 236677, 233348, 229315, 225568]
52610B25568k874k443k724k774j695J43J490J627R41K61On8m31j179j594q68P47
52593B14143J869J609P53P59J791K618K317J336O29M89N93O39N27K04k61o74r85
52576B28356j290j451j096k31N37P27N71M87L18k99j009q83L39J724K113J337
52560B30250J67o08q08o95o10p24r20q38k79M44Q18P64P14Q37O88o3q70q54p3
52541B27340M25o3r35j099l17O52J065Q80M99K27R7N2J06L64Q00J141J065N71
52523B32870p1p00j290j559j065R6J118J327R38N90M88M20L71N46R49J406J903
52506B38337K496K999L187L193L235L083K344J190K45k56n86q51q39o62p93j217
52490B55105j170j52J243J962J548L12j140k178k374j886j392j200q31J07J033
$$ y = [225568, 222694, 220251, 217527, 214753, 213058, 213201, 214691, 216318, 217259, 217520, 217526, 217468, 217037, 215858, 214264, 213396, 214143, 216012, 217621, 218374, 219133, 220924, 223542, 225859, 227195, 227824, 228313, 228906, 229545, 230072, 230276, 230015, 229341, 228356, 227066, 225615, 224519, 224288, 224825, 225552, 226123, 226610, 226928, 226629, 225620, 224737, 225076, 226800, 228913, 230250, 230417, 229809, 229001, 228306, 227696, 226972, 226052, 225214, 224935, 225379, 226197, 226961, 227675, 228512, 229200, 229137, 228267, 227413, 227340, 227765, 227702, 226767, 225668, 225351, 226003, 227068, 227948, 228447, 228674, 228771, 228823, 228929, 229293, 230093, 231234, 232299, 232870, 232799, 232099, 230809, 229250, 228185, 228281, 229399, 230726, 231664, 232254, 232742, 233162, 233533, 234079, 235028, 236434, 238337, 240833, 243832, 247019, 250212, 253447, 256530, 258874, 260064, 260309, 260053, 259467, 258616, 257777, 257115, 256322, 255105, 253935, 253783, 255026, 256988, 258536, 258848, 257708, 255530, 253156, 251270, 249878, 248678, 247847, 247954, 248987]
52475B48987J082M19R7O22J369J581J257P65K19k53j87N92J330J086L4o48k99
52458B58053N31J051J211J227Q42k47j555k236k178j901j540q11n8k56j549k700
52442B47884k611j692j049q92o40j67M2j65l23j34K06M77O67P07M74K11K78N36
52424B43809M35r7m90l40P8L72N53P62Q94Q81R53J295J658J651J244Q26Q36J456
52406B56776K562L826M957N816O236N967N110M359M300M410L421Q40k322m582
52392C01676n375n175m668m191l728l130k338j548r87n81o3M82N75K8o46p90l28
52375B69213K77O30O94O70P86J175J672J869J536R81P64J029J279J014M03J04
52359B84096L57N42k6j091j712j493r94q02p60n06j75p4j22j31k65o38q23m84
$$ y = [248987, 250069, 250488, 250585, 251207, 252576, 254157, 255414, 256179, 256398, 256145, 255958, 256550, 257880, 258966, 259000, 258352, 258053, 258584, 259635, 260846, 262073, 262915, 262668, 261113, 258877, 256699, 254798, 253258, 252447, 252389, 252133, 250584, 247884, 245273, 243581, 242532, 241640, 241000, 240833, 240875, 240710, 240387, 240253, 240459, 240936, 241603, 242310, 242784, 242995, 243273, 243809, 244244, 244147, 243657, 243317, 243395, 243767, 244320, 245082, 245976, 246857, 247810, 249105, 250763, 252414, 253658, 254484, 255320, 256776, 259338, 263164, 268121, 273937, 280173, 286140, 291250, 295609, 299909, 304319, 307740, 308580, 306258, 301676, 296301, 291126, 286458, 282267, 278539, 275409, 273071, 271523, 270536, 269955, 269892, 270374, 270949, 270977, 270331, 269541, 269213, 269490, 270120, 270814, 271484, 272270, 273445, 275117, 276986, 278522, 279503, 280267, 281296, 282575, 283589, 283992, 284096, 284453, 284995, 284969, 283878, 282166, 280673, 279679, 278877, 278117, 277611, 277436, 277362, 277240, 277109, 276844, 276206, 275383, 274899]
52341B74899j00k67n97j92R07J737J883J973K522L211L597L714L679L434L205
52326C03605L478M179M566M292L936M083M585N110N685O222O190N341M216L384
52312C68872K748K038J366P63j87j528k389j995p11O12J780K923L564L136K162
52297C83154J757K052K096J431P38O64R15R02O16L59J19k94p92j073j000o43q0
52280C90921N67J101J355J322J111R21J060J741K764L582L825L616L286K953K550
52265D22675K149J999K184K502K772L164L829M375M106K937J664J076J101J241
52251D57774J437K000K915L767M272M371L975L157K479K449K737K555J798J063
52237D96749O64M60O18J532K822L469L280L202L790M433M608M752N214N368M734
$$ y = [274899, 274799, 274532, 273935, 273743, 274650, 276387, 278270, 280243, 282765, 285976, 289573, 293287, 296966, 300400, 303605, 307083, 311262, 315828, 320120, 324056, 328139, 332724, 337834, 343519, 349741, 355931, 361272, 365488, 368872, 371620, 373658, 375024, 375787, 375600, 374072, 371683, 369688, 368977, 369589, 371369, 374292, 377856, 380992, 383154, 384911, 386963, 389059, 390490, 391228, 391892, 392807, 393709, 394325, 394684, 394803, 394509, 393717, 392644, 391644, 391001, 390921, 391488, 392589, 393944, 395266, 396377, 397298, 398358, 400099, 402863, 406445, 410270, 413886, 417172, 420125, 422675, 424824, 426823, 429007, 431509, 434281, 437445, 441274, 445649, 449755, 452692, 454356, 455432, 456533, 457774, 459211, 461211, 464126, 467893, 472165, 476536, 480511, 483668, 486147, 488596, 491333, 493888, 495686, 496749, 497413, 497873, 498491, 500023, 502845, 506314, 509594, 512796, 516586, 521019, 525627, 530379, 535593, 540961, 545695]
52222E45695L986L850L892L428K878K974L385L369L217L706M555M861M732N009
52208E99537N558N414M607M225M457M198L036K102K181K407J803R59J003J754
52194F43241K110J799J605K019K605K769K473K059J864K007K286K316J927J314
52180F72394O69j22j198k393l393m026m229l951l365k908k874l117l307l297l163
52165F31720l020k991l032k739j712k02R81J492J911K784L622L436K193R79N97
52150F36019N52j31j376k020j313N0Q07O59M07O90J224J514J606J724J619R08
52134F42939j19p28o99o00j018j901k667k737j933o28N71J496K523L858N023N551
52118F48931N810O499P570Q334Q476Q230P636O459M980L977L651L281K307J103
$$ y = [545695, 549681, 553531, 557423, 560851, 563729, 566703, 570088, 573457, 576674, 580380, 584935, 589796, 594528, 599537, 605095, 610509, 615116, 619341, 623798, 627996, 631032, 633134, 635315, 637722, 639525, 640484, 641487, 643241, 645351, 647150, 648755, 650774, 653379, 656148, 658621, 660680, 662544, 664551, 666837, 669153, 671080, 672394, 673063, 672941, 671743, 669350, 665957, 661931, 657702, 653751, 650386, 647478, 644604, 641487, 638180, 634883, 631720, 628700, 625709, 622677, 619938, 618226, 618024, 619005, 620497, 622408, 625192, 628814, 632250, 634443, 635422, 636019, 636571, 636440, 635064, 633044, 631731, 631781, 632588, 633247, 633654, 634344, 635568, 637082, 638688, 640412, 642031, 642939, 642820, 642092, 641393, 640793, 639775, 637874, 635207, 632470, 630537, 629909, 630480, 631976, 634499, 638357, 643380, 648931, 654741, 661240, 668810, 677144, 685620, 693850, 701486, 707945, 712925, 716902, 720553, 723834, 726141, 727244]
52104G27244K58k31n71n51O7R48J573K011K744L895N175O460P840R103R635R121
52088G84721P948O636N070K698m60l391m954n021m372l548k367p55O56J263J342
52073G85466J518J716J334L40o27j164j385j282o38K18L36p87k581m148n109n449
52057G67758n077m024k735j708j078o98m21j53K5k73j291k519l064k767k394k520
52041G37061k827k801k430j843q60N86K078L234M169N069N823O438P272Q250Q464
52026G77683P252N246L696L071L050L417M138M796M840M425M212M322M190L522
52012H37860K785K551K835L269L448L078K035M92j328l381n504p148p965q526
51998H24501r839j2093j4554j6657j8508k0096k0785k0066j8306j6285j4274j2138
$$ y = [727244, 727502, 727271, 726700, 726149, 726216, 727164, 728737, 730748, 733492, 737387, 742562, 749022, 756862, 765965, 775600, 784721, 792669, 799305, 804375, 807073, 806613, 803222, 798268, 793247, 788875, 785327, 782960, 782205, 782861, 784124, 785466, 786984, 788700, 790034, 790374, 789747, 788583, 787198, 785916, 785278, 785496, 785832, 785045, 782464, 778316, 773207, 767758, 762681, 758657, 755922, 754214, 753136, 752438, 752017, 751864, 751889, 751616, 750325, 747806, 744742, 741975, 739581, 737061, 734234, 731433, 729003, 727160, 726300, 726886, 728964, 732198, 736367, 741436, 747259, 753697, 760969, 769219, 777683, 784935, 790181, 793877, 796948, 799998, 803415, 807553, 812349, 817189, 821614, 825826, 830148, 834338, 837860, 840645, 843196, 846031, 849300, 852748, 855826, 857861, 858353, 857025, 853644, 848140, 840992, 833027, 824501, 814662, 802569, 788015, 771358, 752850, 732754, 711969, 691903, 673597, 657312, 643038, 630900]
$$ [...]
##END NTUPLES=NMR SPECTRUM
##END=
