
##TITLE=AC1366_2140_7184965_qDGOeVsAB1
##JCAMPDX= 6.0         $$ Bruker NMR JCAMP-DX V2.0
##DATA TYPE= NMR SPECTRUM
##DATA CLASS= NTUPLES
##ORIGIN= BRUKER
##OWNER= Administrator
$$ 1.72 TOPSPIN		Version 2.1
$$ 2012-12-11 18:12:36.424 -0500  Administrator@X
$$ Compression mode = diff/dup
##.OBSERVE FREQUENCY= 400.02188249412
##.OBSERVE NUCLEUS= ^1H
##.ACQUISITION MODE= SIMULTANEOUS (DQD)
##.ACQUISITION SCHEME= undefined
##.AVERAGES= 8
##.DIGITISER RES= 22
##SPECTROMETER/DATA SYSTEM= spect
##.PULSE SEQUENCE= zg30
##.SOLVENT NAME= COFFEE_meoh
##.SHIFT REFERENCE= INTERNAL, COFFEE_meoh, 1, 14.98509
##AUDIT TRAIL= $$ (NUMBER, WHEN, WHO, WHERE, PROCESS, VERSION, WHAT)
$$ ##TITLE= Audit trail, TOPSPIN		Version 2.1
$$ ##JCAMPDX= 5.01
$$ ##ORIGIN= Bruker BioSpin GmbH
$$ ##OWNER= Administrator
$$ $$ E:\/data/COFFEE/nmr/AC1366_2140_7184965_qDGOeVsAB1/40/pdata/1/auditp.txt
$$ ##AUDIT TRAIL=  $$ (NUMBER, WHEN, WHO, WHERE, PROCESS, VERSION, WHAT)
(   1,<2012-12-11 18:12:28.174 -0500>,<Administrator>,<X>,<go>,<TOPSPIN 2.1>,
      <created by zg
	started at 2012-12-11 18:11:21.736 -0500,
	POWCHK enabled, PULCHK disabled,
       configuration hash MD5:
       86 BA 57 50 F2 9D 5C 9B 26 00 A9 28 5F 66 2E 89
       data hash MD5: 64K
       A6 17 DA 87 5A 9C 2C 61 14 98 C0 72 68 AC A4 39>)
(   2,<2012-12-11 18:12:31.346 -0500>,<Administrator>,<X>,<proc1d>,<TOPSPIN 2.1>,
      <Start of raw data processing
       efp LB = 0 FT_mod = 6 PKNL = 1 PHC0 = 0 PHC1 = 0 SI = 32K 
       data hash MD5: 32K
       97 B8 67 14 24 DC 2D 2C 2A 5E 92 6A 5F CA D2 98>)
(   3,<2012-12-11 18:12:31.814 -0500>,<Administrator>,<X>,<proc1d>,<TOPSPIN 2.1>,
      <pk PHC0 = 100.9314 PHC1 = 0 
       data hash MD5: 32K
       5D FC 38 E8 8F 52 82 B8 9D 97 8C D1 51 D3 36 3A>)
(   4,<2012-12-11 18:12:32.064 -0500>,<Administrator>,<X>,<proc1d>,<TOPSPIN 2.1>,
      <abs ABSG = 1 
       data hash MD5: 32K
       17 E0 6D 4B 03 CE DF 60 AB 3F B4 32 B0 87 7C 03>)
(   5,<2012-12-11 18:12:32.221 -0500>,<Administrator>,<X>,<proc1d>,<TOPSPIN 2.1>,
      <abs ABSG = 2 
       data hash MD5: 32K
       C3 0B 7E DE F1 D1 8E 0A B3 7D CD 09 5A 32 24 D7>)
(   6,<2012-12-11 18:12:32.361 -0500>,<Administrator>,<X>,<proc1d>,<TOPSPIN 2.1>,
      <abs ABSG = 3 
       data hash MD5: 32K
       1D 46 59 5B A6 5A CD 5F D7 2E 2D 9D 30 97 FD 2E>)
(   7,<2012-12-11 18:12:32.502 -0500>,<Administrator>,<X>,<proc1d>,<TOPSPIN 2.1>,
      <abs ABSG = 4 
       data hash MD5: 32K
       33 E1 67 1A A5 DC 88 EB A3 24 68 44 48 0E 7F BD>)
(   8,<2012-12-11 18:12:32.643 -0500>,<Administrator>,<X>,<proc1d>,<TOPSPIN 2.1>,
      <abs ABSG = 5 
       data hash MD5: 32K
       C2 FA 27 F7 AE AD 6B 0F E7 27 A9 BB 1F D2 F2 14>)
$$ ##END=
$$ 
$$ $$ hash MD5
$$ $$ 7A 7B 30 CD 1E DA 53 51 7C 17 71 A2 0F A8 1D 7D
##$RELAX= 
##$RELAX= 
##$RELAX= 
##$RELAX= 
##$RELAX= 
##$RELAX= 
##$RELAX= 
##$RELAX= 
$$ Bruker specific parameters
$$ --------------------------
##$DU= <E:\>
##$EXPNO= 40
##$NAME= <AC1366_2140_7184965_qDGOeVsAB1>
$$ [...]
150 150 150 150 150 150 150 150
##$TP07= 0
##$TPNAME0= <>
##$TPNAME1= <>
##$TPNAME2= <>
##$TPNAME3= <>
##$TPNAME4= <>
##$TPNAME5= <>
##$TPNAME6= <>
##$TPNAME7= <>
##$TPOAL= (0..7)
0.5 0.5 0.5 0.5 0.5 0.5 0.5 0.5
##$TPOFFS= (0..7)
0 0 0 0 0 0 0 0
##$TUNHIN= 0
##$TUNHOUT= 0
##$TUNXOUT= 0
##$USERA1= <user>
##$USERA2= <user>
##$USERA3= <user>
##$USERA4= <user>
##$USERA5= <user>
##$V9= 5
##$VALIST= <valist>
##$VCLIST= <CCCCCCCCCCCCCCC>
##$VD= 0
##$VDLIST= <DDDDDDDDDDDDDDD>
##$VPLIST= <PPPPPPPPPPPPPPP>
##$VTLIST= <TTTTTTTTTTTTTTT>
##$WBST= 2048
##$WBSW= 25
##$XGAIN= (0..3)
0 0 0 0
##$XL= 0
##$YL= 0
##$YMAX_a= 631090
##$YMIN_a= -538856
##$ZGOPTNS= <>
##$ZL1= 120
##$ZL2= 120
##$ZL3= 120
##$ZL4= 120
##$ABSF1= 14.98509
##$ABSF2= -5.573092
##$ABSG= 5
##$ABSL= 3
##$ALPHA= 0
##$AQORDER= 0
##$ASSFAC= 0
##$ASSFACI= 0
##$ASSFACX= 0
##$ASSWID= 0
##$AUNMP= <proc_prof1d_extract_pilot.lims>
##$AXLEFT= 0
##$AXNAME= <>
##$AXNUC= <1H>
##$AXRIGHT= 0
##$AXTYPE= 0
##$AXUNIT= <>
##$AZFE= 0.1
##$AZFW= 0.1
##$BCFW= 0
##$BC_mod= 0
##$BYTORDP= 0
##$COROFFS= 0
##$CY= 15
##$DATMOD= 1
##$DC= 0
##$DFILT= <>
##$DTYPP= 0
##$F1P= 0
##$F2P= 0
##$FCOR= 0.5
##$FTSIZE= 32768
##$FT_mod= 6
##$GAMMA= 0
##$GB= 0
##$INTBC= 1
##$INTSCL= 1
##$ISEN= 128
##$LB= 0
##$LEV0= 0
##$LPBIN= 0
##$MAXI= 10000
##$MC2= 0
##$MEAN= 0
##$ME_mod= 0
##$MI= 0
##$NCOEF= 0
##$NC_proc= -8
##$NLEV= 6
##$NOISF1= 0
##$NOISF2= 0
##$NSP= 0
##$NTH_PI= 0
##$NZP= 0
##$OFFSET= 14.98509
##$PC= 1
##$PHC0= 100.9314
##$PHC1= 0
##$PH_mod= 1
##$PKNL= yes
##$PPARMOD= 0
##$PPDIAG= 0
##$PPIPTYP= 0
##$PPMPNUM= 2147483647
##$PPRESOL= 1
##$PSCAL= 4
##$PSIGN= 0
##$PYNMP= <proc.py>
##$REVERSE= no
##$SF= 400.02
##$SI= 32768
##$SIGF1= 0
##$SIGF2= 0
##$SINO= 400
##$SIOLD= 32768
##$SPECTYP= <>
##$SREGLST= <1H.CDCl3>
##$SSB= 0
##$STSI= 32768
##$STSR= 0
##$SW_p= 8223.68421052631
##$SYMM= 0
##$S_DEV= 0
##$TDeff= 65536
##$TDoff= 0
##$TI= <>
##$TILT= no
##$TM1= 0
##$TM2= 0
##$TOPLEV= 0
##$USERP1= <user>
##$USERP2= <user>
##$USERP3= <user>
##$USERP4= <user>
##$USERP5= <user>
##$WDW= 1
##$XDIM= 32768
##$YMAX_p= 476926088
##$YMIN_p= -1095159
##$CURPLOT= <Network HP LaserJet P1505>
##$CURPRIN= <$Network HP LaserJet P1505>
##$DFORMAT= <normdp>
##$LAYOUT= <+/1D_H.xwp>
##$LFORMAT= <normlp>
##$PFORMAT= <normpl>
##$SURQMSG= 1
$$ End of Bruker specific parameters
$$ ---------------------------------
##NTUPLES= NMR SPECTRUM
##VAR_NAME=  FREQUENCY,     SPECTRUM/REAL,   SPECTRUM/IMAG
##SYMBOL=    X,             R,               I
##VAR_TYPE=  INDEPENDENT,   DEPENDENT,       DEPENDENT
##VAR_FORM=  AFFN,          ASDF,            ASDF
##VAR_DIM=   32768,         32768,           32768
##UNITS=     HZ,            ARBITRARY UNITS, ARBITRARY UNITS
##FACTOR=    0.250966925370066, 1,           1
##FIRST=     8223.43324360094, 43220,        -70054
##LAST=      0,             -218268,         -71029
##MIN=       0,             -1095159,        0
##MAX=       8223.43324360094, 476926088,    0
$$ Real data points
##PAGE= N=1
##DATA TABLE= (X++(R..R)), XYDATA
$$ [...]
19538c32820A1172e15546a66756A2276J32012o3097J42180b35343C918d47926
19527E4273b21714j963d0925A3181O3974h7204m957p7748D0228b5180o3361B65764
19514B6788g7498j36829B42597f7418k95680g4726j15924J3273B3408J54847a98280
19502a69437C4292i8556q940C6222J1409a73457d9351l5300C3402f7358j53291
19491b20649o8823P5224i4753o0096K6170j13085A12021l7773b55047E7221K891
19480F0112a58295B91943a81826o853B18325c8643j33196c884A13695M1204J47248
19469C02147d4662B22354B1238a48487q6050d6984m9606j47886p0863B94162b56356
19457A60940P4269G2949b66927d4950K1111A85948c50568J03893a01550I0860
$$ plain form
19538 -332820 11172 -515546 -166756 12276 144288 81191 223371 -235343 3918 -447926
19527 54273 -221714 -223677 -40925 13181 77155 -87204 -92161 -169909 40228 -25180 -88541 265764
19514 26788 -77498 -214327 242597 -67418 -363098 -74726 -190650 -177377 23408 178255 -198280
19502 -169437 34292 -98556 -107496 36222 47631 -173457 -49351 -84651 33402 -67358 -220649
19491 -220649 -289472 -214248 -94753 -154849 -128679 -241764 112021 74248 -255047 57221 60112
19480 60112 -158295 291943 -181826 -188679 218325 -38643 -171839 -3884 113695 154899 302147
19469 302147 -44662 222354 21238 -148487 -234537 -46984 -96590 -244476 -315339 294162 -256356
19457 160940 235209 72949 -266927 -44950 -23839 185948 -350568 -246675 -101550 90860
19446B3336d46864C20744a99032j22739l1408J36158L4100A39274E0553N5452
19436A06005J03320b3032E2010g7676k8288c7346a0157j88302A25719A6109J65554
19425A81663J77403A42399e9348F5917G760M7326b14906g578A23598c77383E8792
19413A43551a86911A9603h282A72339b37225D12018h3198j32154o6778q5261a20458
19401g7748B41242a32044A32216L27888c18864H9087c24695p4534P9928l1322
19391c50623A46010a88331D8087a79066c5076G3604c22920l2020I0930a57177
19380D45155A01774a38156G6578J63894D7990f9036m2135j50640D2753c4706A87222
19368b50105B7335c9625l8363H7153c28430B87665b74189a28324H9651b26446
$$ plain form
19446 23336 -446864 320744 -199032 -321771 -353179 -217021 -182921 139274 50553 106005
19436 106005 209325 -23032 52010 -77676 -105964 -37346 -10157 -198459 125719 16109 181663
19425 181663 359066 142399 -59348 65917 7760 55086 -214906 -7578 123598 -377383 58792
19413 143551 -186911 19603 -8282 172339 -237225 412018 -83198 -215352 -282130 -367391 -120458
19401 -77748 241242 -132044 132216 460104 -318864 89087 -324695 -399229 -319301 -350623
19391 -350623 146010 -188331 48087 -179066 -35076 73604 -322920 -354940 90930 -157177
19380 445155 101774 -138156 76578 240472 47990 -69036 -111171 -261811 42753 -34706 187222
19368 -250105 27335 -39625 -77988 87153 -328430 287665 -274189 -128324 89651 -226446
19357d9155m0773K4808q8512C6291j0436J41207P2212b03073f1291B3960L6831
19346F0791a66082E46065B2979J12183N4171d4558m08885A0161J23927g4001A5934
19334a83093k8078A00786c82205a88367A56043a23181c7764j03206b065A05051
19323d48420A88816i059j65852c1811r773m35239a2788n969j86723c7599j91356
19312b28955k7176A54959b29517d1981l28023d5301j10267B7879a00579l10558
19302d11137M5239d9188A44459c15344n3657g0826a3757D0349j1147b50031a12934
19290C27158a26133D630h625A23534a36968d0277A81002a78117A35865b64680
19279f7325k77748J39580c2794r8904b6571j09956C93876a29374E4850P5610b9171
$$ plain form
19357 -49155 -89928 -65120 -153632 36291 25855 167062 239274 -203073 -61291 23960 60791
19346 60791 -166082 546065 22979 135162 189333 -44558 -453443 10161 134088 -74001 15934
19334 -183093 -211171 100786 -382205 -188367 156043 -123181 -37764 -140970 -2065 105051
19323 -448420 188816 -9059 -174911 -31811 -41584 -476823 -12788 -18757 -205480 -37599 -228955
19312 -228955 -256131 154959 -229517 -41981 -370004 -45301 -155568 27879 -100579 -411137
19302 -411137 -365898 -49188 144459 -315344 -369001 -70826 -13757 40349 29202 -250031 -112934
19290 327158 -126133 4630 -8625 123534 -136968 -40277 181002 -178117 135865 -264680
19279 -67325 -345073 -205493 -32794 -131698 -26571 -136527 393876 -129374 54850 130460 -29171
19267a20585F0855b05460h4496B97332c72889E2450a01042j6712A26163c2552
19256G8140a48340B03527a31087A89684a70002A46772b19503J09531l55987B00216
19245g2847k73927A3044a74142A71854a82257L7673P1227l06863j0413C63394
19234B29193b28455e418j41511b0850C03792c95642J87843B91937a68823n3218
19224b22041e5495E9509B2267b38525A05554a69977N7751n6781L5186A18439O5253
19213A83692r0992K8858c73368e6666G271J34338C2923h6553b3277j4283A22820
19201b5367A24833D8711J24281b54332A8660b86477C6243P2409L1386N5983A2765
19189a60344j68294a62018k44351B90566a79504B54053b88987F5577b33984L2359
$$ plain form
19267 -120585 60855 -205460 -84496 297332 -372889 52450 -101042 -117754 126163 -32552
19256 78140 -148340 203527 -131087 189684 -170002 146772 -219503 -109972 -465959 200216
19245 -72847 -346774 13044 -174142 171854 -182257 -144584 -73357 -380220 -390633 363394
19234 229193 -228455 -5418 -146929 -20850 303792 -395642 -207799 291937 -168823 -222041
19224 -222041 -55495 59509 22267 -238525 105554 -169977 -112226 -169007 -133821 118439 183692
19213 183692 92700 121558 -373368 -56666 7271 141609 32923 -86553 -23277 -37560 122820
19201 -25367 124833 48711 172992 -254332 18660 -286477 36243 108652 140038 196021 12765
19189 -160344 -328638 -162018 -406369 290566 -179504 254053 -288987 65577 -233984 -201625
19179b01625f2236j09915b547I976a03709B19718l3994a45345C1086a15084A64129
19167G3418a02912o5521r2555A3091J50231F5276l0980K29347r3193a09672j65727
19156b75399j3543g5765A0936R2381K74029A52680c79290B2042R8176J02485m0996
19145A81707b9954D081c0555A2629J5730c3933j51567L6510q2139i6956c3958
19133H5119g0932J8551k15613D0640A3001Q0646h8518A15351l9695b39091A08534
19121a97041I615N8013c2917l0319F0353K03983I5502a08283C27239A18765i3366
19109g7315j52935P5729I287J0776d360C94235A87403e6714l8260j2753a6540
19097G7677m275b16750O057B2551a60709r2395e6501E927b56445I3833d2291j3082
$$ plain form
19179 -201625 -62236 -172151 -2547 9976 -103709 219718 185724 -145345 31086 -115084 164129
19167 73418 -102912 -168433 -260988 13091 163322 65276 34296 263643 170450 -109672 -275399
19156 -275399 -288942 -75765 10936 103317 377346 152680 -379290 22042 120218 222703 181707
19145 181707 -29954 4081 -30555 12629 28359 -33933 -185500 -148990 -231129 -96956 -33958
19133 85119 -70932 -52381 -267994 40640 13001 93647 -88518 115351 75656 -239091 108534
19121 -197041 9615 67628 -32917 -63236 60353 264336 95502 -108283 327239 118765 -93366
19109 -77315 -230250 -154521 9287 20063 -4360 394235 187403 -56714 -94974 -107727 -16540
19097 77677 73402 -216750 -210693 22551 -160709 -253104 -56501 5927 -256445 93833 -42291 -55373
19085e5373j45661j66969a51807B38690o1449a85637A51081d0864J8087o4938
19075h7715k35553R5237H4064K74302I0693b53207H1851D0152a79988L5383p0955
19064b15560o360B9487K22839C7645M7762C2783J57656A4785b0111B02484a60939
19052H203a2597A9641a04257A56083c32124F3026i512A60478J80673H2519b54464
19040a25802b0068j59111A15509b60659a19382B5308a52537L8089l9013d212o1587
19029f5799k21960d7009k66812A51256p0935c18568h1286B3331J06810b69415
19018a70489j9660k20882R4387A44117a47817L3885j4004J7071C78597a91906
19007b05555J6722j48833A37432R2669b65038j24820A9373a52191B0733a08621
$$ plain form
19085 -55373 -201034 -368003 -151807 238690 177241 -185637 151081 -40864 -22777 -87715
19075 -87715 -323268 -228031 84064 358366 90693 -253207 81851 40152 -179988 -144605 -215560
19064 -215560 -221920 29487 252326 37645 85407 32783 190439 14785 -20111 202484 -160939
19052 8203 -12597 19641 -104257 156083 -332124 63026 -9512 160478 341151 82519 -254464
19040 -125802 -20068 -179179 115509 -260659 -119382 25308 -152537 -114448 -153461 -4212 -65799
19029 -65799 -287759 -47009 -313821 151256 80321 -318568 -81286 23331 130141 -269415
19018 -170489 -190149 -411031 -316644 144117 -147817 -113932 -127936 -110865 378597 -191906
19007 -205555 -188833 -337666 137432 230101 -265038 -389858 19373 -152191 20733 -108621
18996b95139I0935b4872D5484c1198k50310h5114A88679i176j33039O0653B5285
18984G3862M5188C4943b76827J16029J9062D7509M8828i9476k82311a83304A45607
18972F860b1290l1511D12226b73104a00190I9979d7979j5956a8569j29977L0633
18961a17913B1056L3057c66972A02687M3532d32353c2056j2747p4633L2541F6629
18949f0796l17307B79902a1175F1000P7638a33870c8741q9696B5846J51409b57001
18937B6448a18500A04131l3282K711k788O5744a30061A23784i847j31136j333
18926a42316a9773C0212a13654j2989n42C214J88068G3065M6916c38371a32367
18914a6041r9652c346B74853A02887e1633A77939a3281N34r5146j7114B3058i7455
$$ plain form
18996 -295139 90935 -24872 45484 -31198 -281508 -85114 188679 -9176 -142215 -81562 25285
18984 73862 119050 34943 -276827 -160798 -141736 47509 96337 -99476 -381787 -183304 145607
18972 6860 -21290 -52801 412226 -273104 -100190 99979 -47979 -63935 -18569 -148546 -117913
18961 -117913 21056 54113 -366972 102687 146219 -432353 -32056 -44803 -119436 -86895 66629
18949 -60796 -378103 279902 -11175 61000 138638 -133870 -38741 -128437 25846 177255 -257001
18937 26448 -118500 104131 70849 73560 70772 136516 -130061 123784 -9847 -140983 -142316
18926 -142316 -19773 30212 -113654 -126643 -127185 3214 191282 73065 119981 -338371 -132367
18914 -16041 -115693 -3346 274853 102887 -51633 177939 -13281 -12747 -107893 -125007 23058 -97455
18901A81062a28403e6464m7299D18982H0666c1756j34940h3227m6819l97014A18893
18889B1691b90659J20683G4537f3452k02700C1685a35490j02655j9384h5634j64715
18878b50349c5310F2046M7587m8278K13094G4867E954N0059O7541r308n6967b1180
18865a00643j34080g3027j21856F596a20667G4967B5741L20208o9184c83700a4855
18853a98575B07428c52266B6056a33386B97267a12942A15116n749O6902f759k31885
18842b38644C4190g575I4894b23825H404a23457e478q5821j13386k27708a52120
18830d5735k04773C6912a26781k83227d4199j24702j55637b6602k29711G7329
18819c13835F3387b21711C42118a73061h3615A21616f1640q5244E1573a38658
$$ plain form
18901 181062 -128403 -56464 -103763 418982 80666 -31756 -166696 -83227 -130046 -527060 118893
18889 21691 -290659 -169976 74537 -63452 -266152 31685 -135490 -238145 -257529 -85634 -250349
18878 -250349 -35310 62046 109633 61355 274449 74867 5954 56013 123554 114246 57279 -21180
18865 -100643 -234723 -73027 -194883 6596 -120667 74967 25741 345949 276765 -383700 -14855
18853 -198575 207428 -352266 26056 -133386 297267 -112942 115116 109367 176269 -6759 -238644
18842 -238644 34190 -7575 94894 -223825 8404 -123457 -5478 -91299 -204685 -432393 -152120
18830 -45735 -250508 36912 -126781 -410008 -44199 -168901 -324538 -26602 -256313 77329
18819 -313835 63387 -221711 342118 -173061 -83615 121616 -61640 -146884 51573 -138658
18808b60532H8195K41027F0748O2084R8768g2756r5520P3328r769I9121c26866
18796E8437J2482a81942I3293h3220F7425i015A27861f5436E2165a76788j21942
18785b98730c4702H6527b30669J00966j64182A1339J39361A7003e75193a53799
18774f2145q4667F2667a55649k4767D71014F4649c77221f8522r088k6080B28114
18762f8751A11138B699J68953h4857D4745d61618C90623a08270j49861a16893
18751B14262b61677f5784j17735F2722a42583A44000c21181c1809l11859M0149
18741c03519A24247L6785i5209M0353r0177F0763b4774j24814d4263A43926a15456
18729A99625d29605d6735k04316J07644c3902j96031e4079j20403L0722C0143
$$ plain form
18808 -260532 88195 329222 60748 122832 221600 -72756 -168276 -94948 -104717 99121 -326866
18796 58437 70919 -181942 93293 -83220 67425 -9015 127861 -65436 52165 -176788 -298730
18785 -298730 -34702 86527 -230669 -129703 -293885 11339 150700 17003 -575193 -153799
18774 -62145 -146812 62667 -155649 -180416 471014 64649 -377221 -68522 -77610 -103690 228114
18762 -68751 111138 2699 171652 -84857 44745 -461618 390623 -108270 -258131 -116893
18751 214262 -261677 -65784 -183519 62722 -142583 144000 -321181 -31809 -343668 -303519
18741 -303519 124247 161032 -95209 -54856 -145033 60763 -24774 -149588 -44263 143926 -115456
18729 199625 -429605 -46735 -251051 -143407 -33902 -229933 -54079 -174482 -143760 30143
18718a07055o1965O8445j45996a2862E0151b59361j36147E4815b52967K3159k92870
18707e22678a59253q1012d1920n6045A80487h1724B68153a23511E813b05596P6606
18696a28990a3219j9003A1517e0264j16931H9333i1307l6852L4956k67501B9959
18684a71924k5502d2618a9745B1295c5443j5919j30047F4838J5947a52477N7984
18673i4493j09936C7451f14118D562a7415A86268b5410A17796b4017A90232k4468
18662A65764e66428a83918G0084a83694m2671O9592k24092B21727r2274H924h9478
18650C05544b44221B47366B8986g4744E1747J31194a09073A1247K3852a87399
18639a41207B3771b38568A60293K1137e1874A49089b97535A1003O5531c13489
$$ plain form
18718 -107055 -169020 -100575 -246571 -12862 50151 -259361 -395508 54815 -252967 -229808 -522678
18707 -522678 -159253 -240265 -41920 -97965 180487 -81724 268153 -123511 5813 -205596 -128990
18696 -128990 -13219 -32222 11517 -50264 -167195 89333 -91307 -128159 -93203 -360704 29959
18684 -171924 -197426 -42618 -19745 21295 -35443 -51362 -181409 64838 80785 -152477 -94493
18673 -94493 -204429 37451 -614118 4562 -17415 186268 -25410 117796 -24017 190232 165764
18662 165764 -566428 -183918 70084 -183694 -226365 -156773 -380865 221727 129453 8924 -89478
18650 305544 -244221 247366 28986 -74744 51747 182941 -109073 11247 35099 -187399
18639 -141207 23771 -238568 160293 181430 -51874 149089 -297535 11003 76534 -313489
18628a71325g1736B35553j14287b23724O5004B33516a9207k06171M8741q2891
18618b59528M3839A47261a54808L164J2231c1187j66712a7933E30609a81604A07455
18606C13027A0954a40779O5132r4463m301d5599j19218j2494Q1496A72c2622B51467
18593c1014A02036p672J53961B8206p035J53522b35849A36416b18647j25575f728
18581E3891a15905j38762a4236A96096b64848a596A35068D7071L46017j88335
18571B04753Q5396d62706P6517a61268M3081N2431m64494b25150g3694C58806
18560d1937j82810g8363e061C2135f3023H9959a56894q954A65897M8595d77206
18548a467k86722g7858K9674k19230g1585d521j55803A46041m8358J46728c4552
$$ plain form
18628 -171325 -71736 235553 121266 -223724 -158720 233516 -19207 -225378 -176637 -259528
18618 -259528 -215689 147261 -154808 -151644 -139413 -31187 -197899 -17933 530609 -181604 107455
18606 313027 10954 -140779 -75647 -170110 -174411 -45599 -164817 -177311 -95815 172 -32622 251467
18593 -31014 102036 94364 248325 28206 21171 174693 -235849 136416 -218647 -344222 -6728
18581 53891 -115905 -254667 -14236 196096 -264848 -1596 135068 47071 393088 204753
18571 204753 290149 -462706 -386189 -161268 -118187 -65756 -530250 -225150 -73694 358806
18560 -41937 -224747 -78363 -5061 32135 -63023 89959 -156894 -165848 165897 214492 -477206
18548 -1467 -288189 -77858 -48184 -267414 -71585 -4521 -160324 146041 97683 244411 -34552
18536C20931H1308d3619j10268d8551k59028b6757n027j99800D7364a21103A94527
18524b35908B35336A157J02179Q1847f7766k40361a32218k7065l05106b02525
18513d6446l17350a34431g204A24758c273r2221K7766k51951A67831k3330K5092
18502A69593a82316j66218e6300j21853M1117B13209H7556f5448C27307a87598
18491F6481d6059A35801B3057c66896D2811b10602q0046a38722A1903K52294e6556
18479d0078j39479M2713q1024D4382L75143a47030B5137N9598a07006j6859p9816
18468b03681E8293a17270H5407d70305K08135A78176a74065F4394b59795J09323
18458a50472N2935n26442D1253K33100a60455E0584J00142a61086A04008a82137
$$ plain form
18536 320931 81308 -43619 -153887 -48551 -307579 -26757 -31784 -231584 47364 -121103 194527
18524 -235908 235336 1157 103336 185183 -67766 -308127 -132218 -159283 -464389 -202525
18513 -46446 -363796 -134431 -7204 124758 -3273 -95494 -67728 -319679 167831 144501 169593
18502 169593 -182316 -348534 -56300 -178153 -137036 213209 87556 -65448 327307 -187598
18491 66481 -46059 135801 23057 -366896 42811 -210602 -290648 -138722 11903 264197 -56556
18479 -40078 -179557 -136844 -217868 44382 419525 -147030 25137 84735 -107006 -123865 -203681
18468 -203681 58293 -117270 85407 -470305 -262170 178176 -174065 64394 -259795 -150472
18458 -150472 -97537 -623979 41253 274353 -160455 50584 150726 -161086 104008 -182137
18447a3519D4751O4906J49975I8158d7676a2120p1780A53344B7031a32849E75608
18435b94588J19243E1892f585j70977A15657a26157A2805c02268a31041k6112
18425a57153j40968Q589A97671E4083c29337A20208b03284h8772j28661C10808
18414D291K64500a90918h2345L4858D8690a62772c6499n2000o9398l447H8673
18402B06165C2265N9701a38718k56341g4878A66628k4826h6468c942B6567c02231
18390E2039i6254H3727f7229D62495B3207a09097c3685k10083A3162K20757c10053
18378a10757A92432a04172M2674k56346J30006n1947e2042p7417m2486j40202
18368c12147Q8261a7811j44466E58544A2946J26766R0752A11522C7115J53877
$$ plain form
18447 -13519 44751 109657 259632 98158 -47676 -12120 -83900 153344 27031 -132849 575608
18435 -294588 -175345 51892 -6585 -177562 115657 -126157 12805 -302268 -131041 -157153
18425 -157153 -298121 -289532 197671 54083 -329337 120208 -203284 -88772 -217433 310808
18414 4291 268791 -190918 -82345 -47487 48690 -162772 -36499 -88499 -157897 -161344 88673
18402 206165 32265 91966 -138718 -395059 -74878 166628 141802 -86468 -3942 26567 -302231
18390 52039 -96254 83727 -67229 462495 23207 -109097 -33685 -243768 13162 233919 -310053
18378 -110757 192432 -104172 -61498 -317844 -187838 -239785 -52042 -129459 -171945 -312147
18368 -312147 -223886 -17811 -162277 558544 12946 139712 230464 111522 37115 190992
18358A90992B9687M7348c04837a34746A04986b80413j93880d9456I4298a74658
18347G341h7084B57661H0394N5157o7372P6616m5922b00628B10788a77934q1036
18336b58970D1430h9521C2737a65830c606j30071j98260p5687d7398j01838j94614
18325c43850a54086L8470j21286f3220L450n5122I3552a76059H3959b5862F8790
18313e9570J0158o0371A5448d7995j12170l53665b18104O535h7919A9863b42067
18301b98220Q4411A11854a48599l6489L798i0112r2508B64522F6215c6805C31877
18289I202a11531I1901c00838Q2791F3402a6792C07617a64283M5055r4250L6472
18278a77006b0790l07025E7582b82959A71031A3805o04K56374a48547J5513l171
$$ plain form
18358 190992 29687 77035 -304837 -134746 104986 -280413 -474293 -49456 94298 -174658
18347 7341 -87084 257661 80394 135551 68179 144795 98873 -200628 210788 -177934 -258970
18336 -258970 41430 -89521 32737 -165830 -3606 -133677 -331937 -407624 -47398 -149236 -343850
18325 -343850 -154086 -115616 -236902 -63220 -59770 -114892 93552 -176059 83959 -25862 68790
18313 -59570 -49412 -109783 15448 -47995 -160165 -513830 -218104 -211569 -87919 19863 -242067
18301 -298220 -213809 111854 -148599 -185088 -181290 -90112 -182620 264522 66215 -36805 331877
18289 9202 -111531 91901 -300838 -218047 63402 -16792 307617 -164283 -119228 -213478 -177006
18278 -177006 -20790 -327815 57582 -282959 171031 13805 13201 269575 -148547 -133034 -136205
18267a36205h03C703M257b78595G6035j0660J0244C3462a12752b1645G2734b16412
18254a22269G3670f5880A49532b66496A89113b32975B9118f2416A15788B4335
18243B9402h6280C46631A08040c4029p6613B895a958r5432o2865A74355a98463
18231a36522D1432h7236C8901L78220A43263a70360j29708K5718P2145M2708b8023
18219c4915k5588H3164J68132a00126B91852A7274J84277A2209a35809J166A59460
18207a51303d9904q1573K9319N0585j86453g6168l7092A44280a00583r051F7654
18195F045f3025A4594J18800a69671J1342A11359a62071d5567A3019b0519p4836
18184i5355l975o7985B33085b01920A09511C9322R9368D2237a02438I4398c5694
$$ plain form
18267 -136205 -803 3703 7960 -278595 76035 65375 75619 33462 -112752 -21645 72734 -216412
18254 -122269 73670 -65880 149532 -266496 189113 -232975 29118 -62416 115788 24335
18243 29402 -86280 346631 108040 -34029 -110642 2895 -1958 -97390 -160255 174355 -198463
18231 -136522 41432 -87236 38901 417121 143263 -170360 -300068 -274350 -202205 -159497 -28023
18219 -34915 -60503 83164 251296 -100126 291852 17274 201551 12209 -135809 -134643 159460
18207 -151303 -49904 -131477 -102158 -51573 -238026 -76168 -113260 144280 -100583 -109634 67654
18195 6045 -63025 14594 133394 -169671 -158329 111359 -162071 -45567 13019 -20519 -95355
18184 -95355 -99330 -167315 233085 -201920 109511 39322 138690 42237 -102438 94398 -35694
18172C55381a35460A06053a18595B23312j7073a96941r9510F9244a83901e2222
18161G5973a88809h1390E9289a29213B78675d86054J43540A19528i1089p0013
18151a61102B77443f1237k18283B46166O0755b62184j91036b21191G4147e9665
18140A51292G3670e2773B09793a63712m6184A96887a05929J9946G5146G80c59885
18128b2387G3770h0604l3492j35382A31015a08676A22649b0894I8813i630m73186
18117d82816A49134f4938e09q8231A07020J2578a17440K9294C46042A6654a21159
18105D8210a40710l7222F4563a75519G109c2668n7209G7726C5452a22035L6169
18094h5866j53695G3999R9512c6797F3289k8057b26567j36886a622r9934A61886
$$ plain form
18172 355381 -135460 106053 -118595 223312 206239 -196941 -296451 69244 -183901 -52222
18161 75973 -188809 -81390 59289 -129213 278675 -486054 -342514 119528 -91089 -161102
18151 -161102 277443 -61237 -279520 246166 306921 -262184 -453220 -221191 74147 -59665
18140 151292 73670 -52773 209793 -163712 -209896 196887 -105929 -85983 75146 780 -359885
18128 -22387 73770 -80604 -114096 -249478 131015 -108676 122649 -20894 98813 -9630 -482816
18117 -482816 149134 -64938 -509 -88740 107020 119598 -117440 -88146 346042 16654 -121159
18105 48210 -140710 -177932 64563 -175519 7109 -32668 -89877 77726 35452 -122035 -85866
18094 -85866 -239561 73999 173511 -36797 63289 35232 -226567 -363453 -1622 -101556 161886
18082D0297c2479A26423J39319j491b46622A26257A720i6517r4722k80435A19967
18070I822J22067J4800b52074B90593b12621a04638k3527B4786M08967a92238
18059a85654j21882a12788A32375C2267a61211C63613c03242B76109a97294Q3484
18049a13810e3427L424j99687o200H0496J23538A1231J32100M7499c9817A26443
18037B3569P8090n0090A2121K00591q2564a45782B18005f5292e273F0250d3511
18025b01177Q2727B54159f9650m0623I2793a73281g8523B30473c27750J58270
18015a69480A0550b91988d8366l0723j76962H4067j5044k7881J2964P8198b80920
18003I8443b19083e9372E0393J21170b67688c8449j67355n1666J14003L3646n1899
$$ plain form
18082 40297 -32479 126423 265742 264251 -246622 126257 1720 -96517 -191239 -471674 119967
18070 9822 131889 146689 -252074 290593 -212621 -104638 -128165 24786 433753 -192238
18059 -185654 -307536 -112788 132375 32267 -161211 363613 -303242 276109 -197294 -113810
18049 -113810 -53427 -50003 -249690 -255890 80496 204034 11231 143331 190830 -39817 126443
18037 23569 101659 51569 12121 212712 130148 -145782 218005 -65292 -5273 60250 -43511
18025 -201177 -118450 254159 -69650 -110273 92793 -173281 -78523 230473 -327750 -169480
18015 -169480 10550 -291988 -48366 -79089 -256051 84067 69023 41142 54106 132304 -280920
18003 98443 -219083 -59372 50393 171563 -267688 -38449 -205804 -257470 -143467 -109821 -161720
17992a61720A66079p6161a6441k73742N4195B9657d6170k96109a07599E9374g5603
17980c98951J84557e0577D9915a41547E981b33826c4585A025K78967h8128I8629
17968i095N25p9767I8216l6119j7481d5891j61450f6527E1502a75714a7510A76399
17955b64274C7686b06555a1037k24910C3948a62640A87854E2290J03658a85399
17944b74495C3355p480P2375k8937Q2372A9010a74485F4364J62999h5355B40897
17932b01157N2614A30232K9972A7480J07227j8264a42526A82070a92029E0161
17921b05715A08985b16874A47074i0096o4329C26747b52668R7628D79081C3088
17910A47691B5325O1436F849L84884b7243I9226i2942E0081a66927k33417A76755
$$ plain form
17992 -161720 166079 89918 -16441 -290183 -235988 29657 -46170 -342279 -107599 59374 -75603
17980 -398951 -214394 -50577 49915 -141547 5981 -233826 -34585 1025 279992 -88128 98629
17968 -9095 -8570 -88337 98216 62097 44616 -45891 -207341 -66527 51502 -175714 -17510 176399
17955 -264274 37686 -206555 -11037 -235947 33948 -162640 187854 52290 155948 -185399
17944 -274495 33355 25875 98250 69313 151685 19010 -174485 64364 227363 -85355 240897
17932 -201157 -148543 130232 160204 17480 124707 106443 -142526 182070 -192029 50161
17921 -205715 108985 -216874 147074 -90096 -154425 326747 -252668 -155040 479081 33088
17910 147691 25325 86761 6849 391733 -27243 99226 -92942 50081 -166927 -400344 176755
17898C3729K8314k8684J30835N2527g4107j20652R5730j4259B09304d9374F6783
17886E639J11015e6751o249C94517h4861k36280J04411c4238A06059a83254B23513
17874g9695B2648K6257e39005b2683A82879c34969f8387J1572k76817D2629b58055
17862A36622b14479l4553B57650B4342L98827C6647a4587j8980m4091B03602a90538
17850c41902D07091M7726A9007J21527D890J13750L07511A33809e0116A37269
17839B26123c24941A8599J84338J9768a43156A6566J33042F9159a08978A93104
17828a07923A31988Q5451r0629a67271B09684a37940A57744a62061e7257n2707
17818a09964m4994n7728K3368B93464G6368c78495C78843H0544c39105F3396A2367
$$ plain form
17898 33729 62043 33359 164194 216721 -74107 -194759 -99029 -113288 209304 -49374 66783
17886 5639 116654 -56751 -63000 394517 -84861 -321141 -216730 -34238 106059 -183254 223513
17874 -79695 22648 48905 -539005 -22683 182879 -334969 -68387 -56815 -333632 42629 -258055
17862 136622 -214479 -249032 257650 24342 423169 36647 -14587 -33567 -77658 203602 -190538
17850 -341902 407091 454817 19007 140534 4890 118640 426151 133809 -50116 137269
17839 226123 -324941 18599 202937 222705 -143156 16566 149608 69159 -108978 193104
17828 -107923 131988 217439 126810 -167271 209684 -137940 157744 -162061 -57257 -109964
17818 -109964 -154958 -212686 -189318 293464 76368 -378495 378843 80544 -339105 63396 12367
17806b45189k3324J04415E4304K30079b94776E1042J5265b86885a37485n4988
17796a92473B09369f7710a7411A92913f8868j07177A93683F6432i6515A49998
17785A27786L3990a44649O689o9205A10010a3127j18085B14422d97636H0240J28376
17774B08616a0813n5371K017A28617e354j08243I5224b40450A42134M6187c34935
17762E845c1126C61074j77174D7943J69793n7340a44116O4783j30153E810b80549
17750a23497a4704k39271a0902A6584a98281H7808J05579F0933e8887j61812l10970
17739e31669E239L22447i2803n6530E224b88527B04983H4752e5849a5776j32202
17728a47978E1841a87213N4686B00422D3898q236M835a63793B69406G9868A5023
$$ plain form
17806 -245189 -268513 -164098 54304 284383 -294776 51042 66307 -286885 -137485 -192473
17796 -192473 209369 -67710 -17411 192913 -68868 -176045 193683 66432 -96515 149998
17785 127786 161776 -144649 -137960 -207165 110010 -13127 -131212 214422 -497636 80240 208616
17774 208616 -10813 -66184 -64167 128617 -5354 -113597 95224 -240450 142134 188321 -334935
17762 5845 -31126 361074 183900 47943 217736 160396 -144116 -79333 -209486 5810 -280549
17750 -123497 -14704 -253975 -10902 16584 -198281 87808 193387 60933 -58887 -220699 -531669
17739 -531669 5239 327686 -92803 -149333 5224 -288527 204983 84752 -55849 -15776 -147978
17728 -147978 51841 -187213 -132527 200422 43898 35662 40497 -163793 269406 79868 15023
17716b3574k14139K1627c1803j03107j81328D7752c5780p0879B99146c2936j26754
17705a59690D8879a22009p3761a0692A42050b98593A80464i1083F5652d3217B73571
17693B60306b0957j6747P716A34168g5424A77644D1977J25403c5227k04084J07118
17682a32193M3573A78686M2075I7566M0449a23040A30972D1920A663d4652j15864
17671a60516f1429H7515p703P8444N5315h5081B94280G8026P8841b74329H6565
17659C0146Q8517b12B4439f3959B38334g2821k00860b1990A18536P4242J2547
17648B05325L05276j56073a7226A17439J97627D5935K15267A17858J2259k2042
17638A08075b7732I3932a49834K6784K7128d0298B35937G6696P1333a9424m6473
$$ plain form
17716 -23574 -237713 -216086 -31803 -134910 -316238 47752 -35780 -106659 299146 -32936 -159690
17705 -159690 48879 -122009 -195770 -10692 142050 -298593 180464 -91083 65652 -43217 273571
17693 260306 -20957 -37704 -29988 134168 -75424 177644 41977 167380 -35227 -239311 -132193
17682 -132193 -88620 178686 220761 97566 138015 -123040 130972 41920 1663 -44652 -160516
17671 -160516 -61429 87515 79812 158256 213571 -85081 294280 78026 156867 -274329 86565
17659 30146 118663 -212 24439 -63959 238334 -72821 -273681 -21990 118536 192778 205325
17648 205325 510601 354528 -17226 117439 315066 45935 261202 117858 130117 108075
17638 108075 -27732 93932 -149834 -123050 -95922 -40298 235937 76696 148029 -19424 -65897
17627f5897B69931c1323j39079J8342C45694e8052D3431i7180E2242a67849L2851
17616a34998l5086B0915I75N7607a39292f7352p8057A99567b2649F6152b34754
17604a01506k20943A92133k7895c63415h8552d0083C20230F9632k7822L6632a22315
17592B02399g2276A47260K17641H5144a81683A0889J83384g4706G5699b2419B38363
17580A08826n2490k5425J69261G5872L21072b73291A94721Q6978N0896j4492o6085
17569B52018K78933I3502a81868D98441a8957H3600h62B86251e2041D22942a33218
17557B43348D3373a7563j98632B76087D3669e0091k29273A69894K11524A746K35254
17546B37000a38642F9707g0895B56720F7929j2273M9535B3573N0703e1171B10745
$$ plain form
17627 -65897 269931 -31323 -170402 -152060 345694 -58052 43431 -97180 52242 -167849 -134998
17616 -134998 -170084 20915 975 58582 -139292 -67352 -145409 199567 -22649 66152 -234754
17604 -101506 -322449 192133 164238 -363415 -88552 -40083 320230 69632 41810 78442 -122315
17592 202399 -72276 147260 364901 85144 -181683 10889 194273 -74706 75699 -22419 238363
17580 108826 56336 30911 200172 75872 396944 -273291 194721 281699 332595 318103 252018
17569 252018 530951 93502 -181868 498441 -18957 83600 -862 286251 -52041 422942 -133218
17557 243348 43373 -17563 -216195 276087 43669 -50091 -279364 169894 381418 1746 237000
17546 237000 -138642 69707 -70895 256720 67929 55656 105191 23573 74276 -51171 210745
17534C77022A79529e0285F9241J11443c6186q2783C52780j47503I8191C2299L5331
17523F7630A0437b7805j42943j02105a1557C01126A20735A5073a05984o3816e7021
17511a90433q9002J36845A74682a08926k17521a24463D2675K39967Q4945j81863
17501A85724b29088b0372B94509o7427J6530n9163E1563K68774e614A55678l3364
17490A22314L01113j91564L2977D6082e0989j47579I7333J00318A9379J14281
17480A33660a87279B71b97899B23078c097A19044C7311c12109A65217D0697J68143
17469B08840P383D8143N30197B23178n5357G0177b09770g7182C47597F6443J89739
17458B56182i9783B20195o5173a1253B13674l6926F6562j4317K75989j18040O88
$$ plain form
17534 377022 179529 -50285 69241 180684 -36186 -118969 352780 205277 98191 32299 67630
17523 67630 10437 -27805 -170748 -272853 -11557 301126 120735 15073 -105984 -169800 -57021
17511 -190433 -279435 -142590 174682 -108926 -326447 -124463 42675 282642 367587 185724
17501 185724 -229088 -20372 294509 227082 243612 184449 51563 320337 -5614 155678 122314
17490 122314 423427 231863 264840 46082 -50989 -198568 97333 197651 19379 133660
17480 133660 -187279 271 -297899 223078 -3097 119044 37311 -312109 165217 40697 208840
17469 208840 216223 48143 578340 223178 167821 70177 -209770 -77182 347597 66443 256182
17458 256182 -99783 220195 155022 -11253 213674 176748 66562 52245 328234 210194 210882
17447B10882q5155J72720b09586C52032P6423G3851J06422m7214i7106B85618
17436h6587K0395A54284C8635M0016N6073R4059A04672J88466I9851K08846I190
17424A00742L90140h8535B93345b2567B53807h9309B01686O7538A21485L1027
17414A52512g3848E0179J53909l7915J9352J4525G2644g5491C88213a33765E34697
17402c63814J59465A78L58704A20138Q23a09619E1019K23824O9735A59602G3756
17390B55327H1853J80104L8527j49431K9430j1289J81227A37346J68125n713H9873
17378C03743q869A45417O9991P2285A11754d29742e5126b3534k5677C26688j20804
17367B05884q9474J24627m2854L59958k09289C6935K92842Q3031j99809a59686
$$ plain form
17447 210882 125727 298447 -209586 352032 428455 73851 180273 133059 -97106 285618
17436 -86587 -66192 154284 38635 78651 134724 228783 104672 293138 99851 308697 9190
17424 100742 490882 -88535 293345 -22567 253807 -89309 201686 269224 121485 152512
17414 152512 -73848 50179 204088 166173 185525 200050 72644 -75491 388213 -133765 534697
17402 -363814 -204349 178 358882 120138 120961 -109619 51019 274843 344578 159602 73756
17390 255327 81853 261957 300484 151053 180483 169194 350421 137346 305471 299758 89873
17378 303743 294874 145417 215408 287693 111754 -429742 -55126 -23534 -49211 326688 205884
17367 205884 116410 241037 198183 558141 348852 36935 329777 412808 212999 -159686
17356C04J29680J03667j07033M2998a39364E2644f5057j2894C98469j09531C4789
17344B54901L7557J07227A37820F4476K55524O3838j83596J77577l9114j34479
17334B04226a70105C2353K53215r5961N5023f9264A30046L055C0271N0219K47812
17323C28302b9439E8139O2661L63612A48144m6647D2307g903F7975K53629q5220
17312B36384E5757K12073b2355r3767A87454Q1184O0941q4364I6387M70049A3636
17300a2620E7613L76776a87546D1462M51557A67561b577j97075C74935f9555F162
17288d4844C29805o7230M5294A6568e8893A28382J95739A11901R2680F0411J97844
17277B58255a6541A72460b06345C84203j39186j00326C252a9662a403A86528K3814
$$ plain form
17356 304 129984 233651 126618 169616 -139364 52644 -65057 -77951 398469 288938 34789
17344 254901 292458 399685 137820 64476 320000 383838 200242 377819 338705 204226
17334 204226 -170105 32353 285568 189607 244630 -69264 130046 133101 30271 80490 328302
17323 328302 -29439 58139 120800 484412 148144 101497 42307 -7903 67975 321604 236384
17312 236384 55757 267830 -22355 -116122 187454 268638 329579 245215 96387 566436 13636
17300 -12620 57613 434389 -187546 41462 493019 167561 -2577 -199652 374935 -69555 6162
17288 -44844 329805 262575 307869 16568 -58893 128382 324121 111901 204581 60411 258255
17277 258255 -16541 172460 -206345 384203 245017 144691 3252 -19662 -1403 186528 210342
17266B10342L5551K5175N9345b29085k2033a10969C1478M77014g6980H4119a24810
17254i1756C82172j11852j29580M300j432K0357R6684K12399A36805L8043j1870
17243A62978D3150Q9118F2318M1298l4505M98131a41120n7600b0359r9680A29058
17231A51817L11867a42764O8325F8373L28187E7852L5271K08127R9574G8356J53155
17220B31511J43655p9365j12459a9192E83328A77715D0599a33009C05926F7225
17209B82429I5070j8978N2029a49721D63949j54986L663Q2825j25001p9399b975
17197H8986O4329p5635M19062b1073C30475r0911I4542J11922R1778L4213a22716
17185D65346A19633L32903j43809m3018o9974J47620M6979A94143K03317O425
$$ plain form
17266 210342 245893 271068 330413 -229085 -251118 -110969 31478 508492 -76980 84119 -124810
17254 -91756 382172 270320 140740 145040 143608 163965 260649 473048 136805 174848 162978
17243 162978 43150 132268 62318 103616 69111 567242 -141120 -198720 -20359 -120039 129058
17231 151817 463684 -142764 -74439 68373 396560 57852 93123 301250 400824 78356 231511
17220 231511 375166 295801 183342 -19192 583328 177715 40599 -133009 305926 67225
17209 282429 95070 76092 128121 -149721 463949 308963 312626 395451 270450 191051 -2975
17197 88986 153315 77680 496742 -21073 330475 239564 94542 206464 298242 332455 -122716
17185 465346 119633 452536 308727 265709 195735 343355 390334 194143 397460 403885
17175D03885A83504m8620D128M08926l2585j83938J31757I2729J80037A23309
17164D7545d4360B20861F2170J10040K39377A88842K74654k27732j8769a86077
17153B44270K25414A83829n8376O402O125a8465F12085E82K27304d0986A62831
17141C81338R9432A17857J90555k0168m6415p8498k0647K37970o9691o01A08504
17129C07827J31265N8728A27216j5041K77741J4317j46461m8211Q2159j17874
17119A73846J02835A00695M3136M4001J36513J86829R8050B26427F3977J10994
17109A74971M60025B80322K89412k74607J1976M3637G1000L23286A68757J53276
17099C22033L053B5369J94774K59652H7861L23032K73836B77999J14160O0379
$$ plain form
17175 403885 183504 134884 4128 413054 380469 196531 328288 92729 272766 123309
17164 47545 -44360 220861 62170 172210 411587 188842 463496 235764 216995 -186077
17153 244270 469684 183829 125453 131855 137980 -18465 612085 582 227886 -40986 162831
17141 381338 480770 117857 308412 288244 241829 163331 142684 380654 310963 310362 108504
17129 307827 439092 497820 127216 112175 389916 404233 257772 209561 291720 173846
17119 173846 276681 100695 143831 187832 324345 511174 609224 226427 63977 174971
17109 174971 634996 280322 569734 295127 307103 350740 71000 394286 168757 322033
17099 322033 325086 25369 220143 479795 87861 410893 684729 277999 392159 452538
17089D52538P2812A08387M8678Q5352K72864B31843L47547k41363M0618n442K21710
17078E94913k15806q0954j48072K48247N1440J75727j98538J82563j81430J48390
17068E76480k71419J22989j29381J40870J00400J04329B60607J95117J69324A00096
17057B25624L15500A08325K60397q1915M49979O7518B41536O3285Q3321O7627
17047D55769N2015j93373j47298M73571n467j49337K63139k95747j5031j18023
17037C20218L04643j21288J79286m1738J24800k85192q1697q2899M40161k28819
17027E27475R5638k80411M22801l56064J95920r4578k54059L31752K06908k43564
17017E51818k07799J58248j3620j82544K07783j48142j18280K94314Q1927l645
$$ plain form
17089 452538 525350 108387 157065 242417 515281 231843 579390 338027 378645 373203 594913
17078 594913 379107 298153 150081 398328 449768 625495 426957 609520 428090 576480
17068 576480 305061 428050 298669 439539 539939 644268 260607 455724 625048 100096
17057 225624 541124 108325 368722 286807 736786 804304 241536 304821 388142 455769
17047 455769 507784 314411 167113 640684 635217 485880 749019 453272 438241 320218
17037 320218 624861 503573 682859 641121 765921 480729 399032 316133 756294 527475
17027 527475 623113 342702 765503 409439 605359 510781 256722 588474 795382 551818
17017 551818 344019 502267 488647 306103 513886 365744 247464 541778 623705 620060
17007F20060K12845n5063l9406l47548L24091L5324k23877K11190j06556k0777
16997F10283m3234J36696J55581k89849J02203R2993J77339k60027O7567J16996
16987H66548P7471j97087l65658K64255P8272k88961O257K01571j35268L80989
16977H88389r0713P9418l92545M78986P5101k01750J91291k61307j74731K00974
16967G93113p6381K1265j48K17471M988j28444J1498k0821k04582M8402P5411
16956G41772n9321R7886J63052j8381J03514l60096J17920j24490J45972L83274
16946A191102J2617J61930l12327k62805J81884K66988j76003J94698k77973K51154
16936A231265k80530N43637o68267L24645k87642L54163k41705p969J47628R3726
$$ plain form
17007 620060 832905 777842 738436 390888 714979 750303 526426 737616 631060 610283
16997 610283 567049 703745 859326 569477 671680 764673 942012 681985 749552 866548
16987 866548 944019 746932 381274 645529 723801 434840 441097 642668 507400 888389
16977 888389 797676 877094 484549 963535 1038636 836886 1028177 766870 592139 793113
16967 793113 716732 737997 737849 955320 960308 831864 843362 822541 617959 666361 741772
16956 741772 682451 780337 943389 925008 1028522 668426 786346 661856 807828 1191102
16946 1191102 1203719 1365649 1053322 790517 972401 1239389 1063386 1258084 980111 1231265
16936 1231265 950735 1494372 826105 1150750 863108 1217271 975566 967597 1115225 1208951
16926A208951J78974q7163L461K10533m94141K69370K03847n0880J78532j5553
16916A605931m12141J32516K55039l28738J27499j5188j40267L85331l1874p0583
16906A507525l9518Q272J00929P8794j85869j1296J82265R6613K10387j75569
16896A772533l30084L6540M62764m97642l535J43240J37522L75478k30993J05298
16886A971121m46969J85228Q8925r0332P2361K68746R1328j04721m88736N84143
16876B131094N1761j90791L05203j79541k9788j84553K13624J74509R9065l39995
16866B050588L26454Q1110J27022k02399J00353k06546J03610J49813J92668j25631
16856B597042K79098k09358L22136j68398J75567K15485l83315L69943j00420
$$ plain form
16926 1208951 1387925 1300762 1304223 1514756 1020615 1289985 1493832 1442952 1621484 1605931
16916 1605931 1193790 1326306 1581345 1252607 1380106 1364918 1224651 1609982 1578108 1507525
16906 1507525 1468007 1476279 1577208 1656002 1470133 1458837 1641102 1737715 1948102 1772533
16896 1772533 1442449 1478989 1941753 1444111 1440576 1583816 1721338 2096816 1865823 1971121
16886 1971121 1524152 1709380 1798305 1707973 1780334 2049080 2140408 2035687 1546951 2131094
16876 2131094 2182855 1992064 2297267 2117726 2087938 1903385 2117009 2291518 2390583 2050588
16866 2050588 2377042 2458152 2585174 2382775 2483128 2276582 2380192 2530005 2722673 2597042
16856 2597042 2876140 2666782 2988918 2820520 2996087 3211572 2828257 3198200 3097780
16847C097780K82209j68119P7111j29454R6089Q1685O1498l8883j04272K95672
16837C551316k3525j1846K70832l42122K43244K40223n6158J50277L1907J14458
16827D168606k27150L83530J31107J14553j72014L04333j03416J80678n0737R828
16817D739318K43616J36313k625K41765j54400K18867L9831M19949l3365L21549
16807F170818M9699j6555K55610l69516L29464N71957R249K82451n2674J43250
16797G373753O2924O51711l40401J84846M7298O79121N4581K20499K6551K13953
16787I174836J16167O03603R3768M87113k8166P70179r6738P60392j23719R8972
16777A1856407N21718Q82309L4690P88919N30420L11859M41465M0824R54173L90226
$$ plain form
16847 3097780 3379989 3211870 3288981 3159527 3255616 3337301 3398799 3359916 3255644 3551316
16837 3551316 3527791 3515945 3786777 3444655 3687899 3928122 3871964 4022241 4054148 4168606
16827 4168606 3941456 4324986 4456093 4570646 4398632 4702965 4599549 4780227 4729490 4739318
16817 4739318 4982934 5119247 5116622 5358387 5203987 5422854 5462685 5882634 5849269 6170818
16807 6170818 6220517 6203962 6459572 6090056 6419520 6991477 7000726 7283177 7230503 7373753
16797 7373753 7436677 8088388 7747987 7932833 7980131 8659252 8713833 8934332 8960883 9174836
16787 9174836 9291003 9894606 9988374 10475487 10447321 11217500 11120762 11881154 11757435 11856407
16777 11856407 12378125 13260434 13295124 14084043 14614463 14926322 15367787 15408611 16362784 16753010
16767A6753010L77289R77591M41052Q21595O49098R30803O28939J239058J85586
16758B3004021R71567J505490R66990J109776R26993J123017J059991J726589
16750C2394434J662848J597446J438607J683787J897754K051347K239967K294244
16742D7260434K320810K818209K950364K935681L239224L770681L650241L839123
16734G2784767M487685M627821N093997N078141N711733N784841O209872O671861
16726A16450718O661810O731555P240991P130450P168575O624037O348314O016571
16718A70373021N469550M470655L143897K463316J002255l79633j544824k583128
16710A82415109m036598m668632n458292o255592o757713o917554p268268p216392
$$ plain form
16767 16753010 17130299 18107890 18548942 19370537 20019635 20950438 21579377 22818435 23004021
16758 23004021 23975588 25481078 26448068 27557844 28484837 29607854 30667845 32394434
16750 32394434 34057282 35654728 37093335 38777122 40674876 42726223 44966190 47260434
16742 47260434 49581244 52399453 55349817 58285498 61524722 65295403 68945644 72784767
16734 72784767 77272452 81900273 86994270 92072411 97784144 103568985 109778857 116450718
16726 116450718 123112528 129844083 137085074 144215524 151384099 158008136 164356450 170373021
16718 170373021 175842571 180313226 183457123 185920439 186922694 186543061 184998237 182415109
16710 182415109 178378511 173709879 168251587 161995995 155238282 148320728 141052460 133836068
16702A33836068p268549o803844o692355o459577o197685n870406n553137m902648
16694H4087867m692530m561530m452478l829649l711345l328337l199056l496571
16686E2816371k178740k943762k355205k272116k068087j790069j973703j984164
16678C5250525j212624j677393j238743j786223j065576j256871j078153r75674
16670B4959268j190543p93323j032410q47233j031801k61373j063233l81568q52213
16661A7505571o68961q21964l9535n68581n19087n54199n54216m9744o81780m02016
16651A2645488n98768m14930j03146l48037J17547k63219j194037j24670K72602
16642I988830m24906m94244l22649L96949k51410p26090j39759j62412O6426o11978
$$ plain form
16702 133836068 126567519 119763675 113071320 106611743 100414058 94543652 88990515 84087867
16694 84087867 79395337 74833807 70381329 66551680 62840335 59511998 56312942 52816371
16686 52816371 50637631 47693869 45338664 43066548 40998461 39208392 37234689 35250525
16678 35250525 34037901 32360508 31121765 29335542 28269966 27013095 25934942 24959268
16670 24959268 23768725 22975402 21942992 21095759 20063958 19802585 18739352 18357784 17505571
16661 17505571 16836610 16014646 15975111 15406530 14887443 14333244 13779028 13729284 13047504 12645488
16651 12645488 12046720 11631790 11528644 11180607 11298154 11034935 9840898 9716228 9988830
16642 9988830 9563924 9069680 8747031 9143980 8892570 8166480 8026721 7864309 7930735 7318757
16632G318757Q467k16560l76124L94839l04717j30280m20509J29443l78608l9325
16622E985383o2398l985m41238j17762p2785J48259n71636O05627m42590j36628
16612D890247J20575r3775j39414j66849q5636k41438j7221k6671J11176o07923
16602C743071j34655K35193J65872r2310j04181k97841j91896m5662J10898j30377
16592C258112L57930m08414J22112j30349l0780m1507n18305M14490q5514j73416
16582B764359K27079l48689K8580k5296o8817j06048J08841k13376K15656p1154
16572B511135p6187q8527j79982J05296O1445N2531j51549l14601M21345j49644
16562B191262l2478L42584o47309J37909j28397l7942J70380j76882q4717K7801
$$ plain form
16632 7318757 7327224 7110664 6734540 7129379 6824662 6694382 6273873 6403316 6024708 5985383
16622 5985383 5922985 5919000 5477762 5360000 5287215 5435474 4863838 5469465 5026875 4890247
16612 4890247 5010822 4917047 4777633 4610784 4525148 4283710 4266489 4239818 4350994 3743071
16602 3743071 3608416 3843609 4009481 3917171 3812990 3515149 3323253 3277591 3388489 3258112
16592 3258112 3616042 3207628 3329740 3199391 3168611 3127104 2608799 3023289 2937775 2764359
16582 2764359 2991438 2642749 2671329 2646033 2577216 2471168 2580009 2366633 2582289 2511135
16572 2511135 2434948 2346421 2166439 2271735 2333180 2385711 2234162 1919561 2340906 2191262
16562 2191262 2158784 2501368 1854059 1991968 1863571 1825629 1996009 1819127 1734410 1762211
16552A762211J23304O0391n8233R029R5217k33298R3865j37371J65966j73647
16542A707434k5127j30710o4650O2249k49094N07613k73912L19889l63834l29422
16532A160436k8443K37866K20926j47180k91979P8618k32321P0705K60496K60706
16522A589830l83632K15518j89340n2721k0441K88386n58791M92297L5998l92188
16512A024916k558L05681Q1276n50712l218K21023j19274L57742j36253j42511
16502A036112K860O0324J31247k80130j0425j48356J94183n7647K75480m99714
16492G03934L4052K1872L14895l15935O2526K20796j60436L1207j31004J60718
16482I42625R2856J0625Q7233j50812k34580J82936m0546o134O0480p0147j28613
$$ plain form
16552 1762211 1885515 1945906 1887673 1896702 1991919 1758621 1852486 1715115 1881081 1707434
16542 1707434 1682307 1551597 1486947 1549196 1300102 1807715 1533803 1853692 1489858 1160436
16532 1160436 1131993 1369859 1590785 1443605 1151626 1230244 997923 1068628 1329124 1589830
16522 1589830 1206198 1421716 1232376 1179655 1159214 1447600 888809 1381106 1417104 1024916
16512 1024916 1022358 1328039 1409315 858603 855385 1076408 957134 1314876 1178623 1036112
16502 1036112 1038972 1099296 1230543 950413 939988 791632 985815 928168 1203648 703934
16492 703934 737986 759858 1074753 758818 821344 1042140 881704 912911 781907 942625
16482 942625 1035481 1046106 1133339 982527 747947 930883 890337 884203 944683 874536 745923
16471G45923J82035k38942J09325M1757j76198j8189L41919k51813k50756L72102
16461H57163N3060C65490J52918L01163j02990l45579J74416L51975l55882P0068
16451F11579J14041L74688l75343J68380j94060J10056k76815j59441J88794J60167
16441G22046J12963j37551j0857n2966k9437J51106j53078j44455j4184k5393
16431D18194O7559l4714j82952J97837J51813k04548K65323K78658m35180K0252
16421E42242L8843J54953B56398J23430L74223k84304J10279B77436K5903K30376
16411E33715q3832m5456M79696l51101A93847L67972B43921N3634K4890N3721
16401C76166K65682L8610k19022A14856L26808K6970J6031r370j31046P7930r362
$$ plain form
16471 745923 927958 689016 798341 840098 663900 645711 987630 735817 485061 857163
16461 857163 910223 365490 518408 819571 716581 371002 545418 897393 541511 611579
16451 611579 725620 1100308 724965 893345 699285 809341 532526 373085 561879 722046
16441 722046 835009 697458 686601 633635 604198 755304 602226 457771 443587 418194
16431 418194 485753 451039 268087 465924 617737 413189 678512 957170 521990 542242
16421 542242 581085 736038 256398 379828 754051 469747 580026 277436 303339 533715
16411 533715 449883 404427 884123 533022 193847 561819 243921 297555 322445 376166
16401 376166 641848 680458 461436 114856 441664 468634 484665 475295 344249 422179 412817
16390D12817K07582k29417G3665K18422q5366K35261j69478j3157J00565R9710
16380D59622K70932C9245K39337R2193N7555j54120J85704E1799M50678K0929
16370E23406I5967M52473A07491M4308N56822C11398q4301j3881M40473k66760
16360C86929j47443R8741l0248H3527K1596J23839K39322m1743a21178C44045
16349A09751c926B52232K42888K6543j75242j5596r386E3853J62059O3474J91713
16338D71099C218J89876J88537j82201L89351j53162p7652o4725J63897A80863
16327D62683j70655R1490j68577p8602K17717K49509B01865a9035B35378K23252
16317D58630k19594Q050a42104B17335J52257K07545k77046j28242K69056k13651
$$ plain form
16390 412817 620399 390982 73665 292087 206721 441982 272504 259347 359912 459622
16380 459622 730554 39245 278582 370775 428330 274210 459914 51799 502477 523406
16370 523406 95967 548440 107491 151799 708621 311398 227097 213216 653689 386929
16360 386929 239486 338227 307979 83527 105123 228962 468284 426541 -121178 344045
16349 109751 -3926 252232 495120 521663 346421 330825 321439 53853 215912 279386 471099
16338 471099 3218 193094 381631 199430 588781 435619 357967 293242 457139 180863
16327 462683 292028 383518 214941 136339 354056 603565 201865 -19035 235378 458630
16317 458630 239036 247086 -142104 217335 369592 577137 300091 171849 440905 227254
16307B27254F3338K13353j1328f8636A55076P2057J23179F7451L66333r6872m5784
16296B91128J29847F6830M1056K8881Q5521a4576A32187K78624j79701a20726
16285D06480L5622J9962A98954J16884j749j32459K21385H4989R2925J6923p3273
16274A21564M7648J49763l5431J2446K11690G3219A7032L07464A16167L54683
16264D70850A8358h39B80895h833A05999J77097j02334J04991K5104K0221h5399
16252C46485D399J01539K1160J77869b96731B24884K26778j06853i4772C42826
16241G2994h2745j60206A51098o078L42454H7599K09782A45757K6676E9299r109
16230E0190H343K52667J63483F2145b5356C30622d0332a2679D4170J71441A794
$$ plain form
16307 227254 63338 276691 265363 -68636 155076 227133 350312 67451 433784 336912 291128
16296 291128 420975 66830 107886 136767 222288 -14576 132187 410811 231110 -120726
16285 406480 442102 462064 198954 315838 314089 181630 403015 84989 177914 194837 121564
16274 121564 169212 318975 283544 295990 507680 73219 17032 324496 116167 470850
16264 470850 18358 -839 280895 -8833 105999 283096 180762 285753 310857 331078 -85399
16252 346485 4399 105938 127098 304967 -296731 224884 451662 344809 -94772 342826
16241 72994 -82745 -242951 151098 145020 487474 87599 297381 145757 172433 59299 50190
16230 50190 8343 261010 424493 62145 -25356 330622 -40332 -12679 44170 215611 1794
16218a55062B25876a612p823C79261j01004o1092a52270C71963A48610Q961a62542
16206A96626a71151e6768j12780f8230C15797J37568c2078E3615c67991C17535
16195F3099Q0664a01581d1745F3408b06790d8923r3663C01000D8839e5235C48166
16183a7383E1573j2501J47087O1934c2843m9128l8279A48250J41107j24504j6556
16172A48297b0261A35489g1400b5651A53005K13981a43377C44457A71715a10758
16161A11605N6045Q8304e5689A95112k9508D0522K88479H3982C1197i881B53381
16149i1580B17099G6946l724K81443h9727k31600c6974h000A52167f9736I6493
16137A25843E3721K7728K2161n0477j8910K02925j13506J40395B4934a28874A07888
$$ plain form
16218 -155062 225876 -1612 -9435 379261 278257 217165 -152270 371963 148610 157571 -162542
16206 196626 -171151 -56768 -169548 -68230 315797 453365 -32078 53615 -367991 317535
16195 63099 143763 -101581 -41745 63408 -206790 -48923 -142586 301000 48839 -55235 348166
16183 -17383 51573 39072 186159 248093 -32843 -81971 -120250 148250 289357 164853 148297
16172 148297 -20261 135489 -71400 -25651 153005 366986 -143377 344457 171715 -110758
16161 111605 167650 255954 -55689 195112 165604 40522 329001 83982 31197 -9881 253381
16149 -91580 217099 76946 73222 354665 -89727 -321327 -36974 -8000 152167 -69736 96493
16137 125843 53721 81449 103610 53133 34223 237148 123642 264037 24934 -128874 107888
16125C87892F6512M4216a76567j78117I9151h8880A50695a76407q2841m7160a35710
16113A58161R056k1105H36K02921O3767g2350j98258C15534C6703b77051G229
16101C30873f0711B83162D1890J25725a40433N8266A5590N0140O2178k136b15047
16089G4004K02028A7567a2195D8189Q8545A6964L2978a3017A15956i0551A65309
16077a3993E62761b1585k42349E9698a42444e506m11881c9070C68040I019i8874
16065g5914E3802k4871a91816F2699i3462C17183g9984A95871a16369c3219c679
16053c1478A16956b6827A64979b4315C62389i7336A49148l0644c7535A33760b37118
16041c6848Q115B64643d11303A14112N922h651k50586k2287F6470B5463a23730
$$ plain form
16125 387892 66512 110728 -176567 -354684 99151 -88880 150695 -176407 -259248 -306408 -135710
16113 158161 167217 146112 836 203757 267524 -72350 -270608 315534 36703 -277051 7229
16101 330873 -60711 283162 41890 167615 -140433 -82167 15590 65730 127908 125772 -215047
16089 74004 276032 17567 -12195 48189 136734 16964 49942 -13017 115956 -90551 165309
16077 -13993 562761 -21585 -263934 59698 -142444 -5506 -417387 -39070 368040 9019 -98874
16065 -75914 53802 28931 -191816 62699 -93462 317183 -79984 195871 -116369 -33219 -3679
16053 -31478 116956 -26827 164979 -24315 362389 -97336 149148 118504 -37535 133760 -237118
16041 -36848 -28733 264643 -411303 114112 120034 -8651 -259237 -281524 66470 25463 -123730
16029C14738d6042j72772A02904M1064k8114P2626Q5496i8063A21352a33264A62468
16017g678I3505m5716a65320F1024K85168C1783E29f4740I1758a43887A1920J940
16005A3860F270c9160H9459J95606d4866k43852A15581J33A4743c5561F5304b03512
15992G6570i2769L6971B62942o7488a54602K5675e8596m358A37848J4144J3621
15981A65613G1629J449Q9290a65398b5119l7483q2921k30864I4481O5710m5062
15970A15129a94585C73857j83933j5056K1914K7345a94918e3602r2688C74179
15959a50503B09461K66675h2591q0220b0941j82091B3261O4208l2349a29069k7890
15948a56959j06264f8331k46177B00709G7061J17360a30955C85496a02598A4442
$$ plain form
16029 314738 -46042 -218814 102904 143968 115854 188480 273976 -98063 121352 -133264 162468
16017 -7678 93505 47789 -165320 61024 346192 31783 529 -64740 91758 -143887 11920 13860
16005 13860 6270 -39160 89459 285065 -44866 -288718 115581 115714 14743 -35561 65304 -203512
15992 76570 -92769 -55798 262942 195454 -154602 -128927 -58596 -62954 137848 151992 165613
15981 165613 71629 73078 162368 -165398 -25119 -62602 -145523 -376387 94481 160191 115129
15970 115129 -194585 373857 189924 174868 196782 224127 -194918 -53602 -146290 374179
15959 -150503 209461 476136 -82591 -162811 -20941 -203032 23261 87469 55120 -129069 -156959
15948 -156959 -263223 -68331 -314508 200709 77061 194421 -130955 385496 -102598 14442
15937a49226B99093j36288b80585N7273b9748A80142C1591b75249f5469Q765o0219
15926a16923A56257e7993n3465E811i7407a4329C23067b5578j00911c9822j44923
15915a84745M125H0680b09210G2964a13030F9958e89348b73704J5267B21160a54593
15903B47687a11999p5555B3951b5157A57159b4618l14355A39785F6020R381k5347
15892E0054a26629A43729d23417F2629a24623A88428o1312L15668a75862A66934
15881B8697K55314b99190g6686F0521e769A0818a63393A0437c01579D8608b83124
15869A58499a27475d4156B15009K0833e5277n1826B22138q0719b6127M690l4662
15858e6099q2373L6872k77180A6792J82411K08882c6336B44000a78265r459A03588
$$ plain form
15937 -149226 299093 162805 -280585 -223312 -29748 180142 31591 -275249 -65469 -56704 -116923
15926 -116923 156257 -57993 -111458 5811 -97407 -14329 323067 -25578 -126489 -39822 -184745
15915 -184745 -180620 80680 -209210 72964 -113030 69958 -589348 -273704 -258437 221160 -154593
15903 247687 -111999 -187554 23951 -25157 157159 -24618 -338973 139785 66020 75401 50054
15892 50054 -126629 143729 -423417 62629 -124623 188428 127116 442784 -175862 166934
15881 28697 284011 -299190 -76686 60521 -5769 10818 -163393 10437 -301579 48608 -283124
15869 158499 -127475 -44156 215009 235842 -55277 -107103 222138 141419 -26127 -21437 -56099
15858 -56099 -138472 -101600 -378780 16792 199203 408085 -36336 244000 -178265 -187724 103588
15846a65744P9972N909A07132a96578r6778C3406J82564C2850b59575a27351B49826
15834B39202a75153N1883j25722D64500b1790A79396O2560C2058J96692k3602
15824B05148e4426m5438B9133b72753Q7559g7931A03808a92328j22729e189C4866
15812A51639L36987A6093M8531a16442A50570c81339n159J4489d5428r9728b8024
15800a36208A47670b89292e3511J8898A47518K2531b30740c6100P904J341C8444
15788a61558f6802j4402L0437j50829A69684h9391j39360c0052k5214k0484g763
15776a33081A27367B9769P900a17888F3443L82880a51100b1067j229k54275B6690
15764C50485r2328b11195M4430B04406G5914Q2543c27929D6167h9870m4517j6062
$$ plain form
15846 -165744 -85772 -79863 107132 -196578 -293356 33406 215970 32850 -259575 -127351 249826
15834 239202 -175153 -123270 -248992 464500 -21790 179396 241956 32058 228750 205148
15824 205148 -54426 -99864 29133 -272753 -185194 -77931 103808 -192328 -315057 -5189 34866
15812 151639 488626 16093 64624 -116442 150570 -381339 -386498 -372009 -45428 -145156 -28024
15800 -136208 147670 -289292 -53511 -34613 147518 170049 -230740 -36100 -28196 -26855 38444
15788 -161558 -66802 -81204 -50767 -201596 169684 -89391 -228751 -30052 -55266 -75750 -7763
15776 -133081 127367 29769 37669 -117888 63443 446323 -151100 -21067 -22296 -276571 26690
15764 350485 258157 -211195 -166765 204406 75914 158457 -327929 46167 -89870 -134387 -150449
15753a50449k34946i8303k46991C13314c02939D15958b34115P5903B19534F9410
15742a00723r408A81943N436D5955K10167a14818n2560A68667M9082j04000E3524
15730B00808a8818E5887K6572b06218c9163k63154A67110b50124A38425J58133
15720B96558A02182B1428a42483c4808j32003A5853h7259j42127B8104O7430f1806
15708b27346E1996L1596I207d6501q4119A55380b5849A51888e277o4666B13336
15696e9519n3257I5799e5926B49167c86194g6864n6595k29053A57922i0185G7566
15684C27230b57274P5534h2337K3228k8087c7201B42726F2600d30973H6531a74417
15672b02715C15801b69113A13799l4144K74277A71925o7018l2489b96644B3193
$$ plain form
15753 -150449 -385395 -98303 -345294 313314 -302939 415958 -234115 -158212 219534 69410
15742 -100723 -110131 181943 187379 45955 256122 -114818 -167378 168667 217749 113749 53524
15730 200808 -18818 55887 82459 -206218 -39163 -302317 167110 -250124 138425 296558
15720 296558 102182 21428 -142483 -34808 -166811 15853 -87259 -229386 28104 95534 -61806
15708 -227346 51996 83592 9207 -46501 -130620 155380 -25849 151888 -5277 -69943 213336
15696 -59519 -112776 95799 -55926 249167 -386194 -76864 -133459 -362512 157922 -90185 77566
15684 327230 -257274 -181740 -82337 -59109 -87196 -37201 242726 62600 -430973 86531 -174417
15672 -202715 315801 -269113 113799 79655 353932 171925 104907 72418 -296644 23193
15661a63413A60803a02702M3204A53975d14503a87876F4083c29483d6651C7021
15650a5621n1083b1818j43979m3888k81k66206E1656c4346o308H4049O4271j5715
15638A32605c06111A20995a37738B7535e5372E2677J29120a40659B80868r7226
15628A83642a75979H5554a1402B65631A03583a25679l29021i772l42147H3966
15617b53701A48096k2230k2970f936j55621n0047G6834C4842b79709k0410G1940
15605A47080f8923C61438c36075B39419B9740Q3540f9o0724m7410j8019A57891
15593d5073k87423K0654J50866F2974a55942M9749B91228F980J34651b9255A71952
15581G1219O1855e1216O658l52283g6275E2732b43292N8877B31947a56348d2301
$$ plain form
15661 -163413 160803 -102702 -59498 153975 -414503 -187876 64083 -329483 -46651 37021
15650 -15621 -66704 -21818 -165797 -209685 -209966 -476172 51656 -34346 -40654 84049 148320 132605
15638 132605 -306111 120995 -137738 27535 -55372 52677 181797 -140659 280868 183642
15628 183642 -175979 85554 -11402 265631 103583 -125679 -454700 -9772 -351919 83966
15617 -253701 148096 125866 102896 -6936 -162557 -212604 76834 34842 -279709 -300119 71940
15605 147080 -68923 361438 -336075 239419 29740 113280 -69 -60793 -108203 -126222 157891
15593 -45073 -332496 -311842 -160976 62974 -155942 -106193 291228 6980 141631 -29255 171952
15581 71219 133074 -51216 -44558 -396841 -76275 52732 -243292 -184415 231947 -156348 -42301
15569b59355A73856a72759a6462A74536q3203a61351j8073Q4786C38772d3572
15558A89746a18981l9933A28568a15194C77673A45419d3554j82196Q5705M9483
15548i0562A58661b43756k9093B54998C5082b15838D3180N2028k1834C6308Q4523
15537A20831Q0013r9286a89534A85420d0098j9274K4620C61767f1689B69905b87910
15525A41591R5569I7190g8148B75612i37E0589a16517j31343A02931P2080J97884
15514C72895A61013a03474K8422j08605N753j10665M0385B13000C9685a34921
15503h0117C9290J84390a29201B0027J61302b27604A17198b18313D6793K7025
15493G3818a65698k4198I371J78235b88078I0092J0049i1036C8664b3724B9802
$$ plain form
15569 -259355 173856 -172759 -16462 174536 91333 -161351 -179424 -94638 338772 -43572
15558 189746 -118981 -158914 128568 -115194 377673 145419 -43554 -225750 -140045 -90562
15548 -90562 158661 -243756 -272849 254998 35082 -215838 43180 95208 73374 36308 120831
15537 120831 200844 101558 -189534 185420 -40098 -59372 -34752 361767 -61689 269905 -287910
15525 141591 237160 97190 -78148 275612 -937 50589 -116517 -247860 102931 175011 372895
15514 372895 161013 -103474 -75052 -183657 -177904 -288569 -248184 213000 39685 -134921
15503 -80117 39290 223680 -129201 20027 181329 -227604 117198 -218313 46793 73818
15493 73818 -165698 -189896 9371 187606 -288078 90092 100141 -91036 38664 -23724 29802
15481g1361J8756k6834B10448b17890C6651j0821D143i8239o9214D5940a16148
15469e6935k3222H154a00438B61091A15972a65015I2107h4664k50079A0778K30794
15458B41572j1991r2101E8482K4588b03617A63529b31508f1842b5671j81755Q7729
15447a19697A81700a1826E2363a96556d244l4246j149q5073k3672D7882J01029
15436A48911B3192g7875m0714d3696A29800J49398d6584C98362A07909J71550
15426B79459f6768E0577A8010L52554a31636e582q6628F0545K80162j07140m1258
15415A92309h4335a7105B86670J25591F9618R718B1693c551B75992a87509L4747
15404a52762j35044E5961a73042f7194A09638J03257I3465j4704M968J48689A11510
$$ plain form
15481 -71361 -52605 -79439 210448 -217890 36651 25830 4143 -98239 -167453 45940 -116148
15469 -56935 -80157 8154 -100438 261091 115972 -165015 92107 -84664 -334743 10778 241572
15458 241572 229581 137480 58482 83070 -203617 163529 -231508 -61842 -25671 -207426 -119697
15447 -119697 181700 -11826 52363 -196556 -4244 -38490 -39639 -124712 -148384 47882 148911
15436 148911 23192 -77875 -118589 -43696 129800 279198 -46584 398362 107909 279459
15426 279459 -66768 50577 18010 370564 -131636 -5582 -92210 60545 340707 233567 192309
15415 192309 -84335 -17105 286670 412261 69618 79336 21693 -3551 275992 -187509 -152762
15404 -152762 -287806 55961 -173042 -67194 109638 212895 93465 78761 83729 232418 111510
15392a5810C15585a7412A65418a06126M9401G960h0717j30463O9275c0506j55796
15381a86302p0657A0518c2708j6391G6084a211G2007j4857K13715B8935e7804
15369F3242J4175j5006j6174b6466B10014A0719K00095C0221a36891A10679P3576
15358A84255h2084D2032K27816j25007f6121J2739A03377c00735J43059D59228
15347B86771g2725j77344J12589K6324a8805N993k04275A02153N4272h2779B8801
15335d1426B19038A07223Q1144K18756c8815k4165k50242Q1134l8053C41b43372
15323c1892a2215B5268p041a84425f5088A08956c73239C05266H7241M5860K00627
15312C33728d48260K16933A55939o6652a98315n4952A56498F7209b01624A23198
$$ plain form
15392 -15810 315585 -17412 165418 -106126 -56725 7960 -80717 -211180 -141905 -30506 -186302
15381 -186302 -256959 10518 -32708 -49099 76084 -1211 72007 57150 270865 28935 -57804
15369 63242 77417 62411 46237 -26466 210014 10719 210814 30221 -136891 110679 184255
15358 184255 -82084 42032 269848 144841 -66121 -53382 103377 -300735 -157676 459228
15347 286771 -72725 -250069 -137480 -111156 -18805 -12812 -217087 102153 156425 -82779 28801
15335 -41426 219038 107223 188367 407123 -38815 -62980 -313222 -232088 -270141 341 -243372
15323 -31892 -12215 25268 18227 -184425 -65088 108956 -373239 305266 87241 133101 333728
15312 333728 -448260 -231327 155939 89287 -198315 -253267 156498 67209 -201624 123198
15301A07765J29086a02578B78956a73115b2479B77071P7366e7621b930o2166R871
15290e5225C53301b8948B00281b94573b2292E8753j3775J30719c4731j5804m14306
15279d64841a83638n4660a3233m8110G4434J5850R1K36409C8608M3931j8409a66206
15266A24043M0227J76108I772J3321K86749j41375R8027a42437I6668a43312m8923
15255a92235D2520b4010B16950H9872m4053J47597K21053k1363L17194Q12165
15245A522465J488963j156338O33519l86685F54710k77237J00094C6731J55023
15236A91754J00780a4351j6370G5665E719a12909a7548D474M2990Q7487k4093
15225A10858n3596L42527h9922C09109K3381b31131E2834a4974m5734B23194h2113
$$ plain form
15301 107765 236851 -102578 278956 -173115 -22479 277071 354437 -57621 -2930 -65096 -55225
15290 -55225 353301 -28948 200281 -294573 -22292 58753 44978 175697 -34731 -50535 -464841
15279 -464841 -183638 -238298 -13233 -61343 74434 90284 90375 326784 38608 82539 64130 -166206
15266 124043 164270 340378 9772 23093 309842 168467 266494 -142437 96668 -143312 -192235
15255 -192235 42520 -24010 216950 89872 45819 193416 414469 393106 710300 1522465
15245 1522465 3011428 1855090 2488609 2101924 654710 377473 477567 36731 191754
15236 191754 292534 -14351 -30721 75665 5719 -112909 -17548 4474 47464 134951 110858
15225 110858 57262 399789 -89922 309109 332490 -231131 52834 -14974 -60708 223194 -82113
15213A41970i1329A31266J83403g9533k6695A09714b8175j15127B9655a48705
15202A78430g6811B02310J43302a43005B79169f8155C4217P9701a89064B69641
15191B5482M6146b43949d4748j23623G6073g6262k99638A35453f9550C74090A04100
15179A88927d5744p822B98267C9084N1367K79904b6945G6117e3851A15414K3340
15168A38754f8584A64861O1759r3024b37940B28175L09815d2735l3416B46097
15157a94357D37304j76433m0523a47277M4260L0405D3186O7396c7398B17567E7132
15145C06907H7800k650Q8210J04394a68710A68096K10123F341A214b33513C5069
15133e796A43513J21836a83935E4895P6107J03478R7883g97o5749B17516i8458
$$ plain form
15213 141970 -91329 131266 314669 -79533 -106228 109714 -28175 -143302 29655 -148705
15202 178430 -76811 202310 345612 -143005 279169 -68155 34217 113918 -189064 269641
15191 25482 71628 -243949 -44748 -168371 76073 -76262 -375900 135453 -69550 374090 104100
15179 188927 -45744 -53566 298267 39084 90451 370355 -26945 76117 -53851 115414 138754
15168 138754 -68584 164861 226620 133596 -237940 228175 537990 -42735 -76151 246097
15157 -194357 437304 260871 220348 -147277 -103017 -72612 43186 110582 -37398 217567 57132
15145 306907 87800 85150 173360 277754 -168710 168096 378219 6341 1214 -233513 35069
15133 -5796 143513 265349 -183935 54895 131002 234480 332363 -797 -66546 217516 -98458
15121C9531a89606B73572b63446D68102j05989j18626l3691I120M84564a5325
15110g4766A43268K16104i3054D4807K1067l2041L2239L51110A65583M44077c0547
15098a88925A85727m4671o9012J2061L53336l5587J25582A0870a24291c4051l6792
15087g0843B10800J91630C2651L49003d5569j6266A01336K85782F1891J22255
15077A84146G7120b06769A4853a73350f5393p7346C4039Q0110J2458m9203L40882
15066D18286A71082J17821H471P0671N2401K278J61513j17307J02245a06149A9194
15054b69653E3820J57470p1298j3482P0742r354A4706R2785K05026K49739h9983
15042B00249J10111j04447l597e4186J807p9953b9667h84F3172N2528r385D8733
$$ plain form
15121 39531 -189606 273572 -263446 468102 362113 243487 209796 9120 493684 -15325
15110 -74766 143268 359372 -93054 44807 65874 33833 66072 417182 165583 609660 -30547
15098 -188925 185727 141056 72044 84105 437441 401854 527436 10870 -124291 -34051 -70843
15087 -70843 210800 402430 32651 381654 -45569 -61835 101336 387118 61891 184146
15077 184146 77120 -206769 14853 -173350 -65393 -142739 34039 114149 126607 77404 418286
15066 418286 171082 288903 8471 79142 131543 133821 295334 178027 280272 -106149 19194
15054 -269653 53820 211290 139992 126510 197252 187898 14706 107491 312517 562256 -89983
15042 200249 310360 205913 202316 -54186 -52379 -132332 -29667 -884 63172 115700 106315 48733
15029f0447H4565K17398A48124J43656j8793n0975F9459a0609m8283G4787J26278
15018B01065a09654b9201A57415J03206I7367k9124h7795A75782K31703j39227
15008B68258p0734M9860K88930A36082K21877A51372L26780p8037D7124M4871
14998I1995K77171o4517O6258a34689e0475A77530R9614c3462B53887a40283A04758
14986H2807L31422F804J32971a59924A98373I7539K80467d9971A32362L28196
14976D60558k26882K57253q8149j11432b979A15904Q4404Q9685a7328C80871j02541
14965B78330a804A04022a65644A54890M2311L03866A36985L19913A29819J66722
14955B96541J77896k30003o2219p363P7818N6077j20707m1802J88202C7579L42783
$$ plain form
15029 -60447 84565 301963 148124 291780 272987 222012 69459 -10609 -58892 74787 201065
15018 201065 -109654 -29201 157415 260621 97367 68243 -87795 175782 407485 268258
15008 268258 197524 247384 536314 136082 357959 151372 478152 400115 47124 91995
14998 91995 369166 304649 370907 -134689 -50475 177530 277144 -33462 253887 -140283 104758
14986 82807 414229 6804 139775 -159924 198373 97539 378006 -49971 132362 460558
14976 460558 233676 490929 402780 291348 -2979 115904 200308 289993 -17328 380871 278330
14965 278330 -1804 104022 -165644 154890 197201 501067 136985 456898 129819 296541
14955 296541 474437 244434 182215 174852 252670 308747 188040 146238 334440 37579 380362
14944C80362m176G4768M5577J40577k166A670L98676a53304B46571K00835A09274
14932D51085A52714j2993L0309K05441a48060e0092C58338O619N410F5146J04146
14921A69292G0486a88656C08939J3878o8181L5296L6485M7576m4547H4426K42375
14910C26801N73535C61046j17162m0071N5263J52325o108j93477L91434j50198
14900D53052I0803K79481o2175J26455J62390J5372j16261M8085B42440J54708
14890C97148j77491J29322K61542B42749G6974b06664C12730r0980K32748I9208
14879C45547n7579L52919m483B17133M8930L3861k2683M9798A23623K99158Q335
14868D31116j06969G6278a80992E29176K3046k71387j13830N4259P8891P4798
$$ plain form
14944 380362 376186 74768 120345 260922 258756 1670 400346 -153304 246571 447406 109274
14932 451085 152714 139721 170030 375471 -148060 -50092 358338 364957 370367 65146 169292
14921 169292 70486 -188656 308939 322817 254636 289932 326417 373993 329446 84426 326801
14910 326801 900336 361046 243884 203813 259076 411401 405293 211816 603250 453052
14900 453052 90803 370284 308109 434564 596954 612326 496065 544150 242440 397148
14890 397148 219657 348979 610521 242749 76974 -206664 312730 221750 454498 99208
14879 345547 287968 640887 636404 217133 266063 299924 277241 327039 123623 422781 431116
14868 431116 324147 76278 -180992 529176 552222 280835 167005 221264 300155 374953
14858C74953A87102n7373L20684j90346J53535j80865K54695m2098A08971R7304
14848B06275J69280j58273M02734P2481k22422j64860R5527M2579J32191m6942
14838E28570A39700O8615J58437J06656J69651B59536J16916C0459N70755O6926
14828F68140j88360J33237C7109L05630R0024K57456M6435A10502a54415C35926
14817D62235j80575a2388E16529p9512j5356J69295r1548o9990L28264l44873
14807D12809J97258B59087J11692K66415B95711A19112N96713j62995P4984J47566
14797G75380l64596j08719K35478j43463M27003k98804J48722k96361K4901O4396
14787D63937J57567j01281L4090j92386L79906j04675k93962J42985K54001A28263
$$ plain form
14858 374953 187102 129729 450413 260067 413602 232737 487432 445334 108971 206275
14848 206275 375555 217282 620016 692497 470075 305215 400742 443321 575512 528570
14838 528570 139700 208315 366752 473408 643059 259536 376452 30459 601214 668140
14828 668140 479780 613017 37109 342739 432763 690219 736654 110502 -154415 335926
14817 462235 281660 -12388 516529 437017 421661 590956 499408 429418 757682 412809
14807 412809 610067 259087 370779 637194 295711 119112 715825 552830 627814 775380
14797 775380 410784 302065 537543 394080 821083 522279 671001 374640 399541 463937
14787 463937 621504 520223 554313 361927 741833 637158 343196 486181 740182 128263
14776E03911R0606J76343k50649L24537k83131j99816J23825B27850L57841m3811
14766E41880J73635B42429M42509j29482N7684l6423k35109J42122k7659R6289
14756E52360j26418K72117j62920L39788j85081l16506J52537q8971K28561C06081
14745D35127K0438k0057q98N60256l86424J93800m6479r3709K86434k97300R2921
14734G44109l25623K48572j29870N50661l39811k50329N8556K79093k47611L46118
14724I33865r6158k5487J93917k20501O078j16075j58337J50969j36207K06353
14714G38417k85536K43102R988l0284j34211J80579J60934j04152Q3081m9540
14704H12378l50928Q48520l03189j73910l30908J92550K11969k32435K1489J6871
$$ plain form
14776 503911 594517 770860 520211 844748 561617 361801 485626 227850 585691 541880
14766 541880 715515 242429 684938 555456 613140 576717 341608 483730 456071 552360
14756 552360 425942 698059 535139 874927 689846 373340 525877 436906 665467 306081
14745 435127 455565 435508 434610 994866 608442 802242 755763 662054 948488 651188 744109
14734 744109 418486 667058 537188 1087849 748038 497709 556265 835358 587747 933865
14724 933865 837707 812220 1006137 785636 791714 675639 517302 668271 532064 738417
14714 738417 452881 695983 705971 675687 541476 722055 882989 778837 861918 812378
14704 812378 461450 1309970 1006781 832871 501963 694513 906482 674047 695536 712407
14694G12407l05800K49547J69023m6319j9198K60946l21643L65859D77564M98566
14684I76130k14542j76689L36989j62001R9355J02391r6949J43022l39717J35575
14674H03564k8033K35080J99214P0870j65043l10236L06629k05039j48256K4098
14664G82848N3319R3185P2596j48330J14293K30701m03088j34913J89736M22843
14654A273190k17631k6953p493J95361j41210j73067K19847q7073j32250N6091
14644I58812m1362K10968K32394m24168J84325j4949J72326k5631l65408M0217
14634I27524K59788R6263j87792j00162j06150M85884l05536J05577j07797Q1232
14624A148831L3633Q656J26190j25724J80997J3245j85998O0717k32566L95704
$$ plain form
14694 712407 406607 656154 825177 778858 759660 1020606 698963 1064822 477564 976130
14684 976130 761588 584899 921888 759887 859242 961633 864684 1007706 667989 803564
14674 803564 775531 1010611 1209825 1280695 1115652 805416 1112045 907006 758750 782848
14664 782848 836167 929352 1001948 853618 967911 1198612 795524 660611 850347 1273190
14654 1273190 1055559 1028606 1021113 1216474 1075264 902197 1122044 1034971 902721 958812
14644 958812 917450 1128418 1360812 936644 1120969 1106020 1278346 1252715 887307 927524
14634 927524 1187312 1283575 1095783 995621 889471 1375355 1069819 1175396 1067599 1148831
14624 1148831 1182464 1191120 1317310 1191586 1372583 1385828 1199830 1260547 1027981 1423685
14614A423685o1310j14816j06153K84326k21332K65747k8555l8821j52998j18843
14604A130930M50942Q9658l83977J41407Q9739l95375L80215N2275o3855k07124
14594A284835J63115j61722L93779L42524k09603l20135L04126l15792L80474
14585A861601k72145K15825j16271L09062k71681q1322J82708j08887M46982l76282
14575A789590j04101K83749k06912K74576k9289j89358L71142k71281K77723l09552
14565A886287L9891O7299J98665j785m3097L17474k5319M19215K9655J38261j25045
14554B901501J41966K51938K59491P54562O20052J283215K836714O596083J6061379
14545C1706901K1646405B4172971H635706l166774J160254L64436B753058q05521
$$ plain form
14614 1423685 1362375 1247559 1141406 1425732 1204400 1470147 1441592 1402771 1249773 1130930
14604 1130930 1581872 1671530 1287553 1428960 1518699 1123324 1503539 1555814 1491959 1284835
14594 1284835 1447950 1286228 1680007 2022531 1812928 1492793 1796919 1481127 1861601
14585 1861601 1589456 1805281 1689010 1998072 1726391 1645069 1827777 1718890 2165872 1789590
14575 1789590 1685489 1969238 1762326 2036902 2007613 1818255 2189397 1918116 2195839 1886287
14565 1886287 1926178 1993477 2192142 2190357 2147260 2464734 2439415 2858630 2888285 3026546 2901501
14554 2901501 3043467 3295405 3554896 4309458 4929510 6212725 9049439 15645522 31706901
14545 31706901 53353306 24172971 8635706 5468932 6629186 6993622 2753058 1947537
14537A947537j1257l33826K5253L63510K09741n28278q9158N16087K19330m47611
14527A871328J987L60950k82729J45173j35888Q8707p0124J44025K74020m3838
14517B353611k15070K17494L2203M4001J23506N7122K7734m0135j70182q6884
14507B343400M21528m5103p6946L03335k18567j12488Q4360l9133L08109o3814
14497B904681p2827O0871l6351K81247j6301J58914k87423L62019k5357j45067
14487C184406l01663P59107n85174J89541j88880J38454K29899K38680m43170
14478C221200L11648j3356k64904M19230k78165O02874m07019O185J16631K76884
14468C991208m8612L38852K0360j58505m6376P0884K70254l46891O61496q18520
$$ plain form
14537 1947537 1936280 1602454 1627707 1991217 2200958 1672680 1583522 2099609 2318939 1871328
14527 1871328 1873315 2234265 1951536 2096709 1960821 2049528 1979404 2123429 2397449 2353611
14517 2353611 2138541 2356035 2388238 2432239 2555745 2612867 2640601 2600466 2430284 2343400
14507 2343400 2764928 2719825 2642879 2946214 2727647 2615159 2699519 2660386 2968495 2904681
14497 2904681 2831854 2892725 2856374 3137621 3121320 3280234 2992811 3354830 3329473 3184406
14487 3184406 2882743 3641850 3056676 3246217 3057337 3195791 3425690 3664370 3221200
14478 3221200 3532848 3519492 3254588 3673818 3395653 3998527 3591508 3597693 3714324 3991208
14468 3991208 3942596 4281448 4301808 4143303 4096927 4167811 4438065 4091174 4752670 3934150
14458C934150N79793J10685J78048m55707L27837J27523o3931J07281M6338p0905
14448D821112j50336O65443j68200k42358K72500L55752j13402J18800j94043
14439E365268Q0182J96867K6779J93150j61840K82894L20530m6488j32987J44257
14429F268612k47833J15771J16401R0398N77256j82358L36029k59336J75173j29566
14419F860547O71616k22990r8888J12268N10658J94259m12387P8786K84957L96164
14409H374990O167L95683j20897J36972K6297j93558M26804L15624J55040q04
14399I522318L25103P8545K41903l51019M88554L83593j28392L07991L31248J57390
14389A1357234l55518O08356M43838k24143L36471K8984M11021m2269P02542l9239
$$ plain form
14458 3934150 4513943 4624628 4802676 4346969 4674806 4802329 4738398 4845679 4892017 4821112
14448 4821112 4670776 5336219 5168019 4925661 5198161 5553913 5440511 5559311 5365268
14439 5365268 5445450 5642317 5669096 5862246 5700406 5983300 6303830 6257342 6124355 6268612
14429 6268612 6020779 6136550 6252951 6343349 6920605 6738247 7074276 6814940 6990113 6860547
14419 6860547 7532163 7309173 7210285 7322553 7833211 8027470 7615083 7693869 7978826 8374990
14409 8374990 8381157 8776840 8655943 8792915 8819212 8625654 9052458 9368082 9523122 9522318
14399 9522318 9847421 9925966 10167869 9816850 10305404 10688997 10560605 10868596 11199844 11357234
14389 11357234 11001716 11610072 12053910 11829767 12166238 12195222 12606243 12563974 13266516 13227277
14379A3227277M53679J35452J45896L53040K39255L80322M02544K8388M20453
14370A5786306j88170N75367O28517K34980J97583N46798J79639N17167L49558
14361A8827745K44967M11958K86942P75391j36024P61649O65366N77578K95356
14352B2710928P02242N76559Q37253J72098O60371O39138P23824O58370Q98971
14343B8579754N40817J234136m4227J462180R66168L68345J285036Q66275J013089
14334C6271573J208773J565835N28928J147947J760195J023570J322568J134902
14326D5964291J781326J791914J899173J337292K296128J939865J737080J862944
14318F0610013K478455K417872K369415K686818K562816K985033L211073K882559
$$ plain form
14379 13227277 13680956 13816408 13962304 14315344 14554599 14934921 15337465 15365853 15786306
14370 15786306 15598136 16173503 16802020 17037000 17234583 17781381 17961020 18478187 18827745
14361 18827745 19072712 19484670 19771612 20547003 20410979 21172628 21837994 22415572 22710928
14352 22710928 23413170 23989729 24826982 24999080 25659451 26298589 27022413 27680783 28579754
14343 28579754 29120571 30354707 30310480 31772660 32738828 33107173 34392209 35258484 36271573
14334 36271573 37480346 39046181 39575109 40723056 42483251 43506821 44829389 45964291
14326 45964291 47745617 49537531 51436704 52773996 55070124 57009989 58747069 60610013
14318 60610013 63088468 65506340 67875755 70562573 73125389 76110422 79321495 82204054
14310H2204054L664823L661040L965937L864738M458545M470023N001925M923456
14302A16214541N198843O394791N952648O517314P230175P696376P760263Q720021
14294A71684972Q887420R678637J0438817J0926850J1757915J2193100J3010482
14287B48578193J3564795J4135980J5001379J5471468J5999013J6456379J6297371
14280C55504578J6469027J6265026J6211368J4935750J4367545J2867095J1776826
14273D58397215Q889025N374330J891060J261012J113446j200594l258166o911587
14265D65555741q990278j1769842j2853886j4588579j6237532j6797977j7149937
14258C67167710j6770222j6896968j6527674j6452432j5456101j5203104j4360111
$$ plain form
14310 82204054 85868877 89529917 93495854 97360592 101819137 106289160 111291085 116214541
14302 116214541 121413384 127808175 133760823 140278137 147508312 155204688 162964951 171684972
14294 171684972 180572392 190251029 200689846 211616696 223374611 235567711 248578193
14287 248578193 262142988 276278968 291280347 306751815 322750828 339207207 355504578
14280 355504578 371973605 388238631 404449999 419385749 433753294 446620389 458397215
14273 458397215 467286240 472660570 474551630 475812642 476926088 475725494 472467328 465555741
14265 465555741 456565463 444795621 431941735 417353156 401115624 384317647 367167710
14258 367167710 350397488 333500520 316972846 300520414 285064313 269861209 255501098
14251B55501098j0660479j2970758j2595864j1457778j1164881r897064r547991
14244A77206283q416945q450365p959046p471843p099034o652620n612767n294553
14236A20249110n824249n098094m927560m761538l812198l612973l913623m052166
14228H4246709l243729l118940l137224k543178k957237k488646k240215k531343
14220F1986197k061067j972944k253436j624400k059172j786390j111658j114754
14212D8002376j669741j729421j630221j157715j147426l59178j192546j120831
14204C7995297j405665j098335j018366n91761n76797p89822j829420n02190o94373
14195B9488568q14027l11662p56960o56198q26841j053128k89947q57573m2613
$$ plain form
14251 255501098 244840619 231869861 219273997 207816219 196651338 186754274 177206283
14244 177206283 168789338 160338973 152379927 144908084 137809050 131156430 125543663 120249110
14236 120249110 114424861 109326767 104399207 99637669 95825471 92212498 88298875 84246709
14228 84246709 81002980 77884040 74746816 72203638 69246401 66757755 64517540 61986197
14220 61986197 59925130 57952186 55698750 54074350 52015178 50228788 49117130 48002376
14212 48002376 46332635 44603214 42972993 41815278 40667852 40308674 39116128 37995297
14204 37995297 36589632 35491297 34472931 33881170 33304373 32514551 30685131 30182941 29488568
14195 29488568 28674541 28362879 27605919 26949721 26122880 25069752 24779805 23922232 23879619
14186B3879619p70582p57012k05211m81945r18256n22425k53668k51188j79504
14177A9539828q42749j20772l94906j41616r18679J43713n20651l83193l70409
14168A5990566k35063j94082l72171O8570p34545j7148l77736q7209l14634l83543
14158A3343005k74549n63663L4453M2085k48267m72855j54159q6837k42932k25889
14148A1150392R1796j90579k25005n04804m523m1018k13145l66878K23183l89694
14138I529725l05593l0048j49395k3398l3007m90035q7267j63780J93780j38820
14128H302162L3205l73514l18578P5054k94318K53076m4209m59279j06211L3597
14118G100985K89834o43083J499J47995j49658j16139K25917o10705J22869J60979
$$ plain form
14186 23879619 23109037 22352025 22146814 21664869 20746613 20224188 19970520 19719332 19539828
14177 19539828 18697079 18576307 18181401 18039785 17121106 17264819 16744168 16360975 15990566
14168 15990566 15755503 15561421 15189250 15257820 14523275 14506127 14128391 14041182 13726548 13343005
14158 13343005 13068456 12504793 12539246 12581331 12333064 11860209 11706050 11619213 11376281 11150392
14148 11150392 11242188 11051609 10826604 10321800 10317277 10276259 10063114 9696236 9919419 9529725
14138 9529725 9224132 9194084 9044689 9021291 8988284 8498249 8410982 8247202 8440982 8302162
14128 8302162 8335367 7961853 7643275 7718329 7424011 7677087 7632878 7173599 7067388 7100985
14118 7100985 7390819 6747736 6749235 6897230 6747572 6631433 6857350 6246645 6369514 6530493
14108F530493m45530J13408Q0384l4070k29648j87728P9252k05420j34042R605
14098E576704k15799J83338o9524J49138n45597K99396l37874N7159J46036m81151
14088D761826K50622j10964M4504p9761j15483k54788P5769L0954p7213L03049
14078D828515k99745j28774l43781L71066j07751j66052j61743R3473j29632m31283
14068C524293J69172K72666K6380k53099j4671J39641k85979Q7633J41994J74095
14058C982125j67756m05425Q9313m7336k46383M92645j11485j46280Q403l59754
14048C088067O0851O8382j85700J75022K3481k42357Q4750k95488J78494J6305
14038B971807p2195l5502Q7911k65414j11839K19192K55872k39411m2546l28829
$$ plain form
14108 6530493 6084963 6198371 6278755 6244685 6015037 5827309 5906561 5701141 5567099 5576704
14098 5576704 5360905 5544243 5474719 5623857 5078260 5377656 5039782 5096941 5242977 4761826
14088 4761826 5012448 4901484 4945988 4866227 4750744 4495956 4571725 4602679 4525466 4828515
14078 4828515 4528770 4399996 4056215 4427281 4319530 4153478 3991735 4085208 3955576 3524293
14068 3524293 3693465 3966131 3992511 3739412 3724741 3864382 3578403 3666036 3808030 3982125
14058 3982125 3814369 3408944 3498257 3450921 3204538 3697183 3585698 3439418 3447821 3088067
14048 3088067 3148918 3217300 3031600 3206622 3230103 2987746 3072496 2777008 2955502 2971807
14038 2971807 2899612 2864110 2952021 2686607 2574768 2793960 3049832 2810421 2767875 2439046
14028B439046L76389O4485o912k28369r2439L81786m28891p9968J91220j48192
14018B468155l29717M07996k7235J71540l93483J39081k85211J77183n9471Q5044
14008B353882p1865j79872L0278n7895p8529r6376K79186k22310K09153J8955
13998B184607q3527j88408K01340l27260J14182J77276p9165r1013O54858N26848
13988C089738J644249N374005J3936024K8670650k1252236A3762240n975820j881202
13980E905218j197053j007465m48199J14298n11996k0608J75573l98504l66016
13971B245248L19064J9578k38816m7237J08295J27134m1166m17944M8318P4633
13961B197107l74249J22609K44216n7006j10274k95663O0800m3279M64730l92641
$$ plain form
14028 2439046 2815435 2879920 2873008 2644639 2552200 2933986 2505095 2425127 2616347 2468155
14018 2468155 2138438 2546434 2519199 2690739 2297256 2436337 2151126 2328309 2268838 2353882
14008 2353882 2282017 2102145 2132423 2074528 1995999 1899623 2178809 1956499 2165652 2184607
13998 2184607 2101080 1912672 2114012 1786752 1900934 2078210 1999045 1908032 2562890 3089738
13988 3089738 4733987 10107992 24044016 52714666 31462430 13762240 7786420 5905218
13980 5905218 4708165 3700700 3252501 3366799 2854803 2834195 3009768 2611264 2245248
13971 2245248 2564312 2583890 2345074 2297837 2406132 2533266 2492100 2074156 2122474 2197107
13961 2197107 1822858 1945467 2189683 2132677 2022403 1726740 1787540 1744261 2208991 1816350
13951A816350K04638m08836M2304J86064J08471m18075J96281M36919p17608K40279
13941A686787j5672o361n01705N02209k15636j65156K16063j7735K61493j11985
13931A632302o9112p1296m04342N57191j58458K91372k96460j82388J64861P8556
13921A542226n8899j15761L89463m77049J63M39107n26398L41235k47517K63344
13911A549914k06514J77308j70678Q9782L55938j56063m45410M39687m16880R2219
13901A309303j49017J58688Q3881j44702j87772K27224j19184q1899p8953L86079
13891A403648J03212j79234k1082p8473M2460R1046k19395J15020j94843k20275
13881H42084m2186M21836j15303R8714j98265L93780k32302j14224J05839l1102
$$ plain form
13951 1816350 2020988 1612152 1654456 1840520 1948991 1530916 1727197 2164116 1446508 1686787
13941 1686787 1671115 1664754 1163049 1665258 1449622 1284466 1500529 1482794 1744287 1632302
13931 1632302 1563190 1491894 1087552 1644743 1486285 1777657 1481197 1298809 1463670 1542226
13921 1542226 1483327 1367566 1757029 1279980 1280143 1719250 1192852 1534087 1286570 1549914
13911 1549914 1343400 1520708 1350030 1439812 1795750 1639687 1194277 1633964 1217084 1309303
13901 1309303 1160286 1318974 1402855 1258153 1070381 1297605 1178421 1096522 1017569 1403648
13891 1403648 1506860 1327626 1306544 1228071 1270531 1361577 1142182 1257202 1062359 842084
13881 842084 799898 1221734 1106431 1205145 1006880 1400660 1168358 1054134 1159973 1128871
13871A128871k55235K20099k45271M6641j07160M95296p0225j57184J04450j41465
13861A018817Q1840j89596K6581K60311j38513k2962j32173K9926n7941j16547
13851G59743J06382J84457k13165J49032r3891P0857M8890J68615m13438m2704
13841G24778K62364D76179P33324k01618k5801l31788M32267j85919J28701k25452
13831G99893j46003j01526J90549L54560l30530J91968M7056R2233l02899j01472
13821F93829L29227k18924L51236p3345m79152j4863N24265j20287j95208k56309
13811E40469M23504j93581n0008k53872L62496j81424L92652k71241J00568k88094
13801E81469J72847n7609N0082J02562k47168J65860j91058K56598r6390k06292
$$ plain form
13871 1128871 873636 1093735 848464 895105 787945 1283241 1213016 1055832 1160282 1018817
13861 1018817 1100657 911061 937642 1197953 1059440 1036478 904305 934231 876290 759743
13851 759743 866125 1050582 837417 986449 892558 963415 1012305 1180920 767482 724778
13841 724778 987142 476179 1209503 1007885 982084 650296 1082563 896644 1025345 799893
13831 799893 653890 552364 742913 1097473 766943 958911 1005967 1098200 795301 693829
13821 693829 1023056 804132 1155368 1082023 602871 588008 1112273 991986 796778 540469
13811 540469 963973 770392 720384 466512 829008 647584 1040236 768995 869563 581469
13801 581469 754316 696707 746789 849351 602183 768043 576985 833583 737193 530901
13791E30901L57156k8353l48177J11181J07701O5070k37172K61294j37736N4610
13781G36475k63243J2514K90523j16016k48899L14514k50037J3204L67998r1238
13771G65795J17792l23819J6071m9245k6327L40396r3367r5775m154m5139l150
13760E99078j84847J01866r6048K73887m1715j28938J53872j42917J78429j72645
13750E40022L183n8871k25935M03293j78377Q5902C8904M81301j22690K64559
13740F62074j91971j8524K46298l43494J79436L5549P029P7316k39943J93706
13730F07476l3614O7194J29337j89521o7523L12604k21589L49130l86331R9279
13720F66442j27819J35205p9136j03747p9577J79582r3697r5998K43548Q3066
$$ plain form
13791 530901 888057 859704 511527 622708 730409 795479 558307 819601 681865 736475
13781 736475 473232 485746 776269 660253 411354 725868 475831 489035 857033 765795
13771 765795 883587 559768 575839 526594 500267 840663 747296 651521 647367 602228 599078
13760 599078 414231 516097 420049 693936 652221 523283 677155 534238 712667 540022
13750 540022 543205 484334 258399 661692 483315 569217 38904 520205 397515 662074
13740 662074 470103 451579 697877 354383 533819 569368 576397 653713 413770 607476
13730 607476 573862 641056 770393 580872 513349 825953 604364 953494 567163 666442
13720 666442 538623 673828 594692 490945 411368 590950 497253 401255 644803 727869
13710G27869k58311L87425l15392j14794M9464A23006N29339j13310j25711j20693
13700B92631K53346k57213N0526O8042j55730R3832m4290N21361l32353J92717
13690F82869k88630K65462l20696K6196K5319R0153o2237o4187J02745j39687
13680C17307L27730j39823j06860d2780C81370J9531J8037A49848K20626J96056
13670E66530j46698J33261B38558G1063J30554L30359j12546J51184J92919o5776
13660F97757l05822j11861P8282J04563N2707n4706A58203L28645A39928K48230
13650C88158A88353M40637k4723k57473Q9911A39140J57681J93702j03960A22732
13639D58125K45353A51929N84770A93615K66185K53278j99593j05621j04498A42522
$$ plain form
13710 727869 469558 856983 541591 426797 476261 123006 652345 539035 413324 292631
13700 292631 545977 288764 339290 407332 251602 345434 301144 822505 490152 682869
13690 682869 394239 659701 339005 365201 390520 480673 418436 354249 456994 317307
13680 317307 645037 505214 398354 -42780 381370 400901 418938 149848 370474 566530
13670 566530 419832 553093 238558 71063 201617 531976 419430 570614 763533 697757
13660 697757 391935 280074 358356 462919 515626 460920 158203 486848 139928 388158
13650 388158 188353 628990 604267 346794 436705 139140 296821 490523 386563 122732
13639 458125 703478 151929 736699 193615 459800 713078 513485 407864 303366 142522
13628F46292B54830M32144j99914k05811L0159K95657N5761l11101O0386j43369
13618B68742n9801L54384Q6440B04771K44880J83664A54951K6613m3584M58658
13608E96638k93201M28511j34342B40487n1417J58150q2750J07605n0586M7312
13598C68801N7604j18466A28197J45709o7476l7193J47386K31245k12541K88274
13588F23601k17841o7254J56044j06082j16903N9692e8412i647A41887M45413
13578E87300O4134j50908j60325L8390A12494O7197C8958K97957o4389K78893
13568E51419k26124J31680R1166o2395j26092K12271a91509B27578q0109L03544
13558D51013b9855B69585J74524j96874l9322Q5621R4631P1404A71399J49350
$$ plain form
13628 646292 254830 686974 487060 281249 311408 607065 662826 351725 412111 268742
13618 268742 208941 563325 649765 204771 449651 633315 154951 181564 137980 596638
13608 596638 303437 731948 597606 240487 189070 347220 264470 372075 321489 368801
13598 368801 426405 307939 128197 273906 206430 169237 316623 547868 335327 623601
13588 623601 405760 338506 494550 388468 271565 331257 -58412 -9647 141887 587300
13578 587300 651434 500526 340201 378591 112494 179691 38958 336915 272526 551419
13568 551419 325295 456975 548141 485746 359654 571925 -191509 227578 147469 451013
13558 451013 -29855 269585 444109 247235 207913 293534 388165 459569 171399 320749
13548C20749E5196M84207B03929M68426k24910k7102j33562m6180l7242K98881
13538E02240B39090G8634M73367A79242R0386P6604O8069J0700j21680d3615C05731
13526A98684L7536J10091j30732j05356N24400A00666K19123L1232q331j48266
13516A94424m1610J96239j25612L02431I5518B6005e7668D85609j93913A17412
13505B60995o185A00317M86950A78936K19297e9044C93506B7644P7090K18431
13495C23165C2245K46418l2937L8207F0949L7584M15751r8126M98k00507K22967
13484D39116j27356K27525a1165C002L16251G9101K42904P2728A2519J83146J85472
13473C81137j80780K28575j28274H8715j9702L11008j47486o2354J2157r0155
$$ plain form
13548 320749 55196 539403 203929 672355 447445 420343 286781 240601 203359 502240
13538 502240 239090 78634 552001 179242 269628 346232 414301 425001 303321 -43615 305731
13526 198684 236220 346311 215579 110223 634623 100666 319789 351021 342690 194424
13516 194424 152814 349053 223441 525872 95518 26005 -57668 485609 291696 117412
13505 260995 254810 100317 587267 178936 398233 -59044 393506 27644 104734 323165
13495 323165 32245 278663 245726 283933 60949 98533 514284 416158 416656 216149 439116
13484 439116 311760 539285 -11165 3002 319253 79101 322005 394733 12519 195665 381137
13473 381137 200357 428932 300658 88715 69013 380021 232535 170181 182338 92183
13463I2183J13262K31613A33141J70739A04909K83011r1834M1837J03481e9589
13452B58950K4905J22035j33999R2173F2455k2828J51888J33709m7536j3333o6794
13441A97561K36434N4951Q6848k66087o8395M7177P3899A28271m0404J24098K3778
13430B35743j5138l0864a570C63472P3723j09670j57361a24436A77772a31908
13419A95998j2714P6724J3200b5845A02719L0222Q231J36789A20609K56412D9655
13407f6675B73685L236K9644K9348K27856E0349a58180E6182K13079A25697K63126
13396C88823p072A65545C8109J57596J562I3939M18812a92161C16727G8615C1082
13384A28937a1063C21375A4461K35368i2064C34178j60349a53973E11417B04706
$$ plain form
13463 92183 205445 437058 133141 303880 104909 387920 296086 337923 441404 -59589
13452 258950 283855 405890 271891 364064 62455 39627 191515 325224 277688 264355 197561
13441 197561 433995 488946 575794 309707 241312 288489 362388 128271 87867 211965 235743
13430 235743 220605 189741 -1570 363472 437195 327525 170164 -124436 177772 -131908
13419 195998 183284 260008 273208 -25845 102719 132941 141172 277961 120609 377021 49655
13407 -66675 273685 276921 306565 335913 563769 50349 -158180 56182 269261 125697 388823
13396 388823 381751 165545 38109 195705 197267 93939 512751 -192161 316727 78615 31082
13384 128937 -11063 321375 14461 249829 -92064 334178 173829 -153973 511417 204706
13373a25445B09852h7162C38461l5769a2015I4401B0845M21151A51580R0647H2808
13361E95780b73883B77559J19341A40303m5761a9373m863I4931Q4770b45132E0482
13349C72378P1695A10631K31816n5375o6816K41655j37869j32505N6826L75716
13339F24079A28382q490a7675E47599C2696M2575L04277D5883K349J53319q1471
13328A20080B6494K24658l720j00090o5403B1122O3798J26751P8558J11716A38851
13316D76460A25048K30020c8678B27818o0287r890J23273r1459A838K67046j05770
13305A63114c1976C02560J07473c4573A07481M1235j7340K12523j07817r2989
13295A43093Q3567d9875j40962A77263F0369J32961N4983J63492j46434a21552
$$ plain form
13373 -125445 209852 -87162 338461 302692 -12015 94401 20845 441996 151580 242227 82808
13361 595780 -273883 277559 396900 140303 94542 -19373 -24236 94931 179701 -245132 50482
13349 372378 444073 110631 342447 287072 220256 461911 324042 191537 248363 624079
13339 624079 128382 119892 -17675 547599 32696 75271 379548 45883 48232 201551 120080
13328 120080 26494 251152 247432 147342 81939 21122 84920 211671 290229 401945 138851
13316 476460 125048 355068 -38678 227818 167531 157641 280914 189455 1838 268884 163114
13305 163114 -31976 302560 410033 -34573 107481 148716 131376 343899 236082 143093
13295 143093 226660 -49875 -190837 177263 60369 193330 248313 411805 265371 -121552
13284a70773A28932K82173I6827K07107a43025E8278J72293M9141h106B72103
13273C27493o3758c8378B10317n8915Q5867I3414L9036O7137q2612K3902n6069
13262H4808N9358q867c37414C23543G940f7882A98838j5212i6638H1931n036h4337
13249A10798L5738o5510K1411K0071D6382R7900K73553b0549A30101B954L33061
13238C36015j2957A18498d30048A26270f1397C78172a29312B50746p3578e3094
13227b8016o3348A61771O8059F9898d9330B59952j08716K5413A6288J84586a7969
13215A4217a40431H7842J41763R3433l2980A19341M1524J14197A11746g3170n957
13204g9127C04220D7385P5026a3975k21008B04265J27688j54272G1021k4984b64954
$$ plain form
13284 -170773 128932 411105 96827 303934 -143025 58278 230571 279712 -8106 272103
13273 327493 263735 -38378 210317 151402 237269 93414 132450 199587 116975 140877 84808
13262 84808 144166 135299 -337414 323543 7940 -67882 198838 183626 -96638 81931 76895 -84337
13249 110798 146536 81026 102437 122508 46382 144282 417835 -20549 130101 2954 336015
13238 336015 323058 118498 -430048 126270 -61397 378172 -129312 250746 177168 -53094
13227 -28016 -91364 161771 229830 69898 -49330 259952 151236 176649 16288 200874 -17969
13215 14217 -140431 87842 229605 323038 290058 119341 160865 275062 111746 -73170 -79127
13204 -79127 304220 47385 122411 -13975 -234983 204265 331953 177681 71021 46037 -264954
13192B77049f7167j11668C24365L3889M6243d1595B40628M5763B5823i6787k9602
13181a26389E161J8286Q1494k1868L3024d1959D16407a57131c3358B63409o5763
13170A97646l1924m2864L00329m1711A23798a37706D07766a83818B47820c3131
13159A22741K2111f0988A2437L24427a1902A46260C4310b50778m722A81443M875
13148A86318J92439b26271I4846c1858C4432a3706n7422j89286A61176b75106
13137a1577I5595K59926A2132K012c8799q9695k6138A63326J5766g2509D7080
13125b06678B12230J00228b122G9593L8755J6421K9309j4443h7782r9348c6115
13113B69254A1531K72742P4685b55443C3048c22537B03074L024b8505A45206F0345
$$ plain form
13192 277049 -67167 -178835 324365 358254 404497 -41595 240628 286391 25823 -96787 -126389
13181 -126389 5161 23447 104941 83073 116097 -41959 416407 -157131 -33358 263409 197646
13170 197646 165722 122858 423187 381476 123798 -137706 407766 -183818 247820 -33131
13159 122741 144852 -60988 12437 336864 -11902 146260 34310 -250778 -255500 181443 186318
13148 186318 378757 -226271 94846 -31858 34432 -13706 -71128 -260414 161176 -275106
13137 -11577 95595 355521 12132 14144 -38799 -128494 -154632 163326 179092 -72509 47080
13125 -206678 212230 312458 -2122 79593 118348 134769 164078 149635 -87782 -187130 -36115
13113 269254 11531 284273 358958 -255443 33048 -322537 203074 206098 -28505 145206 60345
13101A02993J27195b21519h2460K6291A55558O7243I6821K393K55893I8554K66468
13090C65022b4996j14233k57162F4737c0234k4619j8827j58531b889B99955a8195
13078B37186m8683J57100j15720a3559A66978a51975C02646A26756R8320c3818
13067G020J5033L05219j42817N828l0509g9634O487D8692i4631F2368J2809O1960
13055A37137K23390D731L5941a83279B15311a10467B38698q1582h1666G0586O3624
13044A34210f8128j9184K3650A52251J70815A51009Q8097l8070K97500A23925
13033B12483a3948A22525c854r4611C51364D1770d9094B79095G3712J70385n3483
13022A90614f3893A71585m8977j5319B6340d3947i921A58013a30824I2830g3206
$$ plain form
13101 102993 230188 -221519 -82460 -56169 155558 222801 96821 99214 355107 98554 365022
13090 365022 -24996 -139229 -396391 64737 -30234 -54853 -73680 -232211 -2889 299955 -18195
13078 237186 188503 345603 229883 -13559 166978 -151975 302646 126756 225076 -33818
13067 7020 22053 327272 184455 190283 159774 -79634 -73147 48692 -94631 62368 75177 137137
13055 137137 360527 4731 40672 -183279 215311 -110467 238698 157116 -81666 70586 134210
13044 134210 -68128 -87312 -63662 152251 323066 151009 239106 201036 498536 123925
13033 212483 -13948 122525 -3854 -98465 351364 41770 -49094 279095 73712 244097 190614
13022 190614 -63893 171585 122608 107289 26340 -43947 -9921 158013 -130824 92830 -73206
13010A45026i3992A23747e3218A79086b567A14921A6157J68614R9610F9752R913
12999G9665M4213K19501A1156J42824p5277O805J5211c1933G7a36024A0146P3
12987A0219P7104M8581d19073d8732q9971C16388C3587P9351P6404K20421a91045
12975c3321A57841b48464E9784J60984A6779L00188D7494b1628E9126b5295o799
12964c2094k09931R5696A34667a84624d7215A18578J10739a98755B21279b11893
12953A29184b8168i28k98518D9207J93645H717a23130A70155m5254d9451r094
12942e8545E9020b71459g380B4089J47343f9947k67414C7541J24791O3148a04259
12930F8765J13256d6705F465g3703j29296c8388A33419R4255B0581b1306B12980
$$ plain form
13010 145026 -93992 123747 -53218 179086 -2567 114921 16157 184771 284381 69752 79665
12999 79665 123878 343379 11156 153980 78703 85508 100719 -31933 77 -136024 10146 10219
12987 10219 87323 135904 -419073 -48732 -138703 316388 33587 112938 189342 409763 -191045
12975 -33321 157841 -248464 59784 220768 16779 316967 47494 -21628 59126 -25295 -32094
12964 -32094 -242025 -146329 134667 -184624 -47215 118578 229317 -198755 221279 -211893
12953 129184 -28168 -928 -299446 49207 242852 8717 -123130 170155 124901 -49451 -58545
12942 -58545 59020 -271459 -7380 24089 171432 -69947 -337361 37541 162332 225480 -104259
12930 68765 182021 -46705 6465 -73703 -202999 -38388 133419 227674 20581 -21306 212980
12918e9127H3804l7939R8094f0733F5239k2209O2556a31062A11434O3675B7062
12906c03798h7176A2612b83998i2335k37218A43616C1466H017d5889k9636A4132
12894B98755G0469J02528n4496O2032D6402d1689p0244l1143C47630b22623I1520
12882A66218p208O5574a76823K3517H5632L2564K388C3114j6143a7521I0871L58936
12870D49807c6240q2500C1216K01988E0685c7057B09336K44826A02819b9247r4806
12859a24053E30144B54101L9938j23631a03359j12372M9229B2469K20680i6230
12848B84722C6662a49278o967k10163B29892c14370f1829C00821q098G4277P5631
12837A49908b4118j05238d0511C11320a65394c974D7010a89624A20061J89457
$$ plain form
12918 -59127 83804 45865 143959 -60733 65239 43030 105586 -131062 111434 175109 27062
12906 -303798 -87176 12612 -283998 -92335 -329553 143616 31466 8017 -45889 -75525 14132
12894 298755 70469 172997 118501 180533 46402 -41689 -111933 -143076 347630 -222623 91520
12882 166218 159010 224584 -176823 -153306 85632 118196 120584 33114 16971 -17521 90871 449807
12870 449807 -36240 -118740 31216 233204 50685 -37057 209336 454162 102819 -29247 -124053
12859 -124053 530144 254101 294039 170408 -103359 -215731 -166502 22469 243149 -96230
12848 284722 36662 -149278 -156245 -366408 229892 -314370 -61829 300821 292723 74277 149908
12837 149908 -24118 -129356 -40511 311320 -165394 -3974 47010 -189624 120061 309518
12827C09518a78906E0241c07791A92565B9485J49455m144i6291A27577a17406
12816d5577B42978m5853g4323A18432B9892J85502b22351A03197a5774B05090
12805c3064q1420B8386J84349b23319K7322I7419g5225b9193j93441C3320O8368
12794A01688i882j40680B18588l0378b53317H8348N10C9459b90888A99788N1737
12783B51525f4277A29132Q6443b14127A84114c60814A69497e3971A71450J32874
12773C04324r0451c03702A8447g8595B5474n78E637L366e8412B6021a78287G5909
12760G55P7437K88788A65537C7086J39860d66A87761a67785G3156a43351A63938
12748C42069A2450J31232J46168J1074B7803c14649G7353J22384a3438n9863C94971
$$ plain form
12827 309518 -178906 50241 -307791 192565 29485 178940 174796 -96291 127577 -117406
12816 -45577 242978 197125 -74323 118432 29892 215394 -222351 103197 -15774 205090
12805 -33064 -114484 28386 212735 -223319 -195997 97419 -75225 -29193 -222634 33320 101688
12794 101688 -9882 -150562 218588 188210 -253317 88348 88858 39459 -290888 199788 251525
12783 251525 -64277 129132 215575 -214127 184114 -360814 169497 -53971 171450 304324
12773 304324 213873 -303702 18447 -78595 25474 24896 5637 9003 -58412 26021 -178287 75909
12760 755 78192 366980 165537 37086 176946 -466 187761 -167785 73156 -143351 163938
12748 342069 12450 143682 289850 300924 27803 -314649 77353 199737 -13438 -73301 394971
12736D296R0117a5028A6069K3840N1485b7460l0645D8085a36146A60454C5159
12724C8402c70091a4874D1522P1081a10540l4620B03709b30790B44516A6884a04653
12712b35824G8719e631B02058k8556C8852L6622a13140l81753b14876f7472K4753
12701d2719j36641d9966C87697a820D0984c1152k9607A92872d4998A04547B2603
12689A10376J21630e704j10846B8906K71298D402a25066A2045B958f1042I0264
12677a31044c5768A3264J69346m2666k2942k1142c94980E3433P2497c38784A18321
12665A66816D8709h9636C05895K35111A76684h1497D02160j70387H3040n482L2389
12654A09947o584A8158J31958p4976i4140q1764B42442L3968G4668M4215J08902
$$ plain form
12736 4296 94413 -15028 16069 39909 91394 -27460 -58105 48085 -136146 160454 35159
12724 38402 -370091 -14874 41522 112603 -110540 -145160 203709 -230790 244516 16884 -104653
12712 -235824 78719 -5631 202058 173502 38852 75474 -113140 -494893 -214876 -67472 -42719
12701 -42719 -179360 -49966 387697 -1820 40984 -31152 -60759 192872 -44998 104547 22603
12689 110376 232006 -5704 -116550 28906 300204 4402 -125066 12045 2958 -61042 90264
12677 -131044 -35768 13264 182610 139944 117002 95860 -394980 53433 125930 -338784 118321
12665 166816 48709 -89636 305895 541006 176684 -81497 402160 231773 83040 77558 109947
12654 109947 103363 18158 150116 75140 -94140 -175904 242442 276410 74668 118883 227785
12643B27785G5415a89997C76289b41118A68236m9611d6504B83966b35680F08719
12632i0324F6503K10304j13227c87169C44880A04686J62421g6000A07003K379
12622A09382a6215G5195L27540j13313j39095C3565Q6648J9897K95147j84898
12612B50359n4342n6989m8122c30492I0334a95645B6587a64035A1122L23585p3032
12601B61675A23197K9699J40254a5436B94499A37768J49678a59580A98995a31795
12590B67638E834a17949n3923A18667R3732E9040a89251f1430B29139J2319a09393
12578A97341b0758l0152A45559B2565a31281G8613L4496m1145f9783G4185a41372
12566f9147o7986e9626B49286J2885J16124a5767F4207g1243l0795d3247G8651
$$ plain form
12643 227785 75415 -189997 376289 -241118 168236 118625 -46504 283966 -235680 608719
12632 -90324 66503 276807 163580 -387169 344880 104686 267107 -76000 107003 109382
12622 109382 -16215 75195 402735 289422 150327 33565 120213 140110 435257 250359
12612 250359 196017 139028 90906 -330492 90334 -195645 26587 -164035 11122 334707 261675
12601 261675 123197 152896 293150 -15436 294499 137768 287446 -159580 198995 -131795
12590 267638 5834 -117949 -171872 118667 212399 59040 -189251 -61430 229139 241458 -109393
12578 197341 -20758 -50910 145559 22565 -131281 78613 113109 71964 -69783 74185 -141372
12566 -69147 -137133 -59626 249286 262171 378295 -15767 64207 -71243 -102038 -43247 78651
12554b00312A11801J47008b45734C26690A38860L22694j86990a0281A29814f3140
12543B98489A21049b03594A01394k1734K106c039C43663b64841f9399C11228j52661
12532A58567G8840a31052F0312k8308J4978N9547J13009k4607J9816H6095g0917
12520A48925l4182N7710I78L41002j24190J24504A29959J88170K40985b50208
12509b85077a06112A62447c68262A16469a50543B3218a84103B61337f3756A43458
12498e1982b4985H4166h4268k99699J00287C4562a96369p3901a23793N157K5934
12487i2702E18788j60189k5671j16988d67213a25175l6147d2528f724B27064h8286
12475A48491n4487i3732B88589a75802A19568g1402A8658b49179A59382L7082
$$ plain form
12554 -200312 111801 258809 -245734 326690 138860 461554 274564 -10281 129814 -63140
12543 298489 121049 -203594 101394 79660 81766 -3039 343663 -264841 -69399 311228 158567
12532 158567 78840 -131052 60312 32004 46982 106529 219538 194931 214747 86095 -70917
12520 148925 114743 172453 978 341980 217790 342294 129959 318129 559114 -250208
12509 -285077 -106112 162447 -368262 116469 -150543 23218 -184103 261337 -63756 143458
12498 -51982 -24985 84166 -84268 -383967 -283680 34562 -196369 -270270 -123793 -118636 -92702
12487 -92702 518788 358599 332928 215940 -467213 -125175 -161322 -42528 -6724 227064 -88286
12475 148491 94004 -93732 288589 -175802 119568 -71402 18658 -249179 159382 196464
12465A96464g8453r1692A51239O0082C7041K6214J91142a58046R758c6679k28453
12454b65132a2202k45365d7975A53297G051J78340o786d10222J98599E0284J44680
12443A94964a65623c6204A64769e4185j26017I3466g4419A82446l2178b1087k24660
12432b45747G7170b2482o6816F0713a82642I5533b26760B952a39517A76413J57599
12421C34012b51991A2800M803R2055l791a25445L4844A66429b60816A27786J21607
12410B49393A2866J11406c58076J69107e504A27006n3693q005K9543c01265B57129
12398a80629F2138M3800J5558f8357B5261K8391d90631a75545A11259L0725a13267
12386A77406m4887J53445c39892B06278E4342a52823q8192C0919b48574C21427
$$ plain form
12465 196464 -78453 -170145 151239 211321 37041 63255 254397 -158046 -148288 -36679 -265132
12454 -265132 -12202 -257567 -47975 153297 7051 185391 178605 -410222 -211623 50284 194964
12443 194964 -165623 -36204 164769 -54185 -180202 93466 -74419 182446 150268 -21087 -245747
12432 -245747 77170 -22482 -89298 60713 -182642 95533 -226760 2952 -139517 176413 334012
12421 334012 -251991 12800 17603 109658 105867 -125445 -90601 166429 -260816 127786 249393
12410 249393 12866 124272 -358076 -188969 -5504 127006 73313 65308 94851 -301265 257129
12398 -180629 62138 105938 121496 -68357 25261 53652 -490631 -175545 111259 141984 -113267
12386 177406 132519 285964 -339892 206278 54342 -152823 -241015 30919 -248574 321427
12375F5826J55029p9638a54707B2887b3799j23359B23097c08106h1166A47899
12364A42773J12056c55526d1715j45932N9636A37822L7396n1157b69553r5741
12354c65294D7569N2971O8564b87486A46624a7167m8287n8255A59902i519j49961
12343a59480C44081A2924J07139h0869A32639R4724j07799a79503A2156d24210
12332b6152H0541b1394k41798D114J33946a23113k17845g1022A64960b67150g5062
12320c67889B53476b93249d8825k85821E1912L00396H3459a68341j11274p1499
12310c51114c5905A58069J07388c40306D7857h916A76629a04599j10926E3904
12299d4277b1705C97718i2096B29204b8998j40048A90881F5040i0585C4266c37792
$$ plain form
12375 65826 220855 141217 -154707 22887 -23799 -147158 223097 -308106 -81166 147899
12364 142773 254829 -355526 -41715 -187647 -128011 137822 175218 124061 -269553 -365294
12354 -365294 47569 100540 169104 -287486 146624 -17167 -65454 -123709 159902 -9519 -159480
12343 -159480 344081 12924 120063 -80869 132639 227363 119564 -179503 12156 -424210
12332 -26152 80541 -21394 -263192 4114 138060 -123113 -340958 -71022 164960 -267150 -75062
12320 -367889 253476 -293249 -48825 -334646 51912 352308 83459 -168341 -279615 -351114
12310 -351114 -35905 158069 265457 -340306 47857 -8916 176629 -104599 -215525 53904
12299 -44277 -21705 397718 -92096 229204 -28998 -169046 190881 65040 -90585 34266 -337792
12287H9953C5696c46729f1188C26434c00943g953A51937a49964f7114l9991q7844
12276a94949b0905k9335A47886Q2713I1725g2365B08822o2686F8178c02968E9543
12264C61021A76031h3643D70b26802i6718a0005A86967L4825A6807K38651A41
12252A16572b34758a16274L6457D0594K72231E4298K06560F0477J44996f6483
12241C36990j29002J01618f3863j40283D4854b97370k2011A76127a54280D0568
12230C4905L33954n3606A20369J08940b10970d2199C25388M5212A57381J29671
12220B87052F3560e1806B81525K9922a66860B70143C1103L19935r2788K55619
12210E13869E9358M8812J17953q5402K48869h1121C65822P0745k05274h2505j32478
$$ plain form
12287 89953 35696 -346729 -61188 326434 -300943 -7953 151937 -149964 -67114 -107105 -194949
12276 -194949 -20905 -50240 147886 230599 91725 -72365 208822 146136 68178 -302968 59543
12264 361021 176031 -83643 470 -226802 -96718 -10005 186967 221792 16807 255458 141
12252 116572 -234758 -116274 -79817 40594 312825 54298 260858 60477 205473 -66483
12241 336990 207988 309606 -63863 -204146 44854 -297370 -319381 176127 -154280 40568
12230 34905 368859 315253 120369 229309 -210970 -42199 325388 370600 157381 287052
12220 287052 63560 -51806 281525 311447 -166860 270143 31103 351038 258250 513869
12210 513869 59358 108170 226123 140721 389590 -81121 365822 436567 231293 -82505 -214983
12199b14983C4657J28839m0979K58780a18813C10812q0973k908I5111f237A22511
12187B18953R949q4026F4489K60721i7519M2981C15592i4281C53810a45643I0120
12175A98821a18516m0272G0811I894K44964r4975E0454K88672A07811J63982m8016
12164B23777P1638A08560Q338J77662E1335A8747L0831a742l446B35980F7309
12152f6648E2213Q7742n0152e4918r7388H6271N26468B57993A27200b29507Q5239
12141a44268B73823j27846J59138n9010e0575A29990L053a46853n2844A10783
12130a71942E735b34364k0389P3739j24643d470C59446A06080K1749d4236l6158
12119h0394a9638j86343N4805H1118i9487C22288A01762H425i5322j30888H1848
$$ plain form
12199 -214983 34657 163496 122517 381297 -118813 310812 229839 226931 95111 -6237 122511
12187 218953 228902 144876 64489 325210 -97519 -54538 315592 -94281 353810 -145643 90120
12175 198821 -118516 -158788 70811 9894 254858 159883 50454 339126 107811 271793 223777
12164 223777 295415 108560 116898 294560 51335 18747 49578 -1742 -5188 235980 67309
12152 -66648 52213 139955 89803 -54918 -152306 86271 612739 257993 127200 -229507 -144268
12141 -144268 273823 145977 305115 246105 -50575 129990 133043 -146853 -199697 110783
12130 -171942 5735 -234364 -254753 -181014 -305657 -4470 359446 106080 127829 -44236 -80394
12119 -80394 -19638 -205981 -151176 81118 -99487 322288 101762 8425 -95322 -226210 81848
12107b32302E79241H8210a43666d3142A45020K11408b50703c8321j63611F8382
12096b54087D0551a76499F482Q2721h1192C8051K73787F328O6589J5405B7063
12084a66416B29420a6634B90838q1840k4129e7212p6142C09341J15122c7436j91680
12073b29116A87166J34142b5056E5857c5846j59276O6721k48619D04752d5906
12062c00688A60024D4067b21604A3816R8740K33449N00947L54239I3843K7970
12052A21813h8069A1783e4670k21499A57427e8199k52652i0149A56772l3611e1683
12040A64871b97336c9753l15342H1885J7527a00445c4742j11193D8311q7a10050
12028D4205g2291A69957C7102J84698b58619A17439h3563E4626O6561a59684b9215
$$ plain form
12107 -232302 579241 88210 -143666 -43142 145020 356428 -250703 -38321 -201932 68382
12096 -254087 40551 -176499 6482 89203 -81192 38051 311838 6328 72917 88322 27063
12084 -166416 229420 -16634 290838 208998 184869 -57212 -133354 309341 424463 -37436 -229116
12073 -229116 187166 321308 -25056 55857 -35846 -195122 -128401 -377020 404752 -45906
12062 -300688 160024 44067 -221604 13816 112556 346005 846952 1201191 93843 121813
12052 121813 -88069 11783 -54670 -276169 157427 -58199 -310851 -90149 156772 123161 -51683
12040 164871 -297336 -39753 -355095 81885 99412 -100445 -34742 -145935 48311 48224 -110050
12028 44205 -72291 169957 37102 221800 -258619 117439 -83563 54626 121187 -159684 -29215
12016H5018c98570J86462e4474j35135R0370q8130j14501A19429a75500D2329
12005A2995J50431b31304A86988f6102C0284g5122A13634a80825B83844b20498
11994f3895I95J20235J1071e1213l02j28693A80696e8661J8214F5417a58332J0829
11982a47503H5373j7085L29477f6904N86A91512h7308R267O588C22440a40359
11970a1797A4513J4434A3626h0823A93815D3382d31429J98958b0469E8664B0308
11958A18087B0535K37608e7902j06543F625c27406c9845j21225P4638p562A3147
11946B36240E1328a0463k27721B04689F2338f0095J2912A06624c6188j8276B7726
11934D27487a3899B52716a29626g180l119k5286k01047E727b15995c9518a5734
$$ plain form
12016 85018 -398570 -212108 -54474 -189609 -99239 -187369 -301870 119429 -175500 42329
12005 12995 163426 -231304 186988 -66102 30284 -75122 113634 -180825 283844 -220498
11994 -63895 995 121230 132301 -51213 -51515 -180208 180696 -58661 -40447 65417 -158332 -147503
11982 -147503 85373 68288 397765 -66904 -66318 191512 -87308 -78041 -71453 322440 -140359
11970 -11797 14513 28947 13626 -80823 193815 43382 -431429 -232471 -20469 58664 20308
11958 118087 20535 258143 -57902 -164445 6625 -327406 -39845 -161070 -86432 -93994 13147
11946 236240 51328 -10463 -238184 204689 62338 -60095 -47183 106624 -36188 -54464 27726
11934 427487 -13899 252716 -129626 -7180 -10299 -35585 -236632 5727 -215995 -39518 -15734
11922a53332O9968B18468A03803O9180F1029L6845L809a48111o9785R3563B28508
11910A86158c28601C3726a72116F3979b4871c05B86204B473c2260I0877a05941
11898g7891A5467e0711j2272A88143c15879P9934c5374H4954a26216D00316b13040
11886a70074A06988a69441B27978e9006G5210R6648b34704j8889P8279d5870D500
11874b41072c073C36330a8690A49183B6728h4849o562B52827E7189a95903b8271
11862a97613o899E3920j0912I616b50486A19128R6233e6989A68476a21316A19594
11850a74103f9260k35869o5399A76814f8917l49247D2618a32238E673N266g2633
11838b43944b8771J1797R09B45003r7807c8069j85375A32327a30159H9969e8297
$$ plain form
11922 -153332 -83364 218468 103803 172983 61029 97874 101683 -148111 -217896 -124333 228508
11910 186158 -328601 33726 -172116 63979 -24871 -305 286204 2473 -32260 90877 -105941
11898 -77891 15467 -50711 -62983 188143 -315879 -235945 -35374 84954 -126216 400316 -213040
11886 -170074 106988 -169441 227978 -59006 75210 171858 -234704 -253593 -175314 -45870 4500
11874 -241072 -3073 336330 -18690 149183 26728 -84849 -91411 252827 57189 -195903 -28271
11862 -197613 -204512 53920 43008 9616 -250486 119128 215361 -56989 168476 -121316 119594
11850 -174103 -69260 -305129 -370528 176814 -68917 -418164 42618 -132238 5673 10939 -72633
11838 -243944 -28771 -16974 -16065 245003 147196 -38069 -223444 132327 -130159 89969 -58297
11826A5404J15287c84322g6635B53316a35342l6789H8789J13839g7302l41889
11816d19191J50256p2745F5602a34066o9854I7498e129C5068J87090E3597f8847
11804a66998q0721K758B64768A03175C5122Q1547f6136A99527P38b42083k4342
11793b66425B42900c44532C43182E5439J08884i4019j23504C1114c04915Q9962
11783b14953A85053a40426L7400Q749j7346I2567a80396A22682n4832c11465I9705
11771a9097I9213b07731k59090a39789f7074e285o7706F2453a02544M6279J8793
11760c7472A32903g5144B69247A07938g2691r6977P6624B60484A20090B5137L4172
11749E9309K30139A20803a94802f1475d120j89156P565A56208I147K04301g0159
$$ plain form
11826 15404 130691 -384322 -76635 253316 -135342 -172131 88789 202628 -77302 -419191
11816 -419191 -268935 -341680 65602 -134066 -203920 97498 -5129 35068 222158 53597 -68847
11804 -166998 -247719 -244961 264768 103175 35122 116669 -66136 199527 200265 -242083 -266425
11793 -266425 242900 -344532 343182 55439 164323 -94019 -217523 31114 -304915 -214953
11783 -214953 185053 -140426 -103026 -94277 -111623 92567 -180396 122682 67850 -311465 99705
11771 -19097 99213 -207731 -466821 -139789 -67074 -5285 -72991 62453 -102544 -56265 -37472
11760 -37472 132903 -75144 269247 107938 -72691 -169668 -93044 260484 120090 25137 59309
11749 59309 289448 120803 -194802 -61475 -4120 -193276 -185711 156208 9147 213448 -70159
11737b84024c7086l5333r0474m4637J0994A40144a67044p9330A79340b4620j99017
11726b23637m0733C03635i474B23543b57953K9938a13675H9183k022g1247A16987
11714C9908c2098M559D8782A9585P2270b95761j44551a44547j03259c8893C7621
11702b16405K9174n4492M1255m5252e2141l2228F025a18329A18973K22291e47814
11690A6869c2287j89220k49870a83180h7022B61825g693B16056I311i487B31663
11678A25552a4758n8378k97725h317E737b44390B53475b8122A883b98403f9422
11666E0098P2153b15049E1904J48830g3812k22711A68621n0816a56472b8119q0250
11655a08369B1137L68335a1575q6417D6249a38501D8473b8013q4049j23364R9273
$$ plain form
11737 -284024 -37086 -72419 -162893 -207530 -196536 140144 -167044 -246374 179340 -24620 -223637
11726 -223637 -264370 303635 -9474 223543 -257953 -228015 -113675 89183 87161 -71247 116987
11714 39908 -32098 -27539 48782 19585 91855 -295761 -440312 -144547 -247806 -38893 37621
11702 -216405 -187231 -241723 -200468 -245720 -52141 -84369 6025 -118329 118973 341264 -547814
11690 16869 -32287 -221507 -471377 -183180 -87022 261825 -7693 216056 9311 -9487 231663
11678 125552 -14758 -73136 -370861 -8317 5737 -244390 253475 -28122 1883 -298403 -69422
11666 50098 122251 -215049 51904 200734 -73812 -296523 168621 117805 -156472 -28119 -108369
11655 -108369 21137 389472 -11575 -97992 46249 -138501 48473 -28013 -112062 -235426 -136153
11644a36153B22351b38826h8324H2694h1636M142A0357N0868B7121a84348A01555
11632a16419n1405P3368n3904N5143j45463A01509b11267p5809B2479J21764a35004
11620f0892a9703j68903g1276r1894M9822l5579B76532d17508C50581A23361b29751
11608A77267b19409A04285c77909K4113B8774c5465D0095a10661B07359a91137
11597i2614A70521b26603f2863m3907c7182l5255A30187d701C42041c09602g2950
11585b91722M5325c0110j9907j26632Q0463d4890k46651A17865K58721a23318
11574I052f1354j05020G0672b46309a06485m0816c4060A89220g0409B2154J44758
11563A66912H464P9961c0769f669j58271A40270m9598i9584B27666a1583B72590
$$ plain form
11644 -136153 222351 -238826 -88324 82694 -81636 -77494 10357 61225 27121 -184348 101555
11632 -116419 -167824 -94456 -148360 -93217 -238680 101509 -211267 -287076 22479 144243 -135004
11620 -60892 -19703 -188606 -71276 -163170 -113348 -148927 276532 -417508 350581 123361 -229751
11608 177267 -219409 104285 -377909 -353796 28774 -35465 40095 -110661 207359 -191137
11597 -92614 170521 -226603 -62863 -106770 -37182 -72437 130187 -4701 342041 -309602 -72950
11585 -291722 -246397 -30110 -50017 -176649 -96186 -44890 -291541 117865 376586 -123318
11574 9052 -61354 -166374 70672 -246309 -106485 -147301 -34060 189220 -70409 22154 166912
11563 166912 8464 88425 -30769 -6669 -164940 140270 90672 -99584 227666 -11583 272590
11551D7153e8915n7295A65626C9692J11383a50087A90238d6278A12824B8529L70468
11540C98997B6360J74668h1094B80744A26203l1999L7800J43589a95668A74930
11529E4603K53406j36541l0689b36353H687i4750A28193J16874l0024a51696I1880
11517A32744b34947E1699a22914H1021C7249J16940N6971B1153g534I0475K04664
11506B95139A23314M2426j6065E3106g1515B66217L05597a28119E2664K56825
11496C09489g0220A26799E5533J08565K6608R9585B6460N27787A57909o8410a11229
11484A48927m2148J1349N3275K37812j41622c54A37023f9061j14413B7966L26174
11473C54140A48006L4282a21072D6104L70259a25673C81334A12599a08194B37046
$$ plain form
11551 47153 -58915 -116210 165626 39692 151075 -150087 190238 -46278 112824 28529 398997
11540 398997 26360 201028 -81094 280744 126203 94204 132004 275593 -195668 174930
11529 54603 308009 171468 140779 -236353 8687 -94750 128193 245067 215043 -151696 91880
11517 132744 -234947 51699 -122914 81021 37249 154189 211160 21153 -7534 90475 295139
11506 295139 123314 165740 149675 53106 -71515 266217 571814 -128119 52664 309489
11496 309489 -70220 126799 55533 164098 190706 290291 26460 554247 157909 89499 -111229
11484 148927 106779 118128 171403 409215 267593 -354 137023 -69061 -183474 27966 354140
11473 354140 148006 182288 -121072 46104 416363 -125673 381334 112599 -108194 237046
11462A62416f074D17030j86319a88765i3809C89111A25399K92611C9720M3728
11452H3448j478a13978D4280K82583c98807n6422A18657P5132c6822a6847A84716
11440a38144C12785b88136k0119B14548i1635a7241n6107A02159E885K97364a17509
11428B55082a0955D10436A04399Q8782q9966o738c36949A46294K62188A25253
11417A2143b33164A07073b23264g7559j09329A24767a65361B01851b57173A60422
11406h1444I6591i722D6778O657k6515N7631c6270m44612A53222c24970Q3075
11395b41895i8752n4638I0840d00994A12040a39725d4303C44498d5545I1636J25642
11384B17278o1305K0102b19998c5209A14261a72316B59411A08705c8109n8374
$$ plain form
11462 162416 -6074 417030 230711 -188765 -93809 389111 125399 418010 39720 83448
11452 83448 81970 -113978 44280 326863 -398807 -455229 118657 193789 -36822 -16847 184716
11440 -138144 312785 -288136 -308255 214548 -91635 -17241 -73348 102159 5885 303249 -117509
11428 255082 -10955 410436 104399 193181 103215 96477 -336949 146294 408482 125253
11417 12143 -233164 107073 -223264 -77559 -186888 124767 -165361 201851 -257173 160422
11406 -81444 96591 -9722 46778 53435 26920 84551 -36270 -480882 153222 -324970 -241895
11395 -241895 -98752 -153390 90840 -400994 112040 -139725 -44303 344498 -45545 91636 217278
11384 217278 155973 176075 -219998 -35209 114261 -172316 259411 108705 -38109 -96483
11374i6483j94184a35643O847C1649L20589E6613e2002j80583e3811l9854D7024
11362h5978n2887j33521J14139k47106B86002a29165i855A51183B6038h2743B8301
11350B00079b50692B06372H0153e9738A9966a97697A19716b17937M5520a0651
11339d09218f2950C8275J26162A6040b39285A53158A4783a05273B9432K7624J45479
11328B02535b33303M5840a2949j66317D3681R9021c59166h853C1501a02465m3823
11317a46288E0109a1540p4492A5978R5621j5555M4806h3507J1693k8636a8602
11305i5799C4773J59970b98673a48178C4101a03158A65239K62261a79414B2937
11294a50913B86629f2266n3706c7996q5143A17252a19663L3339p7294k5783j80041
$$ plain form
11374 -96483 -290667 -135643 -128796 31649 352238 56613 -52002 -232585 -53811 -93665 47024
11362 -85978 -138865 -272386 -158247 -405353 286002 -129165 -9855 151183 26038 -82743 28301
11350 200079 -250692 206372 80153 -59738 19966 -197697 119716 -217937 -172417 -10651
11339 -409218 -62950 38275 164437 16040 -239285 153158 14783 -105273 29432 57056 202535
11328 202535 -233303 -187463 -12949 -179266 43681 142702 -359166 -8853 31501 -102465 -146288
11317 -146288 50109 -11540 -86032 15978 111599 96044 140850 -83507 -71814 -100450 -18602
11305 -95799 34773 194743 -298673 -148178 34101 -103158 165239 427500 -179414 22937
11294 -150913 286629 -62266 -115972 -37996 -123139 117252 -119663 -86324 -163618 -189401 -369442
11283c69442B0530a01825M1410C4719a14461o6663p5249B9622J63599a72704N7910
11272a14794b7114A58778n4721I395b3808A9761f472l34097B06993a63299P0797
11261i2502k20053A30812J81563h3736I5065a76198K0447j5092C7134e18839g3103
11249f9442j80168E6964R9059D7940h3777L0857k63115h4825B26137a63114c3357
11237f0931D5708J28749k1943f0351A03287a57339k61171A58237d147j87137d173
11225A07570l9690b52794R2654b2351B45062d35692a49200j00634d5172k41746
11215b86918B16956b13945d7581k30632p130F7906a24714K4232G858c5274G3311
11203b70999g0667A79747R2680j19707o0572a95270J8137C8176d9934o8332j81411
$$ plain form
11283 -369442 20530 -101825 -60415 34719 -114461 -181124 -256373 29622 193221 -172704 -114794
11272 -114794 -27114 158778 104057 9395 -23808 19761 -6472 -340569 206993 -163299 -92502
11261 -92502 -312555 130812 312375 -83736 95065 -176198 -155751 -170843 37134 -518839 -73103
11249 -69442 -249610 56964 156023 47940 -83777 -52920 -316035 -84825 226137 -163114 -33357
11237 -60931 45708 174457 152514 -60351 103287 -157339 -418510 158237 -4147 -191284 -4173
11225 107570 67880 -252794 -160140 -22351 245062 -435692 -149200 -249834 -45172 -286918
11215 -286918 216956 -213945 -47581 -278213 -285343 67906 -124714 -100482 7858 -35274 73311
11203 -270999 -70667 179747 272427 152720 92148 -195270 -177133 38176 -49934 -118266 -299677
11192b99677P815C34927N2824E3051K37092b6365O453j87845g0606j33926R6659
11181a07873B01898b63670C07172D8685a15699n3307K4849e7699A3957c98711
11170G2175a2536A51166a86066a1106E2009Q8422c6927l8856r8787D5801i1559
11158a27627L6281j1253B07547F6901b12749j60343D72139F3450A2371M1638L59616
11147D13625b38377B87864F3972a48735d3579A54125m6083A0107e2982A82430
11136b01655A96571A0796J0120M2383a482B82256C4892R8910D6146J42502c12208
11124e8680n263m3206j52255e5729p8888c1520A11319J35746b6658j9091C98509
11112A58082j2804K2512b63894A53113c70455C6867O5372K96011F9074b2310j2986
$$ plain form
11192 -299677 -291862 334927 387751 53051 290143 -26365 -19912 -207757 -70606 -204532 -107873
11181 -107873 201898 -263670 307172 48685 -115699 -169006 -144157 -57699 13957 -398711
11170 72175 -12536 151166 -186066 -11106 52009 140431 -36927 -75783 -174570 45801 -91559
11158 -127627 -91346 -102599 207547 66901 -212749 -373092 472139 63450 12371 54009 413625
11147 413625 -238377 287864 63972 -148735 -43579 154125 108042 10107 -52982 182430
11136 -201655 196571 10796 20916 63299 -1482 282256 34892 133802 46146 188648 -312208
11124 -58680 -63943 -107149 -259404 -55729 -134617 -31520 111319 247065 -26658 -45749 398509
11112 158082 145278 167790 -263894 153113 -370455 36867 102239 398250 69074 -22310 -35296
11101c5296B57341J38004Q1046B6281e6004A30786Q3475J83945B7678J93227K90495
11090E11400j20178j83707R6511Q208j4730A8010L51043j4221A27964L42832b0764
11078D23238a065H8446K13940j34012m0168D9152M53707G1582L7580N46846k46898
11067D09110k4438l4501j31870K53009j55845J47483K10365O0373B97441K35913
11057E33354j36070K85320Q2941k73896j47230J66841J5760R4090l7181L03711
11047H87640k47042q6334J23642J23130L04021m50418Q7763j59681J3813N8545
11037F55079P2258J05423D00675L58050C65673J58164M18108k05160C47727L41897
11027F89624J52954k97317J74793K26702l71030k5192M5132L20158k82951j96782
$$ plain form
11101 -35296 257341 395345 476391 26281 -56004 130786 214261 398206 27678 220905 511400
11090 511400 391222 207515 304026 312234 297504 18010 369053 354832 127964 470796 -20764
11078 423238 -1065 88446 302386 168374 128206 49152 502859 71582 109162 656008 409110
11067 409110 384672 350171 218301 471310 315465 462948 673313 733686 297441 533354
11057 533354 397284 682604 765545 491649 344419 511260 527020 621110 583929 887640
11047 887640 640598 554264 677906 801036 1105057 654639 742402 582721 596534 655079
11037 655079 727337 832760 400675 758725 365673 523837 941945 736785 347727 689624
11027 689624 842578 545261 720054 946756 575726 550534 595666 915824 632873 436091
11017D36091J00639K21794k91712k24280J31823j5782J35230J58285l5538K951
11007F19501j0983k69493L80474K07260D38434K36247k96165J17667J84229K19324
10997H99736m20188j04796p6632L06858j24094r5951M30052r8487j3664j66555
10987E36279J65630k60896L90554M9562k057K5531J66911J94287j97190j04416
10977I64195L48008K82932L82794J4578L21848O42282k60788N33477m77520l08242
10967B443564o9965j49065l19129m30992J45004m66047l47921L65676j23763l07141
10957G40221j7232N8035j47327K44934B60827K37119j62212j27056K40046p1627
10947C77097A24588R0310K33941A46177n3249K79957a35181B62628m6771K92388
$$ plain form
11017 436091 536730 758524 466812 242532 374355 358573 493803 652088 616550 619501
11007 619501 608518 339025 719499 926759 438434 674681 378516 496183 680412 899736
10997 899736 479548 374752 298120 604978 480884 384933 814985 716498 702834 536279
10987 536279 701909 441013 831567 881129 879072 904603 1071514 1265801 1068611 964195
10977 964195 1312203 1595135 1977929 1992507 2314355 2956637 2695849 3229326 2751806 2443564
10967 2443564 2373599 2224534 1905405 1474413 1619417 1153370 805449 1171125 1047362 740221
10957 740221 722989 781024 633697 878631 260827 497946 335734 208678 448724 377097
10947 377097 124588 214898 448839 146177 92928 372885 -135181 262628 215857 508245
10937E08245O2748j44654A21404a0178k40900F4474P5003o5439c51242B41L59866
10926C60107h6452B16037d42681d7173B02698m4668b1888l4602A14260P8793Q3431
10915B76484a67120P0710B2838a59695D5171a04611J8741A24683d799n3074A1805
10903A16368a51208B78775a46527H949a49864K4954A89582b12083b2126q9387
10893a11513k6060c5964J3926m4638C7014b69250b9810p8628I7288K78314A18646
10881b74929f7921B26552L74568k32610c8568a6243l6684j36752F974i9321r8992
10870a98313A03775Q117O7992b77825j7809C4488a1276c887j11695c2083j43226
10859a75309H1474c65627A40819m7733o771a57268P8186m3828G827J33088l4893
$$ plain form
10937 508245 570993 426339 121404 -10178 -251078 64474 139477 74038 -351242 241 360107
10926 360107 -86452 216037 -442681 -47173 202698 158030 -21888 -56490 114260 193053 276484
10915 276484 -167120 -96410 22838 -159695 45171 -104611 -85870 124683 -4799 -57873 11805
10903 116368 -151208 278775 -146527 8949 -149864 -124910 189582 -212083 -22126 -111513
10893 -111513 -137573 -35964 -22038 -66676 37014 -269250 -29810 -108438 97288 375602 118646
10881 -274929 -67921 226552 601120 368510 -38568 -16243 -52927 -189679 6974 -99321 -198313
10870 -198313 103775 111892 179884 -277825 -295634 34488 -11276 -3887 -115582 -32083 -175309
10859 -175309 81474 -365627 140819 93086 86315 -157268 -79082 -122910 7827 140915 106022
10848A06022m6499g2017B7226a32724H4072e19824a99360K7860C8248a03220j65955
10837b69175D6160M6193a70212j1074A301N5620c0155n6859A65565a3277o9947
10826h3224A88734I635Q2240e4533p1473D5975d2781j82371C7101g340j40821
10815a48161A08899a9098G4956g0337B6575L5974e8829j1392k02870E274b28977
10803C96758C4145Q5321D0222h4936a2913k75768f2532A68723J86643c18940a50393
10791C54772a24800A62127E9413d1886B72324b10402a5854j21633L7216C7265
10780D07520j53995n9263a50312J3816J3310e9776k41851A45222A6825K11266
10770B28091F7963d6464A7527g9008J2381I0927b53806i4069l0797K9110A52304
$$ plain form
10848 106022 59523 -72017 27226 -132724 84072 -519824 -199360 -171500 38248 -103220 -269175
10837 -269175 46160 92353 -170212 -181286 1301 56921 -30155 -87014 165565 -13277 -83224
10826 -83224 188734 9635 91875 -54533 -126006 45975 -42781 -225152 37101 -7340 -148161
10815 -148161 108899 -19098 74956 -70337 26575 62549 -58829 -70221 -273091 5274 -228977
10803 396758 34145 119466 40222 -84936 -12913 -288681 -62532 168723 355366 -318940 -150393
10791 354772 -124800 162127 59413 -41886 272324 -210402 -15854 -137487 -100271 37265
10780 407520 253525 194262 -150312 -136496 -123186 -59776 -301627 145222 16825 228091
10770 228091 67963 -46464 17527 -79008 -66627 90927 -253806 -94069 -124866 -95756 152304
10758b43191C22674a27090a7374j17068A3246a8429r5375d2827j31817k3981E5685
10746A52492i5684B59347a30879O0086A33446b02405M3980b1388j9669l72284
10736d13341J39225H1836l2747J61759q8718l0138H539a29578k87373C73597b1513
10724b11340A45387h0745k10881J18306A26029K98735d47664B8464J6056M7534
10714I2054c3117A73755b15641g0541j29244H07M14251a47983B3573c31564J29448
10703b02116E7118e4559p913A73898J7478C3892i85j03894K2975j32431C35469
10691G3862i6930M6328J7964o3354c4270k3051k66319B96000B9717J4657c08831
10679A22748b01252L5028B57931a96465e8075j82881c7341o1699C08801h6761
$$ plain form
10758 -243191 322674 -127090 -17374 -134442 13246 -18429 -113804 -42827 -174644 -198625 55685
10746 152492 -95684 259347 -130879 -70793 133446 -202405 -158425 -21388 -41057 -413341
10736 -413341 -274116 81836 49089 210848 122130 91992 8539 -129578 -416951 373597 -21513
10724 -211340 145387 -80745 -291626 -173320 126029 424764 -447664 28464 44520 92054
10714 92054 -33117 173755 -215641 -70541 -199785 807 415058 -147983 23573 -331564 -202116
10703 -202116 57118 -54559 -62472 173898 191376 33892 -985 -104879 -81904 -214335 335469
10691 73862 -96930 -50602 -32638 -95992 -34270 -57321 -323640 296000 29717 44374 -308831
10679 122748 -201252 -166224 257931 -196465 -58075 -240956 -37341 -99040 308801 -86761
10668a58537A34701B3296J06631g2531D1581b82294i1896A51649C7813J74065
10658B11878b47131J6835A64550F377b74104B23379b93578c6906E03i6415E7168
10646b23564h4677A86161a99873E8795g32570a67254B7550K05858a12388k58603
10636c70991A32142c16190A56582G2308e7588A30690n404f4271o0967A19690a17711
10624A6037a34330G1770b73580A09351G589a1083k27881A85947a92074M6697A64854
10612A36295k2729O5395B3009L76346a95357j13137h5529I917b92534j9389h9242
10600g4645k65947k43362A14194n3433i6611L7627c628C014a03538l2143A1106
10588A10568b07359h8284C1901J03727a44345m5517A42921b5374j97468d7908
$$ plain form
10668 -158537 134701 23296 129927 -72531 41581 -282294 -91896 151649 37813 211878
10658 211878 -247131 -230296 164550 6377 -274104 223379 -293578 -36906 503 -96415 57168
10646 -223564 -84677 186161 -199873 58795 -732570 -167254 27550 233408 -112388 -370991
10636 -370991 132142 -316190 156582 72308 -57588 130690 125286 -64271 -125238 119690 -117711
10624 16037 -134330 71770 -273580 109351 7589 -11083 -238964 185947 -192074 -145377 164854
10612 136295 113566 178961 23009 399355 -195357 -308494 -85529 9917 -292534 -311923 -89242
10600 -74645 -340592 -583954 114194 60761 -96611 -58984 -3628 3014 -103538 -135681 11106
10588 110568 -207359 -88284 31901 135628 -144345 -189862 142921 -25374 -222842 -47908
10577B93673c6635r8509N9370l6944F6112c42424C7888A498c6450A08704a9604
10565a11339q1546A54635a35703o4704O5793h617k36146e2358p4608A04833b10165
10553c24068J00531E2240a61770N0597o6015n9611P1774m1887E7883a03424A05625
10541a21310D7731a14578n8562I7249b15050C47954c5322p0891j14553B14889
10530G4678L8953c46188Q009O3500A06066a09574P044p1330C97277b9913j23938
10519a53851C44804I172b00567I0631J41724d54988J58761B14180D9161b02974
10508a5271q3005A75267a90275b0513k7372e277r239N498B2483M7905H197L57798
10496C65995I3374J21181a05634j6240J6527R731C0503b36645O937B12366B7885
$$ plain form
10577 293673 -36635 -135144 -75774 -112718 66112 -342424 37888 1498 -36450 108704 -19604
10565 -111339 -192885 154635 -135703 -200407 -134614 -8617 -244763 -52358 -126966 104833 -210165
10553 -324068 -223537 52240 -161770 -111173 -177188 -236799 -165025 -206912 57883 -103424 105625
10541 -121310 47731 -114578 -173140 97249 -215050 347954 -35322 -106213 -220766 214889
10530 74678 113631 -346188 -338179 -274679 106066 -109574 -102530 -173860 397277 -29913 -153851
10519 -153851 344804 9172 -200567 90631 232355 -454988 -296227 214180 49161 -202974
10508 -15271 -98276 175267 -190275 -20513 -47885 -5277 -14516 -9018 22483 70388 8197 365995
10496 365995 93374 214555 -105634 -121874 -105347 -95616 30503 -236645 -229708 212366 27885
10484D5955e23972b11109A66251n1187q301O8971L0384a68867n30A28345B9736
10472B47909i5137J3899B4394g0811g312A27078J2179d593B22556a58938o5772
10461b24710I9797a14811e4928D08956I3412b52367J9225i5182c4006A8434K17255
10450B35689b45692D9044c50927C3414p873K497a07590q2294C9376E961J62577
10439A68538J43331d7550H2354a556q7619j35437B1776f0320B44462h3537R617
10428g3920A56352I582a36109e869A0736f8570A13142a59315C24177j41262e14713
10416C86538I5278i1443D2279L632K19127b91415a157A97187b77618B16389O4770
10405B81159J7669G5297a32578C74288a33131r1535A30249K4926c39894h7295
$$ plain form
10484 45955 -523972 -211109 166251 115064 106763 175734 206118 -168867 -169397 128345 29736
10472 247909 -95137 -81238 24394 -70811 -7312 127078 139257 -4593 222556 -158938 -224710
10461 -224710 99797 -114811 -54928 408956 93412 -252367 -233142 -95182 -34006 18434 235689
10450 235689 -245692 49044 -350927 33414 25541 28038 -107590 -189884 39376 5961 168538
10439 168538 311869 -47550 82354 -1556 -89175 -224612 21776 -60320 244462 -83537 -73920
10428 -73920 156352 9582 -136109 -5869 10736 -68570 113142 -159315 324177 182915 -514713
10416 386538 95278 -91443 42279 45911 265038 -291415 -1157 197187 -277618 216389 281159
10405 281159 298828 75297 -132578 374288 -133131 -224666 130249 155175 -339894 -87295
10394g4086A65578F3955L86240j93056q0640J15206j1862E2369O6734a25577B19268
10382B80734r9809c9793A51421J32796o4009D3406j1575O3699J46590M80L04863
10371E47463A18464J58834D4152L96775j18736A37323M87246K8767B40308q6208
10361A54100R774J44862A53284N7598P4471A02171K78306I0273K99890k3732M63743
10350H30174C30316M68321A14134a70345C05574J25566A88269I0729K01904a37273
10339A47155b6440A45267N5786J3533a44253E07342A50989h6957B04148a05010
10328B35204k058J11578cA32152C8202L23463H6344K35946P095j15804a43833
10316F5948J82874H6559d54902B26460d9936m35148I3791b59925J09927j14885
$$ plain form
10394 -74086 165578 63955 450195 257139 176499 291705 279843 52369 119103 -125577 219268
10382 280734 180925 -39793 151421 284217 220208 43406 31831 95530 242120 242600 547463
10371 547463 118464 277298 44152 440927 322191 137323 624569 653336 240308 154100
10361 154100 163874 308736 153284 210882 285353 102171 380477 90273 390163 366431 830174
10350 830174 330316 798637 114134 -170345 305574 431140 188269 90729 292633 -137273
10339 147155 -26440 145267 201053 214586 -144253 507342 150989 -86957 204148 -105010
10328 235204 233146 344724 -3 132152 38202 361665 86344 322290 329385 213581 -143833
10316 65948 248822 86559 -454902 226460 -49936 -485084 93791 -259925 -149998 -264883
10306b64883A50948B9652c93736a34674A01859J74122j06988e9001K367j4247
10296g0881A84568B1780K24114C1599i8254A09751M5504a75790q3328L9035C76060
10284E9264f1824B39240a00211j03812G7734a72495a8277F3958O9287J42106c45987
10272A69899C229c17492J30272l8990A99268D057b17555J8386M7216A78156a39088
10260c04405B2558a24792E1960j9501h0930j35312A20684J40858a79624n6453
10250b36077p6497e5655A30766c4142A18904f8619D887f9805a5625k9136A80700
10238A54314c0246l31256n4368C7855J39338b17392C55658a71870P0425D7106
10227a22282r0384b5838k98906I4441d63673A24151a06472G8969k0041a75417
$$ plain form
10306 -264883 150948 29652 -393736 -134674 101859 275981 168993 -59001 -56634 -70881
10296 -70881 184568 21780 245894 31599 -98254 109751 155255 -175790 -259118 -220083 376060
10284 59264 -61824 239240 -100211 -204023 77734 -172495 -18277 63958 133245 275351 -345987
10272 169899 3229 -317492 -187220 -226210 199268 4057 -217555 -199169 -151953 178156 -139088
10260 -304405 22558 -124792 51960 32459 -80930 -216242 120684 261542 -179624 -236077
10250 -236077 -312574 -55655 130766 -34142 118904 -68619 4887 -69805 -15625 -44761 180700
10238 154314 -30246 -361502 -415870 37855 177193 -217392 355658 -171870 -101445 47106
10227 -122282 -212666 -25838 -324744 94441 -463673 124151 -106472 78969 58928 -175417
10216a69750o367D3104d3724K92a3389q1293C3521a09528B57639b0576l8508j13977
10204a73061I6959C9844e4575A52328b87679A23374g8557j17257R157f5684k17147
10193b82831B4805a18494A2909b15948M2872o7376N5077G6612l2628a51158p7036
10182b28194a3022A04498A8363O9429a82275f4449N835k11352A12009h7878j63558
10171b51436j29442a64090g2672l5779d1296B3379g450A476c24677D0792N9978
10160A00770j0676P5217c07274C06288h7136B4605M1290A679i8127A42657a43683
10148A73205a98866C67713A76431e18899J25211L1926J26760J9419C7564L80331
10138D17895b36761D2875b11952A25068i8823C0726a02044A01507i846k07977
$$ plain form
10216 -169750 -176117 43104 -43724 -43432 -13389 -94682 33521 -109528 257639 -20576 -59084 -173061
10204 -173061 96959 39844 -54575 152328 -287679 123374 -78557 -195814 -186657 -65684 -282831
10193 -282831 24805 -118494 12909 -215948 -173076 -240452 -185375 76612 43984 -151158 -228194
10182 -228194 -13022 104498 18363 87792 -182275 -64449 -58614 -269966 112009 -87878 -251436
10171 -251436 -380878 -164090 -72672 -108451 -41296 23379 -7450 1476 -324677 40792 100770
10160 100770 90094 165311 -307274 306288 -87136 24605 65895 1679 -98127 142657 -143683
10148 173205 -198866 367713 176431 -518899 -393688 -361762 -235002 -215583 37564 417895
10138 417895 -236761 42875 -211952 125068 -98823 30726 -102044 101507 -9846 -217823
10128b17823L2612j25953a1651l54598J70586D5491b66272B71631a04591c772
10117A87742b42320b4242A61265E4557a96793P8442A49908e6529k29439b4756
10106b4564j84523c1816A23726a31267A76652q5435b18427Q1921A24754A7113
10095D3120b8595j05382G4270e9089A03845M7981b36396O8034B6801a31595j157
10084a32752K6811M0171o6964L4613c1204A9731d859A66322E6712A5240K11487
10073B26727a14256A79171a88039A2725c8059E2914e7284F4908k1293L58025j95511
10062B06129H3820l3588c0428k80427a23164k46614b9402E1416a97658O0297M0497
10051i6864E3249g8641b0627k25282g1929j03031J9686B11352C3773a42862N6973
$$ plain form
10128 -217823 -185211 -311164 -11651 -366249 -195663 45491 -266272 271631 -104591 -3772
10117 187742 -242320 -24242 161265 54557 -196793 -118351 149908 -56529 -285968 -24756
10106 -24564 -209087 -31816 123726 -131267 176652 91217 -218427 -136506 124754 17113
10095 43120 -28595 -133977 74270 -59089 103845 151826 -236396 -168362 26801 -131595 -132752
10084 -132752 -105941 -65770 -132734 -98121 -31204 19731 -4859 166322 56712 15240 226727
10073 226727 -114256 179171 -188039 12725 -38059 52914 -57284 64908 43615 401640 206129
10062 206129 83820 50232 -30428 -310855 -123164 -369778 -29402 51416 -197658 -137361 -96864
10051 -96864 53249 -78641 -20627 -245909 -71929 -174960 -155274 211352 33773 -142862 -85889
10040h5889l30p9735k3437R0268m4992k1162N3235j32710e236k15901J05636k39328
10028c54829a41245k00145J21731j214e7063l674j08943A09842e2480l07357B94017
10016a42222A02160c51240a21412j89346A28195c1959J2604C980J29459F5941
10005a32401J9596j8574d8366p9242A36232K4515b79829h2776j93431g6438A70899
9993G1771a80256A90854o963H8544j6839b3293G0173a37024H9988a38736A35905
9981c54085B07856l9859i6311p4315A18259b38290G8229B865a59883B8306J65333
9970A93639b67956f9711B01928a08435d3505l12018i1635q3281A0297N5074a17876
9958B4526e19389A17426m0050A5402a42897A43594n6425K3030D2582a6369A33805
$$ plain form
10040 -85889 -86219 -165954 -189391 -99123 -144115 -165277 -112042 -244752 -5236 -221137 -115501 -354829
10028 -354829 -141245 -341390 -219659 -220873 -57063 -60737 -169680 109842 -52480 -359837 294017
10016 -142222 102160 -351240 -121412 -310758 128195 -31959 -19355 3980 133439 65941
10005 -132401 -112805 -131379 -48366 -127608 136232 160747 -279829 -82776 -276207 -76438 170899
9993 71771 -180256 190854 183891 88544 71705 -23293 70173 -137024 89988 -138736 135905
9981 -354085 207856 167997 -96311 -170626 118259 -238290 78229 2865 -159883 28306 193639
9970 193639 -267956 -69711 201928 -108435 -43505 -355523 -91635 -174916 10297 65371 -117876
9958 24526 -519389 117426 77376 15402 -142897 143594 87169 110199 42582 -16369 133805
9946c8585J0315j11060B16084c66765I4190B8353b12456J01064C40886b33403
9935a55733G8114J66162A7144a91889C71865b57656R7354B10249f3921j19180
9925a83101N4687j66572a0035m04931J44753h7404k32246g4921A8502L31396b55397
9913A34563h7049j71875b5650k17605d1424d78k10569B6460c61109A2207g4800
9901H1797c04127P9498I3412C3694c5483A21426c272q8246A72391E2206b38430
9889b01932C4894N3692b25409i4933q6366A88655E2793b0419l5250l4649C74436
9877a23007E028i6735A61470A9895b45547J14000b9842A45443b14911r4891B6224
9865c66360H400b22070e8468j25340r3146n7730h0274B00145d03764C0098K5276
$$ plain form
9946 -38585 -28270 -139330 216084 -366765 94190 28353 -212456 -111392 340886 -233403
9935 -155733 78114 244276 17144 -191889 371865 -257656 -160302 210249 -63921 -183101
9925 -183101 -128414 -294986 -10035 -414966 -270213 -87404 -319650 -74921 18502 349898 -255397
9913 134563 -87049 -258924 -25650 -243255 -41424 -478 -211047 26460 -361109 12207 -74800
9901 81797 -304127 -224629 93412 33694 -35483 121426 -3272 -91518 172391 52206 -238430
9889 -201932 34894 88586 -225409 -94933 -181299 188655 52793 -20419 -55669 -90318 374436
9877 -123007 5028 -96735 161470 19895 -245547 -131547 -29842 145443 -214911 -309802 26224
9865 -366360 8400 -222070 -58468 -183808 -276954 -334684 -80274 200145 -403764 30098 55374
9854E5374K18227a56083D6414e7383K6296j59198N9385b0023A26167c17552c1388
9842a92394j4398o2591b066l78256I1725a01382j9281A4675b94522f8821j11943
9831a80764O3228k7874K7116A25259o2004F777J45270a45135K2353j60271A41744
9819A82724c09005e2834k8278j73717B0734b48125b5963k93698g4949B17344A0283
9807c38420B27728I1302K1361h6043A46895a37841e5688b0513F4765a34277j39881
9796b74158C43399c89625a25784F135L74038A257a61224D6268h4433m0598A7265
9784a20214j6324e1091K1552A44948b34570l20489A08930N2867M4731C2405j1682
9773B0723M16764a10892o5215c5846l4466A24004M8543a35721a526E6495J56494
$$ plain form
9854 55374 273601 -156083 46414 -57383 -31087 -190285 -130900 -20023 126167 -317552 -31388
9842 -192394 -206792 -269383 -2066 -380322 91725 -101382 -120663 14675 -294522 -68821 -180764
9831 -180764 -117536 -145410 -118294 125259 63255 6777 152047 -145135 -122782 -283053 141744
9819 182724 -309005 -52834 -81112 -254829 20734 -248125 -25963 -319661 -74949 217344 10283
9807 -338420 227728 91302 112663 -86043 146895 -137841 -55688 -20513 64765 -134277 -274158
9796 -274158 343399 -389625 -125784 6135 380173 1257 -161224 46268 -84433 -125031 17265
9784 -120214 -136538 -51091 -29539 144948 -234570 -555059 108930 161797 206528 32405 20723
9773 20723 437487 -110892 -176107 -35846 -70312 124004 172547 -135721 -1526 56495 212989
9762B12989g6258m34626c3833a618A69730f9485A97523b4214B5936a49037e4714
9750h9664b821B97778o197a58690r1885I6073D2733e7458E2935Q495L1737b1791
9737i1246q0497q6281d1271k53791g7017P880A47704e9673A0272a37725A58551
9725C1653a18165j1744j10621F5236a55868D8336a18801k00723B09492I1485a03667
9713e4735q9207I0405b11910k4710G5486b28496B65847A00452b85055a29760n7010
9702a86770D5129b82421I8995h7064J872b2019m13693D3312K33164K520a64433
9690a13959A1500J1182a26286l22787B24181m0252D7455J06011L9623b913o6933
9679f9846E8820a78159A64834J2044d19679a94099H7896L43466A67612C9779R1928
$$ plain form
9762 212989 -76258 -510884 -33833 -1618 169730 -69485 197523 -24214 25936 -149037 -54714
9750 -89664 -2821 297778 291581 -158690 -250575 96073 42733 -57458 52935 61430 93167 -21791
9737 -91246 -171743 -258024 -41271 -295062 -77017 -69137 147704 -59673 10272 -137725 158551
9725 31653 -118165 -129909 -240530 65236 -155868 48336 -118801 -319524 209492 91485 -103667
9713 -54735 -143942 90405 -211910 -236620 75486 -228496 265847 100452 -285055 -129760 -186770
9702 -186770 45129 -282421 98995 -87064 -85192 -22019 -435712 43312 276476 278996 -164433
9690 -113959 11500 22682 -126286 -449073 224181 183929 47455 153466 193089 -2913 -69846
9679 -69846 58820 -178159 164834 176878 -419679 -194099 87896 431362 167612 39779 131707
9668A31707a38692q3063Q9967p750A6148o768a11667A03796a49290j63225a4295
9656A67953a32890o6790e9676F5733h2636B89236g8338j39491Q723P5289a1815
9644a49377m7698i0861c9419j8700D28983c50064D55959a63841d4366B5432b80530
9632B40345e3084A0323b90774h8436G4280c2738k5731A00536b03986c6550j33523
9621a70073C9528e6209j94241D228J85404e8264m8576j1477L2232D8218a95427
9609b43941N8520L8965N6339C1114g0093m07810B25403b02197O2348J8567A50242
9597G0954A9708d5229A23901b14435f4277l4127M3870K6869F1937c81024B64037
9585a31388b4822B6219c01490Q0719r9040C72620a8125k29766K6702e6820i960
$$ plain form
9668 131707 -138692 -221755 -131788 -139538 16148 9380 -111667 103796 -149290 -312515 -14295
9656 167953 -132890 -199680 -59676 65733 -82636 289236 -78338 -217829 -209106 -133817 -11815
9644 -149377 -197075 -90861 -39419 -58119 428983 -350064 455959 -163841 -44366 25432 -280530
9632 240345 -53084 10323 -290774 -88436 74280 -32738 -58469 100536 -203986 -36550 -170073
9621 -170073 39528 -56209 -250450 4228 189632 -58264 -106840 -118317 -86085 48218 -195427
9609 -243941 -185421 -146456 -90117 31114 -70093 -477903 225403 -202197 -139849 -121282 150242
9597 70954 19708 -45229 123901 -214435 -64277 -98404 -54534 -27665 61937 -381024 264037
9585 -131388 -24822 26219 -301490 -220771 -319811 372620 -18125 -247891 -221189 -56820 -9960
9573A17165h1930C5958a81726N3248A24365K0152J31709b51745e0938b3396A63010
9561I2081J58360c26109A23780l3085b45526A74375j9603b58633a784B24903a0307
9549a16821n0787k16281B3458a07577G4199d4662j43313c5253q0395k583M2199
9538g6032L1771b1473C4016a45845k38335a36058k1709D594a71851B4703R1247
9527A15950h6011A5306a91310b9413j43836k53845b03629j06011J31996o1772
9517b39416j65237i0425G2705M6994c95346J83600H883d24568K8775Q9322J08303
9506a98168C6888l60b79739m7379g5981j5929A78989a0507l5664n8890D6319j8360
9494B7959K47170E8642b3360k03928H1988a19221l4152C1149i7835E8074B1701
$$ plain form
9573 117165 -81930 35958 -181726 -128478 124365 144517 276226 -251745 -50938 -23396 163010
9561 92081 250441 -326109 123780 90695 -245526 174375 154772 -258633 -1784 224903 -10307
9549 -116821 -167608 -383889 23458 -107577 74199 -44662 -187975 -35253 -115648 -118231 -76032
9538 -76032 -44261 -21473 34016 -145845 -384180 -136058 -157767 4594 -171851 24703 115950
9527 115950 -86011 15306 -191310 -29413 -173249 -427094 -203629 -309640 -177644 -239416
9517 -239416 -404653 -90425 72705 119699 -395346 -211746 8883 -424568 -395793 -306471 -198168
9506 -198168 36888 36528 -279739 -327118 -75981 -91910 178989 -10507 -46171 -105061 46319 27959
9494 27959 275129 58642 -23360 -227288 81988 -119221 -153373 31149 -97835 58074 21701
9482c44072I962b5066j87690E9719B5352N4349O0943c27736a29028e1994j01835
9471a53829A39733i9962B45104r3242a4015l04613B3887L9280a32495j21890K2211
9460b32174A44367K43709I9172c70252A45244L80561j38264i4501A18271a43277
9449A31653i9446H5412a16953k24517h7037m0423D5009q59c32786C13760c15568
9437B13163g4832j90293a8998o8749A5986K50813d80784b1221B06797H2939a32711
9425A54767a1805m2381A2868a3506k12252j97711C02777n9775b04014B15421b53582
9413a99613I506a22765r5462l17734D9079J24384f5657o3723J4749C16112a47442
9401a95344M7306a971l00404m9384j35041A80922E4769g1115A9172a17172r1376
$$ plain form
9482 -344072 9962 -25066 -212756 59719 25352 79701 140644 -327736 -129028 -51994 -153829
9471 -153829 139733 -99962 245104 151862 -14015 -318628 23887 63167 -132495 -254385 -232174
9460 -232174 144367 388076 99172 -370252 145244 525805 387541 -94501 118271 -143277
9449 131653 -99446 85412 -116953 -341470 -87037 -127460 45009 44150 -332786 313760 -315568
9437 213163 -74832 -265125 -18998 -87747 15986 266799 -480784 -21221 206797 82939 -132711
9425 154767 -11805 -54186 12868 -13506 -225758 -423469 302777 243002 -204014 215421 -253582
9413 -199613 9506 -122765 -218227 -535961 49079 173463 -65657 -129380 -114631 316112 -147442
9401 -195344 -148038 -1971 -302375 -351759 -486800 180922 54769 -71115 19172 -117172 -208548
9390b08548a7892j01152c5963E2563J37236e5253k07092J11931K3049n8479L1877
9379a53967d4299B7734K21315b2716j5533l9629I1627d4155G5215b44225h5863
9367C16623H6147R4220A9104L165M268L28741a95542A36630F098J40779b84492
9355B3502a66350l5104C30423A27436h6086L5187I1352I174f7206B03315a08787
9343a62443A48484c1514j18808P0064B07495a39128l0287J2598B17794c21725
9332d12962d4017E8945b9614C19847R3792c22110f8747j41910f6680k54961Q5902
9321b35739n5344G3004B1634A0437c69169a43567a2403j47281A69977E9389a38154
9309b67429F2404R3080b27145P7048E9978J84972A19879a66284a825j05420I2274
$$ plain form
9390 -208548 -17892 -119044 -35963 52563 189799 -55253 -262345 -150414 -127365 -185844 -153967
9379 -153967 -44299 27734 249049 -22716 -38249 -77878 91627 -44155 75215 -244225 -85863
9367 316623 86147 180367 19104 22269 26537 355278 -195542 136630 6098 146877 -284492
9355 23502 -166350 -201454 330423 127436 -86086 -50899 91352 9174 -67206 203315 -108787
9343 -162443 148484 -31514 -150322 -80258 207495 -139128 -169415 -156817 217794 -321725
9332 -412962 -44017 58945 -29614 319847 413639 -322110 -68747 -210657 -66680 -321641 -235739
9321 -235739 -291083 73004 21634 10437 -369169 -143567 -12403 -159684 169977 59389 -138154
9309 -267429 62404 155484 -227145 -150097 59978 244950 119879 -166284 -1825 -107245 92274
9297d2007r3391A42031B7810e34467b57546B51007K4164g1210c3631A81030d4390
9285a5713l9275j22570B61866b86373B83417b28995a6414j69699I7436M0924h7557
9273c35301d7403j04998C24755b85301h1819j7507D3565B891a75609G194a89900
9261c97600J61062P7148b0832j08257J1983B13285f5218o4372A53219b72474c5046
9249A27627c66055c1811O917F2046a35314j06643i7464k09464Q6443G5342b338
9237h7668B94719a39287p5340c0502B57424c13831N0053B8403J30683b74994J11516
9226a63478O1574A81440q2425m7966B0263N6109i9751C0903D058J70094d2001
9214b13167j41112J49677j34948L5974A1398b8802B46331b25569f3822j16620
$$ plain form
9297 -42007 -135398 142031 27810 -534467 -257546 251007 275171 -71210 -33631 181030 -44390
9285 -15713 -54988 -177558 261866 -286373 283417 -228995 -16414 -186113 97436 138360 -87557
9273 -335301 -47403 -152401 324755 -285301 -81819 -99326 43565 2891 -175609 7194 -189900
9261 -397600 -236538 -159390 -20832 -129089 -117106 213285 -65218 -129590 153219 -272474 -35046
9249 127627 -366055 -31811 -24894 62046 -135314 -241957 -97464 -306928 -220485 75342 -2338
9237 -87668 294719 -139287 -214627 -30502 257424 -313831 -263778 28403 159086 -274994 -163478
9226 -163478 -101904 181440 99015 51049 20263 76372 -99751 30903 4058 174152 -42001
9214 -213167 -354279 -204602 -339550 -303576 11398 -28802 246331 -225569 -63822 -180442
9204a80442C41870b28020k15174G6745R8038a47265k0020j23902A62439c87114
9193F7899B11J42074b4889j15193L4260l48842J29024a08414j21238M1046j24589
9182c13195R2370Q0006I8932D7425a84912B82804C8395J14981Rj7582L7057b02031
9169c80233J61197A20167c23096A26184f5168A03017g8950C36443D5007J98931
9159B43938q6049b3663m0439A71394K0078c18630B09168a71577j16148Q2618n1196
9148b56303C9279a50785I8088J13999f20F7228b28293G1021d1108A23718b09615
9136d41727J22760a49311l2965A58037h1714k45764M2003A17399a74140g5493
9125c1296j0162n0920A03457L5988J7202p379a74445B3813A217c6829A14719O3920
$$ plain form
9204 -180442 341870 -228020 -443194 76745 174783 -147265 -167285 -291187 162439 -387114
9193 67899 211 142285 -24889 -140082 -105822 -454664 -325640 -108414 -229652 -188606 -313195
9182 -313195 -220825 -140819 98932 47425 -184912 282804 38395 153376 153385 135803 172860 -202031
9169 -380233 -219036 120167 -323096 126184 -65168 103017 -78950 336443 45007 243938
9159 243938 157889 -23663 -64102 171394 191472 -318630 209168 -171577 -287725 -205107 -256303
9148 -256303 39279 -150785 98088 212087 -620 67228 -228293 71021 -41108 123718 -209615
9136 -441727 -318967 -149311 -182276 158037 -81714 -327478 -285475 117399 -174140 -75493
9125 -31296 -41458 -92378 103457 139445 156647 149268 -174445 23813 1217 -36829 114719 178639
9113A78639a39621c5403A29345a57166I6807l0492g6256a1749C05924a34817j54406
9102b89223A71453l3944a54003L128A60300a60238L1668D1428b50388D7654A3359
9090a26559j01777e7168B7800b07382A28450o1077K14769h3093C9765a92106B9460
9078b18858O4225b8065j54565e6828j54555b3102L812A23142P5779J3681F6881
9066I2149a43593l5918C70260D2463a57222j64394b0607l05208h204j72468K4806
9055a55866A61591h4785q6281r7933C11703a40135N3918m02358A31333J04498
9045B35831E9832b09914i7680D168b94462H8725B8843J36135c36623J66788A43347
9033A08935c01414h8848k59745P3927O684J05953A62570m1447l3849M9549j1342
$$ plain form
9113 178639 -139621 -35403 129345 -157166 96807 66315 -76256 -11749 305924 -134817 -289223
9102 -289223 171453 137509 -154003 -150875 160300 -160238 -128570 41428 -250388 47654 13359
9090 -126559 -228336 -57168 27800 -207382 128450 67373 282142 -83093 39765 -192106 29460
9078 -218858 -154633 -28065 -182630 -56828 -211383 -23102 -19290 123142 198921 212602 66881
9066 92149 -143593 -179511 370260 42463 -157222 -321616 -20607 -325815 -8204 -180672 -155866
9055 -155866 161591 -84785 -171066 -268999 311703 -140135 -86217 -488575 131333 235831
9045 235831 59832 -209914 -97680 4168 -294462 88725 28843 164978 -336623 -169835 143347
9033 108935 -301414 -88848 -348593 -274666 -267982 -162029 162570 121123 87274 136823 125481
9022A25481a74979G6115j0895N463b15496A34086a29719l38723a09928B09539
9011b0922l61022j00121a05559A49733c7638C5352b64829j88497K02316a3293
9000b63923g9648A9738c46672D07104k883e8347j34279E6093J18013d5849A37487
8988a10498a0743l40379B89145C4977a52627I1263a9210A79255o0166A9506L73131
8977C92637a44221B24985g3199L3344k69485H0416j0514a46468C24490c86549
8966A31814m5877d9795A67375a46553k4745A01794m3157J7669f6994A09171g5357
8954c1827A55189o1433l1241h4240j1046B1757a72503C2625f4479A44176a77994
8942I2603A0000K54486j09541a7085A76815A9836i3087C1045K41649a6278l14819
$$ plain form
9022 125481 -174979 76115 65220 70683 -215496 134086 -129719 -468442 -109928 209539
9011 -20922 -381944 -482065 -105559 149733 -37638 35352 -264829 -453326 -251010 -13293
9000 -263923 -79648 19738 -346672 407104 404221 -58347 -192626 56093 174106 -45849 137487
8988 -110498 -10743 -351122 289145 34977 -152627 91263 -19210 179255 119089 19506 392637
8977 392637 -144221 224985 -73199 -39855 -309340 80416 69902 -146468 324490 -386549
8966 131814 85937 -49795 167375 -146553 -171298 101794 58637 76306 -66994 109171 -75357
8954 -31827 155189 93756 62515 -84240 -95286 21757 -172503 32625 -64479 144176 -177994
8942 92603 10000 264486 154945 -17085 176815 19836 -93087 31045 272694 -16278 -331097
8931c31097a29276F8477P3586a03290R151B55485l4637J55072N50768J639983
8921B566671R386437B704515D07740n2184A12908P4501D489M4146c28865j05200
8911d34065h338A75295F2160J5582P282a56666A91817f8616n4523a7810B76585
8899B744b0545c274A49202a51368B25590B1146d756j98570r3A29043M6229c92260
8886A77683B3563b51979R83e575A8471a11400d6350k4961G559O0977J408d4436
8873c31199E8408j8664c54888a37914F2733b27771C7434a79833C55030b07728
$$ plain form
8931 -331097 -129276 68477 142063 -103290 -94139 255485 220848 375920 926688 2566671
8921 2566671 11953108 2704515 407740 355556 112908 187409 4489 48635 -328865 -434065
8911 -434065 -8338 175295 62160 77742 85024 -156666 191817 -68616 -123139 -17810 276585
8899 2744 -20545 -3274 149202 -151368 225590 21146 -4756 -203326 -203419 129043 175272 -392260
8886 177683 23563 -251979 -250996 -5575 18471 -111400 -46350 -71311 7559 68536 69944 -44436
8873 -331199 58408 39744 -354888 -137914 62733 -227771 37434 -179833 355030 -207728
$$ [...]
##END NTUPLES=NMR SPECTRUM
##END=
