
##TITLE=AC1366_2140_7184965_qDGOeVsAB1
##JCAMPDX= 6.0         $$ Bruker NMR JCAMP-DX V2.0
##DATA TYPE= NMR SPECTRUM
##DATA CLASS= NTUPLES
##ORIGIN= BRUKER
##OWNER= Administrator
$$ 1.72 TOPSPIN		Version 2.1
$$ 2012-12-11 18:25:39.660 -0500  Administrator@X
$$ Compression mode = diff/dup
##.OBSERVE FREQUENCY= 400.02188249412
##.OBSERVE NUCLEUS= ^1H
##.ACQUISITION MODE= SIMULTANEOUS (DQD)
##.ACQUISITION SCHEME= undefined
##.AVERAGES= 64
##.DIGITISER RES= 22
##SPECTROMETER/DATA SYSTEM= spect
##.PULSE SEQUENCE= noesygpps1d.comp
##.SOLVENT NAME= COFFEE_meoh
##.SHIFT REFERENCE= INTERNAL, COFFEE_meoh, 1, 14.96119
##AUDIT TRAIL= $$ (NUMBER, WHEN, WHO, WHERE, PROCESS, VERSION, WHAT)
$$ ##TITLE= Audit trail, TOPSPIN		Version 2.1
$$ ##JCAMPDX= 5.01
$$ ##ORIGIN= Bruker BioSpin GmbH
$$ ##OWNER= Administrator
$$ $$ E:\/data/COFFEE/nmr/AC1366_2140_7184965_qDGOeVsAB1/42/pdata/1/auditp.txt
$$ ##AUDIT TRAIL=  $$ (NUMBER, WHEN, WHO, WHERE, PROCESS, VERSION, WHAT)
(   1,<2012-12-11 18:25:33.660 -0500>,<Administrator>,<X>,<go>,<TOPSPIN 2.1>,
      <created by zg
	started at 2012-12-11 18:14:04.521 -0500,
	POWCHK enabled, PULCHK disabled,
       configuration hash MD5:
       86 BA 57 50 F2 9D 5C 9B 26 00 A9 28 5F 66 2E 89
       data hash MD5: 64K
       2D 69 66 55 DC F4 2D 57 87 D0 92 14 41 B2 2B 25>)
(   2,<2012-12-11 18:25:36.847 -0500>,<Administrator>,<X>,<proc1d>,<TOPSPIN 2.1>,
      <Start of raw data processing
       efp LB = 0.3 FT_mod = 6 PKNL = 1 PHC0 = 0 PHC1 = 0 SI = 128K 
       data hash MD5: 128K
       20 F9 0F B1 80 03 4A D1 87 65 B8 3A CE BB 28 42>)
(   3,<2012-12-11 18:25:37.941 -0500>,<Administrator>,<X>,<proc1d>,<TOPSPIN 2.1>,
      <pk PHC0 = -76.58569 PHC1 = 0 
       data hash MD5: 128K
       EC 78 E8 66 CE ED 8A 7B 91 A8 30 70 DA 7F 7D 76>)
(   4,<2012-12-11 18:25:38.660 -0500>,<Administrator>,<X>,<proc1d>,<TOPSPIN 2.1>,
      <abs ABSG = 1 
       data hash MD5: 128K
       95 DF 60 C3 8D 60 A1 26 7B F0 45 EC E1 E2 BF BE>)
(   5,<2012-12-11 18:25:38.816 -0500>,<Administrator>,<X>,<proc1d>,<TOPSPIN 2.1>,
      <abs ABSG = 2 
       data hash MD5: 128K
       C5 9B 41 4F D9 1A 2D 10 A5 28 88 F5 9C A5 5F 08>)
(   6,<2012-12-11 18:25:38.988 -0500>,<Administrator>,<X>,<proc1d>,<TOPSPIN 2.1>,
      <abs ABSG = 3 
       data hash MD5: 128K
       6D AB B4 3A 2C C6 7A 0E CC D5 FD BA BC 3E 5E 8F>)
(   7,<2012-12-11 18:25:39.160 -0500>,<Administrator>,<X>,<proc1d>,<TOPSPIN 2.1>,
      <abs ABSG = 4 
       data hash MD5: 128K
       81 84 C0 57 DA 9B A9 D4 30 45 F4 69 1B 1E 6A 1F>)
(   8,<2012-12-11 18:25:39.347 -0500>,<Administrator>,<X>,<proc1d>,<TOPSPIN 2.1>,
      <abs ABSG = 5 
       data hash MD5: 128K
       83 F2 12 05 9E D2 0B 13 88 EE 9B 24 6C 54 F6 5C>)
$$ ##END=
$$ 
$$ $$ hash MD5
$$ $$ CB 99 F1 7D 11 72 52 F4 8E 0D BE 2C 89 F3 FE 93
##$RELAX= 
##$RELAX= 
##$RELAX= 
##$RELAX= 
##$RELAX= 
##$RELAX= 
##$RELAX= 
##$RELAX= 
##$RELAX= 
$$ Bruker specific parameters
$$ --------------------------
##$DU= <E:\>
##$EXPNO= 42
$$ [...]
##$TP07= 0
##$TPNAME0= <>
##$TPNAME1= <>
##$TPNAME2= <>
##$TPNAME3= <>
##$TPNAME4= <>
##$TPNAME5= <>
##$TPNAME6= <>
##$TPNAME7= <>
##$TPOAL= (0..7)
0.5 0.5 0.5 0.5 0.5 0.5 0.5 0.5
##$TPOFFS= (0..7)
0 0 0 0 0 0 0 0
##$TUNHIN= 0
##$TUNHOUT= 0
##$TUNXOUT= 0
##$USERA1= <user>
##$USERA2= <user>
##$USERA3= <user>
##$USERA4= <user>
##$USERA5= <user>
##$V9= 5
##$VALIST= <valist>
##$VCLIST= <CCCCCCCCCCCCCCC>
##$VD= 0
##$VDLIST= <DDDDDDDDDDDDDDD>
##$VPLIST= <PPPPPPPPPPPPPPP>
##$VTLIST= <TTTTTTTTTTTTTTT>
##$WBST= 2048
##$WBSW= 25
##$XGAIN= (0..3)
0 0 0 0
##$XL= 0
##$YL= 0
##$YMAX_a= 5720075
##$YMIN_a= -12152684
##$ZGOPTNS= <>
##$ZL1= 120
##$ZL2= 120
##$ZL3= 120
##$ZL4= 120
##$ABSF1= 14.96119
##$ABSF2= -5.596992
##$ABSG= 5
##$ABSL= 3
##$ALPHA= 0
##$AQORDER= 0
##$ASSFAC= 0
##$ASSFACI= 0
##$ASSFACX= 0
##$ASSWID= 0
##$AUNMP= <proc_prof1d_extract.lims>
##$AXLEFT= 0
##$AXNAME= <>
##$AXNUC= <1H>
##$AXRIGHT= 0
##$AXTYPE= 0
##$AXUNIT= <>
##$AZFE= 0.1
##$AZFW= 0.1
##$BCFW= 0
##$BC_mod= 0
##$BYTORDP= 0
##$COROFFS= 0
##$CY= 15
##$DATMOD= 1
##$DC= 0
##$DFILT= <>
##$DTYPP= 0
##$F1P= 0
##$F2P= 0
##$FCOR= 0.5
##$FTSIZE= 131072
##$FT_mod= 6
##$GAMMA= 0
##$GB= 0
##$INTBC= 1
##$INTSCL= 1
##$ISEN= 128
##$LB= 0.3
##$LEV0= 0
##$LPBIN= 0
##$MAXI= 10000
##$MC2= 0
##$MEAN= 0
##$ME_mod= 0
##$MI= 0
##$NCOEF= 0
##$NC_proc= -2
##$NLEV= 6
##$NOISF1= 0
##$NOISF2= 0
##$NSP= 0
##$NTH_PI= 0
##$NZP= 0
##$OFFSET= 14.96119
##$PC= 1
##$PHC0= -76.58569
##$PHC1= 0
##$PH_mod= 1
##$PKNL= yes
##$PPARMOD= 0
##$PPDIAG= 0
##$PPIPTYP= 0
##$PPMPNUM= 2147483647
##$PPRESOL= 1
##$PSCAL= 4
##$PSIGN= 0
##$PYNMP= <proc.py>
##$REVERSE= no
##$SF= 400.020009562228
##$SI= 131072
##$SIGF1= 0
##$SIGF2= 0
##$SINO= 400
##$SIOLD= 131072
##$SPECTYP= <>
##$SREGLST= <1H.CDCl3>
##$SSB= 0
##$STSI= 131072
##$STSR= 0
##$SW_p= 8223.68421052631
##$SYMM= 0
##$S_DEV= 0
##$TDeff= 65536
##$TDoff= 0
##$TI= <>
##$TILT= no
##$TM1= 0
##$TM2= 0
##$TOPLEV= 0
##$USERP1= <user>
##$USERP2= <user>
##$USERP3= <user>
##$USERP4= <user>
##$USERP5= <user>
##$WDW= 1
##$XDIM= 131072
##$YMAX_p= 422623744
##$YMIN_p= -12811
##$CURPLOT= <Network HP LaserJet P1505>
##$CURPRIN= <$Network HP LaserJet P1505>
##$DFORMAT= <normdp>
##$LAYOUT= <+/1D_H.xwp>
##$LFORMAT= <normlp>
##$PFORMAT= <normpl>
##$SURQMSG= 1
$$ End of Bruker specific parameters
$$ ---------------------------------
##NTUPLES= NMR SPECTRUM
##VAR_NAME=  FREQUENCY,     SPECTRUM/REAL,   SPECTRUM/IMAG
##SYMBOL=    X,             R,               I
##VAR_TYPE=  INDEPENDENT,   DEPENDENT,       DEPENDENT
##VAR_FORM=  AFFN,          ASDF,            ASDF
##VAR_DIM=   131072,        131072,          131072
##UNITS=     HZ,            ARBITRARY UNITS, ARBITRARY UNITS
##FACTOR=    0.0627417313425164, 1,          1
##FIRST=     8223.62146879497, -2453,        -56288
##LAST=      0,             -134,            -56809
##MIN=       0,             -12811,          0
##MAX=       8223.62146879497, 422623744,    0
$$ Real data points
##PAGE= N=1
##DATA TABLE= (X++(R..R)), XYDATA
$$ [...]
$$ plain form
63844 1292067 1342008 1390339 1436611 1479805 1518584 1551836 1578961 1599692 1613760 1620703 1619925 1610963
63832 1610963 1593898 1569527 1538909 1502607 1460591 1413139 1361644 1308236 1254501 1200806 1146895
63821 1146895 1092944 1039875 988841 940693 895967 855091 818233 784920 754073 724653 696213
63810 696213 668678 641787 615150 588876 563718 540343 518735 498617 480151 463787 449481
63799 449481 436538 424360 413008 402781 393501 384512 375404 366486 358549 352207 347501 343932 340733
63786 340733 337176 332864 327976 323154 318946 315229 311373 307080 302924 299805 297943 296611 294878 292343
63772 292343 289159 285678 282352 279786 278442 278187 278306 278065 277212 275943 274577 273336 272267 271235 270095
63757 270095 268978 268200 267786 267291 266364 265270 264438 263725 262710 261676 261526 262412 263192 262773 261525 260731 261071
$$ packed form
63844A292067M9941M8331M6272M3194L8779L3252K7125K0731J4068O943p78q962
63832A610963j7065k4371l0618l6302m2016m7452n1495n3408n3735n3695n3911
63821A146895n3951n3069n1034m8148m4726m0876l6858l3313l0847k9420k8440
63810F96213k7535k6891k6637k6274k5158k3375k1608k0118j8466j6364j4306
63799D49481j2943j2178j1352j0227r280q989r108q918p937o342m706l569l199
63786C40733l557m312m888m822m208l717l856m293m156l119j862j332j733k535
63772B92343l184l481l326k566j344k55J19k41q53j269j366j241j069j032j140
63757B70095j117p78m14m95r27j094q32p13j015j034j50Q86P80m19j248p94L40
$$ plain form
63740 261071 262352 264348 266899 269215 270181 269775 269431 270519 272981 275858 278519 280802 282503 283614 284979
63725 284979 287912 292945 299353 305998 312334 318452 324558 330720 336946 343193 349184 354381 358369 361305
63711 361305 363774 365965 367094 365966 362159 356470 350210 344347 339326 335226 331831 328745 325659 322483
63697 322483 319288 316463 314840 315172 317207 319688 321506 322495 322971 323046 322774 322511 322528 322597 322425 322238 322422 322900
63679 322900 323434 324303 325961 328127 329952 331172 332498 334685 337793 341547 345880 350773 355998 361383 367090
63664 367090 373255 379504 385127 389709 393366 396316 398287 398531 396539 392732 388148 383362 377972 371413
63650 371413 363944 356460 349597 343517 338390 334460 331609 329414 327742 326861 326833 327333 328244 329874 332342
63635 332342 335250 338358 342145 347202 353312 359613 365458 370692 375304 379440 383768 389217 396079 403692
$$ packed form
63740B61071J281J996K551K316R66m06l44J088K462K877K661K283J701J111J365
63725B84979K933N033O408O645O336O118O106O162O226O247N991N197L988K936
63711C61305K469K191J129j128l807n689o260n863n021m100l395l086l086l176
63697C22483l195k825j623L32K035K481J818R89M76P5k72k63J7O9j72j87J84M78
63679C22900N34Q69J658K166J825J220J326K187L108L754M333M893N225N385N707
63664C67090O165O249N623M582L657K950J971K44j992l807m584m786n390o559
63650C71413p469p484o863o080n127l930k851k195j672q81k8N00R11J630K468
63635C32342K908L108L787N057O110O301N845N234M612M136M328N449O862P613
$$ plain form
63621 403692 411233 418544 425968 433766 442155 451725 463197 476618 491329 507060 524650 545211 568865
63608 568865 594916 623113 653954 687534 722821 758479 793778 828068 859763 886626 906976
63597 906976 920149 926100 925415 919770 911521 902346 892640 882404 872197 862692 853547 843219 829992
63584 829992 813104 793045 771065 748517 726474 705712 686698 669541 654158 640683 629498
63573 629498 620694 613767 608193 604071 601839 601569 603045 606303 611399 617638 623733 629057 634208 640069
63559 640069 646739 653692 660621 667711 675313 683699 693022 703415 715254 729359 746653 767554 792124
63546 792124 820914 855257 896492 945227 1001195 1062590 1124558 1178921 1217048 1234195 1231457 1213975
63534 1213975 1187709 1157608 1127469 1100182 1077542 1059933 1046474 1035691 1026212 1016968 1006895 994678
$$ packed form
63621D03692P541P311P424P798Q389R570J1472J3421J4711J5731J7590K0561K3654
63608E68865K6051K8197L0841L3580L5287L5658L5299L4290L1695K6863K0350
63597I06976J3173N951o85n645q249r175r706j0236j0207r505r145j0328j3227
63584H29992j6888k0059k1980k2548k2043k0762j9014j7157j5383j3475j1185
63573F29498q804o927n574m122k232k70J476L258N096O239O095N324N151N861
63559F40069O670O953O929P090P602Q386R323J0393J1839J4105J7294K0901K4570
63546G92124K8790L4343M1235M8735N5968O1395O1968N4363L8127J7147k738j7482
63534A213975k6266l0101l0139k7287k2640j7609j3459j0783r479r244j0073j2217
$$ plain form
63522 994678 979025 959266 935683 909220 880841 851163 820673 790209 760938 733813 709215
63511 709215 687289 668232 651928 637601 624412 612320 601833 592960 585007 577476 570453 563867
63499 563867 557114 549965 543246 537928 533790 529636 524765 519664 515208 511671 508641 505598 502356 499054
63485 499054 495854 492687 489440 486393 484266 483689 484815 487545 491799 497334 503537 509773 515758 521361
63471 521361 526248 530091 532965 535062 536064 535205 532100 527246 521650 516113 510864 505599 499827 493365
63457 493365 486582 480078 474155 468792 464081 460416 458109 456947 456307 455775 455633 456629 459220 463190 468200
63442 468200 474557 482973 493504 505194 517143 529693 544311 562505 585204 613051 646951 688090
63430 688090 737068 792286 848725 898851 935761 956188 960952 953262 937157 917092 897726 883076
$$ packed form
63522I94678j5653j9759k3583k6463k8379k9678l0490l0464k9271k7125k4598
63511G09215k1926j9057j6304j4327j3189j2092j0487q873p953p531p023o586
63499E63867o753p149o719n318m138m154m871n101m456l537l030l043l242l302
63485D99054l200l167l247l047k127n77J126K730M254N535O203O236N985N603
63471E21361M887L843K874K097J002q59l105m854n596n537n249n265n772o462
63457D93365o783o504n923n363m711l665k307j162o40n32j42R96K591L970N010
63442D68200O357Q416J0531J1690J1949J2550J4618J8194K2699K7847L3900M1139
63430F88090M8978N5218N6439N0126L6910K0427M764p690j6105k0065j9366j4650
$$ plain form
63418 883076 875593 875965 883773 898489 920126 948847 983753 1022211 1060631 1095770 1125146 1146732
63406 1146732 1159201 1162681 1158732 1149364 1136337 1121315 1105922 1091160 1077037 1063057 1048701 1033117
63394 1033117 1014786 992193 965010 934432 902344 870313 839190 809338 781093 755069 731966
63383 731966 712008 694739 679614 666699 656488 649026 643550 639211 635940 634365 634985 637677 641956
63370 641956 647360 653517 660245 667867 677216 688885 702486 717064 732291 748913 767879 789371
63358 789371 812900 838092 865047 894047 925228 958535 993777 1030623 1068429 1105857 1140596
63347 1140596 1169762 1190938 1203046 1206411 1202377 1192888 1179999 1165300 1149770 1134136 1118948 1104127
63335 1104127 1088825 1072125 1053570 1032739 1008868 981597 951893 921477 891444 862107 834108
$$ packed form
63418H83076p483L72P808J4716K1637K8721L4906L8458L8420L5139K9376K1586
63406A146732J2469L480l949r368j3027j5022j5393j4762j4123j3980j4356j5584
63394A033117j8331k2593k7183l0578l2088l2031l1123k9852k8245k6024k3103
63383G31966j9958j7269j5125j2915j0211p462n476m339l271j575O20K692M279
63370F41956N404O157O728P622R349J1669J3601J4578J5227J6622J8966K1492
63358G89371K3529K5192K6955K9000L1181L3307L5242L6846L7806L7428L4739
63347A140596K9166K1176J2108L365m034r489j2889j4699j5530j5634j5188j4821
63335A104127j5302j6700j8555k0831k3871k7271k9704l0416l0033k9337k7999
$$ plain form
63324 834108 808847 787532 770453 757476 748762 744796 746402 754885 770950 792161 811690 820995
63312 820995 814785 793715 762708 727348 691734 658467 629164 604490 584187 567543 553849 542316
63300 542316 531903 521734 511782 502712 494883 487744 480450 472729 464852 457033 449396 442386 436556 431769
63286 431769 427098 421828 416261 411274 407310 404069 401041 398025 395143 392545 390175 387829 385479 383476
63272 383476 382222 381623 381084 380123 378832 377596 376554 375454 373889 371553 368425 364866 361441 358508 356031
63257 356031 353831 351873 350220 348921 348045 347649 347567 347425 347066 346745 346625 346291 345168 343400 341837 340976 340273
63240 340273 338826 336559 334328 332887 332124 331453 330650 330020 329882 330271 331131 332447 333989 335138 335269 334276
63224 334276 332625 331024 330088 330130 330955 331934 332548 332890 333456 334487 335746 336920 337965 338959 339900 340815 341936
$$ packed form
63324H34108k5261k1315j7079j2977q714l966J606Q483J6065K1211J9529R305
63312H20995o210k1070l1007l5360l5614l3267k9303k4674k0303j6644j3694j1533
63300E42316j0413j0169r952r070p829p139p294p721p877p819p637p010n830m787
63286D31769m671n270n567m987l964l241l028l016k882k598k370k346k350k003
63272C83476j254n99n39r61j291j236j042j100j565k336l128l559l425k933k477
63257C56031k200j958j653j299q76l96q2j42l59l21j20l34j123j768j563q61p03
63240C40273j447k267k231j441p63o71q03o30j38L89Q60J316J542J149J31r93
63224C34276j651j601r36M2Q25R79O14L42N66J031J259J174J045R94R41R15J121
$$ plain form
63207 341936 343526 345560 347671 349426 350686 351712 352932 354574 356494 358356 359868 360928 361747 362911
63193 362911 364995 367873 370683 372862 375042 378373 383037 387947 392172 396167 401221 407912 415554 423127
63179 423127 430392 437916 446189 455034 463995 473112 482888 493426 503969 513601 522093 529677 536279 541575
63165 541575 545741 549536 553512 557586 561468 564887 567176 567212 564268 558618 550990 541737 530953 519015
63151 519015 506482 493574 480255 466829 454085 442714 432768 423688 414764 405760 397301 390513 386010
63138 386010 383251 381105 378902 376743 374915 373379 371890 370370 369037 368207 367966 368055 368239 368797 370385 373231
63122 373231 376712 379953 382600 384800 386787 388929 391911 396293 401857 407829 413716 419475 424899 429451
63108 429451 433030 436449 440758 446231 452287 458262 463976 469585 475095 480188 484629 488862 494005 500975
$$ packed form
63207C41936J590K034K111J755J260J026J220J642J920J862J512J060Q19J164
63193C62911K084K878K810K179K180L331M664M910M225L995N054O691P642P573
63179D23127P265P524Q273Q845Q961R117R776J0538J0543R632Q492P584O602N296
63165E41575M166L795L976M074L882L419K289L6k944n650p628r253j0784j1938
63151E19015j2533j2908j3319j3426j2744j1371r946r080q924r004q459o788m503
63138C86010k759k146k203k159j828j536j489j520j333q30k41Q9J84N58J588K846
63122C73231L481L241K647K200J987K142K982M382N564N972N887N759N424M552
63108D29451L579L419M309N473O056N975N714N609N510N093M441M233N143O970
$$ plain form
63094 500975 509699 519458 529853 540985 552678 564220 575247 586353 598143 609863 619588 625891
63082 625891 628928 629786 629235 627358 624001 619075 612409 603747 593141 581264 569125 557428 546245
63069 546245 535290 524338 513314 502182 491115 480824 472337 466095 461368 456951 452511 448918 447080
63056 447080 446759 446850 446685 446595 447167 448399 449955 451942 454926 459034 463435 467069 469788 472513 476201 480920
63040 480920 486041 491048 495821 500232 503941 506837 509437 512546 516541 521107 525510 528970 531029 531962
63026 531962 532732 534085 535689 536543 536264 535402 534335 532536 529366 525111 520673 516573 512861 509710 507383
63011 507383 505760 504622 504350 505648 508495 512149 516355 521776 528884 537140 545797 554993 565513 577849
62997 577849 591968 607538 623840 639870 655118 669997 684945 699479 712833 725208 737514
$$ packed form
63094E00975Q724R759J0395J1132J1693J1542J1027J1106J1790J1720R725O303
63082F25891L037Q58n51j877l357m926o666q662j0606j1877j2139j1697j1183
63069E46245j0955j0952j1024j1132j1067j0291q487o242m727m417m440l593j838
63056D47080l21R1j65r0N72J232J556J987K984M108M401L634K719K725L688M719
63040D80920N121N007M773M411L709K896K600L109L995M566M403L460K059R33
63026E31962P70J353J604Q54k79q62j067j799l170m255m438m100l712l151k327
63011E07383j623j138k72J298K847L654M206N421P108Q256Q657R196J0520J2336
62997E77849J4119J5570J6302J6030J5248J4879J4948J4534J3354J2375J2306
$$ plain form
62986 737514 750033 762273 774158 786340 798985 811110 821608 830247 837154 842031 844564 845029 843639
62973 843639 839559 831491 819222 803839 786375 767055 746191 725028 704993 686389 668455 650648
62961 650648 633354 617229 602356 588377 575236 563347 552950 543620 534637 525695 517017 508816
62949 508816 500942 493168 485591 478533 472155 466325 460816 455415 449921 444289 438839 434108 430351 427259
62935 427259 424276 421083 417707 414251 410694 406917 402879 398738 394859 391584 388950 386678 384578 382838
62921 382838 381740 381136 380496 379472 378184 376836 375356 373718 372370 371962 372610 373758 374826 375706 376522 377296
62905 377296 378135 379448 381553 384178 386804 389552 393250 398382 404366 410246 415879 422022 429298 437553
62891 437553 446251 455067 463866 472445 480629 488442 495903 502813 509037 514778 520202 524846 527911 529248
$$ packed form
62986G37514J2519J2240J1885J2182J2645J2125J0498Q639O907M877K533M65j390
62973H43639m080q068j2269j5383j7464j9320k0864k1163k0035j8604j7934j7807
62961F50648j7294j6125j4873j3979j3141j1889j0397r330q983q942q678q201
62949E08816p874p774p577p058o378n830n509n401n494n632n450m731l757l092
62935D27259k983l193l376l456l557l777m038m141l879l275k634k272k100j740
62921C82838j098o04o40j024j288j348j480j638j348m08O48J148J068Q80Q16P74
62905C77296Q39J313K105K625K626K748L698N132N984N880N633O143P276Q255
62891D37553Q698Q816Q799Q579Q184P813P461O910O224N741N424M644L065J337
$$ plain form
62877 529248 529632 529747 529132 526468 520854 512694 503389 494268 485714 477228 468390 459631 451814 445109 438760
62862 438760 432136 425522 419527 414119 408809 403561 398851 394883 391327 387952 384958 382408 379788 376547
62848 376547 372864 369567 367376 366464 366651 367742 369570 371773 373688 374648 374540 373996 373854 374462 375676 377327
62832 377327 379332 381384 382997 384044 384905 385901 386889 387598 388070 388491 388882 389306 390167 391843 394009 395662
62816 395662 395947 394834 392942 390918 389094 387638 386771 386598 386716 386278 384752 382542 380616 379539 379126 378968
62800 378968 378853 378675 378424 378524 379673 381891 384024 384674 383484 381180 378561 375952 373557 371780 370899 370678
62784 370678 370553 370184 369871 370448 372592 376094 379967 383464 386795 390577 394843 399067 402947 406562 409673
62769 409673 411550 411769 410786 409367 407936 406822 406723 408163 410585 412632 413532 413728 413946 414145 413790 412758
$$ packed form
62877E29248L84J15o15k664n614q160r305r121q554q486q838q759p817o705o349
62862D38760o624o614n995n408n310n248m710l968l556l375k994k550k620l241
62848C76547l683l297k191r12J87J091J828K203J915R60j08n44j42O08J214J651
62832C77327K005K052J613J047Q61R96R88P09M72M21L91M24Q61J676K166J653
62816C95662K85j113j892k024j824j456q67j73J18m38j526k210j926j077m13j58
62800C78968j15j78k51J00J149K218K133O50j190k304k619k609k395j777q81k21
62784C70678j25l69l13N77K144L502L873L497L331L782M266M224L880L615L111
62769D09673J877K19r83j419j431j114r9J440K422K047R00J96K18J99l55j032
$$ plain form
62753 412758 411341 409502 406792 403176 399374 396056 393129 390202 387366 384941 382663 379804 376153 372355
62739 372355 369130 366576 364397 362378 360373 358241 356111 354421 353417 352856 352412 352097 351972 351788 351288 350669
62723 350669 350365 350543 351176 352425 354500 357254 360309 363513 366882 370156 372914 375234 377840 381511 386576
62708 386576 392989 400453 408465 416687 425513 435820 447909 460964 473934 486704 500086 514782
62696 514782 530719 547360 564360 581880 600515 620944 643426 667526 692520 718129 744599
62685 744599 771851 798736 823434 844492 861155 872822 878861 879210 874587 865555 851799 833067
62673 833067 810557 786440 761826 736129 708776 680741 653710 628365 604327 581421 560083
62662 560083 540575 522610 505909 490577 476793 464543 453755 444295 435826 428117 421456 416271
$$ packed form
62753D12758j417j839k710l616l802l318k927k927k836k425k278k859l651l798
62739C72355l225k554k179k019k005k132k130j690j004n61m44l15j25j84n00o19
62723C50669l04J78O33J249K075K754L055L204L369L274K758K320K606L671N065
62708C86576O413P464Q012Q222Q826J0307J2089J3055J2970J2770J3382J4696
62696E14782J5937J6641J7000J7520J8635K0429K2482K4100K4994K5609K6470
62685G44599K7252K6885K4698K1058J6663J1667O039L49m623r032j3756j8732
62673H33067k2510k4117k4614k5697k7353k8035k7031k5345k4038k2906k1338
62662E60083j9508j7965j6701j5332j3784j2250j0788r460q469p709o661n185
$$ plain form
62650 416271 412305 408760 405315 402370 400010 397464 394088 390336 387123 384584 382167 379801 378204 377917
62636 377917 378592 379518 380406 381323 382186 382779 383134 383478 383708 383318 382020 380197 378460 376884 375030 372676 370151
62619 370151 367880 365945 364274 362930 361914 360913 359623 358236 357277 356993 357123 357277 357264 357073 356786 356567
62603 356567 356553 356653 356597 356174 355406 354559 354063 354278 355136 356139 356848 357255 357554 357787 357979 358374 359128 359896 360133
62584 360133 359798 359410 359414 359815 360381 360866 361101 361244 361873 363386 365240 366236 365703 364029 362017 360139 358563
62567 358563 357388 356539 355689 354584 353212 351563 349523 347225 345227 344088 343888 344281 344786 344990 344775 344520
62551 344520 344762 345507 346137 346173 345811 345511 345403 345357 345325 345319 345336 345627 346783 349143 352282 355409 358079 360160 361324
62532 361324 361214 360155 359171 359053 359701 360606 361709 363440 366035 369192 372514 376071 380284 385378 391175
$$ packed form
62650D16271l966l545l445k945k360k546l376l752l213k539k417k366j597k87
62636C77917O75R26Q88R17Q63N93L55L44K30l90j298j823j737j576j854k354k525
62619C70151k271j935j671j344j016j001j290j387r59k84J30J54j3j91k87k19
62603C56567j4J00n6m23p68q47m96K15Q58J003P09M07K99K33J92L95P54P68K37
62584C60133l35l88MM01N66M85K35J43O29J513J854R96n33j674k012j878j576
62567C58563j175q49q50j105j372j649k040k298j998j139k00L93N05K04k15k55
62551C44520K42P45O30L6l62l00j08m6l2oJ7K91J156K360L139L127K670K081J164
62532C61324j10j059r84j18O48R05J103J731K595L157L322L557M213N094N797
$$ plain form
62517 391175 397477 404345 411857 419874 428299 437409 447555 458651 470340 482713 496479 512262 529917
62504 529917 548551 567007 584369 600379 615449 629924 643147 653620 660275 663372 663952 662697
62492 662697 659611 654619 648191 641374 635318 630687 627483 625536 625093 626660 630315 635600 642177 650154
62478 650154 659540 669783 680103 689904 698477 704677 707518 707103 704471 700269 693745 683257 667858
62465 667858 648398 626992 605352 583783 561899 539951 518886 499237 480725 463236 447512
62454 447512 434408 423848 415048 407480 401111 395898 391579 387946 385021 382950 381898 381856 382342 382502 381847
62439 381847 380705 379698 379017 378506 378106 377788 377285 376445 375701 375611 375995 376086 375592 375079 375149 375689 376200 376516 376945
62420 376945 377802 379000 380010 380271 379760 379080 378819 378923 378980 378967 379236 379808 380202 380218 380357 381082 381972 382161 381516
$$ packed form
62517C91175O302O868P512Q017Q425R110J0146J1096J1689J2373J3766J5783J7655
62504E29917J8634J8456J7362J6010J5070J4475J3223J0473O655L097N80j255
62492F62697l086m992o428o817o056m631l204j947m43J567L655N285O577P977
62478F50154R386J0243J0320R801Q573O200K841m15k632m202o524j0488j5399
62465F67858j9460k1406k1640k1569k1884k1948k1065j9649j8512j7489j5724
62454D47512j3104j0560q800p568o369n213m319l633k925k071j052m2M86J60o55
62439C81847j142j007o81n11m00l18n03q40p44r0L84R1m94n13P0N40N11L16M29
62420C76945Q57J198J010K61n11o80k61J04N7j3K69N72L94J6J39P25Q90J89o45
$$ plain form
62401 381516 380905 381160 382151 383184 384058 385319 387420 390092 392909 396173 400667 406449 412468 417776 422739
62386 422739 428538 435548 442783 449128 454718 460843 468624 478065 488371 498927 509800 521358 533650
62373 533650 546268 558726 570820 582668 594603 607069 620438 634881 650493 667497 686198
62362 686198 706825 729710 755601 785438 819736 858549 902150 951264 1006236 1066254 1129735
62351 1129735 1195308 1261953 1328180 1391464 1448715 1497290 1535581 1562873 1578948 1584084 1579389 1566635
62339 1566635 1547224 1521436 1489125 1451025 1408757 1363559 1315840 1266299 1216701 1168893 1123487
62328 1123487 1080131 1038725 999754 963610 930187 899064 869661 841379 814050 788105 763879
62317 763879 740972 718805 697612 678211 660835 644786 629363 614594 600893 588475 577378
$$ packed form
62401C81516o11K55R91J033Q74J261K101K672K817L264M494N782O019N308M963
62386D22739N799P010P235O345N590O125P781R441J0306J0556J0873J1558J2292
62373E33650J2618J2458J2094J1848J1935J2466J3369J4443J5612J7004J8701
62362F86198K0627K2885K5891K9837L4298L8813M3601M9114N4972O0018O3481
62351A129735O5573O6645O6227O3284N7251M8575L8291K7292J6075N136m695j2754
62339A566635j9411k5788l2311l8100m2268m5198m7719m9541m9598m7808m5406
62328A123487m3356m1406l8971l6144l3423l1123k9403k8282k7329k5945k4226
62317G63879k2907k2167k1193j9401j7376j6049j5423j4769j3701j2418j1097
$$ plain form
62306 577378 567767 559833 553468 548160 543298 538612 534336 530791 527926 525539 523931 523778 525110 526944
62292 526944 528310 529233 530298 531751 533606 536093 539252 542432 545033 547479 550580 554097 556977 559004
62278 559004 561200 564353 568045 571495 574551 577409 580088 582732 585910 590121 595423 602008 610696 622312
62264 622312 636873 653830 672934 694479 718918 746656 778191 814139 855088 901498 953539
62253 953539 1010859 1072610 1137775 1205290 1273693 1340751 1403532 1458767 1503349 1534956 1552593
62242 1552593 1556672 1548690 1530799 1505178 1473184 1435030 1390574 1340327 1285461 1227223 1166990 1106737
62230 1106737 1048564 993601 941963 893877 850065 810793 775370 743138 714414 689878 669364
62219 669364 651747 635792 620788 606663 593877 583012 574104 566411 558986 551323 543419 535549 528114
$$ packed form
62306E77378r611p934o365n308m862m686m276l545k865k387j608j53J332J834
62292E26944J366R23J065J453J855K487L159L180K601K446L101L517K880K027
62278E59004K196L153L692L450L056K858K679K644L178M211N302O585Q688J1616
62264F22312J4561J6957J9104K1545K4439K7738L1535L5948M0949M6410N2041
62253I53539N7320O1751O5165O7515O8403O7058O2781N5235M4582L1607J7637
62242A552593M079p982j7891k5621l1994l8154m4456n0247n4866n8238o0233o0253
62230A106737n8173n4963n1638m8086m3812l9272l5423l2232k8724k4536k0514
62219F69364j7617j5955j5004j4125j2786j0865q908p693p425p663p904p870p435
$$ plain form
62206 528114 521374 515164 509142 503386 498374 494410 491556 490177 490794 493166 496227 499338 503007 507887
62192 507887 513728 519949 526704 534642 543928 554130 564841 575865 587048 598531 610894 624460
62180 624460 638643 652564 666090 679553 692560 703872 712634 719201 724662 730041 736201 744112 754891
62167 754891 769610 789013 813267 842086 875290 913075 955490 1001812 1050670 1100417 1148954
62156 1148954 1193506 1231281 1260458 1280240 1290249 1290548 1282216 1267147 1246928 1222240 1193341 1160540
62144 1160540 1123983 1083641 1040055 994866 950178 907492 867492 830684 797744 769068 744244
62133 744244 722345 702944 686743 674913 667724 664014 662161 661357 661704 663347 666048 669614 674322 680606
62119 680606 688453 697220 705957 713893 720740 726617 731756 736385 740941 746119 752505 760272 769420 780078
$$ packed form
62206E28114o740o210o022n756n012l964k854j379O17K372L061L111L669M880
62192E07887N841O221O755P938R286J0202J0711J1024J1183J1483J2363J3566
62180F24460J4183J3921J3526J3463J3007J1312Q762O567N461N379O160P911J0779
62167G54891J4719J9403K4254K8819L3204L7785M2415M6322M8858M9747M8537
62156A148954M4552L7775K9177J9782J0009K99q332j5069k0219k4688k8899l2801
62144A160540l6557m0342m3586m5189m4688m2686m0000l6808l2940k8676k4824
62133G44244k1899j9401j6201j1830p189l710j853q04L47J643K701L566M708O284
62119F80606P847Q767Q737P936O847N877N139M629M556N178O386P767R148J0658
$$ plain form
62105 780078 792078 804163 813959 819091 818495 812896 804236 794658 785785 778625 773803 771394 770431 768933
62091 768933 764890 757340 746548 733557 720001 708056 699847 696477 697685 702476 710003 720017 732823
62078 732823 748898 768352 790702 815288 841928 870906 902314 935597 969842 1004395 1039070
62067 1039070 1073883 1108786 1143699 1178647 1213634 1248373 1282439 1315873 1349348 1383153 1416031
62056 1416031 1445471 1469240 1486210 1495791 1497533 1491872 1480650 1465976 1448619 1427981 1403358 1374653
62044 1374653 1342004 1305511 1265541 1222925 1178790 1134507 1091602 1051106 1012872 975954 939840
62033 939840 904987 872212 842015 814599 790033 768172 748739 731677 717165 705158 695208 686831
62021 686831 679760 673689 668094 662490 656604 650142 642687 634032 624434 614353 604146 594147 584855 576759
$$ packed form
62105G80078J2000J2085R796N132n96n599q660r578q873p160m822k409r63j498
62091G68933m043p550j0792j2991j3556j1945q209l370J208M791P527J0014J2806
62078G32823J6075J9454K2350K4586K6640K8978L1408L3283L4245L4553L4675
62067A039070L4813L4903L4913L4948L4987L4739L4066L3434L3475L3805L2878
62056A416031K9440K3769J6970R581J742n661j1222j4674j7357k0638k4623k8705
62044A374653l2649l6493l9970m2616m4135m4283m2905m0496l8234l6918l6114
62033I39840l4853l2775l0197k7416k4566k1861j9433j7062j4512j2007r950q377
62021F86831p071o071n595n604n886o462p455q655r598j0081j0207r999r292q096
$$ plain form
62007 576759 570075 564702 560415 557178 555508 556444 560723 567835 576231 584711 593313 602694 613000 623684
61993 623684 634037 643375 650813 655487 657232 656739 654787 651461 646277 638955 629899 619965 609909 600140
61979 600140 590864 582310 574677 567861 561390 554820 548233 542273 537537 533979 531007 528140 525400 523068
61965 523068 521329 520291 520085 520653 521576 522463 523429 524804 526462 527900 529067 530637 533318 537286 542475
61950 542475 548908 556432 564549 572975 582133 592774 605429 620585 638959 660981 686133 713405
61938 713405 742434 773725 807719 844013 881606 919617 957599 995326 1032362 1067996 1101764
61927 1101764 1133894 1164705 1193451 1218357 1238131 1252791 1262513 1266404 1263319 1253488 1238377 1219297
61915 1219297 1197255 1174110 1152545 1134406 1119872 1108700 1101585 1099873 1104517 1115653 1132645 1154057
$$ packed form
62007E76759o684n373m287l237j670R36M279P112Q396Q480Q602R381J0306J0684
61993F23684J0353R338P438M674J745m93j952l326n184p322r056r934j0056r769
61979F00140r276q554p633o816o471o570o587n960m736l558k972k867k740k332
61965E23068j739j038k06N68R23Q87R66J375J658J438J167J570K681L968N189
61950E42475O433P524Q117Q426R158J0641J2655J5156J8374K2022K5152K7272
61938G13405K9029L1291L3994L6294L7593L8011L7982L7727L7036L5634L3768
61927A101764L2130L0811K8746K4906J9774J4660R722L891l085r831j5111j9080
61915A219297k2042k3145k1565j8139j4534j1172p115j712M644J1136J6992K1412
$$ plain form
61903 1154057 1178040 1203198 1228814 1253986 1276946 1295462 1307604 1312010 1308066 1296243 1277881 1254263
61891 1254263 1226154 1194362 1160112 1124526 1088151 1051400 1015019 979799 946282 915057 886760
61880 886760 861300 837643 814985 793614 773940 755258 736514 718056 701556 688025 676815
61869 676815 666869 658165 651408 646843 643978 642363 642178 644084 648703 656268 666634 679593 695202 713715
61855 713715 735323 760160 788672 821782 860474 905149 955346 1010134 1068694 1130482 1194788
61844 1194788 1260303 1325287 1388187 1447976 1503917 1555107 1600080 1636675 1662534 1676202 1677846
61833 1677846 1668609 1649527 1621744 1587778 1551632 1517102 1486511 1461466 1444019 1436060 1437863 1448193
61821 1448193 1465770 1489717 1518328 1548260 1575459 1596548 1609059 1610996 1600933 1578580 1544902
$$ packed form
61903A154057K3983K5158K5616K5172K2960J8516J2142M406l944j1823j8362k3618
61891A254263k8109l1792l4250l5586l6375l6751l6381l5220l3517l1225k8297
61880H86760k5460k3657k2658k1371j9674j8682j8744j8458j6500j3531j1210
61869F76815r946q704o757m565k865j615j85J906M619P565J0366J2959J5609J8513
61855G13715K1608K4837K8512L3110L8692M4675N0197N4788N8560O1788O4306
61844A194788O5515O4984O2900N9789N5941N1190M4973L6595K5859J3668J644
61833A677846r237j9082k7783l3966l6146l4530l0591k5045j7447p959J803J0330
61821A448193J7577K3947K8611K9932K7199K1089J2511J937j0063k2353l3678
$$ plain form
61810 1544902 1501610 1450681 1394261 1334649 1274107 1214559 1157395 1103397 1052814 1005581 961637
61799 961637 921254 885045 853515 826484 803056 782204 763373 746453 731337 717645 704841
61788 704841 692572 680913 670277 660891 652391 644098 635679 627217 618653 609710 600631 592466 586034
61775 586034 580877 575850 570624 565928 562292 559310 556436 553919 552377 551774 551375 550615 549542 548401 547278
61760 547278 546288 545719 545663 545750 545636 545619 546402 548214 550564 552967 555452 558095 560474 562115 563274 564684 566543
61743 566543 568286 569453 570235 570935 571446 571623 571712 571899 571755 570764 569329 568692 569699 572024 574810 577767 581364
61726 581364 586043 591537 597062 602122 606956 612224 618404 625663 634059 643490 653480 663469 673496 684193
61712 684193 695858 707817 719020 728968 737723 745213 751030 754935 757280 758785 760007 760996 761377 760892
$$ packed form
61810A544902m3292n0929n6420n9612o0542n9548n7164n3998n0583m7233m3944
61799I61637m0383l6209l1530k7031k3428k0852j8831j6920j5116j3692j2804
61788G04841j2269j1659j0636r386q500q293q419q462q564q943r079q165o432
61775E86034n157n027n226m696l636k982k874k517j542o03l99p60j073j141j123
61760E47278r90n69n6Q7j14j7P83J812K350K403K485K643K379J641J159J410J859
61743E66543J743J167P82P00N11J77Q9J87j44r91j435o37J007K325K786K957L597
61726E81364M679N494N525N060M834N268O180P259Q396R431R990R989J0027J0697
61712F84193J1665J1959J1203R948Q755P490N817L905K345J505J222R89L81m85
$$ plain form
61698 760892 759890 759061 758556 757682 755724 752781 749484 746063 742130 737239 731324 724670 717844 711657 706787
61683 706787 703338 700992 699499 698745 698355 697652 696184 694095 691851 689726 687595 685142 682197 678905 675555
61668 675555 672292 669188 666568 664915 664286 664142 663993 663885 663986 664112 664165 664688 666385 669214 672544 676054
61652 676054 679924 684176 688484 692697 697020 701640 706661 712356 718829 725399 731119 736045 741173 746766
61638 746766 751644 754708 756436 758044 759651 760175 758829 755873 751881 746998 741121 734316 726933 719581
61624 719581 713018 707665 703232 699209 695762 693730 693634 695102 697424 700349 704060 708613 713632 718376 721904
61609 721904 723377 722480 719582 715428 710675 705724 700802 696027 691430 686956 682397 677439 671979 666510
61595 666510 661891 658491 655691 652396 647956 642425 636176 629657 623447 618050 613379 608755 603704 598576
$$ packed form
61698G60892j002q29n05q74j958k943l297l421l933m891n915o654o826o187m870
61683G06787l449k346j493p54l90p03j468k089k244k125k131k453k945l292l350
61668F75555l263l104k620j653o29j44j49j08J01J26N3N23J697K829L330L510
61652F76054L870M252M308M213M323M620N021N695O473O570N720M926N128N593
61638G46766M878L064J728J608J607N24j346k956l992m883n877o805p383p352
61624G19581o563n353m433m023l447k032r6J468K322K925L711M553N019M744L528
61609G21904J473q97k898m154m753m951m922m775m597m474m559m958n460n469
61595F66510m619l400k800l295m440n531o249o519o210n397m671m624n051n128
$$ plain form
61581 598576 594105 590488 587160 583428 579035 574191 569405 565326 562405 560477 558874 557083 555161 553443
61567 553443 552080 551029 550219 549478 548471 547008 545307 543746 542482 541587 541313 541782 542454 542453 541539 540399 539771
61550 539771 539653 539589 539359 538992 538306 536875 534447 531152 527356 523553 520303 517911 516144 514577 513252 512692
61534 512692 513168 514264 515273 515719 515328 513887 511547 508994 506817 504734 501931 498158 493999 489925 485614
61519 485614 480572 474998 469605 464737 460157 455580 451049 446824 443253 440666 438975 437467 435447 433148
61505 433148 431489 430782 430195 428819 426822 425106 424084 423318 422236 420774 419298 418251 417933 418374 419245 420054
61489 420054 420538 420767 420876 420784 420284 419357 418393 418019 418618 420009 421642 423086 424233 425087 425549 425475 424838 423834
61471 423834 422949 422763 423390 424187 424349 423842 423345 423313 423602 424103 425109 426676 428173 428918 428935 428632 428137 427422
$$ packed form
61581E98576m471l617l328l732m393m844m786m079k921j928j603j791j922j718
61567E53443j363j051q10p41j007j463j701j561j264q95k74M69O72jr14j140o28
61550E39771j18o4k30l67o86j431k428l295l796l803l250k392j767j567j325n60
61534E12692M76J096J009M46l91j441k340k553k177k083k803l773m159m074m311
61519D85614n042n574n393m868m580m577m531m225l571k587j691j508k020k299
61505D33148j659p07n87j376j997j716j022p66j082j462j476j047l18M41Q71Q09
61489D20054M84K29J09r2n00r27r64l74N99J391J633J444J147Q54M62p4o37j004
61471D23834q85j86O27P97J62n07m97l2K89N01J006J567J497P45J7l03m95p15
$$ plain form
61453 427422 426760 426431 426244 425924 425785 426362 427431 428046 427599 426329 424798 423449 422686 422742 423261 423585 423704 424428
61435 424428 426400 429432 433142 437690 443334 449533 455133 459538 463315 467446 472129 476535 479828 482244
61421 482244 484877 488328 491989 494981 497461 500513 504843 510141 515619 520585 524442 526785 527822 528252
61407 528252 528416 527880 526063 522914 518737 513717 507984 501951 496296 491678 488485 486571 485170 483397 481065
61392 481065 478756 477060 476088 475793 476209 477045 477503 476944 475480 473585 471466 469190 467171 466020 465987 466864
61376 466864 468302 469951 471449 472574 473318 473663 473583 473439 473990 475567 477572 479229 480578 482230 484340 486453
61360 486453 488299 490190 492556 495571 499325 503909 509205 514946 521120 527932 535311 542824 550285 558093
61346 558093 566749 576347 586818 598434 611732 626934 643659 661150 678593 695215 710232 722973
$$ packed form
61453D27422o62l29j87l20j39N77J069O15m47j270j531j349p63N6N19L24J19P24
61435D24428J972L032L710M548N644O199N600M405L777M131M683M406L293K416
61421D82244K633L451L661K992K480L052M330N298N478M966L857K343J037M30
61407E28252J64n36j817l149m177n020n733o033n655m618l193j914j401j773k332
61392D81065k309j696r72k95M16Q36M58n59j464j895k119k276k019j151l3Q77
61376D66864J438J649J498J125P44L45q0j44N51J577K005J657J349J652K110K113
61360D86453J846J891K366L015L754M584N296N741O174O812P379P513P461P808
61346E58093Q656R598J0471J1616J3298J5202J6725J7491J7443J6622J5017J2741
$$ plain form
61334 722973 733193 741210 747457 751746 753184 751053 745687 738211 729486 719703 709014 698120 687939
61321 687939 678870 670710 663261 656768 651678 648049 645326 642700 639638 636049 632044 627761 623474 619641
61307 619641 616646 614559 613253 612634 612612 613022 613812 615240 617679 621307 626180 632421 639927 647930 655278
61292 655278 661233 665672 668467 669135 667389 663656 658726 653111 647146 641489 637001 634008 632010 630294
61278 630294 628704 627791 628400 631146 636022 642296 648896 655106 660926 666713 672615 678582 684881 692281 701447
61263 701447 712166 723332 733840 743486 753024 763394 774999 787777 801845 817801 836163 856681
61251 856681 878523 901107 924291 947395 968390 984624 994487 998093 996355 989805 978499 962722
61239 962722 943407 921973 899930 878545 858640 840683 825096 812297 802367 794839 789021 784430
$$ packed form
61334G22973J0220Q017O247M289J438k131n366p476q725r783j0689j0894j0181
61321F87939r069q160p449o493n090l629k723k626l062l589m005m283m287l833
61307F19641k995k087j306o19k2M10P90J428K439L628M873O241P506Q003P348
61292F55278N955M439K795O68j746l733m930n615n965n657m488k993j998j716
61278F30294j590r13O09K746M876O274O600O210N820N787N902N967O299P400R166
61263G01447J0719J1166J0508R646R538J0370J1605J2778J4068J5956J8362K0518
61251H56681K1842K2584K3184K3104K0995J6234R863L606j738o550j1306j5777
61239I62722j9315k1434k2043k1385j9905j7957j5587j2799r930p528n818m591
$$ plain form
61227 784430 780812 777873 775271 772785 770381 768212 766682 766317 767305 769233 771525 774005 776739 779478 781756
61212 781756 783589 785588 788112 790601 792100 792291 791748 791265 791189 791382 791533 791405 791026 790860 791753 794528 799484
61195 799484 806311 814521 824012 835285 849188 866467 887394 911580 938137 966264 995821 1027152
61183 1027152 1060205 1093899 1126535 1156717 1183767 1207528 1228162 1246069 1261551 1274480 1284671
61172 1284671 1292640 1299454 1305487 1309703 1310613 1307717 1301475 1292085 1279017 1261989 1241757 1219480 1195612
61159 1195612 1169919 1142408 1113717 1084615 1055626 1027330 1000539 975861 953309 932745 914515
61148 914515 899234 886973 877101 869024 862778 858720 856930 857137 858962 861886 865069 867546 868630 867991
61134 867991 865408 860779 854444 847247 840136 833789 828690 825382 824543 826896 833066 843278 857050 873404
$$ packed form
61227G84430l618k939k602k486k404k169j530l65R88J928K292K480K734K739K278
61212G81756J833J999K524K489J499J91n43m83p6J93J51j28l79j66Q93K775M956
61195G99484O827Q210R491J1273J3903J7279K0927K4186K6557K8127K9557L1331
61183A027152L3053L3694L2636L0182K7050K3761K0634J7907J5482J2929J0191
61172A284671P969O814O033M216R10k896o242r390j3068j7028k0232k2277k3868
61159A195612k5693k7511k8691k9102k8989k8296k6791k4678k2552k0564j8230
61148I14515j5281j2261r872q077o246m058j790K07J825K924L183K477J084o39
61134H67991k583m629o335p197p111o347n099l308q39K353O170J0212J3772J6354
$$ plain form
61120 873404 891641 911894 934822 960883 990064 1022193 1057087 1094323 1133173 1172942 1213309
61109 1213309 1254222 1295590 1337118 1378305 1418468 1456904 1493134 1526945 1558077 1586060 1610498
61098 1610498 1631396 1648886 1662607 1671541 1674551 1670978 1660699 1643793 1620333 1590549 1555199 1515762
61086 1515762 1474073 1431545 1388697 1345517 1302264 1259747 1218880 1180248 1144205 1111114 1081234
61075 1081234 1054498 1030624 1009411 990732 974274 959555 946318 934705 924862 916515 909138 902513
61063 902513 896868 892375 888830 886038 884282 884008 885103 887006 889575 893397 899004 906259 914855 924984
61049 924984 936958 950470 964893 980314 997656 1017691 1040345 1065081 1091551 1119723 1149705
61038 1149705 1181606 1215376 1250809 1287879 1326810 1367385 1408443 1448712 1488078 1527370 1566972
$$ packed form
61120H73404J8237K0253K2928K6061K9181L2129L4894L7236L8850L9769M0367
61109A213309M0913M1368M1528M1187M0163L8436L6230L3811L1132K7983K4438
61098A610498K0898J7490J3721Q934L010l573j0279j6906k3460k9784l5350l9437
61086A515762m1689m2528m2848m3180m3253m2517m0867l8632l6043l3091k9880
61075A081234k6736k3874k1213j8679j6458j4719j3237j1613r843q347p377o625
61063I02513n645m493l545k792j756k74J095J903K569L822N607P255Q596J0129
61049I24984J1974J3512J4423J5421J7342K0035K2654K4736K6470K8172K9982
61038A149705L1901L3770L5433L7070L8931M0575M1058M0269L9366L9292L9602
$$ plain form
61027 1566972 1606522 1646068 1686489 1728321 1770924 1813431 1855970 1899544 1945299 1994297 2047341
61016 2047341 2104392 2164551 2226953 2291185 2356724 2423169 2491923 2566989 2653366 2755084 2875038
61005 2875038 3015378 3176875 3358755 3560591 3784465 4035393 4321550 4655738 5055592
60996 5055592 5540745 6130669 6846806 7715641 8768370 10040774 11578890 13445825 15719103
60987 15719103 18475241 21761259 25544008 29637775 33658099 37082294 39440034 40534482
60979 40534482 40537488 39894006 39122533 38646805 38705859 39299536 40151461 40752880 40542235 39153468
60969 39153468 36573167 33105635 29198057 25263805 21593510 18346927 15578642 13271086
60961 13271086 11369271 9809468 8533137 7489256 6634780 5935398 5363142 4892447 4499783
$$ packed form
61027A566972L9550L9546M0421M1832M2603M2507M2539M3574M5755M8998N3044
61016B047341N7051O0159O2402O4232O5539O6445O8754P5066Q6377J01718J19954
61005B875038J40340J61497J81880K01836K23874K50928K86157L34188L99854
60996E055592M85153N89924P16137Q68835J052729J272404J538116J866935K273278
60987A5719103K756138L286018L782749M093767M020324L424195K357740J094448
60979D0534482L006o43482p71473m75728N9054N93677Q51925O01419k10645j388767
60969C9153468k580301l467532l907578l934252l670295l246583k768285k307556
60961A3271086j901815j559803j276331j043881q54476o99382n72256m70695l92664
$$ plain form
60952 4499783 4166246 3878071 3624697 3398078 3193487 3008576 2841015 2688151 2548635
60943 2548635 2422481 2309205 2207232 2115140 2031749 1954514 1879349 1802851 1724018 1643694 1563467
60932 1563467 1485399 1411567 1343027 1279728 1221602 1168976 1121775 1079259 1040809 1006139 974530
60921 974530 944799 916460 890125 866428 845257 826285 809381 794146 779926 766785 755685
60910 755685 747145 740380 734376 729245 725866 724580 724764 725432 725853 725824 725614 725457 725002 723621 721263 718513
60894 718513 715707 712595 708984 705023 700556 694973 688191 681231 675271 670563 666776 663944 662446 662255
60880 662255 662726 663095 662850 661748 659824 657295 654231 650365 645334 639003 631475 622975 613834 604449 595172
60865 595172 586300 578091 570610 563759 557704 553049 550124 548301 546577 544804 543801 544305 546392 549886
$$ packed form
60952D499783l33537k88175k53374k26619k04591j84911j67561j52864j39516
60943B548635j26154j13276j01973r2092q3391p7235p5165p6498p8833q0324q0227
60932A563467p8068p3832o8540o3299n8126n2626m7201m2516l8450l4670l1609
60921I74530k9731k8339k6335k3697k1171j8972j6904j5235j4220j3141j1100
60910G55685q540o765o004n131l379j286J84O68M21k9k10j57m55j381k358k750
60894G18513k806l112l611l961m467n583o782o960n960m708l787k832j498j91
60880F62255M71L69k45j102j924k529l064l866n031o331p528q500r141r385r277
60865E95172q872q209p481o851o055m655k925j823j724j773j003N04K087L494
$$ plain form
60851 549886 554690 560553 567053 573843 580411 585733 588986 590809 593066 597107 602884 609892 617996 626776
60837 626776 634848 640635 643573 644224 643644 642949 642933 643509 643827 643327 642374 641612 641167 640860 640701 640753 640881 641067
60819 641067 641648 642838 644283 645388 645770 645179 643380 640436 636704 632207 626381 618713 609251 598328 586344
60804 586344 574079 562518 551903 541533 531017 521106 512736 505788 499501 493602 488279 483435 478818
60791 478818 474660 471416 468929 466575 464176 462175 460961 460538 460786 461455 461916 461456 459958 457949 456004
60776 456004 454433 453496 453513 454709 457141 460622 464575 468279 471720 475912 481848 489259 496889 504008 511199
60761 511199 519666 530087 542131 554684 566499 576975 586444 595593 604616 613072 620461 626738 632232
60748 632232 637110 640997 643349 644437 645616 648015 651035 652866 652536 650626 647808 643728 637913 630776
$$ packed form
60851E49886M804N863O500O790O568N322L253J823K257M041N777P008Q104Q780
60837F26776Q072N787K938O51n80o95j6N76L18n00r53p62m45l07j59N2J28J86
60819F41067N81J190J445J105L82n91j799k944l732m497n826p668r462j0923j1984
60804E86344j2265j1561j0615j0370j0516r911q370o948o287n899n323m844m617
60791D78818m158l244k487k354k399k001j214m23K48O69M61m60j498k009j945
60776D56004j571r37J7J196K432L481L953L704L441M192N936P411P630P119P191
60761E11199Q467J0421J2044J2553J1815J0476R469R149R023Q456P389O277N494
60748F32232M878L887K352J088J179K399L020J831l30j910k818m080n815p137
$$ plain form
60734 630776 622856 613830 603342 592242 581845 572242 562414 551949 541571 531976 523108 514818 507338
60721 507338 500799 494915 489428 484405 479937 476081 473097 471195 469937 468561 467100 466518 467454 469385 471448
60706 471448 473675 476905 481664 487539 493682 499787 506467 514600 524311 534794 545249 555600 566027
60693 566027 576167 585363 593487 600896 607606 613102 616950 619088 619506 618192 615516 612155 608540 604764
60679 604764 601117 598266 596778 596919 598915 602914 608553 615150 622628 631834 643620 657924 674013 691405
60665 691405 710321 731450 755451 782518 812241 844025 877639 913155 950346 988362 1026001
60654 1026001 1061929 1094612 1122413 1143963 1158310 1164755 1162941 1153274 1136949 1115327 1089321 1059438
60642 1059438 1026276 990909 954894 919779 886423 854828 824767 796461 770465 747224 727069
$$ packed form
60734F30776p920r026j0488j1100j0397r603r828j0465j0378r595q868q290p480
60721E07338o539n884n487n023m468l856k984j902j258j376j461n82R36J931K063
60706D71448K227L230M759N875O143O105O680Q133R711J0483J0455J0351J0427
60693E66027J0140R196Q124P409O710N496L848K138M18j314k676l361l615l776
60679F04764l647k851j488J41J996L999N639O597P478R206J1786J4304J6089J7392
60665F91405J8916K1129K4001K7067K9723L1784L3614L5516L7191L8016L7639
60654A026001L5928L2683K7801K1550J4347O445j814r667j6325k1622k6006k9883
60642A059438l3162l5367l6015l5115l3356l1595l0061k8306k5996k3241k0155
$$ plain form
60631 727069 710375 697185 686752 677985 670400 664283 660041 657885 658038 660538 664647 668992 672590 675410
60617 675410 677820 679885 681375 682066 681795 680461 678117 674823 670383 664580 657677 650294 642640 634311 625033
60602 625033 615263 605838 597270 589516 582127 574542 566513 558402 550814 543897 537270 530624 524007 517583
60588 517583 511579 506563 503226 501627 501033 500706 500498 500558 500915 501558 502529 503694 504774 505817 507232 509179
60572 509179 511370 513784 517059 521752 527546 533718 540174 547657 557037 568776 582939 599368 617930
60559 617930 638768 662154 687756 714138 739220 761176 778769 791135 797641 798080 792887 783199
60547 783199 770745 757494 745142 734913 727752 724393 725137 729816 738153 750037 765367 783918 805405
60534 805405 829189 853625 876042 893906 905949 911924 911581 904588 891645 875147 858176 842689
$$ packed form
60631G27069j6694j3190j0433q767p585o117m242k156J53K500M109M345L598K820
60617F75410K410K065J490O91k71j334k344l294m440n803o903p383p654q329r278
60602F25033r770r425q568p754p389p585q029q111p588o917o627o646o617o424
60588E17583o004n016l337j599n94l27k08O0L57O43R71J165J080J043J415J947
60572E09179K191K414L275M693N794O172O456P483R380J1739J4163J6429J8562
60559F17930K0838K3386K5602K6382K5082K1956J7593J2366O506M39n193r688
60547G83199j2454j3251j2352j0229p161l359P44M679Q337J1884J5330J8551K1487
60534H05405K3784K4436K2417J7864J2043N975l43o993j2943j6498j6971j5487
$$ plain form
60522 842689 828899 816512 806270 799869 798251 800388 804150 808115 812150 816487 821004 825593 830563
60509 830563 836314 842997 850897 860728 872996 887222 902220 917123 931812 946526 961644 978110
60497 978110 997738 1022713 1054752 1094821 1143588 1201840 1270215 1348487 1435236 1528046 1623519
60486 1623519 1716787 1801363 1870187 1917211 1938259 1931163 1896113 1836090 1756271 1662395 1559653
60475 1559653 1453000 1347743 1249012 1160437 1083358 1017132 960085 910445 866888 828575 795001
60464 795001 765948 741325 720684 702902 686738 671682 657870 645225 633257 621886 611801
60453 611801 603558 596714 590354 584206 578717 574117 569914 565434 560597 556001 552349 549820 547987 546234
60439 546234 544190 541742 538933 536090 533874 532710 532143 531246 529755 528361 527679 527438 527027 526480 526333 526634
$$ packed form
60522H42689j3790j2387j0242o401j618K137L762L965M035M337M517M589M970
60509H30563N751O683P900R831J2268J4226J4998J4903J4689J4714J5118J6466
60497I78110J9628K4975L2039M0069M8767N8252O8375P8272Q6749R2810R5473
60486A623519R3268Q4576O8824M7024K1048p096l5050o0023p9819r3876j02742
60475A559653j06653j05257r8731q8575p7079o6226n7047m9640m3557l8313l3574
60464G95001k9053k4623k0641j7782j6164j5056j3812j2645j1968j1371j0085
60453F11801q243o844o360o148n489m600m203m480m837m596l652k529j833j753
60439E46234k044k448k809k843k216j164n67q97j491j394o82k41m11n47j47L01
$$ plain form
60423 526634 526594 525376 523041 520615 519249 519353 520438 521759 522970 524140 525354 526509 527397 527742 527310 526257
60407 526257 525222 524672 524331 523713 523085 523201 524123 525052 525571 526293 527772 529372 529870 528938 527486 526668 526950
60390 526950 528027 529285 530376 531515 533164 535364 537638 539662 541682 544066 546709 549120 550817 551491
60376 551491 551150 550355 550027 550654 551916 553295 554734 556382 558021 559213 559903 560582 561877 564155 567374 571146
60360 571146 575091 579234 583832 588751 593313 596873 599222 600363 600388 599811 599464 599686 599970 599725 599035 598337
60344 598337 597894 597976 599102 601491 604631 607971 611731 616387 621624 626471 630360 633351 635359 636002 635425
60329 635425 634609 634415 634625 634343 633187 631827 631276 631857 632963 633812 634178 634207 633734 632368 630379 628947 629181
60312 629181 631200 634471 638661 643695 649270 654926 660694 667341 675876 686920 700527 716543 735278
$$ packed form
60423E26634m0j218k335k426j366J04J085J321J211J170J214J155Q88L45m32j053
60407E26257j035n50l41o18o28J16R22R29N19P22J479J600M98r32j452q18K82
60390E26950J077J258J091J139J649K200K274K024K020K384K643K411J697O74
60376E51491l41p95l28O27J262J379J439J648J639J192O90O79J295K278L219L772
60360E71146L945M143M598M919M562L560K349J141K5n77l47K22K84k45o90o98
60344E98337m43Q2J126K389L140L340L760M656N237M847L889K991K008O43n77
60329F35425q16j94K10k82j156j360n51N81J106Q49L66K9m73j366j989j432K34
60312F29181K019L271M190N034N575N656N768O647Q535J1044J3607J6016J8735
$$ plain form
60299 735278 757897 785915 820081 859704 902701 945818 984950 1016187 1037055 1046423 1043223 1026339
60287 1026339 996503 957700 915755 875518 839576 808865 783423 762622 745555 731489 719737
60276 719737 709394 699736 690719 682556 674996 667601 660553 654592 650171 647138 645086 643467 641565 638976
60262 638976 636132 633867 632488 631726 631415 631629 632256 633052 634112 635684 637567 639233 640537 641672 642413 642070
60246 642070 640394 637966 635396 632632 629357 625788 622780 621174 621036 621431 621185 620132 619390 620031 621789
60231 621789 623597 625118 627028 629877 633445 637303 641306 645249 648632 651129 652931 654424 655803 657127
60217 657127 658431 659694 660947 662399 664124 665695 666533 666719 667102 668528 671165 674476 677589 679885 681607
60202 681607 683639 686308 688707 689782 689707 689471 689403 689039 688296 687695 687299 686443 684825 682995 681427 679932 678382
$$ packed form
60299G35278K2619K8018L4166L9623M2997M3117L9132L1237K0868R368l200j6884
60287A026339k9836l8803m1945m0237l5942l0711k5442k0801j7067j4066j1752
60276G19737j0343r658r017q163p560p395p048n961m421l033k052j619j902k589
60262F38976k844k265j379p62l11K14O27P96J060J572J883J666J304J135P41l43
60246F42070j676k428k570k764l275l569l008j606j38L95k46j053p42O41J758
60231F21789J808J521J910K849L568L858M003L943L383K497J802J493J379J324
60217F57127J304J263J253J452J725J571Q38J86L83J426K637L311L113K296J722
60202F81607K032K669K399J075p5k36o8l64p43o01l96q56j618j830j568j495j550
$$ plain form
60185 678382 677138 676248 674958 672648 669708 666923 664517 662348 660536 659319 658648 658429 658713 659206 659112 658176
60169 658176 657441 658179 660301 662549 664116 665295 666484 667333 667297 666606 666308 667338 669690 672502 674948 677031
60153 677031 679393 682431 685937 689659 693802 698614 703778 708641 712902 716718 720231 723438 726563 730167
60139 730167 734706 740203 746488 753617 761831 771160 781307 792090 803842 817098 831739 846565 859838
60126 859838 870074 876261 877635 873705 864585 851165 835022 818246 802983 790592 781174 774071 768790
60113 768790 765246 763379 762965 763688 764995 766010 766066 765339 764475 763622 762246 759888 756658 752917 748938 744935
60097 744935 741033 737196 733569 730898 730127 731507 734544 738755 744023 750228 757196 765154 774653 785883
60083 785883 798482 812104 826584 841528 856344 870747 884415 896028 903529 905828 903581 897859
$$ packed form
60185F78382j244q90j290k310k940k785k406k169j812j217o71k19K84M93r4r36
60169F58176p35P38K122K248J567J179J189Q49l6o91k98J030K352K812K446K083
60153F77031K362L038L506L722M143M812N164M863M261L816L513L207L125L604
60139G30167M539N497O285P129Q214R329J0147J0783J1752J3256J4641J4826J3273
60126H59838J0236O187J374l930r120j3420j6143j6776j5263j2391r418p103n281
60113G68790l544j867m14P23J307J015N6p27q64q53j376k358l230l741l979m003
60097G44935l902l837l627k671p71J380L037M211N268O205O968P958R499J1230
60083G85883J2599J3622J4480J4944J4816J4403J3668J1613P501K299k247n722
$$ plain form
60071 897859 888773 875941 859696 841177 821666 802393 784622 769253 756490 746182 738115 731697
60059 731697 725931 720258 715015 710486 705898 700046 692649 684507 676488 668932 661945 655698 650363 646045
60045 646045 642739 640175 637942 635973 634648 634158 634133 634213 634654 635969 638254 641218 644491 647560 649789 650991
60029 650991 651667 652242 652413 651708 650207 648174 645381 641466 636582 630922 623936 614944 604428 593863 584208
60014 584208 575348 567087 559815 553842 548825 544258 540115 536636 533865 531701 530109 529039 528378 528215 528933
59999 528933 530785 533534 536584 539388 541768 544057 546873 550478 554406 558056 561590 565788 570905 576150
59985 576150 580562 584030 587125 590184 593013 595430 597700 600174 602639 604237 604176 602502 600017 597455 594891
59970 594891 592088 589126 586422 584201 582218 580030 577387 574408 571541 569317 567904 566947 566013 565195 565096
$$ packed form
60071H97859r086j2832j6245j8519j9511j9273j7771j5369j2763j0308q067o418
60059G31697n766n673n243m529m588n852p397q142q019p556o987o247n335m318
60045F46045l306k564k233j969j325m90k5Q0M41J315K285K964L273L069K229J202
60029F50991O76N75J71p05j501k033k793l915m884n660o986q992j0516j0565r655
60014E84208q860q261p272n973n017m567m143l479k771k164j592j070o61j63P18
59999E28933J852K749L050K804K380K289K816L605L928L650L534M198N117N245
59985E76150M412L468L095L059K829K417K270K474K465J598o1j674k485k562k564
59970E94891k803k962k704k221j983k188k643k979k867k224j413r57r34q18r9
$$ plain form
59955 565096 566238 568684 572098 575891 579287 581660 583045 584067 585116 585753 585240 583580 581713 580620 580471
59940 580471 580764 580988 580844 580020 578239 575654 572843 570248 567857 565593 563645 562176 560986 559849 558984
59925 558984 558831 559465 560531 561647 562558 563132 563545 564293 565663 567418 569387 571977 575455 579077 581789 583679
59909 583679 585832 588687 591500 593626 595384 597274 599216 601056 603077 605380 607337 608295 608427 608408 608712
59894 608712 609685 611811 615339 619933 625077 630480 635847 640841 645735 651495 658621 666325 673388 679385
59880 679385 684566 689079 693024 696837 700922 705196 709511 714091 718867 722856 725010 725386 724699 722992 719623
59865 719623 714392 707897 700807 693536 686560 680389 675216 671171 668716 668154 668856 669759 670553 671663 673167
59850 673167 674570 675678 676898 678523 680508 683177 687375 693516 700973 708812 716814 725580 736006 748756
$$ packed form
59955E65096J142K446L414L793L396K373J385J022J049O37n13j660j867j093j49
59940E80471K93K24j44q24j781k585k811k595k391k264j948j469j190j137q65
59925E58984j53O34J066J116R11N74M13P48J370J755J969K590L478L622K712J890
59909E83679K153K855K813K126J758J890J942J840K021K303J957R58J32j9L04
59894F08712R73K126L528M594N144N403N367M994M894N760P126P704P063N997
59880F79385N181M513L945L813M085M274M315M580M776L989K154L76o87j707l369
59865G19623n231o495p090p271o976o171n173m045k455n62P02R03P94J110J504
59850F73167J403J108J220J625J985K669M198O141P457P839Q002Q766J0426J2750
$$ plain form
59836 748756 763855 780513 797454 813434 827280 837789 844236 847135 848178 849346 852229 857679 865241
59823 865241 872794 877339 876456 868908 854295 833049 806955 778932 751742 726975 705131 686166
59811 686166 669843 656062 645065 636965 631050 626026 621202 617079 614586 613963 614520 615238 615463 615155 614561
59796 614561 613689 612298 610411 608370 606137 603015 598542 593318 588416 584393 581335 579341 578094 576392
59782 576392 573157 568859 564995 562246 560089 558118 556645 555749 554861 553733 552909 552737 552728 552409 552138 552462 553240
59765 553240 553958 554508 555081 555655 556092 556515 557165 558032 558893 559578 560074 560602 561681 563755 566633 569575 572034
59748 572034 574070 575990 578001 580226 582715 585360 588138 591330 595060 598706 601324 602616 602987 602813 602396
59733 602396 602457 603707 605787 607509 608383 609068 610083 611016 611416 611555 611684 611285 609721 607074 603846 600420
$$ packed form
59836G48756J5099J6658J6941J5980J3846J0509O447K899J043J168K883N450P562
59823H65241P553M545q83p548j4613k1246k6094k8023k7190k4767k1844j8965
59811F86166j6323j3781j0997q100n915n024m824m123k493o23N57P18K25l08n94
59796F14561q72j391j887k041k233l122m473n224m902m023l058j994j247j702
59782E76392l235m298l864k749k157j971j473q96q88j128q24j72rl19k71L24P78
59765E53240P18N50N73N74M37M23O50Q67Q61O85M96N28J079K074K878K942K459
59748E72034K036J920K011K225K489K645K778L192L730L646K618J292L71j74m17
59733F02396O1J250K080J722Q74O85J015R33M00J39J29l99j564k647l228l426
$$ plain form
59717 600420 597355 595524 595177 595343 594834 593589 592420 591791 591472 591151 590819 590675 591001 591918 592996 593449 593058
59700 593058 592507 592414 592467 591991 591006 590200 590101 590786 592147 594010 596091 598126 599892 600967 600873 599690 598143
59683 598143 596823 595840 595498 596620 599593 603582 607348 610453 613100 615209 616423 616774 616606 615862 614026
59668 614026 610766 606210 600723 594859 589383 584798 580895 577158 573612 570895 569535 569397 569806 570014 569790
59653 569790 569741 570841 573472 577228 581789 587412 594125 600993 606791 611092 614103 615707 615357 612871 608764
59638 608764 603814 598670 593842 589672 586319 583896 582478 581813 581383 581023 581073 581696 582537 583401 584652 586407
59622 586407 588001 588977 590067 592282 595364 598054 599655 600382 600343 599220 597023 594287 591400 588581 586536
59607 586536 586238 587782 590299 593268 597017 601563 605910 609129 611398 613182 613988 612957 610465 608122 606980
$$ packed form
59717F00420l065j831l47J66n09j245j169o29l19l21l32j44L26R17J078M53l91
59700E93058n51r3N3m76r85q06r9O85J361J863K081K035J766J075r4j183j547
59683E98143j320r83l42J122K973L989L766L105K647K109J214L51j68p44j836
59668F14026l260m556n487n864n476m585l903l737l546k717j360j38M09K08k24
59653E69790m9J100K631L756M561N623O713O868N798M301L011J604l50k486m107
59638F08764m950n144m828m170l353k423j418o65m30l60N0O23Q41Q64J251J755
59622E86407J594R76J090K215L082K690J601P27l9j123k197k736k887k819k045
59607E86536k98J544K517K969L749M546M347L219K269J784Q06j031k492k343j142
$$ plain form
59592 606980 606455 605343 603393 601405 600063 599263 598661 598450 599245 601261 603870 605976 606689 605702 603285 599987
59576 599987 596138 591581 586075 579914 573813 568159 562759 557418 552339 547763 543728 540441 538381 537622
59562 537622 537496 537418 537624 538582 540052 541372 542407 543522 544801 546017 547307 549161 551661 554272 556542
59547 556542 558463 560119 561516 562961 565061 568077 571645 575415 579717 585444 593483 604387 618403 635714
59533 635714 656517 680389 705038 725997 738590 740927 735048 725226 715467 708343 705189 706470 711915
59520 711915 720712 731890 744625 758357 772653 786869 800001 810977 819024 823607 824239 820772 813819
59507 813819 804484 793492 780877 766658 751561 736832 723427 711498 700569 690065 679699 669486
59495 669486 659566 650139 641474 633690 626565 619830 613770 609095 605979 603544 600669 597144 593777 591589
$$ packed form
59592F06980n25j112j950j988j342q00o02k11P95K016K609K106P13r87k417l298
59576E99987l849m557n506o161o101n654n400n341n079m576m035l287k060p59
59562E37622j26p8K06R58J470J320J035J115J279J216J290J854K500K611K270
59547E56542J921J656J397J445K100L016L568L770M302N727Q039J0904J4016J7311
59533F35714K0803K3872K4649K0959J2593K337n879r822r759p124l154J281N445
59520G11915Q797J1178J2735J3732J4296J4216J3132J0976Q047M583O32l467o953
59507H13819r335j0992j2615j4219j5097j4729j3405j1929j0929j0504j0366j0213
59495F69486r920r427q665p784p125o735o060m675l116k435k875l525l367k188
$$ plain form
59481 591589 591150 592383 594563 596705 598422 600306 603126 606850 610903 615140 619941 625367 630791 635460
59467 635460 639007 641328 642433 642606 642368 642151 642251 643158 645580 649990 656337 664317 673830 685218 699161
59452 699161 716110 735604 756395 777635 799714 823419 848410 873159 896337 917487 936002
59441 936002 950009 956923 955086 944727 927589 905854 881353 855422 829272 804237 781592 762187
59429 762187 746272 733476 722933 713809 706050 700446 697686 697667 700002 704835 712685 723724 737769
59416 737769 754811 774983 798113 823840 852107 883086 916702 952615 990045 1026484 1056617
59405 1056617 1073976 1074781 1060221 1035082 1004813 973873 945554 922104 904959 895136 892738 895236
59393 895236 896660 889871 870700 840196 803116 764667 728520 696825 670731 650278 634303 621241
$$ packed form
59481E91589m39J233K180K142J717J884K820L724M053M237M801N426N424M669
59467F35460L547K321J105J73k38k17J00R07K422M410O347P980R513J1388J3943
59452F99161J6949J9494K0791K1240K2079K3705K4991K4749K3178K1150J8515
59441I36002J4007O914j837j0359j7138k1735k4501k5931k6150k5035k2645j9405
59429G62187j5915j2796j0543r124p759n604k760j9K335M833P850J1039J4045
59416G37769J7042K0172K3130K5727K8267L0979L3616L5913L7430L6439L0133
59405A056617J7359Q05j4560k5139l0269l0940k8319k3450j7145r823k398K498
59393H95236J424o789j9171l0504l7080l8449l6147l1695k6094k0453j5975j3062
$$ plain form
59381 621241 610261 601330 594236 588164 582474 577411 573566 571036 569537 568936 569059 569287 569057 568644 568819
59366 568819 569822 571327 573268 575895 578929 581474 583032 584015 585124 586783 589298 592844 597100 601584
59352 601584 606697 613776 623804 636641 651849 669566 690024 712822 737284 763145 790383 818773
59340 818773 848051 878076 908311 937586 964879 989828 1011822 1029151 1040027 1044196 1042643 1035896
59328 1035896 1023618 1005911 983927 958811 930969 901049 870891 842667 817287 794281 773063
59317 773063 753673 736275 720639 706434 693719 682814 673862 666763 661371 657520 654881 653047 651852
59304 651852 651474 652149 653815 656070 658414 660502 662304 664180 666788 670802 676562 683936 692549 702209 713181
59289 713181 726046 741361 759594 781378 807557 838711 874509 913176 950944 981967 999897
$$ packed form
59381F21241j0980q931p094o072n690n063l845k530j499o01J23K28k30m13J75
59366E68819J003J505J941K627L034K545J558R83J109J659K515L546M256M484
59352F01584N113P079J0028J2837J5208J7717K0458K2798K4462K5861K7238K8390
59340H18773K9278L0025L0235K9275K7293K4949K1994J7329J0876M169j553o747
59328A035896j2278j7707k1984k5116k7842k9920l0158k8224k5380k3006k1218
59317G73063j9390j7398j5636j4205j2715j0905q952p099n392l851k639j834j195
59304F51852l78O75J666K255K344K088J802J876K608M014N760P374Q613R660J0972
59289G13181J2865J5315J8233K1784K6179L1154L5798L8667L7768L1023J7930
$$ plain form
59278 999897 1001128 987146 963485 936344 910271 888145 871712 861443 856801 857435 863682 875482
59266 875482 891494 909955 929873 950688 971192 989612 1004559 1015229 1020960 1021311 1016433 1006706
59254 1006706 992170 972975 950229 925708 900741 876004 852174 830066 810095 792373 777401
59243 777401 765983 758282 753477 750494 748704 748037 748987 752468 759045 768230 779066 791331 805473 821328
59229 821328 837544 852467 865039 874742 881264 884454 884221 880387 872981 862549 849648 834246 816282
59216 816282 796640 776769 757431 738742 721366 706447 694067 682869 671784 661238 652057 644040
59204 644040 636447 629287 623244 618607 614965 611748 608568 605177 601642 598470 596206 594942 594474 594837 596382
59189 596382 599293 603139 606952 609969 612412 615333 619475 624539 629884 635436 641371 647374 653073 658921
$$ packed form
59278I99897J231j3982k3661k7141k6073k2126j6433j0269m642O34O247J1800
59266H75482J6012J8461J9918K0815K0504J8420J4947J0670N731L51m878r727
59254A006706j4536j9195k2746k4521k4967k4737k3830k2108j9971j7722j4972
59243G77401j1418p701m805k983j790o67R50L481O577R185J0836J2265J4142J5855
59229H21328J6216J4923J2572R703O522L190k33l834p406j0432j2901j5402j7964
59216H16282j9642j9871j9338j8689j7376j4919j2380j1198j1085j0546r181q017
59204F44040p593p160o043m637l642l217l180l391l535l172k264j264m68L63J545
59189E96382K911L846L813L017K443K921M142N064N345N552N935O003N699N848
$$ plain form
59175 658921 665610 672734 679065 684254 689259 695057 702041 710826 722314 736361 751539 766989 783611
59162 783611 802621 823629 844946 865153 883607 899913 913725 924824 932913 937627 939034 937575
59150 937575 933197 925194 913403 898905 883025 866279 848936 831989 816747 803750 792622 782634
59138 782634 773031 763344 753979 746068 740228 735878 732115 728650 725534 722737 720677 720380 722255 725239
59124 725239 727976 730396 733415 737606 743070 750236 759757 771654 785201 799634 814584 830094 846616
59111 846616 864578 883504 902104 919663 936695 953610 969545 983346 995030 1005273 1014073 1021006
59099 1021006 1026324 1030582 1033405 1033762 1031410 1027060 1021339 1014598 1007612 1001307 995691 990104 984656 980429
59085 980429 977949 976321 974216 971002 966585 960674 952601 941668 927751 911886 895954 881200 867274
$$ packed form
59175F58921O689P124O331N189N005N798O984Q785J1488J4047J5178J5450J6622
59162G83611J9010K1008K1317K0207J8454J6306J3812J1099Q089M714J407j459
59150I37575m378q003j1791j4498j5880j6746j7343j6947j5242j2997j1128r988
59138G82634r603r687r365p911n840m350l763l465l116k797k060k97J875K984
59124G25239K737K420L019M191N464P166R521J1897J3547J4433J4950J5510J6522
59111H46616J7962J8926J8600J7559J7032J6915J5935J3801J1684J0243Q800O933
59099A021006N318M258K823L57k352m350n721o741o986o305n616n587n448m227
59085I80429k480j628k105l214m417n911q073j0933j3917j5865j5932j4754j3926
$$ plain form
59072 867274 853295 839443 826615 814882 803487 792445 782940 775811 770556 766167 762118 758187 754226
59059 754226 750678 748573 748311 748851 748667 747171 744737 741762 738277 734296 729964 725335 720394 715404 710963
59044 710963 707500 704784 702170 699477 697495 697278 698937 701514 704122 706773 709861 713387 717125 721084
59030 721084 725246 729178 732571 735954 740307 746140 753427 762281 773020 785642 799791 815194 831721
59017 831721 849010 866471 883529 899469 913165 923472 929821 932192 930804 926328 920157 913822 908180
59004 908180 903528 900255 898877 899652 902708 908318 916521 926699 938076 950332 963101 975238 985453
58991 985453 993591 1000525 1006856 1012375 1016671 1019385 1019833 1017109 1010766 1000919 987707 971276 952350 932297
58977 932297 912526 894177 878152 864881 854197 845980 840677 838555 838779 840140 842617 847302 854786
$$ packed form
59072H67274j3979j3852j2828j1733j1395j1042r505p129n255m389m049l931l961
59059G54226l548k105k62N40j84j496k434k975l485l981m332m629m941m990m441
59044G10963l463k716k614k693j982k17J659K577K608K651L088L526L738L959
59030G21084M162L932L393L383M353N833P287Q854J0739J2622J4149J5403J6527
59017H31721J7289J7461J7058J5940J3696J0307O349K371j388m476o171o335n642
59004I08180m652l273j378P75L056N610Q203J0178J1377J2256J2769J2137J0215
58991I85453Q138O934O331N519M296K714M48k724o343r847j3212j6431j8926k0053
58977I32297j9771j8349j6025j3271j0684q217n303k122K24J361K477M685P484
$$ plain form
58964 854786 864487 875748 888777 904205 922274 942537 963836 984472 1003010 1018921 1031990 1041255
58952 1041255 1045215 1043031 1034841 1021078 1002346 980076 956368 932958 910837 890816 873630 859377
58940 859377 847650 838429 832200 829071 828405 829319 830857 831715 830683 827532 822710 816131 807191 796152
58926 796152 784473 773338 762675 752033 741631 732039 723495 716072 709996 705344 701805 699088 697183
58913 697183 696022 695334 695060 695532 697060 699720 703604 708851 715403 723180 732445 743506 756171 770030
58899 770030 785063 801266 817941 834238 850253 866607 883083 898784 913786 929559 947622
58888 947622 968883 994396 1025418 1062135 1103314 1147645 1194286 1241551 1286234 1325213 1357048
58877 1357048 1381448 1398054 1406532 1407131 1400230 1385720 1363408 1333660 1297305 1255617 1210935 1166531
$$ packed form
58964H54786R701J1261J3029J5428J8069K0263K1299K0636J8538J5911J3069R265
58952A041255L960k184q190j3763j8732k2270k3708k3410k2121k0021j7186j4253
58940H59377j1727r221o229l129o66R14J538Q58j032l151m822o579q940j1039
58926G96152j1679j1135j0663j0642j0402r592q544p423o076m652l539k717j905
58913F97183j161o88k74M72J528K660L884N247O552P777R265J1061J2665J3859
58899G70030J5033J6203J6675J6297J6015J6354J6476J5701J5002J5773J8063
58888I47622K1261K5513L1022L6717M1179M4331M6641M7265M4683L8979L1835
58877A357048K4400J6606Q478N99o901j4510k2312k9748l6355m1688m4682m4404
$$ plain form
58865 1166531 1125054 1087378 1053402 1023394 997879 976620 958342 941334 924061 905680 886433
58854 886433 867268 848796 830847 813052 795391 778124 761819 747436 735662 726031 717479 709822
58842 709822 703763 699331 695498 691637 688168 685226 681876 677432 672565 668227 664293 660046 655274 650170
58828 650170 644934 640212 637075 635684 634675 632742 630255 628510 628090 628798 630461 632771 634904 636321 637571
58813 637571 639407 641651 643836 646414 650123 654383 657445 658189 657030 655169 653643 652895 652470 651232 648568
58798 648568 645315 642911 641854 641498 641103 640419 639474 638515 638050 638338 638941 639306 639715 641145 644328 649351 655973
58781 655973 663839 672484 681453 690325 698446 705067 710002 713794 716928 719360 720992 721956 721958 720108 716076
58766 716076 710915 706134 702432 699846 698426 698008 697844 697326 696745 696676 697044 697553 698605 700988 704910 710016
$$ packed form
58865A166531m1477l7676l3976l0008k5515k1259j8278j7008j7273j8381j9247
58854H86433j9165j8472j7949j7795j7661j7267j6305j4383j1774r631q552p657
58842G09822o059m432l833l861l469k942l350m444m867m338l934m247m772n104
58828F50170n236m722l137j391j009j933k487j745m20P08J663K310K133J417J250
58813F37571J836K244K185K578L709M260L062P44j159j861j526p48m25j238k664
58798F48568l253k404j057l56l95o84r45r59m65K88O03L65M09J430L183N023O622
58781F55973P866Q645Q969Q872Q121O621M935L792L134K432J632R64Kj850m032
58766G16076n161m781l702k586j420m18j64n18n81o9L68N09J052K383L922N106
$$ plain form
58750 710016 716090 723049 730484 737801 744645 750745 755821 760224 765166 771668 779628 788444 797944 807974
58736 807974 817691 826314 834215 842404 851188 860273 869899 880891 893580 907430 921733 936017 949849
58723 949849 962842 974812 985505 994396 1001306 1006934 1012248 1017642 1023171 1029247 1036404 1044711 1053986
58710 1053986 1064208 1075067 1085373 1093577 1098624 1099898 1096899 1089690 1079197 1066283 1050813 1032249
58698 1032249 1010673 986565 960156 931918 903230 875518 849042 823457 799244 777622 759201
58687 759201 743705 730880 720741 712869 706230 699761 692662 684400 675052 665432 656292 647682 639595
58674 639595 632635 627247 622818 618507 614592 612059 611216 611775 614008 618743 626275 636148 647934 661387
58660 661387 675895 690528 704464 716752 726103 731869 734897 736544 737110 736107 733629 730306 726129
$$ packed form
58750G10016O074O959P435P317O844O100N076M403M942O502P960Q816R500J0030
58736H07974R717Q623P901Q189Q784R085R626J0992J2689J3850J4303J4284J3832
58723I49849J2993J1970J0693Q891O910N628N314N394N529O076P157Q307R275
58710A053986J0222J0859J0306Q204N047J274k999p209j0493j2914j5470j8564
58698A032249k1576k4108k6409k8238k8688k7712k6476k5585k4213k1622j8421
58687G59201j5496j2825j0139p872o639o469p099q262r348r620r140q610q087
58674F39595o960n388m429m311l915k533q43N59K233M735P532R873J1786J3453
58660F61387J4508J4633J3936J2288R351N766L028J647N66j003k478l323m177
$$ plain form
58647 726129 720535 713639 706416 699648 693542 688298 684159 680997 678674 677619 678279 680257 682865 686205
58633 686205 690745 696115 701372 706155 710552 714033 715612 714924 712171 707339 700587 693139 686579 681422
58619 681422 677488 675350 676096 679920 686385 696005 710131 729184 752280 778475 806863 835378 861161
58606 861161 882619 899898 913105 921409 924272 922276 916336 907245 896326 885262 874787 864540
58594 864540 854493 845284 836849 828099 818576 809307 801511 795546 791683 790756 793297 798919 807176 818155
58580 818155 831646 846553 861713 876562 890490 902352 911254 917319 921208 923442 924513 925106 925911
58567 925911 927622 931213 937642 947343 960507 977573 998573 1022214 1046640 1070991 1095216 1118619
58555 1118619 1139825 1158007 1172789 1183136 1187973 1188017 1185307 1180582 1172734 1161189 1147098 1131610 1114711
$$ packed form
58647G26129n594o896p223o768o106n244m139l162k323j055O60J978K608L340
58633F86205M540N370N257M783M397L481J579o88k753m832o752p448o560n157
58619F81422l934k138P46L824O465R620J4126J9053K3096K6195K8388K8515K5783
58606H61161K1458J7279J3207Q304K863j996n940r091j0919j1064j0475j0247
58594H64540j0047r209q435q750r523r269p796n965l863r27K541N622Q257J0979
58580H18155J3491J4907J5160J4849J3928J1862Q902O065L889K234J071N93Q05
58567I25911J711L591O429R701J3164J7066K1000K3641K4426K4351K4225K3403
58555A118619K1206J8182J4782J0347M837M4k710m725p848j1545j4091j5488j6899
$$ plain form
58542 1114711 1096642 1078827 1062227 1046071 1029337 1012353 995881 979645 962937 945934 929372
58531 929372 913642 899129 886764 877248 870146 864453 859696 856018 853708 853191 854924 858912 864723 872106
58517 872106 880938 890540 899950 908922 917603 925151 930052 932217 933445 935248 937472 939587 941994 945138
58503 945138 948552 951837 955791 961678 970006 980523 992482 1004244 1013546 1018985 1020617 1018754 1013141
58490 1013141 1003827 991797 978063 963033 947339 932205 918321 905281 892810 881625 872580 865987
58478 865987 862317 862351 865871 871339 877632 885018 893638 902219 909260 914386 917577 918098 915286 909559 901698
58463 901698 891954 880764 869401 858903 849110 839658 831187 824639 820147 817448 816664 817849 820454 824031
58449 824031 828761 834664 841032 847154 852713 856952 858651 857663 855377 852981 850395 847631 845833 845913 847390
$$ packed form
58542A114711j8069j7815j6600j6156j6734j6984j6472j6236j6708j7003j6562
58531I29372j5730j4513j2365r516p102n693m757l678k310n17J733L988N811P383
58517H72106Q832R602R410Q972Q681P548M901K165J228J803K224K115K407L144
58503I45138L414L285L954N887Q328J0517J1959J1762R302N439J632j863n613
58490A013141r314j2030j3734j5030j5694j5134j3884j3040j2471j1185r045o593
58478H65987l670L4L520N468O293P386Q620Q581P041N126L191N21k812n727p861
58463I01698r744j1190j1363j0498r793r452q471o548m492k699p84J185K605L577
58449H24031M730N903O368O122N559M239J699r88k286k396k586k764j798Q0J477
$$ plain form
58434 847390 849695 853412 858989 865234 870444 874307 877582 880676 883643 886889 890905 895934 902542 911606
58420 911606 923011 935425 948062 961393 975302 988029 998261 1007029 1016228 1026379 1037039 1048012
58408 1048012 1058431 1065702 1067272 1063017 1054660 1043622 1030892 1018208 1007615 999964 994905 992003 990941
58395 990941 991230 992702 995662 999719 1003190 1004556 1003706 1000988 996063 988701 979721 970151 960332 950689 942213
58380 942213 935260 929025 923139 918452 915229 912066 907924 903872 901448 900615 900725 902119 905293 909812 915459
58365 915459 923123 932955 943174 952400 961814 973180 986171 999548 1013566 1028985 1044802 1059184
58353 1059184 1071817 1083316 1093209 1100542 1105712 1109769 1112644 1113859 1114197 1114931 1116221 1117893 1120661 1124944
58339 1124944 1129705 1134368 1140630 1150327 1162760 1176209 1190818 1207561 1225502 1242641 1258736 1274964
$$ packed form
58434H47390K305L717N577O245N210L863L275L094K967L246M016N029O608R064
58420I11606J1405J2414J2637J3331J3909J2727J0232Q768R199J0151J0660J0973
58408A048012J0419P271J570m255q357j1038j2730j2684j0593p651n059k902j062
58395I90941K89J472K960M057L471J366q50k718m925p362q980r570r819r643q476
58380I42213o953o235n886m687l223l163m142m052k424q33J10J394L174M519N647
58365I15459P664R832J0219R226R414J1366J2991J3377J4018J5419J5817J4382
58353A059184J2633J1499R893P333N170M057K875J215L38P34J290J672K768M283
58339A124944M761M663O262R697J2433J3449J4609J6743J7941J7139J6095J6228
$$ plain form
58327 1274964 1291539 1307760 1323520 1338614 1351559 1361327 1369233 1376862 1383318 1387002 1388996 1391967 1396567
58314 1396567 1401556 1406698 1412908 1420225 1428178 1437467 1448954 1461814 1474967 1489282 1505902 1523655
58302 1523655 1540849 1558360 1577952 1598701 1618214 1636365 1654642 1672772 1689325 1704914 1721406
58291 1721406 1738588 1754819 1770403 1787103 1804993 1822966 1841657 1862617 1885303 1908078 1931355
58280 1931355 1956509 1982760 2008702 2035789 2066468 2099826 2133040 2166181 2201331 2237865 2273142
58269 2273142 2307364 2343263 2381413 2420338 2460898 2505939 2555728 2608225 2663713 2724666 2791204
58258 2791204 2861173 2934401 3012106 3092323 3170761 3246031 3319352 3389755 3455033 3517158 3581153
58247 3581153 3648556 3717528 3789190 3867894 3954994 4048310 4147938 4256535 4373643 4496014 4623913
$$ packed form
58327A274964J6575J6221J5760J5094J2945R768P906P629O456L684J994K971M600
58314A396567M989N142O210P317P953R289J1487J2860J3153J4315J6620J7753
58302A523655J7194J7511J9592K0749J9513J8151J8277J8130J6553J5589J6492
58291A721406J7182J6231J5584J6700J7890J7973J8691K0960K2686K2775K3277
58280A931355K5154K6251K5942K7087L0679L3358L3214L3141L5150L6534L5277
58269B273142L4222L5899L8150L8925M0560M5041M9789N2497N5488O0953O6538
58258B791204O9969P3228P7705Q0217P8438P5270P3321P0403O5278O2125O3995
58247C581153O7403O8972P1662P8704Q7100R3316R9628J08597J17108J22371J27899
$$ plain form
58236 4623913 4760805 4906679 5058523 5217698 5389707 5576067 5773615 5982374 6206538
58227 6206538 6447083 6701372 6970920 7261429 7574412 7907374 8263072 8649535 9070087
58218 9070087 9523007 10011912 10546003 11129007 11759351 12443045 13194573 14023315 14932174
58209 14932174 15932189 17045057 18288802 19676139 21230757 22990066 24989624 27264374
58201 27264374 29871999 32898636 36440459 40606259 45549254 51475764 58618710 67235714
58193 67235714 77649213 90262468 105532497 123979746 146253239 173121557 205276236
58186 205276236 242958614 285404302 330097087 372220798 405175313 422623744 421161008
58179 421161008 401769562 369042163 328967871 286938003 246854934 211074799 180645051
$$ packed form
58236D623913J36892J45874J51844J59175J72009J86360J97548K08759K24164
58227F206538K40545K54289K69548K90509L12983L32962L55698L86463M20552
58218I070087M52920M88905N34091N83004O30344O83694P51528Q28742R08859
58209A4932174J000015J112868J243745J387337J554618J759309J999558K274750
58201B7264374K607625L026637L541823M165800M942995N926510P142946Q617004
58193F7235714J0413499J2613255J5270029J8447249K2273493K6868318L2154679
58186B05276236L7682378M2445688M4692785M2123711L2954515J7448431j462736
58179D21161008j9391446l2727399m0074292m2029868m0083069l5780135l0429748
$$ plain form
58172 180645051 155668762 135766814 120447382 109236139 101676471 97326505 95658435
58165 95658435 95787962 96300062 95536868 92278378 86277034 78212127 69178190 60164865
58157 60164865 51826728 44498519 38281031 33116315 28861090 25356010 22462038 20061071
58149 20061071 18050696 16349977 14902913 13668699 12610952 11698033 10906180 10214726
58141 10214726 9600629 9042778 8528883 8052624 7606105 7180602 6773158 6386721 6024196
58132 6024196 5686865 5377419 5098826 4849946 4626706 4427519 4253316 4102383 3969434
58123 3969434 3849406 3737623 3626568 3507999 3379626 3245968 3112108 2980500 2853968
58114 2853968 2736761 2630809 2534447 2446093 2365968 2293302 2225444 2161095 2101410 2046833 1995684
$$ packed form
58172A80645051k4976289j9901948j5319432j1211243p559668m349966j668070
58165I5658435J29527N12100p63194l258490o001344q064907r033937r013325
58157F0164865q338137p328209o217488n164716m255225l505080k893972k400967
58149B0061071k010375j700719j447064j234214j057747r12919p91853o91454
58141A0214726o14097n57851n13895m76259m46519m25503m07444l86437l62525
58132F024196l37331l09446k78593k48880k23240j99187j74203j50933j32949
58123C969434j20028j11783j11055j18569j28373j33658j33860j31608j26532
58114B853968j17207j05952r6362q8354q0125p2666o7858o4349n9685n4577n1149
$$ plain form
58103 1995684 1946733 1900252 1855579 1810583 1764511 1718762 1674041 1629389 1584761 1541871 1501784
58092 1501784 1464154 1429339 1398497 1370964 1344325 1317732 1292572 1269381 1247015 1225480 1206477
58081 1206477 1190133 1173976 1156160 1137021 1116626 1093732 1068394 1042901 1018800 995432 972473
58070 972473 951260 932223 913533 893858 874268 856119 839240 823562 810263 799728 790390 781111
58058 781111 772863 766585 761160 754988 747914 740232 731343 720832 709539 698369 687347 676740 667535
58045 667535 659785 652043 643525 635380 628787 623250 617776 612263 606733 600610 593801 587172 581092 574840
58031 574840 568176 561904 556102 549492 541520 533487 526555 520244 513927 508180 503433 498811 493675 488962
58017 488962 485669 483123 480029 476159 471882 467051 461639 456631 453154 451208 449917 448447 446358 443967
$$ packed form
58103A995684m8951m6481m4673m4996m6072m5749m4721m4652m4628m2890m0087
58092A501784l7630l4815l0842k7533k6639k6593k5160k3191k2366k1535j9003
58081A206477j6344j6157j7816j9139k0395k2894k5338k5493k4101k3368k2959
58070I72473k1213j9037j8690j9675j9590j8149j6879j5678j3299j0535r338r279
58058G81111q248o278n425o172p074p682q889j0511j1293j1170j1022j0607r205
58045F67535p750p742q518q145o593n537n474n513n530o123o809o629o080o252
58031E74840o664o272n802o610p972q033o932o311o317n747m747m622n136m713
58017D88962l293k546l094l870m277m831n412n008l477j946j291j470k089k391
$$ plain form
58003 443967 442595 443362 445571 447517 448904 450844 453472 455720 457839 461832 468433 475795 482240 488226
57989 488226 494322 499386 502364 504081 505548 506134 505170 503905 504030 505377 506748 507893 509034 509495 508545
57974 508545 506858 505610 504804 503786 502556 501278 499317 496066 492018 487875 483417 478314 473147 468502
57960 468502 464063 459698 456314 454407 452834 450333 447169 443992 440255 435331 430075 425579 421215 415642
57946 415642 409128 403299 399188 396898 396446 397393 398331 398349 398505 400443 404171 408655 413866 420556 428554 437000
57930 437000 445972 456253 467699 479196 489950 499460 506730 511089 513539 515790 518134 519616 519951
57917 519951 519697 518705 516004 511285 505120 497751 489016 479419 469908 460477 450282 439237 428313 418152
57903 418152 408540 399269 390381 381465 371866 361765 352077 343234 335023 327560 321347 316307 311801 307738
$$ packed form
58003D43967j372P67K209J946J387J940K628K248K119L993O601P362O445N986
57989D88226O096N064K978J717J467N86r64j265J25J347J371J145J141M61r50
57974E08545j687j248q06j018j230j278j961l251m048m143m458n103n167m645
57960D68502m439m365l384j907j573k501l164l177l737m924n256m496m364n573
57946D15642o514n829m111k290m52R47R38J8J56J938L728M484N211O690P998Q446
57930D37000Q972J0281J1446J1497J0754R510P270M359K450K251K344J482L35
57917E19951k54r92k701m719o165p369q735r597r511r431j0195j1045j0924j0161
57903D18152r612r271q888q916r599j0101r688q843q211p463o213n040m506m063
$$ plain form
57889 307738 304693 302868 301848 301411 301636 302153 302218 301675 301081 300930 301521 303422 307050 311790 316420 320426
57873 320426 324039 327113 328977 329470 329242 328920 328691 328645 328743 328499 327526 326282 325532 325241 324811 324216 324011 324432
57855 324432 325417 327293 330496 334805 339773 345598 352538 359838 366451 372582 379184 386096 392099 396768
57841 396768 400795 404425 407052 408592 409732 410403 409468 406528 402720 399048 395062 389922 383713 376925 369547
57826 369547 361539 353515 346215 339809 334314 330160 327766 326994 327452 328974 331472 334663 338177 341615 344540
57811 344540 346952 349694 353663 358668 363814 368880 374319 379916 384710 388459 391963 395413 397536 397065
57797 397065 394091 389267 382552 373594 362731 350860 338714 326810 315586 305095 295097 285878 278341
57784 278341 272741 268023 263047 257926 253489 249934 246845 244196 242530 242168 242867 244337 246688 250247 255049
$$ packed form
57889C07738l045j825j020m37K25N17O5n43n94j51N91J901L628M740M630M006
57873C20426L613L074J864M93k28l22k29m6R8k44r73j244p50k91m30n95k05M21
57855C24432R85J876L203M309M968N825O940P300O613O131O602O912O003M669
57841C96768M027L630K627J540J140O71r35k940l808l672l986n140o209o788p378
57826C69547q008q024p300o406n495m154k394p72M58J522K498L191L514L438K925
57811C44540K412K742L969N005N146N066N439N597M794L749L504L450K123m71
57797C97065k974m824o715q958j0863j1871j2146j1904j1224j0491r998r219p537
57784B78341n600m718m976n121m437l555l089k649j666l62O99J470K351L559M802
$$ plain form
57769 255049 260479 265474 269312 272280 275267 278741 282432 285937 289121 291925 294276 296256 297792 298229
57755 298229 296833 293854 290469 287552 285066 282638 279955 276466 271576 265473 259103 253081 247316 241915
57741 241915 237569 234593 232323 229999 227669 225818 224699 224402 224974 226059 227010 227746 228886 230647 232279
57726 232279 233033 233061 232906 232749 232642 232820 233243 233457 233423 233861 235240 237069 238766 240480 242375 243772 243919
57709 243919 243106 242241 241677 241267 241155 241630 242399 242865 243026 243413 244265 245360 246596 248201 250457 253650 258025
57692 258025 263303 268494 272743 276159 279218 281558 282020 279880 275596 270383 265449 261525 258708 256848
57678 256848 256323 258168 263145 271121 281880 296203 315576 341110 373435 413614 463566 525512
57666 525512 601178 690877 792018 897604 996055 1073061 1115205 1114487 1071713 996188 901425
$$ packed form
57769B55049N430M995L838K968K987L474L691L505L184K804K351J980J536M37
57755B98229j396k979l385k917k486k428k683l489m890o103o370o022n765n401
57741B41915m346k976k270k324k330j851j119k97N72J085R51P36J140J761J632
57726B32279P54K8j55j57j07J78M23K14l4M38J379J829J697J714J895J397J47
57709B43919q13q65n64m10j12M75P69M66J61L87Q52J095J236J605K256L193M375
57692B58025N278N191M249L416L059K340M62k140m284n213m934l924k817j860
57678B56848n25J845M977P976J0759J4323J9373K5534L2325M0179M9952O1946
57666E25512P5666Q9699J01141J05586R8451P7006M2144p18m2774p5525r4763
$$ plain form
57655 901425 800177 702067 613503 537666 474532 422238 379171 344598 317661 296804 280491
57644 280491 267804 258019 250175 243422 237436 232166 227427 222947 218596 214391 210470 207130 204647 202965
57630 202965 201743 200770 200178 200202 200848 201796 202493 202395 201337 199727 198277 197454 197111 196524 194828 191723 187829
57613 187829 184196 181423 179465 178179 177476 176853 175456 173096 170803 169910 170831 173040 175788 178318 179820
57598 179820 179924 179195 178563 178251 177697 176558 175300 174646 174668 174610 173559 171360 168865 167138 166417 166054 165380
57581 165380 164163 162206 159220 155387 151536 148322 145689 143428 141677 140438 139186 137574 136059 135218
57567 135218 134820 134137 132791 130801 128309 125874 124500 124558 125045 124706 123561 122585 122280 122425 122858 123468 123627
57550 123627 122716 121172 120097 119885 120145 120795 122072 123495 124120 124143 125007 127441 130459 132856 134688 136536
$$ packed form
57655I01425j01248r8110q8564p5837o3134n2294m3067l4573k6937k0857j6313
57644B80491j2687r785p844o753n986n270m739m480m351m205l921l340k483j682
57630B02965j222r73n92K4O46R48O97r8j058j610j450q23l43n87j696l105l894
57613A87829l633k773j958j286p03o23j397k360k293q93R21K209K748K530J502
57598A79820J04p29o32l12n54j139j258o54K2n8j051k199k495j727p21l63o74
57581A65380j217j957k986l833l851l214k633k261j751j239j252j612j515q41
57567A35218l98o83j346j990k492k435j374N8M87l39j145r76l05J45M33O10J59
57550A23627r11j544j075k12K60O50J277J423O25K3Q64K434L018K397J832J848
$$ plain form
57534 136536 138224 139191 139532 139725 139703 139056 138016 137539 138360 140429 143160 145835 147837 148937 149455 149954 150808
57517 150808 152120 153892 156079 158647 161742 165657 170353 175088 178719 180547 180876 180717 180847 181148 180993
57502 180993 180194 179186 178164 176615 174060 170829 167560 164297 160718 156972 153526 150345 146952 143259
57488 143259 139584 135875 131754 127407 123663 120903 118609 116254 113961 112089 110796 110317 110968 112488 113952
57473 113952 114731 114972 114826 113892 111947 109668 107986 107092 106637 106497 106756 107178 107384 107472 107927 108851 109651 109612
57455 109612 108613 107271 106433 106457 106949 107338 107650 108420 109894 111680 113260 114435 115146 115289 114931 114404 113979
57438 113979 113705 113643 113860 114155 114182 113991 114010 114378 114707 114680 114424 114147 113870 113676 113716 113776 113370 112487 111748 111551 111561
57417 111561 111252 110473 109300 107965 107094 107276 108073 108251 107425 106686 106999 107803 107968 107408 106890 106775 106916 107398
$$ packed form
57534A36536J688R67L41J93k2o47j040m77Q21K069K731K675K002J100N18M99Q54
57517A50808J312J772K187K568L095L915M696M735L631J828L29j59J30L01j55
57502A80993p99j008j022j549k555l231l269l263l579l746l446l181l393l693
57488A43259l675l709m121m347l744k760k294k355k293j872j293m79O51J520J464
57473A13952P79K41j46r34j945k279j682q94m55j40K59M22K06Q8M55R24Q00l9
57455A09612r99j342q38K4M92L89L12P70J474J786J580J175P11J43l58n27m25
57438A13979k74o2K17K95K7j91J9L68L29k7k56k77k77j94M0O0m06q83p39j97J0
57417A11561l09p79j173j335q71J82P97J78q26p39L13Q04J65n60n18j15J41M82
$$ plain form
57399 107398 108320 109117 109044 108312 107898 108265 109019 109762 110460 110946 110884 110424 110202 110482 110857 110976 110990 111073 111056 110938
57379 110938 111312 112790 115057 116881 117161 115941 114306 113292 112998 112931 112910 113119 113348 112953 111880 111003 110953
57362 110953 111215 111000 110445 110171 110142 109908 109726 110367 111868 113439 114731 116282 118388 120369 121403 121536 121372
57345 121372 121179 120732 119831 118601 117406 116645 116526 116977 117805 118852 119854 120462 120747 121396 122844 124368 124750
57328 124750 123851 122877 122885 123633 124175 124053 123545 123109 123032 123405 124100 124834 125375 125643 125583 125151 124453 123718 123093 122615
57308 122615 122279 121950 121411 120773 120617 121286 122225 122576 122342 122300 122787 123255 123155 122558 121658 120316 118549 116956
57290 116956 116214 116475 117523 119102 120737 121712 121757 121452 121521 121983 122508 123259 124782 127120 129690 132087 134528
57273 134528 137311 140239 142942 145532 148612 152633 157402 162218 166399 169667 172141 174085 175652 176730
$$ packed form
57399A07398R22P97p3p32m14L67P54P43O98M86o2m60k22K80L75J19J4Q3j7j18
57379A10938L74J478K267J824K80j220j635j014k94o7k1K09K29l95j073q77n0
57362A10953K62k15n55k74k9k34j82O41J501J571J292J551K106J981J034J33j64
57345A21372j93m47r01j230j195p61j19M51Q28J047J002O08K85O49J448J524L82
57328A24750q99r74QP48N42j22n08m36p7L73O95P34N41K68o0m32o98p35o25m78
57308A22615l36l29n39o38j56O69R39L51k34m2M87M68j00n97r00j342j767j593
57290A16956p42K61J048J579J635R75M5l05O9M62N25P51J523K338K570K397K441
57273A34528K783K928K703K590L080M021M769M816M181L268K474J944J567J078
$$ plain form
57259 176730 177019 176336 174909 173313 172060 171293 170853 170462 169854 168963 168136 167901 168363 168999 169275 169229 169270 169573
57241 169573 169939 170041 169590 168509 167200 166311 165939 165412 164281 163131 162838 163317 163714 163651 163529 163661 163819 163751
57223 163751 163584 163648 164423 166502 169866 173269 175257 175914 176757 178704 181146 183410 186049 189944 194902 200050
57207 200050 205104 210393 215891 221019 225290 228595 231009 232845 234711 237032 239630 242148 244644 247308
57193 247308 249831 251624 252602 253277 254149 255379 256985 258942 261117 263414 265907 268578 271109 273304 275526
57178 275526 278329 281827 285811 290373 295894 302420 309505 316739 324112 331808 339925 348524 357736 367696
57164 367696 378405 389575 400616 410931 420404 429474 438671 448343 458908 470945 484720 499908
57152 499908 516100 533318 551760 571365 592008 613813 636865 660885 685664 711605 739475
$$ packed form
57259A76730K89o83j427j596j253p67m40l91o08q91q27k35M62O36K76m6M1L03
57241A69573L66J02m51j081j309q89l72n27j131j150k93M79L97o3j22J32J58o8
57223A63751j67O4P75K079L364L403J988O57Q43J947K442K264K639L895M958N148
57207B00050N054N289N498N128M271L305K414J836J866K321K598K518K496K664
57193B47308K523J793R78O75Q72J230J606J957K175K297K493K671K531K195K222
57178B75526K803L498L984M562N521O526P085P234P373P696Q117Q599R212R960
57164C67696J0709J1170J1041J0315R473R070R197R672J0565J2037J3775J5188
57152D99908J6192J7218J8442J9605K0643K1805K3052K4020K4779K5941K7870
$$ plain form
57141 739475 769817 802990 839395 879159 921776 966483 1012725 1059887 1107250 1155162 1205982
57130 1205982 1262776 1326823 1396831 1470291 1544627 1617239 1685875 1749935 1811012 1871732 1934315
57119 1934315 2000157 2069921 2143425 2219869 2298665 2380020 2464704 2553672 2647972 2748573 2856230
57108 2856230 2971973 3097729 3236003 3389100 3559412 3750468 3966856 4213141 4493990
57099 4493990 4816011 5189107 5626557 6145491 6768302 7522945 8441359 9557777 10907175
57090 10907175 12521552 14424364 16626872 19127216 21908398 24934638 28151500 31491039
57082 31491039 34874828 38213138 41411900 44393036 47107893 49517506 51548970 53073223
57074 53073223 53934034 54005906 53234176 51638697 49299113 46341435 42925220 39224427 35406139
$$ packed form
57141G39475L0342L3173L6405L9764M2617M4707M6242M7162M7363M7912N0820
57130A205982N6794O4047P0008P3460P4336P2612O8636O4060O1077O0720O2583
57119A934315O5842O9764P3504P6444P8796Q1355Q4684Q8968R4300J00601J07657
57108B856230J15743J25756J38274J53097J70312J91056K16388K46285K80849
57099D493990L22021L73096M37450N18934O22811P54643R18414J116418J349398
57090A0907175J614377J902812K202508K500344K781182L026240L216862L339539
57082C1491039L383789L338310L198762K981136K714857K409613K031464J524253
57074E3073223Q60811P1872p71730j595479k339584k957678l416215l700793l818288
$$ plain form
57065 35406139 31616285 27973435 24566041 21451836 18660991 16201551 14063973 12224919
57057 12224919 10652340 9311015 8165902 7183619 6334556 5595729 4951615 4391932 3908515
57048 3908515 3493530 3138985 2836675 2578406 2356577 2164704 1997536 1850881 1721333
57039 1721333 1606006 1502504 1409129 1324852 1248750 1179572 1116190 1058456 1007162 962837 924755
57028 924755 891416 861922 836597 816232 801177 791497 787726 790993 802556 823792 856543 902892
57016 902892 964692 1044354 1146347 1277130 1443546 1651941 1906414 2200592 2504653 2762550
57006 2762550 2911963 2916771 2785101 2558716 2287219 2009748 1751289 1525314 1335972 1180773
56996 1180773 1054626 952593 870162 803292 749191 706199 672536 646037 625216 609547 598456
$$ packed form
57065C5406139l789854l642850l407394l114205k790845k459440k137578j839054
57057A2224919j572579j341325j145113r82283q49063p38827o44114n59683m83417
57048C908515m14985l54545l02310k58269k21829j91873j67168j46655j29548
57039A721333j15327j03502r3375q4277p6102o9178o3382n7734n1294m4325l8082
57028I24755l3339k9494k5325k0365j5055r680l771L267J1563K1236L2751M6349
57016I02892O1800P9662J01993J30783J66416K08395K54473K94178L04061K57897
57006B762550J49413M808j31670k26385k71497k77471k58459k25975j89342j55199
56996A180773j26147j02033q2431o6870n4101m2992l3663k6499k0821j5669j1091
$$ plain form
56985 598456 591052 586980 586445 588916 592542 594971 593900 586821 571698 548682 520410 490037 459494
56972 459494 429803 401944 376676 354246 335017 319792 308898 301521 296575 293803 293553 296070 301736
56959 301736 311546 326479 346444 370278 396487 423296 447885 466213 474241 469835 453930 429946
56947 429946 401851 372692 344807 320526 301506 287452 276596 267873 261884 259575 260925 265538
56935 265538 273673 285996 302859 324510 351525 384240 421747 461500 499298 529432 545959 545237
56923 545237 527663 497001 458418 417043 377035 340680 308427 280263 256690 237977 223203
56912 223203 210897 200286 191152 182860 174576 166338 159140 153838 150456 148457 147138 145886 144622 143978
56898 143978 144557 146114 147940 149938 152825 157360 163877 172594 183953 198553 216960 239488 265966
$$ packed form
56985E98456p404m072n35K471L626K429j071p079j5123k3016k8272l0373l0543
56972D59494k9691k7859k5268k2430j9229j5225j0894p377m946k772k50K517N666
56959C01736R810J4933J9965K3834K6209K6809K4589J8328Q028m406j5905k3984
56947D29946k8095k9159k7885k4281j9020j4054j0856q723n989k309J350M613
56935B65538Q135J2323J6863K1651K7015L2715L7507L9753L7798L0134J6527p22
56923E45237j7574l0662l8583m1375m0008l6355l2253k8164k3573j8713j4774
56912B23203j2306j0611r134q292q284q238p198n302l382j999j319j252j264o44
56898A43978N79J557J826J998K887M535O517Q717J1359J4600J8407K2528K6478
$$ plain form
56885 265966 295825 328409 362602 395860 424219 444059 453931 454581 447840 436004 421605 406683
56873 406683 392211 378670 367006 358482 353853 353321 357109 365522 378654 396646 420125 449920 486619
56860 486619 530928 583969 646023 714476 783021 842680 883858 899082 886079 849049 796433
56849 796433 736954 677366 622551 575861 538880 511711 493960 485162 484599 491691 506888 531591
56837 531591 567206 614917 676279 752981 845478 951981 1067934 1184762 1288747 1363229 1394718
56826 1394718 1378626 1320206 1231101 1125072 1014956 910658 818036 739254 674396 622914 583992
56815 583992 556408 538938 531227 533946 547772 572501 607679 653912 712667 784206 865600 950154
56803 950154 1027694 1085759 1112959 1103731 1060719 992497 909351 820794 734843 657143 590330 534968
$$ packed form
56885B65966K9859L2584L4193L3258K8359J9840R872O50o741j1836j4399j4922
56873D06683j4472j3541j1664q524m629n32L788Q413J3132J7992K3479K9795L6699
56860D86619M4309N3041O2054O8453O8545N9659M1178J5224j3003l7030n2616
56849G96433n9479n9588n4815m6690l6981k7169j7751q798n63P092J5197K4703
56837E31591L5615M7711O1362P6702R2497J06503J15953J16828J03985P4482L1489
56826A394718j6092n8420q9105j06029j10116j04298r2622p8782o4858n1482l8922
56815E83992k7584j7470p711K719J3826K4729L5178M6233N8755P1539Q1394Q4554
56803I50154P7540N8065K7200r228m3012o8222q3146q8557q5951p7700o6813n5362
$$ plain form
56791 534968 490929 457328 432131 413396 400895 395451 397020 404714 418531 439590 468380 503790
56779 503790 543780 585541 624550 654695 670196 667418 645608 607465 559087 507611 457827 411403
56767 411403 369102 332168 301170 275132 252859 234187 219113 206666 195591 185532 176724 169127
56755 169127 162550 157131 153001 149858 147309 145194 143221 140874 138073 135350 132936 130291 126905 123057
56741 123057 119455 116677 115133 114846 115032 114667 113671 112718 111730 109739 106625 103742 102180 101460 100698 99931
56725 99931 99478 99076 98663 99061 100734 102694 103743 104169 105075 106667 108344 109963 111778 113552 114849 115920
56709 115920 117200 118218 118138 117179 116458 116536 117074 117742 118447 118729 118019 116599 115431 114866 114280 113102 111544
56692 111544 110171 109305 108889 108482 107499 105934 104682 104581 105359 106067 106302 106333 106350 106435 107062 108761 111274 113794
$$ packed form
56791E34968m4039l3601k5197j8735j2501n444J569P694J3817K1059K8790L5410
56779E03790L9990M1761L9009L0145J5501k778k1810l8143m8378n1476m9784m6424
56767D11403m2301l6934l0998k6038k2273j8672j5074j2447j1075j0059q808p597
56755A69127o577n419m130l143k549k115j973k347k801k723k414k645l386l848
56741A23057l602k778j544k87J86l65r96r53r88j991l114k883j562p20p62p67
56725I9931m53m02m13L98J673J960J049M26R06J592J677J619J815J774J297J071
56709A15920J280J018q0r59p21P8N38O68P05K82p10j420j168n65n86j178j558
56692A11544j373q66m16m07r83j565j252j01P78P08K35L1J7Q5O27J699K513K520
$$ plain form
56674 113794 116009 118211 120509 122800 125482 129231 133893 138435 142245 145692 149086 151863 153331 153653
56660 153653 153548 153366 152914 151953 150371 147961 144444 139917 135097 130938 127840 125252 122204 118173 113252
56645 113252 107666 101673 96013 91713 88963 86684 83797 80570 78200 77372 77823 79021 80675 82730 85476
56630 85476 89587 95454 102512 109723 116675 123749 131181 138447 144760 149834 154057 157936 161422 163823
56616 163823 164619 164283 163896 163989 164389 165264 167353 170683 173924 175812 176588 177245 177973 178296 178266 178381 178484 177767
56598 177767 175845 173003 169457 165255 160903 157164 154088 151010 147761 145137 143862 143683 143793 143733 143599
56583 143599 143703 144226 145005 145603 145769 145752 145888 146036 145821 145348 145297 146257 148213 150574 152573 153902 155190 157487
56565 157487 161046 165035 168826 173001 178476 185138 192115 199061 206413 214579 223592 233371 243571 253258
$$ packed form
56674A13794K215K202K298K291K682L749M662M542L810L447L394K777J468L22
56660A53653j05j82m52r61j582k410l517m527m820m159l098k588l048m031m921
56645A13252n586n993n660m300k750k279k887l227k370q28M51J198J654K055K746
56630H5476M111N867P058P211O952P074P432P266O313N074M223L879L486K401
56616A63823P96l36l87R3M00Q75K089L330L241J888P76O57P28L23l0J15J03p17
56598A77767j922k842l546m202m352l739l076l078l249k624j275j79J10o0j34
56583A43599J04N23P79N98J66j7J36J48k15m73n1R60J956K361J999J329J288K297
56565A57487L559L989L791M175N475O662O977O946P352Q166R013R779J0200R687
$$ plain form
56551 253258 261424 267878 273143 277658 281638 285510 289723 294144 298178 301435 303842 305317 305848 305718 305074
56536 305074 303473 300398 296031 291006 285704 280326 275233 270504 265554 259953 254278 249339 244911 240170
56522 240170 235043 230123 225451 220505 215316 210473 206027 201473 196992 193597 191686 190382 188738 186925
56508 186925 185859 186130 187509 189041 189567 188655 187086 185972 185574 185443 185364 185347 184984 183841 182458 181985 182770
56491 182770 184115 185434 186692 187707 188004 187581 186981 186406 185585 184595 183904 183430 182479 180888 179389 178573 178289
56474 178289 178312 178794 179714 180573 180987 181048 180965 180909 181229 182143 183191 183685 183669 183668 183686 183380 183158 183903 185482 186659
56454 186659 186738 186250 185812 185439 185325 186082 187675 189155 190053 191097 193027 195550 197979 199998 201214 200940
56438 200940 199168 197054 195761 195417 195688 196552 197818 198619 198163 196601 194718 193282 193026 194365 196500 197540
$$ packed form
56551B53258Q166O454N265M515L980L872M213M421M034L257K407J475N31j30o44
56536C05074j601l075m367n025n302n378n093m729m950n601n675m939m428m741
56522B40170n127m920m672m946n189m843m446m554m481l395j911j304j644j813
56508A86925j066K71J379J532N26r12j569j114l98j31p9j7l63j143j383m73P85
56491A82770J345J319J258J015K97m23o00n75q21r90o91m74r51j591j499q16k84
56474A78289K3M82R20Q59M14O1q3n6L20R14J048M94j6jJ8l06k22P45J579J177
56454A86659P9m88m38l73j14P57J593J480Q98J044J930K523K429K019J216k74
56438B00940j772k114j293l44K71Q64J266Q01m56j562j883j436k56J339K135J040
$$ plain form
56422 197540 196424 194264 193094 193636 194958 195978 196600 197430 198880 200575 201583 201375 200578 200410 201389 203040
56406 203040 204735 206085 206512 205378 202900 200254 198413 197403 196866 196651 196637 196695 197096 198277 199993 201449
56390 201449 202511 203976 206326 209004 211286 213092 214562 215603 216316 217174 218296 219108 219099 218408 217437 216523
56374 216523 216221 217221 219646 222981 226812 231009 235207 238962 242450 246166 249880 252911 255387 258049
56360 258049 260654 261908 261376 260153 259241 258490 257659 257135 256939 256295 254963 253827 253369 252740 251266 249743
56344 249743 249230 249492 249636 249422 249029 248380 247623 247451 247994 248218 247346 246113 245621 245738 245690 245574 246178 247747
56326 247747 249967 252818 256573 261230 266538 272270 277891 282487 285585 287588 288968 289657 289656 289534 289738 290098
56310 290098 290427 290823 290967 290052 288026 285997 284821 284198 283744 283837 284690 285674 286448 287778 290269 293200 295509
$$ packed form
56422A97540j116k160j170N42J322J020O22Q30J450J695J008k08p97j68R79J651
56406B03040J695J350M27j134k478k646j841j010n37k15j4N8M01J181J716J456
56390B01449J062J465K350K678K282J806J470J041P13Q58J122Q12ro91r71r14
56374B16523l02J000K425L335L831M197M198L755L488L716L714L031K476K662
56360B58049K605J254n32j223r12p51q31n24j96o44j332j136m58o29j474j523
56344B49743n13K62J44k14l93o49p57j72N43K24q72j233m92J17m8j16O04J569
56326B47747K220K851L755M657N308N732N621M596L098K003J380O89jj22K04L60
56310B90098L29L96J44r15k026k029j176o23m54R3Q53R84P74J330K491K931K309
$$ plain form
56293 295509 297082 298135 298288 297296 295951 295188 294928 294684 294599 295040 295861 296906 298536 300830 303029 304553
56277 304553 305853 307537 309488 311549 314050 316820 318745 319253 319373 320387 322368 324848 327854 331316 334495
56262 334495 337033 339552 342349 344683 346384 348883 353410 359265 365113 370791 376584 382034 387021 392880
56248 392880 400744 409623 417657 424437 430669 436569 442152 448215 455252 462193 467868 472966 478896 485441
56234 485441 491301 496287 501127 505587 508599 510061 510918 511642 511966 511833 511320 509950 507207 503396 499043
56219 499043 494171 489079 484873 481994 479234 475483 471364 467819 464419 460764 458255 458288 459634 459819 458432
56204 458432 457071 456617 456645 457042 458150 459562 460621 461777 463776 465908 466831 466685 466731 467413 468468 470330
56188 470330 473564 477430 480777 483860 487572 491514 494637 497076 499513 501471 502238 502763 504535 507232 509488
$$ packed form
56293B95509J573J053J53r92j345p63k60k44q5M41Q21J045J630K294K199J524
56277C04553J300J684J951K061K501K770J925N08J20J014J981K480L006L462L179
56262C34495K538K519K797K334J701K499M527N855N848N678N793N450M987N859
56248C92880P864Q879Q034O780O232N900N583O063P037O941N675N098N930O545
56234D85441N860M986M840M460L012J462Q57P24L24j33n13j370k743l811m353
56219D99043m872n092m206k879k760l751m119l545l400l655k509L3J346J85j387
56204D58432j361m54K8L97J108J412J059J156J999K132R23j46M6O82J055J862
56188D70330L234L866L347L083L712L942L123K439K437J958P67N25J772K697K256
$$ plain form
56173 509488 511289 513502 515809 517375 518876 521526 524745 527191 529405 532913 537311 540899 543790 547664
56159 547664 552750 557775 562654 568531 575276 581629 587738 594897 602928 610538 618135 627402 638080 648171
56145 648171 657600 668680 682525 697847 713899 731806 752260 774483 798334 825205 856174 891424
56133 891424 931980 979934 1036577 1102416 1179146 1269191 1372871 1488033 1612251 1742713 1873754
56122 1873754 1997410 2107330 2200631 2276580 2336585 2385567 2429998 2473216 2514160 2550161 2578240
56111 2578240 2594264 2594975 2582039 2561492 2538446 2514466 2489388 2461642 2426064 2375289 2305236 2217282
56099 2217282 2115043 2002352 1884837 1769550 1661273 1561702 1472799 1397563 1336354 1285775
56089 1285775 1242695 1206667 1177415 1153153 1132788 1116974 1105602 1096926 1090192 1086458 1085784 1086407 1087608
$$ packed form
56173E09488J801K213K307J566J501K650L219K446K214L508M398L588K891L874
56159E47664N086N025M879N877O745O353O109P159Q031P610P597R267J0678J0091
56145F48171R429J1080J3845J5322J6052J7907K0454K2223K3851K6871L0969L5250
56133H91424M0556M7954N6643O5839P6730R0045J03680J15162J24218J30462J31041
56122A873754J23656J09920R3301P5949O0005M8982M4431M3218M0944L6001K8079
56111B578240J6024P11j2936k0547k3046k3980k5078k7746l5578n0775p0053q7954
56099B217282j02239j12691j17515j15287j08277r9571q8903p5236o1209n0579
56089A285775m3080l6028k9252k4262k0365j5814j1372q676o734l734o74O23J201
$$ plain form
56076 1087608 1090568 1095519 1100981 1106599 1113613 1121825 1129367 1136355 1145364 1157396 1170786 1184867 1201000
56063 1201000 1218982 1236382 1252719 1270444 1290405 1310187 1328364 1346407 1364780 1381175 1394477
56052 1394477 1406675 1419068 1430432 1440692 1452429 1466749 1481490 1495392 1510167 1526569 1542525
56041 1542525 1557246 1573147 1591562 1610569 1629230 1649881 1674017 1699910 1726397 1754901 1785583
56030 1785583 1815855 1844920 1875454 1908716 1942641 1976953 2015216 2059290 2106637 2155615 2208207
56019 2208207 2264774 2321534 2376498 2432756 2492740 2554459 2616604 2681834 2751457 2822373 2892986
56008 2892986 2966712 3045942 3128104 3211501 3299318 3393932 3493119 3595897 3706071 3825749 3951480
55997 3951480 4081106 4218065 4364582 4517433 4675212 4842930 5024459 5217427 5420454
$$ packed form
56076A087608K960M951N462N618P014Q212P542O988R009J2032J3390J4081J6133
56063A201000J7982J7400J6337J7725J9961J9782J8177J8043J8373J6395J3302
56052A394477J2198J2393J1364J0260J1737J4320J4741J3902J4775J6402J5956
56041A542525J4721J5901J8415J9007J8661K0651K4136K5893K6487K8504L0682
56030A785583L0272K9065L0534L3262L3925L4312L8263M4074M7347M8978N2592
56019B208207N6567N6760N4964N6258N9984O1719O2145O5230O9623P0916P0613
56008B892986P3726P9230Q2162Q3397Q7817R4614R9187J02778J10174J19678J25731
55997C951480J29626J36959J46517J52851J57779J67718J81529J92968K03027
$$ plain form
55988 5420454 5637860 5871929 6118512 6376063 6650886 6947560 7262908 7595951 7954749
55979 7954749 8346440 8769965 9225982 9723963 10271418 10866558 11510542 12216489 12997375
55970 12997375 13856603 14800712 15849630 17023923 18335134 19801043 21457783 23345430
55962 23345430 25497903 27963078 30819719 34163047 38095876 42756256 48338974 55074120
55954 55074120 63210330 73047050 84965645 99411694 116888538 138013976 163543296
55947 163543296 194221244 230441435 271721016 315976825 358894208 394177928 415286276
55940 415286276 418034352 402372261 372099019 332930482 290422182 248808840 210751738
55933 210751738 177524496 149367875 125920601 106584161 90711717 77678786 66938435
$$ packed form
55988E420454K17406K34069K46583K57551K74823K96674L15348L33043L58798
55979G954749L91691M23525M56017M97981N47455N95140O43984P05947P80886
55970A2997375Q59228R44109J048918J174293J311211J465909J656740J887647
55962B3345430K152473K465175K856641L343328L932829M660380N582718O735146
55954E5074120Q136210R836720J1918595J4446049J7476844K1125438K5529320
55947A63543296L0677948L6220191M1279581M4255809M2917383L5283720K1108348
55940D15286276K748076j5662091l0273242l9168537m2508300m1613342l8057102
55933B10751738l3227242k8156621k3447274j9336440j5872444j3032931j0740351
$$ plain form
55926 66938435 58056336 50687935 44539799 39369356 34995920 31279921 28096679 25343013
55918 25343013 22951026 20872465 19056770 17457357 16046077 14803794 13704447 12721618
55910 12721618 11841747 11057147 10353131 9713640 9132074 8605149 8122820 7674721 7259918
55901 7259918 6880097 6529204 6199261 5890371 5605628 5341720 5093442 4862220 4651470
55892 4651470 4458232 4277412 4109656 3957428 3817955 3687597 3568885 3465919 3376943 3298427
55882 3298427 3232394 3182858 3149018 3128780 3125394 3143896 3184123 3242989 3319622 3411399 3507658
55871 3507658 3593315 3656433 3688210 3680708 3631538 3547682 3438281 3306103 3151315 2979910 2801887
55860 2801887 2623829 2449517 2285177 2137174 2005827 1887432 1781265 1689353 1610961 1542832
$$ packed form
55926F6938435q882099p368401o148136n170443m373436l715999l183242k753666
55918B5343013k391987k078561j815695j599413j411280j242283j099347r82829
55910A2721618q79871p84600p04016o39491n81566n26925m82329m48099m14803
55901G259918l79821l50893l29943l08890k84743k63908k48278k31222k10750
55892D651470j93238j80820j67756j52228j39473j30358j18712j02966q8976p8516
55882C298427o6033m9536l3840k0238l386J8502M0227N8866P6633R1777R6259
55871C507658Q5657O3118L1777p502m9170q3856j09401j32178j54788j71405j78023
55860B801887j78058j74312j64340j48003j31347j18395j06167r1912p8392o8129
$$ plain form
55850 1542832 1483838 1434231 1391282 1350517 1310625 1272960 1237332 1202550 1169862 1141409 1116105
55839 1116105 1091039 1066015 1042993 1022110 1001977 982728 965154 948027 929785 911596 895339
55828 895339 880095 864147 848785 836307 825761 814591 802962 792431 781725 768222 752694
55817 752694 738337 725694 712624 698822 686400 676106 666653 657830 651033 646737 644330 644099 646602
55804 646602 650588 654454 659220 667218 678381 690676 703401 716998 730243 740736 747798 752056 752766
55791 752766 748581 740501 731038 720791 708702 695270 682551 671235 660579 651006 643886 638713 633027
55778 633027 625059 614267 599882 581648 561674 543015 526646 512113 500282 492601 488204 484834
55766 484834 482426 482767 485657 488339 488961 487889 485409 480834 474292 466992 459340 450879 442139 434323 427108
$$ packed form
55850A542832n8994m9607m2949m0765l9892l7665l5628l4782l2688k8453k5304
55839A116105k5066k5024k3022k0883k0133j9249j7574j7127j8242j8189j6257
55828H95339j5244j5948j5362j2478j0546j1170j1629j0531j0706j3503j5528
55817G52694j4357j2643j3070j3802j2422j0294r453q823o797m296k407k31K503
55804F46602L986L866M766P998J1163J2295J2725J3597J3245J0493P062M258P10
55791G52766m185q080r463j0247j2089j3432j2719j1316j0656r573p120n173n686
55778F33027p968j0792j4385j8234j9974j8659j6369j4533j1831p681m397l370
55766D84834k408L41K890K682O22j072k480m575o542p300p652q461q740p816p215
$$ plain form
55751 427108 418993 409820 400702 391472 380604 367866 354820 342561 331084 320955 313298 307828 302985
55738 302985 298244 294379 291446 288577 285868 284421 284396 284937 285934 287819 289768 290314 289684 289287 288928 286966
55722 286966 283359 279978 277527 274579 270268 265669 261836 258544 255676 253874 253096 252365 251613 252052 254158
55707 254158 256951 259728 262866 266448 269766 272634 275507 277881 278263 276175 272536 267730 261135 253077
55693 253077 245367 239126 233605 227869 222177 217023 212222 207686 203905 201104 199003 197752 197986 199693
55679 199693 202138 205010 208440 211924 214586 216473 218127 218950 217665 214451 210889 207701 204294 200626
55665 200626 197663 195710 194100 192810 192456 192492 191545 190059 190481 194047 199386 205116 211769 220058 229144
55650 229144 237957 246689 255635 263859 270236 274662 277153 276904 273442 267732 261111 253894 245904 237538
$$ packed form
55751D27108q115r173r118r230j0868j2738j3046j2259j1477j0129p657n470m843
55738C02985m741l865k933k869k709j447k5N41R97J885J949N46o30l97l59j962
55722B86966l607l381k451k948m311m599l833l292k868j802p78p31p52M39K106
55707B54158K793K777L138L582L318K868K873K374L82k088l639m806o595q058
55693B53077p710o241n521n736n692n154m801m536l781k801k101j251K34J707
55679A99693K445K872L430L484K662J887J654Q23j285l214l562l188l407l668
55665B00626k963j953j610j290l54L6r47j486M22L566N339N730O653Q289R086
55650B29144Q813Q732Q946Q224O377M426K491k49l462n710o621p217p990q366
$$ plain form
55636 237538 229483 222065 215482 209887 204812 199457 193994 189556 186474 183666 180372 177315 175450 174603
55622 174603 174065 173597 173191 172736 172502 173107 174474 175676 176253 176746 177576 178409 179001 179510 179514 177995 174924 171772
55604 171772 169751 168622 167763 167258 167134 166639 165188 163261 161605 160319 159290 158679 158281 157295 155377 153263
55588 153263 151772 150956 150655 150991 151757 152220 152168 152381 153533 155373 157460 159898 162823 165922 168942 172042
55572 172042 175348 178979 183700 190582 199620 209662 220039 231220 243414 255560 266181 274327 279329
55559 279329 280751 279118 275708 271099 264781 256440 246505 235093 221852 207435 193903 182872 174295
55546 174295 167608 162757 159385 156284 152657 148943 145597 142157 138337 134867 132272 129880 127079 124519
55532 124519 122928 121619 119394 116273 113199 110588 108215 106060 104327 102977 102018 101852 102732 104285 106133
$$ packed form
55636B37538q055p418o583n595n075n355n463m438l082k808l294l057j865q47
55622A74603n38m68m06m55k34O05J367J202N77M93Q30Q33N92N09Mj519l071l152
55604A71772k021j129q59n05j24m95j451j927j656j286j029o11l98r86j918k114
55588A53263j491q16l01L36P66M63n2K13J152J840K087K438K925L099L020L100
55572A72042L306L631M721O882R038J0042J0377J1181J2194J2146J0621Q146N002
55559B79329J422j633l410m609o318q341r935j1412j3241j4417j3532j1031q577
55546A74295o687m851l372l101l627l714l346l440l820l470k595k392k801k560
55532A24519j591j309k225l121l074k611k373k155j733j350r59j66Q80J553J848
$$ plain form
55517 106133 108374 110987 113457 115543 117700 120226 122846 125625 129270 133754 137587 139410 139552 139177 138661
55502 138661 137705 136325 134746 132903 130917 129573 129474 130182 130931 131661 132750 134225 135905 137731 139412 140362
55486 140362 140548 140757 141476 142236 142528 142462 141963 140402 137863 135753 135190 135599 135832 135774 135881 135969 135673 135461 136028
55467 136028 137149 138080 138598 138753 138173 136615 134722 133343 132501 131780 131144 130637 129938 129036 128628 128945 128929 127594
55449 127594 125541 124154 123948 124708 126467 129050 131253 131812 130924 129768 128820 127732 126462 125443 124894 124897
55433 124897 125760 127371 128647 128675 127981 127642 127581 126865 125361 123935 123238 123289 123980 124984 125501 125132 124754 125535
55415 125535 127349 129142 130453 131498 132137 132008 131483 131281 131278 130809 130040 129837 130374 130944 131125 131057 130648 129567
55397 129567 128022 126510 124860 122600 120233 119010 119259 119927 119939 119150 117953 116885 116652 117611 119115 120204
$$ packed form
55517A06133K241K613K470K086K157K526K620K779L645M484L833J823J42l75n16
55502A38661r56j380j579j843j986j344r9P08P49P30J089J475J680J826J681R50
55486A40362J86K09P19P60K92o6m99j561k539k110n63M09K33n8J07Q8k96k12N67
55467A36028J121R31N18J55n80j558j893j379q42p21o36n07o99r02m08L17j6j335
55449A27594k053j387k06P60J759K583K203N59q88j156r48j088j270j019n49L
55433A24897Q63J611J276K8o94l39o1p16j504j426o97N1O91J004N17l69l78P81
55415A25535J814J793J311J045O39j29n25k02lm69p69k03N37N70J81o8m09j081
55397A29567j545j512j650k260k367j223K49O68J2p89j197j068k33R59J504J089
$$ plain form
55381 120204 120879 121801 122774 122679 121086 118963 117534 117182 117616 118238 118202 116923 114760 112630 110987 109865 109688
55364 109688 110955 113127 114890 115758 116482 117662 118867 119477 119595 119771 120429 121776 123663 125435 126440 126733
55348 126733 126673 126064 124527 122608 121454 121342 121498 121481 121673 122170 122317 121806 121274 121336 121747 122015 122119 122181 122065
55329 122065 121763 121570 121511 121188 120529 120059 120067 120152 120050 120344 121794 124274 126778 128203 127925 126076 123574 121553
55311 121553 120464 119953 119663 119701 120128 120500 120283 119494 118686 118434 118866 119510 119683 119265 118946 119354 120204 120765 120944
55292 120944 121247 121828 122328 122634 123085 123800 124469 124986 125685 126774 128004 129026 129692 129993 130111 130467 131231 131909
55274 131909 131987 131772 131928 132307 132105 131192 130453 130594 131292 131758 131621 131096 130770 131189 132184 132728 132029 130615 129631
55255 129631 129356 129219 129081 129415 130266 131115 131843 132783 133694 133849 133376 133308 133878 133926 132576 130545 129158 128943
$$ packed form
55381A20204O75R22R73r5j593k123j429l52M34O22l6j279k163k130j643j122j77
55364A09688J267K172J763Q68P24J180J205O10J18J76O58J347J887J772J005K93
55348A26733o0o09j537j919j154j12J56j7J92M97J47n11n32O2M11K68J04O2j16
55329A22065l02j93n9l23o59m70QQ5j02K94J450K480K504J425k78j849k502k021
55311A21553j089n11k90L8M27L72k17p89q08k52M32O44J73m18l19M08Q50N61J79
55292A20944L03N81N00L06M51P15O69N17O99J089J230J022O66L01J18L56P64O78
55274A31909P8k15J56L79k02r13p39J41O98M66j37n25l26M19R95N44o99j414r84
55255A29631k75j37j38L34Q51Q49P28R40R11J55m73o8N70M8j350k031j387k15
$$ plain form
55237 128943 129783 131561 133888 135867 136877 137127 136983 136402 135529 135063 135352 135769 135610 135101 134886 135086 135490
55220 135490 136122 136894 137195 136559 135376 134275 133189 131715 130103 129099 128984 129366 129860 130376 130833 131046 130989
55203 130989 130847 130794 130913 131224 131646 132067 132526 133119 133694 133975 133968 133850 133459 132433 130958 129821 129565 130132 131337
55184 131337 132953 134190 134087 132832 131802 131721 131633 130450 128738 128003 128709 129955 130833 131219 131393 131712 132620
55167 132620 134295 136225 137658 138459 139100 139913 140824 141772 142920 144402 146154 147934 149272 149605 148824 147526
55151 147526 146412 145585 144788 144075 143785 143972 144332 144689 145139 145636 145759 145074 143653 142222 141686 142286 143130 142858
55133 142858 140980 138407 136536 135959 136189 136395 136206 135874 135801 135884 135515 134386 133097 132548 132896 133568 134151 134599
55115 134599 134658 133963 132876 132377 132808 133464 133840 134496 136111 138326 140176 141199 141576 141670 141966 143027 144805
$$ packed form
55237A28943Q40J778K327J979J010K50j44n81q73m66K89M17j59n09k15K00M04
55220A35490O32P72L01o36j183j101j086j474j612j004j15L82M94N16M57K13n7
55203A30989j42n3J19L11M22M21M59N93N75K81pj18l91j026j475j137k56N67J205
55184A31337J616J237j03j255j030q1q8j183j712p35P06J246Q78L86J74L19R08
55167A32620J675J930J433Q01O41Q13R11R48J148J482J752J780J338L33p81j298
55151A47526j114q27p97p13k90J87L60L57M50M97J23o85j421j431n36O00Q44k72
55133A42858j878k573j871n77K30K06j89l32p3Q3l69j129j289n49L48O72N83M48
55115A34599N9o95j087m99M31O56L76O56J615K215J850J023L77R4K96J061J778
$$ plain form
55098 144805 146365 146905 146748 146804 147404 148266 149177 150014 150311 149629 148293 147140 146538 146202 145905 145810 146022 146352
55080 146352 146596 146701 146550 145933 144864 143663 142619 141716 140748 139630 138569 137853 137411 136773 135777 135113 135621
55063 135621 137035 138122 138221 138005 138383 139309 140094 140344 140044 139198 137965 136759 135710 134431 132811 131632
55047 131632 131757 132973 134292 135153 135806 136622 137600 138494 139067 139379 139968 141418 143463 144973 145258 144836 144466
55030 144466 144032 143113 142114 141903 142521 143161 143336 143330 143509 143880 144374 145020 145749 146426 147014 147385 147206 146440 145663
55011 145663 145353 145197 144663 143912 143485 143403 143378 143586 144330 145130 145102 144302 143752 144080 144940 145866 146816 147710 148283 148704
54991 148704 149587 151068 152519 153451 154032 154412 154303 153664 153100 153018 152878 151959 150455 149226 148657 148384 148105 148136
54973 148136 148944 150395 151693 152120 151735 151225 151041 151000 150867 150929 151573 152538 153158 153259 153324 153813 154827 156365
$$ packed form
55098A44805J560N40j57N6O00Q62R11Q37K97o82j336j153o02l36k97r5K12L30
55080A46352K44J05j51o17j069j201j044r03r68j118j061p16m42o38r96o64N08
55063A35621J414J087R9k16L78R26P85K50l00q46j233j206j049j279j620j179
55047A31632J25J216J319Q61O53Q16R78Q94N73L12N89J450K045J510K85m22l70
55030A44466m34r19r99k11O18O40J75oJ79L71M94O46P29O77N88L71j79p66p77
55011A45663l10j56n34p51m27q2k5K08P44Q00k8q00n50L28Q60R26R50Q94N73M21
54991A48704Q83J481J451R32N81L80j09o39n64q2j40r19j504j229n69k73k79L1
54973A48136Q08J451J298M27l85n10j84m1j33O2O44R65O20J01O5M89J014J538
$$ plain form
54955 156365 158323 160219 161508 162287 163170 164372 165449 166005 165978 165156 163180 160381 157959 156843 156847 157361 158307
54938 158307 159844 161563 162740 163261 163738 164639 165723 166465 166786 167269 168658 171127 174099 176976 180006 184126
54922 184126 189924 197159 205400 214625 224919 235948 247054 257506 266294 272119 274209 273037 269740
54909 269740 264828 257948 248933 238625 228459 219488 211999 205770 200375 195308 190154 184925 180230 176912
54895 176912 175306 174856 174563 173855 172949 172416 172622 173534 174769 175719 175951 175833 176604 179437 184361 190306 196217
54878 196217 201897 207807 214436 222095 231032 241210 251899 261759 269538 274566 276608 275530 271350 264481
54864 264481 255743 246179 236829 228341 220512 212614 204543 197380 192287 189057 186427 183701 181310 179636
54850 179636 178184 176295 173953 171396 168541 165446 162821 161310 160517 159399 157521 155371 153550 152178
$$ packed form
54955A56365J958J896J289P79Q83J202J077N56k7q22j976k799k422j116MN14R46
54938A58307J537J719J177N21M77R01J084P42L21M83J389K469K972K877L030M120
54922A84126N798P235Q241R225J0294J1029J1106J0452Q788N825K090j172l297
54909B69740m912o880r015j0308j0166q971p489o229n395n067n154n229m695l318
54895A76912j606m50k93p08r06n33K06R12J235R50K32j18P71K833M924N945N911
54878A96217N680N910O629P659Q937J0178J0689R860P779N028K042j078m180o869
54864B64481q738r564r350q488p829p898q071p163n093l230k630k726k391j674
54850A79636j452j889k342k557k855l095k625j511p93j118j878k150j821j372
$$ plain form
54836 152178 151067 150019 149008 148390 148780 150325 152285 153777 154757 155792 157062 158138 158679 158817 158875 159110
54820 159110 159664 160320 160457 159729 158668 158105 158125 158200 158245 158788 159979 161116 161489 161220 161073 161691 163089 164575
54802 164575 165250 164931 164456 164644 165199 165276 164840 164540 164362 163597 162354 161982 163344 165608 167432 168579 169542
54785 169542 170228 170089 169269 168704 169012 169969 171094 172155 173056 173728 174321 175175 176540 178627 181852 186555 192333
54768 192333 198126 203360 208815 215962 225427 236360 247429 258064 268324 277684 284587 287569 286484
54755 286484 282262 275751 267286 257227 246351 235629 226009 218311 212782 208624 204482 199731 194989
54742 194989 191232 188765 187233 186274 185846 186051 186833 187806 188425 188517 188515 188873 189444 189859 190396 191851 194545 198111
54724 198111 202376 207832 214916 223385 232641 242152 251288 259284 265739 270606 273388 272956 268704 261456
$$ packed form
54836A52178j111j048j011o18L90J545J960J492R80J035J270J076N41J38N8K35
54820A59110N54O56J37p28j061n63K0P5M5N43J191J137L73k69j47O18J398J486
54802A64575O75l19m75J88N55P7m36l00j78p65j243l72J362K264J824J147R63
54785A69542O86j39q20n65L08R57J125J061R01O72N93Q54J365K087L225M703N778
54768A92333N793N234N455P147R465J0933J1069J0635J0260R360O903K982j085
54755B86484m222o511q465j0059j0876j0722r620p698n529m158m142m751m742
54742A94989l757k467j532r59m28K05P82R73O19R2kL58N71M15N37J455K694L566
54724A98111M265N456P084Q469R256R511R136P996O455M867K782m32m252p248
$$ plain form
54710 261456 252706 243321 233515 223635 214304 205962 198852 193285 189381 186661 184387 182199 180077 177957
54696 177957 175934 174626 174602 175421 175931 175635 175169 175133 175044 173939 171773 169699 168921 169549 170682 171364 171293 170715
54678 170715 170009 169533 169599 170172 170660 170393 169440 168607 168504 168886 169066 168696 167927 167119 166617 166575 166775 166783 166452 166084
54658 166084 165917 165749 165255 164423 163470 162620 162166 162449 163425 164527 165272 165779 166396 167130 167860 168848 170522 172772
54640 172772 174879 176168 176515 176277 175984 176006 176244 176220 175667 174897 174388 174193 173977 173470 172636 171650 170983 171189 172218
54621 172218 173173 173202 172465 171778 171485 171253 170901 170750 171062 171649 172242 172865 173587 174268 174742 175090 175482 175896 176086
54602 176086 175786 174970 174002 173480 173725 174470 175137 175327 174979 174357 174100 174872 176492 177679 177317 175859 174844
54585 174844 175051 175826 176365 176825 177690 178634 178779 177927 176978 177052 178459 180525 182196 182837 182630 182278 182365 183082
$$ packed form
54710B61456q750r385r806r880r331q342p110n567l904k720k274k188k122k120
54696A77957k023j308k4Q19N10k96m66l6q9j105k166k074p78O28J133O82p1n78
54678A70715p06m76O6N73M88k67r53q33j03L82J80l70p69q08n02m2K00Ql31l68
54658A66084j67j68m94q32r53q50m54K83R76J102P45N07O17P34P30R88J674K250
54640A72772K107J289L47k38k93K2K38k4n53p70n09j95k16n07q34r86o67K06J029
54621A72218R55K9p37o87k93k32l52j51L12N87N93O23P22O81M74L48L92M14J90
54602A76086l00q16r68n22K45P45O67J90l48o22k57P72J620J187l62j458j015
54585A74844K07P75N39M60Q65R44J45q52r49P4J407K066J671O41k07l52Q7P17
$$ plain form
54567 183082 184394 186080 187590 188309 188281 188276 188800 189338 189051 187996 187163 187321 188341 189627 190728 191343 191243
54550 191243 190531 189713 189216 189043 189030 189162 189375 189422 189342 189738 191040 192673 193623 193840 194421 196188 198726 201130
54532 201130 203094 204747 205942 206409 206438 206691 207378 208131 208707 209244 209751 209889 209504 209003 208940 209457 210244 210859
54514 210859 211004 210783 210698 211097 211590 211388 210276 208848 207670 206694 205720 204949 204644 204620 204476 204125 203742 203335
54496 203335 202809 202332 202220 202383 202184 201071 199252 197649 197137 197812 199096 200551 202335 204685 207258 209425
54480 209425 211043 212440 213703 214649 215602 217390 220256 223369 225896 228019 230390 233003 235319 237246 239316
54465 239316 241882 244641 247016 248694 249753 250475 251024 251214 250735 249706 248712 248152 247901 247837 248240 249304 250624
54448 250624 251619 252167 252349 251853 250192 247386 244003 240672 237876 235952 234748 233468 231430 228919 226865
$$ packed form
54567A83082J312J686J510P19k8nN24N38k87j055q33J58J020J286J101O15j00
54550A91243p12q18m97j73j3J32K13M7q0L96J302J633R50K17N81J767K538K404
54532B01130J964J653J195M67K9K53O87P53N76N37N07J38l85n01o3N17P87O15
54514B10859J45k21q5L99M93k02j112j428j178r76r74p71l05k4j44l51l83m07
54496B03335n26m77j12J63j99j113j819j603n12O75J284J455J784K350K573K167
54480B09425J618J397J263R46R53J788K866L113K527K123K371K613K316J927K070
54465B39316K566K759K375J678J059P22N49J90m79j029r94n60k51o4M03J064J320
54448B50624R95N48J82m96j661k806l383l331k796j924j204j280k038k511k054
$$ plain form
54433 226865 225758 225277 224835 224108 223139 222345 222254 222802 223132 222540 221381 220533 220252 220228 220453 221242 222482 223708
54415 223708 224897 226349 227733 228138 227306 226037 225101 224435 223701 222873 221931 220648 219120 218004 217830 218550
54399 218550 219953 221868 223644 224313 223829 223438 224100 225189 225525 225110 224902 225290 225875 226557 227723 229214 230173
54382 230173 230240 230071 230243 230345 229718 228532 227550 227128 227071 227203 227455 227463 226711 225269 223957 223478 223669 223829 223592
54363 223592 223169 222878 222771 222760 222833 223020 223315 223704 224108 224268 223922 223227 222795 223002 223403 223150 222008 220655 219900
54344 219900 219865 220088 220181 220078 219711 218819 217281 215466 213998 213139 212573 211875 210997 210133 209302 208407 207613 207274
54326 207274 207354 207205 206166 204222 201980 200184 199294 199232 199313 198713 197275 195756 195025 195188 195657 195875 195785 195796
54308 195796 196547 198480 201353 204309 206634 208256 209388 210059 210309 210444 210602 210413 209576 208493 207736 207197
$$ packed form
54433B26865j107m81m42p27r69p94r1N48L30n92j159q48k81k4K25P89J240J226
54415B23708J189J452J384M05q32j269r36o66p34q28r42j283j528j116j74P20
54399B18550J403J915J776O69m84l91O62J089L36m15k08L88N85O82J166J491R59
54382B30173O7j69J72J02o27j186r82m22n7J32K52Qp52j442j312m79J91J60k37
54363B23592m23k91j07j1P3J87K95L89M04J60l46o95m32K07M01k53j142j353p55
54344B19900l5K23R3j03l67q92j538j815j468q59n66o98q78q64q31q95p94l39
54326B07274Q0j49j039j944k242j796q90o2Q1o00j438j519p31J63M69K18r0J1
54308A95796P51J933K873K956K325J622J132O71K50J35J58j89q37j083p57n39
$$ plain form
54292 207197 206414 205543 205156 205134 204641 203338 201835 200720 199913 199338 199426 200365 201430 201738 201299 200730 200222 199438
54274 199438 198275 197126 196292 195627 194894 194159 193668 193520 193547 193439 192978 192293 191899 192325 193647 195345 196636
54257 196636 197005 196541 195833 195497 195746 196390 197137 197795 198256 198504 198639 198752 198786 198639 198391 198239 198203 198029 197505
54238 197505 196760 196179 195987 195922 195414 194266 193068 192627 192994 193431 193452 193368 193540 193637 193140 192178 191314 190773 190472
54219 190472 190502 190925 191269 190963 190213 189791 189954 190239 190327 190391 190483 190257 189600 188985 188941 189563 190608 191682 192285 192194
54199 192194 191815 191674 191673 191434 191203 191511 192002 191653 190364 189216 188780 188283 187064 185773 185272 185189 184637 183800
54181 183800 183736 184907 186781 188675 190190 191001 191019 190752 190831 191207 191370 191268 191461 192316 193466 194122 193694 192307
54163 192307 190957 190814 191985 193289 193665 193363 193220 193264 192879 192042 191446 191354 191232 190785 190635 191515 193251 194984
$$ packed form
54292B07197p83q71l87k2m93j303j503j115q07n75Q8R39J065L08m39n69n08p84
54274A99438j163j149q34o65p33p35m91j48K7j08m61o85l94M26J322J698J291
54257A96636L69m64p08l36K49O44P47O58M61K48J35J13L4j47k48j52l6j74n24
54238A97505p45n81j92o5n08j148j198m41L67M37K1q4J72R7m97r62q64n41l01
54219A90472L0M23L44l06p50m22J63K85Q8O4R2k26o57o15m4O22J045J074O03r1
54199A92194l79j41jk39k31L08M91l49j289j148m36m97j219j291n01q3n52q37
54181A83800o4J171J874J894J515Q11J8k67P9L76J63j02J93Q55J150O56m28j387
54163A92307j350j43J171J304L76l02j43M4l85q37n96r2j22m47j50Q80J736J733
$$ plain form
54145 194984 196200 197167 198351 199638 200323 199930 198896 198147 198033 198097 197944 197729 197550 196946 195565 193935 192979
54128 192979 193009 193649 194471 195210 195605 195561 195317 195035 194473 193478 192498 192055 192023 192007 192114 192708 193682 194689 195852
54109 195852 197486 199292 200618 201423 202178 202837 202786 201922 200986 200627 200744 200901 200754 199966 198437 196748 195723
54092 195723 195359 194846 193860 193080 193125 193627 193744 193102 191933 190753 190170 190526 191455 192263 192822 193525 194295 194515
54074 194515 194260 194698 196629 199325 201483 202734 203516 204071 204425 204985 206137 207332 207423 206011 203888 202074
54058 202074 200922 200232 199689 199036 198223 197557 197423 197751 198027 197942 197827 198357 199907 202198 204412 205742 206044
54041 206044 205970 206334 207404 208944 210796 213136 216096 219362 222290 224435 225982 227659 230106 233381 237203
54026 237203 241565 246701 252329 257459 261408 264739 268565 272986 276753 278757 279436 280367 282590 285642 288200
$$ packed form
54145A94984J216R67J184J287O85l93j034p49j14O4j53k15j79o04j381j630r56
54128A92979L0O40Q22P39L95m4k44k82n62r95r80m43l2j6J07N94R74J007J163
54109A95852J634J806J326Q05P55O59n1q64r36l59J17J57j47p88j529j689j025
54092A95723l64n13r86p80M5N02J17o42j169j180n83L56R29Q08N59P03P70K20
54074A94515k55M38J931K696K158J251P82N55L54N60J152J195R1j412k123j814
54058B02074j152o90n43o53q13o66j34L28K76q5j15N30J550K291K214J330L02
54041B06044p4L64J070J540J852K340K960L266K928K145J547J677K447L275L822
54026B37203M362N136N628N130L949L331L826M421L767K004O79R31K223L052K558
$$ plain form
54011 288200 289356 289189 288346 287397 286574 285767 284620 282824 280554 278477 277048 275957 274603 272987 271711
53996 271711 271085 270686 269949 268769 267265 265349 262910 260262 258064 256830 256637 257204 258027 258595 258732 258768 259298
53979 259298 260833 263723 268168 274109 281267 289490 299030 310400 324140 340818 360959 384482 410043
53966 410043 434891 455382 467884 469909 461167 443798 421421 397606 374811 354129 335672 319309
53954 319309 305230 293855 285192 278653 273656 270147 268235 267534 267276 266980 266671 266477 266331 266100 265743 265362
53938 265362 265307 266173 268277 271055 273319 274339 274505 274780 275747 277318 279121 280840 282264 283309 284071 284746
53922 284746 285474 286359 287555 289117 290743 291970 292828 294160 297022 301709 307461 313086 317795 321513 324643
53907 324643 327643 330710 333824 337153 341318 346952 353872 360895 366704 370742 373221 374503 374799 374353 373555
$$ packed form
54011B88200J156j67q43r49q23q07j147j796k270k077j429j091j354j616j276
53996B71711o26l99p37j180j504j916k439k648k198j234j93N67Q23N68J37L6N30
53979B59298J535K890M445N941P158Q223R540J1370J3740J6678K0141K3523K5561
53966D10043K4848K0491J2502K025q742j7369k2377k3815k2795k0682j8457j6363
53954C19309j4079j1375q663o539m997l509j912p01k58k96l09j94j46k31l57l81
53938B65362n5Q66K104K778K264J020J66K75R67J571J803J719J424J045P62O75
53922B84746P28Q85J196J562J626J227Q58J332K862M687N752N625M709L718L130
53907C24643L000L067L114L329M165N634O920P023N809M038K479J282K96m46p98
$$ plain form
53892 373555 372746 371998 371128 369874 368137 366060 363779 361073 357540 353162 348374 343436 338147 332490 327079
53877 327079 322446 318279 314008 309875 306617 304155 301461 297945 294241 291243 288973 286844 284591 282466
53863 282466 280764 279502 278384 276850 274386 271015 267261 263542 259888 256457 253878 252773 253149 254369
53849 254369 255423 255217 253253 250400 248480 248527 249815 251010 251843 253017 254807 256556 257568 257858 257855 257827 257743
53832 257743 257406 256602 255346 254003 252921 251981 250743 249017 247080 245352 244096 243363 243054 243041 243356 244122
53816 244122 245167 245918 245995 245726 245777 246349 247035 247375 247303 247152 247466 248751 251157 254479 258614 263784 270132
53799 270132 277394 285345 294332 304898 317088 330581 345378 361795 379698 398011 414918 428270
53787 428270 436205 438072 434827 428099 418899 407710 395555 384038 374144 365711 358396 352481 348287
$$ packed form
53892C73555q09p48q70j254j737k077k281k706l533m378m788m938n289n657n411
53877C27079m633m167m271m133l258k462k694l516l704k998k270k129k253k125
53863B82466j702j262j118j534k464l371l754l719l654l431k579j105L76J220
53849B54369J054k06j964k853j920M7J288J195Q33J174J790J749J012K90lk8q4
53832B57743l37q04j256j343j082r40j238j726j937j728j256p33l09j3L15P66
53816B44122J045P51P7k69N1N72O86L40p2j51L14J285K406L322M135N170O348
53799B70132P262P951Q987J0566J2190J3493J4797J6417J7903J8313J6907J3352
53787D28270P935J867l245o728r200j1189j2155j1517r894q433p315n915m194
$$ plain form
53774 348287 345388 343000 340862 339164 337765 335999 333305 329758 325893 322087 318159 313641 308550 303748
53760 303748 300156 297676 295367 292767 290491 289251 288820 288473 288111 288351 289591 291540 293727 296044 298604
53745 298604 301329 303930 306145 307783 308485 307622 304646 299655 293515 287339 281880 277436 274040 271484 269304
53730 269304 267129 265048 263408 262368 261951 262339 263586 265086 265914 265834 265419 265108 264799 264613 265295 267298 270012
53713 270012 272453 274332 275869 277081 278038 279442 281948 284883 286525 285903 283746 281480 280013 279764 281112
53698 281112 284139 288203 292323 295905 298773 300707 301384 300798 299491 298274 297840 298516 300140 302128 303820
53683 303820 304908 305518 305955 306354 306572 306408 305940 305585 305686 306093 306373 306418 306564 306997 307308 306927 305842 304612
53665 304612 303752 303375 303433 303993 305112 306573 307868 308469 308162 307296 306662 306871 307721 308346 308121 307216 306145 305005
$$ packed form
53774C48287k899k388k138j698j399j766k694l547l865l806l928m518n091m802
53760C03748l592k480k309k600k276j240m31l47l62K40J240J949K187K317K560
53745B98604K725K601K215J638P02q63k976m991o140o176n459m444l396k556k180
53730B69304k175k081j640j040m17L88J247J500Q28q0m15l11l09j86O82K003K714
53713B70012K441J879J537J212R57J404K506K935J642o22k157k266j467k49J348
53698B81112L027M064M120L582K868J934O77n86j307j217m34O76J624J988J692
53683C03820J088O10M37L99K18j64m68l55J01M07K80M5J46M33L11l81j085j230
53665C04612q60l77N8N60J119J461J295O01l07q66o34K09Q50O25k25r05j071j140
$$ plain form
53647 305005 303570 301967 300759 300212 299966 299648 299436 299633 300040 300288 300566 301396 302669 303572 303678 303520 303705
53630 303705 303980 303763 303240 303242 304097 305242 306102 306837 307966 309642 311628 313738 316019 318609 321638 325126
53614 325126 328767 331915 334092 335539 337111 339529 342833 346581 350422 354305 358146 361504 363847 365165
53600 365165 366128 367460 369279 371238 373235 375655 378765 382076 384542 385395 384755 383484 382415 381628 380479
53585 380479 378451 375930 373900 372866 372400 371835 371030 370168 369180 367867 366453 365517 365273 365308 365177 364883 364586
53568 364586 364150 363301 362071 360802 359752 358915 358227 357689 357246 356715 355942 355034 354347 354238 354853 356129 357944
53551 357944 360199 362782 365517 368243 370815 372971 374390 375104 375844 377630 380951 385477 390601 396003 401572
53536 401572 407099 412320 417161 421749 426309 431209 436915 443653 451196 459231 467861 477520 488479 500612
$$ packed form
53647C05005j435j603j208n47k46l18k12J97M07K48K78Q30J273R03J06j58J85
53630C03705K75k17n23KQ55J145Q60P35J129J676J986K110K281K590L029L488
53614C25126L641L148K177J447J572K418L304L748L841L883L841L358K343J318
53600C65165R63J332J819J959J997K420L110L311K466Q53o40j271j069p87j149
53585C80479k028k521k030j034m66n65q05q62r88j313j414r36k44L5j31k94k97
53568C64586m36q49j230j269j050q37o88n38m43n31p73r08o87j09O15J276J815
53551C57944K255K583K735K726K572K156J419P14P40J786L321M526N124N402N569
53536D01572N527N221M841M588M560M900N706O738P543Q035Q630R659J0959J2133
$$ plain form
53522 500612 513541 526773 539877 552881 566467 581416 597871 615403 633771 653181 673878
53511 673878 695911 719401 744490 770886 797923 825305 853216 881396 908695 934131 957946
53500 957946 980998 1003442 1024825 1045307 1065886 1087201 1108861 1130303 1151716 1173613 1195891
53489 1195891 1217826 1238906 1259325 1279721 1300589 1321802 1342565 1362009 1379937 1396810 1412914
53478 1412914 1427965 1441733 1454656 1467357 1479854 1491714 1502761 1512982 1521767 1527951 1530921 1531229
53466 1531229 1529783 1526755 1521555 1513585 1502687 1489111 1473443 1456393 1438229 1418473 1396586 1372913
53454 1372913 1348533 1324057 1299008 1272597 1244708 1215836 1186498 1157229 1128998 1102904 1079252
53443 1079252 1057294 1036079 1015271 994960 975101 955603 936807 919468 904182 891067 879969
$$ packed form
53522E00612J2929J3232J3104J3004J3586J4949J6455J7532J8368J9410K0697
53511F73878K2033K3490K5089K6396K7037K7382K7911K8180K7299K5436K3815
53500I57946K3052K2444K1383K0482K0579K1315K1660K1442K1413K1897K2278
53489A195891K1935K1080K0419K0396K0868K1213K0763J9444J7928J6873J6104
53478A412914J5051J3768J2923J2701J2497J1860J1047J0221Q785O184K970L08
53466A531229j446l028n200p970j0898j3576j5668j7050j8164j9756k1887k3673
53454A372913k4380k4476k5049k6411k7889k8872k9338k9269k8231k6094k3652
53443A079252k1958k1215k0808k0311j9859j9498j8796j7339j5286j3115j1098
$$ plain form
53432 879969 870707 863101 857061 852759 850438 849932 850652 852316 855514 861218 869675 880044 891245 903139
53418 903139 916790 933571 953897 976763 1000546 1024347 1048572 1074242 1101871 1131126 1161483
53407 1161483 1192935 1225893 1260501 1296308 1332779 1370062 1409082 1450794 1495529 1543196 1593931
53396 1593931 1648071 1705395 1764757 1824777 1884775 1944829 2005169 2065855 2126933 2188500 2250497
53385 2250497 2312654 2374595 2435721 2494986 2551146 2603308 2651056 2694105 2732290 2765997 2796133
53374 2796133 2823345 2847553 2868476 2886116 2900359 2910554 2916152 2917524 2915395 2909465 2898179 2879938
53362 2879938 2853915 2819626 2776519 2724526 2664633 2598533 2528070 2455273 2382252 2310252 2239021
53351 2239021 2167822 2097012 2028034 1961832 1898023 1835749 1774722 1715006 1656351 1598347 1541047
$$ packed form
53432H79969r262p606o040m302k321n06P20J664L198N704Q457J0369J1201J1894
53418I03139J3651J6781K0326K2866K3783K3801K4225K5670K7629K9255L0357
53407A161483L1452L2958L4608L5807L6471L7283L9020M1712M4735M7667N0735
53396A593931N4140N7324N9362O0020N9998O0054O0340O0686O1078O1567O1997
53385B250497O2157O1941O1126N9265N6160N2162M7748M3049L8185L3707L0136
53374B796133K7212K4208K0923J7640J4243J0195N598J372k129n930j1286j8241
53362B879938k6023l4289m3107n1993n9893o6100p0463p2797p3021p2000p1231
53351B239021p1199p0810o8978o6202o3809o2274o1027n9716n8655n8004n7300
$$ plain form
53340 1541047 1484884 1430084 1376652 1325006 1276051 1230312 1187338 1146394 1107607 1071935 1039945
53329 1039945 1011108 984570 960266 938826 920625 905463 893132 883620 876527 870854 865789 861335
53317 861335 857817 855162 853237 852542 853843 857199 862018 868086 875738 884846 894429 903861 913952 926158
53303 926158 940948 957539 975146 993893 1014386 1036872 1061016 1086329 1112585 1139950 1168794
53292 1168794 1199240 1230854 1262830 1294616 1326333 1358556 1391676 1425423 1458898 1491036 1520993
53281 1520993 1548179 1572094 1592475 1609698 1624771 1638599 1651248 1662082 1670514 1676384 1679629 1679984
53269 1679984 1677301 1671964 1664588 1655287 1643544 1628902 1611480 1591576 1569036 1543426 1514747 1483591
53257 1483591 1450633 1416308 1381008 1345061 1308303 1270181 1230654 1190622 1151187 1112794 1075549
$$ packed form
53340A541047n6163n4800n3432n1646m8955m5739m2974m0944l8787l5672l1990
53329A039945k8837k6538k4304k1440j8201j5162j2331r512p093n673n065m454
53317H61335l518k655j925o95J301L356M819O068P652R108R583R432J0091J2206
53303I26158J4790J6591J7607J8747K0493K2486K4144K5313K6256K7365K8844
53292A168794L0446L1614L1976L1786L1717L2223L3120L3747L3475L2138K9957
53281A520993K7186K3915K0381J7223J5073J3828J2649J0834Q432N870L245L55
53269A679984k683n337p376r301j1743j4642j7422j9904k2540k5610k8679l1156
53257A483591l2958l4325l5300l5947l6758l8122l9527m0032l9435l8393l7245
$$ plain form
53246 1075549 1039907 1006411 974960 944973 916191 888704 862271 836241 810150 783779 756693
53235 756693 728610 700394 673829 649942 628165 607489 587751 569352 552379 536763 522873
53224 522873 511185 501517 493121 485400 478156 471365 465130 459570 454394 448902 442807 436717 431352 426709
53210 426709 422454 418634 415274 411750 407488 403002 399278 396282 393085 389435 386103 383467 380800 377403
53196 377403 373525 369648 365701 361688 358361 356428 355459 354352 352617 350516 348128 345128 341588 338301
53182 338301 335935 334222 332280 329609 326601 324135 322764 322261 321862 320901 319209 317040 314842 313095 312076
53167 312076 311559 310865 309393 307109 304516 302289 300964 300698 301094 301389 301060 300315 299880 300311 301560 303132
53151 303132 304524 305436 305723 305298 304219 302789 301383 300101 298724 297111 295497 294263 293536 293160 292917 292618
$$ packed form
53246A075549l5642l3496l1451k9987k8782k7487k6433k6030k6091k6371k7086
53235G56693k8083k8216k6565k3887k1777k0676j9738j8399j6973j5616j3890
53224E22873j1688r668q396p721p244o791o235n560n176n492o095o090n365m643
53210D26709m255l820l360l524m262m486l724k996l197l650l332k636k667l397
53196C77403l878l877l947m013l327j933r69j107j735k101k388l000l540l287
53182C38301k366j713j942k671l008k466j371n03l99r61j692k169k198j747j019
53167C12076n17o94j472k284k593k227j325k66L96K95l29p45m35M31J249J572
53151C03132J392R12K87m25j079j430j406j282j377j613j614j234p27l76k43k99
$$ plain form
53135 292618 292127 291534 291229 291527 292217 292594 291922 289915 286998 284241 282693 282445 282568 282241 281627 281305 281241 280949
53117 280949 280425 280214 280579 281265 282075 283011 283779 283857 283251 282545 281990 281176 279878 278577 277676 276791 275328 273338
53099 273338 271294 269338 267286 265144 263190 261699 260923 261079 261944 262732 262819 262443 262295 262580 262913 263052 263257
53082 263257 263874 264885 265977 266861 267448 267787 267801 267174 265735 264026 263114 263547 264711 265463 265288 264621 264229
53065 264229 264507 265199 265615 265243 264308 263581 263506 263731 263663 263217 262816 262832 263237 263631 263543 262952 262505 262829 263571 263681
53045 263681 262836 261912 261692 261820 261614 261298 261561 262297 262699 262488 262173 262038 261670 260713 259472 258476 257881 257549
53027 257549 257381 257320 257216 256816 255854 254224 252277 250750 250101 250037 250011 249981 250193 250380 249804 248328 246931 246857 248364
53008 248364 250457 251727 251489 250228 248958 248219 247932 248229 249738 252540 255350 256534 255792 254217 252834
$$ packed form
53135B92618m91n93l05K98O90L77o72k007k917k757j548k48J23l27o14l22o4k92
53117B80949n24k11L65O86Q10R36P68P8o06p06n55q14j298j301r01q85j463j990
53099B73338k044j956k052k142j954j491p76J56Q65P88Q7l76j48K85L33J39K05
53082B63257O17J011J092Q84N87L39J4o27j439j709r12M33J164P52j75o67l92
53065B64229K78O92M16l72r35p27p5K25o8m46m01J6M05L94q8n91m47L24P42J10
53045B63681q45r24k20J28k06l16K63P36M02k11l15j35l68r57j241r96n95l32
53027B57549j68o1j04m00r62j630j947j527o49o4k6l0K12J87n76j476j397p4J507
53008B48364K093J270k38j261j270p39k87K97J509K802K810J184p42j575j383
$$ plain form
52993 252834 251808 250967 250249 249444 248266 246989 246417 246869 247734 248310 248610 248983 249481 250002 250691 251638 252445 252568
52975 252568 252059 251566 251573 251841 251685 250769 249600 249117 249673 250608 251075 251104 251413 252356 253626 254977 256547 258240
52957 258240 259451 259761 259461 259025 258460 257551 256332 254902 253126 251037 249248 248435 248510 248717 248505 247920 247195
52940 247195 246380 245428 244364 243287 242341 241702 241421 241259 240783 239676 237994 236274 235328 235669 236986 238364
52924 238364 239108 239167 238746 237928 236904 236188 236165 236617 237034 237279 237602 238136 238772 239494 240436 241476 242085 241778 240642
52905 240642 239364 238764 239195 240199 240769 240219 238868 237756 237621 238321 239324 240520 242278 244706 247231 249171
52889 249171 250589 252263 254755 257799 260692 262985 264507 265024 264303 262525 260265 258016 255919 253895 251810
52874 251810 249603 247543 246270 246096 246283 245507 243237 240340 238182 237419 237754 238504 239151 239600 240158 241106 242321
$$ packed form
52993B52834j026q41p18q05j178j277n72M52Q65N76L00L73M98N21O89R47Q07J23
52975B52568n09m93PK68j56r16j169m83N56R35M67K9L09R43J270J351J570J693
52957B58240J211L10l00m36n65r09j219j430j776k089j789q13P5K07k12n85p25
52940B47195q15r52j064j077r46o39k81j62m76j107j682j720r46L41J317J378
52924B38364P44N9m21q18j024p16k3M52M17K45L23N34O36P22R42J040O09l07j136
52905B40642j278o00M31J004N70n50j351j112j35P00J003J196J758K428K525J940
52889B49171J418J674K492L044K893K293J522N17p21j778k260k249k097k024k085
52874B51810k207k060j273j74J87p76k270k897k158p63L35P50O47M49N58R48J215
$$ plain form
52857 242321 243485 244556 245600 246266 246121 245603 245940 247743 250285 252611 254702 256902 258721 259094 257697
52842 257697 255267 252562 249634 246213 242299 238208 234385 231306 229299 228314 227967 227821 227568 227142 226862 227282
52826 227282 228628 230560 232723 235261 238403 241791 244706 246811 248205 248903 248834 248306 247897 247811 247897 248402 250118
52809 250118 253587 258683 265301 273841 284408 295693 305179 310531 310707 306041 297791 287655 277285
52796 277285 267851 259907 253557 248660 244880 241737 238794 235960 233533 231858 230921 230390 230001 229641 228998
52781 228998 227535 225165 222706 221189 220794 220865 220987 221541 223028 225226 227329 228739 229474 229955 230620 231676
52765 231676 233008 234285 235187 235532 235292 234669 234152 234254 235041 236040 236717 236945 236968 237059 237288 237485 237335 236600 235352
52746 235352 233938 232695 231776 231260 231230 231693 232548 233721 235146 236528 237339 237312 236875 236847 237633 238833 239721 240048
$$ packed form
52857B42321J164J071J044O66j45n18L37J803K542K326K091K200J819L73j397
52842B57697k430k705k928l421l914m091l823l079k007r85l47j46k53m26k80M20
52826B27282J346J932K163K538L142L388K915K105J394O98o9n28m09q6Q6N05J716
52809B50118L469N096O618Q540J0567J1285R486N352J76m666q250j0136j0370
52796B77285r434p944o350m897l780l143k943k834k427j675r37n31l89l60o43
52781B28998j463k370k459j517l95P1J22N54J487K198K103J410P35M81O65J056
52765B31676J332J277R02L45k40o23n17J02P87R99O77K28K3R1K29J97j50p35j248
52746B35352j414j243r19n16l0M63Q55J173J425J382Q11k7m37k8P86J200Q88L27
$$ plain form
52728 240048 240371 241593 244138 247446 250262 251574 251476 251124 251702 253237 254497 254170 252112 249255 246373 243360
52712 243360 239911 236496 234141 233237 233020 232441 231283 230199 229766 229773 229523 228726 227885 227700 228203 228730 228794 228667
52694 228667 228897 229526 230169 230671 231193 231673 231710 231167 230494 230221 230423 230916 231619 232426 232946 232870 232569 232950 234569
52675 234569 237039 239353 240694 240982 240876 241277 242626 244531 246141 246952 247173 247337 247728 248289 248940 249740 250687
52658 250687 251510 251838 251576 251037 250590 250244 249724 249042 248809 249816 252267 255561 258840 261552 263393 263958 262844
52641 262844 260268 257318 255248 254409 253975 252825 250724 248600 247704 248523 250545 252956 255419 258148 261496
52626 261496 265697 270843 276689 282314 286347 287801 286618 283301 278377 272506 266780 262262 259162 256860
52612 256860 254813 253042 251689 250664 249971 249972 250894 252350 253749 255006 256413 257956 259260 260283 261605
$$ packed form
52728B40048L23J222K545L308K816J312r8l52N78J535J260l27k058k857k882l013
52712B43360l449l415k355r04k17n79j158j084m33Pk50p97q41j85N03N27O4j27
52694B28667K30O29O43N02N22M80L7n43o73k73K02M93P03Q07N20p6l01L81J619
52675B34569K470K314J341K88j06M01J349J905J610Q11K21J64L91N61O51Q00R47
52658B50687Q23L28k62n39m47l46n20o82k33J007K451L294L279K712J841N65j114
52641B62844k576k950k070q39m34j150k101k124q96Q19K022K411K463K729L348
52626B61496M201N146N846N625M033J454j183l317m924n871n726m518l100k302
52612B56860k047j771j353j025o93JR22J456J399J257J407J543J304J023J322
$$ plain form
52597 261605 263735 266343 268481 269519 269608 269175 268208 266373 263841 261614 260692 261061 261808 262141 261908 261224 260159
52580 260159 258977 258133 257676 257056 255913 254740 254389 255173 256816 258960 261186 262797 263288 263009 262822 262966
52564 262966 262793 261771 260301 259265 259040 259217 259131 258525 257753 257397 257623 257992 258038 257895 258035 258480 258674 258215
52546 258215 257397 256899 257138 258009 259065 259871 260321 260594 260694 260251 259089 257825 257443 258270 259754 261263 262612
52529 262612 263826 264900 265993 267347 268752 269530 269381 268866 268721 269018 269361 269568 269746 269928 270113 270494 271254
52512 271254 272267 273422 275104 277836 281384 284652 286692 287542 287966 288603 289520 290341 290560 289829 288179 286012
52496 286012 283780 281684 279775 278306 277733 278206 279150 279703 279605 279386 279517 279706 279356 278501 277775 277539 277554 277598
52478 277598 277904 278756 280071 281661 283498 285382 286663 286820 286200 285790 286250 287408 288637 289463 289843 290135
$$ packed form
52597B61605K130K608K138J038Q9m33r67j835k532k227r22L69P47L33k33o84j065
52580B60159j182q44m57o20j143j173l51P84J643K144K226J611M91k79j87J44
52564B62966j73j022j470j036k25J77q6o06p72l56K26L69M6j43J40M45J94m59
52546B58215q18m98K39Q71J056Q06M50K73J00m43j162j264l82Q27J484J509J349
52529B62612J214J074J093J354J405P78j49n15j45K97L43K07J78J82J85L81P60
52512B71254J013J155J682K732L548L268K040Q50M24O37R17Q21K19p31j650k167
52496B86012k232k096j909j469n73M73R44N53r8k19J31J89l50q55p26k36J5M4
52478B77598L06Q52J315J590J837J884J281J57o20m10M60J158J229Q26L80K92
$$ plain form
52462 290135 290779 291865 293084 294240 295621 297560 299775 301508 302286 302165 301258 299429 296644 293264 289815
52447 289815 286634 283942 281984 280873 280366 280038 279652 279190 278688 278256 278223 278925 280145 281010 280629 278861 276359
52430 276359 273969 272244 271412 271459 272055 272644 272819 272581 272127 271567 270996 270628 270583 270599 270290 269688 269249 269315 269816
52411 269816 270570 271574 272912 274586 276507 278472 280157 281474 282972 285573 289773 295412 302297 310515
52397 310515 319804 328998 336570 341547 343548 342341 337992 331461 324421 318207 313157 309011 305589 302912
52383 302912 300890 299224 297635 296136 295025 294530 294432 294215 293653 293105 293038 293496 294335 295735 298089 301387 305104
52366 305104 308677 311754 313976 315038 315125 314871 314597 313914 312354 310140 307986 306390 305479 305369 306137 307441
52350 307441 308569 309070 309124 309140 309245 309303 309241 309123 309020 309014 309245 309785 310500 311234 312111 313436 315227 317041 318411
$$ packed form
52462B90135O44J086J219J156J381J939K215J733P78j21r07j829k785l380l449
52447B89815l181k692j958j111n07l28l86m62n02m32l3P02J220Q65l81j768k502
52430B76359k390j725q32M7N96N89J75k38m54n60n71l68m5J6l09o02m39O6N01
52411B69816P54J004J338J674J921J965J685J317J498K601M200N639O885Q218
52397C10515R289R194P572M977K001j207m349o531p040o214n050m146l422k677
52383C02912k022j666j589j499j111m95r8k17n62n48o7M58Q39J400K354L298L717
52366C05104L573L077K222J062Q7k54k74o83j560k214k154j596r11j10P68J304
52350C07441J128N01N4J6J05N8o2j18j03oK31N40P15P34Q77J325J791J814J370
$$ plain form
52331 318411 319373 320474 322295 325049 328559 332543 336938 342010 348141 355471 363719 372264 380330 387231
52317 387231 392709 397074 400818 404062 406569 408266 409393 410082 410201 409830 409467 409505 409947 411003 413378 417317
52301 417317 421812 425553 428502 431637 435306 438811 441733 444577 447685 450449 452200 453052 453212 452145 449372
52286 449372 445624 442307 440051 438550 437547 437074 436852 436389 435835 435983 437216 439056 440941 442799 444640
52271 444640 446265 447797 449991 453461 457894 462423 466586 470534 474477 478372 482192 486192 490777 496107
52257 496107 501795 506952 510715 512924 514326 516032 518739 522383 526403 530278 533844 537163 540112 542276
52243 542276 543327 543382 542837 542005 541128 540629 540998 542421 544761 547864 551622 555688 559517 562861 566022 569478
52227 569478 573435 577809 582404 586914 590967 594415 597549 600880 604697 608923 613293 617569 621545 625049
$$ packed form
52331C18411R62J101J821K754L510L984M395N072O131P330Q248Q545Q066O901
52317C87231N478M365L744L244K507J697J127O89J19l71l63L8M42J056K375L939
52301D17317M495L741K949L135L669L505K922K844L108K764J751Q52J60j067k773
52286D49372l748l317k256j501j003m73k22m63n54J48J233J840J885J858J841
52271D44640J625J532K194L470M433M529M163L948L943L895L820M000M585N330
52257D96107N688N157L763K209J402J706K707L644M020L875L566L319K949K164
52243E42276J051N5n45q32q77m99L69J423K340L103L758M066L829L344L161L456
52227E69478L957M374M595M510M053L448L134L331L817M226M370M276L976L504
$$ plain form
52213 625049 628191 631645 636381 642760 649924 656457 661786 666563 671566 676764 681802 686853 692233 697465
52199 697465 701604 704581 707455 711062 715017 718453 721287 724296 728233 733238 738926 744652 749838 754318
52185 754318 758372 762238 765710 768304 769689 769780 768590 766150 762509 757763 752270 746836 742293 738759 735577
52170 735577 732242 728987 726196 723630 720776 717780 715473 714406 714286 714451 714572 714774 715350 716474 718006
52155 718006 719469 720432 720955 721492 722206 722645 722291 721316 720528 720561 721407 722894 725364 729448 735023 740723 744824
52138 744824 746560 746392 745145 743304 741142 738968 736846 734326 730924 726908 723338 721300 721154 722447 724381
52123 724381 726462 728947 732653 738108 744918 752124 759126 765936 772560 778561 783479 787367 790533 792946
52109 792946 794344 794904 795330 796089 796965 797670 798552 800219 802652 805312 808191 812196 818243 826361 835978 846688
$$ packed form
52213F25049L142L454M736O379P164O533N329M777N003N198N038N051N380N232
52199F97465M139K977K874L607L955L436K834L009L937N005N688N726N186M480
52185G54318M054L866L472K594J385R1j190k440l641m746n493n434m543l534l182
52170G35577l335l255k791k566k854k996k307j067j20J65J21K02N76J124J532
52155G18006J463R63N23N37P14M39l54r75p88L3Q46J487K470M084N575N700M101
52138G44824J736j68j247j841k162k174k122k520l402m016l570k038j46J293J934
52123G24381K081K485L706N455O810P206P002O810O624O001M918L888L166K413
52109G92946J398N60M26P59Q76P05Q82J667K433K660K879M005O047Q118R617J0710
$$ plain form
52093 846688 858288 870247 881556 890983 897272 899406 897211 891622 883948 875031 865505 856660 850249
52080 850249 847244 847299 849572 853544 858811 864549 869662 873288 875088 875382 875110 875198 875674 875755 874971 873748 872647
52063 872647 871566 870170 868673 867639 867286 867475 868140 869232 870414 871378 872287 873400 874376 874543 873786 872568
52047 872568 871053 868790 865442 861293 856825 852260 847760 843653 840188 837428 835687 835695 837894 841746 846194
52032 846194 850742 855676 861158 866525 870741 873381 874894 875936 876765 877468 878575 881029 885423 891509 898540
52017 898540 905877 913139 920142 927071 934585 943357 953502 964668 976549 988904 1001125 1012286 1021707
52004 1021707 1029027 1033445 1033335 1027165 1014738 997318 976631 954102 930931 908285 886991 867106
51992 867106 848132 829664 811755 794709 778810 764346 751622 740660 731002 722101 713796 706136
$$ packed form
52093H46688J1600J1959J1309R427O289K134k195n589p674q917r526q845o411
52080H50249l005N5K273L972N267N738N113L626J800K94k72Q8M76Q1p84j223j101
52063H72647j081j396j497j034l53J89O65J092J182R64R09J113R76J67p57j218
52047H72568j515k263l348m149m468m565m500m107l465k760j741QK199L852M448
52032H46194M548M934N482N367M216K640J513J042Q29P03J107K454M394O086P031
52017H98540P337P262P003O929P514Q772J0145J1166J1881J2355J2221J1161R421
52004A021707P320M418j10o170j2427j7420k0687k2529k3171k2646k1294j9885
51992H67106j8974j8468j7909j7046j5899j4464j2724j0962r658q901q305p660
$$ [...]
##END NTUPLES=NMR SPECTRUM
##END=
