
##TITLE=AC1367_2285_7221507_Xg8aSAJzSg
##JCAMPDX= 6.0         $$ Bruker NMR JCAMP-DX V2.0
##DATA TYPE= NMR SPECTRUM
##DATA CLASS= NTUPLES
##ORIGIN= BRUKER
##OWNER= Administrator
$$ 1.72 TOPSPIN		Version 2.1
$$ 2012-12-13 21:45:30.698 -0500  Administrator@X
$$ Compression mode = diff/dup
##.OBSERVE FREQUENCY= 400.02188249412
##.OBSERVE NUCLEUS= ^1H
##.ACQUISITION MODE= SIMULTANEOUS (DQD)
##.ACQUISITION SCHEME= undefined
##.AVERAGES= 8
##.DIGITISER RES= 22
##SPECTROMETER/DATA SYSTEM= spect
##.PULSE SEQUENCE= zg30
##.SOLVENT NAME= COFFEE_meoh
##.SHIFT REFERENCE= INTERNAL, COFFEE_meoh, 1, 14.98509
##AUDIT TRAIL= $$ (NUMBER, WHEN, WHO, WHERE, PROCESS, VERSION, WHAT)
$$ ##TITLE= Audit trail, TOPSPIN		Version 2.1
$$ ##JCAMPDX= 5.01
$$ ##ORIGIN= Bruker BioSpin GmbH
$$ ##OWNER= Administrator
$$ $$ E:\/data/COFFEE/nmr/AC1367_2285_7221507_Xg8aSAJzSg/10/pdata/1/auditp.txt
$$ ##AUDIT TRAIL=  $$ (NUMBER, WHEN, WHO, WHERE, PROCESS, VERSION, WHAT)
(   1,<2012-12-13 21:45:22.573 -0500>,<Administrator>,<X>,<go>,<TOPSPIN 2.1>,
      <created by zg
	started at 2012-12-13 21:44:15.636 -0500,
	POWCHK enabled, PULCHK disabled,
       configuration hash MD5:
       86 BA 57 50 F2 9D 5C 9B 26 00 A9 28 5F 66 2E 89
       data hash MD5: 64K
       60 6F 57 ED 46 1F D8 EF 04 FF 00 06 35 77 21 F9>)
(   2,<2012-12-13 21:45:25.636 -0500>,<Administrator>,<X>,<proc1d>,<TOPSPIN 2.1>,
      <Start of raw data processing
       efp LB = 0 FT_mod = 6 PKNL = 1 PHC0 = 0 PHC1 = 0 SI = 32K 
       data hash MD5: 32K
       87 14 F5 7A 4F 9D 7D 7A 96 F3 54 28 76 D6 6A F1>)
(   3,<2012-12-13 21:45:26.105 -0500>,<Administrator>,<X>,<proc1d>,<TOPSPIN 2.1>,
      <pk PHC0 = 97.61353 PHC1 = 0 
       data hash MD5: 32K
       09 4F 12 FB 89 0C 06 27 E4 45 9D 3F 81 B2 DE 03>)
(   4,<2012-12-13 21:45:26.355 -0500>,<Administrator>,<X>,<proc1d>,<TOPSPIN 2.1>,
      <abs ABSG = 1 
       data hash MD5: 32K
       4D 32 C0 A9 4C D3 A9 99 42 E6 7B F8 45 85 E8 87>)
(   5,<2012-12-13 21:45:26.495 -0500>,<Administrator>,<X>,<proc1d>,<TOPSPIN 2.1>,
      <abs ABSG = 2 
       data hash MD5: 32K
       63 95 E2 7D 85 72 A2 4A E5 B4 BD 92 5F 4C A2 78>)
(   6,<2012-12-13 21:45:26.652 -0500>,<Administrator>,<X>,<proc1d>,<TOPSPIN 2.1>,
      <abs ABSG = 3 
       data hash MD5: 32K
       C4 C3 0F 0A AE A1 71 C6 33 0A 6A 23 C1 50 65 22>)
(   7,<2012-12-13 21:45:26.792 -0500>,<Administrator>,<X>,<proc1d>,<TOPSPIN 2.1>,
      <abs ABSG = 4 
       data hash MD5: 32K
       89 5E F4 A0 AE ED B5 84 4D DE B3 2F 73 B7 28 12>)
(   8,<2012-12-13 21:45:26.933 -0500>,<Administrator>,<X>,<proc1d>,<TOPSPIN 2.1>,
      <abs ABSG = 5 
       data hash MD5: 32K
       6D 7D 0C 3F 15 C9 C6 BC B0 0F F4 98 D6 91 E9 BB>)
$$ ##END=
$$ 
$$ $$ hash MD5
$$ $$ 48 E5 34 A9 60 48 BE 0B D3 4F 78 19 0A B8 A5 89
##$RELAX= 
##$RELAX= 
##$RELAX= 
##$RELAX= 
##$RELAX= 
##$RELAX= 
##$RELAX= 
##$RELAX= 
$$ Bruker specific parameters
$$ --------------------------
##$DU= <E:\>
##$EXPNO= 10
##$NAME= <AC1367_2285_7221507_Xg8aSAJzSg>
$$ [...]
150 150 150 150 150 150 150 150
##$TP07= 0
##$TPNAME0= <>
##$TPNAME1= <>
##$TPNAME2= <>
##$TPNAME3= <>
##$TPNAME4= <>
##$TPNAME5= <>
##$TPNAME6= <>
##$TPNAME7= <>
##$TPOAL= (0..7)
0.5 0.5 0.5 0.5 0.5 0.5 0.5 0.5
##$TPOFFS= (0..7)
0 0 0 0 0 0 0 0
##$TUNHIN= 0
##$TUNHOUT= 0
##$TUNXOUT= 0
##$USERA1= <user>
##$USERA2= <user>
##$USERA3= <user>
##$USERA4= <user>
##$USERA5= <user>
##$V9= 5
##$VALIST= <valist>
##$VCLIST= <CCCCCCCCCCCCCCC>
##$VD= 0
##$VDLIST= <DDDDDDDDDDDDDDD>
##$VPLIST= <PPPPPPPPPPPPPPP>
##$VTLIST= <TTTTTTTTTTTTTTT>
##$WBST= 1024
##$WBSW= 4
##$XGAIN= (0..3)
0 0 0 0
##$XL= 0
##$YL= 0
##$YMAX_a= 660829
##$YMIN_a= -561693
##$ZGOPTNS= <>
##$ZL1= 120
##$ZL2= 120
##$ZL3= 120
##$ZL4= 120
##$ABSF1= 14.98509
##$ABSF2= -5.573092
##$ABSG= 5
##$ABSL= 3
##$ALPHA= 0
##$AQORDER= 0
##$ASSFAC= 0
##$ASSFACI= 0
##$ASSFACX= 0
##$ASSWID= 0
##$AUNMP= <proc_prof1d_extract_pilot.lims>
##$AXLEFT= 0
##$AXNAME= <>
##$AXNUC= <1H>
##$AXRIGHT= 0
##$AXTYPE= 0
##$AXUNIT= <>
##$AZFE= 0.1
##$AZFW= 0.1
##$BCFW= 0
##$BC_mod= 0
##$BYTORDP= 0
##$COROFFS= 0
##$CY= 15
##$DATMOD= 1
##$DC= 0
##$DFILT= <>
##$DTYPP= 0
##$F1P= 0
##$F2P= 0
##$FCOR= 0.5
##$FTSIZE= 32768
##$FT_mod= 6
##$GAMMA= 0
##$GB= 0
##$INTBC= 1
##$INTSCL= 1
##$ISEN= 128
##$LB= 0
##$LEV0= 0
##$LPBIN= 0
##$MAXI= 10000
##$MC2= 0
##$MEAN= 0
##$ME_mod= 0
##$MI= 0
##$NCOEF= 0
##$NC_proc= -8
##$NLEV= 6
##$NOISF1= 0
##$NOISF2= 0
##$NSP= 0
##$NTH_PI= 0
##$NZP= 0
##$OFFSET= 14.98509
##$PC= 1
##$PHC0= 97.61353
##$PHC1= 0
##$PH_mod= 1
##$PKNL= yes
##$PPARMOD= 0
##$PPDIAG= 0
##$PPIPTYP= 0
##$PPMPNUM= 2147483647
##$PPRESOL= 1
##$PSCAL= 4
##$PSIGN= 0
##$PYNMP= <proc.py>
##$REVERSE= no
##$SF= 400.02
##$SI= 32768
##$SIGF1= 0
##$SIGF2= 0
##$SINO= 400
##$SIOLD= 32768
##$SPECTYP= <>
##$SREGLST= <1H.CDCl3>
##$SSB= 0
##$STSI= 32768
##$STSR= 0
##$SW_p= 8223.68421052631
##$SYMM= 0
##$S_DEV= 0
##$TDeff= 65536
##$TDoff= 0
##$TI= <>
##$TILT= no
##$TM1= 0
##$TM2= 0
##$TOPLEV= 0
##$USERP1= <user>
##$USERP2= <user>
##$USERP3= <user>
##$USERP4= <user>
##$USERP5= <user>
##$WDW= 1
##$XDIM= 32768
##$YMAX_p= 468918457
##$YMIN_p= -744060
##$CURPLOT= <Network HP LaserJet P1505>
##$CURPRIN= <$Network HP LaserJet P1505>
##$DFORMAT= <normdp>
##$LAYOUT= <+/1D_H.xwp>
##$LFORMAT= <normlp>
##$PFORMAT= <normpl>
##$SURQMSG= 1
$$ End of Bruker specific parameters
$$ ---------------------------------
##NTUPLES= NMR SPECTRUM
##VAR_NAME=  FREQUENCY,     SPECTRUM/REAL,   SPECTRUM/IMAG
##SYMBOL=    X,             R,               I
##VAR_TYPE=  INDEPENDENT,   DEPENDENT,       DEPENDENT
##VAR_FORM=  AFFN,          ASDF,            ASDF
##VAR_DIM=   32768,         32768,           32768
##UNITS=     HZ,            ARBITRARY UNITS, ARBITRARY UNITS
##FACTOR=    0.250966925370066, 1,           1
##FIRST=     8223.43324360094, -21037,       -131309
##LAST=      0,             4514,            -190218
##MIN=       0,             -744060,         0
##MAX=       8223.43324360094, 468918457,    0
$$ Real data points
##PAGE= N=1
##DATA TABLE= (X++(R..R)), XYDATA
$$ [...]
23798 -414382 -95381 -183858 -63431 -54200 389865 60067 -156588 50511 -6237 -101804 -237770
23787 -237770 187426 -121399 -190408 -29225 305394 302220 -184442 229204 -29267 -128526 152535
23775 -11189 89648 -95898 143504 29588 -350384 -208557 111993 -136101 -293302 -435896
23765 -435896 -18441 350990 85297 23362 35655 179800 202744 -8532 24946 167277 -266070
23753 147498 -199075 179190 -108847 67986 -213637 -16889 43491 -17232 -153788 33049
23742 -24670 -77599 110318 -102215 280609 -143319 329790 -95401 53043 35117 -150452
23731 -192538 50634 -187605 164582 27456 358318 37885 268563 30437 31341 133946 -161116
23719 -148379 -168781 -151004 69012 223477 -148328 -116138 -135875 35121 5431 -265225 -273121
23708 -273121 82249 19114 -262225 -366685 16531 122176 207477 152516 190162 206502 -101454
23696 -108795 172089 -130051 -93280 -113671 141889 -33859 -24647 127939 -239511 30820 -28420
23684 -116711 4356 -95832 -69473 331312 -161977 -43237 -182546 -319369 33358 -61039 93698
23672 -74220 49886 -230561 214118 -107072 -40658 242642 -100686 159085 -284348 87136
23661 133582 -44828 196335 -190909 98214 -88201 -3353 111521 -87478 17731 -26186 229044
23649 -215964 97077 -18651 -211439 58203 -35439 -49231 -125793 171393 -260033 -71363 -5339
23637 -22007 -251166 -287203 -215871 -86998 386796 -7417 483017 104076 -129000 126694 251622
23626 251622 314360 -314635 -26455 -43852 -262495 -13811 -235918 97741 -54111 2372 478655
23615 478655 -60581 111783 44878 -44348 -243919 197353 -283773 -181718 321940 226041
23605 226041 255988 -15414 -11079 -16415 -193625 130407 -243470 60618 168459 643594 -86693
23593 -358446 -166701 -286121 -153702 -331238 -203784 -299048 356875 -102669 -54753 -193364
23583 -193364 -115505 404560 -25694 -3107 -195358 215556 -73116 100428 171328 -52154 -82776
23572 -82776 -214164 -217083 5453 -133190 -190511 -74206 -342104 177902 19708 -368258 -11211
23560 -180377 44643 178310 -241544 53781 204644 11591 -137847 -223898 303060 94203
23549 -79998 81132 -173365 -173825 95454 -344352 -78557 -211788 158795 336355 -122919 -23937
23537 -72420 -157124 -97897 143812 -197090 -205145 14085 168461 -64303 96287 -261533 238005
23525 200830 180429 -119416 -282265 153034 163032 -300871 273407 -198627 -155178 -84433
23515 -84433 -132992 -75068 40185 -76512 -349700 -170101 293666 13131 119303 -166756 134638
23503 37231 136556 187909 -132703 -60769 13765 215242 -98531 313345 -187380 257353 137846
23492 137846 -175444 -255317 -41041 -32852 189670 123194 -288641 29458 163577 228386 -153541
23480 -192993 47135 -7002 87958 -200354 -307838 -54683 63439 147745 -240077 263160 25618
23468 -301792 -77523 -98778 -18286 81278 -95057 256836 102036 -218449 120122 171144 72445
23456 418293 -72986 49662 -168298 313104 -134101 98676 176870 -251671 306878 75809
23445 120672 70402 -342671 118709 178434 -20522 -61168 -125399 -170377 -243421 74018 190163
23434 190163 -227104 -73921 61324 29063 -154771 203475 130669 184472 153468 -33824 494
23422 298130 310458 1570 387015 216003 21299 -104693 29090 154770 65217 178784 1972
23410 -120573 -207711 2217 -206838 -51830 -12906 60189 148238 -18399 -290778 241915 -233102
23398 93680 -364963 -96581 16418 71287 -206605 -148492 -157078 416 -103590 -484444 -70325
23386 147314 -22603 -138539 -50068 60981 143007 -32454 -222546 -120659 34801 89887 -264343
23374 -161630 41410 -114892 -236466 -138156 -85517 141723 97150 97162 -233755 -8371 -203815
23363 -203815 -241994 -46801 135597 49384 117565 -66373 14070 -93228 -105485 -7069 -88666
23352 -88666 -104643 109115 -149149 132772 57906 -384138 -129761 -319615 -81830 -88771 -20686
23340 191760 216575 -226264 -96720 40162 -115283 -232600 377479 100145 -245444 -20821
23329 -140102 -206175 -251535 183518 36841 -159273 58431 -213210 -22132 -75663 107412 263984
23318 263984 405593 -115254 -215782 -165348 116013 -31421 -234530 -206794 -95123 51294
23307 188762 -41391 -360011 -27706 67496 171732 -101576 76167 -115000 105356 53648
23297 53648 -97400 -5541 -115623 142947 -53016 39449 -53007 245521 -316855 -147895 -186696
23286 -186696 192347 217457 250051 54601 163676 -99719 38417 -266805 144924 88980 334097
23275 334097 -17706 473864 -320775 16014 -72719 -190969 162060 -76612 4786 218241 -84709
23263 185551 -247113 111251 294951 146308 783 101423 -127973 -1241 -964 -306383 -139150
23251 -37028 -47751 -100273 -256322 340891 -177574 311624 146115 40819 132329 -93052 -126559
23240 -126559 -91457 150572 -276861 349951 -147534 -136517 -4670 52958 135201 138489 -203232
23228 -80537 188656 -227052 63292 -71559 -23922 -142198 -205130 -94734 86386 64574 -49890
23216 216358 5680 235351 -67460 -468094 83811 -198555 -44802 -434029 -133942 30011 -170718
23204 67951 -102044 144800 -136824 49737 203358 123270 -83338 -44210 -274496 21486 187115
23193 187115 -176696 100046 102787 44036 13557 44563 -275529 -247202 -18366 40908 81951
23182 81951 312649 -357527 50975 32225 -279875 -3460 25922 104129 -72722 -550060 156738
23170 -42870 -37042 248794 -144733 58678 -256570 9091 151181 181595 -51797 -291648 19456
23158 63334 -19105 -117923 -51087 96769 21002 -237839 294727 111240 83896 -300839 -24474
23146 -17331 -15481 -50222 92641 -87567 -79488 70617 351385 284968 138470 -209505 -91612
23134 -102196 -77064 -317286 105637 28975 93120 -28748 28150 -270201 157793 34093 331399
23123 331399 23316 -124751 -176723 375104 97917 200938 253436 -166521 -273369 266342
23112 44337 -223406 -12252 -41024 127499 -222597 32247 -85748 235072 -7959 296566 -38617
23100 40089 249696 126763 85928 174749 -78304 167062 -59352 21617 -211850 34481 330088
23089 330088 126701 -333244 -406991 43590 162918 -320056 -138516 94525 -126543 -230384
23079 -230384 -130351 -74369 400917 395140 150454 -72058 -246370 -32589 -169625 171099
23068 -139470 48100 -145305 -118518 333313 254431 -111740 -40621 -242045 -134565 19845
23057 -107983 123319 -205968 214101 -198020 -157238 233381 177802 139923 157302 -41021
23046 -38334 -14211 -240207 85556 -15260 -118534 -228169 81685 -219099 226732 -178012
23035 -10681 -35942 41927 264668 6095 -234122 -244037 55574 62964 -315920 168727 597405
23024 597405 -80495 -146753 150247 202753 297419 192098 -64398 -4503 -190451 243487 -104601
23012 -192671 -90943 -168092 -584152 221833 -2829 20859 -141545 198903 -239189 53354 -99947
23000 147542 -34177 206813 -41287 -77952 110336 -243004 345280 214755 138015 -368664
22989 -301199 -114505 -40870 29262 191090 47717 88871 269889 -51899 -7593 -209644 180061
22977 -204787 28177 -125727 -32002 219811 2148 -161948 306610 27274 -25937 -112723 -142113
22966 -142113 -70348 68335 -90695 -208287 139584 200058 -123942 -207292 -36113 -157598 -164466
22955 -164466 -81165 -114236 4581 -145092 -114917 -255800 18090 -460068 279802 77785 -231477
22943 -60827 -59038 141507 106721 109015 185118 -120885 197309 19142 -515948 -67348 104466
22931 129612 -155702 -158233 -53937 294798 -83955 190937 -14804 4216 -13279 -111342 186168
22919 126626 -38612 -49765 217941 122966 85482 -99660 -9578 -179989 -84594 -19238 194639
22907 -61823 -48870 80355 191361 -270819 -125342 -56767 -59656 103793 -83995 -15378 103391
22895 -102387 -245927 -101627 80978 198568 -273963 -88328 175915 -59526 -10570 151162
22884 38988 -190421 -163674 -78768 -29823 79377 294530 -393680 -98519 74344 -117570 -179821
22873 -179821 41073 -214369 19519 -120919 84084 59433 231753 -49220 29875 117659 -283756
22861 -298436 -208142 -528665 -131302 -368256 -526945 92891 71326 262965 20614 24979 186166
22850 186166 241943 -112747 97711 -194014 -77416 -181549 -34253 -23488 -57103 50535 -61447
22838 -90746 86698 79621 73403 361610 -190530 59960 -59566 -180368 -282462 158939 -224895
22826 255795 51178 -85666 -141451 -202675 -251306 -75624 -21359 140092 116462 97156 34535
22814 98119 -53620 -17398 43583 -164285 -113128 -323652 -241161 500 -265669 -338592 124390
22802 -354016 112534 43984 -32525 -146609 -84585 161672 66859 -256310 9387 -51326 70964
22790 343707 -233789 39093 12977 53944 -49298 -100299 343999 34349 -49972 17204 -206988
22778 -164570 -148508 69713 -254046 397068 409921 184130 -286767 101684 -122883 -123199 198410
22766 -220071 123623 -212654 14044 67720 288011 -109554 34589 185930 17232 -62975
22755 -399056 10775 -521697 -58517 -144596 -129423 65683 -66710 4054 327094 -41426 -143317
22744 -143317 278627 -48142 13161 -352109 -146348 286495 92012 -581903 -102227 -105145
22734 -105145 198010 52576 -164807 31503 -169965 -198996 -345998 -142249 -107732 73087
22723 -41594 -84993 -32949 46513 204010 -161089 -8418 -158071 -251606 48572 -166717 -83946
22712 -83946 -38433 -165953 -160073 333852 -123713 326576 168561 -76759 173394 -30579 17936
22700 73480 -197010 -118289 150726 -201237 8667 -419159 3765 -210267 30742 -391778 383473
22688 231839 89224 -91826 -228498 237366 -107695 -40250 143269 102937 -74344 -31219 -73684
22677 -73684 69589 -19836 -399181 -79464 -227067 -26584 -19742 -65993 -208836 -285658 -275167
22666 -275167 -7471 48544 35317 -291814 -86538 191505 -82519 -91837 286095 -26056 -38776
22655 -38776 -146011 271 -198469 194630 -75979 -46107 -200499 -358591 -120073 75832 366926
22644 366926 -249535 -235966 -61175 -115014 21638 340852 -534014 -110106 76647 -174947
22633 205996 -320367 37801 -62848 158147 -174865 49724 152638 -61255 -50041 113261
22622 -72393 188548 96829 -335526 253888 -249632 -86146 13588 -56932 66511 -129758 -112963
22611 -112963 197186 -195922 120597 -60521 -29962 59047 179642 54357 -376603 -157866
22600 -90330 165010 -125973 270624 -274689 -179392 178558 -25989 113404 -89141 47952
22589 -131994 113606 350005 -29634 -41423 172261 17707 104830 -79809 208903 -248636
22578 -50003 -176570 -179756 -64651 -112894 64895 192526 -14733 5911 209681 -158631 -154247
22567 -154247 -196959 -102736 25999 -451888 63454 -351560 145307 54931 54726 98370 340020
22556 340020 163448 281001 69893 117431 -116222 -158027 -119037 23694 -142231 -100171 -333720
22545 -333720 -263729 151176 54909 -361177 -37441 -533701 43754 2225 -13093 -306129 -142761
22533 -228890 -447792 133892 69914 -440611 377565 417911 -55091 -163227 210438 -274297
22522 -130533 -59230 -80582 75741 -145834 -141825 -180620 89372 385198 76804 -6555 -22248
22511 -22248 89667 55759 -105595 124984 19052 111749 -124850 247296 -89600 235525 -313823
22499 -163981 -78386 59861 -255748 -60944 4207 -27327 46034 -119409 -26350 -28468 369626
22487 282336 -190792 246580 -1169 1802 -158234 182860 -223789 62991 -119160 29658 -48491
22475 -202035 22394 -307108 -331188 -153488 -163506 52994 -19053 148413 64931 164251 -96105
22463 188178 15468 171814 189528 103404 40048 -80017 -250163 -196318 -121627 279945 204142
22452 204142 -156280 210967 -238154 -105045 -323060 107974 -262634 -74576 -345497 132202
22441 -44896 388393 -157973 112022 -285732 16687 -86407 23867 136882 -89723 -200128
22431 -200128 136364 24072 44870 45878 39548 31953 -162536 135064 -142890 173707 112045
22420 112045 159926 -79976 -116462 -3777 -288094 24577 -16679 -60067 222894 -134734 157934
22408 152873 -394684 194537 -174942 -109706 45893 197801 -7836 -204696 77183 112391 -342270
22396 -104008 -69993 -119196 -175547 -210291 -60621 -92482 98038 -175299 23114 -72190 -287257
22385 -287257 213801 294001 88578 -10751 -139929 -73597 -20927 -131402 -157324 -40297 220327
22373 188143 -437031 298980 -135918 -121435 43088 48879 -265396 144617 -195772 -243909
22363 -243909 -158400 -292753 187321 18447 5661 -193402 -62632 256995 -73349 14012 -243772
22351 -49641 104940 -78485 67181 -69697 -159345 35624 -172948 -379299 -97626 -53081 221309
22339 -159427 -9726 156271 -36555 -278963 -333852 -13054 14816 235967 -210837 -75685 -244251
22328 -244251 -144702 -90304 58160 -256853 -55207 30503 155592 -177585 -245452 -133050 -30642
22316 -154009 -132025 56265 145225 -216035 -55209 -32370 121368 -74215 -22634 129227 -110184
22304 48390 -264919 66720 60878 -268131 -193291 134438 108216 89105 58328 -365651 19450
22292 -114254 -159101 -11919 -112206 66896 232509 94560 -174988 -14991 41312 -97906 -239397
22281 -239397 141985 5150 -43252 -78402 -46477 -360371 -222041 -74630 -322839 -126946 -50139
22269 44065 17882 130877 18921 151321 34528 97145 181305 187413 -13522 125495 -59391
22257 62291 -60236 161007 -42101 259798 -20375 8789 -403794 144642 290385 -122646 -171892
22246 -171892 68479 -106726 -178079 -4324 -407950 -70157 -371333 -428170 158766 162200 -93554
22234 62480 103914 231525 -80969 369047 -23008 -61631 93459 250010 -55669 9823 328253
22223 328253 109226 106147 -89856 127033 -152778 173766 194837 -160887 18853 -12307 -1631
22211 135089 -267496 -188164 -203171 -128678 57699 124338 -307448 -115553 43512 21682 -238745
22199 -237102 -40140 -42316 -35576 64784 38425 -145673 -322828 103406 84618 -118301 61506
22187 -208626 -355010 -240106 88905 -236174 -114115 -250537 -481059 97082 176515 326254
22177 326254 81210 -138334 44373 267836 -419051 28639 57231 -45980 -310192 -57388 -151852
22166 -151852 -458377 -55263 -123038 137264 -319244 128429 126638 276713 -126324 -12678
22155 66880 -405933 -121458 -13497 -217936 -44973 104933 113220 -183311 -66447 -157818 208521
22143 -180556 119670 -33518 226102 -283074 -284462 -3790 -262638 222047 -221099 35599 90472
22132 90472 -29901 -193597 -46672 49032 319718 42676 133841 188370 -318575 -74302 -77703
22121 -77703 186351 221180 216032 -110697 -179215 -100840 60823 252395 -226223 105963 51181
22109 113085 146972 90890 -106996 -166216 165499 117415 -195857 -403397 -360582 228262
22098 -75222 -79390 -103797 -456131 -36121 18150 165493 77285 -196855 -280829 69468 -58874
22086 57304 61171 311278 -180154 61619 -19318 78404 109426 -11745 100061 54075 -532 -37674
22074 -37674 342047 -226282 149945 57678 245156 -9496 232562 -376333 -42323 -315998
22064 -315998 -295622 -157117 -279971 107409 269855 21907 -96431 62332 -281410 208470
22053 -125105 -69296 -15434 -40885 32593 -170969 -15836 -208922 -16691 5071 51925 216510
22042 216510 -147482 -71912 -58142 177175 -27252 -212725 129598 -305404 223126 -337694
22031 40887 38904 -91607 11547 -294553 -78843 259025 -277849 -324652 -285564 -60445 -14384
22019 -103111 148775 -103713 -122971 -104099 52363 145492 -136092 397543 -32974 -139645
22009 -139645 26737 -125698 55032 220069 -45010 84356 266372 -317117 -92809 309111
21998 -19470 -324983 -211205 -36424 16985 -95626 19810 -6553 -177509 -250426 -162844 -17357
21986 -22198 6790 -137971 233098 210569 -232947 -48968 160959 -142218 -444940 -198922
21975 -269853 -276639 75036 -316817 55485 194581 41880 426170 -5704 409384 13063 -496070
21963 -6803 -113720 4442 -379377 -271033 -428564 -201982 46129 125521 -91127 -386500 -372864
21952 -372864 -111776 13496 131997 1548 -203121 456169 -339544 17057 -430850 71733
21941 -200242 152319 -61796 60397 35764 40783 51043 -930 -11130 20168 -173451 115463
21929 304873 52569 17257 -281935 -165148 15872 -80785 -399640 -147742 183312 -71192
21918 -191782 147339 45318 27316 77504 -92652 -47928 -76068 -292393 -195584 -125983 -36739
21906 189079 -334914 -287551 1223 127984 199949 -308493 -21554 -130098 93657 78040 46916
21895 46916 112803 -100727 -88623 48814 -361846 -162084 -153815 -184827 -258677 -277172 -218196
21884 -218196 -372037 -203633 -157557 -6284 53723 -162135 -276208 -182711 -161992 -34282 18049
21872 -96769 -172166 -43658 -554928 -410250 -135001 47708 89847 21032 -116500 180467 193813
21861 193813 -113545 -78463 -217618 -202809 -87113 -38940 -202245 39048 -208126 -244135 116573
21849 209578 -62049 -63378 62134 -79608 -134228 -133897 -324805 -233071 -38013 115389 165793 -67382
21836 322011 -165771 -82443 -158953 217082 9749 -149591 -411347 -270720 -7788 3812 -106287
21824 -233194 33471 186609 -148842 33923 -309438 -54967 -214892 30103 162806 -282843
21813 -39627 -185044 -16102 2040 27812 114307 -145792 85557 12126 105388 103618 -6136 -87833
21801 -87833 -2148 151888 226923 -97036 107232 25541 196937 4169 64420 -48653 -99881
21790 -99881 -487972 -2011 183444 -306295 -355836 10794 -173896 15311 -321982 307341 164240
21779 164240 -330384 -10726 12485 -95954 -16121 159237 -103479 -170550 -192753 58767 -247949
21767 -277086 303076 -492716 -41821 -310801 13474 -117609 -47678 -83952 -4866 86245 -4804
21755 48715 103296 -129404 -157388 191043 164393 -362082 -110317 -24780 -22760 276783 209484
21744 209484 134940 213337 -120374 24708 -238688 -30160 -110591 -126774 69106 -164214 -198892
21733 -198892 -92665 -159348 62774 -134107 -369060 41447 -18605 18182 -59290 4356 -55687
21721 146207 170051 14801 -234984 -308196 -92944 73649 -135387 138044 -105602 -60748 33162
21709 -77480 -188325 128836 196864 295571 -64856 92181 39833 -37765 -24994 226976 -159097
21697 -271388 67805 284104 -17710 344285 -82164 44855 145876 234905 7664 186927 -381201
21685 -57925 190922 -7904 176856 12566 129142 -113883 -159371 -64548 203353 60836 -102462
21673 306339 -8380 38187 -201226 -280 195914 -153999 39291 106047 173151 -58715 -89744
21662 -89744 -348096 61036 -224206 137467 229819 -297041 -71797 -69545 -255863 97229 280344
21651 280344 20266 -24388 -65846 188870 -540554 -127259 -65986 162997 132038 138333 80186
21640 80186 -248964 -118555 -124812 -123167 -156416 -266255 231658 -369474 -31966 -52844 -148268
21629 -148268 -221447 -88862 152254 28968 -4941 100083 46387 73083 -293732 -98685 146755
21617 469575 107350 257388 -207844 -544030 -245203 -314856 183185 -167694 -3464 -255524
21607 -255524 -127151 111084 -207034 -310275 180865 -69168 -288649 216608 28410 114444
21597 114444 -117749 93647 229234 -206404 -176693 -16002 -144620 -12955 -15627 150546 2832
21585 -61780 91344 28231 104067 -409839 -205788 28870 -197128 89740 163620 288032 -67749
21573 8017 44258 -235462 -462904 -319904 -114164 23563 -190766 -487868 -175970 -330371
21563 -330371 -110240 -22443 69465 54686 -75253 -104701 -438 -87728 -69461 -51463 71318 132852
21551 132852 -109456 90214 77342 -180530 -147616 86797 -121332 34642 -36646 -898 82384
21539 -35457 94298 211416 -7024 -10081 -383324 109426 10171 300884 -184750 269102 53947
21527 -306486 102062 130462 -142618 -64778 -44152 -59367 131788 146427 81374 127263 -122599
21515 -286373 -26592 -266381 -290512 -123493 15379 -404959 66686 106587 -221128 -114053
21505 -114053 -170410 -282558 -189026 -285173 -117934 195607 -24036 -190056 -41551 10633 145649
21494 145649 -11625 -63126 79162 -119625 205166 -212764 -506643 20020 46876 -34608 -157287
21483 -157287 -4073 -90047 -117024 -38544 -387619 -92018 39234 -120111 -186957 -327485 58653
21471 12821 36205 -42214 -410599 12029 162254 59113 -288416 63998 -261545 -93299 472262
21459 -24528 166268 -206670 -117435 91485 -133458 44157 221668 -32183 33605 -322319 -91563
21447 -28459 88370 -342140 -247444 432018 98150 -87619 45555 55144 389847 366882 588975
21436 588975 256214 258540 412990 342552 475752 261779 345266 183187 168849 182198 148618
21425 148618 29234 43661 -68677 60052 49081 40596 22411 -235497 -160612 -7679 13861 275050
21413 275050 25245 65747 -13408 250922 -208592 -153165 -289040 -93959 247617 86110 -84106
21401 -449779 67184 -68020 -68428 -130862 -22674 380642 -95606 16210 75054 -110574 -253957
21390 -253957 -452072 208709 80284 -345605 55029 5208 -165019 -146791 87890 -391772 -223517
21379 -223517 -379294 -3978 -169655 -181183 45995 -264821 71727 83181 74364 75739 -140631
21367 255982 -130725 84991 -419276 -9223 99249 -219581 -97950 -68172 50756 -63729 -13160
21355 -169590 -76187 103817 -390710 -8251 -56907 105061 45517 -89641 269633 -81371 -282308
21344 -282308 22576 -57042 -480595 343313 -143867 39254 -358539 -45263 -31111 209823
21333 -32648 -98500 -218555 -168198 33229 -12371 36168 -190753 -44909 354699 152625 126614
21322 126614 -260387 101751 -5328 -10608 -137140 24771 386687 64924 -34388 236672 102685
21310 -153904 -239482 63753 -78893 -67009 629669 127574 21458 7590 59794 -61930 -124119
21299 -124119 -355381 -432333 246489 -18897 128019 177011 263978 29235 30601 -280117 -355307
21288 -355307 149912 -178573 -20422 -108593 28820 -62867 -240694 212577 -234846 -204227
21278 -204227 27245 -410946 -249510 -86950 -302692 -66900 -203109 1569 -334278 -33474 -343928
21267 -343928 -7143 -24016 -128714 -184888 210008 -8605 -287247 -290188 3950 25718 30935 18476
21255 18476 121272 -77884 242034 -91482 138622 -243269 99999 26986 -124953 -297622
21245 -297622 116398 -31509 96921 81767 91203 -160824 82220 -35906 -22365 -11232 190816
21233 -286069 -203246 -69181 285757 -240837 -17278 -512881 -130158 -121617 47334 -29732 -260099
21222 -260099 -119207 -341564 88161 121310 -153097 -44126 -158371 -104367 -75644 -233912
21212 -233912 -66586 -38597 -108407 117528 245159 -94510 -119748 -16291 81127 29621 -24833
21200 -10140 -107184 72207 182211 -270467 129679 -207242 173983 -65477 87674 -86848 -14515
21188 123617 -251314 178386 -393831 -193531 -54650 -295927 -119249 177803 -132026 323636
21177 279641 128086 -81124 -127044 -84963 -136646 -232430 21850 23238 257834 32233 111137
21166 111137 35015 66923 -483264 256430 -174035 303943 10656 -198318 -167448 -289444
21156 -289444 -445883 82428 -126350 -209881 1634 -240000 -357462 -28215 116013 -492357
21145 135816 -116611 -53552 -322602 23547 -71385 165207 -259544 -274367 -116428 -118373 -130189
21134 -130189 27282 51529 -15700 118789 -281948 -58297 241576 -348893 -181276 -53016
21123 -240269 -92898 -56402 116220 -221965 -584780 182107 -92377 -263354 392074 -89740
21112 -296319 47548 32251 22270 168888 -27485 -143568 -145550 -13687 -476858 -259498 -153015
21101 -153015 -230027 115200 -15579 -5038 -8183 -479005 -31975 -197256 -54563 -83535 204368
21089 -150507 -287412 -232975 -137412 -146569 232145 311039 -109731 139816 159730 -393838 -212176
21078 -212176 -128015 -388457 -214446 74307 28093 43669 -51849 -50858 -66111 160001 -136942
21066 162205 248928 76423 6120 142548 189155 -72273 -174381 171901 -167310 -169420 108866
21054 46158 256091 231917 189955 -242872 70328 42279 -249724 -409357 165144 60912 -231670
21042 205591 52686 -34837 -383132 -208708 -158573 -32207 -83434 -219945 -79469 -44366 -102043
21031 -102043 224980 134141 -176733 138586 -97642 87646 -31417 -57603 -192508 -280145 16561
21019 -44422 -215277 -127490 -16645 -136346 -387950 -292124 -180378 -269398 -301768 -159194 -17062
21007 385600 -324715 -19160 -22643 8437 127552 159335 -133957 153649 1962 23665 182683
20996 182683 125609 -35973 -81862 -103182 -175017 -319311 -113008 -44204 -373140 -75825 -76642
20985 -76642 119408 116192 319259 -193235 -181879 39531 -156159 25055 -17496 111252 -183224
20973 -58103 23419 -248365 155768 24497 -408697 50373 111698 38960 112193 -134119 -93287
20962 -93287 -94863 -159207 -140208 108889 13081 -56107 -203362 -287777 337693 -101305 45874
20950 132355 -12982 -20826 -222663 94364 56339 -150686 179649 64047 254627 -267115 76030
20938 26631 -295316 -110632 186155 -23741 59738 200432 125889 -150855 -6903 -293244 223650
20926 -132122 89160 84612 -175863 -120536 110068 -373748 -210025 -155911 -95820 -487031 -192080
20914 -378 -2946 62473 1155 -188818 -488694 -579221 31606 -371508 -150692 129095 -116213
20902 531 -194546 151111 101346 -79614 185983 89841 3152 252619 80563 69981 -73742
20890 -176880 -368766 294496 102534 -244373 115843 -64713 -381110 -227122 -112205 -250608
20880 -250608 -125382 -101928 -144029 145692 -24941 -254631 -206742 -230493 -1000 -163852 -73955
20868 -150032 11488 -12798 -102757 -335690 -282990 -131408 19847 -245763 216242 -57345 14555
20856 -165444 52648 65331 -167857 -202039 49024 -78362 190688 -226659 -37354 52249 -212184
20844 -21388 -74833 -105337 -215508 -30188 335918 -114569 273523 -291742 120870 -54633
20833 -26433 -257211 -7985 111315 2099 -151627 -262803 211072 -194271 78475 -149925 -440160
20822 -440160 116943 -213747 -28374 -389135 -70816 -166208 -131929 -143769 75022 108785 -192374
20810 1832 -213425 -288001 6369 140899 -101404 78280 -194519 -7092 122064 -326087 11199
20798 125207 5858 81092 -281049 -217055 63342 50293 174100 7433 338060 -16139 -328637
20787 -328637 -214997 -5470 -40827 81793 -137993 11257 -89847 -19015 259687 -367252 308130
20775 15641 132465 -289878 39242 12920 -246885 -141696 -71608 -138165 55629 -217704 -408023
20764 -408023 -91841 -223031 -204702 -5818 -88892 -28012 156790 104566 -62284 -236729 -3715
20752 -153882 -252873 188621 165433 121037 -47925 306174 -29316 -374376 -171598 -241841 185381
20740 12970 -72890 -61362 -50234 34987 210179 160779 113149 150709 -421063 -348919 -112609
20728 -77143 -23281 -30444 -100958 218060 58212 -28246 -2499 -240704 -146960 -24272 240934
20716 227268 110282 173934 17895 -444708 40843 -65480 35212 47975 81296 -89335 -25399
20704 -52060 63008 -27163 -97056 5895 -27811 78653 -6201 -276807 -183599 -107608 50055 -24462
20691 66365 -2165 326614 -135473 -198387 193905 -111866 -42718 -135257 -40974 -41913 -314269
20680 -314269 24581 -245962 -302727 -107222 -159390 -66273 -90504 260719 -84012 -33830 -411314
20669 -411314 -80234 4454 -352081 -132825 -140440 -39974 -366286 -399013 43044 74944 50591
20658 50591 337854 -115719 -34319 -160186 112400 -43763 174062 -170237 18683 -206659
20647 251675 53756 -60523 -246193 27850 -235299 45848 -166794 66092 -77405 -122872 -319028
20636 -319028 -108710 -340716 -420952 138245 -124276 -281683 -233473 -70128 -194175 -336079
20626 -336079 5927 -4983 -105880 -226574 -167581 -137483 19901 -208601 -291563 129096 -247689
20614 -223887 -208340 34174 -165667 -176334 330135 -160858 -8029 -205229 -184170 -35103 -20710
20603 -20710 -306856 -290796 271198 -125665 -5846 -461671 -209878 -35444 90389 -10696 -123989
20592 -123989 181053 -143630 -152425 -55451 -24016 -270910 -305867 -29610 -46032 -264107 -270789
20581 -270789 -329533 -178923 -13795 -298633 -5405 4461 -62088 65317 -46841 65669 -41453
20569 -255621 -69691 240366 -105056 137157 -73464 12751 187541 217939 -114096 -89200
20559 -89200 -71687 -153131 163519 -6617 -113673 175774 -1413 111377 -140157 51384 71086
20548 71086 -22217 -291599 -93025 -167322 190935 135531 -228318 -325965 -113402 59679 -105105
20536 43745 -553954 125056 -80339 -469662 43237 52925 19339 -161797 -72475 -83455 -45494
20525 -45494 50310 236451 272074 -138107 -82920 -105998 -27280 74318 -123195 106493 -160725
20513 -123627 -51621 -20021 200264 98568 -79714 -1812 -26648 -137995 -210730 -241661 -174482
20502 -174482 -15384 -154339 -492612 63293 -39893 134079 147890 16701 9745 101410 279586
20491 279586 -52892 -57835 -183934 -152580 -79106 -184708 108513 -196483 -168574 -179583 -40000
20479 69196 -86855 65064 203990 -52323 75614 75761 -95527 315289 -202276 -209520 -142709 63611
20466 -72014 -110578 -319862 -255282 276812 17737 -151578 -32785 161219 -323092 177293
20455 -41941 -54909 -9339 35419 -155349 90142 49083 -156648 73768 -43915 -178237 146518
20443 14429 -311679 -71942 -292484 -87160 -166966 -162264 111661 -1705 -138845 -93854 276981
20431 114776 163049 -7980 -105797 -120085 -310756 -124284 69541 -207621 -233486 -102617 -171769
20420 -171769 -155542 -443103 -219595 260239 250591 11888 -235080 -61831 6643 -66275 112475
20408 82431 -251284 -205152 -77482 -357039 -53123 -22849 -66045 34593 61554 75092 33757
20396 -287723 -30774 41531 -213743 -107278 231520 245813 -18261 -299668 -162015 -270131
20386 -270131 -98781 144076 190868 -131668 92089 128373 -315397 16600 -274038 118542
20375 -76868 -113753 41145 264262 6679 -136220 137877 -28577 -34851 174764 -167100 -239826
20364 -239826 -476618 -12265 -70380 7949 78378 113843 -186812 72919 219593 -94882 -137828
20353 -137828 92703 -131787 210147 -222313 179631 -157322 -97272 -136393 -8231 15354 396019
20342 396019 1677 -194670 -375656 -71408 381649 -351890 -115545 -394770 -241233 -56947
20331 40562 -287057 -317111 -83032 -204843 183686 -38077 -554233 -45685 70004 -5944 -282677
20320 -282677 148596 14634 -23820 -354463 -51365 -137085 137211 -257392 188626 252851
20310 252851 -42599 -125123 -224908 -137922 -41927 335253 2666 147885 -176492 253679 -371952
20298 -263010 -75227 -296909 47034 -106557 72330 -273148 -258937 -148591 -73731 -267248
20288 -267248 113819 58544 178097 -194305 216770 12022 181239 -136522 -106548 24127
20277 158662 -236579 104838 208286 -129705 -45328 -448178 -386179 -75882 -162041 -132860
20267 -132860 -466063 -189606 -238687 -131156 -121185 -126680 -247468 31900 -88202 119961 -255478
20255 4991 -378450 -171779 -237219 -129146 -194018 -273769 181396 156996 132128 248285 -16906
20243 -267030 -129685 -264560 -97653 84790 51123 -67409 164870 173704 3459 -113745 -241386
20232 -241386 16475 65598 117067 -23241 153406 203226 -74705 -91307 -69882 -221980 154182
20220 -143153 225911 25188 294556 -234852 -107398 -155995 83715 -15064 138624 -82520
20209 9973 -392891 -234650 -70493 229206 158213 -576089 -107114 -379428 -17190 -288683
20199 -288683 -275589 -361393 87505 -199783 -93654 -135430 -81311 -176296 -201435 -120111 -43258
20187 -210693 -85532 -72459 26988 32198 -185000 -82321 73451 -167449 88430 27255 -26130
20175 105936 136573 -272469 248337 -104112 179212 350494 -326262 -79746 -186674 -1843
20164 -24972 61955 -194820 -17372 -473311 -71351 -197180 931 -125636 42497 -226846 -72136
20152 83497 -107111 -194253 -103603 -382298 -87674 3403 185118 82286 71750 55233 -278350
20140 106146 24312 -233839 -50662 95812 -123812 -150412 241111 -118816 32725 -13568 -122240
20129 -122240 -183421 -120118 -119520 201708 -22086 138380 -26271 109212 -309779 10965 270278
20118 270278 -30290 278805 -51711 -60287 -50117 -234687 -121936 94213 -215122 -55077 -23729
20106 65057 49291 -286678 -382745 -143406 -223064 -16726 199662 -249933 -80127 -303877 161108
20094 -88361 -358756 -110997 -210850 -103935 -110451 24985 -42719 -397692 -134856 -80013 -229833
20083 -229833 -68683 -382127 278919 -156759 -35886 -62460 108792 47737 5736 -126626 -211654
20072 -211654 -95858 -124361 -215395 -14051 -70025 186377 150964 202777 -163754 -84655 -67647
20061 -67647 -157056 -186769 -125356 394064 -77623 -5838 -310216 -188974 224524 -245247 -180097
20050 -180097 -348576 -158567 -85385 -146681 -352840 35382 -45423 -142942 146348 -283014
20039 -418764 425799 -24099 125888 -141985 196283 331654 -139518 90477 -24182 -34672
20029 -34672 -76221 42552 -131873 -193092 2824 -99340 192385 -26125 -221574 24015 174343
20018 174343 -48481 -279068 245317 139588 -56491 -19935 38533 -116954 -118005 175982 -290972
20006 -80422 276442 124505 88941 38257 -294901 111589 -15759 -48312 48061 17015 -252441
19994 68483 319082 401657 -235065 49322 -69325 -19936 251241 -98912 -704215 123442 -308515
19982 69681 51561 2526 -9310 208868 -11501 45844 -58894 91888 -347118 -390685 -181495
19970 -182647 24875 -12860 -70868 -131523 -32350 79370 -120801 -104983 -144805 -286231 -406273
19959 -406273 -232744 -13150 65842 -30255 -176552 66067 -183678 -171079 89287 -69077 -227279
19948 -227279 -31095 244842 -114560 -417051 -53855 -113485 43463 208728 165485 -236374
19937 106716 12359 -80616 133834 23269 109914 -80365 -2488 -175952 59693 134832 -171388
19925 -154135 -281739 -123524 -83967 -16558 113274 -38536 -65382 -51800 -121218 193205 -164386
19913 -214474 -286961 -312855 -34436 -8013 125307 -238872 103397 -49245 286331 133439 63705
19901 -156654 -347329 -30403 -106723 -230136 31775 -8865 68314 -337534 223138 -366289 287812
19889 90655 -229203 -120748 -175813 228855 -246028 82249 174951 -39362 -161602 -243284 -121780
19878 -121780 37539 219704 -64174 2480 94805 65841 45778 -236945 136166 -370779 -437366
19867 -437366 -186141 -105371 -62209 -114084 -97783 -460613 -361273 203607 -139365 1805 73017
19856 73017 -36386 -216441 122409 -169589 -95278 -164877 282038 -224234 -62962 -216541
19846 -216541 -207545 -203309 -6624 245111 131423 -233181 -56931 -112284 215045 256486 201748
19835 201748 91391 -230812 -28697 -65086 -192794 -171850 -181577 -143100 31405 115847 -371517
19823 219362 -159329 369245 163361 -207240 -227770 -173096 -247963 74357 210142 -162367
19812 -150018 162043 189124 -29026 92192 -145711 -157862 -67500 20913 -105710 -426 -151523
19801 -151523 74879 41558 -35890 163364 -233285 -231006 99276 121581 160988 208150 183028
19790 183028 203083 -361361 -62172 -96646 365821 -31396 -77914 12162 -108849 -18078 35268
19778 162966 -130348 57020 215005 -384476 -24457 -329904 -314416 -33329 -189760 209616
19767 20802 80321 -304482 -214281 -53284 -81071 87130 -49642 172761 203059 -218471 -49130
19755 159374 -48756 4823 -125298 -271615 -118371 -94892 -26128 -39236 28686 -299913 -143802
19743 -76588 -368845 -196457 21621 -121601 -201566 -183531 -139092 -367774 -87305 -379143 -139167
19731 24635 100249 -87944 -159987 93257 -60216 -452143 -103198 -89244 262750 -280080 -121907
19719 160990 -142203 -74179 -200390 -115486 -142697 -144297 240947 -188128 -58550 9625 -87027
19707 108148 -175688 -435451 -170516 -398087 358866 22226 -196805 -280614 299903 -418215
19696 128699 -291168 -205326 -449384 143429 -27381 142558 -215980 -64211 -192745 -531103
19686 -531103 -191526 -145171 -82004 156505 145802 -197630 -49872 16726 -116793 126645
19675 -216947 -222125 -50455 236508 302056 -366432 -62954 -79724 -259721 195756 -26085 -106690
19664 -106690 -67376 82781 -112012 -129495 -108215 247228 39716 211560 100125 110431 10459
19652 145803 149218 -2039 -127685 -23335 96140 -311627 49537 -71779 264525 -27630 -209398
19641 -209398 217658 -155280 -338683 28740 -42222 -207701 75975 64681 -264343 68497
19630 -86387 -87317 -77742 3512 -232521 1451 -81120 -154737 -231983 -148028 82216 -98118 71953
19617 -256637 -65014 -26146 -95309 -101957 50815 -189941 45193 -33222 170717 75631 -229575
19605 88492 -71335 33896 301106 19753 -168102 16724 -111491 -209020 163604 -141606 -201215
19594 -201215 -46090 -368788 -214238 -84684 48157 -327613 175085 177330 215770 -466153 -57966
19582 12438 57297 174054 -75851 -237310 -506896 -54645 56165 218109 -387958 -7732 -193016
19571 -193016 -168882 -194450 -128398 -291433 185709 -234850 53850 -191634 148416 163382
19561 163382 -93560 267801 96262 -23793 237657 262562 72452 81141 -42479 229667 -588368
19549 44834 -18654 -116599 129863 -215745 79856 -536203 97886 -74777 -121276 -89242 56584
19537 -274062 -172753 -71335 131726 -59395 -204154 -95910 23494 -55101 -130933 -82508 -148079
19526 -148079 -193633 106866 317128 162665 108251 -288783 -288541 -136860 -189082 -229869 21068
19514 -197197 -44643 -48685 91146 -15822 389694 -63340 -66427 247217 -177259 161587 -243137
19502 -217838 -32532 -124574 -389549 -48499 -247835 -39856 -116982 -152266 -172465 -110117 327514
19490 -401680 -76728 -46860 57856 -5537 -169201 -138819 -28840 -91844 106462 -217138 -77775
19478 -103216 -47248 -118312 -233964 -214516 -64169 -237150 171212 273005 21792 -279159
19467 -340969 -77984 -194310 -127660 -156290 123193 343792 -33280 36901 230496 -80266 37883
19455 -44033 -127784 105567 -188099 112174 99992 77271 -245022 -302660 53085 72118 -239618
19443 -80671 86833 -74662 35413 -109554 -193818 133433 -78970 134770 -71551 68121 -223703
19431 125825 -63811 -169103 47289 -164694 91193 57537 -106621 201452 -41187 -95945 153223
19419 -68196 217262 -204936 -216848 -105088 -11105 140063 -117769 39598 -17246 204733
19408 75405 -251022 158830 -110792 -281462 -1577 278885 -76747 -243087 110639 -24103
19397 118848 126143 -424380 -39063 -176378 -57871 13147 -147516 -38373 -56380 -37873 -226310
19386 -226310 -31018 -281458 -120126 262847 -439052 -67353 -145740 119031 -38386 85113
19375 -396651 -166588 88932 -71985 -48669 151725 -145683 -78059 -19208 -168965 -180712 -198522
19364 -198522 -61118 86009 -78403 170319 -309577 -242898 54125 -195422 126938 -92545 -169942
19353 -169942 -64459 140362 72364 895 72859 -123394 -45964 -258972 -195252 -36759 -100207
19342 -100207 -367013 9958 93191 18546 -104532 -1690 188601 -134459 294493 -347611 -139562
19330 -88430 172483 -42063 99202 -188210 -62752 -103178 -176073 35150 -74772 61456 -177356
19318 216949 175698 19411 -254676 -193235 6323 -190369 250711 -134039 95209 662929 -530272
19306 129006 95357 -183915 -256990 -28792 -135850 -144792 623 -138173 -159127 92635 -186012
19294 47878 46523 127932 -41782 -148240 222575 -108600 138909 -240820 147016 117521 414662
19283 414662 -54636 -53987 -82958 191802 -216057 -143145 -37532 -46179 135880 47583 -268692
19271 -97598 40561 57960 -265919 -4101 50825 -297373 34075 -380521 74605 -20748 1547
19259 -42806 219019 -218905 -237440 1917 -37973 30882 -376669 -25201 46934 -33366 141474
19247 -106643 49841 61098 -76674 56548 -113873 115197 -244778 -85440 45025 -15260 20470
19235 -29669 -583918 13464 29376 -119107 -85522 -246137 24059 -113289 149742 -61636 -339023
19224 -339023 -241584 -34327 101726 -218506 -145673 -35153 -310150 23239 349793 220357
19214 220357 75745 -76923 110079 160123 44961 -184651 -91693 122189 -212222 -463702
19204 -463702 127057 -136206 -48428 -8396 226613 -419371 -131111 80452 -31756 154461
19193 151821 -104191 -76331 88100 -184311 -36530 -53750 -160308 -39604 -101571 74879 41598
19182 41598 -259031 -383207 20790 52681 13130 -310481 -3616 107292 101497 103023 -216580
19170 107544 82513 3020 -275951 262918 42299 223370 187171 -166885 31719 50416 -212350
19158 -279854 -253972 209709 -297879 10980 75728 -151163 26786 -86473 -147794 28768 367089
19147 367089 170945 38728 -446782 -41530 -73719 -257756 27661 -402 -276503 117355 -215347
19135 33463 145644 29954 -56950 90775 -138302 -177687 -60666 3710 -264808 -101061 3585
19123 175854 -41989 59506 -330201 -39230 -208582 119622 -102684 -58147 -239716 48983
19112 51904 24516 298547 -83625 -230712 -269037 -43104 -109426 -81035 -32544 -36411 -148595
19101 -148595 314346 120223 79532 -218150 138165 105863 -248173 -221394 -54472 -298623
19091 -298623 131178 -77235 -173735 96436 57496 -210534 -166164 -264514 -171970 259869 -80743
19079 -22544 231300 -162218 79183 -168887 -156895 -770 -8551 -216470 -313651 -238008 -18570
19067 -72526 160704 -183022 60494 41108 27936 -371557 77383 1049 108621 -15036 41582
19055 103135 91543 -101999 -99298 -54588 257522 -218083 -132216 -75720 162619 -32157 92585
19043 -167449 -63997 -251948 100061 -259412 75257 -223443 148926 108049 37948 -207342
19032 -17037 82859 65707 107415 146161 -122727 231711 133279 204394 -189928 -265641 -269290
19021 -269290 -132613 -244349 70778 221649 236626 -78827 -223589 -263956 -218335 228769
19010 -199835 160984 112398 -181172 -25849 178808 -635042 538 -98549 211966 -162731 -89419
18999 -89419 43418 -309742 183263 7809 150856 151111 -57912 12864 227226 -168866 42981
18987 159529 -188972 61471 -6029 -120732 -293620 42128 19366 -491004 -163246 -88378 -102171
18976 -102171 189142 344181 76156 -141929 -5464 -7872 -146993 -56393 -61006 197814 -118017
18964 104844 -171153 -83218 11962 -85672 248003 -203644 20191 25291 -229560 -178546 -151308
18953 -151308 -63481 -2906 -147586 -27005 10614 83874 -270060 -143182 -70115 164615 41860
18941 101971 -302031 101543 -163508 -119866 -388900 -292401 18319 -153371 255370 297427
18931 297427 42718 129093 -245102 455648 -71348 122757 120345 -264688 134686 39742 -250481
18919 80131 -116210 158164 -48128 -133816 -60874 -321212 -271301 -17012 48302 -29076 -131600
18908 -131600 88977 -198947 -54290 47374 291561 102617 -116965 -189640 239694 -157964
18897 54641 -295594 -382 146330 -262866 276498 32063 -102309 -491862 -35033 -68800 211615
18885 307608 -268288 -13133 -188993 -29988 -24687 -133703 -132431 -157718 -363715 -62111 189726
18873 134390 271551 -159264 207871 157159 32989 -158749 -628239 -137852 -141652 169027
18862 -169436 63785 274849 5506 -182712 184641 -66548 -71894 273517 -71643 7447 132788
18851 132788 -358963 157730 -173408 177113 -172820 218803 109949 -96963 -251868 120176
18840 -99406 -153462 -641723 -207168 -25055 -1663 -68946 -109979 -184744 -259199 -100198 -320041
18829 -320041 188609 383608 -152629 104536 -143059 -112689 -165289 -347440 149049 -65116
18818 68035 135885 55286 355281 235988 -163146 -331537 -154197 -77340 60129 -72959 268853
18806 28022 -65605 -90721 181561 219108 -103794 -47794 -469177 122707 -91062 -290557 158524
18794 171835 -32519 113634 -539449 73127 -70340 -260184 60868 -288429 121206 -52614
18783 -20399 82088 96104 -237092 215146 -20247 -319478 31726 -219524 79787 62273 50051
18772 50051 239513 -154109 144509 -67158 -207997 48466 -117014 -197073 -132802 -236532
18762 -236532 -210509 -63198 -332320 -52198 -3691 -488952 -95548 43012 -471043 99544 -232991
18750 -257840 156818 -102120 2316 -399482 22679 85530 -196752 -80883 -183308 114308
18739 31663 -30234 30381 -261264 -97674 -266189 -78090 -22993 -194863 67769 -88152 -216295
18728 -216295 -159597 -165732 172355 -341627 49228 15667 -319342 105987 -61702 -162079 54911
18716 -7 -55587 139756 -329343 73173 -75480 86377 1937 338224 208218 214354 1902 117977
18704 117977 -29412 -124268 -9747 -277349 -106811 -14994 -141061 -189940 -24389 -160047 106549
18692 -438508 -296654 -115486 12586 141917 82310 -86699 21589 68611 120174 -104925 -122304
18681 -122304 381491 183785 -236853 -336987 -244367 -40058 156761 -44476 -126913 98206
18670 -292259 195923 -73676 -20497 -161871 -77737 -303243 92680 -17952 -298239 -7081 -154180
18659 -154180 -415433 -110279 110410 -164174 37067 149479 -143058 -182817 -119201 -234358
18649 -234358 -29422 -285331 41040 -101195 -145689 -162969 -82785 107366 -183500 -215137 -107675
18638 -107675 23765 59654 84156 152129 129820 -124666 87989 -85969 42477 392189 -108514
18626 -16550 248578 -144332 106978 -145357 -142393 117279 -16132 180149 249870 -184803
18615 -179155 123633 -103008 -336515 825 -51162 95771 221179 152286 131664 -168110 -85346
18604 -85346 -23252 120096 -271141 -22638 -186250 -81263 99588 -34872 -82114 -46405 -96046
18593 -96046 516598 -154178 -53500 221237 -36387 -174986 222924 145701 -79642 -286402
18583 -286402 -268158 249201 -66763 -4924 58201 -128739 88962 52818 -390361 -169712 41530
18571 -253756 -70025 -511171 47989 168624 -125098 -93652 176402 120659 -275414 5920 135670
18560 135670 68807 -197791 173375 -83184 -31134 -244594 -118917 -209931 135326 212222
18550 212222 28564 -98074 -129032 -96554 -310190 -191180 -65920 278366 -32085 -138785 135010
18538 -88483 142115 -188197 -121754 175621 -187417 23829 189154 137279 218875 96029 -206472
18526 20882 -255399 -39718 -169748 -151927 -242494 -67093 315540 60835 -181337 -58293 -98174
18515 -98174 -120945 49872 -16442 217474 -122252 118959 -41712 -30341 6020 -52167 -327364
18504 -327364 -44240 -136304 -9919 -43934 -29892 -216889 -19605 248942 91051 -84688 -40600
18492 49 -272980 63146 -131052 -280032 -192669 -81108 -199890 -199724 191620 39127 172639
18481 172639 -156297 -113854 -71257 105219 12606 -31487 -115037 -290742 271946 -249458
18470 111938 2997 87828 134417 54158 -290780 492266 -238133 -134058 -123473 -59537 144984
18458 119638 36182 -205520 228512 -303842 -10532 297639 285458 -208954 50992 -61054
18447 131261 -72518 -297313 43569 -111385 -39821 -196447 -419169 -112473 78985 -387928
18436 55783 328334 -104372 -382803 -52861 -284817 -187420 14737 -354327 -163913 7210 -271628
18424 -245644 -18357 -129708 -119836 -165348 -9274 -133826 258351 205539 -69687 -343892 -237386
18413 -237386 -40292 -228918 149796 69833 -105313 -71092 -79651 -68611 167705 10417 87758
18402 87758 135452 -35528 279120 -89551 142403 -496628 -219992 121368 292678 -165147
18391 86815 -31949 157736 157256 -211400 -39207 79781 -228380 -54701 -131179 -11213 -103643
18380 -103643 81226 125805 45519 69677 -1958 135852 -144667 147520 -16351 -34273 143389
18368 -184183 78657 164739 88065 58748 -226958 -232024 -346622 234193 95814 -383697 -17658
18356 -130274 -63015 -397230 95206 81966 197264 -198764 -230060 -379211 -180908 -144932
18346 -144932 35949 -151045 58343 -141860 -13804 -22489 81742 -3095 -106015 12743 111116
18335 111116 31492 -271320 11788 18320 -184070 46291 -226238 -208582 232584 195638 327807
18324 327807 -121814 4903 -31375 -321787 17819 -196903 -31989 -193717 -292228 271085 -103139
18312 418098 120414 -65170 262165 148672 -212519 -49222 72768 -172600 5632 -34379 223591
18300 -16713 234041 -247912 -162149 258858 427109 100331 46509 -4175 -316916 143968
18289 -386218 -79129 -103473 372721 -233365 -231233 -279376 85372 -45157 -12567 -310184 344247
18277 46683 -165161 -249980 56143 -102861 -451719 -52886 154006 -71600 -237718 -61612 -58289
18266 -58289 197577 -77126 -14069 24217 -112542 127600 -340284 -29232 94779 -446611 -237818
18255 -237818 -164305 11482 -189783 -197578 -58078 55723 -258917 -99764 -282192 -20488 -132287
18244 -132287 60865 136867 229513 126627 -235862 -191026 -483001 -7819 -112766 -229766 -139774
18233 -139774 55765 113874 -341301 51528 -35208 321108 48084 -232383 243097 -112701
18222 -224781 -46762 -222359 25395 26980 42286 -227547 -234224 425524 -416240 -145199 -43805
18210 67061 -67300 -90352 -12549 131258 97381 -232526 -276300 -142310 75096 -166695 109408
18198 29884 89421 -90906 -90018 59486 -354910 281944 -40822 -83777 40332 -365485 -194908
18187 -194908 -155636 118325 64048 10675 114875 -285804 75652 -53612 -395649 -495781
18177 -495781 -40665 -56285 -104872 145115 -135328 14908 -233805 68825 -59083 114788 -144892
18165 247583 109011 -112665 -208381 -124786 7817 -74077 -272733 103801 -179175 -324542
18155 -324542 -92315 64807 85293 141239 94003 98745 -100328 -195359 -107984 82902 58448
18144 58448 -195964 -61125 -134885 212893 -93555 -22760 128357 -149722 310909 -273496
18133 279083 139463 114931 53034 -290382 -455413 369163 55878 78641 -190874 -167696
18123 -167696 46076 210469 -237292 -46272 -127891 84738 -77193 30180 -70013 350581 -333321
18111 88407 -239592 118192 -183330 -104286 76803 -143153 -196574 35215 -423493 118279
18100 163403 -110227 198652 99905 -160914 -60012 -53182 -45980 59067 -334856 81588 -134036
18088 -398288 -354941 171137 7843 74958 58421 -56892 227308 -188089 -413766 -89329 170147
18076 59688 49250 -24711 -141808 -84158 38504 -208600 33936 48416 162854 264168 -97250
18064 -182061 87133 -82918 -177562 -296172 -159323 -3361 -289002 -187119 -320572 143175
18053 28903 -8136 161963 49212 -332959 -98689 -185346 -117560 -93952 -154418 -347557 -278214
18042 -278214 -11864 223187 60317 282172 -325444 215789 155755 -157817 -67465 -154908
18032 -154908 1210 -137239 35650 9524 132138 -31226 17394 -53851 -149458 -422220 -102252
18020 82599 72983 73759 128507 -21904 -215882 -262637 -180308 -156342 33301 73702 -138394 96813
18007 145239 -154800 99744 -159142 -368323 -255302 -91786 204910 85484 -241814 454998
17996 -59577 -182288 -7755 -195221 -354283 -107360 170196 -274545 100681 68336 -128987
17985 116212 -56879 304785 -65141 137451 -38353 -156379 50085 74904 -237267 -245193 -53912
17973 -22647 62300 27298 -409347 -112991 -120091 -186590 118406 -92586 -146067 -263195 -130143
17961 -202354 -195922 159329 -117066 77819 133390 60444 -31040 -172310 -59541 35236 15314
17949 392416 -101076 -45355 19571 -32054 -49262 49409 271981 256410 452905 -332 -142355
17938 -142355 92117 22026 8720 -60097 -80064 51507 57599 350908 -105705 -69977 -17897
17926 -289578 269054 -168591 288696 193724 1029 392640 51010 -84624 95896 52393 -93622
17914 -183550 -162367 257097 84049 342396 -299057 196010 50289 -220910 -304509 221021
17903 -2869 195616 54664 -161263 -186954 84567 -411873 -85035 84563 90233 635 269293 -47822
17890 31432 261600 143174 129972 182081 -151902 206564 -143196 51383 42031 -86479 36642
17878 -233706 -178291 86895 175458 -480063 -260235 213600 45352 94083 33967 69781 -51585
17866 95209 -187278 -250940 20331 19573 -94668 46581 255195 -102118 -39266 57548 -155652
17854 -186203 132004 -326805 -33292 -35145 -68849 76899 389321 -129469 -25219 26523 -307674
17842 181898 -133929 53818 -127805 -174879 -69374 71736 199353 197701 88819 293161 87631
17830 253274 -55913 216565 12478 78341 138664 33993 -176110 -55348 -85081 266311 6763
17818 197039 -41576 149889 -154394 94273 103926 59325 146971 164010 -194835 211991 -265721
17806 -131230 -89817 18849 -107061 -154619 186309 95223 24106 194283 191015 112993 -194492
17794 -134149 -367961 293370 -38823 48053 77180 180150 278705 213421 -220100 -70146 -452486
17783 -452486 -19034 -303358 186512 -203255 243734 -143617 152346 27708 97430 177855
17773 177855 -209749 -212458 3865 -183768 -296077 327760 53918 24787 -56785 -32289 -87295
17762 -87295 -82450 -129686 173867 -27672 -288139 -171810 86834 39503 328753 7043 308235
17751 308235 -67572 -159586 -174401 96805 36750 -157094 187132 180036 91390 -103652 -306940
17740 -306940 13104 -350113 402962 -11657 25079 -41111 -212581 -53862 246163 -76077 -66924
17729 -66924 -162364 -62526 -27569 366408 -172648 237213 155852 -184881 -147555 15852 -104501
17717 -139563 28981 107718 -355650 136030 225962 -99601 -149213 103627 -260071 314670
17706 -52320 95926 136816 -205515 -245847 -80707 -144142 -338148 -177251 -10836 103279 173019
17695 173019 120650 -6057 -267922 -62471 95334 -179729 43287 153486 -172325 -268170 146432
17683 96821 363103 -214332 -267950 80351 416877 -13531 243938 88002 -296036 60474 109435
17672 109435 -96458 97856 -217688 -53358 -9171 -153182 30196 432364 -26323 13590 270706
17661 270706 -35280 -349623 217033 -142216 -24148 107285 21677 54618 1100 -80229 25585
17649 67474 189026 -276826 105081 -208663 -150165 -185928 47802 229343 312085 95394 476893
17638 476893 -140192 63869 397785 68449 19416 -109384 190900 -200695 153908 79068
17628 79068 -251654 -304084 191293 -345639 84352 -32502 -41989 -14797 -121809 -128930 -173635
17617 -173635 -73878 7936 -29219 -112634 247195 204741 -80151 18744 250685 -3518 334952
17605 210387 244211 95999 -127948 73484 -115062 95651 201016 -190868 125854 136227
17595 136227 -148935 -77007 232335 225549 -174552 -10445 -151178 -52008 234402 160787 77740
17583 -239449 -162144 5506 172645 -274187 -176564 292315 -232364 -317727 -30662 46823 35268
17572 35268 -19518 64921 251977 -184775 -16286 -174543 55522 20298 94146 193338 49923
17560 -97484 -131294 161878 224494 216365 236057 380493 204557 -236841 -78259 -300674 311866
17548 139257 10130 33073 -215157 -93643 97035 -137533 -60481 230290 46561 53442 62176
17537 62176 -221396 56950 148891 -81116 -22108 118735 192565 -120636 -228376 123327 -76740
17525 284537 191064 -118932 56634 250573 101825 316158 120526 176500 231201 125594
17515 125594 257394 273981 447151 459059 -233675 119427 -37776 33350 69650 292754
17505 292754 267028 -271101 -140387 387599 290827 -13251 118467 305649 185267 26252
17494 -23947 -156915 26360 358418 179506 136426 -159521 70326 352105 -92320 -149227 -158625
17483 -158625 139066 15645 21200 -249437 -19012 58017 -62344 144399 -29820 174215 243957
17472 243957 21033 105336 170605 317177 230273 98824 -90179 -40102 105090 -149727 241009
17460 282670 -5718 272083 256193 137420 75299 -63822 388193 60491 400877 517858 -187966
17448 15280 135172 378202 350466 258095 452027 -112743 -28652 437068 -209905 133019
17437 -102633 224550 318529 301367 653217 282365 90264 27288 -46782 -140123 -118317 327033
17425 204288 206515 153523 54061 323729 -34587 168296 133509 292732 431359 484299 451808
17414 451808 372535 219888 496490 196012 341558 -159244 298450 164769 183058 21522
17403 -40136 -269240 86562 17656 185788 170803 -98228 290560 376161 201008 297850 164618
17392 164618 119917 61084 -104820 358607 322750 101948 307357 75458 45334 -240705
17381 151521 95200 400278 -3935 173219 309899 106261 73880 131952 -37771 337341 173707
17370 173707 289690 170820 35488 288631 175789 149398 257432 -55883 168653 -178031
17359 87180 327401 343378 -21917 41264 291665 170994 -249974 18957 72731 -27022 12790
17347 -192824 100330 131065 28585 343891 35891 399801 63306 250200 339268 -113352
17336 177487 -29992 239428 343963 135924 -104260 36215 49825 -65665 334816 -61850
17325 215701 348507 -102881 -164418 -114465 181874 49032 259464 456647 -181952 110138
17314 426093 93682 353662 113484 180783 449562 52302 272852 113120 283227 -23040
17303 20265 150056 158288 71291 175603 96993 81953 77291 -38050 126017 107571 301581
17292 301581 376613 84407 260859 283182 236333 -81761 305484 164875 18202 453000 144468
17280 30975 264685 413991 318407 362849 164233 112515 189492 425535 82076 68240 -38946
17268 520729 -173051 56888 209677 187435 -84060 113343 100900 483725 73464 -161716
17257 288381 222169 213731 104681 128422 -174333 -201854 126636 312328 307943 507216 180537
17245 296770 73293 295553 -111714 236693 2603 618319 163731 47855 104951 46514 44349
17234 44349 252612 103025 346853 138445 -92807 98193 86709 63326 408724 -85055 -59559
17223 -59559 210656 169047 194840 240753 -345126 -39535 -38543 349673 206235 137543 438181
17212 438181 189365 201563 178799 543025 -178269 236888 404688 156316 125504 205355
17202 205355 136299 123497 393878 242623 37899 324814 33294 217092 -24088 213041
17191 201882 158980 -93807 167966 -200726 146137 342165 374568 512202 224449 431679
17181 431679 288357 91928 437874 587883 175647 393165 101835 260539 221905 269433
17171 269433 417210 -171997 -97612 358325 272959 151178 355531 122162 33656 75607
17161 75607 121862 151736 129661 15954 183695 341050 217820 208057 -24266 149709 578004
17150 578004 334313 546268 -31658 193050 14735 301174 217459 349197 -861 20396 220022
17139 220022 43380 231141 74875 536200 313188 126435 303945 135968 296080 335351
17129 335351 590221 642497 404246 314786 -130892 587728 236229 285773 243769 145694
17119 145694 562047 534214 322846 519676 153041 337317 584677 452451 505118 370077
17109 370077 383370 358207 339077 370895 303692 568633 538608 435146 166920 420410 399988
17098 399988 238696 454070 616322 529822 262838 406801 515600 158167 444041 116902
17087 460720 410505 463506 332746 202458 461403 355428 122185 680581 193288 376057
17077 376057 177534 364538 361402 390354 506329 310444 330100 644712 603896 225923
17066 269540 699987 507203 401595 427258 647976 502899 570585 503668 535769 447064
17056 447064 394847 250045 579869 511000 328624 643885 377121 462946 113125 692260
17046 692260 650560 362290 675797 481186 378022 615943 542965 342319 489297 407343
17036 407343 378156 568355 601263 594977 376963 546741 492995 641533 820545 678867
17026 678867 805430 602416 639451 613836 791152 398249 322240 363578 730288 604678
17016 604678 701984 636404 911455 406488 581484 410981 536198 670024 573405 909923
17006 909923 717564 453576 620663 772032 509418 699118 565388 811217 633555 599035
16996 599035 401142 877440 748369 645696 490151 558587 736060 926397 770935 335093
16985 808251 724222 651431 750886 885459 912611 767707 811794 916177 742971 792010 796735
16974 796735 823210 844096 996430 905047 1250651 756096 1017496 657881 1123294 1069202
16964 1069202 415983 1009343 947561 916506 1045549 582823 1126555 958567 1019895 676377
16954 676377 840382 819674 942745 994692 774604 738038 871642 1108918 1369520 905348
16944 905348 611252 1193569 1105474 933660 985172 1249307 971738 1233028 986882 1221601
16934 1221601 1332720 1118493 1078736 929407 1202345 1255848 1280614 942193 825842 1002089
16924 1002089 1245595 1376136 1451765 1374796 1347116 1112296 1239620 1534115 1164656 1309575
16914 1309575 1121213 1678558 1610550 1299586 1439041 1456692 1572757 1447294 1414642 1482987
16904 1482987 1317703 1425563 1611888 1481826 1822971 1582868 1490494 1569778 1529102 2088885
16894 2088885 1798100 2012236 1700875 1509897 1527230 1699231 1794419 1568330 2009464 1965720
16884 1965720 1817586 1754779 1824366 2016193 1800128 1889873 1957926 2283809 1853564 2053180
16874 2053180 2461231 1848338 2417575 2030055 2093056 2179156 1897516 2481756 2209989 2571856
16864 2571856 2215027 2405450 2281458 2692844 2323449 2458566 2392054 2678105 2893528 2813197
16854 2813197 2577301 2911247 2873225 3079222 2863496 2931930 3078874 2974285 3018252 3349572
16844 3349572 3146470 3189076 3547023 3011949 3244234 3351605 3320487 3717840 3392185 3873490
16834 3873490 3787868 3891919 3828065 3985477 3869813 3901670 4024775 4432785 4062976 4514601
16824 4514601 4568069 4888819 4803274 4921990 4632751 4770848 4925683 5122054 5106359 5433362
16814 5433362 5229334 5461321 5627897 5831886 5879367 5997826 6204378 6395812 6034197 6451319
16804 6451319 6216127 6728004 6942286 6941286 7357929 7514827 7588778 7617986 7930328 7727960
16794 7727960 8206163 8720181 8862105 9019429 9083482 9564346 9776157 10160512 10471280 10585621
16784 10585621 10845487 11024852 11604939 11876144 12067223 12625077 12813792 13442323 13604126
16775 13604126 13962984 14851377 14822342 15385286 16057078 16724858 17189971 17808876 18317572
16766 18317572 19068670 20212369 20415019 20842063 21811901 22902241 23561441 24732132 25862318
16757 25862318 26651558 27864440 29188203 30656895 31553044 33364955 34500869 36609456
16749 36609456 38265546 39978015 41764408 44045746 45945597 48502102 51479608 54607092
16741 54607092 57087631 60333509 63920134 67651043 71454628 75688181 80496645 85278606
16733 85278606 90421323 96075925 102329495 108326007 115140431 122695224 130408138 137774618
16725 137774618 145499521 154128522 162234170 170284789 177630184 185175544 191640217 197442539
16717 197442539 201271387 204468957 206197676 206030252 204638143 201525119 196968853 191531225
16709 191531225 185098264 177453873 169624673 161755684 153074223 144521844 136230735 127812993
16701 127812993 120342819 112963209 106180205 99459255 93043211 87807132 82118651 77283395
16693 77283395 72208797 68275495 64430104 60713118 57149185 53889593 51462594 48378158
16685 48378158 45791766 43453707 41117701 38781349 37024103 35306119 33714731 32096501
16677 32096501 30937034 29317956 27831903 26675468 25742834 24791074 23445442 22520119
16669 22520119 21805368 20845317 20241280 19485633 18655607 17959696 17502060 16721257 16301179
16660 16301179 15747044 15163330 14429869 14253028 13751004 13267491 12575853 12103840 12148884
16651 12148884 11321348 11013154 10747863 10574197 10169263 10332461 9776344 9318838 9348812
16642 9348812 9068854 8835223 8667771 8439623 7730431 8155476 7803608 7384087 7537861
16633 7537861 7368807 6752379 6778851 6805777 6443717 6660158 5761489 5851870 5872894 5774627
16623 5774627 5629516 5777153 5312261 4943493 5081146 5032348 4985650 4857696 4870780 4772751
16613 4772751 4424856 4582595 4527349 4147241 4288725 3770336 3848703 4117402 3878577 3747798
16603 3747798 3912122 3565324 3568800 3334194 3793749 3497136 3373373 3257925 3147871 3283112
16593 3283112 3296741 3072107 3027940 2703934 2944311 2843650 2901152 2696117 2494489 2631287
16583 2631287 2790405 2802316 2575530 2224278 2241496 2317599 2218994 2613474 2390880 2272071
16573 2272071 2405385 2239811 2311599 2120870 2255358 2484765 2159288 1956281 2156647 1943044
16563 1943044 1983681 2173189 1991812 1702273 2149491 2141862 1862200 1854100 1977911 1700232
16553 1700232 1588342 1609398 2101860 1719931 1376699 1344140 1546253 1422855 1781673 1690985
16543 1690985 1666464 1437470 1811618 1343787 1247224 1850252 1653588 1381111 1274429 1189167
16533 1189167 1189323 1049967 1164810 1343968 1020916 1215744 1243761 1089239 1255017 1375874
16523 1375874 1310206 990905 1213447 1132790 1498630 1070135 1297124 1533646 1354810 962121
16513 962121 1128737 1210806 1026562 760312 898643 970227 858171 1334463 761059 1254603
16503 1254603 1284475 1212385 1106277 1110581 710584 1057132 852620 1240665 945898 838030
16493 838030 943834 1070077 797084 1003313 915371 793550 1031960 1054700 836683 877500
16483 877500 1046718 941317 823129 756460 999890 958784 803130 800350 680401 662953
16473 662953 1053139 903582 770089 528202 701063 751697 941278 690316 1021942 675611
16463 675611 1007990 404696 529045 415979 709976 392978 490580 591355 269533 771403
16453 771403 597455 719667 514266 380814 534910 935083 627874 707677 382482 634968
16443 634968 846647 752274 513004 779364 834515 412854 910285 818358 653943 581213
16433 581213 795279 709353 886360 619768 484759 462799 724585 751950 611978 392211
16423 392211 715058 624748 688917 730930 262081 591409 486268 293135 477851 751504
16413 751504 783511 385012 576014 205723 880805 353972 443581 513229 753145 430740
16403 430740 452409 532160 250482 298575 608067 554732 223464 303754 479689 620594
16393 620594 427779 647377 136421 483553 690676 462472 328593 377066 553208 212135
16382 594735 456788 276287 276751 573821 519566 307367 397762 616208 575865 274739 246125
16371 246125 650063 631609 354292 428304 95705 314960 207147 513289 407184 456266
16361 456266 350450 645442 310174 -58121 514190 346249 145100 245407 304471 226758
16351 226758 24552 322815 535788 305378 222678 200383 411119 569028 -675 276057 247493
16340 247493 564588 169449 477024 322894 242142 518643 415785 272485 335399 130562
16329 384211 385604 23187 172540 351877 318603 477889 -54352 76658 131026 -133959 465821
16317 387573 295019 635658 263112 294943 753 428433 287505 282835 437159 439062 220196
16306 220196 195365 383497 194494 220883 222998 141345 106975 222098 420766 310291 344880
16295 344880 363370 41972 -1772 354848 314909 473753 205034 292016 75307 -34696 333595
16283 130750 204752 446468 195926 336564 52991 333222 98764 563907 352915 112008
16272 84812 -47508 96171 325137 676355 65194 -97841 262449 228636 427342 52191 465263
16261 465263 440988 137574 188881 396733 64743 108888 89464 538332 236462 40766 76795
16250 76795 252523 221492 404696 86704 315938 293968 538511 372124 147720 306927
16240 306927 595914 149434 -15884 162506 203335 106729 526893 96117 115761 99734 203695
16229 203695 141274 10734 206751 265436 470446 280606 241016 443131 185533 525264
16219 525264 133943 -62476 405072 145394 140786 376063 -24117 300441 162282 75323
16208 402516 148486 35818 128656 148908 5869 48465 258777 258803 323099 2334 -978 359253
16195 145299 419891 163117 76603 296660 262671 123797 182660 177120 32402 540070 395973
16184 395973 337006 201438 114520 59776 -86714 -31828 -206306 99555 59670 117918 71421
16173 71421 110405 258043 -160793 4960 -308109 262836 173484 -95155 320842 48732 26215
16162 26215 171939 164714 -93551 -72429 56606 317138 34968 -99734 64479 121769 82941
16151 82941 109223 392098 -270907 -215750 431649 -81087 14282 -26711 -51195 -28170 123964
16139 142938 472163 125706 423395 196012 167273 -91490 231797 157426 -350198 110809
16128 -148386 -175771 -389132 105865 314114 93596 151902 13958 -123996 -13859 225407
16117 125170 216694 -201392 62749 150730 69569 33217 231647 -216231 160016 102969 -175093
16105 -180623 248948 33077 255027 14066 217624 344422 7153 72432 -266202 107742
16094 55556 84338 13442 185717 -63986 -29312 -49922 -70886 114118 -273032 386657 183296
16082 -49517 205202 -31272 175410 43630 238306 78775 -91213 95058 -76603 79893 -207871
16070 142292 123617 -231588 -175041 -129697 -160022 -368816 172960 20842 80064 72825 -120409
16058 124114 125036 -56512 189411 -315055 -48301 34596 314648 102449 -184016 13810 -12199
16046 98015 239688 -164987 -43943 181540 338167 -95566 86508 34513 197030 -285043
16035 -159837 74466 -9104 86675 -235905 3695 191180 -211758 -91688 -108060 303405 245061
16024 245061 68983 -66668 -14619 -80844 -294186 -213154 -98757 217573 -219876 -127733 -405825
16013 -405825 -182986 -71702 226667 -28150 -182626 -112685 -147870 -197104 150482 -77120 -115653
16002 -115653 136294 -47744 -230865 -130533 -16400 -217963 -75744 -231231 -63429 -48732
15992 -48732 -22395 -27590 234602 230523 34467 245875 12791 -43736 115159 266619 283024
15981 283024 113026 193690 109073 -36000 37860 55438 -127859 -97756 88768 -225551 -274457
15970 -274457 148845 -30381 -19757 70413 -107188 -40061 36611 40416 170878 -56618 177321
15958 -125612 -37652 -13853 -120429 348299 245473 -126181 -258251 -48349 -259374 19048
15947 -165483 111106 -229639 -173796 -93210 -152673 -93411 -35835 -215008 -75182 -109987 -236973
15936 -236973 -316889 -96854 114791 185275 -123076 -154162 207190 73771 68742 -248253 41511
15924 -144411 94353 33127 212095 -197171 4143 -149369 62477 -20246 177979 62262 -150725
15912 -536394 65976 -112960 141012 49553 -175830 373 92491 -270529 -89828 69874 -33993
15900 57980 177787 -11805 -29542 -147376 51700 -150372 10068 10897 128767 -468401 193440
15888 -339218 -26915 108329 208827 124022 19672 -75347 -55542 102809 -184247 -10834 -235507
15877 -235507 -120191 -189455 -116854 -32049 132454 -238064 261990 -54492 23381 -28732 113694
15865 -89807 300727 -79596 223099 -305582 285146 -56921 24839 -144986 208376 15024
15854 176925 -203636 68663 27053 -420734 -210568 19280 108262 -116717 -232944 -84665
15843 -132237 -38821 -297549 -193378 -181054 -137107 -175332 100402 100578 246377 35902 33251
15832 33251 -116942 59441 8115 -74252 -45812 -216403 -83944 -431427 -98944 -198623 -28163
15820 -310987 226868 -259399 -30989 203203 206447 -277182 -99750 -283220 -53882 -2146 188177
15808 83855 24290 -91035 -23947 -22937 259287 108797 87792 -89653 -37162 338937 -105959
15796 -71981 73860 -33467 34672 -241442 153263 -81264 -119062 -136736 124043 -123609 -30952
15784 -57582 -123005 -212910 -279568 267016 -318282 -69105 90107 -1594 34899 -42165 -211303
15773 -211303 377068 97683 -174654 158641 172788 -219379 104377 -140464 98531 -36223
15762 -51138 -93176 80004 79315 -80292 165464 310079 -6466 -70300 349816 -175220 285949
15750 -56906 -89989 117755 40680 -96046 -233274 251556 -120199 54649 8828 141472 -270063
15738 -142777 -1035 -156175 95078 -57596 -117264 28778 -139480 -263435 270367 -169930 107867
15726 -303986 380262 -48257 -445400 -406561 -193290 -461870 196260 101863 -384774 -234128
15716 -234128 -23022 167949 -14613 18536 -260860 82638 -141284 -183215 -59618 169240 -123976
15704 -32713 -103911 -32344 225923 -173305 -415544 7170 77087 113605 -303775 64963 -92998
15692 -88326 -131605 -43608 167844 -59964 164763 -328096 -97928 227636 -30472 -178298 131489
15680 -15701 226815 -99682 -109028 19034 -140956 -287465 229795 100723 230215 410903
15670 410903 -165826 118456 -132531 -67086 -130369 -50899 318908 57633 6335 -22560 22735
15658 198275 73910 -94119 269611 -261296 -51130 -138834 183573 -23423 113976 119872 -68
15646 -228183 27556 47026 177492 -311077 -171864 -228276 -112215 41785 163696 -4795 -181396
15635 -181396 132339 -22846 82972 -14333 -341777 -422968 160154 -306130 -19974 64720 129519
15624 129519 52786 -80095 -49041 -87973 -147665 101264 15743 141699 26071 131150 -353959
15612 175032 -166613 54956 -271516 131854 134531 -34901 76878 -111033 367096 -39480 114950
15600 -123225 -143658 -6459 19511 193904 -35967 563742 -35607 -64123 274994 -56525 28641
15588 225011 -37994 232583 50558 -224950 -128684 -178250 30475 -164284 51067 415747 -430006
15576 112145 313650 126360 -98852 140445 49115 -176527 1891 182434 -117046 39103
15565 -99731 23210 -119084 -219456 -171402 -393398 90658 -56059 232906 -146057 -439204
15555 -439204 81894 68332 -142520 -77475 -137249 -112923 -22376 -211015 16083 -143520 -124939
15544 -124939 -35563 -175440 -90377 -112508 103368 141149 -348418 227595 173792 -5307 175482
15532 -254751 -153137 20772 145729 -33022 54012 -203772 107738 -117317 67067 -100054
15521 33331 -154043 -77907 -161085 294773 126667 -155694 148725 -57134 -151116 -269402
15511 -269402 -190244 128944 137713 -59391 -254629 -282163 35949 -217281 142284 -263192 -147438
15500 -147438 -187495 50266 37474 -129806 182739 27999 55316 -277802 -40052 -131876 134701
15488 -55260 131180 -148000 300168 -28381 141288 12006 -55031 384032 90440 139328 253341
15477 253341 -139697 -219009 288670 -168875 44023 191790 180916 -148518 -239965 -294295
15467 -294295 -60578 -18263 334501 254870 290947 -231441 -516 11567 75275 -17470 202518
15455 -117544 90829 83762 -250998 -113922 -84408 226947 202261 32326 -98680 -168017 102373
15443 -146589 -276172 -173324 216338 -49937 -105296 -119901 -166054 272830 -1705 -35377 -333625
15432 -333625 89356 -70442 -249804 -156082 -169606 374050 -334556 72381 -362466 -255877
15422 -255877 101841 225859 -100423 -254241 119449 187599 -147839 15442 -125886 322253
15411 -38423 97889 231141 -41364 -56726 263719 -4836 -142931 -92215 185952 58952 -294607
15399 468185 -172386 65822 424468 371167 -183443 340970 118725 174509 -60332 211082
15388 -33627 87459 103038 -202553 219439 -67020 150099 -91574 -164289 -116378 135022 -35963
15376 85879 97595 18094 -191040 122740 308613 114262 -51386 -20927 -5699 -44789 -33259
15365 -33259 -186177 101301 5736 -60897 189898 150612 -347691 284571 -20313 -54324 -69366
15354 -69366 -181008 177857 81493 -127758 37469 -165735 227973 105330 -73016 -96978
15344 -96978 87260 107332 -44139 274158 -4280 263719 234677 308212 -123488 124650 132260
15333 132260 342332 -55309 82285 37595 -66540 72697 -73000 397900 188360 -119633 -21846
15321 113119 -31797 -92790 140502 -35666 69479 148630 126555 156621 80845 -56702 -182576
15310 -182576 -146194 -266458 136795 44731 -316370 12191 -89115 -42893 85028 141980 -263986
15298 95470 120098 -387693 -84678 179937 283400 271529 147229 -246786 157838 112131
15288 112131 73587 60295 35173 -83826 347322 3466 97876 192406 244222 -71056 106661
15276 67759 190711 289551 128759 119895 180986 140010 139954 6688 31883 97819 -72575 -113726
15264 -113726 302032 219930 40784 41240 283338 316544 -90619 216040 150051 213469 201695
15253 201695 -180918 57494 129330 270721 571001 714551 1494188 2971744 2061347 2244667
15243 2244667 2123055 1053560 146278 -32479 158771 35912 7001 227564 -52388 2740
15232 124922 -294203 -297481 36134 2647 34677 -33605 -237730 2854 -2722 -11858 -278414 -1288
15219 -38524 -197538 257094 -219353 44538 190802 -33975 -81323 -175209 245708 208400 -118312
15207 239377 129014 393505 322884 -115996 -80068 191502 136607 347259 -204802 -84059
15196 -87547 3153 81920 -73497 -7543 362244 88199 -16694 201863 115058 186838 13385 -103883
15183 208881 -5045 366913 133299 208269 93845 -31599 291490 322975 67921 369030 229285
15172 229285 282188 355795 -156461 -102713 -29354 -93185 168960 306749 40391 3017 -73159
15160 277974 234080 145813 61275 244310 226506 -117184 341854 -15954 -121369 -89069 304345
15148 -66114 -1717 124427 220341 351432 248964 444044 -207388 114077 106249 47919 158858
15137 158858 215549 221631 318620 213300 135830 125892 203463 100887 72001 206813 81128
15125 -198164 125404 658379 -79615 665282 -196209 -11821 -23772 155051 633734 36952
15114 342558 -245928 -200170 470399 -61948 -106385 251197 311470 -197034 253170 -79452
15103 -3713 -86305 55499 131715 -145786 -12111 238002 316007 494226 -118116 57057 157490
15092 157490 96193 124999 301189 61386 -210006 181975 81308 147546 588493 300861
15082 300861 76681 291198 -18436 251199 208997 295455 -121572 157033 12551 206269
15072 206269 262222 345839 391987 68792 273526 136964 303829 127299 -43473 83534 463332
15061 463332 309062 298307 -239548 -266811 -155083 392221 -18781 -35456 147984 65494
15050 203857 168092 320660 347361 -33448 200996 280165 118101 279855 243382 98563 116394
15039 116394 -176319 162307 129990 148722 -249193 120013 12538 438140 -66562 171614
15028 328177 491131 169545 260333 188484 256920 191595 231492 376340 28287 451417 157222
15016 320185 221464 404051 170579 166589 99659 137207 -184211 382241 -8379 -9911 167343
15004 235840 -32851 405253 169873 -98926 156880 424930 -4720 290835 210014 184959 -112056
14992 374126 436493 342368 300731 607581 -47055 120124 -202722 113200 125585 -116730
14981 350818 512970 252904 -80201 361744 259273 111779 70371 316082 373389 61303
14970 296804 340729 261476 426972 442759 323393 203750 559715 -8755 58904 330121 237805
14959 237805 207746 122266 295306 67392 422087 196528 186049 -39428 418849 250921
14949 250921 427922 195584 66895 286608 112726 88913 466249 133797 293280 667931
14939 667931 206924 441354 387426 185601 -7379 -15602 538037 310546 274131 21337 261428
14928 261428 132013 337704 322776 110271 201173 361190 -21323 215553 -71740 668327
14917 -40762 298104 44504 -67503 852432 80584 361648 408165 221588 83093 216790 99652
14905 421183 327558 321109 213649 146265 290780 372183 420455 122437 322994 371227 265911
14894 265911 172902 510291 375501 166882 238455 516006 111735 64457 462434 114021
14883 527509 607940 463001 340135 299157 281486 239997 513313 -100497 708488 225769
14872 398465 553005 116982 169009 187373 429186 651647 380107 269101 340477 414421
14862 414421 333715 481368 462362 465140 314539 450874 425151 660340 259758 482479
14852 482479 275591 416982 596921 344652 726783 426614 321005 316994 159135 235161
14842 235161 487466 342015 446364 631737 544104 429369 196329 624467 620293 336855
14832 336855 462432 639733 300125 426301 224257 346653 375295 460304 361276 602248
14822 602248 574106 456817 458871 390076 386986 616787 724017 295165 488718 243618 792710
14811 792710 445013 415740 570975 936855 425717 746039 464583 321050 377314 276439
14801 276439 414162 637344 775634 540689 404788 379237 406720 798499 282072 410646
14791 410646 547305 570306 458737 560563 392496 563014 466530 564299 796245 379604
14780 661732 554971 461388 437766 378450 596259 467013 748967 442567 657279 308212
14769 947411 593024 970733 441731 781810 686953 658765 643295 803343 666293 468586
14759 468586 781139 726879 715258 854745 351322 743640 413363 704414 950739 645895
14749 645895 485196 587280 450673 509579 174411 971082 782406 908724 849452 852271
14739 852271 869421 841545 708625 669218 606081 527694 607767 623486 592282 818246 695300
14728 695300 556652 895270 906102 494503 707395 635293 713719 959937 921454 907259
14718 907259 559316 708614 529354 1079557 789936 607514 569486 998083 844869 797115
14708 797115 972518 752203 1068168 558680 693394 643011 943027 1063439 764341 744118
14698 744118 862819 830617 1205569 637125 796828 1167623 873993 920570 992598 888139
14688 888139 1001851 925015 1262898 981434 934419 1253116 967052 880043 669833 806347
14678 806347 868703 976587 1206661 1150517 804483 886954 1177202 776915 956246 965285
14668 965285 1312359 1055710 1203124 1048097 1110463 994939 1102124 1174810 1293237 1161087
14658 1161087 1292717 1262442 1063781 1271295 1135317 1353995 1276770 1192612 890988 1172303
14648 1172303 1251584 996539 1437120 1394635 1147038 1282548 1191004 1188838 1471017 1418845
14638 1418845 1404248 1253334 1043562 1439542 1112659 1178669 1377307 1114421 1099282 1395849
14628 1395849 1323037 1302342 971193 1636601 1848259 1450238 1375648 1692571 1422381 1609720
14618 1609720 1556080 1846560 1589086 1758139 1520329 1702987 1653563 1290263 1487633 1448749
14608 1448749 1421961 1028376 1588292 1500649 1609521 1793678 1603655 1477223 1680012 1783560
14598 1783560 1629718 1851530 2076806 1349958 1720668 1700832 2109573 1819576 1577391 2122296
14588 2122296 2025762 1773424 1992740 2043818 1887784 1784899 2157774 2287415 2242181 2074564
14578 2074564 1959650 2104221 2111723 2090642 2399549 2115984 2287410 2443268 2422768 2456265
14568 2456265 2821649 2442528 2584964 2346059 2470752 2907644 2760447 2526767 2806927
14559 2806927 2789297 3094743 3048844 3512843 3703424 3922783 3781829 4302397 5286090 6168971
14549 6168971 7959076 12803745 20875174 37179213 42558359 21578538 10161706 9350984
14541 9350984 5964936 3277220 2637945 1939298 2378805 2276778 2465519 2125748 2131108
14532 2131108 2239606 2309158 2525357 2346365 2234166 2395450 2201221 2333008 2144670 2665103
14522 2665103 2644239 2806627 2495460 2610280 2613960 2650368 2608863 2812585 2790063 2865895 2925481
14511 2925481 2970177 2859017 3110803 2833831 2880089 3148639 3277865 3064132 3535399 3287216
14501 3287216 3347152 3469623 3372710 3437376 3576630 3427928 3603746 3585702 3468066 3543968
14491 3543968 3879612 3624070 3721103 3761101 3826901 3458153 3859170 4196903 3824962 4169543
14481 4169543 3847194 4181626 4235142 3671099 4384015 4028403 4059255 4196025 4465419 4409638
14471 4409638 4552628 4230902 4435887 4311112 4150573 4679330 4551487 4799711 4530706
14462 4530706 4764220 4747767 4880168 4699421 5285228 5003090 5090371 5344808 5269696 5316602
14452 5316602 5454703 5354147 5637923 5631659 5576445 5780727 5881896 6005111 5878478 6032019
14442 6032019 5993539 6182249 6025530 6256646 6316602 6619842 6823221 6829823 6718975 6650852
14432 6650852 7169319 6991270 7016484 7109810 7296602 7608522 7240430 7324679 7800207 7638458
14422 7638458 8055983 7991912 7889041 8324615 8364561 8472734 8660679 9064374 8973348 8743948
14412 8743948 9535790 9270730 9348651 9642250 9943151 10053620 9964264 10107997 10284940 10168781
14402 10168781 11027241 10792433 10965686 11156032 10915885 11420504 11708499 12002333 12243853
14393 12243853 12313084 12565573 12747218 12774771 13105000 13617211 13533892 13503949 14134389 14246600
14383 14246600 14448792 14861193 15198960 15358296 15645326 16062538 16392796 16781296 16686109
14374 16686109 17257735 17529903 17703336 18138788 18515446 18717947 19406620 19914788 19920553 20356364
14364 20356364 20949914 21563239 22071903 22179743 22635930 23166306 23731193 24257374 24892352
14355 24892352 25675600 25963567 26914916 27504203 28350768 28826374 29675630 30452699 30696708
14346 30696708 32017074 32866661 33576192 34494956 35418150 36242503 37519623 38328751 39323692
14337 39323692 40345433 41780402 42811814 44003132 45578937 46997254 48381086 50024683
14329 50024683 51189319 53082216 54689145 56402238 58419360 60604651 62341021 64795483
14321 64795483 67082861 69321529 72075006 74448905 77063769 80335599 83327873 86549889
14313 86549889 90131449 93485622 97197825 101240979 105502476 109719237 114722204 119479438
14305 119479438 124729832 130242750 136217708 142202822 149086769 155563105 163242700 170961987
14297 170961987 179019015 187851760 197236334 207054841 217450747 227820298 239408853
14290 239408853 250908859 263149006 276120613 289666689 303613216 317736068 332254093
14283 332254093 347111753 361840000 377005081 391181820 405468192 419211763 432070398
14276 432070398 443537317 453921996 461918109 467143597 468918457 468579339 468039799 466682010
14268 466682010 464417014 459571279 451782899 442131094 430138534 416917384 402572662
14261 402572662 387490008 372196511 356553034 340672480 324990090 309495312 294443439
14254 294443439 279696432 266037127 254428583 241928564 229675007 218247563 207277618
14247 207277618 197270947 187358132 178943853 170524240 162265347 154945806 147689100 140994975
14239 140994975 134427342 128815043 123234191 117910052 113131066 108160643 103550464 99430948
14231 99430948 96077397 92080568 88539011 84875369 81553814 78571990 75464489 72990083
14223 72990083 70458457 67850939 65718664 63660606 61731766 59437324 57260444 55290700
14215 55290700 53608982 52348927 50981010 49106189 47645832 46293676 44951385 43845147
14207 43845147 43054588 41738673 40165739 39105358 38356658 36937173 36492245 35666104 34672942
14198 34672942 33364049 32781228 31839593 30786445 30506978 29482451 28891059 28198122 27220350
14189 27220350 26846361 26275744 25464331 25380044 24376353 23870190 23339598 22839615 22196107
14180 22196107 21655511 21414394 21362011 20392923 20336368 19719727 19202554 19134227 18631847 18116926
14170 18116926 17895912 17676832 17167719 16892869 17010636 16244431 15653448 15489467 15117320
14161 15117320 15075665 14689903 14714329 14092560 14271284 13729995 13523157 13077194 13156224 12661637
14151 12661637 12585959 12429044 12114926 11833335 11889247 11546727 11786723 11294367 11077324 10943194
14141 10943194 10705032 10560134 10513556 10222550 10154247 9846955 10223554 9639333 9790599 9143097
14131 9143097 9447624 9554516 8842384 9271999 8759735 8615356 8401714 8393157 8410421 8246845
14121 8246845 8267063 8191544 8147847 7766236 7500729 7515951 7681012 7260044 7566600 7518087
14111 7518087 7165334 7418962 6847314 7092707 6805535 6882297 6595929 6546564 6721139 6549975
14101 6549975 6309502 6530215 5993102 6018693 6193133 5920364 6202757 5983187 5710747 5899241
14091 5899241 5856343 5719425 5377400 5593295 5452983 5118348 5503019 5119054 5066238 5454782
14081 5454782 5095754 4933771 5009621 4858244 4933753 4946066 4926866 4840981 4733459 4488348
14071 4488348 4597731 4598495 4612400 4182452 4270940 4243392 4370396 4029473 4209157 4324752
14061 4324752 4425064 4242622 3882113 3978790 3809161 3803746 4109873 3531097 3777134 3674319
14051 3674319 3747461 3832131 3553005 3654840 3628190 3424626 3743210 3325804 3213146 3532024
14041 3532024 3067392 3305194 3316947 3107784 3306381 3283982 3019983 3144556 2709606 3089693
14031 3089693 3277313 2975387 3241054 3159633 2994746 3139419 2975912 2886457 2518481 2861118
14021 2861118 2833927 2752529 2499762 2754943 3025422 2982694 2839265 2673979 2150561 2551742
14011 2551742 2677413 2578707 2645690 2617062 2739389 2197796 2385182 2099281 2815753 2321455
14001 2321455 2709615 2279506 2448897 2345169 2361004 2581318 2215338 2307618 2605585 2193723
13991 2193723 2833587 3404889 4142176 7234631 14408728 31179037 43745177 26868186
13983 26868186 14102255 8286109 5814830 5337910 4460541 3865098 3521130 3578739 3180461
13974 3180461 2629376 2996304 2743916 2555742 2991725 2599830 2618604 2283576 2513759 2410936
13964 2410936 2436105 2405175 2043286 2148483 2432476 1955941 2117065 2150952 2424717 2184501
13954 2184501 2190655 2008030 2023821 1886697 2255604 1822547 2038786 1982889 1794219 2390511
13944 2390511 1910396 1703197 1824851 1875028 1925914 1783239 1806512 1847851 1806140 1723177
13934 1723177 1811855 1770820 1631083 1964068 1689702 1547169 1445204 1872575 2086681 1532512
13924 1532512 1431673 1627632 1572048 1692049 1583275 1492995 1201369 1517322 1411416 1391065
13914 1391065 1149458 1538449 1400392 1493837 1023385 1586384 1479826 1730946 1410666 1755963
13904 1755963 1585466 1398354 1382122 1523215 1609777 1786094 1574099 1305914 1526178 1347949
13894 1347949 1527499 1085150 1202120 1214114 1426369 1207552 1456743 1068639 1431241 1426853
13884 1426853 1153238 1788464 1227507 1198001 1482047 1616858 942105 1078101 1161052 872551
13874 872551 1361758 1306225 1311337 966380 838212 1410648 1072625 1461931 817915 987813
13864 987813 1335523 1263432 1380417 974362 1302362 910862 921974 1597485 1268036 743784
13854 743784 777846 990887 1022969 1127608 1077257 1338679 966475 1028665 1090779 836876
13844 836876 937811 1127877 1214604 1279018 1109962 1209483 1078142 882299 1051986 935875
13834 935875 935680 972252 728474 901454 971840 999850 934307 894160 831542 1093195 724719
13823 724719 1092394 1179525 830862 909285 1222370 619308 754786 700586 404002 1241247
13813 1241247 993817 1017410 855083 919721 1083318 1008220 936832 875923 1323846 888858
13803 888858 786819 1007760 1144295 640577 849857 518261 600314 676008 804157 797128
13793 797128 1176922 663667 1237683 702443 1072331 812676 796358 751364 556240 855715
13783 855715 839118 924957 1029183 662427 690040 1053788 1052827 839286 606643 534359 997067
13772 997067 806449 655123 778079 672125 1182580 575969 871221 781922 592964 580303
13762 580303 684022 1074227 558679 869733 896841 688632 826972 659489 433255 818154
13752 818154 835740 438745 590014 504401 703276 657523 649417 542309 603568 686273 676077
13741 676077 473708 817874 711970 791152 462853 342798 768576 820079 535163 746715
13731 746715 417114 673073 656153 391921 944439 684351 790850 365655 627054 374233
13721 374233 557528 312828 588856 556334 576857 581702 687747 638365 728059 566468 495908
13710 495908 457723 611140 541458 390460 572713 586408 768786 207678 484426 509942
13700 509942 671795 463016 90401 673845 394091 211879 470368 346014 665864 351878
13690 351878 542683 898493 322331 724725 691813 721595 686134 637092 110527 374432
13680 374432 592000 532911 818170 721700 598902 551045 414771 479075 381471 446834 390788
13669 390788 356383 273802 572335 614344 196625 248593 662949 747599 507868 526920 658796
13658 658796 692002 337228 631168 366782 434489 94345 591840 717461 484060 757091
13648 757091 306371 750013 156123 -28717 737443 574248 457787 275638 364960 328267
13638 328267 347804 533340 583739 231898 435340 372139 268510 656824 281405 53781
13627 581434 332918 498782 159037 403087 539042 527403 1040090 460547 280451 383262
13617 383262 431914 301801 434433 457451 133284 610057 380651 436376 674120 440352
13607 440352 258232 379885 444520 440977 637664 384592 375942 643409 139052 503117
13597 503117 744212 156860 371537 424183 48286 161583 408867 441986 562837 672661
13587 672661 688310 364128 357544 255873 741621 419535 479149 673448 623989 140473
13576 521679 304292 76348 472649 227450 101103 208795 314193 331569 629714 309062
13565 351969 442980 121095 323117 449875 330083 371179 264150 321697 395722 448662
13555 448662 126501 584815 523316 352464 514806 289453 332394 573715 295158 341616
13545 341616 150586 304600 290044 289504 93279 219788 615179 390567 471851 241471 339023
13534 339023 430747 520935 393332 294926 166030 119527 488584 243237 77166 304692
13524 304692 288535 200000 187276 345703 657512 428970 86795 622653 149282 287625
13514 287625 131371 172966 319804 118465 126806 557086 -101673 170229 559392 175980
13503 257721 459667 -41097 276347 387604 -45580 419723 350874 451241 509491 210417
13492 19423 273773 386769 225416 340124 391570 -500 278126 -148992 331081 402291 353874
13481 353874 52171 267654 316624 270633 500148 76122 -170886 53708 392401 81024 432723
13470 432723 387966 81097 175005 46677 100326 126535 149674 82814 272110 266968 252744
13459 252744 486383 580219 263404 392546 154850 285285 469007 70668 641618 456173
13449 456173 34708 -20639 338402 460446 421024 -133645 203909 266742 205030 155628 208369
13438 208369 320579 331083 277123 97221 416980 119537 -19488 153293 98230 170788 267609
13427 267609 -59905 230803 258372 54474 -29574 284896 141595 64861 -154817 -305806
13417 -305806 69639 446070 415422 21610 231786 372800 193308 -57028 -195732 -22095
13406 386578 244140 223969 407609 343423 341134 384113 132010 109016 109517 274246 242046
13395 242046 291731 396893 222126 263231 136066 309727 300009 -90161 239637 59224 253956
13384 253956 195572 153871 219946 108318 132929 520150 187167 353249 231175 356728
13374 356728 481286 338510 202627 529004 129886 -6621 254259 413406 752284 9860
13363 320757 46051 348513 360133 57016 -52405 120518 452383 143252 335233 507281
13353 507281 113722 296737 72856 -20184 181363 341988 323652 269742 514467 135054
13342 456330 483826 307910 244956 186754 147137 85909 249706 333906 267278 202570 367657
13331 367657 150869 123088 72588 19966 300879 84546 192351 302771 122586 41382
13320 139314 64822 191805 -94154 279078 109252 267534 260107 162130 386297 336904 147802
13308 152556 232032 131236 500778 395923 -328763 -190880 71962 176272 302430 136815
13297 -97062 314264 107449 45190 234773 205307 152241 219775 306697 308756 231811 46337
13285 81555 165491 40320 37148 69253 406222 39688 -15474 78766 31454 252275 98195
13273 54274 -190377 368257 -17707 28930 27635 310015 573790 448316 195143 62901 -9681
13261 123069 266641 179975 58591 -71978 -61651 -354959 411165 110675 -6301 202962 49751
13249 319930 488220 -222560 -171945 3296 15782 25462 54664 108256 43812 136694 128216 358731
13237 358731 210068 70139 83855 396829 -14561 341986 197445 -152945 177322 502500
13227 502500 226053 -29273 70967 246079 311040 120584 50329 262404 381401 139518
13216 30906 -2889 216471 -37376 -62462 -38783 107501 -61823 218485 241463 409993 -204587
13204 -161950 -76281 74286 -7243 201963 -265195 88923 114163 192212 247938 -77082 205431
13192 77584 -41730 355869 43712 115376 -36431 111160 -136190 -63230 395152 281710 60792
13180 1079 242572 142355 232954 23457 190527 21495 127996 -288950 49973 155950 89128
13169 89128 368260 -86875 -26838 209380 332650 261146 20846 198347 172192 -69308 -151990
13158 -151990 172882 -116455 124576 181118 74971 476861 91927 170018 91511 132071 -24683
13146 57979 419462 129018 153532 -122490 248189 -41981 411556 -128516 -212969 2490 -40266
13134 -114513 154147 -197204 -225836 294501 175592 -96775 -146196 -133974 68360 239286
13124 239286 7124 124739 453518 99074 -54924 60832 96851 609957 306292 240881 724585
13113 724585 2730 -8197 -1920 -185798 -449685 42209 -22780 5872 67631 36149 316416 38131
13100 -2757 188337 -81642 286660 25180 -62626 -75450 -146101 197274 261840 180446 101956
13089 101956 130859 30126 14682 -8637 -111638 -205901 38389 52273 121552 248384 142959
13078 142959 47674 1501 364195 -80944 219910 130874 -313230 120396 219081 96957 524933
13067 524933 -191834 23156 -173640 138740 65678 144398 337650 106013 -121945 -48580
13056 84933 183930 -33342 153619 89092 -120748 103287 203065 117335 -23105 44252 393625
13045 393625 264444 119782 49792 -38676 62967 303255 268424 179770 290014 22687 353727
13034 353727 -243413 323482 336163 221328 54533 120747 -1650 54947 31141 276600 285159
13023 285159 -115421 -161183 107003 188654 442053 -167964 221285 -42332 -240887 337232
13012 167762 197597 -49212 54325 392753 -940 129633 197159 341978 314573 72559 -34716
13000 30509 -42597 211672 -90088 -95788 -289471 243378 191769 -5290 -71931 -240322 49631
12988 100656 107510 -105809 127636 7532 307014 162377 -61463 420420 366805 307091 -9073
12976 -149593 322610 -42848 -12558 251089 -139161 373037 -28734 -27093 64289 138625 238145
12965 238145 -93857 146899 272779 82742 -58112 129309 -27487 20804 175673 490367
12955 490367 78556 -96009 3983 274855 32725 170386 -7801 23943 122347 216318 122051
12944 122051 155616 -38650 29777 157757 49506 37422 -61860 34909 -221 373444 51557
12932 -6214 -63057 4829 431205 -24985 52954 -228046 297368 33199 -48030 59432 -173781
12920 141387 180322 119094 64894 50989 -155598 176543 -258320 65003 -82558 290605 -1493
12908 -19115 -47250 -108900 -29557 -107123 12136 -127507 9073 -60991 444569 -213154 94661
12896 291965 132505 128671 347263 306129 -109613 -83194 166893 256088 243099 288586 52474
12884 -175429 -150140 76918 -269433 293494 135647 271206 -220509 130129 -87033 176369
12873 468888 -87897 -20542 -15562 -55217 -219302 113623 11821 40302 -122865 -35761 203651
12861 419466 -252861 116546 -181906 60366 291280 -190392 -135148 -320434 137784 -30052
12850 296379 256299 -87904 8551 136627 50925 81216 -62112 286148 95747 -121535 450788
12838 176929 65261 94134 -97246 140821 119590 470484 75093 5733 47748 -129191 -222011
12827 -222011 58986 127498 59609 218965 -108192 132783 237486 320553 -84573 -40781 42256
12815 360712 -23926 28522 -220462 92972 -279801 293330 -159516 -96844 34818 335065
12805 335065 158632 155859 -208079 -118585 241702 95311 167193 81176 160317 28782 58144
12794 58144 143715 -286799 90954 76182 400946 161802 37729 30588 -3218 83710 -230096
12782 82287 -67381 140079 51709 51612 -250080 91742 300271 -10137 117905 -58266 -68971
12771 -68971 56950 -297476 -104548 -33157 198944 23184 207419 -262868 -91892 285351
12760 14308 103440 67124 -287026 409547 -332104 195029 335118 -504683 211665 -340329
12749 -19874 -4446 29065 -2627 52257 -64826 530865 126746 -42761 241518 -57058 268400
12737 68386 19338 505008 132479 -271423 232768 -328506 190289 -24065 -85496 -21880
12726 -98160 -135740 444597 -73157 54158 -119660 -87054 66841 354713 -266510 66957 239615
12715 239615 32462 -277826 -199679 -138281 76527 83445 96086 -152826 96553 139256 250227
12704 250227 263258 110773 351609 156856 -38990 -199112 -12216 265922 -173856 179371
12693 53191 274895 -28175 -46113 100937 -63648 -15047 110893 69476 248173 279811 -68884
12681 -90966 -3160 320495 11310 165191 60217 21427 -342160 139613 330492 -160473 112565
12669 6755 10397 107551 365812 171075 573429 -96524 246510 -52340 290380 89177 -78412
12657 329708 485748 -122155 279974 -135870 -83269 264176 104217 198166 -2975 105722
12646 223324 148059 -188470 -39668 161212 242318 143654 145996 -196563 -98765 -1090 29448
12634 130518 177686 12103 195912 -80526 -43103 332221 189168 -40939 312097 258164 197503
12623 197503 401810 -182914 -92913 148333 184215 198493 48231 389596 24577 116991 -170439
12611 -218227 126764 193683 29137 135316 -80925 -29152 391707 -22901 272996 -18609 324162
12599 13852 165394 197793 201807 27973 193101 -214036 91148 186266 -86247 -86399 -185164 117781
12586 58473 151743 -57533 -63735 67314 201202 -24108 -67700 68719 41097 273010 205522
12575 205522 -381 302586 301894 -3370 8173 345660 -79576 142723 -111668 51963 153142 165762
12563 165762 -84323 108250 252368 94936 -134689 -424122 17637 4211 234453 337329
12553 337329 -26698 67254 2410 299573 -176797 164872 2638 -218337 89026 166806 -200409
12541 170804 -160439 33122 -85989 1043 -358390 254634 -103364 119729 -21709 53362 -36573
12529 202067 333860 95051 195252 90177 -63402 114332 -83981 170467 16630 15827 229974
12518 229974 161396 -156216 214049 197368 152423 187864 -5991 -77501 -341037 132326 -209283
12506 196615 -273055 158048 -351346 68134 -274948 -112705 -25742 -76262 -385626 75427
12495 -104700 137442 384093 301656 148834 -157687 1691 -249635 -368210 276894 129971
12484 -210893 135665 418435 -166823 72201 -95914 172661 -67883 -58571 -40997 220101 -93033
12472 197623 121988 -254099 80024 -175139 -38837 -138144 -100496 267982 192860 426389 26214
12460 -46650 -126387 -22936 93929 -165993 552405 46075 -257520 176730 47397 -69027 -108497
12449 -108497 36181 -154172 -176042 -19207 44135 -483349 175696 25980 -95733 -104447 206680
12437 -149195 185620 93294 36927 349630 -46442 -115696 6993 -120436 -89123 112824 177473
12426 177473 224264 117536 398595 -173130 -259434 -31994 -23624 -145334 -29187 116446 8607
12414 -59692 -94050 -74054 -146742 -231500 -10544 -276157 -75305 -204817 432318 -185744 217524
12402 -56408 92819 -108177 320638 -49348 -249116 215627 124963 165495 -19999 218369 -84907
12390 22424 40484 45443 8792 -113438 92131 -292777 149854 133349 -459784 98061 80142
12379 80142 -219089 259235 192809 86625 -68449 68553 -336 -19767 224163 -171805 33874
12367 101053 -92930 -29759 31142 41274 -289791 -162918 -128310 -114127 102694 25726 444290
12356 444290 -9839 182017 128095 162784 206932 249968 79531 272388 -28936 6871 269385
12345 269385 213026 80170 512966 108866 -15271 -160611 49110 -88982 -150987 -1667 -252940
12334 -252940 -101318 -113732 -215911 -50607 123039 -139456 80018 -113112 -18405 340841
12323 -236746 78071 -61884 17324 -120088 -148618 -86258 49359 24963 2916 -49809 -70261
12312 -70261 297354 -222867 140727 4681 111188 246624 159975 206072 -14134 -13435 109614
12300 148225 -72407 240469 173349 -204258 107618 -14544 -144131 113199 349186 155097
12289 -53429 -210400 174462 234644 167066 110570 -114869 39259 279284 -140181 172515
12278 227598 155311 -99631 263297 105179 -161248 74391 -305722 -182392 -20360 97470
12267 98747 92834 -50589 -150382 183583 92949 -214082 -241024 7493 182061 412689 -121361
12255 297712 7628 -13485 58006 390901 -47192 -152609 -75000 168830 218803 -42827 392551
12243 92152 13539 -201391 60351 333594 -46294 81034 150511 26774 -15329 465258 -70125
12231 139595 228727 -129144 -144718 -148038 -34207 88207 -27763 -173689 80335 318937 443634
12220 443634 68705 294634 -176787 126368 291390 -37016 -45737 162665 -99591 303199
12209 -21314 280567 153864 -47888 194023 -84251 187362 457191 113083 258235 22827
12198 250294 -101527 179788 -78182 237429 168886 455274 211763 24616 520119 241919
12187 -116014 -82573 392276 -34840 -132270 -2063 -83798 106283 427427 147059 -32405 160544
12175 77709 62765 13330 73971 -154543 273168 -41050 -102988 378625 -55133 -76761 38124
12163 49402 -38982 -180154 298810 92430 28730 118784 -59984 -98567 350004 -92941 79859
12151 144438 -47231 30835 218532 88176 199661 -154034 23895 -432037 514724 75330
12140 -73216 -180452 -298376 -216902 117475 -70963 365628 -12595 124857 -136636 -164347
12130 -164347 -154986 -450609 109311 276876 103501 -52684 -10360 -103680 411047 63974 68654
12119 68654 -34648 142382 131851 -151679 315997 36225 67661 328727 -311159 -246189 188101
12107 179905 187182 175288 181754 339003 -295144 14589 -176001 -104323 166338 -63330 -91555
12096 -91555 -127159 309168 -146693 521443 -97666 -4608 -18917 -107635 -110972 26660 -115780
12084 386682 104936 -4232 83071 108776 -128288 -63283 -36190 336360 127297 -91521 234613
12072 -185186 -39426 445003 226206 30526 111944 -60326 184176 -7258 -579421 329208 42759
12060 38530 -8220 -419309 16458 132057 -2912 -190397 -233314 -82271 117099 80717 -221401
12048 -294671 145958 219350 -60682 -233090 110466 -171153 71470 -142447 -107910 72183
12037 29426 -125825 -21543 -117458 410318 1127153 540404 213671 21422 11145 62015 18448
12025 185608 -236186 138687 135511 -40984 84004 -316476 131199 113785 76093 -144974 235033
12013 76817 -172118 114058 -112914 -271479 -116543 -227568 -17761 -182536 28097 108022
12003 108022 28337 -534789 -315060 51217 -321768 208890 -103702 -15795 -452821 -268175
11993 -268175 -130048 -121189 -212451 -352841 -219960 4500 59532 -19808 94027 19876 215155
11982 215155 192342 -424626 210705 -125090 40714 463171 -177729 -108795 100668 299795
11972 299795 -176832 -286529 279300 27630 197412 99075 264056 -37134 -74511 -142453
11962 -142453 156908 -92420 -171423 289806 -149969 -45346 219106 -90449 -298371 277713
11951 6357 -375295 -22390 93473 -39144 -154376 204908 170612 -136070 156121 -339258 4635
11939 -325074 12596 -143479 -63492 112650 -115755 230070 -133030 304851 -115259 78000
11928 11385 62849 356119 -144297 67228 -75466 -159959 163384 -468563 -175167 64746 98307
11917 98307 174910 -84622 -75817 30440 -230077 106143 -233614 -145534 -121188 273958 281199
11906 281199 97852 94869 -79978 89193 223193 199051 -236719 60790 170937 26889 195348
11895 195348 374853 -73494 70201 30975 -10317 -172554 -94194 191972 108995 -235701 16402
11883 -294190 32282 -51782 119568 -130234 -258852 23958 -114526 -117518 -367460 -107063
11872 -51471 135918 316642 -25282 -61645 117975 -105807 -138838 -129945 227086 -94359 76662
11860 -59399 42570 393593 177200 162253 34299 -108171 282237 199799 87260 -24370 -237403
11849 -237403 -34365 121813 -138254 42023 -79375 -201021 -148688 -96192 43741 158891 29500
11837 -388034 96455 9133 -191402 -27206 18493 -43114 -174587 -90149 -91747 201292 125172
11826 125172 -66260 -212910 175037 124729 34294 -437474 -37728 21248 -476200 -131553
11815 242240 20628 94280 67722 -248493 -181872 -446694 215434 37180 -327874 236837
11804 -223593 218265 -136816 90020 -5212 43975 78679 -97069 -97444 -152825 -108306 89277 -10581
11791 201161 -229418 -175824 -134666 182892 -59125 5278 26097 -146671 -412493 -57732 -179740
11780 -179740 272117 82352 -2767 -166893 181144 -16213 175146 40544 -2234 -19945 -15075
11769 -15075 -41287 129502 241521 243065 180103 26959 115290 45504 -8292 -257712 7461 27678
11757 27678 55187 -31106 -18178 -197520 20054 -168942 -26906 -55228 24386 -316571 -312131
11746 -312131 -36729 118523 94199 -85627 14584 -75050 768 -117624 -310978 -407667 -115001
11734 246658 -79228 16874 154629 36509 -269856 -63941 -91440 -106459 -123995 -255591 137578
11722 -27092 -98408 14192 273479 -240192 29862 12913 -252400 29008 -15912 -108726 96239
11710 254966 84238 24822 -184948 285586 -364082 -437747 -370072 -422851 -106935 2234 83887
11699 83887 161649 63327 -90222 -265234 -61715 236109 83376 139131 -58218 151683 -87592
11687 199090 -280212 -282633 491971 -105393 -409531 -158951 162263 261511 280153 -267918
11676 -64427 -558372 9390 -193577 -443767 -182275 73668 172673 -283599 -122347 74268 65974
11665 65974 185066 -146292 -145776 -96939 -115925 -135978 87453 65267 -20314 -403820 -21834
11653 329086 -97315 99028 -137341 -15110 -247789 4876 -101305 -93160 123468 -104101 -125958
11642 -125958 -207009 -181016 46580 -87420 39241 -88673 277138 -270354 100410 -134676 7828
11630 205122 -87219 193418 92459 403687 -106267 -383913 -99505 -105901 109722 4447 -177353
11618 103284 125613 120815 -128713 62947 -173676 -257172 173586 72351 -112413 -80732 -274317
11607 -274317 134038 -75450 141696 -429104 72730 -281434 151962 201915 -154826 -181161
11597 -181161 -18560 411625 -326836 134007 -44861 138186 93866 -192603 -465419 367860
11586 -4664 9606 -304812 197046 -103483 25419 -66749 -76504 28527 -49565 -39956 -175960 -181989
11574 -181989 21002 -91306 -122550 242488 61614 56585 -36454 146899 -47306 102522 -13482
11562 -153746 -43806 54182 119047 28592 -54334 148470 -72634 -52537 -88348 -2737 -158101
11551 -158101 30850 55464 -218176 72378 -177669 -317277 59739 -113551 244722 -85274
11540 -90011 77943 -125445 78793 241818 13994 -10831 267446 258775 -133719 -351119 -56595
11528 298523 -18170 -22472 -16319 4478 173376 300829 198974 -301352 -413942 -133618 188845
11516 152677 234956 -378223 -235147 289150 604474 -14657 52308 -130902 6183 98472 214477
11505 214477 200077 71205 184027 20800 -169726 42294 89108 143760 298674 206129 47962
11493 120516 -60974 231900 162632 255515 -339145 107376 457792 -172757 59394 -150878
11482 -180415 78514 526921 84142 257966 145172 193388 123828 212025 -28431 186246 201032
11471 201032 146627 125708 47000 -80866 225971 115884 -42468 64085 17944 -166310 -20701
11459 352470 52071 -90564 320170 103328 173024 103026 572544 -212205 106189 67329
11449 67329 -175208 -96289 -52112 138047 286683 -61299 -34994 151808 -248770 -151459 323105
11437 -278088 -237374 83812 70331 253310 -133468 301565 -198940 117200 214188 61646
11426 -214569 -271260 -21562 -1617 -99901 -290270 5748 -69994 -192622 -50456 41774 -358873
11414 27619 -99659 95038 -412965 -174786 24778 -146957 -8150 -8203 63198 -191102 293041
11402 182248 257483 -224115 143839 -171084 -183239 -426755 -247669 91231 185031 -58683
11391 -260244 27993 -45809 -67969 185620 12472 -53869 20801 284262 13674 -380051 -490845
11380 -490845 -418531 -371875 126287 144244 -101427 -186348 63415 132762 -192995 -75820 121000
11368 -33693 226900 -99076 64653 195801 31663 107049 48777 -32921 -176722 28515 -293228
11356 86691 70335 -39941 57061 -203733 -181186 236921 84343 -59828 -116447 213133 -254237
11344 -161830 -238404 46887 -33322 -227550 -129358 49662 242830 81225 -116704 173260 38511
11332 -188145 137521 77884 -153956 51687 -57603 370394 -272775 190357 -162149 329709
11321 -112205 60305 22156 87674 24378 -33425 -246499 53941 -87793 -214417 97583 -78449
11309 -154739 -360872 -180735 -94514 108868 -212447 -82013 -58291 72514 -156916 156226
11298 -11662 29554 -265265 -148123 -105938 168437 287006 -6949 271636 -187129 -431162
11288 -431162 290128 115150 510683 -94943 -2587 -250246 -69280 -502633 58079 -207468
11277 -91470 -151150 268281 180132 -295889 129195 63502 -9312 141579 -103001 -32201 -225622
11266 -225622 9595 -59432 -99580 -127283 -64629 88729 -219122 -205404 -99675 -207966 -171098
11255 -171098 -202628 -78108 107278 -88635 -293137 -41062 35099 29698 -92205 28208 191088
11244 191088 -312502 -91983 -78559 -281004 223322 -143692 -162437 -116292 164087 -320466
11233 177758 -212026 137976 -94489 29687 -356538 -15805 -70800 -6136 178331 -1685 320777
11221 -159256 -112447 -97934 34874 -181464 -39997 121084 -179746 97281 -12897 88660 -181250
11209 138789 -43214 -38925 -177234 -43915 167699 175576 198976 -139058 58643 143529 -51906
11197 -175784 -85965 221004 -301681 -160137 11920 114057 -107105 262010 -69812 -63885
11187 -63885 -32378 130004 273614 51883 -24787 -118789 113657 -64268 168723 110214 4420
11175 -151791 -21063 -87107 40128 -322744 67221 -22337 -329727 52032 172240 -125528 -125733
11164 -125733 -199759 386643 108719 25600 255185 -10838 -241654 79835 120015 -147891
11153 4027 -117278 81392 -80180 -18506 -41367 -48837 115397 -10650 -150934 155180 313189
11142 313189 -228169 -339648 335755 212861 -179429 62663 53981 -38778 215144 -203307
11131 316901 264315 157537 -108984 -86323 105610 29626 19757 -240265 -256831 -162073 151348
11119 -79729 -109684 325590 196140 96139 93519 -125087 -139063 148468 66371 291680 -41254
11107 -386231 141131 344477 -267622 -6446 56935 295015 270188 298987 -309389 -54794 -7120
11095 217022 253639 19019 30280 293806 70416 -52704 187073 317247 16609 304547 228959
11084 228959 193416 396469 79565 345228 -64681 13489 -97291 203823 90199 106120 197923
11073 197923 291120 407769 467216 481836 294707 425241 643170 448753 396865 390693 511118
11062 511118 676920 337867 336668 738903 389585 542216 358955 320089 405117 776030
11052 776030 487611 721475 404802 822304 685035 509383 783691 807861 731287 775570
11042 775570 558833 542537 604372 471887 470472 436170 752333 709819 635588 844838 752463
11031 752463 499649 717007 589441 555317 571700 621354 382033 518176 441449 612363
11021 612363 234311 557128 702678 280441 408708 266516 658401 664432 475794 587046
11011 587046 739593 247824 333831 448042 644109 546613 567996 410681 676450 567337
11001 567337 394368 751690 855636 508173 479163 539060 805167 398252 232099 754964
10991 754964 369350 885501 689522 705273 753880 572008 561741 934752 1099438 853086
10981 853086 1050268 1177962 1249771 1362218 1524206 1795167 2152604 2158818 2319984 2500354
10971 2500354 2653413 2763532 2540485 2396609 1789484 1645292 1347167 1440216 1417493 1007256
10961 1007256 840831 1048120 1104208 1003346 1230097 859123 471065 216793 188468 362806
10951 362806 190399 280170 21925 332347 117871 392952 32739 156135 182549 250686
10941 250686 271311 65250 149728 273433 97426 420134 327211 -104503 -119346 47837 422176
10930 422176 -91228 263953 -111714 -60532 -165790 -193177 -53906 -239572 -269885 115709
10919 48603 71252 27245 -42436 -102867 374720 173370 -218130 -195497 300306 -350382 -166939
10907 95371 -135811 -254110 116796 -71920 -24336 158052 -78616 -189145 -156451 -162929 -8722
10895 -6616 -126290 -322582 206206 2157 -38534 -253800 104808 85202 -359748 41162 -22036
10883 51585 -12936 -73609 287306 -64411 95985 -206160 -67960 -190417 -5472 15935 240157
10872 240157 44998 -364271 -327236 -60243 70469 -150859 -43518 -16375 7509 215752 -116198
10860 -3360 -283152 33569 66971 -40072 447076 -187878 -112902 -92756 -285409 156493 -107539
10848 -96499 -29370 -142940 78812 -127557 -143292 -148394 138466 226526 104889 -81420 -228093
10837 -228093 107059 148858 -122190 43808 262713 -356099 23850 31806 -117135 209026
10826 150730 237354 372200 -53187 -193941 -158422 -211750 -108988 -56213 225582 -200936
10815 -9082 -175393 165673 -2184 -224580 69537 -105364 -85144 59816 -67811 -155915 -52057
10803 2505 -226689 349301 7020 -425772 232338 240436 19825 -92188 120814 -60540 -92335
10792 -92335 -331884 -181673 -75692 -170135 74535 64764 -343646 134763 -48241 173652 -135703
10780 -71334 -90002 116165 -273896 -194329 412329 87394 97806 -333299 274066 432071
10770 432071 -164637 -224247 70368 253027 -40339 331005 -58715 42601 19210 -184525 174440
10758 -136131 -68782 -1093 252157 -241805 35865 442224 -414725 -257317 137963 168881
10748 168881 -57606 40440 -82523 64199 154633 -211210 407862 165090 -43809 -159726 -170658
10737 -170658 121749 267804 203695 -231547 -312558 13804 161532 -120951 40152 83179
10727 83179 110181 -216005 -608 126399 -222157 -42414 -325528 -226798 61820 -339965 -222369
10716 -222369 73743 82814 -150993 105261 -384754 264536 -376041 -97893 -198405 212881
10705 83994 -51102 46261 -288767 -36870 -96582 57691 -215966 -178133 226648 2144 -26591
10693 88901 134338 42286 14182 -225017 -141259 7586 -15616 269129 -158539 307 -355667
10681 -103466 -271550 -198953 457700 187901 -337133 -81968 -39855 -110011 313933 -90646
10670 11231 -303844 -81499 -170022 143835 -101899 -94629 -159278 -258537 79829 -537062 38754
10658 -108732 -109701 -129933 65496 -57440 -220776 59458 260449 1808 -192081 -185468 -42058 -344010
10646 -344010 8432 -52281 14499 -2999 -98781 -113878 -271943 40623 -62077 -123863 100428
10634 -34723 -91455 -34576 -42723 192945 -79214 13829 264319 -87174 25244 44282 179699
10623 179699 99660 -221229 255292 -257219 -101310 63723 119433 -134888 -44417 44173
10612 -10410 222740 -229331 -31803 -157475 -110640 237370 98437 195867 -115792 66952 368789
10601 368789 -74746 -56194 -126300 -44117 1294 -160419 -8123 -91763 -52529 -10285 -100892 8354
10588 -423006 -59563 -319119 126618 -193613 16043 111227 -324320 -187091 -128135 -273912
10578 -273912 -333440 -171891 -83732 153958 -179719 80599 -282930 -37751 1262 -177006 107851
10566 125424 207670 196963 126653 -122398 -93417 -329800 -133933 50650 104115 184764 15357
10554 15623 -353652 249726 -123988 -72195 132422 -13494 302002 53451 35881 105864 109642
10543 109642 -224866 -11465 -17439 -57749 -82704 -41858 -290790 103402 -269945 -286914 14861
10531 149905 -61652 -8665 33318 59776 -58114 -101569 -126616 -68579 53840 -100994 47850
10519 -162548 58345 -244064 -89134 305000 216628 33845 -159262 -24165 132320 -182958
10508 -18736 -71280 -133716 -70968 34238 289734 185075 -104408 112169 -76259 26793 30272
10497 30272 -12221 190800 12885 -307263 -262599 -334195 -16468 -114571 -254030 37978 121397
10486 121397 23847 -93299 49849 -10791 62144 122287 -335835 -286173 19979 -62094 421493
10474 -185763 85154 -273011 -109807 107109 -267264 -156915 165874 108799 240896 71791
10463 7391 -12138 37250 225972 -126975 -422924 48889 -104218 -15894 66209 -86440 -249576
10452 -249576 320006 -382996 -132107 -200820 296086 127551 -307156 328008 -69201 -345726
10442 -345726 -79218 101409 -149697 28909 -2895 70703 28778 -70923 -53894 -129781 6501
10430 -149187 235177 -86958 140399 174534 272825 -49536 29806 48433 -21540 -284125 -293310
10419 -293310 -340308 105233 -245380 197251 104311 216054 -100089 -213297 -118837 -40394
10408 111699 74705 -85844 99948 376668 -199227 -123235 -229681 -119321 -178546 -85336 165120
10396 136356 169748 96704 -78795 106130 172955 110660 150129 -26305 -146696 213598 128438
10385 128438 -17840 427478 -100045 362190 28213 191131 305326 -10335 407084 231172
10375 231172 486816 329986 6323 362057 104637 -32333 394999 303651 424875 329012
10365 329012 443394 224392 452976 146002 109891 50869 50422 53667 168949 237204 374337
10354 374337 418050 267875 235322 725154 559953 451553 160949 238031 419490 -47885
10343 402245 145993 298002 244645 463530 25417 -187610 290018 -320191 235810 309829
10333 309829 -67824 65001 -280276 -333684 125292 101525 56457 395570 53234 298012 -39215
10321 306881 -276977 -179735 234049 -81899 -108801 -259096 205253 287224 259603 25880 -17132
10309 118304 145125 -168229 -264686 -65974 -84664 41428 -83113 -211902 205518 76279 -113442
10297 -150615 23426 376735 -155985 71529 -95619 -32188 -85377 -29571 -297030 314089 -149701
10285 -65080 -79214 -94326 -14404 124792 -75125 75578 19154 -199180 -268235 -247673 43539
10273 105395 -216095 -41729 425338 -85716 263828 -155657 402618 -213121 -147969 122822
10262 85612 106537 378016 123812 -62532 164956 88555 -178081 339444 77358 316558
10252 316558 -179270 -147513 -22502 -118099 13522 -65618 -314692 -145503 -63814 -481550 -107678
10240 81948 180703 -152005 63216 -187320 50200 99149 -133874 50664 -187122 -229998 158274
10228 51400 -30636 -94903 -56423 93077 75595 -146825 -209936 -80702 220302 -41287 -214290
10217 -214290 -77648 -104200 15118 197814 48072 -189997 -203917 -146373 -20557 -266754 -259789
10206 -259789 -138508 -204826 168385 -58428 203006 -80126 -245135 47309 101647 -3206 -56605
10195 -56605 -146042 -326858 77148 8100 -104643 28105 574457 67236 209636 -159770 923
10183 -181879 -241204 -158220 -95407 -179741 -502879 -114822 57170 96354 -15133 -187666 72744
10171 111989 91538 -84384 -420096 52093 -145821 -102200 -47393 -210474 -162419 344443 78082
10159 -103061 -195350 -221945 4770 22321 -145083 76680 253108 56218 -67805 200305 -428832
10147 237788 -12414 363356 -219757 -141700 -249705 47397 -14983 -35481 -457431 -144299
10136 14484 -59530 103644 62643 -363506 -152222 -103792 -13602 15854 223983 -155422 108978
10124 -47572 -102391 -181038 -121969 -88501 -50658 -100300 -96167 -292243 -313120 357854 -43918
10112 177975 -271049 153411 -32042 -28970 -3749 108929 239431 245917 -387426 -508959 -211478
10100 -351877 -100074 -112707 146285 42417 -229686 128158 4966 -66037 -114693 -42543 -11133
10088 -312746 141711 -43486 -58734 -85689 -251830 -74436 -100824 -234521 -152389 -171741 75443
10076 149171 52654 29582 -250568 -131187 206301 -282241 -90671 -348515 -218926 -5937
10065 -54501 66276 -362753 80209 57205 -96340 -73364 172209 -145221 84072 -184994 247482
10053 -147412 -149266 -4884 -188209 -358871 171665 -17505 50220 -196839 -72296 83488 -149607
10041 -226520 -227084 -102953 78397 -256902 256525 359931 -205760 173439 -1646 -30557 -39100
10030 -39100 -99774 446885 55528 -237658 141626 79731 179927 -354708 -197497 -18763
10019 61382 -115751 -168887 25446 19608 -4414 23601 -95952 -115595 89152 -68605 -113730 37672
10006 -159179 29501 295393 125603 31664 122709 -159544 120779 337476 53379 -257104
9995 -409787 -243319 340285 -216374 59932 -165290 -236953 106797 70268 180413 214272
9985 214272 146387 -41135 32763 -123324 -438619 17182 -112270 90705 -107111 -36417 212323
9973 221520 54641 51269 193613 -222735 -141823 107819 -134371 -14165 -74268 -41670 -54044
9962 -54044 267 -73826 -107863 254255 -14498 70589 -281537 -96211 -259776 -346422 -250790 135392
9949 -188075 -97770 -86028 39236 154267 -207153 -103070 224008 -116497 -253869 440944
9938 207383 -206470 -30763 -120620 -376961 1621 23572 -239642 157026 -229690 311079 -72513
9926 156616 -66645 -113852 -13384 -182898 9028 -180041 -72940 42072 -171858 -110675 -424428
9915 -424428 22459 -22828 -72099 -598151 -22519 -54604 -157885 -132884 -81728 22497 47761
9904 47761 -563372 -84191 -331981 83709 -401151 57887 185001 -77485 192173 59778 237338
9893 237338 43297 -180658 -342433 -135773 2319 -23941 177826 -441740 -154007 -322342
9883 -322342 -283972 -82332 -192360 98520 -145699 -485377 -177000 -385038 -244303 79639
9872 -280989 -384297 -119157 -345214 -399020 -93506 -11012 -257222 -160250 -95629 120835 -277723
9860 -69898 3302 18389 119699 -154330 -143948 263462 -69954 187350 146545 -321229 -204997
9849 -204997 -664610 200098 -122370 -85357 34095 -33730 -103894 119356 -300477 -109667
9838 -12822 -290539 -226083 -130954 -218994 -316731 45168 -338868 83141 -200874 -109324 -394219
9827 -394219 -83091 -120026 -212079 -309735 21107 -39754 -254636 110981 -129029 -57912 188636
9815 93619 -188477 -55315 -103675 131936 -41945 -269426 -301735 67598 -216304 -119624 -49587
9803 -154843 -117841 180644 -163079 -100201 -138264 143151 -67235 -29390 -59732 -150678 219362
9791 -54701 -174305 75785 140800 -344546 262152 134128 48798 15616 -339651 55755 120110
9780 120110 -248635 -235889 -282105 -222251 -247974 15531 32078 -154156 -96091 56038 -240000
9768 -362237 115934 -461709 -165642 -6570 213335 155792 73377 -16198 -230221 -52916 149488
9756 -287422 83711 -475757 56138 100782 -62171 -59882 62317 -318428 -77850 -235893 -153905
9745 -153905 154681 -163534 -92189 155683 -84091 -435572 122845 185267 -90429 -179033 345709
9733 -33546 16825 -135306 -80487 -70600 -298465 -15206 89350 101221 -122878 302992 -8655
9721 -419414 -119178 121486 -151578 12838 -66668 -87001 -184793 -58795 -293376 -83154 -46541
9710 -46541 -141513 -218893 68395 72655 -326111 -44639 108611 66200 -40850 -294297 58067
9698 -253419 32214 -161279 118874 51209 -259715 -45572 -91773 -368886 -126057 71752 43730
9687 43730 -104009 284354 125764 -26338 -243367 -135338 -245029 101142 -164800 189652
9676 -31965 192812 -318987 -269412 68409 16719 -238823 89520 123286 58335 110518 -104527
9664 91182 -127226 156611 132017 -374004 27450 29035 -247339 -223178 194223 -229190 295765
9652 -9626 249571 -18568 -118338 162941 -88200 130905 -235243 130990 -59799 -263158 50329
9640 39525 -146290 78764 28965 -278641 -16611 110853 -151474 -112421 146889 57603 342
9628 -39210 -156343 59567 -403056 19513 111772 -49148 -67793 -74950 -201728 107597 42526
9616 100360 78503 -405211 -154902 -271844 -229596 -435360 -263457 331196 295455 -176648
9605 -160588 -225467 148319 -44976 -26222 -381382 -213249 78306 -285045 -132379 91565 105960
9594 105960 -90932 74847 -172873 138790 286199 -43438 91677 242975 -101244 -10230 -3608
9582 -272211 293061 -2617 -77656 114982 199571 -69609 -337186 42975 -69058 156788 74996
9570 206135 -38211 98726 -224072 -24425 -252700 -31116 -461708 73883 -215697 111833 -96520
9558 40923 -48338 -142694 -271096 150733 -374159 -324529 -167583 23638 -179288 -80060 -83393
9547 -83393 -279582 -303525 -366211 -90032 -10537 -90373 -353636 -60059 73168 148502 55108
9535 -83528 -122874 161224 -39150 222679 -226238 -332418 -100401 -78255 54349 296141 -15574
9523 -334895 -7321 -267914 -163306 -106761 283015 -324519 -204635 148710 -138219 -51249
9512 -5697 -355573 -181855 86993 -124043 349018 175040 -154461 63161 35230 -132908 -170594
9501 -170594 19995 43138 -268143 -97601 41013 -78433 9412 -189450 -118355 -172772 -209750
9490 -209750 4550 61853 -144651 -38572 -237456 -153925 151022 72018 -320188 -335459 -112541
9478 -123965 -228987 -88422 -252452 -265656 236498 -204521 -24197 -158063 20574 64092 -98632
9466 74668 69064 84871 140476 21194 -92269 -257461 -127617 -33005 31877 161023 -344164
9454 10042 112840 -237856 -242477 -14016 283338 379078 -194885 -113446 42295 -198581 -79164
9442 -437302 -176894 -203983 42198 39731 -60418 -334237 -10977 130222 -281403 -145320 303302
9430 -277186 -37656 68190 10620 178397 -262101 -180193 182459 -35005 -5368 27461 -32479
9418 277529 123272 179919 211524 88811 104347 -20780 -286743 -204811 44632 -137669 -89485
9407 -89485 86003 -88315 -101029 -242313 -282068 -86531 -126457 275458 -140996 -163009 -320215
9396 -320215 -270092 -300192 -47522 165504 -16508 -156772 -18633 -244394 -136014 -137902 -241708
9385 -241708 -151667 163613 150664 -192821 -59909 332714 267085 -20171 5525 300523 25804
9373 -54893 -44695 -243927 -267713 -87400 -30485 -96370 -247258 -108345 158631 -102734 -292784
9362 -292784 -84455 31234 -351065 53405 379270 -174462 -136578 -54619 -136039 158489 -124336
9350 -7212 119073 117903 -76234 -23200 180230 -91322 208399 100361 -144857 39077 210673
9339 210673 -59594 -110469 -58573 -137325 322121 -152796 -218862 130253 359468 -260719 -257303
9328 -257303 195200 -142562 7340 -95403 -186665 -175102 214130 -29858 -130665 -143295 -422305
9317 -422305 -35428 305883 -233637 -283477 67587 34278 -148869 -203935 -348015 -20003 201241
9305 -80440 163699 -183870 -42099 -206165 -170273 -67101 -111056 78600 -87479 -62140 305299
9293 -54130 -62325 136220 -135918 -101167 -81123 167135 -214345 -90921 -114057 330512 19255
9281 131481 -58318 51643 -69363 138356 -115369 -113495 51363 -38004 -413011 217095 -36467
9269 -80935 -208832 -48492 -239956 -89714 -131282 38133 130094 -14447 41162 -136460 283319
9257 -357842 -140234 200768 80748 59663 -374811 -648680 -71532 -217119 162528 379055
9247 379055 328798 -69014 45732 -51068 -170862 95197 -126488 -115240 -87336 147608 69140
9235 -181308 80741 118086 -283925 143094 -273559 -606481 34894 -362750 -353331 -146147 -326128
9224 -326128 35758 25139 -15959 -295505 -242818 -148973 182778 -83814 -205798 231895 284030
9213 284030 -132271 -94738 -61324 -34203 -3538 -263165 -161686 99203 -398804 -142460 -38899
9201 125671 176782 -238567 42024 -48947 25403 -154735 191995 29996 20340 -168716 -20758
9189 -287462 235562 39204 -205303 128896 -213179 -86860 -18102 -73301 -236412 48715 256090
9178 256090 -93496 -284765 -26118 -425429 -347453 -34593 -128984 -359918 -350521 -59862 236099
9166 -108655 -55003 248716 -82746 244993 -142625 -176070 39174 93364 -42262 -181923 77817
9154 -349536 -49999 73773 -17307 71902 12983 109422 -231996 -340486 -196793 75653 -243072
9142 -193648 -235104 57756 141967 35269 -34182 96222 290793 42673 53638 164612 -139868
9130 191236 103357 133006 -218491 -64800 4920 -283159 -149335 -157600 -150430 -36046 -179206
9119 -179206 65100 -344329 -179689 -11180 -171696 -183906 117342 -18316 -349955 41177 -390483
9107 62381 -124078 146526 -241492 757 -137927 143659 80282 38263 -242951 -57209 57480
9095 -81248 -54455 309126 -65009 359582 -53772 208682 -453727 -493341 -541525 -310 -262845
9084 -262845 -148402 100882 121764 -282779 168694 -213964 -117489 -183751 -80981 -184881
9074 -184881 -59604 190908 242227 215909 70132 213319 218742 -128316 -235340 -157969 -206302
9063 -206302 -8958 243790 102151 -196557 -281169 -88293 129846 -16347 -98234 57690 -54071
9051 -3912 -148492 175995 -189044 349392 86833 195563 -82463 68131 -93218 11453 -506092
9039 73457 -98834 37402 -218413 36715 70511 -247395 104203 -129897 270398 69159 234034
9028 234034 -81791 24955 -71863 336244 -97563 107555 76829 116290 -4745 91477 76344
9017 76344 74458 -119590 247076 -5753 -103553 14333 -390412 -155378 150678 -2774 -51741
9006 -51741 -17985 -25157 -333253 142492 232737 -62039 68392 34119 -267996 -35672 73814
8994 -80554 -335745 -204302 -238822 62626 -18937 -230409 35403 231129 208678 329534 -17550
8982 -50077 127465 -125153 -127810 -4791 -37502 -28124 -46958 307305 127994 45629 193580
8971 193580 41624 191937 -240844 -98137 201270 -157032 1431 -78199 -194931 -181944 11017
8959 -184398 48507 -73341 -140061 -80596 -173006 -5960 58248 167561 155603 -111233 -377477
8948 -377477 335944 -357833 -121254 38767 -245592 -3993 52040 -61425 1947 7492 90841
8937 90841 -85348 286401 497131 130942 -272926 261305 -410628 125820 369321 -9869
8926 200846 202930 603317 616985 2523444 7893653 5223937 1334980 478887 228573 237380
8916 237380 10358 128945 -142331 -107731 55447 -45229 -345970 100429 120211 -60103 -79685
8905 -79685 91087 20302 -117473 -261097 24559 -118948 -274959 -189366 73993 90141 164347
8894 164347 9808 -150920 -112040 233745 -179031 118790 -182097 80942 8488 -64696 -55634
8883 -55634 -57703 -147769 -227574 62410 132889 -241694 -187710 -10527 -53536 -225718 -67791 -420281
8871 -420281 -107757 29622 234525 15783 -98528 -25534 45622 -2301 -207530 -182925 -196639
8860 -196639 -190870 195009 -431076 -194067 280923 -310134 30477 36754 -229616 -67232 -98292
8849 -98292 -106989 33182 -133870 -33701 -117025 -85624 67615 117970 326175 -248114 198481
8837 104628 -249945 420543 90572 -80766 16156 353581 -106189 -163593 133253 18925 -175560
8825 42644 -365314 73170 58551 -190266 -33800 -19505 -34854 -45673 -307069 -267354 -94588
8813 -120405 124730 47286 73871 -462186 216966 -186391 -232037 267216 108336 -280662
8802 -156955 -22589 61108 -306718 -455203 232462 -208819 -182339 -172754 76359 -148726 12029
8790 198583 45805 318772 -437804 147887 -229713 -294822 -69635 -237821 -113621 -210164
8780 -210164 -232913 9127 74456 -358322 159401 -272975 -196689 33551 22943 -68096 -109886
8769 -109886 -307362 146203 -253406 140717 16104 -31283 231694 -1609 -59233 28234 -66158
8757 12903 -344577 47100 139568 20366 210532 -121733 -52393 -35507 214518 -26929 -191831
8746 -191831 -37907 -138123 49017 -512569 -148900 67613 100424 61501 -180711 -28027 -257141
8735 -257141 -579395 70077 96125 188428 -58698 -22585 -74789 13823 88442 -298570 18281
8723 174116 -109162 -215484 177279 -11597 -71676 -339153 68885 13092 -269233 238774
8712 184034 -114081 -181085 -57063 178769 -100107 11472 212731 25429 22171 -120073 -218352
8701 -218352 66889 104997 -154277 -160618 109291 -45511 -114089 -75756 -153415 -194205 -57731
8689 -98798 -167134 102061 118244 72986 -129476 -5270 -216226 62388 108041 -74772 -33224
8677 172820 -34841 -337101 -259058 11574 -229044 184880 -153243 235463 -192683 12620
8666 -138625 -54424 -147101 -227836 327302 -362233 -29450 -8373 236640 79960 -230773 -261846
8655 -261846 269944 -1946 -121585 -77976 -126707 -85214 -468268 -87450 -484291 -150756 -71462
8643 179401 -327537 126263 -329051 -85944 -129101 352496 -473617 -213641 -19506 -349392
8633 -349392 45264 284702 230118 -205527 95244 -48804 -196420 -227231 -230424 81497 146288
8622 146288 29285 -598262 -220950 -235730 -116957 -99518 -243662 82188 197616 -211901
8611 231831 -182715 -145601 -287416 -56347 -53891 148695 -96796 -162044 158635 217896 390089
8600 390089 159890 -211297 -70140 141634 -281849 14073 -183308 -121097 -127854 5212 -340773
8588 -321053 188522 111724 -155090 -24458 187534 -149101 39511 16640 -513139 -41178 207189
8576 -11729 -37813 92837 258321 -273358 128936 202354 -271227 327779 -173638 -122167 212717
8564 -7981 214373 -38931 162510 208778 -192438 -462282 228873 -160019 -264392 127458
8553 -17814 -176013 -53866 137861 -534 240544 247911 72412 -297183 -226551 -400936 -277245
8542 -277245 -36731 -262718 77980 -212925 -34306 68644 182189 -86389 40198 -183771 706
8530 238289 29240 112239 195396 216832 32405 274979 -454812 43823 -40975 17598 -67098
8518 66729 -12711 -25680 96497 127634 164109 69054 -124633 -19425 30405 -146313 -194580
8507 -194580 -265612 -77436 -21179 -349929 -25602 -53222 107375 27226 105335 323971 215542
8496 215542 -43885 209194 -296510 144116 40607 -420472 -81475 139569 -186694 91577
8485 -133587 -101871 -142774 -213412 -303401 -115881 -391729 88017 -66703 -62186 -477194 -19301
8473 -253387 90433 -277085 -159132 -99513 90502 -18203 134816 -152293 182429 562736
8463 562736 -103818 -49139 -154649 -25806 95219 -69570 -511552 -205226 -16058 343866 267054
8452 267054 -78764 -169696 431261 -31007 29783 -44885 -8900 -158722 13709 -59896 -121621
8441 -121621 -353246 25331 82212 12104 36010 -23826 -182585 233486 -244915 -441642 -7545
8429 50033 -540687 -45396 -352754 -189181 -177562 101055 -207216 -226732 -139214 289052 11949
8417 -141499 160436 155797 119986 -33469 98269 -106973 -33108 -236650 -99120 -258345 -66888
8405 44628 93130 2159 129280 404497 351956 258444 -14360 10174 135758 156397 102450
8394 102450 -221036 -213146 151803 -112254 -244793 235720 68025 58438 161247 -268819 57398
8382 -187118 -239268 127278 -211425 -175738 -139160 -126028 215352 171919 116937 -22499 172123
8370 -81916 46205 -32045 13992 -170607 38682 -116569 117839 -202928 -46127 -263227 81580
8358 -463878 89707 43971 258369 -103008 71129 -56556 61790 -265408 -25925 151142 -210397
8346 -147803 -392723 -44595 -35697 -159112 -147664 -151931 -193157 -214482 -95692 -407670 -172901
8334 126163 -322225 -75612 -80746 146672 -75084 154271 -178371 -83345 63335 -309558 -242680
8323 -242680 -34972 -12797 -23605 -2904 -116827 -131470 143031 -261774 -4159 -129703 -86607
8312 -86607 -95279 -281224 -10486 -110550 -139050 -212093 21517 98415 3515 -148128 67934 -492091
8299 -387635 -136726 -31919 -232993 112100 -215069 -59815 -236361 211646 -14434 112083
8288 2994 87302 -261056 -195389 -60826 -222592 151684 -106358 -105165 -216405 -276017 -161216
8277 -161216 -427043 -7175 -120274 176977 -81308 -12897 121457 -97822 -73865 -140949 21148
8265 -160568 -362199 -78703 -124391 -59682 -93298 -304778 -232304 -121648 -131056 -64397 102487
8253 -309360 -104820 -421613 -149682 194238 -328630 -84839 38940 78477 -277856 -193348
8243 -193348 -28834 -46525 37881 -74109 -46246 63397 -30086 -116873 -67696 -70036 -99945 -161775
8231 -161775 -32784 -32194 564 -229585 194766 24738 187148 239867 8890 31818 -211596 -254655
8219 -254655 38884 -47458 267569 -339310 -46992 218146 155498 12082 -390660 -144481 171686
8207 -123223 190013 11831 -106062 -163109 -18170 -492698 -49187 169040 -43509 148561 4392
8195 48720 292957 -132118 205066 -77969 -72275 -27522 -63206 -19938 -205933 -94676 44653
8183 81834 179824 117204 106491 -86824 14990 99574 -242310 81716 91350 -257824 -334449 63634
8170 -95693 200809 189235 -192125 -110560 -138867 198271 -51623 -22900 -121907 13482 24689
8159 24689 -37761 -116872 139551 128801 127661 -152379 -241582 588102 -217158 129040 250637
8148 250637 4774 74848 12454 -375948 -67268 -241072 75314 -424977 -106050 -174257 -92931
8137 -92931 18963 216881 131027 -228 -413994 145862 246593 -60736 7344 -246263 106255
8125 -137188 -299315 -214540 -171733 -230700 18804 -404815 93168 109080 -52739 209196 131468
8114 131468 -87724 235893 -69576 168676 -200514 -385421 -2290 126076 68821 -2646 -215884
8103 -215884 -65619 183832 -98201 -227092 -138241 83072 -184769 -110302 -1178 -115757 -20959
8091 -114371 364753 22168 63521 120252 -45586 -102020 -190151 77733 -507270 -319384 1419
8079 -8680 22803 -157808 -107569 -11105 -68449 71909 -15163 -233936 -2417 278408 100922
8067 -295698 21490 -283194 146979 -209269 -140387 -41272 85068 -254694 16708 -67527 -257674
8056 -257674 9986 300614 6835 247674 220749 -218658 -35440 146916 -337252 -154220 51584
8044 -105959 -151366 -353238 8848 17771 188848 118482 -190461 208769 -479873 -13866 59461
8032 255574 87614 96141 -8992 104922 73233 124934 -116538 -239326 46381 149155 297045
8021 297045 -28334 22184 118104 37282 114124 -138006 -358495 -189024 298446 131034 -53567
8009 85095 95447 31540 -81981 92077 -25246 23756 -107953 -186030 -9039 -213629 -46207 -204594
7997 -204594 52716 295108 -82074 87785 179375 130001 225381 -192919 -54671 -176301 -102374
7986 -102374 -320800 -253355 40929 -191658 -22979 -235442 192571 18349 -161739 54647 92343
7975 92343 -256021 140738 104210 -160594 189363 63692 -3032 44951 46341 -191446 -57905
7963 233411 -20596 -159353 -246969 2935 -230593 -153655 -107489 47420 82825 103085 -188470
7951 -64161 431968 -61035 -305151 -11491 -106829 26704 -31898 19580 345133 -77129 18636
7939 -74126 55454 3953 -63389 99133 180169 302703 -489730 -388103 -190393 -1401 29652
7927 -77682 256057 16682 231035 82844 -28187 -150606 -30416 326359 99350 105424 -429212
7915 267990 127991 -369983 -183681 15483 -94773 12093 2944 -64977 205869 -119794 -27502
7903 -266838 135202 122414 -396560 -163080 91975 133297 -181572 -146980 107196 35856 98071
7892 98071 58545 -137593 113794 -522991 -83903 -235257 18258 -181726 14818 33558 -233589
7880 -73458 -303273 80563 136096 183534 17028 94180 66833 -59112 26330 -55626 -117808 -259344
7868 -259344 41988 -100942 -191610 -391666 -104131 94948 -25966 -51569 -172874 -130720 130030
7856 -181715 105697 82065 -67040 164017 127532 75317 -176035 177886 -100736 -239580
7846 -239580 -23995 87249 -7557 -340287 -341010 -85672 -366122 -190758 86848 -411493 -76577
7834 -51947 -50517 -95585 -57837 39350 131258 110307 164781 -243684 -208490 -80120 -76206 -33491
7821 -35388 144341 -69068 57180 -51351 -70900 136042 -459684 52736 17164 -26005 -107081
7810 -107081 54545 -282429 254225 146045 69288 59257 210246 -114204 153931 -49279
7799 -4329 -131335 -51516 -507307 -280381 -154404 63110 -564602 -359781 -87245 -133778 475164
7787 -17866 72403 -96681 288761 -419013 120351 43931 -55671 -122891 -241484 -215864 -214081
7776 -214081 133129 -30069 -198560 143417 500156 -137778 -48756 -84959 -166883 84755 -357796
7764 341575 62589 -232434 52117 96806 193520 -226851 96164 -22276 75280 -85744 68038
7752 108100 218818 34099 119539 432239 -312157 165756 116493 -387451 -170959 -184630
7742 -184630 -117554 97082 280645 150169 18758 -69333 128169 -174514 64595 308982 -302625
7730 -983 -209201 92453 -35404 -21230 -46389 -70578 -87210 49748 209864 221684 -21807 30140
7717 -17911 80121 -364473 -82713 -68546 -35489 39449 2800 -10854 138141 -22773 -178071
7706 -178071 -263254 -6721 -38615 -297753 81474 -128143 -173554 312296 -60207 173811 166582
7695 166582 -69617 101314 -118577 -144345 -62831 -243023 -85689 -168338 235241 -9300 -93869
7684 -93869 -178119 -71399 -69239 -132755 -287466 142046 -80778 263711 178074 68578 -247641
7672 76213 -75387 -82282 -16839 15260 78541 -115983 -12882 -274277 -168631 -104348 -121440
7661 -121440 117860 -151674 -90932 37939 24162 27695 -272780 -38048 -18515 -65711 253210
7649 -297304 29167 336419 17894 -138128 -294279 -47502 222939 283907 95224 -42844 -35192
7638 -35192 63690 -326602 -205471 11210 180545 81730 -291841 -112218 -100732 -186933 -304178
7627 -304178 12744 -139838 -353595 -4796 -27435 -21277 -81930 -346970 78893 -137643 -102557
7616 -102557 -361494 -260709 -200353 65515 -104437 -5255 -215324 -122507 61172 -187642 -220618
7605 -220618 122619 230174 184855 -129083 -89716 -248865 -166562 52429 32828 86145 -195995
7593 -55603 141803 101356 253727 119047 -64019 -110655 90553 -109273 -7306 -83801 252442
7581 -153412 213029 247362 21465 -48132 -111568 -96244 194053 -631469 -277223 -44894 -164501
7570 -164501 -145526 -260890 -417936 7489 142993 -59498 10053 118540 -54328 78784 24380
7558 179928 -117518 279850 -86061 -319872 337214 -65070 146182 -57232 -142602 -53652 206065
7546 -85229 126501 205970 -69436 -92551 -41046 -64961 88831 46914 111865 -320975 217256
7534 -16738 -42589 53382 -195011 261335 98746 160661 -127516 93069 -225435 30293 -165789
7522 33477 63020 68522 342737 -237742 -7851 -282193 -48210 -78160 -196413 97293 -95961
7510 -15714 -173154 -74376 27390 -65529 9818 359739 83218 137306 -218163 -114837 -90085
7499 -90085 115622 -536342 -57965 86441 52952 203460 -7771 -183566 -289648 -206622 -44780
7487 -170102 -35996 -47066 -99289 69248 -18834 -100449 102145 -172147 68400 -13773 13944
7475 89291 37165 232934 -387746 42208 -165752 -78703 -49272 10870 -45952 159706 178819
7464 178819 -156307 -319390 -159756 112761 -223308 105507 -201252 166230 -100934 -75056
7454 -75056 51737 276439 -66621 -333815 -358177 -110699 -18525 -101024 -130695 -145411 68643
7442 -24316 -23201 -325538 -3531 339721 -65502 -528769 -112296 -136081 90837 23801 154275
7431 154275 -206917 -145973 -17509 106386 137214 209598 162748 -74582 -88829 -217473 -43854
7419 33337 -76175 333117 -147254 13904 -139150 58537 -217523 -162994 59630 192242 -5340
7407 -53938 -113370 -270526 -5923 -27986 -283757 237121 75967 -84828 -128816 43223 27251
7396 27251 -114242 -167707 -225097 188141 123329 -30397 92447 81170 -36653 -113874 -22972
7384 142147 47670 -256023 -100087 -254773 -228584 138175 -33867 332480 364759 107892
7373 -267411 -84450 -279668 277311 167576 20113 -440543 47814 178923 -154955 104817
7362 -140941 -36930 -189282 -122208 -359870 -273431 61789 287821 -173851 26842 152259 -279851
7350 28171 -149854 49972 -252743 87985 -126650 366040 -96247 -320519 -52799 -70087 -33640
7338 45671 216652 34355 279198 -35163 -14075 -109948 227395 -615775 214297 -257412 38442
7326 -119205 95329 309107 -122282 213754 34991 108889 -347912 -443193 -68736 -228051 -179092
7315 -179092 -104660 -77110 231667 52567 -120301 248592 -126431 35412 -54577 -147675 -183127
7304 -183127 126995 8932 -9007 -32446 3020 -207029 126646 -36550 40191 -238338 -315091
7293 -315091 141324 20374 -219501 -142770 301600 69113 -74165 90202 223111 -72628 167333
7281 -180874 -48972 -121604 29476 164102 5876 -394793 187035 136366 -377622 -78344 -250610
7270 -250610 119319 35637 -5545 -34910 -71741 -124028 -129943 12195 -97234 -128656 -56138 179202
7257 25087 262885 -40000 227122 -103957 -177885 332612 -23866 -303631 -137338 366691
7246 -44534 -92856 -50268 155136 -215088 43062 -183830 -31506 -53340 -444420 206427 67332
7234 -61584 267388 145413 -22066 112740 103607 -134287 -264246 49932 159833 50734 -73648
7222 -35926 -81236 125053 -11031 61059 18271 204680 -232564 -22755 -88577 -122527 -70882
7211 -70882 -55235 383595 -255784 339709 -117748 55656 19894 -80240 134248 -48720 3143
7199 159369 52931 -42363 -172229 -18416 -97950 -10540 269492 -36295 -163513 -356815 -19057
7187 -108474 42636 -37634 -236887 -78985 169413 95389 -215188 262325 -199320 164725
7176 17174 -80275 -71922 36977 43895 235191 381449 220702 117126 -110630 -236346 -46276
7164 118628 -42175 -26219 59611 -158293 -55204 108806 -100282 104686 55621 310540 -36210
7152 -27361 256603 -18069 -3534 -111871 -83726 124328 -162259 -143601 -31818 -82224 -267339
7141 -267339 -179203 23879 -30439 227435 -45104 -102947 154685 -107637 -199723 80058 60588
7130 60588 29281 146490 -340894 -121282 -104191 -145504 -22286 231662 -20418 84838 29001
7118 334286 152812 -165520 -205084 -98692 -268573 -94848 -101654 -106090 77497 -61237 -23646
7106 177497 -143490 -63299 -98326 -94212 265312 -24973 -443929 -114189 -240812 124385 -81008
7094 -400523 -15530 -211130 -388981 16295 -183883 -108284 -34839 -38020 47136 -87058 16464
7082 -82852 -26516 182722 38043 -17928 -30927 -28567 -186648 60319 -36491 33181 -183156
7070 352215 251481 63363 -224668 131093 80436 -14246 224905 -207354 52858 166602
7060 166602 -72607 -32914 91259 -34920 300356 -70533 -99932 131854 -16914 -220132 -92322
7048 86317 -146210 26475 260368 -68138 -73973 1154 70085 161433 -92916 -181301 12045 78774
7036 78774 11699 9280 10892 89578 -200604 439168 110321 45020 -93150 -196313 -120310
7025 -120310 -51632 -268680 49837 -128529 -84659 -219069 -244403 -297607 -81435 -205457 130214
7013 -138278 226878 -72997 -66886 171725 165860 -107205 -48786 163744 -122718 -125777 -215479
7002 -215479 -25395 256653 -94412 9512 13126 167823 -177401 -38229 -243940 70358 -256327
6990 -161431 58449 -18712 11575 -46633 -31887 47400 -209339 63100 8806 39988 -149122
6978 -179652 -495336 -157745 32855 -35587 -366582 -228035 -293880 -87147 -122193 124900 -237586
6966 209090 -34349 -80130 237559 60869 200736 4314 -80603 -101332 -322025 51333 185450
6955 185450 106064 -84840 -22273 397692 -209229 52860 -183230 266712 -98682 -241127 -48960
6943 -174267 -431801 206915 -6326 315902 40358 -39773 -90530 -93936 139888 270238 -266790
6931 96160 15364 18504 -19211 -255768 -88004 -111753 -36918 96339 139006 -41319 -114096 73152
6918 -77472 -169355 -55525 -171770 -48580 -139502 118945 -76327 12856 235304 254061 -323231
6906 238102 211474 146000 15202 -39655 -269816 48313 -42194 -111639 209542 -174295 41427
6894 53982 143700 -161918 41638 -10204 64509 -194896 -205169 -133128 -118485 -86065 152192
6882 -160790 -301253 -147890 66923 -61346 -394375 25831 -83299 92282 -11530 132822 126350
6871 126350 -178489 -131756 -219515 -254983 206625 244908 56275 -129829 -286610 -144916 3006
6859 63481 143315 -257999 -198069 -134888 322649 -222883 -92878 -36525 -302157 75043 2920
6847 210413 -384107 -74561 61545 -112513 -17897 -176710 -89696 -68023 -298254 -158107 122489
6835 16006 70865 -45164 -291344 54828 109736 -42268 55373 -14615 68333 207288 72165
6823 48514 -59301 243750 36415 -210770 319483 -238664 61493 -153677 141469 18351 36635
6812 36635 -70044 207599 -241104 -237750 -88735 -191837 -461171 160734 -122145 143239 4579
6800 -264555 -54798 157390 349272 -219909 105068 78652 -100575 -106255 -275681 -127149
6789 -18954 261791 196369 -34676 -1440 170516 -19491 -81987 140812 -167855 -392870 -120975
6777 -98848 -284420 248982 168923 -79669 54634 -5044 -125790 -77880 22668 28571 -102878
6765 -112232 115052 87282 27889 146446 359843 195635 97318 365184 -158914 109268
6754 -28642 120457 215297 67330 -215106 -229470 33699 -228009 51868 -534644 -141943 -51883
6742 -73601 -29865 -28941 -82858 -432295 -74895 168417 -162731 -273390 -141542 154220 -283078
6730 -335684 -38532 -113062 -51886 213659 -162050 -121281 105235 -297529 215451 4426 -39537
6718 23676 -126499 -339385 66659 -211063 -62619 25603 -224955 50154 -306370 -136748 117111
6706 92384 -1074 -101543 38710 61402 -582 -58096 -372995 -230861 188009 -186070 24616
6694 -1554 -226291 20160 -229013 120521 -304834 -231714 169644 73622 -78277 -5319 182214
6682 133450 123686 -34218 -105009 -85988 -36951 -32632 1687 -304920 284844 169054 337782
6671 337782 88508 -41029 -44970 -333007 17334 83607 18264 -137309 -122193 20540 141562
6660 141562 -62432 -70245 -33335 -26382 137884 -18970 -56750 -220973 -43983 -76364 129115
6648 -5629 -187936 49239 148050 163515 120679 121727 66078 179577 -320353 -374362 15241 -160160
6635 -393749 -188826 -274907 204879 -302112 -124810 -110649 121823 83512 44161 -117289
6624 96690 -340117 -26942 115115 182501 227072 229670 -294097 -239900 -37446 138932 -111943
6612 -207468 -111235 -52848 74589 -72688 241282 -31466 -20251 -15755 13346 -61047 -24263 66677
6599 461842 190347 -35088 95460 -26922 143982 31175 142864 -106903 -28953 -543910 113732
6587 -228526 204748 -80004 -151794 -353584 -41792 203891 -281449 398324 -40637 131075
6576 63227 -70954 12140 -260795 -555451 -189295 52997 166730 -301148 125335 200585 -16502
6564 -178399 210003 78242 -142387 52740 -313671 160511 -96773 200558 -99695 201719
6553 251057 224387 -44560 1510 -167700 -51745 26811 -239945 -167237 57294 -160577 -267052
6542 -267052 -247820 -265722 -123679 -42603 69684 315486 -222293 209514 231327 142076 241035
6531 241035 -24668 278543 -69701 93817 -80387 22439 -529335 -42747 -210742 27058 283439
6520 283439 -33118 -28633 -214012 88262 188701 131977 -228810 -107643 542400 -117636 237579
6508 -237301 -254448 -220503 -21125 -90183 -139837 -256943 32168 90114 -13829 237910 -197894
6496 -94670 46705 45558 -350050 170023 -10842 -84833 -31872 -23134 131787 11506 -162575
6484 -211673 -47708 -278644 131648 57265 154400 54678 56474 -101298 89355 128839 -173717
6472 279961 44400 -10133 191017 -157209 -356700 79271 -121098 207843 -48545 126620
6461 173805 -281440 22844 186412 -126282 230205 -339797 -49472 96897 -168896 -78944
6450 71517 22283 384571 138031 -72353 70703 -33426 104170 -213950 132799 -34138 -7605
6438 37987 229376 -276800 242671 137654 -98531 140407 277256 -33276 -95127 5536 -197580
6426 -172262 -205248 -206628 121332 29559 -3850 -210886 -237778 1351 -11886 24106 -136851 -303007
6414 -303007 586568 -100311 84409 134869 132443 229640 -44103 -136909 -55379 425966 -162248
6402 153339 -166196 -136079 193917 -31300 284645 -54087 167161 78105 -226061 188603
6391 214055 -135614 -55542 -95043 185710 -82537 117668 309751 -55814 -226182 -12456 67328
6379 186532 80670 72333 2328 232468 198428 -535397 -226184 -151901 -502290 -165201 -13541
6367 55911 25341 39082 -12316 162164 184733 228032 358267 -108728 -188083 -179398 -35787
6355 85712 -159175 3135 188785 -39 121423 118521 25684 12789 -249846 190424 83163 -284746
6342 29922 159835 -112578 -88300 -243947 109492 250 30906 -72619 65609 165357 81432
6330 -71827 10436 85256 -75432 -142068 -308914 115980 56724 98541 128188 -83909 294020
6318 106860 22927 28160 -225518 -207133 88609 -25362 45228 384210 39320 161986 -2224
6306 -111256 -164803 -131764 -231909 28459 36616 -324690 88136 -208810 -38063 -117161 -93483
6295 -93483 167849 -299157 218227 -59996 55902 88589 236872 242929 -210909 -156923 55231
6283 -25313 231293 275120 214397 94255 -73381 47704 263572 25063 -177121 -95810 97469
6271 135551 31978 -88203 34791 28578 141704 154132 -205817 63784 53782 -69388 -162962
6260 -162962 -290998 -175400 -59312 -62856 -38136 -106151 96593 -195691 212129 53812 149703
6249 149703 157028 -159192 -345286 -3780 -208290 273652 160327 332699 4610 65341 -237221
6237 71586 158337 -78909 -137997 115324 342686 59426 -157750 -237730 73314 -26731 57097
6225 -345005 -155886 120882 101699 -10211 -130910 -120801 42238 80564 -169907 -75773 118822
6213 243097 -264516 152683 -126639 -223231 389232 -41590 274374 220400 98846 -226160
6202 251824 -219467 -132448 -18658 196708 30472 -105557 -162880 161303 -133241 -42731 -20958
6190 449696 -206761 -26655 -37137 -148228 139768 -54082 27556 35513 -48105 -311700 -144905
6178 -237379 -696985 -21509 201074 -245159 77628 4783 -32151 -40375 28627 193503 -158545
6166 -108645 128249 -549477 -147452 4292 -86107 286776 -118649 -94555 278070 15674 287126
6155 287126 -18746 43541 75108 6561 -283788 357076 -157224 -259641 -157419 255090 100265
6143 44932 112004 -363061 -125843 -124454 360018 177652 -163106 -267846 -121317 -34240 36707
6131 158981 472360 -417463 316518 -51069 -138807 277142 -169870 -94865 222549 -3641 -55082
6120 -55082 -113014 -173452 -104305 -295012 -92675 -193758 222304 -140888 -312368 172166 -126650
6108 -427798 101204 -311156 88669 -42044 -356621 172742 59960 100465 206580 467193
6098 467193 58465 -194437 -183130 168918 -251853 166397 208661 114203 20638 390962 54439
6086 -68774 -241103 84613 -202213 284477 -254964 -126318 -111058 151195 -232683 -102118
6075 102514 208364 -242468 -420237 79354 -250385 5071 -256376 -21827 -95577 27471 228734
6064 228734 -43761 287509 -245455 66037 -6369 121374 -198497 121926 -118085 164210
6053 -1899 168474 -29346 -536907 128494 -60674 -14419 137061 -261977 -211731 -250225 -126783
6042 -126783 -325875 -48074 -64670 -45161 -260901 211827 173248 174297 -153973 -278246 375875
6030 -248457 53543 -99412 177026 277933 -114590 -98688 -128951 -238148 -84108 -122509 53269
6018 -227971 25462 -34713 -112596 115153 10893 90459 -23097 -2793 91148 7963 129536 232455
6006 232455 205129 -334891 366664 -207331 63396 4865 -174614 -203315 113394 -80057 193774
5994 247613 -137526 166295 16266 20201 103726 -179347 -207405 352057 9066 112902 -107801
5982 -137282 104253 125093 -230350 114688 -220877 -310999 346010 -74369 -255718 345264
5971 228089 9001 67351 -45377 -107080 113115 21190 323482 -145993 -354956 283353 -242791
5959 43330 83796 -62288 337102 142888 -120756 63686 143500 -12082 -81381 67139 -8129
5947 -129230 228233 166416 33356 99251 28051 -70348 -54077 104819 -74990 164367 85312
5936 85312 372551 -303149 -132553 145487 -147621 -617 -30344 207547 -157698 -117245 182494
5924 -198621 -154722 -180303 301470 129954 -138463 273097 -35096 261097 -370596 -61618
5913 15286 55498 84232 10670 30493 62023 143276 -89455 -143920 184271 162539 195130 232146
5901 232146 81391 -278212 12700 -195990 -137109 -85228 -304255 10788 -5899 101483 52776
5890 52776 -552947 16945 88360 -151799 184792 23343 -135458 98805 79016 124662 -293396
5878 193329 -96021 -41784 126266 -103328 264847 1285 128937 154800 -41401 -253326 -44521
5866 -148636 125193 155256 7789 -42240 -73314 -187538 -72522 -207311 115474 -127382 -378072
5855 -378072 -214075 -30119 480860 45766 306316 -3846 60574 -46906 -9360 325350 -169176
5843 -90105 22913 230972 -74960 90525 227665 -97027 212874 188092 -57015 -41746 -349895
5832 -349895 -227163 58775 -282273 -88988 48682 -242096 274127 -145089 238731 -179721
5821 76459 30142 42651 10570 -61383 -316980 -219682 98800 120762 -186607 -82393 99730
5809 117933 -266609 -95941 18658 -236948 28417 -27556 100363 43528 -53131 -261094 108312
5797 297519 62509 102430 92212 -31382 48742 -109629 -252269 -282598 -123955 -186135 -93960
5786 -93960 -249305 216750 -110454 -42809 96202 380802 -13831 -18651 -18932 19940 46692 -36214
5773 336222 -15492 149797 124594 -134134 -61167 78349 -93584 32976 -48287 -67299 107104
5761 -115920 -117883 123343 26014 -270768 -58374 -216661 177512 258232 186786 43218 202992
5750 202992 9084 66979 319031 89469 64817 90141 10205 -267024 12574 342253 248306
5739 248306 58910 -243842 39806 30729 20788 -29702 26230 -26395 184556 -89893 15871 -174674
5726 159468 -18809 -25489 244348 -192934 101844 331839 483888 205179 54938 -37779 -205836
5715 -205836 -88622 -366083 -93543 -82118 -34012 16797 151418 252788 152162 179309 -101573
5703 -402148 -60399 -304716 87994 75496 -19497 258310 4638 -53676 193833 52120 116522
5692 116522 -137946 279038 -173965 -332940 -232643 -174093 -212977 14564 -15063 46618 -78491
5680 32068 -64823 139644 -400068 72165 -142134 -340850 98711 -203979 15999 -349222 -77556
5668 -23439 18696 -100076 138221 144323 215141 -37729 -138374 -304704 -58216 176871 93044
5657 93044 -364077 -163774 145233 -23984 -146535 -44355 -258529 7222 138165 69187 200130
5646 200130 88312 7694 158260 248021 -334285 -136560 -312996 -213032 -181016 -15487 95611
5634 10754 66541 185690 179039 43616 -160241 81966 -97869 29465 -88468 157497 49286
5622 175212 -22944 -75019 -17271 -322809 -213154 94904 -20199 226131 -51789 49418 -78444
5610 100838 -471570 -14564 17261 69883 -229700 31332 -76853 -281734 -254060 -268293 192644
5598 -40659 -41920 225554 88885 -5746 -90445 -62285 173561 425090 -133138 -124019 -31617 3094
5585 -71279 96527 189046 217268 13906 -171695 83459 -266151 -298 -12720 -20204 156803 64484
5572 -392785 124486 501154 -44213 -385592 -66581 -26292 224792 -52675 24720 149438 -308034
5560 -6791 -195135 234415 105540 260474 -121159 51006 -56923 -175891 -52176 -75263 -78110
5549 -78110 222445 127940 -30905 362552 156903 142602 59929 299788 -195093 96185 -253883
5537 96209 -202242 -162096 6517 189010 75022 -150110 -51310 84266 -211923 -146673 -274415
5526 -274415 -151836 33275 48928 -133451 -151209 453394 233084 5476 -205599 166231 40566
5514 -405118 397460 499831 52145 2359 102802 -83391 -48772 761 3976 -399256 -82652 183859
5501 -249895 95518 -35605 -122313 170252 -293090 12063 -200505 124522 -30035 49833 -89978
5489 -359652 87261 -169136 -53635 61903 137364 92391 179594 -139364 316264 195995 8499
5477 189905 -109619 144314 -125463 -33984 -120983 -307972 215421 40525 170473 -221281
5466 82362 281962 -189783 -1475 356689 -29570 -8057 -181380 -457708 -343266 99648 210261
5455 210261 -157051 -97166 -212529 201634 -15545 158372 -36082 33852 165340 297584
5445 297584 384208 -19278 -218743 71975 -2804 -104841 -153933 192105 -60270 -146984 -14318
5433 -234384 -101364 184003 164093 -61506 120294 328161 -69708 9770 -321126 331305 -253690
5421 -194300 -86497 106494 -222982 110641 -336149 363258 -169144 234540 58968 79177
5411 79177 -368979 118208 112989 -456899 285986 -146918 32288 39638 -65714 276439 -135618
5399 -122909 -103524 -10741 -135613 -30382 143584 11460 45955 -93184 91095 17389 158729
5388 158729 -184739 -196924 -203801 324187 171656 -247341 144340 -62415 219103 -97754 241827
5376 178721 162272 158139 -226338 -150036 92174 75375 -13587 15069 -131147 -27735 -41006
5365 -41006 178975 -196013 202108 75090 -269547 -10565 -115964 -80137 -12003 88554 -203156
5353 -91149 -67352 -207836 -30681 191540 221458 99882 -338862 -156349 102487 390103 19403
5341 272383 -243048 -89251 46609 -222666 33062 -233130 -63542 -105623 126043 31120 -194783
5329 -119061 168075 -205990 141542 -92748 199223 122624 -155014 135922 -43929 -43077 -141629
5318 -141629 273299 97757 118233 -25681 170410 -158756 205232 428431 -85065 -8536 71474
5306 -4418 -516207 -174924 72608 -94809 42126 -216186 237519 146892 -11037 155417 -67947
5294 -145715 -1309 19060 111209 -217879 268559 322822 -40230 9325 -17172 -28464 -285218
5283 -285218 166783 157117 217963 -44017 23901 -142930 -52241 -30958 321155 -173216 23654
5271 -43686 -7528 -72645 -137405 52266 -77291 238209 109309 132509 221313 -192592 120414
5259 -96415 -101250 -229014 -10587 49222 -45731 -59626 130416 65356 35992 -317360 -221665
5248 -221665 -146495 -10191 -251409 -340417 -100099 611951 371628 478499 -114161 111726
5237 88973 311507 20023 225618 173353 -50848 -344424 -193454 -72427 281877 332678 -183568
5225 -140152 150892 -113136 33295 -209500 -115978 -60122 -187354 -135353 -243175 -93182 -46198
5213 16860 -82540 131412 -226487 128851 70314 -9599 -49145 -236157 62609 -323922 309609
5201 337733 94017 198939 -5364 160209 47220 304857 -119501 -83863 178179 84691 -11587
5189 -161478 35428 314667 -458428 -358172 490735 78938 88556 290125 150034 40868 37702
5178 37702 140204 -83768 168497 -250658 162315 114966 -105624 -118767 102754 226921
5168 226921 -81522 90697 -113903 -381931 228466 36582 5130 76225 -64389 96668 111749
5157 111749 -53206 112145 27312 -125397 -73433 35582 262912 -96306 -106499 -99595 59866
5145 214077 -263337 49060 -110849 -13137 55422 170362 131539 78455 166321 14460 -63305
5133 -52167 107584 139073 -92627 181162 61656 -121867 -85931 -407541 -240467 -212116 -51426
5121 -65075 -232668 -87971 236702 14263 59256 18830 90711 72947 502478 418620 -142891
5109 -242366 26137 105300 -53814 125143 -80397 281861 -11738 300600 299 -176620 79115
5097 37747 -41044 -23941 -310260 -93072 94088 55108 -449 214357 183422 -6711 -174893 -61586
5084 -72038 278808 137342 12808 14645 205663 11199 72651 -261145 23227 -102843 -179051
5073 -179051 -270734 -106487 -259792 147696 -131308 -152131 -70537 101177 -8798 46265 -229317
5061 287374 174600 232233 -34650 117915 84343 -43462 76109 -65750 -169385 -272524 -85257
5049 -184036 135830 -287072 20484 -71102 -155845 -93452 -82564 -157419 162780 -169919 72384
5037 -433997 -161487 -12998 34467 80770 8933 -82669 82531 65584 -17661 121708 -197330
5025 -115065 220233 -120590 96840 46128 26161 127640 43954 91375 -206290 73609 -105104
5013 -163079 234413 53396 -137463 130292 -104241 150688 28409 210007 120991 -322119
5002 -11006 -193158 -191627 -210338 -51043 183919 103709 -351725 -353435 -129133 114496 35935
4990 -69546 35949 -302392 -42265 -87394 32249 128401 40806 96718 57357 358335 -171584
4978 121800 -18088 179022 -152324 30427 17673 3253 -191438 27343 118641 -57575 -176538
4967 -176538 -281278 259456 97355 -320586 13897 -20249 -349531 102586 221397 3547 -74848
4955 248330 88381 131525 -22339 -171839 155490 -193560 -13917 94964 -259538 77447 -56919
4943 -104120 137652 40552 107840 -132265 324759 37494 -237638 -339604 145589 -14723
4932 118410 -337949 112100 -75155 -144593 234459 -103030 95519 -181211 -28912 -64274 -97258
4921 -97258 122462 73070 -11050 329956 76673 6171 -158850 -258552 126365 86619 -49416
4909 261313 -103537 165472 -125369 72446 -93940 182771 -390124 40909 -182581 -312254
4899 -312254 175933 -15924 99811 33208 159667 -115289 -197855 184946 -66055 83558 -340424
4887 -66909 -1419 -342331 62955 -65995 7682 358102 -199621 -363200 -86886 412220 11930
4875 37348 153389 13200 26831 213399 -27610 260743 215831 -218356 388772 -132658 163681
4863 -124276 4928 -369597 78709 -21210 -170414 -227941 167723 73974 388507 -50929 -356137
4852 -356137 7659 -164564 260845 -88055 62083 -93415 365213 162011 144847 51670 -141889
4840 -84552 -95355 259333 -106980 11971 299149 328280 -258963 -186116 -65550 444863 -50440
4828 -89996 -204140 93733 -265988 -6952 -37661 10983 -486411 156805 -250536 187734 63303
4816 205197 -172166 30234 -64238 -63212 124567 78033 -184920 -196120 13800 -129428 166573
4804 162531 85456 -163732 -195508 -130205 -186120 -113271 129641 133399 15408 -37237 -18456
4792 352605 364359 162161 -97660 -15802 -194773 -16127 -81556 53852 -166612 -245807 95762
4780 75623 -40939 40023 -3695 17596 189358 -141443 -330776 182462 64837 70106 -37781
4768 79259 -127289 -240546 -63726 -66926 92110 57982 -101781 129411 175477 -126811 -60629
4756 127630 148589 22731 -103076 369151 119541 158963 33642 -112079 -46121 -11074 -125228
4745 -125228 -247143 16563 -187415 -169515 -65676 -55081 139526 164491 -205822 -206698 383366
4733 -63165 15545 -25552 177514 208893 66587 -228586 -193921 -76493 85212 267977 -186650
4721 -38877 145282 -386311 -74018 -152560 137373 -147565 15118 -47840 115330 220509 16488
4709 -63813 -13677 -66174 76619 168316 -133731 -39173 -126616 128630 -261790 149307 321972
4698 321972 41054 302015 95527 60628 -127280 140358 -28099 56810 355305 94374 -58408
4686 44788 86616 -256920 31713 72466 58080 134623 549088 222620 -167479 225048 188836
4675 188836 7927 1033 18601 140436 -37223 -263925 -82404 -296681 7907 -7355 -19016 205681
4662 -76948 -128183 139688 -225442 43182 23556 -201315 41969 134557 -24074 42212 29973
4651 29973 -198878 -92506 341286 -15788 9857 -171890 128224 4136 224374 109204 -262792
4639 -174388 2330 -114514 154836 16522 -306727 108193 -50193 220480 416851 -82030 -182318
4628 -182318 33166 321722 -109250 200563 101298 -125897 67100 160179 341299 -175963
4617 66314 77960 83503 -250923 128427 -154831 276007 136255 -15997 -128499 56518 -322454
4605 -305771 215389 -4352 62069 180865 -183743 -146406 -134339 -119802 94636 94578 25271 -108414
4592 22252 -75304 67229 279610 23361 -7222 197879 -409352 -225968 124794 -182992 -222625
4581 -222625 129757 -122961 -245515 116793 -28766 171351 140966 54525 -120792 99436
4570 -186371 -154293 58272 -221108 74071 244290 -27273 -34044 -107102 98678 -10044 59051
4558 237538 201778 -169997 89176 -99097 -138116 19890 167638 -125654 149137 81048 102199
4547 102199 293067 83015 41929 -378532 74770 190801 129202 -19689 132314 -121229 -351962
4536 -351962 -92041 329652 186099 -185893 -227803 -160254 -144203 163021 -119617 -87621 187305
4524 -208359 -96142 -109340 -100881 123986 55436 -293682 109577 -34990 1728 -75164 70339
4512 -168476 56334 -2397 99268 104006 346346 -136489 5809 41319 141908 143497 -123042 201619
4499 49891 -151536 161536 -286657 -25305 -94010 304531 5511 217475 -102283 40354 126126
$$ [...]
##END NTUPLES=NMR SPECTRUM
##END=
