
##TITLE=AC1367_2285_7221507_Xg8aSAJzSg
##JCAMPDX= 6.0         $$ Bruker NMR JCAMP-DX V2.0
##DATA TYPE= NMR SPECTRUM
##DATA CLASS= NTUPLES
##ORIGIN= BRUKER
##OWNER= Administrator
$$ 1.72 TOPSPIN		Version 2.1
$$ 2012-12-13 21:58:33.789 -0500  Administrator@X
$$ Compression mode = diff/dup
##.OBSERVE FREQUENCY= 400.02188249412
##.OBSERVE NUCLEUS= ^1H
##.ACQUISITION MODE= SIMULTANEOUS (DQD)
##.ACQUISITION SCHEME= undefined
##.AVERAGES= 64
##.DIGITISER RES= 22
##SPECTROMETER/DATA SYSTEM= spect
##.PULSE SEQUENCE= noesygpps1d.comp
##.SOLVENT NAME= COFFEE_meoh
##.SHIFT REFERENCE= INTERNAL, COFFEE_meoh, 1, 14.96075
##AUDIT TRAIL= $$ (NUMBER, WHEN, WHO, WHERE, PROCESS, VERSION, WHAT)
$$ ##TITLE= Audit trail, TOPSPIN		Version 2.1
$$ ##JCAMPDX= 5.01
$$ ##ORIGIN= Bruker BioSpin GmbH
$$ ##OWNER= Administrator
$$ $$ E:\/data/COFFEE/nmr/AC1367_2285_7221507_Xg8aSAJzSg/12/pdata/1/auditp.txt
$$ ##AUDIT TRAIL=  $$ (NUMBER, WHEN, WHO, WHERE, PROCESS, VERSION, WHAT)
(   1,<2012-12-13 21:58:27.417 -0500>,<Administrator>,<X>,<go>,<TOPSPIN 2.1>,
      <created by zg
	started at 2012-12-13 21:46:56.964 -0500,
	POWCHK enabled, PULCHK disabled,
       configuration hash MD5:
       86 BA 57 50 F2 9D 5C 9B 26 00 A9 28 5F 66 2E 89
       data hash MD5: 64K
       61 29 F1 DA 2C E8 A9 E4 4B 03 F4 7B A9 C9 63 2A>)
(   2,<2012-12-13 21:58:30.752 -0500>,<Administrator>,<X>,<proc1d>,<TOPSPIN 2.1>,
      <Start of raw data processing
       efp LB = 0.3 FT_mod = 6 PKNL = 1 PHC0 = 0 PHC1 = 0 SI = 128K 
       data hash MD5: 128K
       39 B6 05 8A 22 9C D8 92 4F 7B 83 18 CE FD 3F 0E>)
(   3,<2012-12-13 21:58:31.920 -0500>,<Administrator>,<X>,<proc1d>,<TOPSPIN 2.1>,
      <pk PHC0 = -80.42542 PHC1 = 0 
       data hash MD5: 128K
       9C A4 F4 77 93 7B 3A BC AF 95 07 01 8C F2 7B A5>)
(   4,<2012-12-13 21:58:32.694 -0500>,<Administrator>,<X>,<proc1d>,<TOPSPIN 2.1>,
      <abs ABSG = 1 
       data hash MD5: 128K
       FA AC 30 D5 15 E8 1E 11 06 C3 16 2B 3C C9 BB 4F>)
(   5,<2012-12-13 21:58:32.866 -0500>,<Administrator>,<X>,<proc1d>,<TOPSPIN 2.1>,
      <abs ABSG = 2 
       data hash MD5: 128K
       7B F9 5F 09 A7 37 55 DB 0E D9 DE 51 A6 06 FC 52>)
(   6,<2012-12-13 21:58:33.055 -0500>,<Administrator>,<X>,<proc1d>,<TOPSPIN 2.1>,
      <abs ABSG = 3 
       data hash MD5: 128K
       67 5E F1 DB 25 51 D0 54 59 33 09 E3 29 D4 F8 52>)
(   7,<2012-12-13 21:58:33.261 -0500>,<Administrator>,<X>,<proc1d>,<TOPSPIN 2.1>,
      <abs ABSG = 4 
       data hash MD5: 128K
       AC 30 77 90 E6 8D 44 60 AF 8F 03 A4 2C A9 05 66>)
(   8,<2012-12-13 21:58:33.448 -0500>,<Administrator>,<X>,<proc1d>,<TOPSPIN 2.1>,
      <abs ABSG = 5 
       data hash MD5: 128K
       93 2C 8D 49 1C 4B 33 50 E4 E3 9F 53 B0 23 91 8B>)
$$ ##END=
$$ 
$$ $$ hash MD5
$$ $$ B0 BB 57 6B C8 4D 05 30 77 CA 30 D0 79 B4 E5 87
##$RELAX= 
##$RELAX= 
##$RELAX= 
##$RELAX= 
##$RELAX= 
##$RELAX= 
##$RELAX= 
##$RELAX= 
##$RELAX= 
$$ Bruker specific parameters
$$ --------------------------
##$DU= <E:\>
##$EXPNO= 12
$$ [...]
##$TP07= 0
##$TPNAME0= <>
##$TPNAME1= <>
##$TPNAME2= <>
##$TPNAME3= <>
##$TPNAME4= <>
##$TPNAME5= <>
##$TPNAME6= <>
##$TPNAME7= <>
##$TPOAL= (0..7)
0.5 0.5 0.5 0.5 0.5 0.5 0.5 0.5
##$TPOFFS= (0..7)
0 0 0 0 0 0 0 0
##$TUNHIN= 0
##$TUNHOUT= 0
##$TUNXOUT= 0
##$USERA1= <user>
##$USERA2= <user>
##$USERA3= <user>
##$USERA4= <user>
##$USERA5= <user>
##$V9= 5
##$VALIST= <valist>
##$VCLIST= <CCCCCCCCCCCCCCC>
##$VD= 0
##$VDLIST= <DDDDDDDDDDDDDDD>
##$VPLIST= <PPPPPPPPPPPPPPP>
##$VTLIST= <TTTTTTTTTTTTTTT>
##$WBST= 1024
##$WBSW= 4
##$XGAIN= (0..3)
0 0 0 0
##$XL= 0
##$YL= 0
##$YMAX_a= 5819813
##$YMIN_a= -12131889
##$ZGOPTNS= <>
##$ZL1= 120
##$ZL2= 120
##$ZL3= 120
##$ZL4= 120
##$ABSF1= 14.96075
##$ABSF2= -5.597432
##$ABSG= 5
##$ABSL= 3
##$ALPHA= 0
##$AQORDER= 0
##$ASSFAC= 0
##$ASSFACI= 0
##$ASSFACX= 0
##$ASSWID= 0
##$AUNMP= <proc_prof1d_extract.lims>
##$AXLEFT= 0
##$AXNAME= <>
##$AXNUC= <1H>
##$AXRIGHT= 0
##$AXTYPE= 0
##$AXUNIT= <>
##$AZFE= 0.1
##$AZFW= 0.1
##$BCFW= 0
##$BC_mod= 0
##$BYTORDP= 0
##$COROFFS= 0
##$CY= 15
##$DATMOD= 1
##$DC= 0
##$DFILT= <>
##$DTYPP= 0
##$F1P= 0
##$F2P= 0
##$FCOR= 0.5
##$FTSIZE= 131072
##$FT_mod= 6
##$GAMMA= 0
##$GB= 0
##$INTBC= 1
##$INTSCL= 1
##$ISEN= 128
##$LB= 0.3
##$LEV0= 0
##$LPBIN= 0
##$MAXI= 10000
##$MC2= 0
##$MEAN= 0
##$ME_mod= 0
##$MI= 0
##$NCOEF= 0
##$NC_proc= -2
##$NLEV= 6
##$NOISF1= 0
##$NOISF2= 0
##$NSP= 0
##$NTH_PI= 0
##$NZP= 0
##$OFFSET= 14.96075
##$PC= 1
##$PHC0= -80.42542
##$PHC1= 0
##$PH_mod= 1
##$PKNL= yes
##$PPARMOD= 0
##$PPDIAG= 0
##$PPIPTYP= 0
##$PPMPNUM= 2147483647
##$PPRESOL= 1
##$PSCAL= 4
##$PSIGN= 0
##$PYNMP= <proc.py>
##$REVERSE= no
##$SF= 400.020009735748
##$SI= 131072
##$SIGF1= 0
##$SIGF2= 0
##$SINO= 400
##$SIOLD= 131072
##$SPECTYP= <>
##$SREGLST= <1H.CDCl3>
##$SSB= 0
##$STSI= 131072
##$STSR= 0
##$SW_p= 8223.68421052631
##$SYMM= 0
##$S_DEV= 0
##$TDeff= 65536
##$TDoff= 0
##$TI= <>
##$TILT= no
##$TM1= 0
##$TM2= 0
##$TOPLEV= 0
##$USERP1= <user>
##$USERP2= <user>
##$USERP3= <user>
##$USERP4= <user>
##$USERP5= <user>
##$WDW= 1
##$XDIM= 131072
##$YMAX_p= 400052227
##$YMIN_p= -12478
##$CURPLOT= <Network HP LaserJet P1505>
##$CURPRIN= <$Network HP LaserJet P1505>
##$DFORMAT= <normdp>
##$LAYOUT= <+/1D_H.xwp>
##$LFORMAT= <normlp>
##$PFORMAT= <normpl>
##$SURQMSG= 1
$$ End of Bruker specific parameters
$$ ---------------------------------
##NTUPLES= NMR SPECTRUM
##VAR_NAME=  FREQUENCY,     SPECTRUM/REAL,   SPECTRUM/IMAG
##SYMBOL=    X,             R,               I
##VAR_TYPE=  INDEPENDENT,   DEPENDENT,       DEPENDENT
##VAR_FORM=  AFFN,          ASDF,            ASDF
##VAR_DIM=   131072,        131072,          131072
##UNITS=     HZ,            ARBITRARY UNITS, ARBITRARY UNITS
##FACTOR=    0.0627417313425164, 1,          1
##FIRST=     8223.62146879497, 2235,         -53150
##LAST=      0,             2716,            -53191
##MIN=       0,             -12478,          0
##MAX=       8223.62146879497, 400052227,    0
$$ Real data points
##PAGE= N=1
##DATA TABLE= (X++(R..R)), XYDATA
$$ [...]
61534D56943K015L155L191K667K116J651J312J033L93p48j706j805j564k144l693
61519D62816n122n503m935l958k953k226k016k119j995j455q49n75o72r74j237
61504D26227j219r36p28q25j034j224j679k471k878k237j086o52j201j795j738
61489D04524j384j314j482j575j639j860k083j988j497q08j43L52O28P96J024
61474C91551J357J697J864J624Q43k11r66j109q30l15M88J352J599R59J72O4M88
61457D00627P80Q17Q44O82Q2m60k26N62J093J318J761K157J663N22J30R71J873
61440D15196J949J934K730L753L894L337L159L658M276M776N408N975N792M701
61426D70538L311K159J295P14N81Q18J093J324J780K566L380L888L949L494K618
$$ y = [456943, 458958, 462113, 465304, 467971, 470087, 471738, 473050, 474083, 474476, 473728, 472022, 470217, 468653, 466509, 462816, 457694, 452191, 447256, 443298, 440345, 438119, 436103, 433984, 431989, 430534, 429685, 429110, 428438, 427464, 426227, 425008, 424072, 423344, 422519, 421485, 420261, 418582, 416111, 413233, 410996, 409910, 409258, 408057, 406262, 404524, 403140, 401826, 400344, 398769, 397130, 395270, 393187, 391199, 389702, 388894, 388751, 389103, 389731, 390527, 391551, 392908, 394605, 396469, 398093, 398936, 398725, 397759, 396650, 395820, 395505, 395993, 397345, 398944, 399903, 400075, 400139, 400627, 401407, 402224, 403068, 403750, 403832, 403372, 403146, 403708, 404801, 406119, 407880, 410037, 411700, 412222, 412352, 413323, 415196, 417145, 419079, 421809, 425562, 429456, 432793, 435952, 439610, 443886, 448662, 454070, 460045, 465837, 470538, 473849, 476008, 477303, 478017, 478598, 479416, 480509, 481833, 483613, 486179, 489559, 493447, 497396, 500890, 503508]
61411E03508J801J528J626J421O33l80j321k344l469m220m341m367m941n812o197
61396D73125n938n608n478n090m095k911k093j607j174q98j000j166q86l24j74
61381D34683o04r86q31m36k53k18k1L23O14Q29J003R96P40M58L79M49O81J364
61363D39170K497L377L280K380J569J449J988K923L951M654M780M677M966N765
61349D87426O636P299P970Q901J0032J1161J2163J2951J3518J4048J4691J5229
61337F22025J5231J4592J3602J2409J0742Q231M922J386j591l621n014o325p572
61324F79017q308q515q817r431r591q610p022n918n511n195m701m259l738k705
61310E86696j398p48j119j761j797j094qJ140K029K379K360K511L103L934M818
$$ y = [503508, 505309, 506837, 508463, 509884, 510517, 510137, 508816, 506472, 503003, 498783, 494442, 490075, 485134, 479322, 473125, 467187, 461579, 456101, 451011, 446916, 444005, 441912, 440305, 439131, 438233, 437233, 436067, 435181, 434857, 434683, 434079, 433093, 432262, 431826, 431573, 431355, 431334, 431657, 432271, 433100, 434103, 435099, 435839, 436297, 436676, 437125, 437806, 439170, 441667, 445044, 448324, 450704, 452273, 453722, 455710, 458633, 462584, 467238, 472018, 476695, 481661, 487426, 494062, 501361, 509331, 518232, 528264, 539425, 551588, 564539, 578057, 592105, 606796, 622025, 637256, 651848, 665450, 677859, 688601, 696832, 701754, 703140, 701549, 697928, 692914, 686589, 679017, 670709, 662194, 653377, 643946, 634355, 625745, 618723, 612805, 607294, 602099, 597398, 593139, 589401, 586696, 585298, 584550, 583431, 581670, 579873, 578779, 578771, 579911, 581940, 584319, 586679, 589190, 592293, 596227, 601045]
61295F01045N750O556O941P008P004O571M941K123q23l062m735o141o893o478
61281F19807n147l675k579j960j746j649j198k26R40J973K922L857M606N120N726
61266F26771O618P513Q072Q419Q878R490J0031J0320J0366J0423J0918J1982J3164
61253G52965J4064J5102J6953J9275K0746K0558J8966J6278J2323P354K441j719
61241I15306n517r352j2671j4909j6593j8493k0207k0625j9411j7175j4468j1566
61229G34319q908o885n273l719k613k537l032k846j583j96M56P65J719L510N261
61214G08438N851M925L231K031J929K326K256J568Q69N74N62P44J332K301L201
61199G42138L726M181N045O305P594Q844J0451J2741J5477J8155K0661K3338K6285
$$ y = [601045, 606795, 613351, 620292, 627300, 634304, 640875, 645816, 647939, 647116, 644054, 639319, 633178, 626285, 619807, 614660, 610985, 608406, 606446, 604700, 603051, 601853, 601627, 602567, 604540, 607462, 611319, 615925, 621045, 626771, 633389, 640902, 648974, 657393, 666271, 675761, 685792, 696112, 706478, 716901, 727819, 739801, 752965, 767029, 782131, 799084, 818359, 839105, 859663, 878629, 894907, 907230, 914584, 917025, 915306, 909789, 900437, 887766, 872857, 856264, 837771, 817564, 796939, 777528, 760353, 745885, 734319, 725411, 718526, 713253, 709534, 706921, 704384, 701352, 698506, 696923, 696727, 697183, 697948, 699667, 703177, 708438, 714289, 719214, 722445, 724476, 726405, 728731, 730987, 732555, 733424, 733998, 734560, 735304, 736636, 738937, 742138, 745864, 750045, 755090, 761395, 768989, 777833, 788284, 801025, 816502, 834657, 855318, 878656, 904941]
61186I04941K8900L0497L1175L1678L2381L2856L2449L0906K8364K5207K2008
61175A231362J9188J6648J4158J2012J0605R353O952L082j009m223p128j0989
61163A300011j5772k0080k2853k4438k5921k7952l0223l1819l2096l1278l0033
61152A007546k8556k6612k4439k2768k1586j9850j6942j3650j0992q795o274l437
61140H03645r57R01K259K984K909K416J869Q81r81l040m045l596k174l4K789N589
61124H11415P395Q415R925J2507J5521J8556K2231K6868L1365L4304L5730L7047
61112A071279L9295M2091M4265M5126M5000M4632M4289M3660M2585M1319L9865
61101A543406L7568L3988K9698K5574K1521J6726J1091N583R86l044p498j2900
$$ y = [904941, 933841, 964338, 995513, 1027191, 1059572, 1092428, 1124877, 1155783, 1184147, 1209354, 1231362, 1250550, 1267198, 1281356, 1293368, 1303973, 1313326, 1320278, 1323360, 1322351, 1318128, 1311000, 1300011, 1284239, 1264159, 1241306, 1216868, 1190947, 1162995, 1132772, 1100953, 1068857, 1037579, 1007546, 978990, 952378, 927939, 905171, 883585, 863735, 846793, 833143, 822151, 813356, 807082, 803645, 802688, 803589, 805848, 808832, 811741, 814157, 816026, 816907, 815926, 812886, 808841, 805245, 803071, 803037, 805826, 811415, 818810, 827225, 837150, 849657, 865178, 883734, 905965, 932833, 964198, 998502, 1034232, 1071279, 1110574, 1152665, 1196930, 1242056, 1287056, 1331688, 1375977, 1419637, 1462222, 1503541, 1543406, 1580974, 1614962, 1644660, 1670234, 1691755, 1708481, 1719572, 1725155, 1726141, 1723097, 1715599, 1702699]
61089A702699j8830k4370k9004l3143l7378m1241m3392m3470m2794m2540m2123
61078A304414m0477l8164l6654l5925l4415l1438k8113k5492k3141k0160j6606
61067I73829j3235j0556q622p165n630l659j729o45k57M97K173M205N928P358
61053I42492Q700R858J0883J2121J3653J5131J6442J7908J9713K1738K4090K7084
61041A139813L0553L3935L7018L9882M2186M3584M4787M7020N0150N2672N3867
61030A615467N4794N6580N8978O1185O3047O4705O6077O7415O9544P2720P6000
61019B326512P8247P9207P9338P9520Q1262Q6031R3964J04235J16886J32893J52164
61008C410259J73142J95135K19437K47815K82087L26029L84941M61638N55197
$$ y = [1702699, 1683869, 1659499, 1630495, 1597352, 1559974, 1518733, 1475341, 1431871, 1389077, 1346537, 1304414, 1263937, 1225773, 1189119, 1153194, 1118779, 1087341, 1059228, 1033736, 1010595, 990435, 973829, 960594, 950038, 941416, 934251, 928621, 924962, 923233, 922588, 922331, 922828, 925001, 929206, 935134, 942492, 951192, 961050, 971933, 984054, 997707, 1012838, 1029280, 1047188, 1066901, 1088639, 1112729, 1139813, 1170366, 1204301, 1241319, 1281201, 1323387, 1366971, 1411758, 1458778, 1508928, 1561600, 1615467, 1670261, 1726841, 1785819, 1847004, 1910051, 1974756, 2040833, 2108248, 2177792, 2250512, 2326512, 2404759, 2483966, 2563304, 2642824, 2724086, 2810117, 2904081, 3008316, 3125202, 3258095, 3410259, 3583401, 3778536, 3997973, 4245788, 4527875, 4853904, 5238845, 5700483, 6255680]
60999F255680O65458P96096R51275J132946J344838J595293J890845K229525K603373
60990A9465329K994419L344765L527466L380484K815686J916545R20703R0931
60982C8456328m10863n52649l90470m2279L04217M17569J24120n80340j515468
60973C5810165k419538l083702l420284l448290l244446k902302k506279k115757
60965A2669567j761498j454443j196483r84673q11976o70382n54656m62033l89396
60956D384027l32491k87454k51622k22952j99658j80228j63118j46790j30711
60947B469003j15684j02515r0881q0307p1580o5995o3550o2873o2818o3038o3025
60936A626737o1805n8966n5238n1548m8046m4413m0663l7161l4145l1581k9355
$$ y = [6255680, 6921138, 7717234, 8668509, 9801455, 11146293, 12741586, 14632431, 16861956, 19465329, 22459748, 25804513, 29331979, 32712463, 35528149, 37444694, 38365397, 38456328, 38045465, 37492816, 37102346, 37060067, 37364284, 37781853, 37905973, 37325633, 35810165, 33390627, 30306925, 26886641, 23438351, 20193905, 17291603, 14785324, 12669567, 10908069, 9453626, 8257143, 7272470, 6460494, 5790112, 5235456, 4773423, 4384027, 4051536, 3764082, 3512460, 3289508, 3089850, 2909622, 2746504, 2599714, 2469003, 2353319, 2250804, 2159923, 2079616, 2008036, 1942041, 1878491, 1815618, 1752800, 1689762, 1626737, 1564932, 1505966, 1450728, 1399180, 1351134, 1306721, 1266058, 1228897, 1194752, 1163171, 1133816]
60925A133816k7296k5211k3191k1706k1153k1296k1474k1318k0978k0627k0046
60914H89520j8991j7657j6424j5252j3731j1783r866q405p311o348n590n266n384
60901G47512n762o257o634o503n779n042m967n509n995o006n819n924o501p391
60887F63423q292q915r164r205r256r291r079q455p448o296n439n241n456n344
60873E56542m575l689l258k990k253j181m51r7N72J832L088L865M455N322O398
60858E63580P393Q257Q932R149Q952Q901R209R065P578N193L388K870K767J876
60844F57110K16j226j965k657m115o226q139r339j0067j0723j1297j1575j1580
60831E68417j1475j1239j0723r915q860p431n529l487j889r38j74R62K425L529
$$ y = [1133816, 1106520, 1081309, 1058118, 1036412, 1015259, 993963, 972489, 951171, 930193, 909566, 889520, 870529, 852872, 836448, 821196, 807465, 795682, 785816, 777411, 770100, 763752, 758162, 752896, 747512, 741750, 735493, 728859, 722356, 716577, 711535, 706568, 701059, 695064, 689058, 683239, 677315, 670814, 663423, 655131, 646216, 637052, 627847, 618591, 609300, 600221, 591766, 584318, 578022, 572583, 567342, 561886, 556542, 551967, 548278, 545020, 542030, 539777, 538596, 538145, 538048, 538620, 540452, 543540, 547405, 551860, 557182, 563580, 570973, 579230, 588162, 597311, 606263, 615164, 624373, 633438, 641016, 646209, 649597, 652467, 655234, 657110, 657326, 656100, 654135, 651478, 647363, 641137, 632998, 623659, 613592, 602869, 591572, 579997, 568417, 556942, 545703, 534980, 525065, 516205, 508774, 503245, 499758, 497869, 496931, 496757, 497719, 500144, 503673]
60817E03673L682L102K733L240M233M794M727M752N331N896N762N239N253O084
60803E68501P112P637P409O541N469M891N072N336M849L851L358L593L605K630
60789F39854J100j81j187k409l869n043n642o041o753p783q583q709q434q530
60775E67790r231r740r175p796o722o494o584o361n863n336m682l757k731j768
60761D81550p75J68N53R5o70r31n45%L97P85J251J552J494J314J516K343L533
60744D93630M584N274N809O413O889O855O325N736N411N321N405N743O218O369
60730E75982N852M884M042L719L895M242M343L953L128K035P17p38j897k223j710
60715F10224r33m71n27j115k170l324m041m173m118m326m871n684o740p840q525
$$ y = [503673, 507355, 510457, 513190, 516430, 520663, 525457, 530184, 534936, 540267, 546163, 551925, 557164, 562417, 568501, 575613, 583250, 590659, 597200, 602669, 607560, 612632, 617968, 622817, 626668, 630026, 633619, 637224, 639854, 640954, 640773, 639586, 637177, 633308, 628265, 622623, 616582, 609829, 602046, 593463, 584754, 576320, 567790, 558559, 548819, 539644, 531848, 525126, 518632, 512048, 505687, 499824, 494488, 489806, 486049, 483318, 481550, 480775, 480943, 481496, 481591, 480921, 479990, 479445, 479445, 479842, 480627, 481878, 483430, 484924, 486238, 487754, 490097, 493630, 498214, 503488, 509297, 515710, 522599, 529454, 535779, 541515, 546926, 552247, 557652, 563395, 569613, 575982, 581834, 586718, 590760, 594479, 598374, 602616, 606959, 610912, 614040, 616075, 616792, 616054, 614157, 611934, 610224, 609291, 608820, 608293, 607178, 605008, 601684, 597643, 593470, 589352, 585026, 580155, 574471, 567731, 559891, 551366]
60700E51366q460p786o922o282o120o350o387n615m189k979k635l008l551l751
60686D77331l094j254J226L046L426K960K769L156L642M022M676N882P292Q289
60672E23369Q544Q172P478O647N659M551L609L039K564J787Q97M66L55m53k491
60657E74193m888o326o606o591o909p359p502p198o436n147l483k041j479j842
60643E00386k360k076q69L04L80o72j960k759l005k810k207j404p35j54N71J082
60627D81712P52m4L8J467K982L316K914K986L633M050L982L801L516K866K230
60612E20201K288K881L270L476M193N353N996N844N731O185O655O688O745P184
60598E92690P352O564N261M346L923L486K945K610K496K400K458K836L025K210
$$ y = [551366, 542906, 535120, 528198, 521916, 515796, 509446, 503059, 497444, 493255, 490276, 487641, 484633, 481082, 477331, 474237, 472983, 474209, 477255, 480681, 483641, 486410, 489566, 493208, 497230, 501906, 507788, 515080, 523369, 531913, 540085, 547563, 554210, 559869, 564420, 568029, 571068, 573632, 575419, 576316, 576782, 577137, 576684, 574193, 569305, 562979, 556373, 549782, 542873, 535514, 528012, 520814, 514378, 509231, 505748, 503707, 502228, 500386, 498026, 495950, 495081, 495385, 495765, 495093, 493133, 490374, 487369, 484559, 482352, 480948, 480213, 480059, 480630, 481712, 482464, 482420, 482458, 483925, 486907, 490223, 493137, 496123, 499756, 503806, 507788, 511589, 515105, 517971, 520201, 522489, 525370, 528640, 532116, 536309, 541662, 547658, 553502, 559233, 565418, 572073, 578761, 585506, 592690, 600042, 606606, 611867, 616213, 620136, 623622, 626567, 629177, 631673, 634073, 636531, 639367, 642392, 644602]
60584F44602M21j357k306k528k611k950l589m275m495l822k482j271o72l33L45
60569F12677J462K702L979N506P274Q933J0396J2096J4344J6667J8196J8592J8071
60556G50895J6596J3708R458M960J455r11k880m759n897n533l738j286J160L583
60542G76811O394R809J3377J6263J8071J9189K0191K1098K1505K1099J9737J7249
60530I80793J3708R835O605M479L430L581N141P655J0100J2026J4035J6696J9463
60517A107547K1129K1096J9794J8086J6686J5916J5570J5031J3783J1790R333
60506A285761O594L725J042j193l071m735n779n325k831J295O079J0882J5874
60493A308318K1595K8143L4820M0505M4145M4866M1892L4833K4063J0526m850
$$ y = [644602, 645023, 643666, 641360, 638832, 636221, 633271, 629682, 625407, 620912, 617090, 614608, 613337, 612665, 612332, 612677, 614139, 616841, 620820, 626326, 633600, 642533, 652929, 665025, 679369, 696036, 714232, 732824, 750895, 767491, 781199, 790657, 795617, 797072, 796161, 793281, 788522, 782625, 777092, 773354, 772068, 773228, 776811, 783205, 793014, 806391, 822654, 840725, 859914, 880105, 901203, 922708, 943807, 963544, 980793, 994501, 1004336, 1010941, 1015420, 1018850, 1022431, 1027572, 1035227, 1045327, 1057353, 1071388, 1088084, 1107547, 1128676, 1149772, 1169566, 1187652, 1204338, 1220254, 1235824, 1250855, 1264638, 1276428, 1285761, 1292355, 1296080, 1297122, 1295929, 1292858, 1288123, 1282344, 1277019, 1274188, 1275483, 1281562, 1292444, 1308318, 1329913, 1358056, 1392876, 1433381, 1477526, 1522392, 1564284, 1599117, 1623180, 1633706, 1628856]
60482A628856k1239l7450n1890o3282p1175p5579p6438p3854o8588o1953n5101
60471I72307m8592m2522l6898l1847k7617k4371k1939j9865j7773j5606j3545
60460F71732j1883j0905j0644j0647j0319r589q921q527p961o770n185l818l006
60447E63557k766l093l793m312m262l977l982m081l625k659k004k072k281k046
60433E18604j650j622j781j622j275j324j774k005j838j885k502l060k837k137
60419D91292j832j982j763p78K87P22Q08J239J893J965J227M30K94O59R84J161
60403D96606J390J610J539J213R54Q76P88O38N91O13L37l40q92o45M77J933L076
60386E10764L511L087J975P25j03m31n86p27o58l39j42k95l45L32J519K183J636
$$ y = [1628856, 1607617, 1570167, 1518277, 1454995, 1383820, 1308241, 1231803, 1157949, 1089361, 1027408, 972307, 923715, 881193, 844295, 812448, 784831, 760460, 738521, 718656, 700883, 685277, 671732, 659849, 648944, 638300, 627653, 617334, 607745, 598824, 590297, 582336, 575566, 570381, 566563, 563557, 560791, 557698, 553905, 549593, 545331, 541354, 537372, 533291, 529666, 527007, 525003, 522931, 520650, 518604, 516954, 515332, 513551, 511929, 510654, 509330, 507556, 505551, 503713, 501828, 499326, 496266, 493429, 491292, 489460, 487478, 485715, 484937, 485224, 485946, 486754, 487993, 489886, 491851, 493078, 493508, 493802, 494461, 495445, 496606, 497996, 499606, 501145, 502358, 503312, 504188, 504976, 505614, 506205, 506818, 507155, 506815, 505923, 505278, 505755, 507688, 510764, 514275, 517362, 519337, 520062, 519959, 519528, 518942, 518215, 517557, 517218, 517076, 516781, 516436, 516768, 518287, 520470, 522106]
60369E22106L73n32n52K3O68J057J035N96O6n2L87R59J168J006Q34Q89J111J299
60351E32441J269R01L14n6J56P53J099Q57L66J72M32R88J748K681L520L886L732
60334E55259L384L044K570J904J391J424J924K424K530K138J335L54m49q77j111
60319E77244j365j426q08N58K103L173L559L518L544M244N965Q369J0641J2394
60305F31713J4125J6466J9359K2419K5921L0641L6394M1161M2170L7986K9485
60294I47840J8813P612l707j5144k5943l4441l9121l9625l6933l2669k8199k4060
60282F94423k0098j6218j2882j0597r111p627n896m527l938l628k960k139j758
60269E93044j701j287l78M50Q18R19Q67M50j96l73K74J155J477J126M59l47j166
$$ y = [522106, 522479, 521947, 521395, 521418, 522086, 523143, 524178, 524774, 524840, 524788, 525175, 526134, 527302, 528308, 529142, 530031, 531142, 532441, 533710, 534611, 534925, 534869, 535025, 535778, 536877, 537734, 538100, 538272, 538704, 539692, 541440, 544121, 547641, 551527, 555259, 558643, 561687, 564257, 566161, 567552, 568976, 570900, 573324, 575854, 577992, 579327, 579681, 579232, 578355, 577244, 575879, 574453, 573645, 574203, 576306, 579479, 583038, 586556, 590100, 594344, 600309, 608678, 619319, 631713, 645838, 662304, 681663, 704082, 730003, 760644, 797038, 838199, 880369, 918355, 947840, 966653, 974265, 970558, 955414, 929471, 895030, 855909, 816284, 779351, 746682, 718483, 694423, 674325, 658107, 645225, 634628, 625517, 617890, 611994, 607467, 603529, 599901, 596941, 594802, 593044, 591343, 590056, 589678, 590128, 590946, 591865, 592732, 593182, 592986, 592613, 592887, 594042, 595519, 596645, 597104, 596757, 595591]
60252E95591j617j525j420j878k559k606j933j332j226j168q56q35j567k363k091
60237E70615p02O75J118Q34N92Q44J516K254K608K381K057K468L783N075N252
60222F01370M214K765J692J258J388J857K267K279J929J467R83M49P7J51N63R28
60206F25637J195J678K441L066L221L023K668K140J539J222J334J463J213P90
60192F52630P18J104J499J396O79k38o41j39P95J230Q44J84k50n33p21m09M61
60175F58609J000L67r36j592j098j42M52M42j68j264k331k656k134j400r91q15
60159F45343n62j96J71N03Q30J237J801K349K413J894J501J962K955L505L358
60144F69064L216L576M160M732N679P380R534J1530J3068J4179J5076J6151J7548
$$ y = [595591, 593974, 592449, 591029, 589151, 586592, 583986, 582053, 580721, 579495, 578327, 577471, 576636, 575069, 572706, 570615, 569913, 570588, 571706, 572540, 573132, 573976, 575492, 577746, 580354, 582735, 584792, 587260, 591043, 596118, 601370, 605584, 608349, 610041, 611299, 612687, 614544, 616811, 619090, 621019, 622486, 623469, 623918, 623995, 624146, 624709, 625637, 626832, 628510, 630951, 634017, 637238, 640261, 642929, 645069, 646608, 647830, 649164, 650627, 651840, 652630, 653348, 654452, 655951, 657347, 658026, 657788, 657147, 657008, 657803, 659033, 659877, 660061, 659811, 659278, 658557, 658148, 658609, 659609, 659976, 659040, 657448, 656350, 656208, 656660, 657102, 656934, 655670, 653339, 650683, 648549, 647149, 646158, 645343, 644781, 644585, 644756, 645259, 646089, 647326, 649127, 651476, 653889, 655783, 657284, 659246, 662201, 665706, 669064, 672280, 675856, 680016, 684748, 690427, 697807, 707341, 718871, 731939, 746118, 761194, 777345, 794893]
60131G94893J8534J7860J5015J0690N799O17m802j0021j4364j7219j7980j6391
60119G82631j3294j0305q274o689m924l304k259j359j27Q53P06k19p21m02Q0L30
60103G32723P10J400J909J817J281N48l39j075r99R7J507K424K880L548M858O602
60087G59891Q298R651J0711J1681J2590J3186J3240J2821J2063J0786Q599N376
60075H88893J422k718o508r584j1986j4031j5727j6502j5908j4409j2970j1987
60063G57985j1123j0151r354q963q715q265p728p474p561p610p168o165n007m192
60049F48509l775l356k710k162k053k119j824j063j42P48J546J980J877J675K017
60034F39148K792L297L348L451L738L567K567J279K60p02j961l234m172n135o607
$$ y = [794893, 813427, 831287, 846302, 856992, 862791, 863408, 858606, 848585, 834221, 817002, 799022, 782631, 769337, 759032, 750758, 744069, 739145, 735841, 733582, 732223, 732096, 732949, 733655, 733436, 732715, 732313, 732393, 732723, 733433, 734833, 736742, 738559, 739840, 740388, 740049, 738974, 737975, 738072, 739579, 742003, 744883, 748431, 753289, 759891, 768189, 777840, 788551, 800232, 812822, 826008, 839248, 852069, 864132, 874918, 883517, 888893, 890315, 887597, 881089, 871505, 859519, 845488, 829761, 813259, 797351, 782942, 769972, 757985, 746862, 736711, 727357, 718394, 709679, 701414, 693686, 686212, 678651, 671041, 663873, 657708, 652701, 648509, 644734, 641378, 638668, 636506, 634453, 632334, 630510, 629447, 629305, 630053, 631599, 633579, 635456, 637131, 639148, 641940, 645237, 648585, 652036, 655774, 659341, 661908, 663187, 663447, 662745, 660784, 657550, 653378, 648243, 641636]
60019F41636q191r043r100r024q999q514p382o181n386m810m170l648l425l194
60005E50569k664k100j904j884j532q25k33L1J91L53L40K24M59J098J330M43j013
59988E42883j604o42J049K219K494K339K094J649R99M86L84M64K59m46j462k374
59972E50791k720k245j207k94o5m54j008j433j714j793j528r87m92k09Q2O18J232
59955E36574J545J410R90M60mj08K90P40M88n27j337r67L58J455J516P69j71j077
59937E42404j959k534k377j598r29q94j176j076n77m59j221k180k171r66N19J472
59921E24278K036K626L037K848K287K027K236K491K595K725K809K469J800J539
59907E57803K079K870L207L073K806K457K007J827K273L042L518L575L485L211
$$ y = [641636, 633445, 624402, 615302, 606278, 597279, 588765, 581383, 575202, 569816, 565006, 560836, 557188, 553763, 550569, 547905, 545805, 543901, 542017, 540485, 539660, 539427, 539458, 539649, 540002, 540342, 540566, 541025, 542123, 543453, 543896, 542883, 541279, 540637, 541686, 543905, 546399, 548738, 550832, 552481, 553480, 553966, 554350, 554814, 555073, 554627, 553165, 550791, 548071, 545826, 544619, 544325, 544260, 543806, 542798, 541365, 539651, 537858, 536330, 535343, 534851, 534642, 534724, 535342, 536574, 538119, 539529, 540519, 540979, 540975, 540867, 541157, 541897, 542385, 541858, 540521, 539554, 539912, 541367, 542883, 543652, 543481, 542404, 540445, 537911, 535534, 533936, 533007, 532113, 530937, 529861, 529284, 528825, 527604, 525424, 523253, 522287, 522806, 524278, 526314, 528940, 531977, 534825, 537112, 539139, 541375, 543866, 546461, 549186, 551995, 554464, 556264, 557803, 559882, 562752, 565959, 569032, 571838, 574295, 576302, 578129, 580402, 583444, 586962, 590537, 594022, 597233]
59893E97233K472J527J212J949L195M133M521M588M462M126L784L848M434N069
59879F46553N144M600M029M066M769N612N997N630M591L266K092J103k41k386
59865F94825m919o850p714p907p855p397o322m961l750k632j332J0R63J372J414
59850F36945J319J404K125L668N668P697R761J1879J3596J4517J5024J5694J6112
59837G55409J5115J2268Q402M589J410n87o36J370M191O066O064M293J123l180
59823H15897q078j2555j5629j7104j7660j8050j8265j7638j5907j3787j2218j1266
59811F37740j0219q607o660m797l267k268j866j628q51N47J809K209J750Q40l00
59796F04432j560k701l580m356n137n624n478m821m130l692l434l170k811k363
$$ y = [597233, 599705, 601232, 602444, 604393, 607588, 611721, 616242, 620830, 625292, 629418, 633202, 637050, 641484, 646553, 651697, 656297, 660326, 664392, 669161, 674773, 680770, 686400, 690991, 694257, 696349, 697452, 697211, 694825, 689906, 683056, 675342, 667435, 659580, 652183, 645861, 640900, 637150, 634518, 633186, 633196, 634159, 635531, 636945, 638264, 639668, 641793, 645461, 651129, 658826, 668587, 680466, 694062, 708579, 723603, 739297, 755409, 770524, 782792, 791194, 795783, 797193, 796606, 795970, 797340, 801531, 807597, 813661, 817954, 819077, 815897, 807819, 795264, 779635, 762531, 744871, 726821, 708556, 690918, 675011, 661224, 649006, 637740, 627521, 618914, 612254, 607457, 604190, 601922, 600056, 598428, 597577, 598124, 599933, 602142, 603892, 604732, 604432, 602872, 600171, 596591, 592235, 587098, 581474, 575996, 571175, 567045, 563353, 559919, 556749, 553938, 551575]
59782E51575j894j431q94l04L2j78o43o65o6M82L42k50o20n69l73r0M95J206J416
59763E47571Q60J67J84J016J936K203J684P53j16o03n11J29J017J746K209K634
59747E62879L126L330K860J913J221J297J961K663L004K878K319J482O34L7j87
59732E91417p6K59O54R64J126J153J051Q20N17J59l15r07j384j447j103p15o24
59715E91549q17j015r68o82l09J22P56J567K026J538L30n01k28N47O28j94q63
59698E93486m41P09J381R28n1l99M00J714K481K318J729J229O85k65j428k116
59682F02360j770l52J657L334L807L088K168J844J800J278K20r14k079l498m743
59667F08200n014m318l546l202k856k044r78n8N40O03m6r42j170m57N15J171J678
$$ y = [551575, 549681, 548250, 547356, 547052, 547084, 546906, 546263, 545598, 545532, 546014, 546356, 546106, 545486, 544917, 544544, 544454, 544949, 546155, 547571, 548431, 548598, 548782, 549798, 551734, 553937, 555621, 556374, 556258, 555655, 555144, 555273, 556290, 558036, 560245, 562879, 566005, 569335, 572195, 574108, 575329, 576626, 578587, 581250, 584254, 587132, 589451, 590933, 591567, 591604, 591417, 591341, 591600, 592254, 593218, 594344, 595497, 596548, 597368, 597885, 598044, 597729, 596822, 595438, 593991, 592888, 592173, 591549, 590732, 589717, 588749, 588067, 587758, 587880, 588636, 590203, 592229, 593767, 594097, 593596, 593368, 593915, 594543, 594349, 593486, 593045, 593754, 595135, 596063, 596012, 595613, 596013, 597727, 600208, 602526, 604255, 605484, 606169, 605904, 604476, 602360, 600590, 600238, 601895, 605229, 609036, 612124, 614292, 616136, 617936, 619214, 619434, 618520, 616441, 612943, 608200, 603186, 598868, 595322, 592120, 589264, 587220, 586242, 586184, 586724, 587327, 587281, 586339, 585169, 584712, 585227, 586398, 588076]
59650E88076K255K687L012L740M812N089L724J495j79j036j924l260m422m721
59636E99348m194l321k495j878j423r11j61Q11J942L194M336M897M665L987L411
59621F12208L206L345L578L413K457R90k53j070k045l467m638m696l620k002l05
59606F07101J193K229K870L545M223M159K958J379L34k70r23j350j034m58o51
59591F25305j596k192j866j244j029j126j156j075r74q17o93r00j560k492l503
59576F03082m380m769m542m202m322m644m359l316k214j553j103n12J84Q80J562
59561E65792J964J719J074Q29J322K013K321K247J920J289O53P68J810K865L029
59546E91615K649K693L326L872M037M346N267O599P992R632J2101J5702J9924
$$ y = [588076, 590331, 593018, 596030, 599770, 604582, 609671, 613395, 614890, 614711, 613675, 611751, 608491, 604069, 599348, 595154, 591833, 589338, 587460, 586037, 585126, 584965, 585776, 587718, 590912, 595248, 600145, 604810, 608797, 612208, 615414, 618759, 622337, 625750, 628207, 629197, 628944, 627874, 625829, 622362, 617724, 613028, 609408, 607406, 607101, 608294, 610523, 613393, 616938, 621161, 625320, 628278, 629657, 629991, 629721, 628798, 627448, 626414, 625956, 625305, 623709, 621517, 619651, 618407, 617378, 616252, 615096, 614021, 613047, 612230, 611537, 610637, 609077, 606585, 603082, 598702, 593933, 589391, 585189, 580867, 576223, 571864, 568548, 566334, 564781, 563678, 563166, 563350, 564230, 565792, 567756, 569475, 570549, 571378, 572700, 574713, 577034, 579281, 581201, 582490, 583143, 583911, 585721, 588586, 591615, 594264, 596957, 600283, 604155, 608192, 612538, 617805, 624404, 632396, 642028, 654129, 669831, 689755]
59533F89755K3265K3622J9536J1605K602m296p620p985o671m278q42L314P411
59520G49418J0812J3354J5071J5968J6129J5668J4448J2188Q972N340J800j454
59508H77714m272o493q355j0437j2812j4732j5502j5328j4847j4333j3794j3338
59496G33471j2865j1796r781p355n297l653k098q33k47K0P40J889K710L012L483
59481F91400M626O205P915R711J1315J2251J2700J3507J4905J5982J5782J4276
59469H30575J1838Q447M062o59m523o592o560m806k316lK233N316R598J4179J8022
59454H78811K1161K4263K7520L0570L3346L6331M0070M4647M9428N2936N3191
59443A292274M8607L8596K3471M352j6364l5109m8675n5990n8200n7149n4047
$$ y = [689755, 713020, 736642, 756178, 767783, 770385, 766089, 758469, 750484, 743813, 739535, 738693, 742007, 749418, 760230, 773584, 788655, 804623, 820752, 836420, 850868, 863056, 872028, 877368, 879168, 877714, 873442, 866949, 858594, 848157, 835345, 820613, 805111, 789783, 774936, 760603, 746809, 733471, 720606, 708810, 699029, 691674, 686377, 682724, 680626, 679793, 679546, 679566, 680306, 682195, 684905, 687917, 691400, 696026, 702231, 710146, 719857, 731172, 743423, 756123, 769630, 784535, 800517, 816299, 830575, 842413, 850860, 854922, 854263, 849740, 843148, 836588, 831782, 829466, 829463, 831696, 837012, 846610, 860789, 878811, 899972, 924235, 951755, 982325, 1015671, 1052002, 1092072, 1136719, 1186147, 1239083, 1292274, 1340881, 1379477, 1402948, 1407300, 1390936, 1355827, 1307152, 1251162, 1192962, 1135813, 1081766]
59432A081766m9479m4068l8714l4100l0129k6198k2121j8446j5511j2555q445
59421G82000l107K455P451J1794J5339J7801J9730K2470K6517L0872L4634L8002
59409A005958M0563L9734L2739K0049N417p435j6976k2931k5078k3749k0277j5803
59397A012211j0438m578n23j484q681j9880l0868l8105m0271l8226l3942k9195
59385G56020k4788k0815j7411j4921j3332j1981j0231q281o905o401o208n668
59373F09078m757l773k724j474l09K31J11r2M9L79O56R84J509K063K497L081M143
59356F11652N468O478O995P486Q511J0134J2004J3835J5666J7725K0134K2833
59344G58921K5635K8269L0351L1579L2034L2035L1540L0047K7386K4126K0720
$$ y = [1081766, 1032287, 988219, 949505, 915405, 885276, 859078, 836957, 818511, 803000, 790445, 782000, 778893, 781348, 788799, 800593, 815932, 833733, 853463, 875933, 902450, 933322, 967956, 1005958, 1046521, 1086255, 1118994, 1139043, 1144460, 1137025, 1120049, 1097118, 1072040, 1048291, 1028014, 1012211, 1001773, 997195, 996672, 995188, 986507, 966627, 935759, 897654, 857383, 819157, 785215, 756020, 731232, 710417, 693006, 678085, 664753, 652772, 642541, 634260, 627355, 620954, 614746, 609078, 604321, 600548, 597824, 596350, 596041, 596272, 596383, 596291, 596340, 596719, 597375, 598359, 599868, 601931, 604428, 607509, 611652, 617120, 623598, 630593, 638079, 646590, 656724, 668728, 682563, 698229, 715954, 736088, 758921, 784556, 812825, 843176, 874755, 906789, 938824, 970364, 1000411, 1027797, 1051923, 1072643]
59333A072643J6650J1139M576j696p035j2008j7061k1569k4792k6987k8865l0448
59321I34547l1179l0893k9978k8723k7005k4606k1477j7877j4400j1624r546p700
59309F79539n985m822m164l133j280M94J161J191J899L463M805N443O222P854
59295F92687R822J1366J2675J4409J6607J9006K1835K5265K7993K7365K1545J1220
59283I11795r57j2219k0705k5335k5781k2887j8451j3985r736n235n60L570O849
59270G66363R878J3293J6859J9794K1734K2979K3899K4360K3736K1432J7493J2741
59258I94561Q077L617j154o398j1474j5605j8502k0149k0573k0142j9594j9164
59246H53500j8156j5947j3074j0608q749o737m141j375J078L272N373P236Q731
$$ y = [1072643, 1089293, 1100432, 1105008, 1103312, 1096277, 1084269, 1067208, 1045639, 1020847, 993860, 964995, 934547, 903368, 872475, 842497, 813774, 786769, 762163, 740686, 722809, 708409, 696785, 687239, 679539, 673554, 668732, 664568, 661435, 660155, 660649, 661810, 663001, 664900, 668363, 673168, 678611, 684833, 692687, 702509, 713875, 726550, 740959, 757566, 776572, 798407, 823672, 851665, 879030, 900575, 911795, 910838, 898619, 877914, 852579, 826798, 803911, 785460, 771475, 761739, 756504, 755944, 759514, 766363, 776241, 789534, 806393, 826187, 847921, 870900, 894799, 919159, 942895, 964327, 981820, 994561, 1002638, 1006255, 1005101, 998703, 987229, 971624, 953122, 932973, 912400, 892258, 872664, 853500, 835344, 819397, 806323, 795715, 786966, 780229, 776088, 774713, 775791, 779063, 784436, 791672, 800403]
59233H00403J0046J1306J2292J2871J3345J3918J3981J2554R474N672K090j306
59221I16646n030q905j2078j4207j5960j7861j9298j9353j8255j7133j6443j5616
59209G36507j4371j3384j3165j3164j2569j1387j0057q610o946n481m669m241
59197F18463l624k901k578k609k437j956j581j372q38J93J167J469J121O08M29
59182F03554R12K053L370M185M162L464K573K170K874M630O586P994R007J0050
59168F67584J0878J1088J1201J2231J4188J6056J7378J8756K0427K1491K1174
59157H42452J9929J8490J6551J3365R220N260K031j021m474q098j1292j3823j5809
59144H72781j7283j8031j7851j6833j5388j3935j2573j1125r554q142p179o595
$$ y = [800403, 810449, 821755, 834047, 846918, 860263, 874181, 888162, 900716, 910190, 915862, 917952, 916646, 911616, 902711, 890633, 876426, 860466, 842605, 823307, 803954, 785699, 768566, 752123, 736507, 722136, 708752, 695587, 682423, 669854, 658467, 648410, 639800, 632854, 627373, 622704, 618463, 614839, 611938, 609360, 606751, 604314, 602358, 600777, 599405, 598567, 598760, 599927, 601396, 602517, 603125, 603554, 604466, 606519, 609889, 614074, 618236, 621700, 624273, 626443, 629317, 633947, 640533, 648527, 657534, 667584, 678462, 689550, 700751, 712982, 727170, 743226, 760604, 779360, 799787, 821278, 842452, 862381, 880871, 897422, 910787, 920007, 925267, 927298, 926277, 921803, 913705, 902413, 888590, 872781, 855498, 837467, 819616, 802783, 787395, 773460, 760887, 749762, 740208, 732066, 724887, 718292]
59132G18292o018n057l590j955q22n67o92j75J424L523N241O259O828P348Q218
59117G38257R696J1540J3015J3712J4134J4993J6122J6656J6263J5533J4986J4260
59105I09167J2771J0759R119Q231P434N907L657J456n7r04j509k195k972l690
59091I57174m197m426m355m010l506l127l083l222l161k987l498n413q330j0962
59077H92897j2349j2557j2227j1905j1876j2096j2092j1364j0094r001q306p443
59065G61587o168n218n240n626n289m184l232k835k551k214k365l170l773l359
59051G06363k351j883k337l032l313l338l588m068m252l748k652j359k96J29k40
59036F70035q75p62M43J784K149J857K249L676M935N076M764N191O461P944R537
$$ y = [718292, 712274, 707217, 703627, 701672, 700850, 700283, 699591, 699416, 700840, 704363, 709604, 715863, 722691, 730039, 738257, 747953, 759493, 772508, 786220, 800354, 815347, 831469, 848125, 864388, 879921, 894907, 909167, 921938, 932697, 941816, 950047, 957481, 963388, 967045, 968501, 968444, 967540, 966031, 963836, 960864, 957174, 952977, 948551, 944196, 940186, 936680, 933553, 930470, 927248, 924087, 921100, 917602, 912189, 903859, 892897, 880548, 867991, 855764, 843859, 831983, 819887, 807795, 796431, 786337, 777336, 769030, 761587, 755419, 750201, 744961, 739335, 734046, 729862, 726630, 723795, 721244, 719030, 716665, 713495, 709722, 706363, 704012, 702129, 699792, 696760, 693447, 690109, 686521, 682453, 678201, 674453, 671801, 670442, 670146, 670275, 670035, 669160, 668398, 668841, 670625, 672774, 674631, 676880, 680556, 685491, 690567, 695331, 700522, 706983, 714927, 724464]
59021G24464J1487J3401J4531J4922J5299J5845J5931J5150J3789J2171J0209
59010H77199P844N277K707K86j623k652k892k628j761r2K048M173O496R483J2610
58995I16475J4514J4603J3642J2604J1768J1145J0757J0144Q557O106L836K170
58983A036321J03l396p942j2379j6061j8700j9604j8262j5459j2798j1037r543
58971H91243p458m708j759J070L770O370Q759J0743J2276J3559J4839J6049J6876
58958I81629J7162J6913J5906J3645R917N143rn116j0005j4494j8284k0924k1910
58945I69573k1155j9346j7457j5827j4031j1653q811n895l360j828j823l215n253
58932H39919p306r088j0263j0473r875r118q569q139p908q169q690q748q166p519
$$ y = [724464, 735951, 749352, 763883, 778805, 794104, 809949, 825880, 841030, 854819, 866990, 877199, 885043, 890320, 893027, 893313, 891690, 889038, 886146, 883518, 881757, 881665, 883713, 887886, 894382, 903865, 916475, 930989, 945592, 959234, 971838, 983606, 994751, 1005508, 1015652, 1024209, 1030315, 1034151, 1036321, 1036424, 1033028, 1025086, 1012707, 996646, 977946, 958342, 940080, 924621, 911823, 900786, 891243, 883785, 879077, 877318, 878388, 882158, 888528, 897287, 908030, 920306, 933865, 948704, 964753, 981629, 998791, 1015704, 1031610, 1045255, 1055172, 1060315, 1060306, 1055190, 1045185, 1030691, 1012407, 991483, 969573, 948418, 929072, 911615, 895788, 881757, 870104, 861293, 855398, 852038, 850210, 848387, 845172, 839919, 832613, 823525, 813262, 802789, 792914, 783796, 775227, 767088, 759180, 751011, 742321, 733573, 725407, 717888]
58918G17888p003n915l842j547k6O80J203J962L195N135P425Q990R340R502J0750
58903G57737J2856J4609J5769J7323J9727K1874K2341K1034J9186J7970J7434
58892I57860J6827J5832J5297J6492J9744K4228K9078L4079L9064M3310M5979
58881A257790M6561M4625L9843L2874K5396J8525J1649L621n418j4288k2349k9821
58869A409008l6634m2033m5374m6578m5717m2897l8658l3934k9467k5621k2684
58858I99411k0796j9634j8755j8206j8235j8546j8468j7919j7510j7505j7315
58847G96522j6259j4370j2146r893p672n691m394m116m708n565o097o117n728
58834F93766n002m123l691m210n178n420m656l959m188m681m286l023j886j363
$$ y = [717888, 710885, 704970, 701128, 699581, 699555, 700235, 701438, 703400, 706595, 711730, 719155, 728145, 737485, 746987, 757737, 770593, 785202, 800971, 818294, 838021, 859895, 882236, 903270, 922456, 940426, 957860, 974687, 990519, 1005816, 1022308, 1042052, 1066280, 1095358, 1129437, 1168501, 1211811, 1257790, 1304351, 1348976, 1388819, 1421693, 1447089, 1465614, 1477263, 1480884, 1475466, 1461178, 1438829, 1409008, 1372374, 1330341, 1284967, 1238389, 1192672, 1149775, 1111117, 1077183, 1047716, 1022095, 999411, 978615, 958981, 940226, 922020, 903785, 885239, 866771, 848852, 831342, 813837, 796522, 780263, 765893, 753747, 743854, 736182, 730491, 726097, 721981, 717273, 711708, 705611, 699494, 693766, 688764, 684641, 680950, 676740, 671562, 666142, 661486, 657527, 653339, 648658, 644372, 641349, 639463, 638100]
58820F38100j127q66n04K66J721L436M659N345N958O316N672M067K670K318K540
58805F80571K401J723Q92J6j089k333l351l957m300m489m334l530k114p04q1m38
58789F54883j133j329p30M39J877L350M660N803O938P929Q233P601O566N781N157
58774G16025M195K917J823J001nj420k744l280k807j763q74n87p15q33j004j605
58758G08324k344k157n92J443K936M097N574O969P341O842O643P257P960Q084
58744G68377P909Q054Q716R717J0671J1081J0833J0514J0680J0923J0438R399
58732H87312Q842R199R871J0336J0700J0941J0616R675Q765Q354Q236Q126Q058
58719A009031P930P374O412N643N555O187P506R359J0994J1510J0989J0260R360
$$ y = [638100, 636973, 636107, 635603, 635869, 637590, 641026, 645685, 651030, 656988, 663304, 668976, 673043, 675713, 678031, 680571, 682972, 684695, 685587, 685603, 684514, 682181, 678830, 674873, 670573, 666084, 661750, 658220, 656106, 655402, 655321, 654883, 653750, 652421, 651691, 652130, 654007, 657357, 662017, 667820, 674758, 682687, 690920, 698521, 705087, 710868, 716025, 720220, 723137, 724960, 725961, 725956, 724536, 721792, 718512, 715705, 713942, 713068, 712481, 711766, 710933, 709929, 708324, 705980, 703823, 703231, 704674, 707610, 711707, 717281, 724250, 731591, 738433, 745076, 752333, 760293, 768377, 776286, 784340, 793056, 802773, 813444, 824525, 835358, 845872, 856552, 867475, 877913, 887312, 896154, 905353, 915224, 925560, 936260, 947201, 957817, 967492, 976257, 984611, 992847, 1000973, 1009031, 1016961, 1024335, 1030747, 1036390, 1041945, 1048132, 1055638, 1064997, 1075991, 1087501, 1098490, 1108750, 1118110]
58706A118110P310L802j2l110n935r337j3080j6394j9329k2467k5677k8140k9463
58693I56278k9909k9557k8057k5278k1735j8198j5236j3109j1750j0886j0322
58682G42241j0067j0101j0166j0053r844r753r823r886r623q641o771m321j858
58669F31334K85K028L307M278N554P592R899J1593J2672J3805J4821J4496J2247
58656G43911R115O411M255K183M31l43k71k48q15j751k674l493m238m838n135
58641G42500m927m133l033k093j398n85N64J830K995M052M791M754L944K958K099
58626G54318Q78r79k702l365l215l311m004m470l799j907P02L614O700R956J3285
58611G61701J6447J9180K1276K2385K1852J9187J4800R866N338J414j913m358
$$ y = [1118110, 1125420, 1129222, 1129210, 1126100, 1120165, 1110828, 1097748, 1081354, 1062025, 1039558, 1013881, 985741, 956278, 926369, 896812, 868755, 843477, 821742, 803544, 788308, 775199, 763449, 752563, 742241, 732174, 722073, 711907, 701854, 692010, 682257, 672434, 662548, 652925, 644284, 637513, 633192, 631334, 631619, 633647, 636954, 641232, 646786, 654378, 664277, 675870, 688542, 702347, 717168, 731664, 743911, 753026, 759437, 763692, 765875, 766306, 765963, 765692, 765444, 764629, 762878, 760204, 756711, 752473, 747635, 742500, 737573, 733440, 730407, 728314, 726916, 726331, 726895, 728725, 731720, 735772, 740563, 745317, 749261, 752219, 754318, 755196, 754217, 751515, 748150, 744935, 741624, 737620, 733150, 729351, 727444, 728146, 731760, 738460, 748416, 761701, 778148, 797328, 818604, 840989, 862841, 882028, 896828, 906694, 912032, 913446, 911533, 907175]
58599I07175n709o251o480o573o440o000n268m377l606l040k185m66J790L519
58585H56089M314N024O592Q910J1312J3579J5791J7529J7951J6695J4242J1431
58573I99459Q874O728M870L318K458K625L562M728O017P638R425J1010J2672J4986
58559A098370J7504J8827J8409J7260J6225J4645J1574P442L392l78m377q417
58547A210476j1565j3449j4633j5617j6286j6450j6294j6159j6285j6741j7299
58536A039698j7472j7046j6350j5693j4819j3349j1409r411p533n876m695m013
58524I02032l226j738L25K446M398O165P562Q485R147R527R029P362N363M128
58510I71005L654L104K123J118M04J8K06J175K359K878K860L464N199O999P477
$$ y = [907175, 901466, 895215, 888735, 882162, 875722, 869722, 864454, 860077, 856471, 853431, 851246, 850780, 852570, 856089, 860403, 865427, 872019, 880929, 892241, 905820, 921611, 939140, 957091, 973786, 988028, 999459, 1008333, 1015061, 1019931, 1023249, 1025707, 1028332, 1031894, 1036622, 1042639, 1050277, 1059702, 1070712, 1083384, 1098370, 1115874, 1134701, 1153110, 1170370, 1186595, 1201240, 1212814, 1220256, 1223648, 1223270, 1218893, 1210476, 1198911, 1185462, 1170829, 1155212, 1138926, 1122476, 1106182, 1090023, 1073738, 1056997, 1039698, 1022226, 1005180, 988830, 973137, 958318, 944969, 933560, 924149, 916616, 910740, 906045, 902032, 898806, 897068, 897393, 899839, 904237, 910402, 917964, 926449, 935596, 945123, 954152, 961514, 966877, 971005, 974659, 977763, 979886, 981004, 981408, 981426, 981632, 982807, 985166, 988044, 990904, 994368, 999567, 1006566, 1014043]
58495A014043O560N395M907M955M810M082K964J725K42j794m337o956r195j0645
58481A016756j0765r349p205n616m797l645j471Q07J887J859J810K059J771K56
58467I84357k138m509o193p030p343p734q532r404r720r220q135o872n731m724
58453H87072l477j689L13J839K817L798M833N148M366L158K141R71o56j929j833
58438I06872n95P71J902L086M179M606M342M009M043M424N047N700N925N652N658
58423I65621O703Q498J0251J1829J3466J4745J4923J4190J3500J3130J2337J0545
58411A109738P991N059J791j619m549o518p616q200q465q419q005p204o204n281
58397A052499m327k907r22J200L173N099O718P212O289M779L453J970k26k718
$$ y = [1014043, 1020603, 1025998, 1030905, 1035860, 1040670, 1044752, 1047716, 1049441, 1049683, 1047889, 1043552, 1036596, 1027401, 1016756, 1005991, 996642, 989437, 983821, 979024, 975379, 973908, 974715, 976602, 978461, 980271, 982330, 984101, 984357, 982219, 977710, 971517, 964487, 957144, 949410, 940878, 931474, 921754, 912534, 904399, 897527, 891796, 887072, 883595, 881906, 882219, 884058, 886875, 890673, 895506, 900654, 905020, 908178, 910319, 911290, 910634, 908705, 906872, 906277, 907048, 908950, 912036, 916215, 920821, 925163, 929172, 933215, 937639, 942686, 948386, 954311, 959963, 965621, 972324, 980822, 991073, 1002902, 1016368, 1031113, 1046036, 1060226, 1073726, 1086856, 1099193, 1109738, 1117729, 1122788, 1124579, 1122960, 1118411, 1111893, 1104277, 1096077, 1087612, 1079193, 1071188, 1063984, 1057780, 1052499, 1048172, 1045265, 1044343, 1045543, 1048716, 1053815, 1060533, 1067745, 1074034, 1078813, 1082266, 1084236, 1084010, 1081292]
58383A081292m689o080p158p604p038o065n625n621n212m155k911j673l09J034
58369A018186K119L172M419N386N563N395N804P073Q873J0922J2786J3734J3704
58356A117136J3671J4142J4129J2752J0840R569Q479O493M102K695K355K269K735
58343A221367M580O978Q040P661P660Q908J0310J1016J1631J2705J3799J4591
58331A339246J5412J6166J6182J5603J5507J6258J7010J7180J7000J6404J4879
58320A516847J2779J1332J0974J0975J0903J1085J1434J1408J1393J2413J4218
58309A645761J5332J5432J5956J7765J9905K1300K2126K2815K3120K2870K2433
58298A864815K1913K1007K0042J9792K0057J9864J9250J9356K0488K1728K2723
$$ y = [1081292, 1076603, 1070523, 1063365, 1055761, 1048723, 1042658, 1037033, 1031412, 1026200, 1022045, 1019134, 1017461, 1017152, 1018186, 1020305, 1023477, 1027896, 1033282, 1038845, 1044240, 1050044, 1057117, 1065990, 1076912, 1089698, 1103432, 1117136, 1130807, 1144949, 1159078, 1171830, 1182670, 1192239, 1200718, 1207211, 1211313, 1214008, 1216363, 1218632, 1221367, 1225947, 1232925, 1240965, 1248626, 1256286, 1265194, 1275504, 1286520, 1298151, 1310856, 1324655, 1339246, 1354658, 1370824, 1387006, 1402609, 1418116, 1434374, 1451384, 1468564, 1485564, 1501968, 1516847, 1529626, 1540958, 1551932, 1562907, 1573810, 1584895, 1596329, 1607737, 1619130, 1631543, 1645761, 1661093, 1676525, 1692481, 1710246, 1730151, 1751451, 1773577, 1796392, 1819512, 1842382, 1864815, 1886728, 1907735, 1927777, 1947569, 1967626, 1987490, 2006740, 2026096, 2046584, 2068312, 2091035]
58287B091035K4189K6328K8399L0136L1907L3358L3777L3895L5311L7818L9546
58276B445699L9996M0647M2100M3191M3525M4425M6414M8268M9500N1464N4849
58265B950078N8473O1618O5265O9871P4185P7514Q0880Q4768Q7980Q9904R1657
58254C792193R3800R5272R5759R6680R8706J00778J02688J05946J10904J15908
58244D808634J20569J26800J35205J43746J51593J60843J72518J84371J94873
58235F199152K05846K18785K32132K44728K58410K74496K91307L07989L27022
58226H559867L49858L74060L98112M25030M57459M93323N30491N71714O20384
58217A2780298O75366P34728Q00697Q76201R60571J053759J160459J284929J426638
$$ y = [2091035, 2115224, 2141552, 2169951, 2200087, 2231994, 2265352, 2299129, 2333024, 2368335, 2406153, 2445699, 2485695, 2526342, 2568442, 2611633, 2655158, 2699583, 2745997, 2794265, 2843765, 2895229, 2950078, 3008551, 3070169, 3135434, 3205305, 3279490, 3357004, 3437884, 3522652, 3610632, 3700536, 3792193, 3885993, 3981265, 4077024, 4173704, 4272410, 4373188, 4475876, 4581822, 4692726, 4808634, 4929203, 5056003, 5191208, 5334954, 5486547, 5647390, 5819908, 6004279, 6199152, 6404998, 6623783, 6855915, 7100643, 7359053, 7633549, 7924856, 8232845, 8559867, 8909725, 9283785, 9681897, 10106927, 10564386, 11057709, 11588200, 12159914, 12780298, 13455664, 14190392, 14991089, 15867290, 16827861, 17881620, 19042079, 20327008, 21753646]
58208B1753646J586965J775009K000513K267151K580368K955688L411218L959358
58200D2289916M615699N407622O361802P492126Q814920J0366482J2187623J4301974
58192A11838164J6731342J9514185K2666042K6115741K9685854L3044968L5505028
58185B95101324L5821665L2449250K4418700J2261288j895080j5260988k5614061
58178C57282098l1940043l4314406l3471658l0433711k6210887k1556095j6928766
58171A62426532j2721643r463966p678583p492056q441329r721843j0642357j0889465
58163H5375290j0483076r602888q465077p264525o136832n143941m298771l598814
58155C0381366l033898k580635k210915j906462j657306j451195j275123j124582
$$ y = [21753646, 23340611, 25115620, 27116133, 29383284, 31963652, 34919340, 38330558, 42289916, 46905615, 52313237, 58675039, 66167165, 74982085, 85348567, 97536190, 111838164, 128569506, 148083691, 170749733, 196865474, 226551328, 259596296, 295101324, 330922989, 363372239, 387790939, 400052227, 398157147, 382896159, 357282098, 325342055, 291027649, 257555991, 227122280, 200911393, 179355298, 162426532, 149704889, 140240923, 132562340, 125070284, 116628955, 106907112, 96264755, 85375290, 74892214, 65289326, 56824249, 49559724, 43422892, 38278951, 33980180, 30381366, 27347468, 24766833, 22555918, 20649456, 18992150, 17540955, 16265832, 15141250]
58147A5141250j001291r02388q19615p48326o89350o41671o00053n60705n23414
58138H654437m87345m50036m11592l75075l41777l10214k80218k53697k30814
58129E513669k09880j91845j80470j76603j76191j75249j73173j69950j64014
58120C896294j54840j44603j35264j26467j17594j09381j02181r5158q8414q3349
58110B739043p9865p5802p0436o5872o3593o2166n9963n7644n6169n4622n1898
58099B041013m8767m6469m4852m3420m2603m2458m1639l9139l5825l3032l0913
58088A591896k9220k8200k7663k6672k5181k4437k4780k4766k3522k2251k2091
58077A313113k2313k1931k1422k1406k1332k0915k1229k2662k3503k2309k0170
$$ y = [15141250, 14139959, 13237571, 12417956, 11669630, 10980280, 10338609, 9738556, 9177851, 8654437, 8167092, 7717056, 7305464, 6930389, 6588612, 6278398, 5998180, 5744483, 5513669, 5303789, 5111944, 4931474, 4754871, 4578680, 4403431, 4230258, 4060308, 3896294, 3741454, 3596851, 3461587, 3335120, 3217526, 3108145, 3005964, 2910806, 2822392, 2739043, 2659178, 2583376, 2512940, 2447068, 2383475, 2321309, 2261346, 2203702, 2147533, 2092911, 2041013, 1992246, 1945777, 1900925, 1857505, 1814902, 1772444, 1730805, 1691666, 1655841, 1622809, 1591896, 1562676, 1534476, 1506813, 1480141, 1454960, 1430523, 1405743, 1380977, 1357455, 1335204, 1313113, 1290800, 1268869, 1247447, 1226041, 1204709, 1183794, 1162565, 1139903, 1116400, 1094091, 1073921]
58066A073921j8741j7572j5491j3271j2552j2971j2730j1494j0490j0129r644
58055I28836q989r119j0221j1294j1637j1482j1036j0160r108q454q182p797p221
58042H04136o757o322n721n406n934o826p005o303n625n600n939o181o340o715
58028G17462p529q700r609r452q235p006o602o663o439n885n317m604l594k739
58014F25088k452k318j804j208j007q80l66N9k55q11o27N6N6q67j691j704j257
57997F08012q57n92o05j094j622j388l95M60N97K38l90j362k326k521j922j539
57981E92694k043k819k945k525k418l048m076m975n390n117m212l179k677k900
57967E44370l391l508l052k322j618q54J28J029J368J285J508K250K696K054O35
$$ y = [1073921, 1055180, 1037608, 1022117, 1008846, 996294, 983323, 970593, 959099, 948609, 938480, 928836, 919847, 910728, 900507, 889213, 877576, 866094, 855058, 844898, 835790, 827336, 819154, 811357, 804136, 797379, 791057, 785336, 779930, 773996, 767170, 760165, 753862, 748237, 742637, 736698, 730517, 724177, 717462, 709933, 701233, 691624, 682172, 673937, 666931, 660329, 653666, 647227, 641342, 636025, 631421, 627827, 625088, 622636, 620318, 618514, 617306, 616299, 615419, 615053, 615112, 614857, 614046, 613419, 613475, 613531, 612664, 610973, 609269, 608012, 607155, 606563, 605958, 604864, 603242, 601854, 601459, 601919, 602516, 602754, 602364, 601002, 598676, 596155, 594233, 592694, 590651, 587832, 584887, 582362, 579944, 576896, 572820, 567845, 562455, 557338, 553126, 549947, 547270, 544370, 540979, 537471, 534419, 532097, 530479, 529625, 529753, 530782, 532150, 533435, 534943, 537193, 539889, 541943, 542578]
57952E42578o45j498k353l448m509n280n756n865n485m805m239l907l590l192
57938D88006k839k531k078j417o73J83J276K402L040K879K173J435R36N68J08
57923D93468m26o38j49Q32J546J418N61n60j667k689l546m211m790n243n364n141
57907D63401m831m490l842k951k483k886l724m371m853n393n625n020l885l051
57893D05996k712k278j439n02L13J205K172K709K547K176K303L024L799M026L561
57878D26900K794K306K223J994J037m91j899k842l545m198m638m785m941n389
57864D04526n962o278o214n934n532m942m153l386k886k534j891p06O54J604K069
57849C58435K503L172L846M359M970N912O921P531P587P148O260N125M229L826
$$ y = [542578, 541933, 540435, 538082, 534634, 530125, 524845, 519089, 513224, 507739, 502934, 498695, 494788, 491198, 488006, 485167, 482636, 480558, 479141, 478468, 478651, 479927, 482329, 485369, 488248, 490421, 491856, 492792, 493360, 493468, 493042, 492404, 492255, 493087, 494633, 496051, 496612, 496052, 494385, 491696, 488150, 483939, 479149, 473906, 468542, 463401, 458570, 454080, 450238, 447287, 444804, 441918, 438194, 433823, 428970, 423577, 417952, 412932, 409047, 405996, 403284, 401006, 399567, 399065, 399378, 400583, 402755, 405464, 408011, 410187, 412490, 415514, 419313, 423339, 426900, 429694, 432000, 434223, 436217, 437254, 436763, 434864, 432022, 428477, 424279, 419641, 414856, 409915, 404526, 398564, 392286, 386072, 380138, 374606, 369664, 365511, 362125, 359239, 356705, 354814, 354108, 354762, 356366, 358435, 360938, 364110, 367956, 372315, 377285, 383197, 390118, 397649, 405236, 412384, 418644, 423769, 427998, 431824]
57835D31824L491K573R63q28k181k774k785k885l723n108o086o093n572n182m893
57820C90741m373l764l397l154k746k370k385k552k181r83P20K427L679M123L798
57805C77583L041J725q35m674q357j0337j0639j0406j0186r683q873q175p576
57792B92608o686n678n147m939m212k834j631j056o58k15l03j153j864j467j57
57777B54608J061J569J470J247J420K173L057L431L347L478M118M859N332N551
57763B96721N383M563L494L135L663M111L770L077K525J601l28k754m608n628
57749C18725o311o799o664n771m604l759l464l571l676l442k984k721k711k598
57735B59650k289k153k243k002j178l29O0L02P31R17M35k18l64l01p14j320j129
$$ y = [431824, 435315, 437888, 438851, 438023, 435842, 433068, 430283, 427398, 423675, 418567, 412481, 406388, 400816, 395634, 390741, 386368, 382604, 379207, 376053, 373307, 370937, 368552, 366000, 363819, 362836, 363556, 365983, 369662, 373785, 377583, 380624, 382349, 381514, 376840, 368483, 358146, 347507, 337101, 326915, 317232, 308359, 300184, 292608, 285922, 280244, 275097, 270158, 265946, 263112, 261481, 260425, 259767, 259552, 259249, 258096, 256232, 254765, 254608, 255669, 257238, 258708, 259955, 261375, 263548, 266605, 270036, 273383, 276861, 280979, 285838, 291170, 296721, 302104, 306667, 310161, 313296, 316959, 321070, 324840, 327917, 330442, 332043, 331715, 328961, 324353, 318725, 312414, 305615, 298951, 293180, 288576, 284817, 281353, 277782, 274106, 270664, 267680, 264959, 262248, 259650, 257361, 255208, 252965, 250963, 249785, 249456, 249516, 249818, 250549, 251466, 251901, 251683, 251319, 251018, 250304, 248984, 247855]
57718B47855K7J237J766J719J419R90O83P83J011O78l41j358j789j700j265k96
57702B51419J270K878L799L877L590L475L658L911M061M235M570M653L727J712
57688C00835m17j678k128k317k174j205M39K097L757O115R263J2349J4975J8078
57674C57989K2738K8805L5529M3039N2123O2679P3363Q3001R1133R6107R3293
57663A039799P7019M5656M696l5970o8055q8326r7326r6827q9247p8024o6483
57652E46912n6035m6345l7194k9284k3176j8555j4941j2280j0420q672o562m512
57640B78936l268k976l227l591l681l143k118j380j422j657j175j08M53q7j151
57625B50405j871k070k084k057j917j798k022k594k946k437j133L0J02q13j534
$$ y = [247855, 247882, 249119, 250885, 252604, 254023, 255013, 255696, 256479, 257490, 258168, 257827, 256469, 254680, 252980, 251715, 251419, 252689, 255567, 259366, 263243, 266833, 270308, 273966, 277877, 281938, 286173, 290743, 295396, 299123, 300835, 300418, 298740, 296612, 294295, 292121, 290916, 291355, 293452, 297209, 303324, 312587, 324936, 339911, 357989, 380727, 409532, 445061, 488100, 540223, 602902, 676265, 759266, 850399, 946506, 1039799, 1116818, 1162474, 1167170, 1131200, 1063145, 974819, 877493, 780666, 691419, 613395, 546912, 490877, 444532, 407338, 378054, 354878, 336323, 321382, 309102, 298682, 290010, 283448, 278936, 275668, 272692, 269465, 265874, 262193, 259050, 256932, 255552, 254130, 252473, 251298, 251190, 251643, 251556, 250405, 248534, 246464, 244380, 242323, 240406, 238608, 236586, 233992, 231046, 228609, 227476, 227506, 227608, 226795, 225261]
57610B25261j100J16Q97P19K45J89K52l51j594k536k516j881j353j118q06j80
57594B14244N62R79P34j54j160j641j555j562k077k515k014p14L23M40J7l08l59
57577B03240k44j01k56j013j913j946q89K14M27J39K07N75O09L71M24O93O18L66
57559B01521P38J717K186J448J15q13r48k79J088K361K274O50q81o92P78J681
57543B12944J179J57l25k94k66k16K64J134J751J559O31m98j417k073k486k465
57527B09579j915j251j032j191j064l79L55O68Q01J137J444J292R51J127J925
57512B12447K626K574J873J104Q20J268K248L150L408K981K183J241L16k42j41
57497B37856L90Q57J162J500J666J152R4n48j71N52M70o03j666j659m65J116K113
$$ y = [225261, 224161, 224277, 225174, 225893, 226138, 226327, 226579, 226228, 224634, 222098, 219582, 217701, 216348, 215230, 214424, 214244, 214806, 215785, 216519, 216365, 215205, 213564, 212009, 210447, 208370, 205855, 203841, 203127, 203450, 203890, 203907, 203599, 203240, 202996, 202895, 202639, 201626, 199713, 197767, 196878, 197092, 197519, 197658, 197865, 198440, 199049, 199420, 199844, 200537, 201155, 201521, 202259, 203976, 206162, 207610, 207725, 206912, 205964, 205685, 206773, 209134, 211408, 212058, 211177, 210485, 211263, 212944, 214123, 214280, 213955, 213661, 213395, 213179, 213443, 214577, 216328, 217887, 218518, 218020, 216603, 214530, 212044, 209579, 207664, 206413, 205381, 204190, 203126, 202747, 203102, 203770, 204571, 205708, 207152, 208444, 209395, 210522, 212447, 215073, 217647, 219520, 220624, 221444, 222712, 224960, 228110, 231518, 234499, 236682, 237923, 238239, 237997, 237856, 238246, 239103, 240265, 241765, 243431, 244583, 244677, 244129, 243958, 244510, 244980, 244377, 242711, 241052, 240587, 241703, 243816]
57480B43816K085J285K90m81q25n53L91J574K272K219J884J776J843J745J472
57465B60793J317J438J747K113K441K611K632K696K896K947K533J788J237J295
57451B90484K005L073L925L930L019K008J828K431K801K146P67l63n17L50J686
57436C19573K685K854K481K348K775L224L043K372J938K152K706K978K621J825
57422C55575J194J292K035K694K716K456K714L607M301L982K810J733J547K184
57408C90840K889K979K509K140K311K760L066L315L798M193L867K996K633L274
57394D33570M023L824K959K585L069L674L858L958M348M714M631M345M385M716
57380D88659M863M704M611M808N048N067M978N019N157N178N007M726M364L899
$$ y = [243816, 245901, 247186, 247476, 246995, 246170, 245617, 246008, 247582, 249854, 252073, 253957, 255733, 257576, 259321, 260793, 262110, 263548, 265295, 267408, 269849, 272460, 275092, 277788, 280684, 283631, 286164, 287952, 289189, 290484, 292489, 295562, 299487, 303417, 306436, 308444, 310272, 312703, 315504, 317650, 318417, 318054, 317537, 317887, 319573, 322258, 325112, 327593, 329941, 332716, 335940, 338983, 341355, 343293, 345445, 348151, 351129, 353750, 355575, 356769, 358061, 360096, 362790, 365506, 367962, 370676, 374283, 378584, 382566, 385376, 387109, 388656, 390840, 393729, 396708, 399217, 401357, 403668, 406428, 409494, 412809, 416607, 420800, 424667, 427663, 430296, 433570, 437593, 441417, 444376, 446961, 450030, 453704, 457562, 461520, 465868, 470582, 475213, 479558, 483943, 488659, 493522, 498226, 502837, 507645, 512693, 517760, 522738, 527757, 532914, 538092, 543099, 547825, 552189, 556088]
57366E56088L509L575M319N478O470O836O548N949N550N707O291O711O516N979
57352F35526N855O446P236P590P490P291P100O855O793P247P989Q361Q098P607
57338G37484P218O803O386O528P541Q690Q951Q419Q236R016R948R883Q832P893
57324H51828P848Q381Q759Q810Q884R137R321R363R608J0280J0958J1069J0657
57311I74903J0290J0240J0313J0475J1063J2120J3020J3235J3101J3356J4098
57300A106214J4734J4843J4688J4814J5502J6644J7810J8441J8287J7755J7540
57289A287272J7848J8267J8483J8728J9318K0074K0487K0345J9923J9604J9584
57278A499933J9912K0511K1115K1406K1386K1508K2191K3199K3753K3450K2830
$$ y = [556088, 559597, 563172, 567491, 572969, 579439, 586275, 592823, 598772, 604322, 610029, 616320, 623031, 629547, 635526, 641381, 647827, 655063, 662653, 670143, 677434, 684534, 691389, 698182, 705429, 713418, 721779, 729877, 737484, 744702, 751505, 757891, 764419, 771960, 780650, 789601, 798020, 806256, 815272, 825220, 835103, 843935, 851828, 859676, 868057, 876816, 885626, 894510, 903647, 912968, 922331, 931939, 942219, 953177, 964246, 974903, 985193, 995433, 1005746, 1016221, 1027284, 1039404, 1052424, 1065659, 1078760, 1092116, 1106214, 1120948, 1135791, 1150479, 1165293, 1180795, 1197439, 1215249, 1233690, 1251977, 1269732, 1287272, 1305120, 1323387, 1341870, 1360598, 1379916, 1399990, 1420477, 1440822, 1460745, 1480349, 1499933, 1519845, 1540356, 1561471, 1582877, 1604263, 1625771, 1647962, 1671161, 1694914, 1718364, 1741194]
57267A741194K2815K3601K4418K4458K3772K3103K3055K3658K4513K5172K5412
57256B005171K5388K5431K5706K6140K6751K7727K8959K9823K9822K9245K8753
57245B308916K8485K8041K7336K6890K7126K7850K8617K9275K9906L0516L1062
57234B624020L1512L1725L1465L0790L0191L0048L0178L0188L0122L0324L0734
57223B961297L0798L0257K9725L0136L1650L3444L4644L5192L5590L5995L6059
57212C324787L5705L5558L6154L7039L7166L6128L4552L3283L2602L2365L2371
57201C707710L2365L2074L1611L1557L2267L3334L4054L4273L4391L4569L4475
57190D072680L3845L2976L2323L1844L1029K9636K8092K7017K6483K5939K4937
$$ y = [1741194, 1764009, 1787610, 1812028, 1836486, 1860258, 1883361, 1906416, 1930074, 1954587, 1979759, 2005171, 2030559, 2055990, 2081696, 2107836, 2134587, 2162314, 2191273, 2221096, 2250918, 2280163, 2308916, 2337401, 2365442, 2392778, 2419668, 2446794, 2474644, 2503261, 2532536, 2562442, 2592958, 2624020, 2655532, 2687257, 2718722, 2749512, 2779703, 2809751, 2839929, 2870117, 2900239, 2930563, 2961297, 2992095, 3022352, 3052077, 3082213, 3113863, 3147307, 3181951, 3217143, 3252733, 3288728, 3324787, 3360492, 3396050, 3432204, 3469243, 3506409, 3542537, 3577089, 3610372, 3642974, 3675339, 3707710, 3740075, 3772149, 3803760, 3835317, 3867584, 3900918, 3934972, 3969245, 4003636, 4038205, 4072680, 4106525, 4139501, 4171824, 4203668, 4234697, 4264333, 4292425, 4319442, 4345925, 4371864, 4396801]
57179D396801K3680K2674K1991K1217K0132J9092J8553J8348J7731J6197J4143
57168D610559J2494J1714J1248J0213Q573P212O781O843O534N674M742L940K977
57155D709504J755O79N9k97p19j367k421m145o485q939j1094j2979j4756j6449
57141D632346j8126j9959k1812k3271k4314k5465k6915k8006k8107k7592k7365
57130D361414k7703k8142k8209k7738k6654k5048k3380k1927k0188j7308j3067
57119D102050p979k563K931Q061J2151J4859J6442J7465J8747K1463K6695L4765
57107D265087M5466N8880P5381R4869J16836J41573J70858K07257K53259L11058
57097E740524L82380M67911N67091O78447P99448R25979J052918J175567J289824
$$ y = [4396801, 4420481, 4443155, 4465146, 4486363, 4506495, 4525587, 4544140, 4562488, 4580219, 4596416, 4610559, 4623053, 4634767, 4646015, 4656228, 4664801, 4672013, 4678794, 4685637, 4692171, 4697845, 4702587, 4706527, 4709504, 4711259, 4711938, 4711997, 4711700, 4710981, 4709614, 4707193, 4703048, 4696563, 4687624, 4676530, 4663551, 4648795, 4632346, 4614220, 4594261, 4572449, 4549178, 4524864, 4499399, 4472484, 4444478, 4416371, 4388779, 4361414, 4333711, 4305569, 4277360, 4249622, 4222968, 4197920, 4174540, 4152613, 4132425, 4115117, 4102050, 4094071, 4091508, 4094439, 4102500, 4114651, 4129510, 4145952, 4163417, 4182164, 4203627, 4230322, 4265087, 4310553, 4369433, 4444814, 4539683, 4656519, 4798092, 4968950, 5176207, 5429466, 5740524, 6122904, 6590815, 7157906, 7836353, 8635801, 9561780, 10614698, 11790265, 13080089]
57088A3080089J390519J470724J523362J542671J523880J464114J366710J244052
57080B4606121J111965R78016Q34907O65762M55532J98420j01364m31097p70615
57071B7547647j094840j379086j604441j760124j843160j857399j812415j721451
57063A4474731j598616j456751j306698j157271j015077q84320p67039o63776
57055E625183n74126m97030m31008l74602l26728k86538k52962k24577k00078
57046B457534j78761j60331j44353j30211j17541j06366r6619q7855p9655p2061
57036A283781o5270n9110n3140m7212m1603l6463l1524k6406k1071j5719j0294
57025H75969m240L030J1438K0285K9348L9777N3257P0365R0370J12242J33680
$$ y = [13080089, 14470608, 15941332, 17464694, 19007365, 20531245, 21995359, 23362069, 24606121, 25718086, 26696102, 27531009, 28196771, 28652303, 28850723, 28749359, 28318262, 27547647, 26452807, 25073721, 23469280, 21709156, 19865996, 18008597, 16196182, 14474731, 12876115, 11419364, 10112666, 8955395, 7940318, 7055998, 6288959, 5625183, 5051057, 4554027, 4123019, 3748417, 3421689, 3135151, 2882189, 2657612, 2457534, 2278773, 2118442, 1974089, 1843878, 1726337, 1619971, 1523352, 1435497, 1355842, 1283781, 1218511, 1159401, 1106261, 1059049, 1017446, 980983, 949459, 923053, 901982, 886263, 875969, 871729, 874759, 886197, 906482, 935830, 975607, 1028864, 1099229, 1189599, 1301841, 1435521]
57014A435521J47637J42028J07066M5037k8302r3338j37732j59384j62151j51545
57004A144837j33378j12982r3788p7000o2818n1249m1851l3857k6998k1575j7562
56993D71779j4280j1284q823p195o149n271m423l575k608j451j14J389K633K458
56979D13086j90m869r816j3641j6200j7628j7497j5628j2968j0863r683q632o761
56966B68710l775k09K912M844N919P228R320J1620J3434J4815J5902J5933J3761
56953C80414R178L161l093q794j3413j6481j7762j7332j5552j3040j0456p972
56941B68858n217k061Q27K669L689N009P421J0639J3827J6511J8782K0668K1408
56928C83030J9560J4132N741l642j2095j8639k2899k4682k4288k2629k0464j7897
$$ y = [1435521, 1583158, 1725186, 1832252, 1877289, 1848987, 1755649, 1617917, 1458533, 1296382, 1144837, 1011459, 898477, 804689, 727689, 664871, 613622, 571771, 537914, 510916, 489341, 471779, 457499, 446215, 437392, 430197, 424048, 418777, 414354, 410779, 408171, 406720, 406606, 407995, 410628, 413086, 412896, 408027, 398211, 384570, 368370, 350742, 333245, 317617, 304649, 293786, 284103, 275471, 268710, 264935, 264726, 267638, 272482, 278401, 285629, 294949, 306569, 320003, 334818, 350720, 366653, 380414, 389592, 392753, 389660, 380866, 367453, 350972, 333210, 315878, 300326, 287286, 276830, 268858, 263641, 261580, 262407, 265076, 268765, 273774, 281195, 291834, 305661, 322172, 340954, 361622, 383030, 402590, 416722, 422463, 418821, 406726, 388087, 365188, 340506, 316218, 293589, 273125, 255228]
56916B55228j5055j2690j1384j0550r004o521m119k824k704l046l049k270r39
56903A71073J52M77M05P33J695K820L639M069M269M570N416O921Q598J0024J1543
56888B36404J3745J6405J8630J9837J9920J8553J5272J0341M759p53n942j0128
56876C57043j2113j1535r520p403n344k788L29L588O896J0554J4629J8863K3139
56863C86338K7591L2301L7211M2093M6172M7835M5199L7209K4300Q289q101k2069
56851G04368l1768l6750l7460l4560k9024k2311j5649r137k187N153J2014J8083
56839E20772K4399L2108M0922M9604N7707O5779P3408P7820P5153O3087M2107
56828A122866J4916j4427m1160o1147p2598p6328p4154o7552n8024m7664l8099
$$ y = [255228, 240173, 227483, 216099, 205549, 196545, 190024, 185905, 183081, 180377, 177331, 174282, 172012, 171073, 171225, 171702, 172107, 172840, 174535, 177355, 180994, 185063, 189332, 193902, 199318, 206239, 214837, 224861, 236404, 250149, 266554, 285184, 305021, 324941, 343494, 358766, 369107, 373866, 373113, 367171, 357043, 344930, 333395, 323875, 316472, 311128, 308340, 308669, 312257, 319153, 329707, 344336, 363199, 386338, 413929, 446230, 483441, 525534, 571706, 619541, 664740, 701949, 726249, 734538, 726437, 704368, 672600, 635850, 598390, 563830, 534806, 512495, 496846, 487709, 485522, 490675, 502689, 520772, 545171, 577279, 618201, 667805, 725512, 791291, 864699, 942519, 1017672, 1080759, 1122866, 1137782, 1123355, 1082195, 1021048, 948450, 872122, 797968, 730416, 672392, 624728, 586629]
56817E86629k9169j9760r905j039O042J2413J9622K7847L6125M3727N0233N4360
56805G77125N3697M6151L1524J1712j0159l0658m6816n6912o0941o0219n6352
56794E98152n0507m3462l5961k8631k1719j5169r028l426J770O875J1822J6148
56782D26864J9790K3311K6700K8330K5867J8327O842o357j9120k9616l6499l9474
56770D44965l9367l7307l3955k9682k5044k0727j7209j4664j3032j1990j1069
56759A90919j0002q822p576o215m834l786l323l364l639l891l834l226k166j133
56745A25108n64n28p55q50n15J12L89j58j124j599j328r50r83j182j134r57r40
56728A12042r68p57m10k41k80k57Q2Q05J644J930J147j26n38L94J509J533P80
$$ y = [586629, 557460, 537700, 527795, 526756, 532798, 545211, 564833, 592680, 628805, 672532, 722765, 777125, 830822, 876973, 908497, 920209, 910050, 879392, 832576, 775664, 714723, 654504, 598152, 547645, 504183, 468222, 439591, 417872, 402703, 393675, 390249, 392019, 398894, 410716, 426864, 446654, 469965, 496665, 524995, 550862, 569189, 576031, 569674, 550554, 520938, 484439, 444965, 405598, 368291, 334336, 304654, 279610, 258883, 241674, 227010, 213978, 201988, 190919, 180917, 172095, 164519, 158304, 153470, 149684, 146361, 142997, 139358, 135467, 131633, 128407, 126241, 125108, 124544, 124016, 123261, 122411, 121896, 122008, 122397, 122239, 121115, 119516, 118188, 117238, 116255, 115073, 113939, 112982, 112042, 111074, 110317, 109907, 109666, 109386, 109129, 109211, 110016, 111660, 113590, 114737, 114611, 114073, 114467, 115976, 117509, 118289]
56711A18289M64Q01Q51J79m89n09k20j63j61K01P15Q03M13Q2J96N39N73o4j248
56692A21252k368k762k356j733j474j509j333o70K59J006J186O33m72j565k041
56677A06053j668o80M98J429J722J201J44q50j316j206p30j01M73P95Q64R25J128
56660A08681J254J007N27L08N77J073J491J884K409K980L377L545L501L142K380
56645A38136J388M53k76o56l82O57J878K357J763O42k71p36q77q08o19m80m77
56628A41692m41j55L65R00J242J294J070P19M50L44L44L88M08K09l41r40r69k53
56610A46326N59P26L00l4P4K88K08L1J93P12J205J480J664J712J263L04m16j79
56592A56416P01J181Q18J70j62k44k59P2R92K029K397J861Q04k36p53l63P71J915
$$ y = [118289, 118753, 119554, 120405, 120584, 120095, 119586, 119366, 119203, 119042, 119243, 119958, 120761, 121174, 121256, 121452, 121991, 122564, 122500, 121252, 118884, 116122, 113766, 112033, 110559, 109050, 107717, 107047, 107306, 108312, 109498, 110131, 109659, 108094, 106053, 104385, 103705, 104203, 105632, 107354, 108555, 108699, 107849, 106533, 105327, 104597, 104496, 104969, 105764, 106628, 107553, 108681, 109935, 110942, 111469, 111777, 112354, 113427, 114918, 116802, 119211, 122191, 125568, 129113, 132614, 135756, 138136, 139524, 139977, 139701, 139045, 138663, 139320, 141198, 143555, 145318, 145960, 145689, 144953, 144076, 143268, 142649, 142169, 141692, 141251, 141096, 141461, 142361, 143603, 144897, 145967, 146686, 147136, 147480, 147824, 148212, 148620, 148829, 148488, 147548, 146579, 146326, 146885, 147611, 147911, 147877, 147951, 148239, 148447, 148478, 148671, 149383, 150588, 152068, 153732, 155444, 156707, 157011, 156595, 156416, 157117, 158298, 159116, 159286, 159124, 158880, 158621, 158693, 159685, 161714, 164111, 165972, 166776, 166540, 165787, 165424, 166195, 168110]
56574A68110K673L465M543N064M119K244R47Q67J478K388L674M845M892L886L362
56559B16557M450O477Q039Q509P897O202L884K230K194L208L954L887L334K561
56545B83383J704J236J549K107J893O19j049k425l282l630l659l837m475n213
56531B64921n529n525n578n505m878m068l963m486m462l331k135k118l019l517
56517B06807l040k351k331k916l428l532l409l145k451j152K68J067J092R28J112
56502A83519J547J810J671J125K52o47j076q67m47l01l85l86k71j98j23P4L09
56485A85606M45O06Q45Q34L84%K61P88N46o64j790j871j150m81n9O17J683K457
56467A89057K207J104J12o7L12M99K69R6L74Q57J104J198J559K211K580K074P34
$$ y = [168110, 170783, 174248, 178791, 183855, 187974, 190218, 191165, 192032, 193510, 195898, 199572, 204417, 209309, 213195, 216557, 221007, 227484, 235523, 244032, 251929, 258131, 262015, 264245, 266439, 269647, 273601, 277488, 280822, 283383, 285087, 286323, 287872, 289979, 291872, 292491, 291442, 289017, 285735, 282105, 278446, 274609, 270134, 264921, 259392, 253867, 248289, 242784, 237906, 233838, 229875, 225389, 220927, 217596, 215461, 213343, 210324, 206807, 203767, 201416, 199085, 196169, 192741, 189209, 185800, 182655, 180204, 179052, 179320, 180387, 181479, 182407, 183519, 185066, 186876, 188547, 189672, 189924, 189277, 188201, 187334, 186887, 186586, 186201, 185815, 185544, 185346, 185223, 185297, 185606, 186051, 186657, 187502, 188336, 188720, 188720, 188981, 189769, 190315, 189651, 187861, 185990, 184840, 184359, 184300, 184917, 186600, 189057, 191264, 192368, 192480, 192413, 192725, 193224, 193493, 193589, 193963, 194820, 195924, 197122, 198681, 200892, 203472, 205546, 206280]
56450B06280p34j433r57K31J095R24q4j074j299o40L59Q65M27o14j490j828j846
56433A98182j805j708j590j610j601j044J85J485K298K718K968K779J846N84k09
56418B03478k38K05Q54J606K268K600K631K532K306J965J677J475J068L62j23
56403B24666J01P29J044Q87O28M40K21J82P33J729K431K358J723Q83j03j196k029
56386B35427k228j892j532j540j818j953j772j545j565j637j386q86n04j03Q80
56371B15946K407L588L826L511L195K783K176J979K718L780L975K944J369O6n37
56356B53726l31L78Q95Q64P32R56J140N96n02j289j278p16j5N40Q16J069J801
56339B59382K874L268K374J015M14O70J079J455K103K820L051K829K577K256J606
$$ y = [206280, 205546, 204113, 203156, 203387, 204482, 205406, 205322, 204248, 202949, 202309, 202668, 203533, 203960, 203346, 201856, 200028, 198182, 196377, 194669, 193079, 191469, 189868, 188824, 189009, 190494, 192792, 195510, 198478, 201257, 203103, 203687, 203478, 203240, 203445, 204299, 205905, 208173, 210773, 213404, 215936, 218242, 220207, 221884, 223359, 224427, 224789, 224666, 224767, 225496, 226540, 227427, 228055, 228495, 228716, 228898, 229631, 231360, 233791, 236149, 237872, 238755, 238652, 237456, 235427, 233199, 231307, 229775, 228235, 226417, 224464, 222692, 221147, 219582, 217945, 216559, 215673, 215169, 215066, 215946, 218353, 221941, 225767, 229278, 232473, 235256, 237432, 239411, 242129, 245909, 249884, 252828, 254197, 254263, 253726, 253395, 253773, 254668, 255532, 256264, 257220, 258360, 258956, 258454, 257165, 255887, 255171, 255156, 255696, 256512, 257581, 259382, 262256, 265524, 267898, 268913, 269327, 269997, 271076, 272531, 274634, 277454, 280505, 283334, 285911, 288167, 289773]
56324B89773J037J166J696J747J180N72J13l70n09K09J211J308M70j43kJ49k07
56307B99400m75p0O43J064J198J356J692K236K858L117K880K849L568M143L247
56292C29706J315K58P70J500J275O56N69Q04Q45J032J792K558K543K064K079K843
56276C52609L765M310M418M287M239M553N153N636N849N979O066N896N524N288
56262D23572N243N155N134N595O463P049O895O175N296M774N319P180R413J0806
56248E14069J1482J2545J4240J5644J6379J7202J8543J9735K0266K0612K1139
56237G01856K1295K0564J9324J8019J6298J3633J0161O309K252j786n363q329
56225H14233j0937j3195j4837j6027j7263j8342j8476j7651j6841j6531j6139
$$ y = [289773, 290810, 291976, 293672, 295419, 296599, 297171, 297284, 296914, 296405, 296614, 297825, 299133, 299603, 299460, 299458, 299607, 299400, 298925, 298855, 299498, 300562, 301760, 303116, 304808, 307044, 309902, 313019, 315899, 318748, 322316, 326459, 329706, 331021, 331279, 332049, 333549, 334824, 335480, 336049, 336853, 337698, 338730, 340522, 343080, 345623, 347687, 349766, 352609, 356374, 360684, 365102, 369389, 373628, 378181, 383334, 388970, 394819, 400798, 406864, 412760, 418284, 423572, 428815, 433970, 439104, 444699, 451162, 458211, 465106, 471281, 476577, 481351, 486670, 493850, 503263, 514069, 525551, 538096, 552336, 567980, 584359, 601561, 620104, 639839, 660105, 680717, 701856, 723151, 743715, 763039, 781058, 797356, 810989, 821150, 827459, 829711, 827925, 822562, 814233, 803296, 790101, 775264, 759237, 741974, 723632, 705156, 687505, 670664, 654133, 637994]
56214F37994j5232j4276j3612j2825j1550j0034q444o640m971m202m207l911k964
56201E25126k301k497k782k352j509q73m93l03m75p40m52K98P70J141K442M450
56185E19450N271L907J807Q84J270K031K763L413L668L544L640L998L780K844
56171E62270K271K621K974K675K503L105L709L563L332L756M256M177M160M936
56157F10308N909O327O705P754Q916R409R717J0643J1761J2178J2083J2303J3039
56144G37052J4062J5360J6662J7293J7368J8069J9965K2341K4932K8797L4499
56133I66400M1006M7513N4794O3525P2977Q2475R2322J01835J08498J10590J08799
56122A850734J03725R4272Q0685O6818N6527M9494M3224L7287L2434K7096J8478
$$ y = [637994, 622762, 608486, 594874, 582049, 570499, 560465, 552021, 545381, 540410, 536208, 532001, 528090, 525126, 522825, 520328, 517546, 515194, 513685, 512812, 512319, 512016, 511541, 510801, 510349, 510647, 511417, 512558, 515000, 519450, 524721, 528628, 530435, 531319, 532589, 534620, 537383, 540796, 544464, 548008, 551648, 555646, 559426, 562270, 564541, 567162, 570136, 572811, 575314, 578419, 582128, 585691, 589023, 592779, 597035, 601212, 605372, 610308, 616217, 622544, 629249, 637003, 645919, 655328, 665045, 675688, 687449, 699627, 711710, 724013, 737052, 751114, 766474, 783136, 800429, 817797, 835866, 855831, 878172, 903104, 931901, 966400, 1007406, 1054919, 1109713, 1173238, 1246215, 1328690, 1421012, 1522847, 1631345, 1741935, 1850734, 1954459, 2048731, 2129416, 2196234, 2252761, 2302255, 2345479, 2382766, 2415200, 2442296, 2460774]
56111B460774O732m986j4377k1397k6382k9619l2753l8142m6533n7055o8874q0942
56099B046446r0803r5986r6380r3404q7517p8611o8073n7997m8766l9503l0533
56088A258873k3237j7817j3310r421o521m326k411j330j348r52J305M404O384
56075A190293P343Q677J0372J1450J2137J3214J4098J4035J4194J5932J8054J8584
56063A348383J8290J9404K1677K2882K2667K2836K4032K5079K5437K5510K4899
56052A601096K2952K0666J9589J9391J8999J9046K0445K1743K1131K0025K1230
56041A826313K4372K6770K8036L0048L2938L4906L5788L7125L8905L9777M0173
56030B195151M1732M4060M5556M6918N0108N4405N7299N8812O0982O3779O5550
$$ y = [2460774, 2467506, 2462520, 2448143, 2426746, 2400364, 2370745, 2337992, 2299850, 2253317, 2196262, 2127388, 2046446, 1955643, 1859657, 1763277, 1669873, 1582356, 1503745, 1435672, 1377675, 1328909, 1289406, 1258873, 1235636, 1217819, 1204509, 1195088, 1188567, 1184241, 1181830, 1180500, 1179152, 1178200, 1179505, 1183909, 1190293, 1197636, 1206313, 1216685, 1228135, 1240272, 1253486, 1267584, 1281619, 1295813, 1311745, 1329799, 1348383, 1366673, 1386077, 1407754, 1430636, 1453303, 1476139, 1500171, 1525250, 1550687, 1576197, 1601096, 1624048, 1644714, 1664303, 1683694, 1702693, 1721739, 1742184, 1763927, 1785058, 1805083, 1826313, 1850685, 1877455, 1905491, 1935539, 1968477, 2003383, 2039171, 2076296, 2115201, 2154978, 2195151, 2236883, 2280943, 2326499, 2373417, 2423525, 2477930, 2535229, 2594041, 2655023, 2718802, 2784352]
56019B784352O6954P0128P4452P7443P9338Q2398Q6312Q8952R1093R5412J01300
56008C698134J05694J08735J13395J19844J25462J30239J36715J44774J52003
55999D834995J58911J68208J79269J89201J98866K11538K26100K38410K49027
55990F654525K62437K78821K94127L08359L25960L47606L69741L92731M21165
55981I655472M55490M91733N30216N75715O28517O84516P44794Q15321Q96779
55972A5478553R85184J083119J199148J335650J489444J665297J875892K127965
55964B7240252K423052K773035L199564L717550M336590N079110N976893P048791
55956F1794837Q305077R775337J1505688J3527243J5858060J8532404K1576278
$$ y = [2784352, 2851306, 2921434, 2995886, 3073329, 3152667, 3235065, 3321377, 3410329, 3501422, 3596834, 3698134, 3803828, 3912563, 4025958, 4145802, 4271264, 4401503, 4538218, 4682992, 4834995, 4993906, 5162114, 5341383, 5530584, 5729450, 5940988, 6167088, 6405498, 6654525, 6916962, 7195783, 7489910, 7798269, 8124229, 8471835, 8841576, 9234307, 9655472, 10110962, 10602695, 11132911, 11708626, 12337143, 13021659, 13766453, 14581774, 15478553, 16463737, 17546856, 18746004, 20081654, 21571098, 23236395, 25112287, 27240252, 29663304, 32436339, 35635903, 39353453, 43690043, 48769153, 54746046, 61794837, 70099914, 79875251, 91380939, 104908182, 120766242, 139298646, 160874924]
55949A60874924K4932911K8431880L1769720L4342117L5009381L2248445K4958097
55942C72567475J3421370m71496j4035081k4981422l2133478l5421205l5502416
55935B43443747l3358536k9971794k6111358k2273260j8741155j5657379j3055255
55928H4275010j0893963r112124p656554o473207n503041m699866m036981l490689
55920C2408585l032641k642602k313347k037168j800072j593029j416105j266891
55912A6306730j136124j018623r17568q33740p60441o92991o33855n84431n40283
55903I188674m98344m60914m29064l99304l69871l43428l20669k98005k74170
55894E794905k52558k34532k16739j97560j79957j65518j51530j36386j22138
$$ y = [160874924, 185807835, 214239715, 246009435, 280351552, 315360933, 347609378, 372567475, 385988845, 385517349, 371482268, 346500846, 314367368, 278946163, 243443747, 210085211, 180113417, 154002059, 131728799, 112987644, 97330265, 84275010, 73381047, 64268923, 56612369, 50139162, 44636121, 39936255, 35899274, 32408585, 29375944, 26733342, 24419995, 22382827, 20582755, 18989726, 17573621, 16306730, 15170606, 14151983, 13234415, 12400675, 11640234, 10947243, 10313388, 9728957, 9188674, 8690330, 8229416, 7800352, 7401048, 7031177, 6687749, 6367080, 6069075, 5794905, 5542347, 5307815, 5091076, 4893516, 4713559, 4548041, 4396511, 4260125, 4137987]
55885D137987j09422r5506p9569o4367n0400l3951j3387P713K5998M1696N4091
55874C820883N8744N2253L5537J0180k3981o4873j05964j40848j67002j83467
55864C291462j88994j84722j74924j62718j48018j31231j15279j02123r0805q0514
55854A912134p2172o5484n8278n0499m5098m3138m1782l9076l6858l6750l7001
55843A385998l5755l4011l2849l0966k7587k4743k3989k3614k1742j9618j9193
55832A091931j9765j9546j8552j7613j6438j4782j3652j3470j2954j1508j0677
55821I22974j1524j2693j2870j2994j4114j5141j4734j3535j2627j1590r879q373
55809G72900p716o866m991l077k058j065P22K313K741K963M085N394N866O047
$$ y = [4137987, 4028565, 3933059, 3853490, 3789123, 3738723, 3704772, 3691385, 3699098, 3725096, 3766792, 3820883, 3879627, 3931880, 3967417, 3977597, 3953616, 3888743, 3782779, 3641931, 3474929, 3291462, 3102468, 2917746, 2742822, 2580104, 2432086, 2300855, 2185576, 2083453, 1992648, 1912134, 1839962, 1774478, 1716200, 1665701, 1620603, 1577465, 1535683, 1496607, 1459749, 1422999, 1385998, 1350243, 1316232, 1283383, 1252417, 1224830, 1200087, 1176098, 1152484, 1130742, 1111124, 1091931, 1072166, 1052620, 1034068, 1016455, 1000017, 985235, 971583, 958113, 945159, 933651, 922974, 911450, 898757, 885887, 872893, 858779, 843638, 828904, 815369, 802742, 791152, 781273, 772900, 765184, 758318, 753327, 750250, 748192, 747127, 747849, 750162, 752903, 755866, 759951, 765345, 771211, 777258]
55795G77258O601O605N131L162K016J157o56l190n433p325r176j0389j0429j0199
55781G45133j0992j2898j5317j8057k0785k2446k2416k1233j9382j6511j2773
55770E52323r437p174n086k554o02k44r24j701k597l597l902l373l295m388n540
55755D97909n821o133p468r024r637r666r870r749q693p543p310p401o731n581
55741C87282m799m141k986j804j317j071l22M37K40p67j760k497l056l172k999
55726C57268l450m724n570n180m556m705m867m085l200l423m084l729k543j749
55712C01403j307k47J226J956J859J980K593K909K628K309K154J593K28j771m045
55697C15468o067p151p195o981p031o840n995n121m696l909k040r1M29k79p58
$$ y = [777258, 783859, 790464, 795595, 798757, 800773, 801930, 801274, 798084, 792651, 785326, 776150, 765761, 755332, 745133, 734141, 721243, 705926, 687869, 667084, 644638, 622222, 600989, 581607, 565096, 552323, 542886, 535712, 530626, 528072, 527470, 527226, 526302, 524601, 522004, 518407, 514505, 511132, 507837, 503449, 497909, 492088, 485955, 478487, 469463, 459826, 450160, 440290, 430541, 421848, 414305, 406995, 399594, 392863, 387282, 382483, 378342, 375356, 373552, 372235, 371164, 370842, 371279, 371519, 370752, 368992, 366495, 363439, 360267, 357268, 353818, 349094, 343524, 338344, 333788, 329083, 324216, 320131, 316931, 313508, 309424, 305695, 303152, 301403, 300096, 299849, 301075, 303031, 304890, 306870, 309463, 312372, 315000, 317309, 319463, 321056, 321284, 319513, 315468, 309401, 302250, 295055, 288074, 281043, 274203, 268208, 263087, 258391, 254482, 252442, 252351, 252780, 252501, 251743]
55682B51743m01L07J136K249L182L198K461J727R82l36k019l125l338l225l187
55667B51354l114k946k825k680k329j814j208l91M71Q39O97Q36J661K517K903
55652B43971L448M735O070O447N983N356M583L452K453K047J669N53j012k329
55638B87426l522n034o506p339p700p973p802o898n998n780n530m258k489j511
55624B09086j402j295j025j055j092m04O77J069O04J31N6j3k91o39j213k169k991
55607A98034l092k784k644k426j759j210j342j379l89P05K22j510k366j510m14
55592A76136m14j049j364j440j784k223k206j531l99Q08J597J749J624J634J692
55577A72830J706K066K897L433L185L058M089N650O388O461P110Q236Q156O060
$$ y = [251743, 251342, 251649, 252785, 255034, 258216, 261414, 263875, 265602, 266584, 266248, 264229, 261104, 257766, 254541, 251354, 248240, 245294, 242469, 239789, 237460, 235646, 234438, 234047, 234518, 235357, 236054, 236890, 238551, 241068, 243971, 247419, 252154, 258224, 264671, 270654, 276010, 280593, 284045, 286498, 288545, 290214, 290767, 289755, 287426, 283904, 278870, 272364, 265025, 257325, 249352, 241550, 234652, 228654, 222874, 217344, 213086, 210597, 209086, 207684, 206389, 205364, 204309, 203217, 202813, 203490, 204559, 205163, 205294, 205350, 205337, 205046, 204407, 203194, 201025, 198034, 194942, 192158, 189514, 187088, 185329, 184119, 182777, 181398, 181009, 181714, 181936, 180426, 178060, 176550, 176136, 175722, 174673, 173309, 171869, 170085, 167862, 165656, 164125, 163726, 164534, 166131, 167880, 169504, 171138, 172830, 174536, 176602, 179499, 182932, 186117, 189175, 193264, 198914, 205302, 211763, 218873, 227109, 235265, 241325]
55563B41325L092O70r68k158l011l631m210m566m432m248m751n709o152n771n119
55548A90361m513l861l440l551l533k420o79J33m24j224j432j421j499j239n70
55533A60688k48n86q39m23K52O45Q14Q31M55j90m83k29J55N78J403K414K762K275
55515A70274J737J536J111J53p98j351j842k412k641k557k890l734m079l337k316
55500A46854j939j971j744j308j014p25k21J83J56m4m9N4O8J38L48M64M02M28
55482A40080O33Q35J126J700K032J232l63j156l42R48J238M93l58q36j008r07
55466A45347o92p53j007p15L25J133Q82J52L0N01O79J90n55j146j454j324q03
55449A40790m02n58q98o85J44Q68Q29M6q66j133m68M69O44j8m20K37J257J370
$$ y = [241325, 244417, 245087, 244119, 241961, 238950, 235319, 231109, 226543, 222111, 217863, 213112, 207403, 201251, 195480, 190361, 185848, 181987, 178547, 174996, 171463, 169043, 168364, 168497, 168073, 166849, 165417, 163996, 162497, 161258, 160688, 160440, 159854, 159015, 158592, 158844, 159489, 160303, 161134, 161589, 161399, 160916, 160687, 160842, 161420, 162823, 165237, 167999, 170274, 172011, 173547, 174658, 174811, 174013, 172662, 170820, 168408, 165767, 163210, 160320, 156586, 152507, 149170, 146854, 144915, 142944, 141200, 139892, 138878, 138153, 137932, 138115, 138271, 138227, 138178, 138232, 138300, 138438, 138786, 139250, 139652, 140080, 140713, 141548, 142674, 144374, 146406, 147638, 147275, 146119, 145777, 146725, 147963, 148456, 148098, 147262, 146254, 145347, 144655, 143902, 142895, 142180, 142505, 143638, 144520, 144672, 144702, 145203, 145882, 146072, 145517, 144371, 142917, 141593, 140790, 140388, 139830, 138932, 138247, 138391, 139259, 140088, 140134, 139268, 138135, 137667, 138136, 138780, 138762, 138342, 138579, 139836, 141206]
55431A41206L80p00j043p92m93k85J07Q23J557J875J790J763J957J862J066J25
55415A51198j5O79J315J309R11M90Q1k24k31j97o80j595k186k159k068k294k454
55398A41880k178j699j270p80l49m56j014j143m67J49j21p76p27J91J185J619
55382A34044J442Q45J12l64m05k23l5K24N84Q08P49N11J47l13m64Q8Q06N78o92
55363A38442j764j751j194r07p73m90n16j193j672r11O70J624J382P76P04J135
55347A33562J522J482J019M23Mk79p36j288j383p49J57Q20J199J227N02r11k018
55330A34553j939r57P6Q43J314J092k2j152j124L8J175J523J334J046O78J88k19
55313A38447l80l51k37j35k31n37p02m90l07p27j565j873j004O84K179K702K219
$$ y = [141206, 141586, 140886, 139843, 139051, 138558, 138273, 138380, 139203, 140760, 142635, 144425, 146188, 148145, 150007, 151073, 151198, 151183, 151862, 153177, 154486, 155397, 155887, 155968, 155744, 155513, 155316, 154636, 153041, 150855, 148696, 146628, 144334, 141880, 139702, 138003, 136733, 135953, 135604, 135148, 134134, 132991, 132524, 132673, 132552, 131776, 131049, 131240, 132425, 134044, 135486, 136331, 136443, 136079, 135674, 135451, 135416, 135640, 136224, 137032, 137781, 138292, 138439, 138126, 137662, 137750, 138556, 139134, 138442, 136678, 134927, 133733, 132826, 132053, 131563, 131047, 129854, 128182, 127271, 127941, 129565, 130947, 131723, 132427, 133562, 135084, 136566, 137585, 138008, 138012, 137733, 136997, 135709, 134326, 133577, 133734, 134554, 135753, 136980, 137482, 136571, 134553, 132614, 131657, 131733, 132576, 133890, 134982, 134960, 133808, 132684, 132722, 133897, 135420, 136754, 137800, 138478, 138666, 138447, 138067, 137716, 137479, 137344, 137113, 136576, 135874, 135384, 135077, 134350, 132785, 130912, 129908, 130592, 132771, 135473, 137692]
55296A37692J291M35l01r94j328r41k32j02o24p99l5Q05O00l38n44P58K730L782
55278A41855K995Q55j153j833j339p42n56l82l3r3q05j347r33ON44N64N59O29
55260A38791N85O27R87J224P26k08p05n58m10o85j098j216q98j87O55J057O36
55243A39323k43q11p79m33q0J22L2l27n60k84L44Q34Q89N08j26n80m35O7J66l45
55223A37282p31m69j2J64M00R69J172M05n52n39J45K32n01j046r05o66o76m31
55205A34241L26R84R94O20L58K27N5j20k83n62q76r00n12L9M91P41O99M63M76
55186A37461J008J554J348M41l82o49n65l38J67J007J888K425K324J458K04n84
55170A48767m96j59l44p67o07J45P93J171J708K337K444K009J747J882J766J030
$$ y = [137692, 138983, 139418, 139117, 138123, 136795, 135854, 135622, 135520, 134896, 134097, 134062, 134867, 135467, 135129, 134585, 135343, 138073, 141855, 144850, 145705, 144552, 142719, 141380, 140638, 140082, 139700, 139667, 139574, 138769, 137422, 136489, 136495, 137039, 137603, 138162, 138791, 139376, 140003, 140990, 142214, 142940, 142732, 142027, 141469, 141059, 140374, 139276, 138060, 137162, 136975, 137630, 138687, 139323, 139080, 138269, 137490, 137057, 136977, 137099, 137131, 136804, 136244, 135960, 136304, 137138, 138027, 138535, 138409, 137829, 137394, 137461, 137627, 137282, 136551, 136082, 136070, 136234, 136634, 137603, 138775, 139180, 138628, 138089, 138234, 138466, 137965, 136919, 136014, 135348, 134672, 134241, 134567, 135551, 136545, 137165, 137523, 137750, 137805, 137685, 137402, 136840, 135964, 135064, 134552, 134591, 135082, 135823, 136522, 136985, 137461, 138469, 140023, 141371, 141812, 141430, 140781, 140216, 139878, 140045, 141052, 142940, 145365, 147689, 149147, 149351, 148767, 148271, 148112, 147768, 147001, 146394, 146539, 147332, 148503, 150211, 152548, 154992, 157001, 158748, 160630, 162396, 163426]
55154A63426J50m12p86j112j148q96q38j182j494j450j248j017n40J21L87j8o34
55137A51309r86j111j083p48k85k70o79o33K57J039O29n83j251q98l62m87j043
55120A42815j230q11l83n70j084r96K1J083J190N58J72L01L12n0j82K42O21L78
55102A42387j76m08j78L54J127J842J867J081L35L95Q54P01k31j063r25K57J832
55085A50051K861K676J466K09l07k61l52q12j298j534j583j512j195n68J24N01
55069A48466M10J16L6K20K51j47n77m35K25P69R17J022J301J354P70k40j077j370
55051A52011j132o04j17J00J40K22L59M51N76P51O49J27k07K26Q40M95o82j315
55033A52890q29k91o04j097p69N9M02J77K7J47K87N28R82J134M96l51l99K71O36
$$ y = [163426, 163576, 163164, 162378, 161266, 160118, 159222, 158384, 157202, 155708, 154258, 153010, 151993, 151453, 151574, 151961, 151943, 151309, 150323, 149212, 148129, 147381, 147096, 146826, 146147, 145514, 145771, 146810, 147439, 146856, 145605, 144707, 144345, 143858, 142815, 141585, 140774, 140391, 139821, 138737, 137741, 137762, 138845, 140035, 140593, 140765, 141066, 141378, 141328, 141146, 141388, 142009, 142387, 142211, 141803, 141625, 141979, 143106, 144948, 146815, 147896, 148231, 148626, 149480, 150181, 149950, 148887, 147962, 148219, 150051, 152912, 155588, 157054, 157263, 156956, 156695, 156343, 155531, 154233, 152699, 151116, 149604, 148409, 147841, 147965, 148466, 148876, 148992, 149028, 149248, 149499, 149352, 148775, 148340, 148565, 149334, 150251, 151273, 152574, 153928, 154698, 154458, 153381, 152011, 150879, 150275, 150158, 150258, 150398, 150620, 150979, 151430, 152006, 152757, 153406, 153533, 153326, 153552, 154392, 154887, 154205, 152890, 152061, 151770, 151166, 150069, 149300, 149359, 149761, 149938, 149965, 150112, 150399, 150927, 151909, 153043, 153539, 153188, 152789, 153060, 153696]
55014A53696K68k87n99p58o45L8Q00O15m77j049k30R76J103K23l98j60L15L58
54996A53789R4n8l8k1MK67R21J805K467K480J862J054M02j37o33q40o35m69q13
54977A61501j246p76P20K088K284J573Q79M06k55r74r58P1J330J945J902J652
54961A72142J306P12j4n66q65r94q58l25M53J156J625J812J585R63L38R7J24K6
54943A78717l81j001j700k165j854o57O13R64L90k54m53l98j93M79J652K660K908
54926A79327K648K656L315M347N245N786O157O723P612Q590R381R899R977R138
54912B70801P122M370J591j010l565n862p456q350q891r024q369p111o064n634
54898B12548n339m650l715k958k443j969j458r40m18O3L94N06L53o0l69Q6J432
$$ y = [153696, 153964, 153677, 153078, 152320, 151675, 151713, 152513, 153128, 152651, 151602, 151372, 152348, 153451, 153674, 153276, 153116, 153431, 153789, 153883, 153825, 153787, 153766, 153770, 154037, 154958, 156763, 159230, 161710, 163572, 164626, 165028, 164891, 164258, 163418, 162783, 162314, 161501, 160255, 159479, 160199, 162287, 164571, 166144, 167023, 167429, 167174, 166200, 165242, 165313, 166643, 168588, 170490, 172142, 173448, 174160, 174146, 173580, 172715, 171721, 170863, 170538, 170991, 172147, 173772, 175584, 177169, 178132, 178470, 178567, 178691, 178717, 178336, 177335, 175635, 173470, 171616, 170959, 171572, 172536, 172926, 172672, 172219, 171821, 171628, 172107, 173759, 176419, 179327, 181975, 184631, 187946, 192293, 197538, 203324, 209481, 216204, 223816, 232406, 241787, 251686, 261663, 270801, 277923, 282293, 283884, 282874, 279309, 273447, 265991, 257641, 248750, 239726, 231357, 224246, 218182, 212548, 207209, 202559, 198844, 195886, 193443, 191474, 190016, 189076, 188658, 188721, 189115, 189621, 189974, 189914, 189545, 189631, 191063]
54881A91063K761L181L087L602M958O327P188P830Q453Q795Q800Q624P835N752
54867B78256K805L38j340l351o104q259q727q427q720r176q422o504m859m247
54853B03263m142m066m147m272l857k773j689j189j206j438j681j652j113l10
54839A69728K23L44L06J41l88j157j596j398q60m00j10J07L30O17R57J107Q14
54822A68765J88l18l65RN00P67O29K36l9jJ77K39J29l9n6L40J104J596J177J95
54802A75233k41K40P07K76o87j301j399j342j139n94j6J45J48O44J530J901J299
54785A75404L33j20Q8M12M03K17L40Q50J199J049J055K101L820M783M463M008
54769B00405M506N482N973O170O889Q006Q681Q745Q753Q808Q419P394N920L873
$$ y = [191063, 193824, 197005, 200092, 203694, 208652, 214979, 222167, 229997, 238450, 247245, 256045, 264669, 272504, 278256, 281061, 281399, 280059, 276708, 270604, 262345, 253618, 245191, 236471, 227295, 218873, 212369, 207510, 203263, 199121, 195055, 190908, 186636, 182779, 180006, 178317, 177128, 175922, 174484, 172803, 171151, 170038, 169728, 169951, 170295, 170601, 170742, 170354, 169197, 167601, 166203, 165343, 164943, 164833, 164940, 165270, 165887, 166844, 167951, 168765, 168953, 168635, 168270, 168279, 168779, 169546, 170175, 170411, 170372, 170371, 170548, 170787, 170916, 170877, 170821, 171161, 172265, 173861, 175038, 175233, 174992, 175232, 175939, 176215, 175528, 174227, 172828, 171486, 170347, 169753, 169737, 169882, 170030, 170674, 172204, 174105, 175404, 175737, 175617, 175705, 176117, 176520, 176737, 177077, 177927, 179126, 180175, 181230, 183331, 187151, 191934, 196397, 200405, 204911, 210393, 216366, 222536, 229425, 237431, 246112, 254857, 263610, 272418, 280837, 288231, 294151, 298024]
54755B98024J005k229m969p039q796j0047j0159r315q534q156p350n541l444k120
54741B11330j738j652j325p37j96n5l20n10k12L50P09R05J293J758J872J738J896
54724B15106K445L037L720M933O525P695Q089Q160Q160P597O014L612Q07k140
54710B83760m850o864q195r226r822r446q334p514p262o639n123l663l223l225
54696A90374k524j255n30o93j018j027j015j203j307j089p32l75M9M20M11M6k42
54679A78290k82m74j096j699j590p28K25O51N18K08O1J84M76P01O05J63l40o10
54661A75263o64o91o85n22l55n41r86j017k60P38J159R50P34Q66J099J146J065
54644A77299R69P96M70J22oK69Q54J268R30j38j137j308p39l7M25N83K75n96j610
$$ y = [298024, 299029, 296800, 291831, 284792, 275996, 265949, 255790, 246475, 237941, 229785, 222435, 216894, 213450, 211330, 209592, 207940, 206615, 205878, 205682, 205627, 205307, 204797, 204585, 204935, 205644, 206549, 207842, 209600, 211472, 213210, 215106, 217551, 220588, 224308, 229241, 235766, 243461, 251550, 259710, 267870, 275467, 281481, 285093, 285900, 283760, 278910, 272046, 263851, 254625, 244803, 235357, 227023, 219509, 212247, 205608, 200485, 196822, 193599, 190374, 187850, 186595, 186065, 185372, 184354, 183327, 182312, 181109, 179802, 178713, 177981, 177606, 177655, 178075, 178486, 178532, 178290, 178008, 177534, 176438, 174739, 173149, 172421, 172646, 173297, 173815, 174023, 174084, 174268, 174744, 175445, 176050, 176213, 175873, 175263, 174599, 173908, 173223, 172701, 172346, 171805, 170819, 169802, 169542, 170280, 171439, 172389, 173123, 173989, 175088, 176234, 177299, 178268, 179064, 179534, 179656, 179650, 179919, 180773, 182041, 182971, 182833, 181696, 180388, 179649, 179612, 180037, 180620, 180895, 180299, 178689]
54625A78689k102j818r81J35J210J721J367N08k83q83j369j468r75l92l28n30
54609A72501l75n9k11n28l4J211J924J448O00K79L51M41O99J106J011K15l63L8
54591A80254Q06R38N87N81Q75O34k94j002q07r7L24K51J20K66M62K26m53r37p53
54572A81981k89k11l22J89J374K204J966J136M51m9n34p00l50m8l74r45r42l28
54554A84209K39M11L87K70l1l55l04K03Q45J274J333J033O58O34R04P85o4q95
54536A91536o94M37J369J372P58J49k55m36j85O04J470J628Q18k58n71P3P20M39
54518A98974m39p38j9R35J287J097P75L24l62r70j182j197j318j292p30J68P55
54501A96068P12K60k06l53o2L13J75m91r20n98k3J47J67P20J643K003J401M45
$$ y = [178689, 176587, 174769, 173788, 173923, 175133, 176854, 178221, 178729, 178446, 177563, 176194, 174726, 173751, 173359, 173031, 172501, 172126, 172067, 171856, 171328, 171294, 172505, 174429, 175877, 176477, 176756, 177107, 177548, 178247, 179353, 180364, 180579, 180216, 180254, 181060, 181998, 182585, 183166, 184041, 184675, 184381, 183379, 182572, 182475, 182799, 183050, 183170, 183436, 183898, 184124, 183671, 182734, 181981, 181692, 181481, 181159, 181348, 182722, 184926, 186892, 188028, 188479, 188430, 187896, 187196, 186846, 186798, 186424, 185479, 184537, 184209, 184448, 184859, 185246, 185516, 185485, 185130, 184826, 185029, 185874, 187148, 188481, 189514, 190172, 190806, 191710, 192495, 192431, 191536, 190842, 191279, 192648, 194020, 194778, 194927, 194672, 194236, 194051, 194655, 196125, 197753, 198571, 198313, 197742, 197815, 198535, 198974, 198535, 197797, 197778, 198713, 200000, 201097, 201872, 202196, 201834, 200864, 199682, 198485, 197167, 195875, 195145, 195313, 196068, 196780, 197040, 196834, 196481, 196419, 196732, 196907, 196416, 195496, 194898, 194875, 195022, 195189, 195909, 197552, 199555, 200956, 201401]
54483B01401q2k4K73M40L89M11Q50J508J695J177O56Q24J376J574J429J518J943
54466B17358K214K074J705J170L46n74j171j359j306r26q3P52Q96M53K05L40J26
54449B22220q72k037k454j950r87q0L70R0p73j622j950j699j029q2Q27J197Q29
54432B09998R6m72o84o43m44j51J06K43L13M31O30Q71J063J161J274J578J984
54415B17354K055J492N19m14j094j460j364q56m45n26p27l92L56O88K43l93o20
54398B14416n61o56r12r96p31k43K66O28P72Q07R47J267J600J697J351M95n85
54381B19562j231j006k55K49K27O2M7m4m16p02l26O48J412J201J37q52j035p02
54363B16976o72j118j322p88k9K06k2j29M2K45M88Q80R73J61j238k110j896j151
$$ y = [201401, 201319, 201295, 201568, 202008, 202397, 202808, 203658, 205166, 206861, 208038, 208694, 209518, 210894, 212468, 213897, 215415, 217358, 219572, 221646, 223351, 224521, 224867, 224293, 223122, 221763, 220457, 219531, 219448, 220200, 221096, 221549, 221754, 222094, 222220, 221348, 219311, 216857, 214907, 213920, 213840, 214210, 214300, 213527, 211905, 209955, 208256, 207227, 207145, 207972, 209169, 209998, 210094, 209622, 208938, 208295, 207851, 207700, 207806, 208049, 208362, 208793, 209423, 210294, 211357, 212518, 213792, 215370, 217354, 219409, 220901, 221420, 221006, 219912, 218452, 217088, 216232, 215787, 215261, 214534, 214142, 214498, 215186, 215429, 215036, 214416, 213855, 213199, 212287, 211291, 210560, 210317, 210583, 211211, 211983, 212790, 213737, 215004, 216604, 218301, 219652, 220147, 219562, 218331, 217325, 217070, 217319, 217546, 217608, 217655, 217611, 217195, 216493, 216167, 216815, 218227, 219428, 219565, 218713, 217678, 216976, 216304, 215186, 213864, 213076, 213047, 213253, 213231, 213102, 213144, 213389, 213877, 214757, 215730, 215891, 214653, 212543, 210647, 209496]
54345B09496n36r1K80K91k07p93r67p71n67n25o50q72q87l80K94K29q06j781j693
54326A99064q92m45n58m66K08R40J243J311J402J230N21k88m85l2M21M18J19j37
54308B03574k24j7O55J596K098J704Q13J53j18k79k91R9N33K13q66j635j335n36
54290B06137k74o80j131j228j016n12K08P38P75P17J113J743J862J239L12n76
54274B09427j313j577j080l01j29n47n56L52J317J219J17r02j017m50j27p58k052
54257B01623k822k175o18M56L79k13m51k69r1QK83Q03J271J330Q70J22n09q22
54239A99175r45r68o96n0N56P83R32J351J601J037M5l06J22L50j01n07k72J12
54221B02219J00J42Q57J842K218J914J566J458J345J145J053J047Q15J77p56j799
$$ y = [209496, 208960, 208869, 209149, 209440, 209233, 208440, 207473, 206702, 206135, 205610, 204960, 204088, 203201, 202821, 203115, 203344, 202538, 200757, 199064, 198172, 197727, 197169, 196703, 196911, 197851, 199094, 200405, 201807, 203037, 203558, 203270, 202785, 202753, 203174, 203592, 203711, 203574, 203350, 203333, 203988, 205584, 207682, 209386, 210199, 210352, 210234, 209955, 209664, 209763, 210296, 210509, 209643, 208008, 206673, 206137, 205863, 205183, 204052, 202824, 201808, 201296, 201504, 202242, 203017, 203734, 204847, 206590, 208452, 209691, 210003, 209427, 208114, 206537, 205457, 205156, 205027, 204480, 203924, 204276, 205593, 206812, 206929, 206027, 205010, 204560, 204433, 203675, 201623, 198801, 196626, 196008, 196464, 196843, 196630, 196179, 195910, 195819, 195827, 196110, 196913, 198184, 199514, 200384, 200506, 199997, 199175, 198230, 197262, 196566, 196516, 197072, 197855, 198787, 200138, 201739, 202776, 202821, 202515, 202637, 202987, 202886, 202379, 202107, 202219, 202319, 202461, 203318, 205160, 207378, 209292, 210858, 212316, 213661, 214806, 215859, 216906, 217721, 217898, 217142, 215343]
54205B15343k688l035k641j798j071q59j174j619j509n44N65O92k32j048r12l11
54189A97159p0j31j4K06K21K83P30J121P44k23r60j192j298j400j268r93r15q25
54171A91175k15O23P75J07m60m22l67p73j062n86J94M08P3j72k39n55j014r26
54153A86564r2Q46J364J633J836J555M57q64j337o89K68O64M43R3r5j85k21p1
54135A92169L40P90R01N45L6j35J71N55N67K49j6j09j93j90K68J156J841J917
54117B00862J772J868J896J346N45L32P98J151Q78L18k9q9P8M82Q31N82k84j094
54099B12243j404j557j892k053j589q12m11n16o90o29l96p6L00N63N65M64N08
54082B02618O39N60J85k72n90o98n77k31K69P97J241J497J539J481J434J298R41
$$ y = [215343, 212655, 209620, 206979, 205181, 204110, 203251, 202077, 200458, 198949, 198405, 198970, 199662, 199430, 198382, 197470, 197159, 197089, 196958, 196944, 197150, 197371, 197654, 198384, 199505, 200249, 200026, 199066, 197874, 196576, 195176, 193908, 192915, 192000, 191175, 190960, 191583, 192358, 192465, 192005, 191583, 191216, 190443, 189381, 188795, 188989, 189397, 189470, 189298, 189059, 188504, 187490, 186564, 186472, 187318, 188682, 190315, 192151, 193706, 194163, 193299, 191962, 191273, 191541, 192205, 192648, 192741, 192646, 192461, 192240, 192169, 192509, 193299, 194200, 194745, 194781, 194646, 194817, 195372, 195939, 196188, 196172, 196063, 195870, 195680, 195948, 197104, 198945, 200862, 202634, 204502, 206398, 207744, 208289, 208621, 209419, 210570, 211448, 211766, 211737, 211648, 211726, 212208, 213039, 213621, 213337, 212243, 210839, 209282, 207390, 205337, 203748, 202936, 202525, 202009, 201319, 200690, 200294, 200218, 200518, 201081, 201646, 202110, 202618, 203257, 203817, 204002, 203730, 203140, 202442, 201865, 201634, 201903, 202700, 203941, 205438, 206977, 208458, 209892, 211190, 212131]
54065B12131M96J78q2m48o84l65L84Q94P89K56m80j308j781j379m34M3k21l57
54047B07632J65O19K51m73p02m90l17nQ45J847K371K657L275L846L541K613K139
54030B29814K323K344K021K219L225L960L527K518K005J986J689R24L22L57P97
54015B60031J109J013O29K31j18o22j339j878j847j487j327j362j179q95j185
54000B49774k129k826k594j925j704j973k118j927j787j852j749j161l42J62P8
53985B25927m65j137j599j524p19N88J626J586M08j041j808j777j517j406j235
53970B15907o29M20J492K022J686P93J69L46R30J079N91R8K21Q65J469J618J291
53953B30368P97N24O24Q82J089J379J919K359K069R63k33o87k04P45J444J459
$$ y = [212131, 212627, 212805, 212723, 212275, 211591, 211226, 211610, 212504, 213293, 213549, 213069, 211761, 209980, 208601, 208167, 208210, 207989, 207632, 207797, 208416, 208667, 208194, 207492, 207002, 206685, 206680, 207525, 209372, 211743, 214400, 217675, 221521, 225062, 227675, 229814, 232137, 234481, 236502, 238721, 241946, 245906, 249433, 251951, 253956, 255942, 257631, 258555, 258877, 259234, 260031, 261140, 262153, 262782, 263013, 262895, 262273, 260934, 259056, 257209, 255722, 254395, 253033, 251854, 250959, 249774, 247645, 244819, 242225, 240300, 238596, 236623, 234505, 232578, 230791, 228939, 227190, 226029, 225687, 225849, 225927, 225462, 224325, 222726, 221202, 220483, 221071, 222697, 224283, 224691, 223650, 221842, 220065, 218548, 217142, 215907, 215278, 215698, 217190, 219212, 220898, 221691, 221860, 222206, 223136, 224215, 224806, 224904, 225125, 225990, 227459, 229077, 230368, 231165, 231689, 232313, 233195, 234284, 235663, 237582, 239941, 242010, 242973, 242740, 242053, 241849, 242594, 244038, 245497]
53937B45497J052J002J729K625K709J896J174J432K554L770M431M300L489K414
53923B80074J536R28L30l05n47j5J132K306L007L121K900K648K363J765Q67L20
53907C02430P81K094L436M171M178L482K196P81j66n38o91q15p94o98q55j298
53891C17694j716j996k313k588k498k170k181k722l326l688m051m431m276l381
53877B76357k474k280k446k175j509j229j643k150k029j229l08Q4k99j094j675
53862B53901j749j524j202p29j66R0k01p47j140j345j494j474j082m11K29O17
53846B41573O40L08j31l64m14n57o91l76L21O51K27l68m77k64j80r1L47Q68R44
53827B41966N94K03j91o78q76l59M64P30L18q4KL90Q02J161J327J189J045J217
$$ y = [245497, 246549, 247551, 249280, 251905, 254614, 256510, 257684, 259116, 261670, 265440, 269871, 274171, 277660, 280074, 281610, 282538, 282868, 282563, 282016, 282001, 283133, 285439, 288446, 291567, 294467, 297115, 299478, 301243, 302110, 302430, 303211, 305305, 308741, 312912, 317090, 320572, 322768, 323549, 323383, 322845, 322154, 321339, 320545, 319847, 318992, 317694, 315978, 313982, 311669, 309081, 306583, 304413, 302232, 299510, 296184, 292496, 288445, 284014, 279738, 276357, 273883, 271603, 269157, 266982, 265473, 264244, 262601, 260451, 258422, 257193, 256885, 256969, 256670, 255576, 253901, 252152, 250628, 249426, 248697, 248531, 248621, 248420, 247673, 246533, 245188, 243694, 242220, 241138, 240727, 240956, 241573, 242213, 242521, 242390, 242026, 241612, 241055, 240364, 239988, 240309, 240960, 241187, 240819, 240342, 240078, 239898, 239807, 240154, 241022, 241966, 242560, 242763, 242572, 241894, 241018, 240659, 241123, 241853, 242171, 242087, 242089, 242479, 243281, 244442, 245769, 246958, 248003, 249220]
53809B49220J391J032M66O39J687K603K579K005J816K460L771N191N899N465M637
53794B90861M786O218P787Q548Q966R843J0942J1532J1804J2734J4830J7753K0872
53781D37476K3418K4334K2887J9441J4803Q914J117q163j6825k2685k5189k5251
53769D54277k4037k2257k0211j7961j5557j3340j1792j0901r963q363o326m618
53757B88951l610k972k305j696j621k266l159l503k989k109j485j065l53O78J393
53742B61889J344Q30L51J4k07j30K22K97l23j180j502j279j059q32lJ431K487
53725B62350K397J554Q28N01L99N51J048J526J459R27N26M96M32k0o03p44j84
53708B73443P91J644J999J889J625J493J621K069K804L485L626L200K775K732
$$ y = [249220, 250611, 251643, 252109, 252748, 254435, 257038, 259617, 261622, 263438, 265898, 269669, 274860, 280759, 286224, 290861, 295647, 301865, 309652, 318200, 327166, 337009, 347951, 359483, 371287, 384021, 398851, 416604, 437476, 460894, 485228, 508115, 527556, 542359, 551273, 552390, 544227, 527402, 504717, 479528, 454277, 430240, 407983, 387772, 369811, 354254, 340914, 329122, 318221, 308258, 299895, 293569, 288951, 285341, 282369, 280064, 278368, 276747, 274481, 271322, 267819, 264830, 262721, 261236, 260171, 259818, 260496, 261889, 263233, 264063, 264414, 264428, 264221, 264091, 264313, 264610, 264287, 263107, 261605, 260326, 259267, 258435, 258432, 259863, 262350, 264747, 266301, 267129, 267630, 268029, 268580, 269628, 271154, 272613, 273540, 274066, 274562, 274994, 274974, 274371, 273627, 273443, 274234, 275878, 277877, 279766, 281391, 282884, 284505, 286574, 289378, 292863, 296489, 299689, 302464, 305196]
53694C05196K709K114J062K68K08P01J294J585J305N55q5j00K91M45K37J40L38
53677C18263L83o2o71j014j186j470j700j422n58M11Q64M59o42j738j982j135
53661C06800J52R50Q81K09n89j062r17l30p4p71j968k415j469P5Q59M48l87p62
53643B99630o16m14l48j90K46Q28J361J771K013K011J839J692J558J192N94K34
53627C13401M99J178J809K258K604K637K106J356J175J807K617K921K815K848
53613C42031L183L472L436L270L303L485L416K885K205J833J775J690J519J640
53599C79143K146K507K212J481R44Q59J062J383J667J625J176P54Q09J166J326
53584D00260J264J316J504J609J782K338L097L611M127N419P591R777J1321J2482
$$ y = [305196, 307905, 310019, 311081, 311349, 311557, 312258, 313552, 315137, 316442, 316997, 316912, 316812, 317103, 317548, 317785, 317925, 318263, 318646, 318584, 317913, 316899, 315713, 314243, 312543, 311121, 310563, 310974, 311838, 312297, 311655, 309917, 307935, 306800, 306952, 307902, 308783, 308992, 308403, 307341, 306424, 306094, 306020, 305249, 303281, 300866, 299397, 299472, 300331, 300779, 300392, 299630, 299014, 298600, 298252, 298062, 298308, 299136, 300497, 302268, 304281, 306292, 308131, 309823, 311381, 312573, 313167, 313401, 313900, 315078, 316887, 319145, 321749, 324386, 326492, 327848, 329023, 330830, 333447, 336368, 339183, 342031, 345214, 348686, 352122, 355392, 358695, 362180, 365596, 368481, 370686, 372519, 374294, 375984, 377503, 379143, 381289, 383796, 386008, 387489, 388433, 389292, 390354, 391737, 393404, 395029, 396205, 396959, 397768, 398934, 400260, 401524, 402840, 404344, 405953, 407735, 410073, 413170, 416781, 420908, 426327, 433918, 443695, 455016, 467498]
53570D67498J3695J4696J4738J3183R694M476j479o887j1160j4407j6431j6576
53558D71040j4862j2437j0446r030p887o968o158m982l281j736j037r94r54o74
53544C89594k50L06Q77J127J112J553K865M345N052N053N114N502N843N985O207
53529D40285O741P556Q575R582J0206J0344J0436J0886J1591J2398J3444J4601
53517E66645J5151J4833J4645J5712J7725J9473K0570K1635K2909K3881K4315
53506G77494K4591K4816K4519K3619K2786K2415K1949K0762J9216J8313J8576
53495A019056J9680K0948K1834K2065K1628K0750J9825J9236J8993J8657J7853
53484A240525J6885J6396J6278J5620J4022J2328J1451J1108J0380R056P644O428
$$ y = [467498, 481193, 495889, 510627, 523810, 533504, 537980, 536501, 529614, 518454, 504047, 487616, 471040, 456178, 443741, 433295, 424265, 416378, 409410, 403252, 398270, 394989, 393253, 392216, 391222, 390268, 389594, 389344, 389650, 390527, 391654, 392766, 394319, 397184, 401529, 406581, 411634, 416748, 422250, 428093, 434078, 440285, 447026, 454582, 463157, 472739, 482945, 493289, 503725, 514611, 526202, 538600, 552044, 566645, 581796, 596629, 611274, 626986, 644711, 664184, 684754, 706389, 729298, 753179, 777494, 802085, 826901, 851420, 875039, 897825, 920240, 942189, 962951, 982167, 1000480, 1019056, 1038736, 1059684, 1081518, 1103583, 1125211, 1145961, 1165786, 1185022, 1204015, 1222672, 1240525, 1257410, 1273806, 1290084, 1305704, 1319726, 1332054, 1343505, 1354613, 1364993, 1374049, 1381693, 1388121]
53472A388121N312M202K791L51l245o718q639r343j0385j2295j4081j5080j5910
53459A305081j7200j8600j9597k0433k1493k2544k3161k3393k3472k3349k2895
53448A068944k2192k1367k0591k0230k0387k0230j8713j6177j4307j3985j4134
53437H66631j3199j1028q551o409m654l303k228q68J222L661N693P137Q363R615
53423H52082J0941J2566J4714J7050J8842J9780K0270K0989K2286K3985K5562
53412A059067K6665K7583K9011L1192L3534L5302L6455L7582L9230M1414M3638
53401A440673M5324M6415M7544M9278N1321N3006N4326N5761N7060N7258N6224
53390B014190N5184N5104N5402N5039N4081N3162N2052M9931M6783M3391L9993
$$ y = [1388121, 1393433, 1397635, 1400426, 1400777, 1397532, 1390814, 1382175, 1372832, 1362447, 1350152, 1336071, 1320991, 1305081, 1287881, 1269281, 1249684, 1229251, 1207758, 1185214, 1162053, 1138660, 1115188, 1091839, 1068944, 1046752, 1025385, 1004794, 984564, 964177, 943947, 925234, 909057, 894750, 880765, 866631, 853432, 842404, 833853, 827444, 822790, 819487, 817259, 816391, 817613, 821274, 826967, 834104, 842467, 852082, 863023, 875589, 890303, 907353, 926195, 945975, 966245, 987234, 1009520, 1033505, 1059067, 1085732, 1113315, 1142326, 1173518, 1207052, 1242354, 1278809, 1316391, 1355621, 1397035, 1440673, 1485997, 1532412, 1579956, 1629234, 1680555, 1733561, 1787887, 1843648, 1900708, 1957966, 2014190, 2069374, 2124478, 2179880, 2234919, 2289000, 2342162, 2394214, 2444145, 2490928, 2534319, 2574312]
53379B574312L6104L1754K7822K4708K1568J7475J2729Q345M623Q81l526q564
53367B748231j3960j9756k6109l2738l8982m4476m9493n4404n9010o2642o4876
53356B281785o5840o5862o5158o3928o2461o0909n9214n7350n5513n3900n2542
53345A619108n1406n0477m9618m8536m7076m5405m3834m2529m1337l9788l7396
53334A121706l4227l1050k8560k6514k4044k0825j7473j4758j2824j1272r563
53323H90596p356m793k495q64N25K340M435O023O821P238P423P080O424O297O912
53308I36606P418P249P079P812R403J1325J3482J5888J8119J9847K1389K2923
53296A098540K3862K3899K4050K5568K8088K9982L0338K9603K8420K6910K5192
$$ y = [2574312, 2610416, 2642170, 2669992, 2694700, 2716268, 2733743, 2746472, 2754817, 2759440, 2760321, 2756795, 2748231, 2734271, 2714515, 2688406, 2655668, 2616686, 2572210, 2522717, 2468313, 2409303, 2346661, 2281785, 2215945, 2150083, 2084925, 2020997, 1958536, 1897627, 1838413, 1781063, 1725550, 1671650, 1619108, 1567702, 1517225, 1467607, 1419071, 1371995, 1326590, 1282756, 1240227, 1198890, 1159102, 1121706, 1087479, 1056429, 1027869, 1001355, 977311, 956486, 939013, 924255, 911431, 900159, 890596, 883240, 878447, 875952, 875088, 875613, 877953, 882388, 888411, 895232, 902470, 909893, 916973, 923397, 929694, 936606, 944024, 951273, 958352, 966164, 975567, 986892, 1000374, 1016262, 1034381, 1054228, 1075617, 1098540, 1122402, 1146301, 1170351, 1195919, 1224007, 1253989, 1284327, 1313930, 1342350, 1369260, 1394452]
53285A394452K3634K2306K0826J8983J6921J4696J2157R344O488L614P00j866
53273A542255l597m693n905p608r547j1484j3454j5370j7052j8723k0920k3671
53261A390231k6301k8225k9512l0584l1770l3232l4840l6069l6438l6121l5693
53250A031446l5269l4443l3068l1560l0269k9147k8104k7218k6385k5316k4110
53239G06557k3373k3430k3833k3826k3058k1623j9771j7832j6152j4890j3933
53228D84836j3041j1956j0511q964p974p811p758o937n611m933n291n724n296
53215C83029m341l851m143m658m799m424l735l059k632k393k080j656j394j408
53201C38456j434j254j105j374k053k728l001k812k444k288k471k727k769k710
$$ y = [1394452, 1418086, 1440392, 1461218, 1480201, 1497122, 1511818, 1523975, 1533319, 1539807, 1543421, 1544121, 1542255, 1538658, 1533965, 1528060, 1520452, 1510905, 1499421, 1485967, 1470597, 1453545, 1434822, 1413902, 1390231, 1363930, 1335705, 1306193, 1275609, 1243839, 1210607, 1175767, 1139698, 1103260, 1067139, 1031446, 996177, 961734, 928666, 897106, 866837, 837690, 809586, 782368, 755983, 730667, 706557, 683184, 659754, 635921, 612095, 589037, 567414, 547643, 529811, 513659, 498769, 484836, 471795, 459839, 449328, 440364, 432390, 424579, 416821, 409884, 404273, 399340, 394049, 388325, 383029, 378688, 374837, 370694, 366036, 361237, 356813, 353078, 350019, 347387, 344994, 342914, 341258, 339864, 338456, 337022, 335768, 334663, 333289, 331236, 328508, 325507, 322695, 320251, 317963, 315492, 312765, 309996, 307286]
53187C07286k817k905k472j496o66n80j087j604j852j957k095k207k051j422m45
53172B81630L13L82n9l81k95n2Q3J57J48j99r14j567j732j422q39n2P52J065N60
53153B77578l39p21j07J047J759J386K22p59p94k9P54R52N01l29j098j250m99
53136B78274P52J713J959J625R64K47o2L13Q85Q80L72J86N07N50l9m00K05J075
53118B90006J018J51l03K97J425K358K867K865K205J126K84M4Q2q1m70p57o70
53101C02447j84M23O84L19l89p93o03j77m1l24p00q43q17r91j554k126k101j434
53083B90796p63o20q34j013j246j749k132j693m91N11O02Q4l69n84p81r36q09
53066B77973m42k07l04o09r84j426j825j924j729j683k139k765k823k064j020
$$ y = [307286, 304469, 301564, 299092, 297596, 296930, 296350, 295263, 293659, 291807, 289850, 287755, 285548, 283497, 282075, 281630, 281943, 282325, 282266, 281885, 281590, 281538, 281621, 281778, 281926, 281727, 280813, 279246, 277514, 276092, 275253, 275201, 275953, 277018, 277578, 277239, 276518, 276411, 277458, 279217, 280603, 280825, 280066, 279272, 279243, 279997, 280949, 281450, 281121, 280023, 278773, 278274, 279026, 280739, 282698, 284323, 285287, 285534, 285472, 285785, 286670, 287550, 287922, 288108, 288615, 289165, 289126, 288726, 288931, 290006, 291024, 291175, 290872, 291169, 292594, 294952, 297819, 300684, 302889, 304015, 304299, 304343, 304425, 304344, 303874, 303117, 302447, 302263, 302686, 303370, 303689, 303300, 302507, 301904, 301727, 301686, 301362, 300662, 299819, 299002, 298011, 296457, 294331, 292230, 290796, 290033, 289413, 288579, 287566, 286320, 284571, 282439, 280746, 280255, 280766, 281368, 281452, 281083, 280499, 279718, 278782, 277973, 277531, 277324, 277020, 276411, 275427, 274001, 272176, 270252, 268523, 266840, 264701, 261936, 259113, 257049, 256029]
53051B56029l33o8O9J10k02q34j217p90L30J379J626R78k2p24q52n63k16j67o10
53032B53923j305j565r34Q4M55n0m84o8O45N79k48p39k00Q94J668J674R38j35
53014B55132p79n04J74K06n43j117r15m54k75MQ31J662J658J010O31P72Q30M27
52996B58750j01l48l60l26k71j49J26O59J339J657J199K27o19j100j428j660j570
52979B56025j103n25k8M39R15J301J517J531J326J031Q95R01O62J61P6Q55J767
52962B67746J728Q22J41J72L15J10p9L1l0o85j560k070k202k201j992j516j117
52945B57613j054j025p57o15j010j565j564r97m09L1N63R68O16m57j224q43L12
52928B48583J141J048L31l75p08o71m57k73k56m15n98n33q4N51J036J286J400
$$ y = [256029, 255696, 255628, 255697, 255807, 255605, 254771, 253554, 252764, 253094, 254473, 256099, 257077, 257055, 256331, 255479, 254916, 254700, 254533, 253923, 252618, 251053, 250119, 250203, 250658, 250608, 250124, 250056, 250701, 251280, 251032, 250293, 250093, 250987, 252655, 254329, 255267, 255132, 254353, 253849, 254023, 254229, 253686, 252569, 251654, 251200, 250925, 250929, 251760, 253422, 255080, 256090, 256721, 257493, 258323, 258750, 258649, 258301, 257941, 257615, 257344, 257195, 257321, 257980, 259319, 260976, 262175, 262402, 261783, 260683, 259255, 257595, 256025, 254922, 254397, 254369, 254808, 255723, 257024, 258541, 260072, 261398, 262429, 263324, 264225, 264887, 265048, 265124, 265979, 267746, 269474, 270296, 270437, 270609, 270924, 271034, 270955, 270986, 270956, 270271, 268711, 266641, 264439, 262238, 260246, 258730, 257613, 256559, 255534, 254777, 254162, 253152, 251587, 250023, 249026, 248617, 248648, 249211, 250179, 250795, 250338, 249114, 248271, 248583, 249724, 250772, 251103, 250728, 250020, 249349, 248892, 248619, 248363, 247948, 247350, 246817, 246733, 247284, 248320, 249606, 251006]
52911B51006J209L85p61j194m16O15N48n81j376r28J95R15R45P19N92N90O21N82
52893B53666L97J91J98M07N92Q12J404K289K751K245J052k36j430k463k908k441
52877B56526j568j184j466j762j591j195j026j129j258j147o31K37J102J568J568
52862B47044J227N25n08j386j513r73m49k68o6N28J351K084K598K688K033P55
52846B55670l89p72n16j01K46L79j2r10j579j236m8J003J197O46q1n18n50l68
52828B52061k12j3M89J194J619J564J407J379J107L73k33j45J79n1n44k21J161
52811B61114K696L723M607N758O870P630Q380R346R734Q362N016O48l607p051
52797C23226r222r723q561o478m669l981m253m490l911k791k010j904j980j823
$$ y = [251006, 252215, 252600, 251839, 250645, 250229, 250844, 251392, 250811, 249435, 248507, 248702, 249617, 250562, 251281, 251873, 252463, 253084, 253666, 254063, 254254, 254452, 254859, 255451, 256263, 257667, 259956, 262707, 264952, 266004, 265768, 264338, 261875, 258967, 256526, 254958, 253774, 252308, 250546, 248955, 247760, 246734, 245605, 244347, 243200, 242569, 242806, 243908, 245476, 247044, 248271, 248796, 248288, 246902, 245389, 244416, 243967, 243699, 243633, 244161, 245512, 247596, 250194, 252882, 254915, 255670, 255281, 254509, 253993, 253892, 254138, 254517, 254505, 253595, 252016, 250780, 250732, 251735, 252932, 253578, 253497, 252979, 252429, 252061, 251849, 251836, 252325, 253519, 255138, 256702, 258109, 259488, 260595, 260968, 260735, 260590, 260769, 260718, 260174, 259953, 261114, 263810, 267533, 272140, 277898, 284768, 292398, 300778, 310124, 319858, 328220, 333236, 333884, 330277, 323226, 314004, 304281, 295720, 289242, 284573, 280592, 276339, 271849, 267938, 265147, 263137, 261233, 259253, 257430]
52783B57430j706j987k399k381j831j159o85m03k11o4P9K32L35M24O83J159J466
52766B48982J119J59p62r77m29L45P33N19j2l78k76J80M89J61p45j433j074J95
52748B46796J249J138P8r95j442j213n18K32M19k08j001j076m00L71J009J799
52732B46238K586K645J904J323J575K014J703Q25L32N37Q51P45L54jk70n76r70
52715B61815j426j915k374k721k815k463j650p50k52k29l03j95K9K43M02L47m1
52698B45702m48l90K9K25J05K21O94Q27K53l86n08n93j195j667r75N60J540J397
52680B45391J016J261J861K130K039K020K119J934J258M82K17O09J089R77L33
52665B64736j04J29O72R29P99M73m2p58j354j423r40k00N27J035J223J352J816
$$ y = [257430, 255724, 253737, 251338, 248957, 247126, 245967, 245282, 244879, 244668, 244604, 244683, 244915, 245250, 245674, 246357, 247516, 248982, 250101, 250260, 249498, 248521, 248092, 248437, 249170, 249689, 249677, 249299, 249023, 249203, 249692, 249853, 249108, 247675, 246601, 246796, 248045, 249183, 249261, 248266, 246824, 245611, 245093, 245325, 245744, 245536, 244535, 243459, 243059, 243430, 244439, 246238, 248824, 251469, 253373, 254696, 256271, 258285, 259988, 260813, 261145, 261682, 262533, 263278, 263632, 263631, 263361, 262785, 261815, 260389, 258474, 256100, 253379, 250564, 248101, 246451, 245701, 245449, 245220, 244917, 244722, 244751, 244994, 245396, 245743, 245702, 245254, 244864, 244893, 245118, 245223, 245444, 246138, 246965, 247218, 246832, 246324, 245731, 244536, 242869, 241894, 242454, 243994, 245391, 246407, 247668, 249529, 251659, 253698, 255718, 257837, 259771, 261029, 261511, 261728, 262337, 263426, 264403, 264736, 264632, 264761, 265433, 266362, 267161, 267634, 267592, 266834, 265480, 264057, 263117, 262917, 263444, 264479, 265702, 267054, 268870]
52648B68870K396K240J050l25j032j281j652j946j632r39n11l50m2L03L10K98
52632B65757Q44J658J987K024K696M021M967N088N012N014M352K540J57k100m141
52617B99876n690n913m703l335k914k941k326j158l99l12k88RJ83j16p25j278
52601B67970j493j169l30O34J256J369J051N38L26Q71J869K276J533K70n62q34
52585B75575r52r31m99J95O37O61N15L51J16r3r4J08M01P87J132J060M91p4k76
52566B79110n40j280j911j530l69L71K10j04N4K36k19j074j526j169k50P28J251
52549B71988J052M72K66P29J322J470J324J330J405J123M91j01n56j099j578j415
52533B78223n05L59L70l33r81j174j089q94m80J15N02L52k18p85r67n79K40R78
$$ y = [268870, 271266, 273506, 274556, 274231, 273199, 271918, 270266, 268320, 266688, 265749, 265238, 264888, 264846, 265149, 265459, 265757, 266601, 268259, 270246, 272270, 274966, 278987, 283954, 289042, 294054, 299068, 303420, 305960, 306117, 304017, 299876, 294186, 288273, 283570, 280235, 277321, 274380, 272054, 270896, 270497, 270185, 269897, 269906, 270089, 269973, 269248, 267970, 266477, 265308, 264978, 265612, 266868, 268237, 269288, 269826, 270152, 271023, 272892, 275168, 276701, 276971, 276409, 275575, 274623, 273692, 273193, 273388, 274025, 274686, 275201, 275552, 275668, 275575, 275481, 275589, 275990, 276777, 277909, 278969, 279460, 279386, 279110, 278570, 277290, 275379, 273849, 273480, 273851, 274061, 273957, 274011, 274247, 274028, 272954, 271428, 270259, 270009, 270737, 271988, 273040, 273512, 273778, 274507, 275829, 277299, 278623, 279953, 281358, 282481, 282972, 282871, 282315, 281216, 279638, 278223, 277718, 278077, 278447, 278114, 277133, 275959, 274870, 273976, 273496, 273611, 274113, 274465, 274247, 273462, 272495, 271916, 272156, 273134]
52515B73134J201J104J298J873K240K102K064K668L387L313K531J893J628J081
52501C01517j1j020j519j960k728l280l010k319k016k018j556n30K42K73O7K31
52485B80363N23L04l27m06P90K711L901L430J928Q88J025J585J471N74l21o75
52469B97764o17l32K88J284K330L118L656L910L556K398R01j78o28r27j484k129
52453C12910k475k509k527k634k633k398k125k053k109j926j236j78O96Q01O5
52438B89669r00j315r65l33pj89o90j084q74R0J195J516R25L16L99P41N22k45
52420B88771q42j008j183j575j702j068J24J197J648J530J437K051L411M718N158
52405C02667M818M447M572N285O541Q053Q985Q573O961M801K204j064m418o586
$$ y = [273134, 274335, 275439, 276737, 278610, 280850, 282952, 285016, 287684, 291071, 294384, 296915, 298808, 300436, 301517, 301506, 300486, 298967, 297007, 294279, 290999, 287989, 285670, 283654, 281636, 280080, 279550, 279792, 280065, 280132, 280363, 280886, 281190, 280863, 280457, 281247, 283958, 287859, 291289, 293217, 294105, 295130, 296715, 298186, 298760, 298439, 297764, 297147, 296815, 297103, 298387, 300717, 303835, 307491, 311401, 314957, 317355, 318256, 318078, 317450, 316523, 315039, 312910, 310435, 307926, 305399, 302765, 300132, 297734, 295609, 293556, 291447, 289521, 288285, 288107, 288803, 289604, 289669, 288769, 287454, 286489, 286156, 286149, 285960, 285270, 284186, 283312, 283402, 284597, 286113, 287038, 287354, 287753, 288494, 289016, 288771, 287929, 286921, 285738, 284163, 282461, 281393, 281517, 282714, 284362, 285892, 287329, 289380, 292791, 297509, 302667, 307485, 311932, 316504, 321789, 328330, 336383, 345368, 353941, 360902, 365703, 367907, 366843, 362425, 355839]
52391C55839p153p000o911o649n803m604l403k145r97o28j176j631j014L26J349
52376C08400J699J719J603J310J045J091J412J904K637L377L423K544J503Q98
52362C34565J87j226k535k450j207l84p50j480j642j369j241j426j748j927j452
52347C13915J7J846K789K461J782J651J827J587Q86L56M23R46J487J794K028K642
52331C38437L767M854N327N376N613O080O263O154O383P158P804P742P144O262
52317D24364M903L107J703J380J770K144K499L099L380K468P85RJ090L105M541
52302D60347N000N025M835M097K878J920J818K368K985L311L098J999M9j869k628
52287D95233k016q76q9J93K41K06J17J1j54m91p90n89J69R10J183J275J711K456
$$ y = [355839, 348686, 341686, 334775, 328126, 322323, 317719, 314316, 312171, 311174, 310546, 309370, 307739, 306725, 307051, 308400, 310099, 311818, 313421, 314731, 315776, 316867, 318279, 320183, 322820, 326197, 329620, 332164, 333667, 334565, 334752, 333526, 330991, 328541, 327334, 326950, 326200, 324720, 323078, 321709, 320468, 319042, 317294, 315367, 313915, 313932, 315778, 318567, 321028, 322810, 324461, 326288, 327875, 328761, 329117, 329540, 330486, 331973, 333767, 335795, 338437, 342204, 347058, 352385, 357761, 363374, 369454, 375717, 381871, 388254, 395412, 403216, 410958, 418102, 424364, 429267, 432374, 434077, 435457, 437227, 439371, 441870, 444969, 448349, 450817, 451602, 451611, 452701, 455806, 460347, 465347, 470372, 475207, 479304, 482182, 484102, 485920, 488288, 491273, 494584, 497682, 499681, 499730, 497861, 495233, 493217, 492341, 492252, 492445, 492686, 492892, 493009, 493020, 492866, 492375, 491585, 490996, 491165, 492075, 493258, 494533, 496244, 498700]
52269D98700L086L436L609L567L251K966L107L579L976M213M546N011N369N612
52255E54028O014O606P005O906O435N895N395M791L881K686J619J190J384J629
52241F15464J555J414J491J643J795K379L560M551M549L977L895M434M769M528
52227F60004M201M114M018L879M079M533M562L895L058K446J931J681K298L670
52213G08369M570M205L331L145L773M652N641O759P351O694N210M099L707L197
52199G74703J982O47J47N84J238J518J577J982K969M123M887N190N267N006M071
52184H15891K727J837J640J214k36k104l160l227l219l673m171m250m059l843
52170G91367l495l022k879l312l727l269j926n77N3J06K08P06J478K272K833K816
$$ y = [498700, 501786, 505222, 508831, 512398, 515649, 518615, 521722, 525301, 529277, 533490, 538036, 543047, 548416, 554028, 560042, 566648, 573653, 580559, 586994, 592889, 598284, 603075, 606956, 609642, 611261, 612451, 613835, 615464, 617019, 618433, 619924, 621567, 623362, 625741, 629301, 633852, 638401, 642378, 646273, 650707, 655476, 660004, 664205, 668319, 672337, 676216, 680295, 684828, 689390, 693285, 696343, 698789, 700720, 702401, 704699, 708369, 712939, 717144, 720475, 723620, 727393, 732045, 737686, 744445, 751796, 758490, 763700, 767799, 771506, 774703, 776685, 777332, 777479, 778063, 779301, 780819, 782396, 784378, 787347, 791470, 796357, 801547, 806814, 811820, 815891, 818618, 820455, 822095, 823309, 823073, 820969, 817809, 814582, 811363, 807690, 803519, 799269, 795210, 791367, 787872, 784850, 781971, 778659, 774932, 771663, 769737, 769160, 769213, 769319, 769527, 770233, 771711, 773983, 776816, 779632]
52154G79632J947M60r35j744k170k636l070k995k244j174j84O26J323J912K361
52139G71109K471J871M87j074k053k456k913l582l869l411k671k130j501k48J445
52124G51475K867L693M246M939N846O798P628Q304Q916R447R565Q935P759O617
52110H47035N670M538L166K220K278L011L643L898M081M544N440O726Q067Q999
52096I13316R556J0350J1679J2945J3391J2957J1874R876O630K669r00l556n537
52083A005250o885p149o211m667l084j391N92K441L426L304K497J501M02q53j911
52068I87262k057r84N65J381J001Pr72j939k979l656l569l142l107l385l210k349
52052I58867j493j287j519j566j250r69j110j612k030k024j790j849k336k723
$$ y = [779632, 781579, 782039, 781104, 779360, 777190, 774554, 771484, 768489, 766245, 765071, 764887, 765513, 766836, 768748, 771109, 773580, 775451, 775938, 774864, 772811, 770355, 767442, 763860, 759991, 756580, 753909, 751779, 750278, 750030, 751475, 754342, 758035, 762281, 767220, 773066, 779864, 787492, 795796, 804712, 814159, 823724, 832659, 840418, 847035, 852705, 857243, 860409, 862629, 864907, 867918, 871561, 875459, 879540, 884084, 889524, 896250, 904317, 913316, 922872, 933222, 944901, 957846, 971237, 984194, 996068, 1005944, 1012574, 1015243, 1014343, 1010787, 1005250, 998365, 991216, 985005, 980338, 977254, 975863, 976455, 978896, 982322, 985626, 988123, 989624, 990026, 989173, 987262, 985205, 984221, 984786, 986167, 987168, 987175, 986203, 984264, 981285, 977629, 974060, 970918, 967811, 964426, 961216, 958867, 957374, 956087, 954568, 953002, 951752, 950783, 949673, 948061, 946031, 944007, 942217, 940368, 938032, 935309]
52038I35309k435j426M9J876L873N520O395O710O864O670N755M516L920M157M272
52023I92025L509K455K403L801N792P131P317O849O516O545O523O231O184O999
52009A070280Q359R095Q351O281L548N57k670o132r645j2933j5884j8703k1653
51996A018851k4512k6534k7227k6899k6125k4896k2791j9877j6903j4643j3360
51985G75084j2782j2225j0939q875o942n955n625n260n149o200q229r865j0427
51972F66611j0731j1439j1713j0487q166o035m432k615j96K340M535O478Q267
51959F22417R640J0365J0487J0103R268Q164O814M703J255l187p415j0504j2370
51946F59740j3027j2091r503o177l225q07J690M520P278R562J1296J2321J2322
$$ y = [935309, 932874, 931448, 931497, 933373, 937246, 942766, 949161, 955871, 962735, 969405, 975160, 979676, 983596, 987753, 992025, 995534, 997989, 1000392, 1004193, 1009985, 1017116, 1024433, 1031282, 1037798, 1044343, 1050866, 1057097, 1063281, 1070280, 1078639, 1087734, 1096085, 1102366, 1105914, 1106471, 1103801, 1097669, 1088024, 1075091, 1059207, 1040504, 1018851, 994339, 967805, 940578, 913679, 887554, 862658, 839867, 819990, 803087, 788444, 775084, 762302, 750077, 739138, 730263, 723321, 717366, 711741, 706481, 701332, 695132, 686903, 677038, 666611, 655880, 644441, 632728, 622241, 614075, 608040, 603608, 600993, 600797, 603137, 607672, 614150, 622417, 632057, 642422, 652909, 663012, 672280, 680444, 687258, 691961, 693216, 690029, 682614, 672110, 659740, 646713, 634622, 625119, 618942, 615717, 614910, 616600, 621120, 628398, 637960, 649256, 661577, 673899]
51933F73899J1386J0162R116Q004O364M168J596j485n305r554j3408j6199j7712
51920F61032j8019j7334j6069j4619j3036j1229r428q022o959n769m245k641j058
51907E32604P22K634M084M778N302O435Q271J0422J2751J5260J7519J8766J8520
51894F58068J6694J3222Q080J691n069j1251j6007j8637j8989j7764j5981j4065
51882E79992j1804r020n923k776L57L478O590R773J3054J6189J8789K0581K1422
51869F60702K1279K0391J9072J6904J2632N568l011j0610j5696j8532j9958k0148
51857F68593j8871j6349j3315j0436p832n138k072Q59K463K031K43j588k855l708
51843E92025m154l991l556l533l943m149m073m368n099n243m086k298r37j3J186
$$ y = [673899, 685285, 695447, 704563, 712567, 718931, 723099, 724695, 723210, 717905, 708351, 694943, 678744, 661032, 643013, 625679, 609610, 594991, 581955, 570726, 561298, 553276, 546317, 540548, 536303, 533662, 532604, 533326, 535960, 540044, 544822, 550124, 556559, 564830, 575252, 588003, 603263, 620782, 639548, 658068, 674762, 687984, 696064, 697755, 692686, 681435, 665428, 646791, 627802, 610038, 594057, 579992, 568188, 559168, 553245, 550469, 550826, 554304, 560894, 570667, 583721, 599910, 618699, 639280, 660702, 681981, 702372, 721444, 738348, 750980, 756548, 753537, 742927, 727231, 708699, 688741, 668593, 649722, 633373, 620058, 609622, 601790, 596652, 594580, 595439, 597902, 599933, 600176, 598588, 595733, 592025, 587871, 583880, 580324, 576791, 572848, 568699, 564626, 560258, 555159, 549916, 545830, 543532, 542595, 542582, 543768]
51828E43768K896M646N938O469N982M499K524N73j293l050m214m275l446k460
51814E58557j690p91Q69L535O598Q762R087Q072P128O735N843L537N08j865l278
51799F11607m364n238n260m174k429k61K651O345J0116J3216J5535J7258J8304
51786F73306J8350J7111J4329R781L624l363r983j5104j8157j9408j9610j9215
51774F31661j8082j6151j4014j2274j0603q119m686j229J411L299M960O561P918
51761E70652Q901R418R197P870N291J717k328o313r959j3047j5020j5087j3194
51748E38098j0575q745p954p150n560l568j880m64J177L085M830O250P704R578
51734E24826J1851J4220J6420J8260J9392J9114J6674J1992O189J105j926k791
$$ y = [543768, 546664, 551310, 557248, 563717, 569699, 574198, 576722, 577295, 576002, 572952, 568738, 564463, 561017, 558557, 556867, 556076, 556945, 560480, 567078, 575840, 584927, 592999, 600127, 606862, 612705, 616242, 616750, 614885, 611607, 607243, 602005, 596745, 592571, 590142, 589881, 592532, 598877, 608993, 622209, 637744, 655002, 673306, 691656, 708767, 723096, 732877, 736501, 733138, 723155, 708051, 689894, 670486, 650876, 631661, 613579, 597428, 583414, 571140, 560537, 552418, 547732, 546503, 547914, 551213, 556173, 562734, 570652, 579553, 588971, 598168, 606038, 611329, 613046, 610718, 604405, 594446, 581399, 566379, 551292, 538098, 527523, 518778, 510824, 503674, 498114, 494546, 492666, 492202, 493379, 496464, 501294, 507544, 515248, 524826, 536677, 550897, 567317, 585577, 604969, 624083, 640757, 652749, 658938, 660043, 658117, 655326]
51722F55326k203r48L58J036L54k049n688r230j1168j0795q606n695k880n82P00
51707E97930M76j043k763l569l052j256J756N581Q989J0444R220N857J662j972
51693F28260l948l805j857J225M854Q314J0342R656O195J374l153o698r306j0926
51679F30527j1350j0697r347p471n043k323J85K269M056N457O063N687M695L608
51665F16316K815K834M249O931R606J0716R635O736K601k329p396j1622j4177
51652F36915j4763j3563j1046p782m153k47L732P014Q578P880N128R21l977q703
51638F05934j2609j5611j7802j8837j8167j5972j3212j0671q447o584n450n069
51626D57503m631l410j868j143j546k135j910r28n2J49r6j95M6L21M07N44J030
$$ y = [655326, 653123, 652175, 652533, 653569, 653923, 651874, 646186, 636956, 625788, 614993, 606387, 600692, 597812, 597230, 597930, 598406, 597363, 594600, 591031, 587979, 586723, 588479, 594060, 603049, 613493, 622713, 628570, 630232, 628260, 624312, 620507, 618650, 619875, 624729, 633043, 643385, 653041, 659236, 660610, 657457, 650759, 641453, 630527, 619177, 608480, 599133, 591662, 586619, 584296, 584481, 586750, 590806, 596263, 602326, 608013, 612708, 616316, 619131, 621965, 626214, 633145, 642751, 653467, 663102, 669838, 672439, 670110, 662714, 651092, 636915, 622152, 608589, 597543, 589761, 585608, 585361, 589093, 596107, 604685, 612565, 617693, 618614, 614637, 605934, 593325, 577714, 559912, 541075, 522908, 506936, 493724, 483053, 474606, 468022, 462572, 457503, 452872, 449462, 447594, 446451, 444905, 442770, 440860, 439932, 439880, 440029, 439933, 439738, 439784, 440105, 440512, 441056, 442086]
51609D42086J601J594Q09j40n02j32M63O70K87k65k65N46J568K086K265K867M109
51592D59647N537P051R170J1873J4048J4629J3599J1376Q113M448K040K120L865
51579E67516N473O591Q501J1909J5976J9858K3932K8725L3473L6661L7727L7624
51567H33966L7873L9440M2051M4227M4259M1794L8501L6844L8355M3153N0700
51556A291163O0425P1474Q2209R0185R2776Q8197P6295N8509L7033J3977q903
51545A953340l0202m9070o5315p9058r0119r7827j01543j01376r8272r3267q6706
51534A060585p8396o8623n8556m9432m1547l4490k8137k2869j8844j5570j2411
51523F31710r181o144l743k431k328k896l350l551m081n150n920n452m076l125
$$ y = [442086, 443687, 445281, 446090, 445950, 445448, 445316, 445779, 446449, 446736, 446471, 446206, 446752, 448320, 450406, 452671, 455538, 459647, 465184, 472235, 481405, 493278, 507326, 521955, 535554, 546930, 555043, 559491, 561531, 563651, 567516, 572989, 579580, 588081, 599990, 615966, 635824, 659756, 688481, 721954, 758615, 796342, 833966, 871839, 911279, 953330, 997557, 1041816, 1083610, 1122111, 1158955, 1197310, 1240463, 1291163, 1351588, 1423062, 1505271, 1595456, 1688232, 1776429, 1852724, 1911233, 1948266, 1962243, 1953340, 1923138, 1874068, 1808753, 1729695, 1639576, 1541749, 1440206, 1338830, 1240558, 1147291, 1060585, 982189, 913566, 855010, 805578, 764031, 729541, 701404, 678535, 659691, 644121, 631710, 622529, 616385, 612642, 610211, 607883, 604987, 601637, 598086, 594005, 588855, 582935, 577483, 573407, 570282]
51509E70282l335m081m424m380m711n723o830p375p421p477p667p604p042o278
51495D85934n785n641n473m775l333j444J03O69M71M51J213K358L047K941K218
51480D72954J040m49j779k355k137j698j533j631j718j592j177n62j33k55p99
51465D56176j194j085o66k68Q0N75J280J999K388K196J538R00O49O73P36J069
51449D67046K124L747N128N790O274P529R948J3207J6845K0636K4368K7387K8429
51436F38458K6143K0230J2150M512m90k133j055J357L366L336M13m957j1205j6331
51422F73794j8849j8586j6764j4940j3673j2373j0392p870n444l571k386j841
51410E47105j658j372o50M61J751L013L932M163L720L084K681K550K664L232M352
$$ y = [570282, 566947, 562866, 558442, 554062, 549351, 543628, 536798, 529423, 522002, 514525, 506858, 499254, 492212, 485934, 480149, 474508, 469035, 464260, 460927, 459483, 459586, 460255, 460726, 461177, 462390, 464748, 467795, 470736, 472954, 473994, 473545, 471766, 469411, 467274, 465576, 464043, 462412, 460694, 459102, 457925, 457363, 457230, 456975, 456176, 454982, 453897, 453231, 452963, 453043, 453618, 454898, 456897, 459285, 461481, 463019, 463919, 464568, 465241, 465977, 467046, 469170, 472917, 478045, 483835, 490109, 497638, 507586, 520793, 537638, 558274, 582642, 610029, 638458, 664601, 684831, 696981, 701493, 701003, 698870, 697815, 699172, 702538, 705874, 706287, 701330, 690125, 673794, 654945, 636359, 619595, 604655, 590982, 578609, 568217, 560347, 554903, 551332, 548946, 547105, 545447, 544075, 543425, 543886, 545637, 548650, 552582, 556745, 560465, 563549, 566230, 568780, 571444, 574676, 579028]
51395E79028N654O681P440Q227R137J0117J1423J3484J6296J9326K2213K5289
51383G34315K9238L4418M0702M7851N5885O4948P4939Q5324R5328J04303J11783
51372A479034J17182J19473J17254J09229R4946P5289N2228K7775L021k1804m6344
51361B127283o9425q9310j04602j14762j20002j20851j17874j11669j02958r2525
51351A083305q1146o9639n8944m9782m2227l5902l0712k7000k4789k3315k1743
51340F18106j9977j8367j6835j4950j2675j0519q867p671o735n929n116m298l745
51327D82422l602l491k952k067j235n34M1O1p56j648j500n10j56j233k874l790
51311D56176l637k765j579o03l42n46k83P48J779K253K648L383L851L401K455
$$ y = [579028, 584682, 591363, 598803, 607030, 616167, 626284, 637707, 651191, 667487, 686813, 709026, 734315, 763553, 797971, 838673, 886524, 942409, 1007357, 1082296, 1167620, 1262948, 1367251, 1479034, 1596216, 1715689, 1832943, 1942172, 2037118, 2112407, 2164635, 2192410, 2195431, 2173627, 2127283, 2057858, 1968548, 1863946, 1749184, 1629182, 1508331, 1390457, 1278788, 1175830, 1083305, 1002159, 932520, 873576, 823794, 781567, 745665, 714953, 687953, 663164, 639849, 618106, 598129, 579762, 562927, 547977, 535302, 524783, 515916, 508245, 501510, 495581, 490465, 486167, 482422, 478820, 475329, 472377, 470310, 469075, 468541, 468582, 468643, 467887, 466239, 464739, 464229, 464073, 462840, 459966, 456176, 452539, 449774, 448195, 447592, 447250, 446704, 446421, 447169, 448948, 451201, 453849, 457232, 461083, 464484, 466939]
51296D66939J747J121P3j153k039k827l972m952m785l427j691J3J722K963L049
51281D52781K302J824J930J907J500J469K249L127L280K916K780L099L545L707
51267D88416L289K189P40n17j376j896j931j379r32j581l159m221l845k719k009
51252D69069j949k137k442k789k612j501n0P13O72O85J350K315K871K699K046
51237D68940J471J435J872K297K533L084M301N603O008N343M286L263K017L81
51223E12834j214k339l196m179n145n579n312m706m199l966l998m187m306m133
51209D56375l653k946j965o74N69J226J312J526K350L351L803L694L542L475L169
51194D75154K700K614L009L213K782K206K181K719L409M051M550M676M451M334
$$ y = [466939, 468686, 469807, 469880, 468727, 466688, 463861, 459889, 454937, 450152, 446725, 445034, 445047, 446769, 449732, 452781, 455083, 456907, 458837, 460744, 462244, 463713, 465962, 469089, 472369, 475285, 478065, 481164, 484709, 488416, 491705, 493894, 494634, 494117, 492741, 490845, 488914, 487535, 486603, 485022, 481863, 477642, 473797, 471078, 469069, 467120, 464983, 462541, 459752, 457140, 455639, 455589, 456302, 456974, 457659, 459009, 461324, 464195, 466894, 468940, 470411, 471846, 473718, 476015, 478548, 481632, 485933, 491536, 497544, 502887, 507173, 510436, 512453, 512834, 511620, 509281, 506085, 501906, 496761, 491182, 485870, 481164, 476965, 472999, 469001, 464814, 460508, 456375, 452722, 449776, 447811, 447137, 447706, 448932, 450244, 451770, 454120, 457471, 461274, 464968, 468510, 471985, 475154, 477854, 480468, 483477, 486690, 489472, 491678, 493859, 496578, 499987, 504038, 508588, 513264, 517715, 522049]
51180E22049M413M035K857J674J265J020r9j635k083j248n90r66j436j033l76
51165E27847n95j592k486l126m059n298o175o373o300o383o474o086m926l312
51151D64662k181k371l591m505m109k751j417n28Q8M96O42P07R07J091J093J193
51135D49426J692K319K650K857L311L687L259K055Q97K20l58j189k014k511k751
51120D63550k735k069n49J242K416K698K567K535K526K048R57r6l12K03M88J18
51104D75587m9Q45K145K418J556J036J880L376M248M248L919L412K336N59j466
51089E06050l072l842l799l446l357l517l258k097k94J568L153M314M898N045
51075D98346N263N815O315O272N682M644K961O59j433k373k224j869j816j825
$$ y = [522049, 526462, 530497, 533354, 535028, 536293, 537313, 537214, 535579, 533496, 532248, 531658, 530692, 529256, 528223, 527847, 527252, 525660, 523174, 520048, 515989, 510691, 504516, 498143, 491843, 485460, 478986, 472900, 467974, 464662, 462481, 460110, 456519, 452014, 447905, 445154, 443737, 443209, 443297, 443793, 444435, 445142, 446049, 447140, 448233, 449426, 451118, 453437, 456087, 458944, 462255, 465942, 469201, 471256, 472153, 472373, 472015, 470826, 468812, 466301, 463550, 460815, 458746, 458197, 459439, 461855, 464553, 467120, 469655, 472181, 474229, 475186, 475090, 474778, 474981, 475469, 475587, 475538, 476383, 478528, 480946, 482502, 483538, 485418, 488794, 493042, 497290, 501209, 504621, 506957, 507516, 506050, 502978, 499136, 495337, 491891, 488534, 485017, 481759, 479662, 479368, 480936, 484089, 488403, 493301, 498346, 503609, 509424, 515739, 522011, 527693, 532337, 535298, 535957, 534524, 532151, 529927, 528058, 526242, 524417]
51061E24417j636j327q86J4J492L096M115M093L061J537K93j96n7M68J486L079
51045E43049M724N737O084O162O021N534N217N923P591R201J0224J1159J2342
51032F38968J3144J2902J1793J0175P789M456Q64k147m652p187r621j1382j2498
51019F52604j3452j4137j3864j2437j0461q477o489m374k218q6J945L645M926
51006E77125O216P878R463J0247J0383J0614J0932J0491R025P377O293N529M550
50993F86123L286J733l63k852m933o095o650o896o465n193l750k586j040J596
50979F45915M705P251R460J2331J5665J7977J8477J7845J6773J4949J2132R221
50967H02701P412O794O466N724M614L566K942K790K662J897L08j503k708k928
$$ y = [524417, 522781, 521454, 520568, 520582, 522074, 525170, 529285, 533378, 536439, 537976, 538269, 538073, 538016, 538484, 539970, 543049, 547773, 553510, 559594, 565756, 571777, 577311, 582528, 588451, 596042, 605243, 615467, 626626, 638968, 652112, 665014, 676807, 686982, 694771, 699227, 700091, 697944, 693292, 686105, 676484, 665102, 652604, 639152, 625015, 611151, 598714, 588253, 579776, 573287, 568913, 566695, 566609, 568554, 572199, 577125, 583341, 591219, 600682, 610929, 621312, 631926, 642858, 653349, 662374, 669751, 676044, 681573, 686123, 689409, 691142, 690779, 687927, 682994, 676899, 670249, 663353, 656888, 651695, 647945, 645359, 644319, 645915, 650620, 657871, 667331, 679662, 695327, 713304, 731781, 749626, 766399, 781348, 793480, 802701, 810113, 816907, 823373, 829097, 833711, 837277, 840219, 843009, 845671, 847568, 847876, 846373, 843665, 840737]
50953H40737k253q45J198L782O802J0089J3241J5785J7581J8903K0060K1217K2582
50940I88879K4432K6663K8620K9436K8243K4046J6192N615m784j1947j5106j6034
50928A124255j6734j7472j7383j6436j5927j6895j8766k0184k0783k1401k2589
50917I19685k3736k4049k3644k2991k1845j9703j7050j5051j3891j2432r961p352
50905G07980n895n601n488n100m809m870m985m874m579m081l218k217j705j919
50891F48639k263k068j433r58q58q20o21l67p3N60J590K410K238J059l02j039
50875F45694j011n08K50J135J801J816J162L93J56O20J363J836J898J910K248
50860F60763K829L322L781M686O188P718Q689R237R872J0647J1254J1773J2676
$$ y = [840737, 838484, 837639, 838837, 842619, 849421, 859510, 872751, 888536, 906117, 925020, 945080, 966297, 988879, 1013311, 1039974, 1068594, 1098030, 1126273, 1150319, 1166511, 1172126, 1167342, 1155395, 1140289, 1124255, 1107521, 1090049, 1072666, 1056230, 1040303, 1023408, 1004642, 984458, 963675, 942274, 919685, 895949, 871900, 848256, 825265, 803420, 783717, 766667, 751616, 737725, 725293, 715332, 707980, 702085, 696484, 690996, 685896, 681087, 676217, 671232, 666358, 661779, 657698, 654480, 652263, 650558, 648639, 646376, 644308, 642875, 641917, 641059, 640239, 639618, 639251, 639178, 639738, 641328, 643738, 645976, 647035, 646733, 645694, 644683, 644175, 644425, 645560, 647361, 649177, 650339, 650732, 650888, 651508, 652871, 654707, 656605, 658515, 660763, 663592, 666914, 670695, 675381, 681569, 689287, 697976, 707213, 717085, 727732, 738986, 750759, 763435]
50847G63435J4022J5226J5841J6140J6695J7711J8995K0254K1226K1812K2265
50836I63622K2956K3862K4526K4679K4605K4742K5292K6279K7605K8878K9664
50825A246710L0117L0921L2269L3486L4035L4391L5345L6772L7762L7710L6606
50814A626124L4316L0337K4467J7259R633K285m568j1124j7712k4139k9430l2615
50802A624833l3802l4011l3900l3061l0746k6906k2237j7581j3410r709o137k425
50790A360908J277M677P914J1485J5401J8802K0684K0855J9855J8113J5563J2091
50778A527625Q048M148Q83j878m615p490j0148j2294j4314j6881k0026k3129k5927
50765A404002k8923l2419l5668l7646l8334l8516l8382l7243l4806l1949k9640
$$ y = [763435, 777457, 792683, 808524, 824664, 841359, 859070, 878065, 898319, 919545, 941357, 963622, 986578, 1010440, 1034966, 1059645, 1084250, 1108992, 1134284, 1160563, 1188168, 1217046, 1246710, 1276827, 1307748, 1340017, 1373503, 1407538, 1441929, 1477274, 1514046, 1551808, 1589518, 1626124, 1660440, 1690777, 1715244, 1732503, 1742136, 1744421, 1739853, 1728729, 1711017, 1686878, 1657448, 1624833, 1591031, 1557020, 1523120, 1490059, 1459313, 1432407, 1410170, 1392589, 1379179, 1369470, 1363333, 1360908, 1362185, 1366862, 1374776, 1386261, 1401662, 1420464, 1441148, 1462003, 1481858, 1499971, 1515534, 1527625, 1535673, 1539821, 1540704, 1538826, 1534211, 1526721, 1516573, 1504279, 1489965, 1473084, 1453058, 1429929, 1404002, 1375079, 1342660, 1306992, 1269346, 1231012, 1192496, 1154114, 1116871, 1082065, 1050116, 1020476]
50754A020476k7670k5114k1755j8310j5423j3072j1057r382p904o187m083k072
50742H58447n72P72K587M804O656P767Q671J0159J2412J4953J7153J8569J9017
50729I81395J8634J7863J7172J6750J6458J6046J5308J4205J2917J1813J1222
50718A149783J1223J1622J2127J2606J3106J3687J4238J4603J4859J5370J6499
50707A299723J8261K0259K1882K2634K2552K2349K2777K3703K4075K3082K1065
50696A542362J8993J7255J5482J3327J0859Q196N351K666R46Q27K184M366O803
50683A649617R231J1496J3343J4457J4693J4436J4594J5993J8760K2474K6888
50672A825982L2269L8909M6472N3774N9173O1470O0784N8333N5055N0706M4817
$$ y = [1020476, 992806, 967692, 945937, 927627, 912204, 899132, 888075, 878693, 870789, 864602, 860519, 858447, 857875, 858647, 861234, 866038, 872694, 880461, 889132, 899291, 911703, 926656, 943809, 962378, 981395, 1000029, 1017892, 1035064, 1051814, 1068272, 1084318, 1099626, 1113831, 1126748, 1138561, 1149783, 1161006, 1172628, 1184755, 1197361, 1210467, 1224154, 1238392, 1252995, 1267854, 1283224, 1299723, 1317984, 1338243, 1360125, 1382759, 1405311, 1427660, 1450437, 1474140, 1498215, 1521297, 1542362, 1561355, 1578610, 1594092, 1607419, 1618278, 1626474, 1631825, 1634491, 1635437, 1636264, 1638448, 1642814, 1649617, 1658848, 1670344, 1683687, 1698144, 1712837, 1727273, 1741867, 1757860, 1776620, 1799094, 1825982, 1858251, 1897160, 1943632, 1997406, 2056579, 2118049, 2178833, 2237166, 2292221, 2342927, 2387744]
50661B387744L8168L2357K8020K4403K0958J8236J6686J5342J2660Q286L241j373
50649B604728n238q464j1073j2900j3628j2903j0598p006k573K393P549J2343
50637B542630J6340J9602K2442K4801K6066K5537K3086J9504J6110J3747J2139
50626B762004J0619R293Q649P767L806n781k0653l7470n1966o0913o2968n8823
50614B503564n0633m0641l0187k0073j1324m848o74J685K211L76l850r745j6653
50601B319208k4413l2806m1081m8354n4135n8345o1108o2633o3090o2550o1154
50590A749539n9140n6533n3009m8530m3776l9492l5586l1446k6967k2627j8628
50579A313805j4651j0542o553k804R32M683Q111J1076J3923J6867J9606K1730
$$ y = [2387744, 2425912, 2458269, 2486289, 2510692, 2531650, 2549886, 2566572, 2581914, 2594574, 2602860, 2606101, 2604728, 2599490, 2591026, 2579953, 2567053, 2553425, 2540522, 2529924, 2522918, 2520345, 2522738, 2530287, 2542630, 2558970, 2578572, 2601014, 2625815, 2651881, 2677418, 2700504, 2720008, 2736118, 2749865, 2762004, 2772623, 2781916, 2790565, 2798332, 2802138, 2796357, 2775704, 2738234, 2686268, 2625355, 2562387, 2503564, 2452931, 2412290, 2382103, 2362030, 2350706, 2345858, 2345184, 2346869, 2349080, 2349456, 2345606, 2335861, 2319208, 2294795, 2261989, 2220908, 2172554, 2118419, 2060074, 1998966, 1936333, 1873243, 1810693, 1749539, 1690399, 1633866, 1580857, 1532327, 1488551, 1449059, 1413473, 1382027, 1355060, 1332433, 1313805, 1299154, 1288612, 1282059, 1279255, 1280187, 1284870, 1292981, 1304057, 1317980, 1334847, 1354453, 1376183]
50567A376183K3206K4168K4588K4439K4002K3738K3981K4848K6287K8148L0386
50556A653974L3108L6298L9508M2153M4053M5464M6719M8055M9581N1000N1544
50545B141457N0671M8716M6475M4305M2222M0584L9988M0551M2015M4533M8472
50534B629989N3383N7985O1568O4663O8113P2099P6470Q1294Q6542R1748R6445
50523C440299J00618J04297J07056J08175J06954J02662R4726Q3272O9026N2482
50513D369567L3625J2750r142l1062n2576p3172r1703j07056j18813j26787j30381
50502C675250j29049j22996j12852r9101q2390o3897m4741k5402o313J1383K6364
50491C026256L7948M5620M8169M4349L4237J9081k7k2240m5734o7597q5483r8829
$$ y = [1376183, 1399389, 1423557, 1448145, 1472584, 1496586, 1520324, 1544305, 1569153, 1595440, 1623588, 1653974, 1687082, 1723380, 1762888, 1805041, 1849094, 1894558, 1941277, 1989332, 2038913, 2089913, 2141457, 2192128, 2240844, 2287319, 2331624, 2373846, 2414430, 2454418, 2494969, 2536984, 2581517, 2629989, 2683372, 2741357, 2802925, 2867588, 2935701, 3007800, 3084270, 3165564, 3252106, 3343854, 3440299, 3540917, 3645214, 3752270, 3860445, 3967399, 4070061, 4164787, 4248059, 4317085, 4369567, 4403192, 4415942, 4406800, 4375738, 4323162, 4249990, 4158287, 4051231, 3932418, 3805631, 3675250, 3546201, 3423205, 3310353, 3211252, 3128862, 3064965, 3020224, 2994822, 2988509, 2999892, 3026256, 3064204, 3109824, 3157993, 3202342, 3236579, 3255660, 3255633, 3233393, 3187659, 3120062, 3034579, 2935750]
50479B935750j08144j13872j16278j15818j13055j08412j02345r5455q8255q1063
50469A893053p4105o7465o0943n4450m8410m3233l8439l3147k7583k3210k0942
50458A401126k0061j9458j9129j9587k0392k0477j9719j9147j9370j9629j8748
50447A185409j6424j3328j0371q196o939o076m802k826o03J405L263N201P065
50434A132778Q645J0161J1999J4076J6023J7826J9784K1859K3686K5272K7117
50423A329226K9366L1389L2576L3223L4247L6283L9322M2941M6562M9773N2757
50412A757665N6221O0490O4897O8329P0231P0748P0212O8922O7176O4907O1400
50401B481198N6053M9310M2257L5119K6792J6071K970j1348k5475l8467n0035
$$ y = [2935750, 2827606, 2713734, 2597456, 2481638, 2368583, 2260171, 2157826, 2062371, 1974116, 1893053, 1818948, 1751483, 1690540, 1636090, 1587680, 1544447, 1506008, 1472861, 1445278, 1422068, 1401126, 1381065, 1361607, 1342478, 1322891, 1302499, 1282022, 1262303, 1243156, 1223786, 1204157, 1185409, 1168985, 1155657, 1145286, 1137090, 1130151, 1124075, 1119273, 1116447, 1115844, 1117249, 1120512, 1125713, 1132778, 1141423, 1151584, 1163583, 1177659, 1193682, 1211508, 1231292, 1253151, 1276837, 1302109, 1329226, 1358592, 1389981, 1422557, 1455780, 1490027, 1526310, 1565632, 1608573, 1655135, 1704908, 1757665, 1813886, 1874376, 1939273, 2007602, 2077833, 2148581, 2218793, 2287715, 2354891, 2419798, 2481198, 2537251, 2586561, 2628818, 2663937, 2690729, 2706800, 2709770, 2698422, 2672947, 2634480, 2584445]
50390B584445o0256o8868p4830p7057p5588p1529o5715n8049m8365l7345k6129
50379A920714j5432n472L512J1143J6977K0360K0459J6957J0554K471o524j6321
50367A979398k6846l7536m7378n5308o0708o3649o4635o4052o2095n9187n6003
50356A382001n2885m9629m6115m2692l9598l6440l2842k9303k6691k5002k3214
50345I77590k0623j7753j5623j4462j3633j2648j1630j0619q987o263l279j640
50333H40430j722k090j381j11L55n4j97K96N31J1m69j52N65R66J097J252J243
50316H40570R05P39J256K212L194M436O295Q369R949J0950J1718J2284J2493J2399
50302I37769J1799R942O619L110J015M51L97M98J239K460L053K468J445P51O6
$$ y = [2584445, 2524189, 2455321, 2380491, 2303434, 2227846, 2156317, 2090602, 2032553, 1984188, 1946843, 1920714, 1905282, 1899810, 1903322, 1914465, 1931442, 1951802, 1972261, 1989218, 1999772, 2002243, 1995719, 1979398, 1952552, 1915016, 1867638, 1812330, 1751622, 1687973, 1623338, 1559286, 1497191, 1438004, 1382001, 1329116, 1279487, 1233372, 1190680, 1151082, 1114642, 1081800, 1052497, 1025806, 1000804, 977590, 956967, 939214, 923591, 909129, 895496, 882848, 871218, 860599, 851612, 845349, 842070, 840430, 838708, 836618, 835237, 835126, 835481, 835427, 835230, 835526, 836057, 836068, 835599, 835447, 836012, 836978, 838075, 839327, 840570, 841475, 842214, 843470, 845682, 848876, 853312, 859607, 867976, 877925, 888875, 900593, 912877, 925370, 937769, 949568, 959510, 966129, 969239, 970254, 970705, 971102, 971600, 972839, 975299, 978352, 980820, 982265, 983016, 983082]
50287I83082j403l762o418q687j0054j0230r257p467n217k786l92J992M423O243
50273I30067O072L416j34k361k923l194l693l160p03K380L932L304J592P2p67
50258I33900j027j013j027j053p40pO10M47n60j888k870l069k562k109k601m096
50242I10335n656o327o007n147m141l250k685k346j813q97N6P11J270K131L276
50227H79510M342N097N549N689N385M480L015J419L76N3l92k035m804p451r030
50212H91203r834j0620j1507j2029j1826j0931r764r054r288r953r918q845p626
50199G60008o966o338n039l579k959k921k075J36K638M183M867N644O919Q189
50185G62707Q971R492J0182J0772J0266P968M334N51k522m698n876n768m382k347
$$ y = [983082, 981679, 977917, 971499, 962812, 952758, 942528, 933271, 925804, 920587, 917801, 917409, 919401, 923824, 930067, 936139, 939555, 939421, 937060, 934137, 930943, 927250, 924090, 923387, 925767, 929699, 933003, 934595, 934667, 933900, 932873, 931860, 930833, 929780, 929040, 929033, 929643, 930090, 929530, 927642, 924772, 921703, 919141, 917032, 914431, 910335, 904679, 898352, 892345, 887198, 883057, 879807, 877122, 874776, 872963, 872066, 872122, 872833, 874103, 876234, 879510, 883852, 888949, 894498, 900187, 905572, 910052, 913067, 914486, 914862, 914915, 914523, 912488, 907684, 900233, 891203, 881369, 870749, 859242, 847213, 835387, 824456, 814692, 805638, 796350, 786397, 776479, 767634, 760008, 753042, 746704, 741665, 738086, 735127, 732206, 730131, 730267, 732905, 737088, 741955, 747599, 754518, 762707, 771678, 781170, 791352, 802124, 812390, 820358, 824692, 825243, 822721, 818023, 812147, 806379, 801997, 799650]
50171G99650m67Q34J544J971K727M295O361P993Q754R124R597R975R994J0030
50157H82382J0491J1017J1060J0859J1065J1616J1790J1397J1006J0871J0302
50146A003856Q415N116J052l082o956j0521j3664j5976j6947j6501j5109j3163
50134I06520j0549p117l288K72L294N740P247P373O395N211M442M079M032M450
50120I38101N360O508P733R163J0939J3136J5969J9606K3710K7637L1242L4970
50108A144074L8981M2684M5403M6988M7381M6117M2829L7964L2473K7003K1907
50097A573804J7864J5707J5434J5943J6098J5773J5428J4842J2757P920J87r539
50085A712218k0117l0585m0046m7670n3054n6252n7307n6112n2935m8713m4368
$$ y = [799650, 799183, 800017, 801561, 803532, 806259, 810554, 816915, 824908, 833662, 842786, 852383, 862358, 872352, 882382, 892873, 903890, 914950, 925809, 936874, 948490, 960280, 971677, 982683, 993554, 1003856, 1012271, 1017387, 1018439, 1015357, 1008401, 997880, 984216, 968240, 951293, 934792, 919683, 906520, 895971, 888854, 885566, 885838, 889132, 894872, 902119, 909492, 915887, 921098, 925540, 929619, 933651, 938101, 943461, 949969, 957702, 966865, 977804, 990940, 1006909, 1026515, 1050225, 1077862, 1109104, 1144074, 1183055, 1225739, 1271142, 1318130, 1365511, 1411628, 1454457, 1492421, 1524894, 1551897, 1573804, 1591668, 1607375, 1622809, 1638752, 1654850, 1670623, 1686051, 1700893, 1713650, 1721570, 1721757, 1712218, 1692101, 1661516, 1621470, 1573800, 1520746, 1464494, 1407187, 1351075, 1298140, 1249427, 1205059]
50074A205059m0035l5394l0533k5931k1576j6839j1535o585l119j079P11L088
50062A016232N549O780N938L211o59m976r150j2471j4229j4184j2787j0854r044
50049I49356p577o242m615k451q0J789K801L416M478O341Q532J0278J1146J1257
50035I88429J1060J0998J1386J2391J3954J5683J7041J7860J8520J9347J9969
50024A156638J9580J7874J5364J2782J0562Q892P739O642N011K929J182J71o59
50011A264707j910l297m140m319m085l352j963l28J094K805N880J0624J6488K3260
49997A301464L1316M0497M9811N8677O7483P6268Q3670Q8047Q9156Q7882Q4826
49986B059097Q0041P3911O7242O0422N3236M5676L8358L1991K7044K3931K2789
$$ y = [1205059, 1165024, 1129630, 1099097, 1073166, 1051590, 1034751, 1023216, 1016631, 1013512, 1012433, 1013144, 1016232, 1021781, 1028561, 1034499, 1037710, 1037051, 1032075, 1022925, 1010454, 996225, 982041, 969254, 958400, 949356, 941779, 935537, 930922, 928471, 928391, 930180, 932981, 936397, 940875, 947216, 955748, 966026, 977172, 988429, 999489, 1010487, 1021873, 1034264, 1048218, 1063901, 1080942, 1098802, 1117322, 1136669, 1156638, 1176218, 1194092, 1209456, 1222238, 1232800, 1241692, 1249431, 1256073, 1261084, 1264013, 1265195, 1265366, 1264707, 1262797, 1259500, 1255360, 1251041, 1246956, 1243604, 1241641, 1241313, 1242407, 1245212, 1251092, 1261716, 1278204, 1301464, 1332780, 1373277, 1423088, 1481765, 1549248, 1625516, 1709186, 1797233, 1886389, 1974271, 2059097, 2139138, 2213049, 2280291, 2340713, 2393949, 2439625, 2477983, 2509974, 2537018, 2560949, 2583738]
49975B583738K2702K1777J8452J2346L586q002k2251l7620n1768o3306p2305p9060
49963B328289q3139q4183q2960q0853p8458p5213p0349o3800n6180m8307m0757
49952A564090l3547k6223j8546j1022m401J249O387J0852J3528J3425J0677O179
49940A532648P35n058j0532j5259j9502k3924k8844l4072l9279m4096m7912n0044
49928A214861n0155m8384m5116m0899l6374l1960k7595k3058j8446j4110j0283
49917H68481p000m222j848K58J964K903L109L274L952M851N571O633Q933J2277
49903I09136J5416J7678J9732K2326K5116K7304K8922L0688L2697L3718L2072
49892A194805K7138K0088J3127P847M310J764k09j770l640o775j1019j4898j7190
$$ y = [2583738, 2606440, 2628217, 2646669, 2659015, 2662601, 2654599, 2632348, 2594728, 2542960, 2479654, 2407349, 2328289, 2245150, 2160967, 2078007, 1997154, 1918696, 1843483, 1773134, 1709334, 1653154, 1604847, 1564090, 1530543, 1504320, 1485774, 1474752, 1470351, 1471600, 1477987, 1488839, 1502367, 1515792, 1526469, 1532648, 1533383, 1528325, 1517793, 1502534, 1483032, 1459108, 1430264, 1396192, 1356913, 1312817, 1264905, 1214861, 1164706, 1116322, 1071206, 1030307, 993933, 961973, 934378, 911320, 892874, 878764, 868481, 861481, 857259, 855411, 855669, 857633, 860536, 863645, 866919, 870871, 875722, 881293, 887926, 896859, 909136, 924552, 942230, 961962, 984288, 1009404, 1036708, 1065630, 1096318, 1129015, 1162733, 1194805, 1221943, 1242031, 1255158, 1263005, 1267315, 1269079, 1268870, 1267100, 1263460, 1256685, 1245666, 1230768, 1213578]
49879A213578j8066j8247j7673j5679j1978o835m99O793J4423K1647K8272L4527
49867A230263M0226M4496M6506M6156M3942M0445L6175L1745K8019K5908K5950
49856A639831K8024L1558L5860M0067M2881M2911L9457L2593K2362Q565q178k5747
$$ y = [1213578, 1195512, 1177265, 1159592, 1143913, 1131935, 1125100, 1124601, 1131394, 1145817, 1167464, 1195736, 1230263, 1270489, 1314985, 1361491, 1407647, 1451589, 1492034, 1528209, 1559954, 1587973, 1613881, 1639831, 1667855, 1699413, 1735273, 1775340, 1818221, 1861132, 1900589, 1933182, 1955544, 1964109, 1955931, 1930184]
$$ [...]
##END NTUPLES=NMR SPECTRUM
##END=
