
##TITLE=AC1367_2285_7221507_Xg8aSAJzSg
##JCAMPDX= 6.0         $$ Bruker NMR JCAMP-DX V2.0
##DATA TYPE= NMR SPECTRUM
##DATA CLASS= NTUPLES
##ORIGIN= BRUKER
##OWNER= Administrator
$$ 1.72 TOPSPIN		Version 2.1
$$ 2012-12-14 00:10:13.066 -0500  Administrator@X
$$ Compression mode = diff/dup
##.OBSERVE FREQUENCY= 400.02188249412
##.OBSERVE NUCLEUS= ^1H
##.ACQUISITION MODE= SIMULTANEOUS (DQD)
##.ACQUISITION SCHEME= undefined
##.AVERAGES= 8
##.DIGITISER RES= 22
##SPECTROMETER/DATA SYSTEM= spect
##.PULSE SEQUENCE= zg30
##.SOLVENT NAME= COFFEE_meoh
##.SHIFT REFERENCE= INTERNAL, COFFEE_meoh, 1, 14.98509
##AUDIT TRAIL= $$ (NUMBER, WHEN, WHO, WHERE, PROCESS, VERSION, WHAT)
$$ ##TITLE= Audit trail, TOPSPIN		Version 2.1
$$ ##JCAMPDX= 5.01
$$ ##ORIGIN= Bruker BioSpin GmbH
$$ ##OWNER= Administrator
$$ $$ E:\/data/COFFEE/nmr/AC1367_2285_7221507_Xg8aSAJzSg/20/pdata/1/auditp.txt
$$ ##AUDIT TRAIL=  $$ (NUMBER, WHEN, WHO, WHERE, PROCESS, VERSION, WHAT)
(   1,<2012-12-14 00:10:04.957 -0500>,<Administrator>,<X>,<go>,<TOPSPIN 2.1>,
      <created by zg
	started at 2012-12-14 00:08:58.504 -0500,
	POWCHK enabled, PULCHK disabled,
       configuration hash MD5:
       86 BA 57 50 F2 9D 5C 9B 26 00 A9 28 5F 66 2E 89
       data hash MD5: 64K
       D5 D7 76 5F F7 66 C5 85 B1 56 0C DF 54 51 47 80>)
(   2,<2012-12-14 00:10:08.020 -0500>,<Administrator>,<X>,<proc1d>,<TOPSPIN 2.1>,
      <Start of raw data processing
       efp LB = 0 FT_mod = 6 PKNL = 1 PHC0 = 0 PHC1 = 0 SI = 32K 
       data hash MD5: 32K
       F5 73 C2 8C D7 D1 89 BA 8E 24 7A DE 5C 4A 83 DC>)
(   3,<2012-12-14 00:10:08.473 -0500>,<Administrator>,<X>,<proc1d>,<TOPSPIN 2.1>,
      <pk PHC0 = 98.65173 PHC1 = 0 
       data hash MD5: 32K
       AA 6A D7 58 ED 0F A7 10 DF B4 71 0A 2F 8A 84 FE>)
(   4,<2012-12-14 00:10:08.707 -0500>,<Administrator>,<X>,<proc1d>,<TOPSPIN 2.1>,
      <abs ABSG = 1 
       data hash MD5: 32K
       D7 CA F9 6F 90 72 73 0B 82 EB EB 01 C0 1F 6B 22>)
(   5,<2012-12-14 00:10:08.863 -0500>,<Administrator>,<X>,<proc1d>,<TOPSPIN 2.1>,
      <abs ABSG = 2 
       data hash MD5: 32K
       3F FF BA 7E 84 AA C7 BA 55 AC 43 47 B5 7E 34 69>)
(   6,<2012-12-14 00:10:09.004 -0500>,<Administrator>,<X>,<proc1d>,<TOPSPIN 2.1>,
      <abs ABSG = 3 
       data hash MD5: 32K
       96 DB E1 EA 24 40 8F F1 BD 5E D0 B6 F5 CB 6C 6C>)
(   7,<2012-12-14 00:10:09.160 -0500>,<Administrator>,<X>,<proc1d>,<TOPSPIN 2.1>,
      <abs ABSG = 4 
       data hash MD5: 32K
       D2 4E 53 C5 B9 B5 1A D9 51 5C 83 DC DE 0A 67 C8>)
(   8,<2012-12-14 00:10:09.316 -0500>,<Administrator>,<X>,<proc1d>,<TOPSPIN 2.1>,
      <abs ABSG = 5 
       data hash MD5: 32K
       6A 47 13 99 15 DA 86 4A 72 57 76 F9 F6 69 01 FF>)
$$ ##END=
$$ 
$$ $$ hash MD5
$$ $$ B3 45 4B BE ED 4E AA CA 68 2D C5 80 F7 6D 15 D0
##$RELAX= 
##$RELAX= 
##$RELAX= 
##$RELAX= 
##$RELAX= 
##$RELAX= 
##$RELAX= 
##$RELAX= 
$$ Bruker specific parameters
$$ --------------------------
##$DU= <E:\>
##$EXPNO= 20
##$NAME= <AC1367_2285_7221507_Xg8aSAJzSg>
$$ [...]
150 150 150 150 150 150 150 150
##$TP07= 0
##$TPNAME0= <>
##$TPNAME1= <>
##$TPNAME2= <>
##$TPNAME3= <>
##$TPNAME4= <>
##$TPNAME5= <>
##$TPNAME6= <>
##$TPNAME7= <>
##$TPOAL= (0..7)
0.5 0.5 0.5 0.5 0.5 0.5 0.5 0.5
##$TPOFFS= (0..7)
0 0 0 0 0 0 0 0
##$TUNHIN= 0
##$TUNHOUT= 0
##$TUNXOUT= 0
##$USERA1= <user>
##$USERA2= <user>
##$USERA3= <user>
##$USERA4= <user>
##$USERA5= <user>
##$V9= 5
##$VALIST= <valist>
##$VCLIST= <CCCCCCCCCCCCCCC>
##$VD= 0
##$VDLIST= <DDDDDDDDDDDDDDD>
##$VPLIST= <PPPPPPPPPPPPPPP>
##$VTLIST= <TTTTTTTTTTTTTTT>
##$WBST= 1024
##$WBSW= 4
##$XGAIN= (0..3)
0 0 0 0
##$XL= 0
##$YL= 0
##$YMAX_a= 660573
##$YMIN_a= -561319
##$ZGOPTNS= <>
##$ZL1= 120
##$ZL2= 120
##$ZL3= 120
##$ZL4= 120
##$ABSF1= 14.98509
##$ABSF2= -5.573092
##$ABSG= 5
##$ABSL= 3
##$ALPHA= 0
##$AQORDER= 0
##$ASSFAC= 0
##$ASSFACI= 0
##$ASSFACX= 0
##$ASSWID= 0
##$AUNMP= <proc_prof1d_extract_pilot.lims>
##$AXLEFT= 0
##$AXNAME= <>
##$AXNUC= <1H>
##$AXRIGHT= 0
##$AXTYPE= 0
##$AXUNIT= <>
##$AZFE= 0.1
##$AZFW= 0.1
##$BCFW= 0
##$BC_mod= 0
##$BYTORDP= 0
##$COROFFS= 0
##$CY= 15
##$DATMOD= 1
##$DC= 0
##$DFILT= <>
##$DTYPP= 0
##$F1P= 0
##$F2P= 0
##$FCOR= 0.5
##$FTSIZE= 32768
##$FT_mod= 6
##$GAMMA= 0
##$GB= 0
##$INTBC= 1
##$INTSCL= 1
##$ISEN= 128
##$LB= 0
##$LEV0= 0
##$LPBIN= 0
##$MAXI= 10000
##$MC2= 0
##$MEAN= 0
##$ME_mod= 0
##$MI= 0
##$NCOEF= 0
##$NC_proc= -8
##$NLEV= 6
##$NOISF1= 0
##$NOISF2= 0
##$NSP= 0
##$NTH_PI= 0
##$NZP= 0
##$OFFSET= 14.98509
##$PC= 1
##$PHC0= 98.65173
##$PHC1= 0
##$PH_mod= 1
##$PKNL= yes
##$PPARMOD= 0
##$PPDIAG= 0
##$PPIPTYP= 0
##$PPMPNUM= 2147483647
##$PPRESOL= 1
##$PSCAL= 4
##$PSIGN= 0
##$PYNMP= <proc.py>
##$REVERSE= no
##$SF= 400.02
##$SI= 32768
##$SIGF1= 0
##$SIGF2= 0
##$SINO= 400
##$SIOLD= 32768
##$SPECTYP= <>
##$SREGLST= <1H.CDCl3>
##$SSB= 0
##$STSI= 32768
##$STSR= 0
##$SW_p= 8223.68421052631
##$SYMM= 0
##$S_DEV= 0
##$TDeff= 65536
##$TDoff= 0
##$TI= <>
##$TILT= no
##$TM1= 0
##$TM2= 0
##$TOPLEV= 0
##$USERP1= <user>
##$USERP2= <user>
##$USERP3= <user>
##$USERP4= <user>
##$USERP5= <user>
##$WDW= 1
##$XDIM= 32768
##$YMAX_p= 467663578
##$YMIN_p= -709350
##$CURPLOT= <Network HP LaserJet P1505>
##$CURPRIN= <$Network HP LaserJet P1505>
##$DFORMAT= <normdp>
##$LAYOUT= <+/1D_H.xwp>
##$LFORMAT= <normlp>
##$PFORMAT= <normpl>
##$SURQMSG= 1
$$ End of Bruker specific parameters
$$ ---------------------------------
##NTUPLES= NMR SPECTRUM
##VAR_NAME=  FREQUENCY,     SPECTRUM/REAL,   SPECTRUM/IMAG
##SYMBOL=    X,             R,               I
##VAR_TYPE=  INDEPENDENT,   DEPENDENT,       DEPENDENT
##VAR_FORM=  AFFN,          ASDF,            ASDF
##VAR_DIM=   32768,         32768,           32768
##UNITS=     HZ,            ARBITRARY UNITS, ARBITRARY UNITS
##FACTOR=    0.250966925370066, 1,           1
##FIRST=     8223.43324360094, -206639,      -199393
##LAST=      0,             -78070,          -217545
##MIN=       0,             -709350,         0
##MAX=       8223.43324360094, 467663578,    0
$$ Real data points
##PAGE= N=1
##DATA TABLE= (X++(R..R)), XYDATA
$$ [...]
19527A67299a24522k1976p3463H611a2137j15633p7473L2169k25568J2905J29360
19516b56377o8781A96693J33450f8711J2133E1488d8946J8586A9324b12297E34087
19504c73512I5078c27598j42294b19125B1150J3510R1469b40983B47570j5808
19494B31762A00547b99394J03418B67494j02235P8167a07150I156K5441a01467
19483C6824f4990E4790J42823p2321a12652B36798j3745J6822j09274b38057c2150
19471b28352A68624c9656j07284j22197J4163G9182e5068j34413D1604a65408
19460d5116j75351I7460i3876A76631f4646j899j64958M6136f5383B0261h4227
19448a22939K6213k10107F7078k4237J86118D3935b61613P8834c1427m33231d7835
$$ plain form
19527 167299 -124522 -146498 -219961 8611 -12137 -127770 -205243 -173074 -398642 -385737 -256377
19516 -256377 -325158 196693 330143 -68711 -56578 51488 -48946 -30360 19324 -212297 534087
19504 -373512 95078 -327598 -469892 -219125 21150 34660 126129 -240983 247570 231762
19494 231762 100547 -299394 -195976 267494 165259 243426 -107150 9156 34597 -101467
19483 36824 -64990 54790 197613 125292 -112652 236798 223053 239875 130601 -238057 -32150
19471 -228352 168624 -39656 -146940 -269137 -254974 79182 -55068 -189481 41604 -165408
19460 -45116 -220467 97460 -93876 176631 -64646 -66545 -231503 -185367 -65383 20261 -84227
19448 -122939 -96726 -306833 67078 42841 228959 43935 -261613 -182779 -31427 -464658 -47835
19436h0058F4836J03732e7612r9477d6821j30958L6514b1190K49A89098A5492
19424b9347A24735c03158J18716G7106a54871N3978H8505b69366G6665a11219
19413I3694b29580B10279E6701A7116b68201i3994K3004c487C3662d3996l4469
19402g8465j80643a07082j74154d3169j792p6792m44729a37290G1060b87841A14035
19390d519p0580k0685G1846f8487q0490b0557E46436b13043i3724j43588c9124
19378B39055I9162J31304g3113H7878b77700Q8184C26912D9340a08167A66789
19367G5428a15318d2184m76995e4461H3670b32471j9177H9605b3145k27050c6883
19355c1672A35067Q4709F5447d7905A48048d4068J9146A83306D1047b50070R3755
$$ plain form
19436 -80058 64836 168568 -57612 -157089 -46821 -177779 -141265 -21190 -20941 189098 15492
19424 -29347 124735 -303158 -184442 77106 -154871 -100893 88505 -269366 76665 -111219
19413 93694 -229580 210279 56701 17116 -268201 -93994 -70990 -3487 33662 -43996 -78465
19402 -78465 -259108 -107082 -281236 -43169 -44961 -121753 -566482 -137290 71060 -287841 114035
19390 -4519 -75099 -95784 71846 -68487 -148977 -20557 546436 -213043 -93724 -237312 -39124
19378 239055 99162 230466 -73113 87878 -277700 -189516 326912 49340 -108167 166789
19367 75428 -115318 -42184 -519179 -54461 83670 -232471 -251648 89605 -23145 -250195 -36883
19355 -31672 135067 219776 65447 -47905 148048 -44068 -24922 183306 41047 -250070 -156315
19344a56315B79300B3611h9607I2500j4418J44361H8619e8758H7837C4111e52641
19332b64687h5077J0648A46707j9689N3304b00280B51700j2830N2779g2779B42462
19320b0351k80158B07896L34543E9602R5706d5713A21565b88086J35440j48484
19310c01130J40048K2121p3318Q965a00618C12106a4099j78346n8453R5697D2836
19298a95306A1077b02791k0059m2678A12007l5007c4322j33618I5153J77261A1364
19286a05581A43094o512n3821M0073D0029J79402b76048D0779B724J49476A6771
19274D9775N4257a55788j10021C7152b99005E2796h2111J5086k92916A10279a65113
19262H2992a25744p7134j62981H4955j6312g6505l1392B97293H0278j9169b51488
$$ plain form
19344 -156315 279300 23611 -89607 92500 78082 222443 88619 -58758 87837 34111 -552641
19332 -264687 -85077 -74429 146707 127018 180322 -200280 251700 238870 291649 -72779 242462
19320 -20351 -300509 207896 542439 59602 155308 -45713 121565 -288086 -152646 -301130
19310 -301130 -161082 -138961 -212279 -203314 -100618 312106 -14099 -192445 -250898 -155201 42836
19298 -195306 11077 -202791 -222850 -265528 112007 77000 -34322 -167940 95153 272414 11364
19286 -105581 143094 136582 82761 122834 40029 219431 -276048 40779 2724 152200 16771
19274 49775 104032 -155788 -265809 37152 -299005 52796 -82111 -67025 -359941 110279 -165113
19262 82992 -125744 -202878 -365859 84955 68643 -76505 -107897 297293 80278 61109 -251488
19250I833K261K84984a99533G7151B9537a58323A0216b35308c8697o5490B2208
19238E4014E276a82320j7008R9094j48647O8557k67749A45986c1901j58816C0129
19226C9509J9794K47126j45083m0646K1982i2340k8844C88319c3501A8697J15993
19215A34690j257D7479d8073r3601C0646K12722F3939O9128a12326j36886h9721
19203A94197k3805g4167r0878j41702J9882B5742b99438A15382E6412f2652F6738
19191d01313J06907A59110b08240l07785b01075P5964N6135E8600a54911j5058
19181a69969B7670a24073A04507b26641o8344J23747J4395A70174c25250A07321
19170b59722a05893M9657I5710c00489F6025a89524f5473j96733P9202A41162
$$ plain form
19250 9833 12094 297078 -199533 77151 29537 -158323 10216 -235308 -38697 -104187 22208
19238 54014 5276 -182320 -199328 -100234 -248881 -180324 -448073 145986 -31901 -190717 30129
19226 39509 59303 306429 161346 120700 142682 -92340 -121184 388319 -33501 18697 134690
19215 134690 133433 47479 -48073 -141674 30646 243368 63939 133067 -112326 -249212 -89721
19203 194197 170392 -74167 -165045 -306747 -286865 25742 -299438 115382 56412 -62652 66738
19191 -401313 -294406 159110 -208240 -516025 -201075 -125111 -68976 58600 -154911 -169969
19181 -169969 27670 -124073 104507 -226641 -294985 -171238 -156843 170174 -325250 107321
19170 -259722 -105893 -56236 95710 -300489 66025 -189524 -65473 -262206 -183004 141162
19159B10706c37900I1625a47328A00161a15903o3950E049c44729f0797k13233
19149b74030C75810A14365O4277h0570p2033A967a4398l71294D5410a0700C05008
19137b8149A53644a26238B24956H170O1616A2748M9631P2488h1702k22662c4236
19125a69751A66633i102m9686A81617i5115G4816f1775k91172C04425r2724a41576
19113a77050F0944P4218C1712a73186h1319j01411p478A12485g1427K2940j257
19102d9744n9476j17257I0226b07073h48j21021o7750C17693d9116l8458j10731
19091a98305L814k2999F2065b25034B60461i9786k47726J72454L800r0818J17185
19080a44891B16478q0009b9801p9377F1557R2847I063a1744A99180l1415a27152
$$ plain form
19159 210706 -337900 91625 -147328 100161 -115903 -179853 5049 -344729 -60797 -274030
19149 -274030 375810 114365 178642 -80570 -152603 1967 -14398 -385692 45410 -10700 305008
19137 -28149 153644 -126238 224956 8170 69786 12748 62379 134867 -81702 -304364 -34236
19125 -169751 166633 -9102 -58788 181617 -95115 74816 -61775 -352947 304425 211701 -141576
19113 -177050 60944 135162 31712 -173186 -81319 -182730 -190208 112485 -71427 -48487 -49744
19102 -49744 -109220 -226477 90226 -207073 -848 -121869 -189619 317693 -49116 -87574 -198305
19091 -198305 -194491 -217490 62065 -225034 260461 -99786 -347512 -175058 -171258 -262076 -144891
19080 -144891 216478 136469 -29801 -109178 61557 154404 9063 -11744 199180 167765 -127152
19068B07451f2252m9552K1632j49566A6931a14243I9341b95995J21907F1319a91025
19056A47373J33687a68576P4800A22088P1266c43704A54233b21763L3781B41768
19045c68908J24669C01935I2420h3281k1128c1282A12298b12873A26586e6589
19034g5676o117J0266j08761f7253I1902H116a90853L3985a539A09972C4676j0063
19022B4613e32261a30837F5861a13388B825a71465L7061n287l474k3861j7035
19011a84061h2946H6152d97A60541b58517e8528H3882a41803A24721h1772L9772
19000d2000B05052r7946i8927A62038C1813g7645L1077j63975B23836I9799J40549
18989B40348b03746k46473i4634j07176c9745m3100A39363h6244j83234D5191
$$ plain form
19068 207451 -62252 -111804 -90172 -239738 16931 -114243 99341 -295995 -174088 61319 -191025
19056 147373 281060 -168576 -93776 122088 193354 -343704 154233 -221763 -187982 241768
19045 -368908 -244239 301935 92420 -83281 -104409 -31282 112298 -212873 126586 -56589
19034 -75676 -81793 -71527 -180288 -67253 91902 8116 -190853 -156868 -1539 109972 34676 24613
19022 24613 -532261 -130837 65861 -113388 2825 -171465 -134404 -139691 -143165 -167026 -184061
19011 -184061 -82946 86152 -497 160541 -258517 -58528 83882 -141803 124721 -81772 -42000
19000 -42000 205052 107106 -98927 162038 31813 -77645 -46568 -210543 223836 99799 240348
18989 240348 -203746 -450219 -94634 -201810 -39745 -82845 139363 -86244 -269478 45191
18978c51623a74321k3012C6435O0497f0355H5533a50517q3219J15482D340K03728
18967B08068L8500J2335D6231a80630A17958b63640O3134B2066a41806L2842D1580
18955e61043a21860j5687k63942C290g8040K3288B1152b57183N5920B33308l7332
18944A95976a88508b1520j45582C50931a76563B56639a64514j2768G8946b15551
18933i8858r8577q9174h3046B9840D386b1866k52842h2187B31175c56947C2702
18921A32703b40975p625H4959J7744B874a78147K5016o1419Q1638A15461d0259
18909c3904j76302D6358K12882i2877B2547a98276D7435b39525F34c18465A35063
18897A3125c40972a44605E3850b54905r9766B19492j00229K25963a18035A44260
$$ plain form
18978 -351623 -174321 -197333 36435 96932 -60355 85533 -150517 -233736 -118254 4340 208068
18967 208068 246568 258903 46231 -180630 117958 -263640 -200506 22066 -141806 -108964 41580
18955 -561043 -121860 -137547 -401489 3290 -78040 -54752 21152 -257183 -201263 233308 195976
18944 195976 -188508 -21520 -167102 350931 -176563 256639 -164514 -177282 78946 -215551
18933 -98858 -197435 -286609 -83046 29840 4386 -21866 -274708 -82187 231175 -356947 32702
18921 132703 -240975 -248600 84959 102703 2874 -178147 -153131 -214550 -132912 115461 -40259
18909 -33904 -210206 46358 259240 -92877 22547 -198276 47435 -239525 634 -318465 135063
18897 13125 -340972 -144605 53850 -254905 -354671 219492 119263 345226 -118035 144260
18886b30058I1002c09012L9338a28930k04466f2746J5256o615m8872b1874k42455
18875b64329A44238G951e0048r8655K4737j5301b326j00721d1281A86535A1361
18863h4160A40751n7551C5255c30959J31634A45820b48327A52833J9586b2600
18852a04123A76024H7189c00499E5324a58787C3166J06187a12355B38325A00540
18841D7709j8760L00019q0257F0393b27295j0605i8429J4406C12611G1376a77780
18829B3972c706A65803b36586N4953B55032a5711A9784K3649e5529G1792d10519
18817B53855j11502J12434B3972d1207l07642g9404B6794J5544k885K4943n926
18806E8470a79890f5546b6082A174d21636K01932A78496o4488E1194Q1146b73640
$$ plain form
18886 -230058 91002 -309012 -269674 -128930 -333396 -62746 -47490 -54105 -102977 -21874 -264329
18875 -264329 144238 7951 -50048 -148703 -123966 -139267 -2326 -103047 -41281 186535 11361
18863 -84160 140751 83200 35255 -330959 -199325 145820 -248327 152833 172419 -22600
18852 -104123 176024 87189 -300499 55324 -158787 33166 139353 -112355 238325 100540
18841 47709 28949 328968 248711 60393 -227295 -237900 -98429 -84023 312611 71376 -177780
18829 23972 -3706 165803 -236586 -181633 255032 -15711 19784 43433 -55529 71792 -410519
18817 253855 142353 254787 23972 -41207 -348849 -79404 26794 42338 39453 64396 58470
18806 58470 -179890 -65546 -26082 1174 -421636 -219704 178496 114008 51194 132340 -273640
18794a96281A94823a05134L2102j13662M6257k7804F4411b76395m7599b071B1441
18782c90797a40390K6416c9360A61198a3616j70064p299F7628I475a63270O5971
18771i7299C77084a20007L4028A89073a80785B1989a64596N5307a0495I453a6981
18759b58787ME6468b32165d526r0250B6954a13880n2792A86354g6037B79262a88036
18746a81444A43729D6545L00294c6846D4276Q4456c8009p4158C57126a30675B0585
18734b04102F1060R1831a66251b4413B61904c8794j89435Q5873J5743j2926m7701
18723a87240B69466a15430a6291m0456k60752A8144c0399j04014l12782B83342
18712c52274L7543m754H6905O5466b49129F5816a10809k6047f3144A49644J08861
$$ plain form
18794 -196281 194823 -105134 -73032 -186694 -140437 -168241 64411 -276395 -323994 -2071 21441
18782 -390797 -140390 -113974 -39360 161198 -13616 -183680 -190979 67628 9475 -163270 -97299
18771 -97299 377084 -120007 -85979 189073 -180785 21989 -164596 -109289 -10495 9453 -16981
18759 -258787 -258783 56468 -232165 -4526 -94776 26954 -113880 -166672 186354 -76037 279262 -188036
18746 -181444 143729 46545 346839 -36846 44276 128732 -38009 -112167 357126 -130675 20585
18734 -204102 61060 152891 -166251 -24413 261904 -38794 -228229 -142356 -126613 -139539 -187240
18723 -187240 269466 -115430 -16291 -56747 -317499 18144 -30399 -134413 -447195 283342
18712 -352274 -314731 -319485 86905 152371 -249129 65816 -110809 -136856 -63144 149644 258505
18701B58505a37360A77573q1044a81720j65844h8918j33508a2837n5234l51048
18691d19119I8968B1052P1030b16531A6616K18084C4217a14935j75349F1696b5640
18679a13021A92048a00320o9353D2340a96752D7471J92633b34936K4325h3971
18668b1423p9602F4104a49608A14708J27193i5402B27652l7421a20932A03433
18657A74172b33637C1550e8076i176j78649B53385i2566A31041a20422k01537
18647c21959b6461J1265k12460a3687A97322D743J67510c68705c640j25487B70659
18635a10332L4397A22106f28857h9060F31h5802B93809c44326A87124d463k67325
18624b71788e2552k47464a36225A96560e6446B90195a17556j415j78007j20170
$$ plain form
18701 258505 -137360 177573 96529 -181720 -347564 -88918 -222426 -12837 -68071 -419119
18691 -419119 98968 21052 92082 -216531 16616 234700 34217 -114935 -290284 61696 -25640
18679 -113021 192048 -100320 -169673 42340 -196752 47471 240104 -234936 -210611 -83971
18668 -21423 -101025 64104 -149608 114708 241901 -95402 227652 190231 -120932 103433
18657 174172 -233637 31550 -58076 -9176 -187825 253385 -92566 131041 -120422 -321959
18647 -321959 -26461 -15196 -227656 -13687 197322 4743 172253 -368705 -3640 -129127 270659
18635 -110332 -75935 122106 -628857 -89060 631 -85802 293809 -344326 187124 -4463 -271788
18624 -271788 -52552 -300016 -136225 196560 -56446 290195 -117556 -118971 -296978 -417148
18614d17148a14736A1390J24463E4048p12J82712j0380k5064a97915O0030A46662
18602C82414d0346B57533a83134a7466f693j57849I7567l0219O7822b64186C55723
18590A00222a73815L4384j99363e964r5756F286b31572J4885A39974D576J00753
18579A05329f841l0394E1644J90464D2815J36228f6139a7963k12331j93484N7634
18568c66144f5407K5482l08550b0656I6300a46569j74554J09851A5203L1747J3145
18557F0095b57891M3540A64875e7292j43419E77J186J26767m8896j9410j6215
18546D4009J24429D1431h3414k33880L2910g0747j52122A61395a90381D8199J0749
18535E8948K925J22681H1637a33923k27134B26883F3697J8271N4092b69447A30090
$$ plain form
18614 -417148 -114736 11390 135853 54048 53336 236048 225668 200604 -197915 -137885 146662
18602 382414 -40346 257533 -183134 -17466 -6693 -164542 97567 67348 135170 -264186 355723
18590 100222 -173815 -139431 -338794 -5964 -101720 6286 -231572 -216687 139974 4576 105329
18579 105329 -6841 -37235 51644 242108 42815 179043 -66139 -17963 -230294 -423778 -366144
18568 -366144 -65407 -39925 -348475 -20656 96300 -146569 -321123 -211272 15203 46950 60095
18557 60095 -257891 -214351 164875 -57292 -200711 577 1763 128530 79634 60224 44009
18546 44009 168438 41431 -83414 -317294 -284384 -70747 -222869 161395 -190381 48199 58948
18535 58948 61873 184554 81637 -133923 -361057 226883 63697 81968 136060 -269447 130090
18523A9311b32115f1485k02937B2057L01883e348j99736c2758B26316F19J4128
18512A4747a31517j3992K104I6665b61986b1875A1676a19548l753j14811a3614
18500F4501g9691B28702A7511f6471a127E2553a38824q3686d7105J3409o1542
18489i5238b6134B57757F0873J03957h479j81849C88359F7002c74610d8012j28321
18478a76333l5507j23862c3616j3261k5396q2365J0793c115l36810a15123K4195
18467i0928A71180a72515a3127B73989G2035J56222C7656L6648J6047a55690l22156
18456d77846a39936M4926B5832a28889a1940I4259b41757n1741j28252a45543
18445G627f6747e507A00765K24608a48982M2918a9495A66913B3139b58675E4917
$$ plain form
18523 19311 -232115 -61485 -264422 22057 323940 -5348 -205084 -32758 226316 619 14747
18512 14747 -131517 -145509 -143405 96665 -261986 -21875 11676 -119548 -123301 -238112 -13614
18500 64501 -79691 228702 17511 -66471 -1127 52553 -138824 -222510 -47105 -33696 -95238
18489 -95238 -26134 257757 60873 164830 -8479 -190328 388359 67002 -374610 -48012 -176333
18478 -176333 -211840 -335702 -33616 -46877 -72273 -154638 -143845 -3115 -339925 -115123 -90928
18467 -90928 171180 -172515 -13127 273989 72035 228257 37656 74304 90351 -155690 -477846
18456 -477846 -139936 -95010 25832 -128889 -11940 94259 -241757 -293498 -421750 -145543
18445 7627 -66747 -5507 100765 325373 -148982 -106064 -19495 166913 23139 -258675 54917
18433a58877E832J107i8882A12336M9715b44127a15311A18459m2955b77216E5667
18421b2208C226d6908H3075e3686K5650j40074A65933g5876n0728i770o2709r5061
18409a67540A6518a68157f2333j02926c2707F0191J50605a01308B378d837C3212
18397B74419D2542h6415l7819A44356b65232O2669A39520c71556P4919A4309O1095
18386G5404M8386B1213g6397p6699A77446F4233g6874A01437R7248a0173j6497
18375b6670A65275f5447B5091d7664D4248a6291k4693j81592A97953h8230B36654
18363A30370b31416C18914F3609c1952A0294b67832b1460M386j15213B57230e396
18351b61702a22232j50322J18004K0950D20227a60783a1612A07530d1366A07026
$$ plain form
18433 -158877 5832 6939 -98882 112336 162051 -244127 -115311 118459 75504 -277216 55667
18421 -22208 3226 -46908 83075 -53686 -28036 -168110 165933 -75876 -126604 -9770 -72479 -167540
18409 -167540 16518 -168157 -62333 -165259 -32707 60191 210796 -101308 2378 -4837 33212
18397 274419 42542 -86415 -124234 144356 -265232 -202563 139520 -371556 -296637 14309 75404
18386 75404 123790 21213 -76397 -153096 177446 64233 -76874 101437 198685 -10173 -26670
18375 -26670 165275 -65447 25091 -47664 44248 -16291 -40984 -222576 197953 -88230 236654
18363 130370 -231416 318914 63609 -31952 10294 -267832 -21460 -17074 -132287 257230 -5396
18351 -261702 -122232 -272554 -154550 -133600 420227 -160783 -11612 107530 -41366 107026
18340F2391a30507N075A50404h9023j5106n3830c4031E8731j6164A2240a0040
18328C5314h8800o946l96039D41286a63659A20922a35117A16886i9383B45613
18317G0322b43315C2431c50431A70255G7981b85127b3205G9176l2318O7351a52044
18305H2274i7398r1490D8308g6763E2878L3873K32241a31044A85925a5559A43848
18293c08839a14989A53745A7690L30613a72710m1672b1150k92362f9357A49605
18282b27940a0927G6138a71892B64769a38293n9734A79554b25098B91953a84441
18271a8057j06116r7189g4458D20013b90611D04942E3396e1290E7766g7874j7139
18260i5013k27191E0324a52060k1571B10065C2514m413L24994D8873J81188G6195
$$ plain form
18340 62391 -130507 -125432 150404 -89023 -104129 -157959 -34031 58731 42567 12240 -10040
18328 35314 -88800 -95746 -491785 441286 -163659 120922 -135117 116886 -99383 245613
18317 70322 -243315 32431 -350431 170255 77981 -285127 -23205 79176 46858 114209 -152044
18305 82274 -97398 -188888 48308 -76763 52878 86751 318992 -131044 185925 -15559 143848
18293 -308839 -114989 153745 17690 348303 -172710 -214382 -21150 -313512 -69357 149605
18282 -227940 -10927 76138 -171892 264769 -138293 -198027 179554 -225098 291953 -184441
18271 -18057 -124173 -221362 -74458 420013 -290611 404942 53396 -51290 57766 -77874 -95013
18260 -95013 -322204 50324 -152060 -173631 210065 32514 28101 353095 48873 230061 76195
18248a57103A01360a69874q6367d0463Q550H5545a20959E7288N8270j6598a71564
18236A32812i7543l367A04702C8218b2928j2644E8616a17802p2842m5047D26644
18224A1855h7166A28653L2250C8816J25415I717K28625c2253o4317j37553J06860
18213a27263E8577K89036B19J14734M4018b24356j39222e567k48028A15200b56632
18201G1992f8611l62957a42446F9382L15387b54041a08480b40C0647a03847j86892
18190b90739F902K1753J81776a27433N9309A84833a67739B59408b73245A25194
18179a01076n3198L9622A48007a02927B81056O2838c78625B7033J6707a25340
18168d9548j39850B65816h9838B43671j10383d07465h9502j65970A19567a55725
$$ plain form
18248 -157103 101360 -169874 -256241 -40463 -31913 85545 -120959 57288 115558 98960 -171564
18236 132812 -97543 -100910 104702 38218 -22928 -35572 58616 -117802 -190644 -235691 426644
18224 11855 -87166 128653 160903 38816 164231 9717 238342 -32253 -96570 -234123 -127263
18213 -127263 58577 347613 219 114953 158971 -224356 -363578 -5567 -253595 115200 -256632
18201 71992 -68611 -431568 -142446 69382 384769 -254041 -108480 -240 30647 -103847 -290739
18190 -290739 6902 28655 210431 -127433 -68124 184833 -167739 259408 -273245 125194
18179 -101076 -154274 -114652 148007 -102927 281056 343894 -378625 27033 43740 -125340
18168 -49548 -189398 265816 -89838 243671 133288 -407465 -89502 -255472 119567 -155725
18157E1844g1210L300q675B42810G7451J38014j9218p8456J58134b8458j86116
18146b14574g8881k61213C645g8517H3678C2784h1443C1935c21857I4674K2304
18135A16978d3973l2143B7131h0405h055j73468n439f1951l8294B03520c58298
18123B8637c25636A29690h226B27943b61589d6661j11753G7173K50314A19105
18112i4626G7928a54582A50790b05042g59D0475j5185a68676m1554a7172m8248
18101f5420j59094k6077A06240l2006a19081D4116P166k2480g1923J1384j65090
18090b25629B90159A1726a8995r4796c477D6998O274e3687l84633A69341a13419
18078a21928B6328b08528l4984N1399B34384a25695r5569D6496j5443b3731k31666
$$ plain form
18157 51844 -71210 -67910 -76585 242810 77451 215465 196247 117791 275925 -28458 -214574
18146 -214574 -78881 -340094 3645 -78517 83678 32784 -81443 31935 -321857 94674 116978
18135 116978 -43973 -76116 27131 -80405 -8055 -181523 -186962 -61951 -100245 203520 -358298
18123 28637 -325636 129690 -8226 227943 -261589 -46661 -158414 77173 327487 119105
18112 -94626 77928 -154582 150790 -205042 -759 40475 25290 -168676 -210230 -17172 -65420
18101 -65420 -224514 -250591 106240 74234 -119081 44116 51282 28802 -71923 -60539 -225629
18090 -225629 290159 11726 -18995 -113791 -3477 46998 53272 -53687 -438320 169341 -113419
18078 -121928 26328 -208528 -243512 -192113 234384 -125695 -221264 46496 31053 -23731 -255397
18067b55397d9238J6870j65973k3788C8798h2064m108A80751a38973B663c37901
18055e3302r5419O9983c1553l73087e0448j25041m4526O7881b9433D6638h2854
18043A75954a28415j55819c4594k13080d1028B03970I7734j7705d1873k28468
18033b70341h7342B18525B3120a72988L9537G7878i3431L3230j08D9077c37012
18021b7104C04156e0761A21633B491R716b69822d3096k56052a42810E3900L4024
18010H7924a10811A64804J7353d8344J413D5062a95301G2325h4942D30276m2728
17999C87548a63808p466Q4248K375L5745B29459h3215A26343i9589C9087L2473
17988G1560e4105j66680A30433h4482p9741j1249r6427A06241D7692K1958f8735
$$ plain form
18067 -255397 -49238 -32368 -198341 -222129 38798 -82064 -86172 180751 -138973 2663 -337901
18055 -53302 -148721 -78738 -31553 -404640 -50448 -175489 -220015 -152134 -29433 46638 -82854
18043 175954 -128415 -284234 -34594 -247674 -41028 203970 97734 80029 -41873 -270341
18033 -270341 -87342 218525 23120 -172988 -133451 77878 -93431 -60201 -60309 49077 -337012
18021 -27104 304156 -50761 121633 2491 12207 -269822 -43096 -299148 -142810 53900 87924
18010 87924 -110811 164804 182157 -48344 -46931 45062 -195301 72325 -84942 430276 387548
17999 387548 -163808 -171274 -87026 -84651 -48906 229459 -83215 126343 -99589 39087 71560
17988 71560 -54105 -220785 130433 -84482 -164223 -175472 -271899 106241 47692 69650 -68735
17976A13994L03583B3565a06383o377H1355d170q2988j99268J30470k1155h566
17964I1178B3304c2494A39490k9723a90754A3356a98447O5639e5913A8048J47056
17953A65104l3102a01023j3849o7547A06489e3520l8458A47918A2243J85029F3339
17941F0821e5300k08037M5632h0529E2468J3575a00561I9693J9389L2857a86387
17929B61429b02953A3359a15947E4129A2137J50219b12937a01428l308k14717
17919c19453J17790d1429A3473J82215B6291J23659n9570j7509b3363a0245k37412
17908b47657A11627a21929a8064j02313C7605r594f9544c3622A01898f3056l5211
17897i8267I3061J81993a89743F3798J70491J5871l4007O6943a75957B9458b45124
$$ plain form
17976 113994 417577 23565 -106383 -112760 81355 -4170 -87158 -286426 -155956 -177111 -8566
17964 91178 23304 -32494 139490 109767 -190754 13356 -198447 -132808 -55913 18048 165104
17953 165104 132002 -101023 -114872 -182419 106489 -53520 -91978 147918 12243 197272 63339
17941 60821 -55300 -263337 -217705 -80529 52468 66043 -100561 99693 119082 151939 -186387
17929 261429 -202953 13359 -115947 54129 12137 162356 -212937 -101428 -104736 -319453
17919 -319453 -201663 -41429 13473 195688 26291 149950 90380 72871 -23363 -10245 -247657
17908 -247657 111627 -121929 -18064 -120377 37605 28011 -69544 -33622 101898 -63056 -98267
17897 -98267 93061 275054 -189743 63798 234289 250160 216153 283096 -175957 29458 -245124
17885a08360B39782n3685f7321j9742K5625C89623a22915p4186c0343G2512A6220
17873d6592j37335C04513I9481c6059A74416J80708g0440Q108J9121p2200B05941
17861H6557a78498B25918P8901i2286A75247a9552A11352K4152J44401C1670A955
17849a28282A30632b38587H2966h2895k83531B16460A03912a35406A7840K4025
17839D1865f9455A13990c4483f185C9518a4158B89872a43569O1091B49725G9188
17827G5903b03635M572I6805J720J49645j14231b65812A88719K9630D5078g4328
17815c11840A35637a16436I358k429J30483a25973b9833C84125a94376a2518B9172
17803A21321J25923i9072A2544M9540L0199b136k07559I3226i9932j31282B97629
$$ plain form
17885 -108360 239782 186097 -67321 -87063 -61438 389623 -122915 -197101 -30343 72512 16220
17873 -46592 -183927 304513 99481 -36059 174416 355124 -70440 -62332 -43211 -115411 205941
17861 86557 -178498 225918 304819 -92286 175247 -19552 111352 135504 279905 31670 1955
17849 -128282 130632 -238587 82966 -82895 -366426 216460 103912 -135406 17840 41865
17839 41865 -69455 113990 -34483 -6185 39518 -14158 289872 -143569 -82478 249725 79188
17827 75903 -203635 -199063 96805 98525 248170 133939 -265812 188719 218349 45078 -74328
17815 -311840 135637 -116436 9358 6929 137412 -125973 -29833 384125 -194376 -12518 29172
17803 121321 247244 -99072 12544 62084 92283 -2136 -209695 93226 -99932 -231214 297629
17791a7442B4472b03198p8088B45319i9989A77520J11017d6381A48957d23592
17780a44544N7939A9670c04448E354g8909A03419B4841J12305L77120a34226k10220
17769c44446a72004d4917A32334J00525a82160A27122D9759O9151J68724H9333
17758B0343b82777a10973q5158B56483q0302d5187A9275a50964j73175D3785K71718
17747C15503a7103A18397A8256b93626A22584a67752b6158m62087A67440a8780
17736A08644J92141g4473l3011B58754b76852G6979L06590j43882A4624i2298
17725I3921a6839D6817k143b2906H3973b95958j20692I6494a41294k1782n797
17714a68873H538b25502c6875B3547K45319c9137L879N5C07674f5405I7452A49
$$ plain form
17791 -17442 24472 -203198 -281286 245319 -99989 177520 288537 -46381 148957 -423592
17780 -144544 -86605 19670 -304448 5354 -78909 103419 24841 137146 514266 -134226 -344446
17769 -344446 -172004 -44917 132334 232859 -182160 127122 49759 118910 287634 89333
17758 20343 -282777 -110973 -196131 256483 176181 -45187 19275 -150964 -324139 43785 315503
17747 315503 -17103 118397 18256 -293626 122584 -167752 -26158 -488245 167440 -18780
17736 108644 300785 -74473 -107484 258754 -276852 76979 383569 239687 14624 -92298
17725 93921 -16839 46817 44674 -22906 83973 -295958 -416650 96494 -141294 -163076 -168873
17714 -168873 8538 -225502 -36875 23547 268866 -39137 -35258 -35203 307674 -65405 97452 149
17701c5383C25364A49444b19285A42841A804a26877k202a4437A3917i139C35756
17689b35597D32214b0425A61945E3678e5481k55583A61222G8200b34865F1858
17678a47299a2154B68283B8205j0669F190J38774f8665k27708Q263C88106J0005
17667C98111a9174o1520A00633a25507H8190I095i8772j16191f1206n1101j04886
17656b17193K8500O3534E8579b14225b630A74730E4362L05817a29993M2239j00393
17645a88147k9289B65500E9855h0151A12222B3672a57889c0185m5312j96563N9431
17634b12629b1592B1617J37741b31423f1174B23645b8218j10881A86862i4881
17623d9699a6486n7653k07451B40860I427e8200A56522a12915B60818b43829G5914
$$ plain form
17701 -35383 325364 149444 -219285 142841 1804 -126877 -129079 -14437 13917 -9139 335756
17689 -235597 432214 -20425 161945 53678 -55481 -311064 161222 78200 -234865 61858
17678 -147299 -12154 268283 28205 17536 6190 144964 -68665 -296373 -288110 388106 398111
17667 398111 -19174 -80694 100633 -125507 88190 9095 -98772 -214963 -61206 -112307 -217193
17656 -217193 -188693 -125159 58579 -214225 -2630 174730 54362 360179 -129993 -87754 -188147
17645 -188147 -217436 265500 59855 -80151 112222 23672 -157889 -30185 -75497 -272060 -212629
17634 -212629 -21592 21617 159358 -231423 -61174 223645 -28218 -139099 186862 -94881
17623 -49699 -16486 -74139 -281590 240860 9427 -58200 156522 -112915 260818 -243829 75914
17611g7298C92971d2235A98652a21640H3432J34014b9198j9348a9334A12700b44303
17599G4310c12646i8095l45644B65435A4079N6450L9107b4766p0474A49225J10223
17588B59448a03202p7664C71116b33056k5094a1745A71410p3549J9147c5135D1841
17576G2609M9544b27427e8815j13122G457Q6076j6044i2141A31176D4554g5088
17564B10326B9043K18219H5277Q0200J5843K04221b24624P7050A17458b6727I1593
17552a83767A91727J17133I477K28237r3788J57332D3886e16684B96863q0444
17542B16419d3768A07194J18281D0992e1694H727M8075a7085H7964i9204m8659
17531a47863A49198b05685D2472f9064B16688a94610B9636i4149D18287B05023
$$ plain form
17611 -77298 392971 -42235 198652 -121640 83432 217446 -29198 -48546 -19334 112700 -244303
17599 74310 -312646 -98095 -443739 265435 14079 70529 109636 -24766 -95240 149225 259448
17588 259448 -103202 -180866 371116 -233056 -258150 -11745 171410 97861 117008 -35135 41841
17576 72609 122153 -227427 -58815 -171937 7457 93533 77489 -92141 131176 44554 -75088
17564 210326 29043 247262 85277 165477 181320 385541 -224624 -147574 117458 -26727 91593
17552 -183767 191727 308860 9477 237714 143926 301258 43886 -516684 296863 216419
17542 216419 -43768 107194 225475 40992 -51694 8727 56802 -17085 87964 -99204 -147863
17531 -147863 149198 -205685 42472 -69064 216688 -194610 29636 -94149 418287 205023
17520H9030d2254O461n4113l32482C34379c8094B00427j6315J29309A33828a51642
17508g223A70874A949q72h4663B01973c75731i2905I9672J73140A31862a47730
17496e4406E8981a35927A37435n6365B151K25008n7780H0440f838B2539J21640
17485A44179J0531h7988f622A72245O1127D6844K78030j3677o3209A21979J39119
17474B61098M1112j47796G397a00901F0896J59777a94333C6953l656J68562h6014
17462A8349J55507A7595K99380j40302i3163B7731K58522F0294g1900D75150c5947
17450A40740D4075L20588A11797O4480L1353J0079J75093m3216H9936O0573l3206
17439A17303M395K99953j78486D1896L2233d6878D48939c1243F7843L52684F9117
$$ plain form
17520 89030 -42254 -35793 -89906 -422388 334379 -38094 200427 184112 313421 133828 -151642
17508 -7223 170874 1949 1077 -84663 201973 -375731 -92905 99672 272812 131862 -147730
17496 -54406 58981 -135927 137435 81070 2151 227159 169379 80440 -6838 22539 144179
17485 144179 154710 -87988 -6622 172245 233372 46844 324874 311197 247988 121979 261098
17474 261098 302210 154414 7397 -100901 60896 220673 -194333 36953 33297 201859 -86014
17462 18349 173856 17595 316975 176673 -93163 27731 286253 60294 -71900 475150 -35947
17450 140740 44075 364663 111797 176277 207630 217709 392802 349586 89936 150509 117303
17439 117303 121698 421651 243165 41896 74129 -46878 448939 -31243 67843 420527 69117
17427G6780J03555J97768j29282I6992K23567E2296K71228j61714J48060r1054
17417B18816b93B69662J32711m2634A43276K56291m5803A54467c207B77489I5782
17405B25737g5875k38184D58886d1432A78471J67831j13890A04142K0011a41809
17394B21335J5766r8183o303k6955a33954E0557P2924J88503L24A54778b520A63923
17381b61032A53143c1957E0438o544J34116H105M04683I0058Q5090J73604A21481
17369a2566m1015C17435a39900c5097A98537K26692j96017a9213B33739k4843
17359B08896i7539C87784A76585J5546q2865J13960B3403L54138A85533q6596
17349I8937K20559F924N332a88521m0476A58548L8267a20802C44958G6925K29591
$$ plain form
17427 76780 180335 378103 248821 96992 320559 52296 323524 161810 309870 218816
17417 218816 -293 269662 402373 359739 143276 399567 353764 154467 -3207 277489 95782
17405 225737 -75875 -314059 458886 -41432 178471 346302 232412 104142 124153 -141809
17394 221335 237101 138918 132615 105660 -133954 50557 123481 311984 312308 154778 -2520 163923
17381 -261032 153143 -31957 50438 43894 178010 8105 412788 90058 175148 348752 121481
17369 -12566 -53581 317435 -139900 -35097 198537 425229 229212 -19213 233739 208896
17359 208896 -97539 387784 176585 192131 109266 223226 23403 377541 185533 98937
17349 98937 319496 6924 12256 -188521 -228997 158548 196815 -120802 344958 76925 306516
17338C06516A25773K53578j82682q8796K47156a7377j14894A67299b7783A11544
17327H1579N30117A29634O9868h4561A3599K73360l6171P2820b42260B26929q7654
17316A39275K49675j74208J3726q6856J09307e0319B22393L6530A22918L9827
17306A62745b3745B51469J22102B5148L3533O6556i5769C07308d2430A77293p5548
17295A01745K7524e2099B35456N9121A05187b0634j57852H5945j784L28974j81834
17284B31301M8987D9903J50971r0177K2991J80719J43141l9568a16490A20583
17273a13230f171A09195J08494R5553D2323K29961c5546D64273A39040N5287b0452
17261A80606K68224k18478a00486A94942J14199I2425c7173E4396J09863J30726
$$ plain form
17338 306516 125773 379351 196669 107873 355029 -17377 -132271 167299 -27783 111544
17327 81579 611696 129634 199502 -84561 13599 286959 250788 323608 -242260 226929 139275
17316 139275 388950 214742 228468 141612 250919 -50319 222393 258923 122918 162745
17306 162745 -23745 251469 373571 25148 58681 125237 -95769 307308 -42430 177293 101745
17295 101745 129269 -52099 235456 294577 105187 -20634 -178486 85945 84161 413135 231301
17284 231301 280288 49903 200874 110697 133688 314407 457548 417980 -116490 120583
17273 -113230 -6171 109195 217689 313242 42323 272284 -35546 464273 139040 194327 -20452
17261 180606 448830 230352 -100486 194942 309141 92425 -37173 54396 164259 294985
17251B94985g8861D6715J85952N2764m73L4851b9008A36050N3462m9367L29332
17240D69477n0638j40399A37220a94229P3274a8552C23316K53597c217m269K033
17229e453B10676I1271L87588A52476O014F4379K49547I9758M7602o6422a9418
17217A05025K87329j74293J73581q6494H9309P8588B3128J45695k7759O1069H0754
17205B44137a21342e5272A63605k750J85398J05388D6177J76289E6735P05945
17195G62680B75215m4836J74334j41971E7294L85915N7588B29786A09412R5463
17185B04875K02026k02148c2461C72708j08013J775A31572K66070j02376o9111
17175B26155D0359J12957M72119j31974B43532m7656K71827j16176E0143J45268
$$ plain form
17251 294985 -78861 46715 232667 285431 284958 319809 -29008 136050 189512 140145 469477
17240 469477 418839 278440 137220 -194229 -120955 -18552 323316 576913 -3217 -7486 -5453
17229 -5453 210676 91271 478859 152476 158490 64379 313926 99758 147360 80938 -19418
17217 105025 392354 218061 391642 305148 89309 167897 23128 168823 141064 202133 80754
17205 244137 -121342 -55272 163605 160855 346253 451641 46177 222466 56735 762680
17195 762680 275215 230379 404713 262742 57294 443209 500797 229786 109412 204875
17185 204875 406901 204753 -32461 372708 264695 266470 131572 397642 295266 226155
17175 226155 40359 153316 625435 493461 243532 195876 467703 351527 50143 195411
17165A95411L39635Q5133A72615L38264A32710N10096E2521L30009j58593K98738
17155E22675j54608J28735K03779B75536a31934C34439K11834k49149N897Q916
17145C11937J42125A04188p112J29319K89650m3365k12496m5747o587K49327N1876
17134E09053r1909J5671J06373j66328l6825O5653a2220A14932N37972B72690
17123D02687j5483j39602J01475j9965J34075j79693A5577K59962J32426L4912
17113D42877j51751j02497M44743j11160j18533L7332o5752D3548N23839J5813
17103E83200B70706f3502F13820A92348L64113j97558q7182n3074P9948K56303
17093E54898M9048j75228q82J6221J60287l3951j96066j66062K20831M18411l88962
$$ plain form
17165 195411 535046 620179 172615 510879 132710 642806 52521 382530 223937 522675
17155 522675 368067 496802 700581 275536 -131934 334439 546273 297124 303021 311937
17145 311937 454062 104188 97076 226395 516045 472680 260184 214437 207850 457177 509053
17134 509053 417144 432815 539188 372860 336035 401688 -12220 114932 652904 272690
17123 402687 387204 247602 349077 329112 463187 283494 15577 275539 407965 442877
17113 442877 291126 188629 633372 522212 403679 441011 375259 43548 567387 583200
17103 583200 270706 -63502 613820 192348 556461 358903 271721 218647 298595 554898
17093 554898 603946 428718 427836 444057 604344 570393 374327 208265 429096 847507 458545
17082D58545Q7736N0873k86830K08K28355k12782J18484J57508k1920l2816j6102
17071E31259j50182N0293A97969Q5385K07715j6925K1666N8976B19305L57476
17061E76781k62153M6019K2291j9489J61215J22774B36129L07594j9734J15300
17051F39289q1154J9452j59991K77233j60402A75556M87946j11054q3116j03954
17041C65378K28837k14434L31157k03457m7435K1930j13320R8356L6613J52206
17031F55831k33370q664J44776j60985J04193J35443j40550B43981P29680k60428
17021G13233k10256O7157j02325K74485k87152k8377O35607k85024j31513j09935
17011E35900l2429R3476j07301K79947Q4574k63084o3427L72410k75280P6773
$$ plain form
17082 458545 546281 597154 310324 310532 538887 326105 444589 602097 580177 547361 531259
17071 531259 381077 431370 197969 283354 491069 474144 495810 554786 219305 576781
17061 576781 314628 360647 382938 363449 524664 647438 236129 543723 523989 639289
17051 639289 558135 577587 417596 694829 534427 175556 663502 552448 469332 365378
17041 365378 594215 379781 710938 507481 460046 481976 368656 467012 503625 655831
17031 655831 422461 413797 558573 397588 501781 637224 496674 243981 973661 713233
17021 713233 502977 570134 467809 742294 455142 426765 1062372 777348 645835 535900
17011 535900 503471 596947 489646 769593 854167 591083 527656 900066 624786 701559
17001G01559n8780L7608l3273K71695k23896R5865P0878j57418k13258O22435
16991A113415m38629p2004J8882K79551j73210j483J75396k28842r4262L43756
16981I22570k0788K23032n21744L07968M5220r5252M0656K60808P2030j35608
16971A098892L264j20223j81061K06391k80673K47485m3787l61815N02991K98180
16961A369644m00513q3099j81206M52207l9249j41451L05223l37414j67518K96592
16951A073216J31829l10883L30504j10188j52436J49675j7231J01863j34632L70380
16941A432097l01033l34590K91511O3480J21278p9895k84290M20244J22875k73326
16931A178351J05008j8985J00169k5791R4730l15311L10634j45064k5213J33941
$$ plain form
17001 701559 642779 680387 647114 918809 694913 790778 861656 704238 490980 1113415
16991 1113415 674786 602782 621664 901215 728005 726522 901918 673076 578814 922570
16981 922570 901782 1124814 603070 911038 956258 861006 901662 1162470 1234500 1098892
16971 1098892 1102156 981933 800872 1007263 726590 974075 930288 568473 1071464 1369644
16961 1369644 969131 886032 704826 1157033 1117784 976333 1281556 944142 776624 1073216
16951 1073216 1205045 894162 1224666 1114478 962042 1111717 1094486 1196349 1061717 1432097
16941 1432097 1131064 796474 1087985 1151465 1272743 1192848 908558 1328802 1451677 1178351
16931 1178351 1283359 1264374 1364543 1338752 1433482 1118171 1428805 1283741 1258528 1392469
16921A392469j52940K10775q6168n0127j13208K52324j14546K52844k43038L71264
16911A719649p6942m4879K18936l99838J93386K85281l95148K65008l8883j35241
16901A591329j69754M05492m8516m656K3435p42j36809K97694K51624l65675K22585
16890B066007l72902M04212l49714L55724n38550M93791K57422m64353N80067
16881B431704l12478K36690l99181K19943l86619L6691K95249R558N4615l6381
16871B149791J74765J9550L07946k68252R3863L28578n87747M67757k53864J89876
16861B622263k111j0252J69213j08739Q1478L83131l09427K63729J03946l25396
16851B867835O8636L41552n5731K53215m66116K5278L74652l0936j4623L8139
$$ plain form
16921 1392469 1239529 1450304 1364136 1314009 1200801 1453125 1338579 1591423 1348385 1719649
16911 1719649 1642707 1597828 1816764 1416926 1610312 1895593 1500445 1765453 1726570 1591329
16901 1591329 1421575 1827067 1778551 1773895 1797330 1796588 1659779 1957473 2209097 1843422 2066007
16890 2066007 1693105 2097317 1747603 2103327 1564777 2058568 2315990 1851637 2431704
16881 2431704 2119226 2355916 1956735 2176678 1790059 1826750 2121999 2131557 2186172 2149791
16871 2149791 2324556 2344106 2652052 2383800 2477663 2806241 2218494 2686251 2432387 2622263
16861 2622263 2620152 2609900 2779113 2670374 2751852 3134983 2825556 3089285 3193231 2867835
16851 2867835 2936471 3278023 3222292 3475507 3009391 3034669 3409321 3378385 3363762 3401901
16841C401901N16163l1488l35040Q5712L07741N8658p9235M12585m5414k37164
16831D054419N03351l61513K28141K83693J50991j92102J26323j20950N270L54398
16821E032021K82594o4715j2920n0344K64527J52760k98004O22096m62819P1297
16811E536493N81066J47376J11060J50674j33529N24352j28213K24743J43536
16802G157558K66319j42131O11606K73253j5213k1835J68519L58534K45476L854
16792H905940N66469K13539j91228M97412M70101K31090o7001Q02751L2351j81253
16782A1280171N32128P19764L40427N04905P1709L46212M22923J64097O26072
16773A5008408N44768Q52915L92363M60357M85685N88958P79869O48933J279817
$$ plain form
16841 3401901 3918064 3886576 3551536 3637248 3944989 4003647 3924412 4336997 4291583 4054419
16831 4054419 4557770 4196257 4424398 4708091 4859082 4666980 4793303 4672353 4677623 5032021
16821 5032021 5314615 5249900 5236980 5186636 5451163 5603923 5305919 5928015 5465196 5536493
16811 5536493 6117559 6264935 6375995 6526669 6393140 6917492 6789279 7014022 7157558
16802 7157558 7423877 7281746 7893352 8166605 8151392 8129557 8298076 8656610 8902086 8905940
16792 8905940 9472409 9685948 9494720 9992132 10462233 10693323 10626322 11429073 11461424 11280171
16782 11280171 11812299 12532063 12872490 13377395 13449104 13795316 14218239 14382336 15008408
16773 15008408 15553176 16406091 16798454 17258811 17744496 18333454 19113323 19762256 21042073
16764B1042073M45896N57424Q92070M94430J266324J101593J121222P63140J173512
16755B8857684J304881J320296J251978J572503J463866J664857J811442K010493
16747D1258000K107096J843019K435008K767080K528117K741144K897272L175998
16739F1752734L197404L994413M200307M460307M217413N081321N180928N625524
16731I7710351N924196O162560O587470O684392P157205P253657P770772P336515
16723A52587118P343111P825203O670914N989076N711089M062739L260773K079368
16715A95529391J295982o12021k092220k888317m500981n205617n874764o658939
16707A68992514p152554p482541p910912p403356p727491p260995o845118p072279
$$ plain form
16764 21042073 21487969 22045393 22937463 23431893 24698217 25799810 26921032 27684172 28857684
16755 28857684 30162565 31482861 32734839 34307342 35771208 37436065 39247507 41258000
16747 41258000 43365096 45208115 47643123 50410203 52938320 55679464 58576736 61752734
16739 61752734 64950138 68944551 73144858 77605165 81822578 86903899 92084827 97710351
16731 97710351 103634547 109797107 116384577 123068969 130226174 137479831 145250603 152587118
16723 152587118 159930229 167755432 174426346 180415422 186126511 190189250 193450023 195529391
16715 195529391 196825373 196213352 194121132 191232815 186731834 181526217 175651453 168992514
16707 168992514 161839960 154357419 146446507 139043151 131315660 124054665 117209547 110137268
16699A10137268o379224o558261n569018m996509n226496m902906m377454m025303
16691F8102097l467118l879660l161016l253875k884029k752678k321798k527571
16683D3854352k114752j986209k145561j515986j499342j701100j898827r02982
16675C0089593j438251j056089j218864j294961k71863j467524p74006q84154
16667B1683881j279711q6405j244784l23227p16531n88580q58245k88054j243571
16658A5054773j07358q1944o88671o05964L7451r14545j37780m27015k81941j60998
16648A1686008q44495R3210m51018m62424l8322n11305R8634n81113j00568m51718
16638H436889r419k94656m37161P1131k32237j03680k44971m9085o9898k37368
$$ plain form
16699 110137268 103758044 97199783 91630765 86634256 81407760 76504854 72127400 68102097
16691 68102097 64634979 60755319 57594303 54340428 51456399 48703721 46381923 43854352
16683 43854352 41739600 39753391 37607830 36091844 34592502 32891402 30992575 30089593
16675 30089593 28651342 27595253 26376389 25081428 24809565 23342041 22568035 21683881
16667 21683881 20404170 20317765 19072981 18749754 18033223 17444643 16586398 16298344 15054773
16658 15054773 14947415 14865471 14176800 13570836 13608287 12693742 12555962 12128947 11847006 11686008
16648 11686008 10841513 10934723 10483705 10021281 9982959 9471654 9570288 8989175 8888607 8436889
16638 8436889 8427470 8132814 7695653 7766784 7534547 7430867 7185896 7136811 7066913 6829545
16628F829545j74223k94826J41470o81424N5850J86241m33117p5354k5939L7449
16618E565672l6762k52438k29652J6291n00100J29275K37748l16539j34787N23919
16608E002627p11546j62461O8116r7702k36179K1249q4514k31332J50150l17903
16598C400505K48730O9576j05735m53391P5205k41393J42666M7760j99899j6924
16588B967100j62569K10736P770k1105k09567o3868J69271j4089J23241n42332
16578B464588J29014n5257J86040m0290l52638q4971M3021J74867j81096K9197
16568B312475j80432K16430l02174j15540J82026J21535k38520k4234R5519k12814
16558A854271j13710M22787j53463N782k85928K81746q8084k9345j55503o5597
$$ plain form
16628 6829545 6655322 6360496 6501966 5820542 5876392 6062633 5629516 5554162 5528223 5565672
16618 5565672 5528910 5276472 5046820 5063111 4563011 4692286 4930034 4613495 4478708 5002627
16608 5002627 4291081 4128620 4196736 4099034 3862855 3884104 3799590 3568258 3718408 3400505
16598 3400505 3649235 3718811 3613076 3159685 3234890 2993497 3136163 3183923 2984024 2967100
16588 2967100 2804531 3015267 3023037 3001932 2792365 2728497 2897768 2883679 3006920 2464588
16578 2464588 2593602 2538345 2724385 2684095 2331457 2246486 2289507 2464374 2283278 2312475
16568 2312475 2132043 2348473 2046299 1930759 2112785 2234320 1995800 1971566 2067085 1854271
16558 1854271 1740561 2163348 2009885 2015667 1729739 2011485 1923401 1894056 1738553 1672956
16548A672956o3384M9883l60004K52962N81857m57989m9317R4009m46279K66855
16538A541549j9724R3864j92836K20145j5424L2254J61812l87956J7940l31630
16528A119994L48362k4936l6587O6363R3534l28960M06038l72141l13832L83307
16518A341142L3239j515l38958M6410L31739j55878k2968n1482J8719k34296J18349
16507A084501m8760K36038J7787j14995m1138J58776o7449k34530J24923k07705
16497I07448k71469N07332J03134p5121j94607J09243j94732k4404K45142J4933
16487A126899l25152L52338l32994P2571o037j4367N5480J48689k64611J80574
16477I93390J69974l52948j90038M18047j78902r0859M5694J05147J23733j54926
$$ plain form
16548 1672956 1609572 1659455 1299451 1552413 2134270 1676281 1626964 1720973 1274694 1541549
16538 1541549 1521825 1615689 1422853 1642998 1627574 1659828 1821640 1433684 1451624 1119994
16528 1119994 1468356 1443420 1406833 1473196 1566730 1237770 1643808 1271667 957835 1341142
16518 1341142 1374381 1372866 1033908 1080318 1412057 1256179 1233211 1181729 1200448 966152 1084501
16507 1084501 1035741 1271779 1289566 1174571 1133433 1292209 1224760 990230 1115153 907448
16497 907448 635979 1143311 1246445 1171324 976717 1085960 891228 866824 1111966 1126899
16487 1126899 801747 1154085 821091 893662 887625 873258 928738 1077427 812816 993390
16477 993390 1163364 810416 620378 1038425 859523 768664 814358 919505 1043238 888312
16467H88312j95864K37627n8920k46684K81025j98573J93757K14962n07525j44992
16457D63125K35800K74040k95725J47280j96058L88515C76624L39456J60974q1874
16447G95180C93196K44831n5788J08439J11888C93682K74408q1003J69613B79412
16436A022812m31027J29065l24320L20892j9017M552B86565J28627J64074j2139
16426E67127K39210C25052M03614o4587r2216q601J36340k87038J12408J51727
16416F76699C32041l7432L32131n0426J07868j24407j18123K6399N8923j75830
16406C51144M3116K43587P165p0684j66472J87085j14031k1334P4099L0755Q9302
16395F53732j67769k8697K34468j98589K43083k13041O1502j38014j4789K15806
$$ plain form
16467 888312 692448 930075 871155 624471 905496 706923 900680 1115642 608117 463125
16457 463125 698925 972965 677240 824520 628462 1016977 376624 716080 877054 795180
16447 795180 393196 638027 582239 690678 802566 393682 668090 587087 756700 279412
16436 1022812 591785 720850 396530 717422 698405 702957 286565 415192 579266 567127
16426 567127 806337 325052 728666 664079 571863 563262 699602 412564 524972 676699
16416 676699 332041 294609 626740 576314 684182 559775 441652 468051 526974 351144
16406 351144 394260 637847 645012 574328 407856 594941 480910 459576 533675 564430 653732
16395 653732 485963 457266 691734 493145 736228 523187 584689 446675 431886 647692
16385F47692k4233L7161B15615J60432p1515o0195R5992j3162K85108j20396G3518
16373D14914P1115p6403A23363J22483L09928k55244L1892A39428J70345M23108
16363G32881j3427j62012A49266L07725j20280R3575r5334p8726K33511k22734
16353B67003J25069A35747K63069j21468j9815M1881n154J33798m6468G5917O99630
16342G75547C56383m8133L06079k6498k67204j0558r5634K47645a13275F51335
16331E0862c7452E28298j18597p7179j49287M8749J30910j45842J66621j00015
16321B83658o9967L28189B53823a6090C19624J72666j87987M33657B59303N9710
16311C19013L76069A44521L34354a77F93357B96751J81196a7418B36926A02759
$$ plain form
16385 647692 623459 660620 215615 376047 304532 244337 340329 327167 612275 491879 73518
16373 414914 486029 409626 123363 245846 555774 300530 332422 139428 309773 732881
16363 732881 719454 557442 149266 456991 336711 430286 334952 256226 489737 267003
16353 267003 392072 135747 398816 277348 257533 299414 294260 428058 381590 75917 775547
16342 775547 356383 308250 614329 587831 320627 310069 214435 462080 -113275 651335
16331 50862 -37452 528298 409701 332522 183235 231984 362894 217052 383673 283658
16321 283658 213691 541880 253823 -16090 319624 492290 304303 737960 259303 319013
16311 319013 695082 144521 478875 -177 693357 296751 477947 -17418 236926 102759
16300B75619K26756p6019K4799A30208J99706m760A49793K24280p7973L369J25407
16289D24876J84231k21456n8211K0956J96173B60238L56095C0317L09046J45624
16279D84987A98942J49043l4285g994q1650C28350K4134l3074P7903j49212L8112
16268B86213p6629O1602g750A91354K43414B03398g1693H2758K27115J63506a79162
16256C51017K06842B27173O6943m6780q3823L18314j81321G8010L17707j24184
16246B71533A15976f802A161J27306O546J53606f0495C82470Q8677j97790J10332
16235C83689a00688B56191L72346A15412C8230Q2933J81433F0443M3533B5064
16224D4919a12370C35187j39871k6873p9462K59730B9381L81575i0932E82226
$$ plain form
16300 275619 502375 426356 451155 130208 329914 325154 149793 374073 296100 299469 424876
16289 424876 609107 387651 329440 350396 546569 260238 616333 30317 339363 484987
16279 484987 198942 347985 313700 -7994 -89644 328350 352484 319410 397313 248101 286213
16268 286213 209584 271186 -7750 191354 434768 203398 -71693 82758 309873 473379 -179162
16256 351017 557859 227173 294116 247336 163513 481827 300506 78010 395717 271533
16246 271533 115976 -6802 1161 128467 135013 288619 -60495 382470 471147 273357 383689
16235 383689 -100688 256191 628537 115412 38230 121163 302596 60443 103976 25064
16224 44919 -112370 335187 195316 168443 88981 348711 29381 410956 -90932 582226
16213D28821j49165F124P2045L62402J12475E7184O8487F0840M20549j59991E9782
16201B8603K229K9446M15325A48009C2033A2844a75838L2074F3890f157I5468
16189d3513D81495A04687K16806H8195L59724A14821O1175G9541M158J37083m4412
16178A76370p5020b44098A31289A4596K9443L1225a5202C1203L4794k0932L02655
16167C47720P0525h5627j48636B8185b11090C475K74920k1912a64295O4094a4732
16155C5162J15388P8083G5754g4417A19132n0901B1821P6493f4011b4337B70731
16143B16502E1705P8954J22714j13833J26123o752a52498G5875C5041J80184o1987
16132A53238a37076A05884c3474R022E7547K53528a3155j04470N8601B74181E4079
$$ plain form
16213 428821 279656 6124 78169 440571 553046 57184 125671 60840 481389 321398 59782
16201 28603 30832 60278 475603 148009 32033 12844 -175838 -143764 63890 -6157 95468
16189 -43513 481495 104687 321493 88195 447919 114821 175996 79541 83699 220782 176370
16178 176370 101350 -244098 131289 14596 44039 75264 -15202 31203 65997 45065 347720
16167 347720 418245 -85627 -234263 28185 -211090 3475 278395 256483 -164295 -100201 -14732
16155 35162 150550 228633 75754 -74417 119132 68231 21821 98314 -64011 -24337 270731
16143 216502 51705 130659 253373 139540 265663 258911 -152498 75875 35041 215225 153238
16132 153238 -137076 105884 -33474 -24452 57547 311075 -13155 -117625 -59024 274181 54079
16120A43066a07454p7768D2130f8227A21160A3713J48071J26644j07328F8899
16109A27974c76134N4162A03111n1167P7593J43383p6016K34454N0474j64741
16099C17091E214Q7230l2752d6211o4028B96537d9957A9603A603L35638D9363
16087A1772a09059F9959j2266c8230C1557K95120j12172a43268A94582G4887M6527
16076A21414a28041j8845L5793A92069i3067c8241n8241a9113A73150E3931g0044
16064D84061a09421M1390B72946I6023b39490E4823g0858C5178j0955a29658A93890
16052c09068a21123B6524b3639l6887A74538h3947L9350l44833P3726A56336f2107
16040A69085J67528A38044N3019J16220b59559B03846A1715a25906o5175B18622
$$ plain form
16120 143066 -107454 -185222 42130 -68227 121160 13713 161784 288428 181100 68899
16109 127974 -376134 -321972 103111 51944 129537 272920 196904 431358 481832 317091
16099 317091 5214 92444 59692 -46211 -110239 296537 -49957 19603 1603 337241 49363
16087 11772 -109059 69959 57693 -38230 31557 326677 214505 -143268 194582 74887 121414
16076 121414 -128041 -146886 -111093 192069 -93067 -38241 -96482 -19113 173150 53931 -70044
16064 484061 -109421 -68031 272946 96023 -239490 54823 -70858 35178 24223 -129658 193890
16052 -309068 -121123 26524 -23639 -60526 174538 -83947 -44597 -389430 -315704 156336 -62107
16040 169085 336613 138044 191063 307283 -259559 203846 11715 -125906 -191081 218622
16029a81216A27034c94622g3893A62314C9466J8613K9832a42886k7672j50380
16019c20938a1219p973B63653F0548a0519B53118a8004j66973j4123j15063F1424
16007A44343a57222L4269C0211J57593a65338b0199B53805j06952m2961K40156
15997C44048A21263Q0511r667A1666R3653L27907G5629b86298I705Q9348c4541
15985B73771D2881N6422a46525B05614M3934g5475A70072a9143C24588A43636
15974B63311G898c76388B64892b3787A333K4457b48388A53056K7700n8125a04114
15962b46059D6342a41117M5473j77991B40014F2976L5825b0006j77914A0254h7433
15950c2270l4574d50j00793o2860k20883B16433G9380a69720j93608a44840J5385
$$ plain form
16029 -181216 127034 -394622 -73893 162314 39466 58079 87911 -142886 -170558 -320938
16019 -320938 -11219 -19192 263653 60548 -10519 253118 -18004 -184977 -199100 -314163 61424
16007 144343 -157222 -122953 30211 187804 -165338 -20199 253805 146853 103892 344048
15997 344048 121263 201774 192107 11666 105319 433226 75629 -286298 9705 99053 -34541
15985 273771 42881 99303 -146525 205614 249548 -75475 170072 -19143 324588 143636
15974 263311 7898 -376388 264892 -23787 1333 25790 -248388 153056 180756 122631 -104114
15962 -246059 46342 -141117 -95644 -273635 240014 62976 98801 -20006 -197920 10254 -87433
15950 -32270 -66844 -450 -101243 -164103 -384986 216433 79380 -169720 -363328 -144840 -129455
15939a29455k36806g8632j36940n2714A83435b79100a32005L8122n3712R665d4502
15927c00272H2112J69633a74524e469l87800A4069a68752A48006a56930B12238
15916B02471a32558B25468d6935A11637c71358a09802A32329l3867c9629A96407
15905A404b91272e3880p4856j15886D1016J86322a92802C6169d444o8546C7248
15893i6413p9288k99375b6380k97756J25238h4548A34618A3239L4278J80663j04877
15882A23303i9663I1082a37917q9316a8905j25243A60682f6783m1295k30397g1032
15870I4705d67959g0215B3109a40784m37506a12288l4922A42400Q35d33474J60454
15859b73020G5095e6838n7685K7969L8640m6609j9208A03811c24094B18453A0553
$$ plain form
15939 -129455 -366261 -78632 -215572 -268286 183435 -279100 -132005 -93883 -147595 -137930 -44502
15927 -300272 82112 251745 -174524 -5469 -393269 14069 -168752 148006 -156930 212238
15916 202471 -132558 225468 -46935 111637 -371358 -109802 132329 98462 -39629 196407
15905 1404 -291272 -53880 -128736 -244622 41016 227338 -192802 36169 -4444 -72990 37248
15893 -96413 -175701 -475076 -26380 -324136 -198898 -84548 134618 13239 47517 228180 123303
15882 123303 -99663 91082 -137917 -227233 -18905 -144148 160682 -66783 -108078 -338475 -71032
15870 94705 -467959 -70215 23109 -140784 -578290 -112288 -147210 142400 143235 -433474 -273020
15859 -273020 75095 -56838 -114523 -86554 -47914 -94523 -113731 103811 -324094 218453 10553
15847a66200h1886I9158c8949B58138b63048B78584a09324L6439C17628G5438
15836B22085H3286K16531a91565G1032L64924b3814j46713J7089G414J02363a29533
15824A40772M8828p1697J32473a5071A2910K37079C071J21504D0839J5498a58639
15812B40910c01992A84256H8496K3076c5038j37177B1129a99338j47036a6538
15801A38896a44813F5565b21724A64211a03911c5151l7961H0221j3134a53791
15790a00777Q711A71571a12895E4777K57553A54163a14205A7635a32689k61366
15780c94055a83984d9415j66573J3088M9225K6242L1773p6804B71704b02176A70094
15768b90581A63165p9225d31110a69548e5979G2474d62533J44209O9347C5900
$$ plain form
15847 -166200 -81886 99158 -38949 258138 -263048 278584 -109324 -72885 317628 75438
15836 222085 83286 299817 -191565 71032 435956 -23814 -170527 -153438 7414 109777 -129533
15824 140772 189600 117903 250376 -15071 12910 249989 3071 124575 40839 56337 -158639
15812 240910 -301992 184256 88496 111572 -35038 -172215 21129 -199338 -346374 -16538
15801 138896 -144813 65565 -221724 164211 -103911 -35151 -73112 80221 67087 -153791
15790 -100777 -92066 171571 -112895 54777 312330 154163 -114205 17635 -132689 -394055
15780 -394055 -183984 -49415 -215988 -202900 -153675 -127433 -95660 -172464 271704 -202176 170094
15768 -290581 163165 83940 -431110 -169548 -55979 72474 -462533 -318324 -248977 35900
15757a83414j92498B61702a33974j87130b0307b013A63292k9645a86996C03448
15746d9303C04574h2490K2952l68583a60056N6214H9888k0502B7854Q5725l8097
15735G5482b33498A44039a93398k0068j3471I6670d1050k58542J03547A00579
15724a47098j47082a44780j98878B27279h6281A3243O3405c29706e8441A7641
15713i1049D6076a80919a9301C2799b88497A13533Q1677c83741e7155H02d84944
15701f6762k89569J66492j14769P2879M8240B32189o976H7567a35160j55550Q8662
15690b02048n2663C4501J47490j8131g8718A59863a49894j6E3507a74217f3957
15678a61081c8200j99702G576d41229A78374c0112B40879h8018A25339R5381a10305
$$ plain form
15757 -183414 -375912 261702 -133974 -321104 -20307 -2013 163292 133647 -186996 303448
15746 -49303 304574 -82490 -59538 -428121 -160056 -103842 89888 69386 27854 113579 75482
15735 75482 -233498 144039 -193398 -213466 -226937 96670 -41050 -299592 -196045 100579
15724 -147098 -294180 -144780 -343658 227279 -86281 13243 76648 -329706 -58441 17641
15713 -91049 46076 -180919 -19301 32799 -288497 113533 195210 -383741 -57155 802 -484944
15701 -66762 -356331 -189839 -304608 -231729 -183489 232189 225213 87567 -135160 -290710 -202048
15690 -202048 -254711 34501 181991 163860 -78718 159863 -149894 -149910 53507 -174217 -63957
15678 -161081 -38200 -237902 7576 -441229 178374 -30112 240879 -88018 125339 220720 -110305
15666A70717a65585D15642a5528A185a8232A57915O3540d1041j53013j87825f1680
15654A78693N2202a67673f1776j53663d3425k48331j94010a22375a0292b067B48480
15642G2714a16941j30735G3780E281J830a54485E8288R8040g1162D522b59079
15630b01205a2199p3511F902b43072B4115b18425B0482b08181B84320F4242a96717
15618F5731K16107l4133f3779A16406a04861i353q3236o9103a7278F904a04344
15606c7449A25490h5673j11148h4348A09742J20134B0060J27107b44276J3407
15596b30869A50080a6229n0754j23684J5876j81712J47202P489g1664A46866J85113
15585C31979A46755a6147k27756A68324a94164A90324g0880H4062b14773A38903
$$ plain form
15666 170717 -165585 415642 -15528 1185 -18232 157915 221455 -41041 -194054 -381879 -61680
15654 178693 230895 -167673 -61776 -215439 -43425 -291756 -485766 -122375 -10292 -2067 248480
15642 72714 -116941 -247676 73780 5281 7111 -154485 58288 156328 -71162 4522 -259079
15630 -201205 -12199 -85710 6902 -243072 24115 -218425 20482 -208181 284320 64242 -196717
15618 65731 281838 247705 -63779 116406 -104861 -9353 -92589 -161692 -17278 6904 -104344
15606 -37449 125490 -85673 -196821 -84348 109742 229876 20060 147167 -244276 -230869
15596 -230869 150080 -16229 -66983 -190667 -174791 -356503 -209301 -201812 -71664 146866 331979
15585 331979 146755 -16147 -243903 168324 -194164 190324 -70880 84062 -214773 138903
15574a964A41841h0455L9443A07741K02646H1901j4750c69864A31374i243m7781
15563e7024E0368J64254C7114b14703F7780a00912b8443j25747J1675C04399r5642
15552B08757n4960C0036L40814a22089b9856J0349D7409a84060I5079B8450c38672
15540b5695A24656b15944r3554H7216M3202a99091H4695Q805j347a42227O5607
15529g6620k34231J27348B0238a26643E57710H200J04622n0993f5253j143G9417
15517A1750b7854k14562k8389A1453a71103j5680B31248a22781a4032b099j49366
15506a51465A03274N8187J22744b01890g8593B95938c42602i6263j08173D4420
15495f6763a4457j45793B26014J42854b72739A31788a19571G2777a86240f013
$$ plain form
15574 -1964 141841 -80455 -41012 107741 310387 81901 67151 -369864 131374 -9243 -57024
15563 -57024 50368 214622 37114 -214703 67780 -100912 -28443 -154190 -142515 304399 208757
15552 208757 153797 30036 370850 -122089 -29856 -19507 47409 -184060 95079 28450 -338672
15540 -25695 124656 -215944 -309498 87216 130418 -199091 84695 93500 92153 -142227 -76620
15529 -76620 -310851 -183503 20238 -126643 557710 8200 112822 61829 -65253 -66396 79417
15517 11750 -27854 -242416 -270805 11453 -171103 -186783 231248 -122781 -14032 -2099 -151465
15506 -151465 103274 161461 284205 -201890 -78593 295938 -342602 -96263 -204436 44420
15495 -66763 -14457 -160250 226014 368868 -272739 131788 -119571 72777 -186240 -6013
15484a96879B72241C0873g7833A43112d4075A00394L8077n9870K9999J46162o0217
15473A94545Q7731j17838c54660e1508F7668b0792H6502J09495b29062e6408B3775
15461F4667i3682E3897a38874A11763N892J67031C8760b14456D8699A1460K14603
15450B26063d8684B57365g2926k945k7307j7797A47816g0184A87201b16900o4251
15439b81151D10414h7935j1718A79744P3677D9720a30294G1891N5637C7382a4329
15427b30934A53194f0329l90993C2350h4638k3753C22386l9518d8845B40955a02527
15415f5449B25717k6237a34330k6682C3495L6091b26536A09116b68677F1280a54146
15403b0413F4177O9696c23382A04774b9741n0671J5085D4555Q0106l0441K38086
$$ plain form
15484 -196879 272241 30873 -77833 143112 -44075 100394 138471 78601 108600 254762 194545
15473 194545 282276 164438 -354660 -51508 67668 -20792 86502 195997 -229062 -56408 23775
15461 64667 -93682 53897 -138874 111763 117655 284686 38760 -214456 48699 11460 226063
15450 226063 -48684 257365 -72926 -75871 -103178 -120975 147816 -70184 187201 -216900 -281151
15439 -281151 410414 -87935 -99653 179744 253421 49720 -130294 71891 127528 37382 -14329
15427 -230934 153194 -60329 -451322 32350 -84638 -108391 322386 282868 -48845 240955 -102527
15415 -65449 225717 199480 -134330 -161012 33495 69586 -226536 109116 -268677 61280 -154146
15403 -20413 64177 133873 -323382 104774 -29741 -80412 -65327 44555 124661 94220 332306
15392C32306h1184b0659j90153J01705A08305a0137A48150c49457A08000L5425
15382A43425E6664a88860j10916J00870b2725A73444m5916h4357D1620a42803
15371b2871j18337e5479A03664g2376q9378C35803j11452O0268A17612a43671
15360b64223h4277A99057m7659H681J48220a56439F8477K11719B0512J27775k4174
15349A24113J608E6550a72108k6343B06188G5723J29014b25521A07813k9580h2615
15337A30880L6878L9768J04370f6591C06479b14281B08376O3176D0536a4653B25959
15325A89770m3888d00314a40958n6605Q5306B59613e8373E19684a75009G5963
15314A73099g6328A82087P8970r9114f5521r677b6987B5271b65940F5361O7940
$$ plain form
15392 332306 -81184 -20659 -210812 -109107 108305 -10137 148150 -349457 108000 143425
15382 143425 56664 -188860 -299776 -198906 -22725 173444 127528 -84357 41620 -142803
15371 -22871 -141208 -55479 103664 -72376 -161754 335803 224351 284619 117612 -143671
15360 -264223 -84277 199057 151398 8681 156901 -156439 68477 280196 20512 148287 124113
15349 124113 125721 56550 -172108 -198451 206188 75723 204737 -225521 107813 78233 -82615
15337 130880 167758 207526 311896 -66591 306479 -214281 208376 271552 40536 -14653 225959
15325 189770 145882 -400314 -140958 -197563 -112257 259613 -58373 519684 -175009 75963
15314 173099 -76328 182087 261057 161943 -65521 -75198 -26987 25271 -265940 65361 133301
15303A33301L04671A2893R2109O8059J28016A31700K3701a43561q510A84685G4339
15291A97098n2024k3143a3853E8241c100I5131J78117q3834d3558C7364a94401
15279a11265F6671K00077F4019g3398C11815g8538A2008K00687b92802D8111q539
15268C9572L7201N5829R9164a49178A29702N6840N3216J55654C7665K07608g1458
15256B57536b0607G3540J61377c03092A68684L03634B33953j15262N59221M48712
15246A126624J219710j47157k89548P01029A194098n26924D083L10735A07760
15236B05522E5133J263d9958A63748d6717K1682E9000a68945j13736D7101K71598
15225C18699H5083b5652E0487g8486l1805j07333J6855I0909b12827O3628b9552
$$ plain form
15303 133301 437972 12893 105002 173061 301077 131700 155401 -143561 -152071 184685 74339
15291 197098 145074 121931 -13853 58241 -3100 95131 273248 189414 -43558 37364 -194401
15279 -111265 66671 266748 64019 -73398 311815 -78538 12008 212695 -292802 48111 39572
15268 39572 76773 132602 231766 -149178 129702 186542 239758 395412 37665 245273 -71458
15256 257536 -20607 73540 234917 -303092 168684 472318 233953 118691 677912 1126624
15246 1126624 2346334 2199177 1909629 2610658 1194098 667174 4083 314818 107760
15236 205522 55133 56396 -49958 163748 -46717 -25035 59000 -168945 -282681 47101 318699
15225 318699 85083 -25652 50487 -78486 -110291 -217624 -200769 90909 -212827 -149199 -29552
15213b3431B25514b179F4262c6310I7741a75181e9113D42637h724B30426A172
15201A91694J9132J3152R7445g5192D6183N0991a2610B73868o8561b52031A45265
15189G6201L17645I3071J5940h6728A80291J967c58106A38530A9765g74B00959
15177F1865P3809J159m5030l7908a8424B84160i1707A47840i047A78626E8890
15165E4922K18976L0619c7894l996B18930j01392b16920A80819J88630A22599
15154B24512i0203F09743k73539a98623d4432k26710A20693a19198K5982D30062
15143B39758j11430J27845n3460i1715j79558E71516A34924J33749L7911j53216
15133A53368c205A70209m0514c11214A55540G2529J58103D4223J50700F7421J54729
$$ plain form
15213 -23431 225514 -2179 64262 -36310 97741 -175181 -59113 442637 -8724 230426 1172
15201 191694 210826 223978 321423 -75192 46183 97174 -12610 273868 205307 -252031 145265
15189 76201 393846 93071 109011 -86728 180291 182258 -358106 138530 19765 -774 200959
15177 61865 135674 136833 91803 53895 -18424 284160 -91707 147840 -9047 178626 58890
15165 54922 273898 304517 -37894 -41890 218930 117538 -216920 180819 369449 122599
15154 224512 -90203 609743 336204 -198623 -44432 -271142 120693 -119198 -93216 430062
15143 239758 128328 256173 202713 -91715 -271273 571516 134924 268673 306584 153368
15133 153368 -3205 170209 129695 -311214 155540 72529 230632 44223 194923 67421 222150
15122B22150g2012A66878K18866A16350P0265C2686O7470a15810D3601L97001
15112D40602A898J94238k8954J46686J8415A907a0557C5908J72601k7781K7219
15101B07947A3751R8450J99759R6352F1282Q8928h4738L1866I0307c414E7909
15089C92642K5856j13266A42058K23362r7885A09664N9193C8238M50492l9418
15079D49312c8888C28634A54237J18958j14435j0127k6282K68928D8438j890K22506
15068B69054H3104J18900N5183b57154b7932C16785j39519g9532f836o6943B57148
15056B86048j28064k1936j4230g2368B33606H358J15195Q5064k5258M1518m5248
15045A79629B1997Q1297G678d3656C90789A79852b41820B56670A1911N42446j78523
$$ plain form
15122 222150 -72012 166878 385744 116350 186615 32686 100156 -115810 43601 440602
15112 440602 1898 196136 167182 313868 332283 1907 -10557 35908 208509 180728 207947
15101 207947 13751 112201 311960 408312 61282 150210 -84738 -52872 90307 -3414 57909
15089 392642 418498 305232 142058 365420 267535 109664 168857 38238 488730 449312
15079 449312 -38888 328634 154237 273195 158760 148633 122351 391279 48438 46548 269054
15068 269054 83104 202004 257187 -257154 -27932 316785 177266 -79532 -6836 -73779 257148
15056 286048 157984 136048 121818 -72368 233606 8358 123553 208617 183359 224877 179629
15045 179629 21997 103294 7678 -43656 390789 179852 -241820 256670 11911 554357 375834
15034C75834a04987A42581N9914q3957J4318j1055M8326n0087a49607D02598D78
15022C03892f1903B21779d8874A79628K21588j79823L06057k20548J89823C976
15011G17J7327K44989A07963J87866P8953l3223A09503L22321A19875J66337a82948
14999i7607A74377p8055d1302I010M89146G5891K88827j05036K56226o1003A55748
14987D11873k6092F5936L24703A50381J0028o4645K84623A37578j0021M41346
14977E68903A66921m6297C1064M9894K02828J54071M8888j96594D4133M12152
14967D56285E5117R0658n0538O6458j5296O7972J69527J49305j06460k07011J99175
14956D18907G7091K02372H3831J49736I7352A2802J79925L62598j35169J9824
$$ plain form
15034 375834 -104987 142581 202495 118538 132856 121801 170127 120040 -149607 402598 478
15022 303892 -61903 221779 -48874 179628 401216 221393 527450 306902 496725 3976
15011 717 18044 263033 107963 295829 374782 341559 109503 431824 119875 286212 -182948
14999 -97607 174377 96322 -41302 9010 498156 75891 364718 259682 515908 454905 155748
14987 411873 385781 65936 390639 150381 160409 95764 380387 137578 127557 568903
14977 568903 166921 120624 31064 80958 283786 437857 486745 290151 44133 456285
14967 456285 55117 145775 95237 161695 146399 214371 383898 533203 426743 219732 418907
14956 418907 77091 279463 83831 233567 97352 12802 192727 555325 420156 439980
14946D39980E3419K97234A0538M65306j03132o677j37014K2990K01580j25704
14936C27887A09431K09655k0122N30150C97126r8001K48300q6280k09096m1724
14926B10325R7642A49232L07404N3557j98494R13j0394j7554o9135J14929p89
14915C29669a17790B03038J43503r9968m7762K86688o2136A14563L57396j2192
14905D59767N572q5130N7742j23495K02914j7845B01430P2817L45656j11454j60253
14894C48196A8966P47792E1355K72838A37637K66693o7861O3854j36465K4701
14884B88559M17495d8952E86207B41297j18262M01362p6394K1330N1175M085k38390
14873B86203J07184J22607j98334p7894J56804p9912I1838K01016J38070j04715
$$ plain form
14946 439980 53419 350653 10538 475844 372712 366035 229021 252011 453591 327887
14936 327887 109431 319086 298964 829114 397126 299125 547425 461145 252049 210325
14926 210325 307967 149232 456636 510193 311699 312612 302218 284664 215529 330458 329669
14915 329669 -117790 203038 346541 246573 198811 485499 423363 114563 471959 459767
14905 459767 465339 380209 437951 314456 517370 499525 201430 274247 619903 508449 348196
14894 348196 18966 766758 51355 324193 137637 404330 336469 400323 263858 288559
14884 288559 706054 -48952 586207 241297 123035 524397 448003 469333 520508 524593 286203
14873 286203 393387 515994 317660 239766 396570 316658 91838 292854 430924 326209
14863C26209J51248Q9386p1807K8321n7924j61111P928J1896b1431E74146f7947
14851B55944J84388K71P4478L35876k87783J47141B16078K53025J64080R3428
14841G26611l20416A73540K14492n960L60257k10292j32131K1817M92653l02699
14831F11677K0846j14604j47882K76077k77357K5426J63903j16914o659P0567
14821E05080A59519K12669O9850K75045k69234K83383B93358J24994J53668k4062
14811E47958K4601p5133k19891p3644N85665l37081m0561K0221L09582j01934
14801F39783B10269L63037j33108K68878j7288Q4324j56989B81054M42295k19472
14791E03877M3132j12875j1193j3916L57725k98601O5852R4656P7212k12919j53677
$$ plain form
14863 326209 477457 566843 495036 523357 465433 304322 312250 324146 -21431 574146 -67947
14851 255944 440332 440603 515081 850957 563174 710315 216078 469103 633183 726611
14841 726611 406195 173540 388032 382072 742329 532037 399906 421723 914376 611677
14831 611677 632523 517919 370037 646114 368757 394183 558086 441172 434513 505080
14821 505080 159519 372188 442038 717083 447849 731232 293358 418352 572020 547958
14811 547958 572559 497426 277535 203891 789556 452475 411914 432135 741717 639783
14801 639783 210269 573306 440198 709076 691788 776112 619123 281054 723349 503877
14791 503877 547009 434134 422941 409025 766750 468149 534001 628657 705869 492950 339273
14780C39273M19441j47688l3500K72026j20715j16680J27962k4772K6531j11210
14770F30668r8324K068K11379j01816j94P3316j41017J86445r0355j50132l6059
14759D85979K08241J4603M6952J43935D37118L84377K9513j32955K19676m52744
14749D84985j38N24248n4241k23513J49330p4305k24638L49282C74683M97995
14739H72678j79596Q1286K59719D82611J06498L23825m20665J64690J32428q6070
14729G03317j2715J37032m4869j17666M3012J20090K62408k84281J39923J2231
14719I58482k27371J34193J61524K12016l76610J78082l41488K2759R8763J27886
14709I48236l40690J96384O976L43987k20986q8453L9072J09799q537k08396N43884
$$ plain form
14780 339273 758714 611026 577526 849552 728837 612157 740119 715347 741878 630668
14770 630668 532344 534412 745791 643975 643781 717097 576080 762525 672170 522038 485979
14759 485979 694220 708823 755775 899710 437118 821495 851008 718053 937729 484985
14749 484985 484847 1009095 954854 731341 880671 806366 581728 931010 374683 872678
14739 872678 693082 774368 1034087 482611 589109 912934 492269 656959 789387 703317
14729 703317 690602 827634 782765 665099 708111 828201 1090609 806328 946251 958482
14719 958482 731111 865304 1026828 1238844 862234 1040316 698828 721587 820350 948236
14709 948236 607546 803930 810906 1154893 933907 845454 884526 994325 985788 777392 1321276
14698A321276m27016J05127Q4871l73405M89719n87525J67155M6608J46716Q9574
14688A063100P5551k9314k42969j5015k8696j15930P0341R2110l2193N6083J41495
14677A034563q3824L6681J69967j06981k25593K58787j38039L5480p7924L15275
14667A218392K0999J8654k15341q4865L60592j86078o3578J16134k39488J53821
14657A099242N2912j11285J22311j72804l32151N40748K18564K47225j41951l68314
14647A154497N6205L53913j18441m82777L11638N6996k34684L88384K64603o98449
14637A051885N74784j46172j43684L0395j63856j693K93996k14177l7716K29938
14627A473700l40351K54775J09335R3504k69983J94306p1325M1427N5501J87944
$$ plain form
14698 1321276 894260 999387 1084258 710853 1200572 613047 780202 826810 973526 1063100
14688 1063100 1138651 1109337 866368 851353 822657 706727 777068 869178 836985 893068 1034563
14677 1034563 950739 987420 1157387 1050406 824813 1083600 945561 981041 903117 1218392
14667 1218392 1239391 1258045 1042704 957839 1318431 1132353 1068775 1184909 945421 1099242
14657 1099242 1152154 1040869 1163180 990376 658225 1198973 1417537 1664762 1522811 1154497
14647 1154497 1210702 1564615 1446174 963397 1275035 1332031 1097347 1485731 1750334 1051885
14637 1051885 1626669 1480497 1336813 1367208 1203352 1201659 1495655 1281478 1243762 1473700
14627 1473700 1133349 1388124 1497459 1590963 1320980 1515286 1443961 1485388 1540889 1728833
14617A728833q7842k67133j01128K48618j54044L93566m97318L74980k43872L78320
14607A772980K69536o24978N11315R0918J0836O3212k47125J10435m9263j8151
14597A889715m0568k8392J76186l15491k52833O81176m11630J22398L47205l05796
14587A861970k15159M05442J61122j86305l5666K50247N5642n0694q3388J643
14577B164854J35596j18373J00817o1089P1054l01567R6094J91920J03259j01769
14567B280796J86128O2031k4226J23157J84135j79669K74753O9523J17485m76801
14557B617312L44015K18227K60166K78542K45997J72947O10673J121456J689827
14548G559162L406462P246512J4544277J3238189k1088941A1606452k825549P89574
$$ plain form
14617 1728833 1640991 1373858 1272730 1521348 1367304 1760870 1263552 1638532 1394660 1772980
14607 1772980 2042516 1417538 1928853 2019771 2030607 2093819 1846694 1957129 1907866 1889715
14597 1889715 1849147 1820755 1996941 1681450 1428617 2109793 1698163 1820561 2167766 1861970
14587 1861970 1646811 2052253 2213375 2027070 1991404 2241651 2297293 2246599 2163211 2164854
14577 2164854 2300450 2182077 2282894 2221805 2292859 1991292 2087386 2279306 2382565 2280796
14567 2280796 2466924 2528955 2504729 2627886 2812021 2632352 2907105 2976628 3094113 2617312
14557 2617312 2961327 3179554 3439720 3718262 3964259 4137206 4747879 5869335 7559162
14548 7559162 10965624 18212136 32756413 45994602 24905661 11606452 8780903 9570477
14540I570477m605594j953162l28835j35875l70869k6454M6960j80651L34789
14531B350786J5467q6129M42789l47890J35789m3181M1434O0358K01802k84374
14521B486851K04687K40679k24664j98050K42574P8100q5882J7839K14588j29941
14511B846781p1880J24121Q1126j43100j981K2628L22133j75606J36418n7606
14501C083034J42310K80068p2418l4284k57642M71720l55653J06218L23318J19735
14491C806406K8892k72120m3271K6014K38200K75837j99454j66331q3244r7614
14481C513315O69482k54767L16185m62945J27252L13692Q6218k640P4565l06196
14471D074161M32058k57246M59921l19128J18257K2341K59075N2269k71231P8645
$$ plain form
14540 9570477 4964883 3011721 2682886 2547011 2176142 2149688 2196648 2015997 2350786
14531 2350786 2366253 2280124 2722913 2375023 2510812 2467631 2509065 2569423 2771225 2486851
14521 2486851 2691538 2932217 2707553 2509503 2752077 2830177 2744295 2762134 2976722 2846781
14511 2846781 2774901 2899022 2980148 2837048 2835067 2857695 3179828 3004222 3140640 3083034
14501 3083034 3225344 3505412 3432994 3398710 3141068 3612788 3257135 3363353 3686671 3806406
14491 3806406 3835298 3563178 3519907 3545921 3784121 4059958 3860504 3694173 3610929 3513315
14481 3513315 4182797 3928030 4244215 3781270 3908522 4222214 4308432 4305792 4380357 4074161
14471 4074161 4506219 4248973 4708894 4389766 4508023 4530364 4789439 4841708 4570477 4649122
14461D649122L66537j44164N17211k00955o2773N38902l41696j38349L61995K74674
14451E820504n2016j21896R3378J83667O5938M9824J270J45466J67553l43200
14441F010488N80291k49050K05808p8854O3893J03145M8897J40094J96916n4969
14431F966659J93413j81620K49972J53720j23649L70287k24078K67033J23801
14422G795538p8493M46700l04502J59457J96901K81017K80312N98376k44498m4853
14412I085955j48869K40378M07863Q3433L13682q440j02345K33401K44639Q2857
14402A0432554Q7032J63500J85989L48671M1922K57506J30298N35387J8395Q5570
14392A2286824M22042L01500J10355p6060J77210K21653K22318M20491K84201
$$ plain form
14461 4649122 5015659 4871495 5388706 5187751 5124978 5663880 5322184 5183835 5545830 5820504
14451 5820504 5768488 5646592 5739970 5923637 5989575 6039399 6040669 6186135 6353688 6010488
14441 6010488 6590779 6341729 6547537 6468683 6532576 6635721 6684618 6824712 7021628 6966659
14431 6966659 7160072 6978452 7228424 7382144 7258495 7628782 7404704 7671737 7795538
14422 7795538 7717045 8163745 7859243 8018700 8215601 8496618 8776930 9375306 9130808 9085955
14412 9085955 8937086 9177464 9585327 9668760 9982442 9974002 9871657 10105058 10349697 10432554
14402 10432554 10519586 10683086 10869075 11217746 11259668 11517174 11647472 12182859 12201254 12286824
14392 12286824 12708866 13010366 13120721 13044661 13221871 13443524 13665842 14086333 14370534
14383A4370534K02617K78654K98626m6724O71632K64767M7259L57538K78877M15568
14373A7139348L48206L39394M76679K66813L53285M24016K17452M58438O1456
14364B0085087J065572J71017K2631J239070P8177O42678Q81150Q4719O76165
14355B4946266M65119M72305R22763M33754O20738P03690O21505P16293J108753
14346C1011186O81538L87243J028533Q04872J245455O47536J035555Q53290J308410
14337C9003618P01012J334110J237627R93685J361959J161907J477189J579784
14329D8850891J769402J545383J193154J756842J680084J794001K057240K004366
14321F2651363K536376J925170K378478K957143K329377K930389L106191K863897
$$ plain form
14383 14370534 14573151 14851805 15150431 15103707 15775339 16040106 16087365 16444903 16723780 17139348
14373 17139348 17487554 17826948 18303627 18570440 18923725 19347741 19565193 20023631 20085087
14364 20085087 21150659 21321676 21344307 22583377 22661554 23304232 24185382 24270101 24946266
14355 24946266 25411385 25883690 26806453 27240207 27860945 28564635 29186140 29902433 31011186
14346 31011186 31692724 32079967 33108500 33913372 35158827 35806363 36841918 37695208 39003618
14337 39003618 39704630 41038740 42276367 43270052 44632011 45793918 47271107 48850891
14329 48850891 50620293 52165676 53358830 55115672 56795756 58589757 60646997 62651363
14321 62651363 65187739 67112909 69491387 72448530 74777907 77708296 80814487 83678384
14313H3678384L158450K940970M246235L558902L802783M387783M435145M796124
14305A15004776M930232N354600N351371O190178O183599O558547P187578P542880
14297A64303761P597828Q235696R293038Q954067J0064285J0417522J1348195
14290B30214392J1275664J2032064J2458095J3555149J3755913J4064847J4720462
14283C22076586J4952251J5130107J5446095J5257566J5179634J4502865J3831945
14276D26377049J2491335J1564985Q980628O175813K073768k1336j86565J4784
14268D67470461j820198o290297q057026r024100r524239j0618775j3198257j3801582
14260C95135987j5196312j5009086j5306679j6189209j5474969j5156659j5283430
$$ plain form
14313 83678384 86836834 89777804 94024039 97582941 101385724 105773507 110208652 115004776
14305 115004776 119935008 125289608 130640979 136831157 143014756 149573303 156760881 164303761
14297 164303761 171901589 180137285 189430323 198384390 208448675 218866197 230214392
14290 230214392 241490056 253522120 265980215 279535364 293291277 307356124 322076586
14283 322076586 337028837 352158944 367605039 382862605 398042239 412545104 426377049
14276 426377049 438868384 450433369 459413997 465589810 467663578 467642242 467455677 467470461
14268 467470461 465650263 459359966 451302940 442278840 432754601 422135826 408937569 395135987
14260 395135987 379939675 364930589 349623910 333434701 317959732 302803073 287519643
14253B87519643j4607648j2009753j1892020j2780716j1904397j0989382j0579634
14246B02756093j0268845r276287q362202q277177q175053p138709p275825o306729
14238A37675266n969761n748212n079917n272336n262968m411797m480665l365676
14230I8083934m194766l685502l777520l115345l086683l300951k858158k610055
14222G1454954k194365k854448k224577j728414k616831j584536k021335j773741
14214E4456707j635503j053577j900655j628401j722032r36161j444234q39162
14206D3296982r40736j652378j403028j016978j149772p93621m53919q61856j681537
14197C3343157n54619j206837n37376r31256l15518r05317p81291o96420o80499
$$ plain form
14253 287519643 272911995 260902242 249010222 236229506 224325109 213335727 202756093
14246 202756093 192487248 183210961 174848759 166571582 158396529 151257820 143981995 137675266
14238 137675266 131705505 125957293 120877376 115605040 110342072 105930275 101449610 98083934
14230 98083934 93889168 90203666 86426146 83310801 80224118 76923167 74065009 71454954
14222 71454954 69260589 66406141 64181564 62453150 59836319 58251783 56230448 54456707
14214 54456707 52821204 51767627 49866972 48238571 46516539 45580378 44136144 43296982
14206 43296982 42356246 40703868 39300840 38283862 37134090 36340469 35886550 35024694 33343157
14197 33343157 32788538 31581701 31044325 30113069 29797551 28892234 28110943 27414523 26734024
14188B6734024n50255p79114m19760n40278q04235k91245o66451n63163l05305
14179B1814218o06862n04404m17903j22076m26820n70997J5913q01847n72700
14170A7806522j35858o08009q5027p90119K4120j72259j83206k69919k93388m55514
14160A4837343k67374k90805k93666l54051j99028p2471j62572K8183l28876j26741
14150A2769942n00913m7287p0845j18350l08661k61840m320m12686k78856o3726
14140A0702458J06304k56016j76503k58810j20093O2216k63991k81917j6765j53775
14130I343108k99508M4674l2474l68903j31940N4422j07646k23435p8014q0407
14120H119877k34584r7934j27802K50k7885m81133K03395j05363j49786l69671
$$ plain form
14188 26734024 26183769 25404655 24984895 24444617 23640382 23349137 22682686 22119523 21814218
14179 21814218 21207356 20702952 20285049 20162973 19736153 19165156 19181069 18379222 17806522
14170 17806522 17670664 17062655 16977628 16187509 16211629 16039370 15856164 15586245 15292857 14837343
14160 14837343 14569969 14279164 13985498 13631447 13432419 13359948 13197376 13225559 12896683 12769942
14150 12769942 12269029 12221742 12150897 12032547 11723886 11462046 11457726 11045040 10766184 10702458
14140 10702458 10808762 10552746 10376243 10117433 9997340 10059556 9795565 9513648 9496883 9343108
14130 9343108 9043600 9088274 9055800 8686897 8554957 8609379 8501733 8278298 8200284 8119877
14120 8119877 7885293 7787359 7659557 7659807 7631922 7150789 7354184 7248821 7099035 6729364
14110F729364N7862k9525r7849q7287J9502j73375R0444J36350j35238l82448
14100F127800l13964M56393j08708j45931j68176J98459m43001j58425J75380
14091E619827p6376j39210q8567k01826j74824N58567n09147K32025l96374R6727
14081D920822K01743l69958J96279L732l51738j58901J69089j19332J77122j39824
14071D529034n7624m75385L32327l19467L41292j95245j6066J23953O1619k44481
14061D079957q4574k78975L06625k0604K15641j5710l29525k41832Q7369r2078
14051C626294l70367N17915j04458j17089j89018K2173K24906k54184J28663j31987
14041C352848k68426N4869O8787k35061J11725l7939O7652n3334K23360j96775
$$ plain form
14110 6729364 6787226 6757701 6659852 6572565 6592067 6418692 6509136 6645486 6510248 6127800
14100 6127800 5813836 6270229 6161521 6015590 5847414 6045873 5602872 5444447 5619827
14091 5619827 5543451 5404241 5315674 5113848 4939024 5497591 4988444 5220469 4824095 4920822
14081 4920822 5122565 4752607 4948886 4952618 4600880 4441979 4611068 4491736 4668858 4529034
14071 4529034 4471410 3996025 4328352 4008885 4350177 4154932 4138866 4262819 4324438 4079957
14061 4079957 3995383 3716408 4023033 4002429 4218070 4202360 3872835 3631003 3718372 3626294
14051 3626294 3255927 3773842 3669384 3552295 3363277 3385450 3610356 3356172 3484835 3352848
14041 3352848 3084422 3139291 3208078 2973017 3084742 3046803 3114455 3061121 3284481 3087706
14031C087706m6142L87621n78915J43407p642J13685m02223L92818k53904K33552
14021C069963j84963o62538J67264L07842q0549j15580Q7561J61947l93614O3284
14011B420617J2877J11161L592k46799P5735m7980K61725k10723j01108R7681
14001B376778j30844J54549l09322K40832k68496J14024l9623m4358J98387N66213
13991B858140l78861J13544J063495K592523N817728J3373816J8976375j4141108
13983C0275652A5040065n675455k306238j316563j438514m64491n357j73356o14944
13974C045147K37208n40222j05394Q1182p0216k51424K00406j25369P9076l00639
13964B249755J87063m9146k90302K35614l24631K86225p2442L54422m64932K29014
$$ plain form
14031 3087706 3041564 3429185 2850270 2993677 2986035 3099720 2697497 3090315 2836411 3069963
14021 3069963 2885000 2222462 2389726 2697568 2617019 2501439 2589000 2750947 2357333 2420617
14011 2420617 2433494 2544655 2548247 2301448 2377183 2329203 2590928 2380205 2279097 2376778
14001 2376778 2245934 2400483 2091161 2331993 2063497 2177521 2137898 2093540 2291927 2858140
13991 2858140 2479279 2592823 3656318 6248841 12066569 25440385 44416760 30275652
13983 30275652 15040065 9364610 7058372 5741809 4303295 3838804 3833447 3660091 3045147
13974 3045147 3282355 2742133 2636739 2717921 2647705 2396281 2596687 2471318 2550394 2249755
13964 2249755 2436818 2387672 2097370 2332984 2008353 2294578 2222136 2576558 2111626 2340640
13954B340640k29982k88177L7310K05526j41724m02505M17286P4138n69703L93434
13944A836243j58929L06088j83327j73421K37470r9216m6191J71591m53940J65512
13934A601880J791L34737O752n2030j36024j05225j07941r6104K14838R0058j64565
13923A588167j6013K57376k25179l79542K17682k83482J71555K1256m8282J9735
13913A323273L51992j09871k78853K27745J85275l87005k34488J39721K42894
13904A460683J64452l05685j5014J57455k68468K5128L79175m03761R6095J827
13894A291887q4704K7008L07246n25695K25946n1139J90208j36586L16521j88728
13884A371964j85460J85586k20821R9902r8115Q263l9044j54699J63757J90406
$$ plain form
13954 2340640 2110658 1822481 1859791 2065317 1923593 1521088 1938374 2012512 1442809 1836243
13944 1836243 1677314 1983402 1800075 1626654 1864124 1764908 1718717 1890308 1436368 1601880
13934 1601880 1603671 1938408 1945160 1893130 1757106 1651881 1543940 1447836 1662674 1752732 1588167
13923 1588167 1572154 1829530 1604351 1224809 1442491 1159009 1330564 1351820 1303538 1323273
13913 1323273 1675265 1565394 1286541 1514286 1699561 1312556 1078068 1217789 1460683
13904 1460683 1625135 1319450 1304436 1461891 1193423 1218551 1597726 1193965 1290060 1291887
13894 1291887 1207183 1234191 1541437 1015742 1241688 1190549 1380757 1244171 1560692 1371964
13884 1371964 1186504 1372090 1151269 1251171 1153056 1161319 1122275 967576 1131333 1321739
13874A321739k37897j26323K79497q7874L8290j06536M9352l4405j45611j68174
13864G82058J35447L24552J28721k74351l04962N14082M952k86585L96535q0537
13854A339912l75541j9867j41873L65329j7387j01249J21405k19252K08569k87223
13844H72823J42900k43404J34113J77995o6463k48423R2565L05282j45679p9047
13834I42662j17886K0115J75914J25398k89017j23847Q026K67357j13707q0909
13824H14106J14925J72836J44456k37396m12129M75119l67720m5772O0994K53598
13814I73017j64948n0897j10433L19826j538L023k59199J80639n2819M8019j75098
13803G09592K1484K43678k10614J50254q0008k14228M16750j27946j78066J1272
$$ plain form
13874 1321739 1083842 957519 1237016 1149142 1187432 1080896 1130248 1095843 950232 782058
13864 782058 917505 1242057 1370778 1096427 791465 1305547 1310499 1023914 1420449 1339912
13854 1339912 964371 944504 802631 1167960 1150573 1049324 1170729 951477 1160046 872823
13844 872823 1015723 772319 906432 1084427 1017964 769541 862106 1167388 1021709 942662
13834 942662 824776 844891 1020805 1146203 857186 733339 741365 1008722 895015 814106
13824 814106 929031 1101867 1246323 1008927 596798 1071917 704197 658425 719419 973017
13814 973017 808069 757172 646739 966565 965027 968050 708851 889490 836671 884690 709592
13803 709592 731076 974754 764140 914394 834386 620158 1036908 908962 730896 742168
13793G42168j92071L3234j5147J46303N4137m5324K40779C74170L97220j61975
13783F09415Q8014M4008k13026M02057k73483J6786j19020J14631n558r4540L05349
13772H74633q2097B76604N59242j40706j83787J21917j31692j44609K8539j60183
13762B25325O63893B33755M39798k27176J28541p9760L97327n6527l11768K81626
13752H05816j41534J38417r4479l06290L47282k94112K10195O1730j21105j59970
13742D45950M16518k15791J41862Q3476k26923J55754j1792k40362K79267L6638
13732H64597l87299J23071j70094M0160J1582Q9981k18621L37576l03821A90105
13721H06176l53601L48457l86475J53482J95631j05903j55004j49326L14336j31409
$$ plain form
13793 742168 550097 583331 568184 714487 768624 723300 964079 374170 771390 609415
13783 609415 697429 741437 528411 930468 656985 673771 554751 669382 663824 569284 874633
13772 874633 792536 276604 835846 695140 511353 633270 501578 356969 385508 225325
13762 225325 889218 233755 673553 446377 574918 495158 892485 835958 524190 805816
13752 805816 664282 802699 708220 401930 749212 455100 665295 727025 605920 445950
13742 445950 862468 646677 788539 872015 645092 800846 789054 548692 827959 864597
13732 864597 477298 600369 430275 470435 482017 571998 353377 690953 387132 190105
13721 806176 452575 801032 414557 568039 763670 657767 502763 353437 667773 536364
13711E36364L22558l22869m2026L19046l77032o3719A65861N55390k79081J24233
13701E66403J38872K13053o3250j18769k29388J2053M07623j58412j53089j83953
13691D31143j43385M17548l45808K51014B90523M16509B76644K76943N221Q2465
13681F41273P2047j9912k91740q5084L17710l03393L04965B91512K23754k10227
13671C05039K54462j76581q0683K69065j57843A30389J43058A3436N00876O1080
13661E75392r105A79922Q6754M65558k53225k10022J54915p5946j31793M2924
13651B59087j08347D4695N81704J13950k49162A93382J33633L80130k71163o058
13641D29924q8047K89287B55895l8333N02707C48188J93176k31989K37287k51898
$$ plain form
13711 536364 858922 536053 494027 813073 436041 372322 165861 721251 442170 566403
13701 566403 705275 918328 855078 736309 506921 518974 926597 768185 615096 431143
13691 431143 287758 705306 359498 610512 290523 707032 276644 553587 558808 641273
13681 641273 713320 693408 401668 316584 634294 330901 635866 291512 515266 305039
13671 305039 559501 382920 302237 571302 413459 130389 273447 13436 514312 575392
13661 575392 566287 179922 266676 732234 479009 268987 423902 347956 216163 259087
13651 259087 150740 44695 626399 740349 491187 193382 327015 707145 435982 429924
13641 429924 341877 631164 255895 217562 720269 348188 541364 309375 546662 294764
13631B94764A31177L38418B04957L89957R0751k94335A88763L13283k13528K06699
13621D95217L8016j96370K43866k25893N55055B88129J41522j57737J54768J90889
13611F17571J37543C57165j21491L55256j39633K17152j34580p8983K9014j10752
13601C73148L12413C23191K57475b3973D62499q740o4738A62586J26613O5539
13591C54738j00176M80508B34650K77843A36483K96234j15398o5046L78958q77
13581F30354N8315g2009D37804k9693r8942J79547j69785m4420L4034J0602J20266
13570D39413B18778G4429J89475J54560O0921A23607L41210I2395K89525a801
13559D64937Q8886j69782R1042g1676E69491k28184a12015C70520A06570A8657
$$ plain form
13631 294764 131177 469595 204957 594914 685665 391330 188763 502046 288518 495217
13621 495217 533233 336863 580729 354836 909891 288129 429651 271914 426682 617571
13611 617571 755114 357165 235674 590930 451297 668449 533869 454886 483900 373148
13601 373148 685561 323191 580666 -23973 462499 453759 389021 162586 289199 354738
13591 354738 254562 735070 234650 512493 136483 432717 317319 252273 631231 630354
13581 630354 688669 -72009 437804 408111 309169 488716 318931 274511 308545 319147 439413
13570 439413 218778 74429 263904 418464 479385 123607 464817 92395 381920 -1801
13559 464937 553823 384041 475083 -71676 569491 341307 -112015 370520 106570 18657
13548I0130M67759F6069J76181g2209I3400J01636L13129B34247p3336K09263
13538C70174O3211D7329K78325M6830j41892K86188A31884J24419q5150R4779
13528B65932K3330p3510O4012K82717k73254I2817L44699A95331l6937j3475J17476
13517B62395P9488L75078B22317H0686J18314k320L96688A09795K64270c4919
13506E1586J72721A08434K58379J63081H614L38499j3518K87787A35322c2379
13495D05723j23904F1442K6937P1100M1459K09133j67653J95485G2766L04682
13485C77448F2944J19644J09285A25399K78117j9541L813j42799J42122o2033
13475C25078A49301O2318J50554p0042M5229O2284m0089C5869M76242k55936I8727
$$ plain form
13548 90130 557889 66069 242250 -72209 93400 195036 508165 234247 160911 370174
13538 370174 433385 47329 325654 372484 230592 516780 131884 256303 171153 265932
13528 265932 289262 215752 279764 562481 289227 92817 437516 195331 158394 144919 262395
13517 262395 341883 716961 222317 80686 199000 196680 593368 109795 374065 -34919
13506 51586 224307 108434 366813 529894 8614 347113 333595 621382 135322 -32379
13495 405723 281819 61442 88379 159479 200938 410071 242418 437903 72766 377448
13485 377448 62944 182588 291873 125399 403516 383975 387788 244989 387111 325078
13475 325078 149301 211619 362173 292131 337360 399644 359555 35869 512111 256175 98727
13463E33931k64119n1821a47679F8469J96549g5612j48080A66691p0427m6299
13453D9965L60013D8369b25609A10105J73996j01001J03891b009B37566N8691
13443B96257o4112e1772A38686L05039j58004K03729A36474E709a28477K4294
13433a04183A55995M6306L2753R1850J80323m4276E829M86732A54266J32052I3456
13421B0612J14272J76613j16074M01f2652L0561C64051j71879k6021p7902b44375
13409h3940j41087C27563O4877A18332K69737A18637K2574h9127G1649A7470K31357
13398B48827A17852J98941a39833A12793J5943E1806J07894K18708A38680J56829
13388B95509q3583k4765J10627H8633K20247n1203M612b3303B93316J51921A04946
$$ plain form
13463 533931 269812 217991 -147679 68469 265018 -75612 -223692 166691 96264 49965
13453 49965 409978 48369 -225609 110105 284101 183100 286991 -2009 237566 296257
13443 296257 232145 -51772 138686 443725 285721 489450 136474 5709 -128477 -104183
13433 -104183 155995 202301 235054 326904 507227 462951 5829 492561 154266 286318 93456
13421 20612 134884 311497 195423 195824 -62652 -32091 364051 192172 166151 88249 -244375
13409 -83940 -225027 327563 392440 118332 388069 118637 141211 -89127 71649 17470 248827
13398 248827 117852 316793 -139833 112793 128736 51806 159700 378408 138680 295509
13388 295509 211926 187161 297788 88633 308880 257677 262289 -23303 293316 445237 104946
13376a97996A10378k8109C5082M71259A55382M94266j83376H6139k3384K59804
13366C22559a80411A81178J79044J30660A11853K9192J90182C6743K05108k8034
13356B13817c441B16418r6591i8458A86084l2345K44451a3917A73799J79662p2182
13345B81279n7221A1919i2091E3905J81835q4387n6802a2131E46420P8366B50012
13333H879M77789k33902m715J26409G1923N198i5757G0260L77891D004K13108
13322B17112r7574E452i3125C74695a22215B19566p6521P2606a14300A98641K9415
13311B28056B6420K69345A20949n3417P7299N5197J58098A62678b14984D48580
13300A83154L9135b19552D73169J11492k48550b69786A04037i4242G2603k5578
$$ plain form
13376 -197996 110378 82269 35082 506341 155382 649648 466272 86139 62755 322559
13366 322559 -180411 181178 360222 490882 111853 141045 331227 36743 241851 213817
13356 213817 -3441 216418 119827 -98458 186084 153739 398190 -13917 173799 353461 281279
13345 281279 224058 11919 -92091 53905 235740 151353 94551 -12131 546420 624786 250012
13333 8879 486668 252766 248051 374460 71923 77121 -95757 70260 448151 4004 217112
13322 217112 119538 5452 -93125 374695 -122215 219566 143045 215651 -114300 198641 228056
13311 228056 26420 295765 120949 67532 144831 200028 358126 162678 -214984 448580
13300 183154 222289 -219552 473169 584661 336111 -269786 104037 -94242 72603 47025
13290D7025i140A90969H7806k1832g4868H6779C2248a12632A58694o3825D2212
13278B00093D4674K40754j02961d1255A24312J34707J68957A92127H0300h4605
13267B95532k4606a69326B41110E94L32932G7589K00242Q333k1180E5201K06562
13256B61763a01995B4396K05771L0697g2308p8027A7193J62863L4033k8893E9611
13244A06541K15912G2902B2692L24865A44N2865M492K33309f1336A42831M1881
13233A84712F6201J45035K082J05517I6808a82667Q3834A5004a35847B92308A20296
13221A5706L19834H3401a47477G9454P7084j2679n7367a64617C53800H0215a96080
13209A2691g3844C4851Q2492A7918a63229A18064K24078A36804d3319i949C6805
$$ plain form
13290 47025 -9140 190969 87806 65974 -74868 86779 32248 -112632 158694 94869 42212
13278 200093 44674 285428 182467 -41255 124312 259019 427976 192127 80300 -84605
13267 295532 270926 -169326 241110 594 333526 77589 277831 286164 264984 55201 261763
13256 261763 -101995 24396 230167 260864 -72308 -150335 17193 180056 214089 185196 59611
13244 106541 322453 72902 22692 347557 144 53009 57501 290810 -61336 142831 184712
13233 184712 66201 211236 213318 318835 96808 -182667 -98833 15004 -135847 292308 120296
13221 15706 335540 83401 -147477 79454 156538 143859 86492 -164617 353800 80215 -196080
13209 12691 -73844 34851 117343 17918 -163229 118064 342142 136804 -43319 -9949 36805
13197A06787D5095h1417J1760l113A46636B8054K09060I0776M7222n9311g4205
13185e2792A35195a21444K3412L7679b7372n5109G9735J48964I5328O6365n0122
13174A11571b2403G4557a39568B00158b0943B61496j20761k5139B0775a22173
13163B9030K12410F622J54390j8598O7311K11905C225c8520o656J0319A99202
13151b6317H1783a53113g1158C2865P0797L1968Q452g986H2463k3103P6414b2914
13138F2574a65373E8794M6917k5595P211N0342L12098B092J59280b35940q2261
13127c18201a02794j2678A22554b43959b9537j0727B38438a2874A19851a18282
13116b72097B84408C0686b20913M5855A31593d994A47960g8813D3931K29588P890
$$ plain form
13197 106787 45095 -81417 -69657 -72770 146636 28054 237114 90776 137998 78687 -74205
13185 -52792 135195 -121444 -98032 -60353 -27372 -82481 79735 228699 95328 161693 111571
13174 111571 -22403 74557 -139568 200158 -20943 261496 140735 115596 20775 -122173
13163 29030 241440 6622 161012 142414 209725 421630 3225 -38520 -45176 -34857 199202
13151 -26317 81783 -153113 -71158 32865 103662 135630 144082 -7986 82463 59360 135774 -22914
13138 62574 -165373 58794 105711 80116 87327 137669 449767 2092 161372 -235940 -318201
13127 -318201 -102794 -115472 122554 -243959 -29537 -40264 238438 -12874 119851 -118282
13116 -272097 284408 30686 -220913 -175058 131593 -4994 147960 -78813 43931 273519 281409
13105B81409B7215a10967K0298C62371A54402M9892l7508a95846E1558d1475B18669
13093f413E6809Q3859o4272d7086k3036K1752k8745B31403I3044O0942O5877a65645
13080B13428Q7208n9502o6555L9749H250K38196F4961a8765n2419c545E69842
13068A67228j9464k801J10121M8068q8148H037J67659a11454o7399A64353J89
13057A64542i4304B44852d3948q8293k24720C54249a3277F2005K0620k2524F112
13045a88296e9478A21441b46208B58254j23833A4122K5248i2290B30888g4744
13034D4048r414f1805B13206p0459a02072K3976f865B41944h8653A74522J86969
13023C61491c99134A08700d4337I5870q144B9671L3711A7213K53875I3285b42765
$$ plain form
13105 281409 27215 -110967 -90669 362371 154402 204294 166786 -195846 51558 -41475 218669
13093 -6413 56809 140668 76396 -47086 -70122 -48370 -77115 231403 93044 153986 219863 -165645
13080 213428 300636 241134 174579 214328 8250 246446 64961 -18765 -71184 -3545 569842
13068 167228 147764 144963 255084 303152 215004 8037 175696 -111454 -178853 164353 164542
13057 164542 -94304 244852 -43948 -132241 -356961 354249 -13277 62005 82625 60101 6112
13045 -188296 -59478 121441 -246208 258254 134421 14122 39370 -92290 230888 -74744
13034 44048 34634 -61805 213206 142747 -102072 -78096 -6865 241944 -88653 174522 361491
13023 361491 -399134 108700 -44337 95870 87726 29671 63382 17213 271088 93285 -242765
13011f5141b9784a1193n4193k17339g2072m3188a5593n9379l0825A63420K88813
13000D52233A4668a0100A91821q9929h4834A6363N0946J84955b88173J01424Q3735
12989a03014K4517A22591D990P5463m933l0866a80328A60340R3172a39873N2615
12978h7258l1846a793A29370j1492m7770o693a78798B6968a21393j28140f7300
12966e6438J7462a8797n912j4573A32925J40690f2752A76696A3318J34313c22793
12954C25823G5225b90774P1958q4713a39093C05496E8647b6031l9058A25903J30410
12943B56313a55574A57581J7409c7369J1259A89422f6203n7903H0185k8662J77472
12932B28995A9895a47843B26114c5878A27503B8009M2997b9656j10494f4160G311
$$ plain form
13011 -65141 -29784 -11193 -65386 -282725 -72072 -115260 -15593 -74972 -105797 163420 452233
13000 452233 14668 -10100 191821 101892 -84834 16363 67309 252264 -288173 -186749 -103014
12989 -103014 -78497 122591 4990 80453 75520 44654 -180328 160340 253512 -139873 -87258
12978 -87258 -119104 -1793 129370 117878 70108 63415 -178798 26968 -121393 -249533 -67300
12966 -56438 -38976 -18797 -24709 -39282 132925 273615 -62752 176696 13318 147631 -322793
12954 325823 75225 -290774 -218816 -303529 -139093 305496 58647 -26031 -65089 125903 256313
12943 256313 -155574 157581 174990 -37369 -26110 189422 -66203 -124106 80185 51523 228995
12932 228995 19895 -147843 226114 -35878 127503 28009 71006 -29656 -140150 -64160 7311
12920A72794b95979I0296J70656A1643a04198a5695j37390A51142N6091B7303
12909A68129F9708c0905E6896J51322b22826F8678b8713A58729m5466f1530A72179
12897h2044A41a96260A82629a06894l0378j09106A06511E821J36277J4948K1012
12886A78058a08968B13066o7738a60327B4163N12849b61483A72156J41694h7374
12875A45945A1980M6403k2977d264l6896A06330d0126a792D0356J66510b99072
12863a00415B39964d33803E1594J57078a05106G7451c82019a33031j4053B4069
12852E5756l130J38423A1245a22687c4624q0438B8053a98703a1625m7901C09596
12840B66774j7767J47010a51076A13371D8489c2364A92312l5166G028O5613o911
$$ plain form
12920 172794 -295979 90296 260952 11643 -104198 -15695 -153085 151142 207233 27303
12909 168129 69708 -30905 56896 208218 -222826 68678 -28713 158729 113263 -61530 172179
12897 -82044 141 -196260 182629 -106894 -137272 -246378 106511 5821 142098 157046 178058
12886 178058 -108968 213066 145328 -160327 24163 537012 -261483 172156 313850 -87374
12875 145945 11980 58383 35406 -4264 -41160 106330 -40126 -1792 40356 206866 -299072
12863 -100415 239964 -433803 51594 208672 -105106 77451 -382019 -133031 -147084 24069
12852 55756 52626 191049 11245 -122687 -34624 -115062 28053 -198703 -11625 -59526 309596
12840 266774 249007 396017 -151076 113371 48489 -32364 192312 157146 7028 72641 65730
12829F5730J28082f0644k63283A24914a76370g9806k4336D7237c8726B18625b82180
12817b80360A64869a46102E02208a29313a0917k60666E7030L3666a0206A73434
12806A26389n4904K87883b27622B40036d5106l1112A18528C568L5259J26826J84307
12795C49960a06939C6967j1400M14269a714B49244b11106B42677i4968C02153
12784d7942q484B76071p9686D3944b44181C8331b4355B88138I9950b66089e9459
12772a2914j21726A73962b33372g3283k94198I1637M2424g7284B45647O0400b78289
12760A61357K07793c77123A7251a21062A70284G9588b42895C35052n0652a9544
12749A12559l1306N3668E4606L31913b19810a9951l2948A51906J90362a22914
$$ plain form
12829 65730 193812 -60644 -323927 124914 -176370 -79806 -104142 47237 -38726 218625 -282180
12817 -280360 164869 -146102 502208 -129313 -10917 -271583 57030 90696 -10206 173434
12806 126389 71485 359368 -227622 240036 -45106 -76218 118528 3568 38827 165653 349960
12795 349960 -106939 36967 25567 439836 -1714 249244 -211106 242677 -94968 302153
12784 -47942 -56426 276071 196385 43944 -244181 38331 -24355 288138 99950 -266089 -59459
12772 -12914 -134640 173962 -233372 -73283 -367481 91637 134061 -77284 245647 306047 -278289
12760 161357 369150 -377123 17251 -121062 170284 79588 -242895 335052 284400 -19544
12749 112559 81253 134921 54606 386519 -219810 -19951 -52899 151906 342268 -122914
12738A21729d5220K2448r5780A98370J82320j60099n1269F9215L60140B12175
12727c6594B93603a6540o5137L4999C05101A37871J4374f6896B15163G0180A2560
12715b27219A3496P0546g698A47510B4863K73855g0016B83781a3485j47622L4756
12704a26351B6834K35606J0334a402B3946Q2061D0274J67467E8241m99C416L10271
12692C13687j05086b88471C2845b09446j87967b6781j5484B84551O2700F3295
12681A26361b599p0211K6459q8519A09868C4274O7197K17853a40318c5806A19441
12669d5237l122o2741H7445J49344j14891N9952n4870J79751b75043B50655B3462
12657B52189E7074L28089i1493H4489b8623A32256c6274m6701q944b1543j23104
$$ plain form
12738 121729 -45220 -22772 -118552 198370 380690 220591 169322 69215 429355 212175
12727 -36594 293603 -16540 -81677 -46678 305101 137871 152245 -66896 215163 70180 12560
12715 -227219 13496 84042 -7698 147510 24863 298718 -70016 283781 -13485 -161107 -126351
12704 -126351 26834 262440 272774 -1402 23946 106007 40274 207741 58241 57742 3416 313687
12692 313687 208601 -288471 32845 -209446 -397413 -26781 -42265 284551 347251 63295
12681 126361 -2599 -72810 -46351 -134870 109868 34274 101471 319324 -140318 -35806 119441
12669 -45237 -48359 -111100 87445 236789 121898 181850 126980 306731 -275043 250655 23462
12657 252189 57074 385163 -91493 84489 -28623 132256 -36274 -82975 -91919 -21543 -144647
12646a44647A21966f2191B23594A8992K40917D4807B1347Q0073M45169B23450
12635A6332f9862A82747J29702j52430J62044j31997m5203Q0075J41452H061M23847
12624D31908i0551A91761K6864a43633A66750a1272A47043o0617a03938F6221
12613b03797A53403o8378J2021Q9299n1009g456j69714B02672i8720A54307n8345
12602I5962b56669c6094B38970r3291b16633C67840A1494d8336A20942b37578
12591a62030C28849C9346d6741I622J74555b5458p0586k1173a2340j03750N3384
12580f2706G4602b4053C290f7565F7787a34149M3083B048J12466N2383N1828E8137
12567A62077H0719J30708E7071j4123N4222b0893B915b59887B09084a73918Q6365
$$ plain form
12646 -144647 121966 -62191 223594 18992 259909 44807 21347 101420 546589 223450
12635 16332 -69862 182747 312449 160019 322063 190066 144863 224938 366390 8061 431908
12624 431908 -90551 191761 218625 -143633 166750 -11272 147043 86426 -103938 66221
12613 -203797 153403 85025 97046 186345 135336 -7456 -177170 202672 -98720 154307 95962
12602 95962 -256669 -36094 238970 145679 -216633 367840 11494 -48336 120942 -237578
12591 -162030 328849 39346 -46741 9622 184177 -25458 -96044 -117217 -12340 -116090 -62706
12580 -62706 74602 -24053 3290 -67565 67787 -134149 -91066 2048 114514 166897 218725 58137
12567 162077 80719 211427 57071 42948 97170 -20893 2915 -259887 209084 -173918 -87553
12556h7553c8969I3934a31053B66131b75083A80966B0494b21105d2710D2404J63458
12545B05862a55666k6138c95I5779f5580j67026a02225A35155r474Q5466a50034
12533A59070G7757d39708i0086L4368C8880a09251k05059J42221Q2183A41977
12522A02891f7938A17133e4393E203L44347J15928h9367A68027k9388h2775a9714
12510B42405a26328j43588f5230o135l5148B88178C0598b17608B04086a20246
12499A18139D2191N1482K5699a1917m4212B99199F9600J2779Q9218c0945A61642
12487C75986A31943j9087a310F9160h9259c2725B60831F7011o569c42744i0827
12475A02107J21679o9993a975G659J36724c06658B55649f458A62257J2290c1586
$$ plain form
12556 -87553 -38969 93934 -131053 266131 -275083 180966 20494 -221105 -42710 42404 205862
12545 205862 -155666 -181804 -395 95779 -65580 -232606 -102225 135155 125681 211147 -150034
12533 159070 77757 -439708 -90086 -55718 38880 -109251 -314310 -172089 -89906 141977
12522 102891 -67938 117133 -54393 5203 349550 465478 -89367 168027 138639 -82775 -19714
12510 242405 -126328 -269916 -65230 -71365 -106513 288178 30598 -217608 204086 -120246
12499 118139 42191 93673 119372 -11917 -56129 299199 69600 82379 171597 -30945 161642
12487 375986 131943 112856 -1310 69160 -89259 -32725 260831 67011 60442 -342744 -90827
12475 102107 223786 153793 -1975 7659 144383 -306658 255649 -6458 162257 174547 -31586
12463D85172a69629F0662K11368a57406A52950G4709J06199n6488R9864D4445
12452A31143a87313R1368n11B33020c22524B17754b2890R574j88269k59285f9263
12440d8895J9507G3621q332a75919J7672a7190k24153A8754a6717j10356B9482
12428a35457H1358K49216A03719i2296A32857b00809C73125a6813A06444J50556
12418B57000i2908B59785c19968B29129b35699b5609C64077A41466K1781a98016
12407a32506d7442A50345d4633A06015J09894c69303b1240j30616A57299J87627
12397C44926A46042d150n0035j8079A15998b23335j63055F1067b09609B00816
12386A3110a55951a1070A12231Q4618a8445k63977A37747a5900l0918A74490L32519
$$ plain form
12463 485172 -169629 60662 272030 -157406 152950 74709 180908 124420 224284 44445
12452 131143 -187313 -95945 -96456 233020 -322524 217754 -22890 -13316 -201585 -460870 -69263
12440 -48895 -29388 73621 65289 -175919 -158247 -17190 -241343 18754 -16717 -127073 29482
12428 -135457 81358 330574 103719 -92296 132857 -200809 373125 -16813 106444 257000
12418 257000 -92908 259785 -319968 229129 -235699 -25609 364077 141466 163247 -198016
12407 -132506 -47442 150345 -44633 106015 215909 -369303 -21240 -151856 157299 344926
12397 344926 146042 -4150 -54185 -72264 115998 -223335 -386390 61067 -209609 200816
12386 13110 -155951 -11070 112231 196849 -18445 -282422 137747 -15900 -46818 174490 507009
12375E07009b76460a08259C65860E6138K70125B6951J53486b18225p2261g7795
12364B8088J06061E1162o953R2837d9740F6437k346N2870a9176d989G0961K07409
12352B78370b63117D23066A51910b4342k02232A81662b66153B45246A15737B3954
12341A033O0993N469i1604d3186l24285C31170B8131b83899A97708i5316C60103
12329b52204e9825C4550h1655k63428a68867A35626a37993n8953j14824L1057
12319b80713G4652J80197n7305q2204g4434k12201F7674q797Q892b54326k782
12308b57108A37864a73702j13998e2201a9105l1920C89027f0842C749J02338g8016
12296A54609m7787a82707C34389b2667l98152a26293p5840B57331A3882R2382
$$ plain form
12375 507009 -276460 -108259 365860 56138 326263 26951 180437 -218225 -290486 -77795
12364 28088 134149 51162 44209 137046 -49740 66437 64091 116961 -19176 -4989 70961 278370
12352 278370 -263117 423066 151910 -24342 -226574 181662 -266153 245246 115737 23954
12341 1033 62026 67495 -91604 -43186 -367471 331170 28131 -283899 197708 -95316 360103
12329 -252204 -59825 34550 -81655 -345083 -168867 135626 -137993 -196946 -311770 -280713
12319 -280713 74652 254849 197544 115340 -74434 -286635 67674 58877 67769 -254326 -257108
12308 -257108 137864 -173702 -287700 -52201 -19105 -51025 389027 -60842 3749 106087 -78016
12296 154609 106822 -182707 334389 -22667 -420819 -126293 -202133 257331 13882 106264
12286A06264c5704H6332b7825k14345c5028q5370L1248M2136k7651j22551A13907
12274B05774b2545B46851A22105b29462C9932b19558A23307A2780b50982A05744
12263h8390A64942k7285K23425k4503q8641E2682h9397L8851j4193D5400d8707
12251B51681a14796E7659M0642M4612b61585I08K20007h9637L6468A65783K91053
12240D56836d1195G6143K08438A12339R5207C6548L87310d5673B5707K35129A22568
12228A39658k4876b2723j99758B74783l0567A15131K15038A43233N343J32288
12218B80864n9571c4503E18115j75932C4337b7101F8069K48711I6382a96952B43340
12206B31890l7699J8696E6631A6168R566f4503F6171K43084q7126J3675R4503
$$ plain form
12286 106264 -35704 86332 -27825 -242170 -35028 -120398 -89150 -47014 -74665 -197216 113907
12274 205774 -22545 246851 122105 -229462 39932 -219558 123307 12780 -250982 105744
12263 -88390 164942 137657 361082 336579 247938 52682 -89397 -50546 -64739 45400 -48707
12251 251681 -114796 57659 98301 142913 -261585 908 220915 -89637 -53169 165783 456836
12240 456836 -41195 76143 284581 112339 207546 36548 423858 -45673 25707 260836 122568
12228 139658 114782 -22723 -222481 274783 244216 115131 330169 143233 148576 280864
12218 280864 221293 -34503 518115 342183 34337 -27101 68069 316780 96382 -196952 243340
12206 231890 194191 212887 56631 16168 25734 -64503 66171 309255 222129 235804 330307
12195C30307A29233j0650l8800N0053F1204J48261M4502f6630A96200b62590I1846
12183A49279B2274b7357A35251o7151L78152G5447j2071B925K33432a05665B34616
12171f3461F700f1148k20710B98529k0478e4436C44922j42511E8701J28728g1643
12159B07542E7176J92565A24336h5836l1903k6180A30532A0746h6584B85764A3867
12147B63923I7777O0333a62981A19213e5843G6669a59102A1141K30023K67693
12137E08857A24668h49j25796B0445K03191F5450N8013f1546A74109c8280o2547
12126a00827b0576E5315b67575R9336B34045c79194E8284L77938q2601J8890d03710
12114F1143O3227b7360D62550l7178H0171J87595B6788J40643a61337g8989A6123
$$ plain form
12195 330307 129233 118583 79783 129836 61204 209465 253967 -66630 196200 -262590 91846
12183 149279 22274 -27357 135251 68100 446252 75447 63376 2925 236357 -105665 234616
12171 -63461 6700 -61148 -281858 298529 278051 -54436 344922 202411 58701 187429 -71643
12159 207542 57176 249741 124336 -85836 -117739 -143919 130532 10746 -86584 285764 13867
12147 263923 97777 158110 -162981 119213 -55843 76669 -159102 11141 241164 508857
12137 508857 124668 -849 -126645 20445 223636 65450 123463 -61546 174109 -38280 -100827
12126 -100827 -20576 55315 -267575 -168239 234045 -379194 58284 436222 353621 372511 -403710
12114 61143 124370 -27360 462550 425372 80171 267766 26788 167431 -161337 -78989 16123
12102A23293n4427e8903k11849M7752e6803A3684J20886M0217a1565a257j37070
12091a38327c3147l6449j21260D6630N502J86738a74643D1616R1722n6650b1264
12079D9573a35517H1283c62903A01719b84780a03742B3757b7904C62922j1588
12069C51334j12382j02422b46483A22811k0096j8615c0321A01713e20680F8184
12058b43185Q6272L1130p3017e5154a2189p1377B844J74194P3961g4143o4515
12047a38658A70089E2656c06042K8908A82541L2484c5001j72159C99879c834A59135
12035A33390m8657M33754O42424D13571R370j55716a98637b969C06846p0481B9878
12023d0162A30537a67023l6124j3756a05434C75038i6820A49616l1749i4553l4633
$$ plain form
12102 123293 68866 -58903 -270752 -223000 -56803 13684 134570 174787 -11565 -1257 -138327
12091 -138327 -33147 -69596 -190856 46630 52132 238870 -174643 41616 133338 76688 -21264
12079 49573 -135517 81283 -362903 101719 -284780 -103742 23757 -27904 362922 351334
12069 351334 238952 136530 -246483 122811 102715 84100 -30321 101713 -520680 68184
12058 -243185 -156913 -125783 -198800 -55154 -12189 -83566 2844 177038 250999 -74143 -138658
12047 -138658 170089 52656 -306042 -277134 182541 215025 -35001 -207160 399879 -3834 159135
12035 133390 84733 518487 1160911 413571 422941 267225 -198637 -2969 306846 236365 29878
12023 -40162 130537 -167023 -203147 -216903 -105434 375038 -96820 149616 117867 -94553 -129186
12012a29186d7612k40592F9829f7801J2476o3138k80587a5331k8642B26732E8710
12000B87504g7113A72058f7193B30974J9810c1156E3824g9978j66050j23922J67871
11989b02079K2638j08681E8088a57631N673G8663A7948J55658i0054j67899c9444
11977A12747g9572B03608a14351A49428a18253c1779j45731B00657d1296j15234
11967a56530G3575b5457a2370A4206g6477B8235a33635G58J15219a42737d9880
11955E1170b5629I7657a25842E2529J92001A3330a33280j2177i170j91780B8585
11943b7276j01979j82754J14770L501j38462a39351b4629h110A64382n4078J74782
11932B85086m0415e8204l5561A33505d54263A46921a50714I9436a28336k72267
$$ plain form
12012 -129186 -47612 -288204 69829 -67801 -55325 -118463 -399050 -15331 -43973 226732 58710
12000 287504 -77113 172058 -67193 230974 250784 -31156 53824 -79978 -246028 -369950 -202079
11989 -202079 -179441 -288122 58088 -157631 -151958 78663 17948 173606 -90054 -257953 -39444
11977 112747 -79572 203608 -114351 149428 -118253 -31779 -177510 200657 -41296 -156530
11967 -156530 73575 -25457 -12370 14206 -76477 28235 -133635 758 115977 -142737 -49880
11955 51170 -25629 97657 -125842 52529 244530 13330 -133280 -145457 -9170 -200950 28585
11943 -27276 -129255 -312009 -197239 -193738 -332200 -139351 -24629 -8110 164382 110304 285086
11932 285086 244671 -58204 -93765 133505 -454263 146921 -150714 99436 -128336 -400603
11922d00603E548b21209P0404k07675A05499O4797d3763a0924A7637L0226e1911
11910a26614F8738N108a00236A4600J27678b67842D12667H2173e603A72934m6667
11899A26267L4517G6933b61176B2829J54443b80604a35093L9686A74694f5858
11888A3084a45917B90487n9183o7391D1494a79220j53594D7250j6457K22703n8769
11877A94727b59682O732a22420k13950D8977e05732A70432a10071K1449E2854
11866e6811A90583l769a21447C59323B8181L07064a03805l09298g7808l5430F7057
11854i1397f664o0505E3712a22399F5635d28233P0996J25339B38139N3612F2962
11842b6982B98826c32637J56435B59350d65869B44329c84906c9157A34968K3039
$$ plain form
11922 -400603 5548 -221209 -150805 -358480 105499 170296 -43763 -10924 17637 47863 -51911
11910 -126614 68738 73846 -100236 14600 142278 -267842 412667 82173 -5603 172934 126267
11899 126267 160784 76933 -261176 22829 177272 -280604 -135093 -95407 174694 -65858
11888 13084 -145917 290487 231304 163913 41494 -179220 -332814 47250 30793 253496 194727
11877 194727 -259682 -252950 -122420 -336370 48977 -505732 170432 -110071 -88622 52854
11866 -56811 190583 186814 -121447 359323 28181 335245 -103805 -413103 -77808 -113238 67057
11854 -91397 -6664 -67169 53712 -122399 65635 -428233 -357237 -231898 238139 291751 62962
11842 -26982 298826 -332637 -176202 259350 -465869 244329 -384906 -39157 134968 158007
11832A58007b62673a05374a3945m06636J43199E192b41604P2147j19601g5287
11821B58910E031b6401m39187a38923j22375a9403p6585l9615B7721b78825l8311
11810c17136a30072A88313R4463g342l99891J77422A63466d8192A4850j758J8908
11799C2000a14195O766j93809j30229c6005A87336a38319A19333c66524i1126
11788A61815d9447B0008b06141Q5735K1546A22871A7655J19989J95251i1096p3423
11777a64519A09172h9526A60791A7763f1561A27485E0592r027a66440A25436e0742
11765B96175h1580j07457M4388O4645k30314C0535a75208A83945h0798k12550
11755b93348j34f2605p5432l06344A3434a5252n8158C51756b60812A8545b10606
$$ plain form
11832 158007 -262673 -105374 -13945 -420581 -277382 5192 -241604 -169457 -289058 -75287
11821 258910 5031 -26401 -465588 -138923 -261298 -19403 -95988 -135603 27721 -278825 -317136
11810 -317136 -130072 188313 282776 -7342 -407233 -229811 163466 -48192 14850 13092 32000
11799 32000 -114195 -107429 -301238 -431467 -36005 187336 -138319 119333 -366524 -91126
11788 161815 -49447 20008 -206141 -120406 -98860 122871 17655 137644 332895 -91096 -164519
11777 -164519 109172 -89526 160791 17763 -61561 127485 50592 41565 -166440 125436 -50742
11765 296175 -81580 -189037 -144649 -80004 -310318 30535 -175208 183945 -80798 -293348
11755 -293348 -293482 -62605 -138037 -444381 13434 -15252 -73410 351756 -260812 18545 -210606
11743f0820j37021i8004A43809e5611a4686k89340a40164e8573K8859G5117a04969
11731a07037B47153a79806A66391a57439A38938F2935K0169g8175I848b2571A83237
11719H1789b7526k32821b1011j91675e2997B86745a18903l5708P5622o3747M1658
11708a01078k29428a27588B4331M1856J39666a18415D5337J6567f8745j04515
11698a73260R272j72321E6294K80259b74117A6432b59851B81353l819a04567A6302
11686A71390a15741H6244d09695c7823m20666A12070J39612a6928p1641c3228
11675B3947K88102a65536C11625a36098A78284G1053c6407j91973A29730B5439
11664b5699j21075j85069B7775Q9212B9996a06117j06648j2516b3860j38989d1603
$$ plain form
11743 -60820 -197841 -98004 143809 -55611 -14686 -304026 -140164 -58573 -29714 75117 -104969
11731 -107037 247153 -179806 166391 -157439 138938 62935 83104 -78175 9848 -22571 183237
11719 81789 -27526 -260347 -21011 -212686 -52997 286745 -118903 -154611 -78989 -142736 -101078
11708 -101078 -330506 -127588 24331 66187 205853 -118415 45337 61904 -68745 -173260
11698 -173260 -163988 -336309 56294 336553 -274117 16432 -259851 281353 277534 -104567 16302
11686 171390 -115741 86244 -409695 -37823 -458489 112070 251682 -16928 -88569 -33228
11675 23947 312049 -165536 311625 -136098 178284 71053 -36407 -228380 129730 25439
11664 -25699 -146774 -331843 27775 116987 29996 -106117 -212765 -225281 -23860 -162849 -41603
11652A20382m3642J17377q9152a83A47441a71999B63900D6394d45594d4046j71288
11641b15334e4933i125B38590b85465P9807M0985j51949C80574A33482a8496A8234
11629H7829D0816a03753j71622r2257h0504D25796a15531A12811c5956j18644
11619a54600c0808m8059B98032a33966F9610b46409n2696c9927j861l5396c5484
11607a28999p3409G2084b85696a18022j19775d0822A33980n8476l7350a33700
11596G552a36743A99645f4962A86210a39640A2280R5774b22612B62932G1385e8681
11584b23131A273J15893l4809J70175c7144H158M1146b69070B72812i3009A46325
11572A66569Q9946b19975h0850r9519J0284k20413A24250e2424B83797B6450M1799
$$ plain form
11652 120382 76740 194117 104965 -183 147441 -171999 263900 46394 -445594 -44046 -215334
11641 -215334 -54933 -9125 238590 -285465 -205658 -164673 -316622 380574 133482 -18496 18234
11629 87829 40816 -103753 -275375 -367632 -80504 425796 -115531 112811 -35956 -154600
11619 -154600 -30808 -78867 298032 -133966 69610 -246409 -299105 -39927 -41788 -77184 -35484
11607 -128999 -202408 72084 -285696 -118022 -237797 -40822 133980 75504 38154 -133700
11596 7552 -136743 199645 -64962 186210 -139640 12280 108054 -222612 262932 71385 -58681
11584 -223131 1273 117166 82357 252532 -37144 8158 49304 -269070 272812 -93009 146325
11572 166569 256515 -219975 -80850 -180369 -170085 -390498 124250 -52424 283797 26450 68249
11561F8249b03788G7642a0112k17672B29690a30140O206d9722A8710e4376B56932
11549a83825H1357k7751b52929f9187G8635J87323a21182F5153B0429K0957h5804
11537A59382E4683h5344H595L0615K61303a59223a2061j73251D8546J29375R1651
11526B69572j00824p5738J17849a90713C16302a38070k8626D24809h4278J6107
11516f8171A07776J47142J26596I2135M45280a50708E0461J44273a03705A60484
11505A49611a25990A9778Q9058k8774O4262M9042L8590r754c9839G1037M11425
11494D82462F671M7813K06526M4104b62686C15383J31686A6679J56702A6509L72796
11483C89305A4789M12356F1209J05621j511K17187A21245a10434a0755j17602
$$ plain form
11561 68249 -203788 77642 -10112 -227784 229690 -130140 -123934 -49722 18710 -54376 256932
11549 -183825 81357 53606 -252929 -69187 78635 265958 -121182 65153 20429 41386 -85804
11537 159382 54683 -85344 8595 39210 300513 -159223 -12061 -185312 48546 177921 269572
11526 269572 168748 93010 210859 -190713 316302 -138070 -166696 424809 -84278 -68171
11516 -68171 107776 254918 381514 92135 537415 -150708 50461 194734 -103705 160484
11505 149611 -125990 19778 108836 80062 144324 193366 231956 222202 -39839 71037 482462
11494 482462 6671 54484 261010 305114 -262686 315383 447069 16679 173381 16509 389305
11483 389305 14789 427145 61209 166830 165319 382506 121245 -110434 -10755 -128357
11473a28357A55093J47193a98416B67047c3280B07508n8583G1179M3223R3638
11463B08040K10066f2515a7138A07363K7193a05289C3199R1467J5193d1237B0928
11451a8295B53540I5717m1395K62993b23375B54158i12D05046A3853h7121A14654
11439A7942M8279g7278B56964c36010c1614j53384C112c054B03386o24b5700G8148
11426b52580I962b93428h2075A39769e1571r697j56974j34441d9822A2722c3632
11414b14186E1237K8730Q4906a9023A6914f4104c1717m53732g1841k5354j22836
11403b20031A24325R4168c28174H1341b1298A57570b57629A68978P5795d5096
11392c8440A3360b4868A26473a73739A03054c2108A41662a66970D6010J61352
$$ plain form
11473 -128357 155093 302286 -198416 267047 -33280 207508 148925 71179 114402 208040
11463 208040 418106 -62515 -17138 107363 134556 -105289 33199 124666 139859 -41237 20928
11451 -18295 253540 95717 54322 317315 -223375 254158 -912 405046 13853 -87121 114654
11439 17942 66221 -77278 256964 -336010 -31614 -184998 3112 -3054 203386 202762 -25700 78148
11426 -252580 9962 -293428 -82075 139769 -51571 -61268 -218242 -352683 -49822 12722 -33632
11414 -214186 51237 79967 164873 -19023 16914 -64104 -31717 -485449 -71841 -97195 -220031
11403 -220031 124325 218493 -328174 81341 -21298 157570 -257629 168978 244773 -45096
11392 -38440 13360 -24868 126473 -173739 103054 -32108 141662 -166970 46010 207362
11382B07362d0961a1783k4026n1760A56377K48907b15052R7454C316a08011q4854
11371a92865B86186a92489c0940j4763r4346j37262a28827C30374a37316r3306
11361b30622A16212a47965N7706J4943B7866a19556B5220h8078d1025B03434l7555
11350A65879d3258j39436M700j2499N7999q4981A22525a32635C28344b68040C48225
11338F4070h832n0173l0687k04249A85149M5912a5478j7110p3059A86253a54439
11326c5980j19794C63990p5158e17999K02877A76768a03904B76791L7167j33695
11316A80263O122c27328O6342a5846B7007L034a32995j71415D6015b96850M6779
11305b50071r486g4098o543m8210m6915A2859i9787d5035A43017a81887B2704
$$ plain form
11382 207362 -40961 -11783 -35809 -87569 156377 405284 -215052 -117598 3316 -108011 -192865
11371 -192865 286186 -192489 -30940 -45703 -140049 -277311 -128827 330374 -137316 -230622
11361 -230622 116212 -147965 -90259 -75316 27866 -119556 25220 -88078 -41025 203434 165879
11350 165879 -43258 -182694 -177994 -190493 -132494 -217475 122525 -132635 328344 -268040 348225
11338 64070 -8832 -59005 -89692 -293941 185149 231061 -15478 -32588 -105647 186253 -154439
11326 -35980 -155774 363990 288832 -517999 -315122 176768 -103904 276791 313958 180263
11316 180263 186385 -327328 -260986 -15846 27007 30041 -132995 -304410 46015 -296850 -250071
11305 -250071 -259557 -74098 -80641 -128851 -175766 12859 -99787 -45035 143017 -181887 22704
11293A53378g0358n3341R488C15434e2545j91651a17159B03947f4105q2221B2380
11281i3385q4775g6001G1683c6222F8581k3070A0370O9012J5134a53462p9043
11270b32505q3571c1057J1346n8296j70711B02466a10505N226B84187F4730C860
11258b93733A0844K2317g4461j32774A33463c00339d3856j19899k89785i6063
11247d05785H6381H613f7571I9586c33921J34275L7063G4174M8567l06J8966c79845
11234a40862A22282n6991a44385G7938b18998c8411C33208a9547H3299J4040a41984
11222a8159j70638j37799D7122c0843B20911F0849J82929b16056e9390q0591b2718
11210h8369F0531k9923b535k72117C067O5818J04098G6880e14157B6443K05484
$$ plain form
11293 153378 -70358 -123699 -114211 315434 -52545 -244196 -117159 203947 -64105 -146326 22380
11281 -93385 -178160 -76001 71683 -36222 68581 45511 10370 79382 94516 -153462 -232505
11270 -232505 -316076 -31057 -19711 -78007 -248718 202466 -110505 -105279 284187 64730 3860
11258 -293733 10844 33161 -74461 -207235 133463 -300339 -43856 -163755 -453540 -96063
11247 -405785 86381 8613 -67571 99586 -333921 -199646 -162583 74174 122741 122435 141401 -379845
11234 -140862 122282 65291 -144385 77938 -218998 -38411 333208 -19547 83299 97339 -141984
11222 -18159 -188797 -326596 47122 -30843 220911 60849 243778 -216056 -59390 -139981 -22718
11210 -88369 60531 30608 -2535 -274652 3067 68885 172983 76880 -514157 26443 231927
11199B31927b44493a2271q4663A28436K7140J65185h5739B24408f1823A2704n450
11188G254K93001b61973B06152a49703A98227C3962a41787J2455K0253j36165
11178b45244I8544c3618k8567A64616K13077j13003d4084j97686A60333a39612
11167h2926m0262H5611P5765E6250a10469k14060A64425B815M0544a47001k2583
11156a69584A37153B139a78411N1958d2362B24629b22349c4319j40016P7166p226
11145a04395L3103A53863a87724Q5708l03590J29864B09808m8237m3084m7243
11135G1244b96115f9612A8002c735B33164G5323K0948L03362j37748H2301N2432
11124A34733P2595a97806L2744H6472d70769f4360b859A2378h3378b8852l33460
$$ plain form
11199 231927 -244493 -12271 -96934 128436 155576 320761 -85739 224408 -61823 12704 7254
11188 7254 300255 -261973 206152 -149703 198227 33962 -141787 -129332 -109079 -245244
11178 -245244 98544 -33618 -62185 164616 377693 264690 -44084 -241770 160333 -139612
11167 -82926 -123188 85611 161376 56250 -110469 -324529 164425 2815 43359 -147001 -169584
11156 -169584 137153 2139 -178411 -126453 -42362 224629 -222349 -34319 -174335 -97169 -104395
11145 -104395 -71292 153863 -187724 -102016 -405606 -275742 209808 161571 118487 71244
11135 71244 -296115 -69612 18002 -3735 233164 75323 96271 399633 261885 82301 134733
11124 134733 207328 -197806 -165062 86472 -470769 -64360 -2859 12378 -83378 -28852 -362312
11113c62312B89394j05257D8322K17258H5363d134A19943m390R8746H9730P1301
11102A61031J94267l8090p5289O6403K6343m90b3639D9972K90521l3119A46226
11090A28906n0643M9541j042J669K4839J04480d0351B76073C7275R2965P2942
11079B03182K19581A46036P2979N3223n5321K34598b4096C92454J69719B04301
11068C36094A36019K65242p4730j33022H0791N21716B01000J93194j07907J99752
11058D86039N7253k47165K68627K5831K2411p6120K44730l39225K54081j62865
11048E33597L34409A15224P31138O0773l58597J19984j21452p8135j10479P4324
11038D32780L67397j04482B59290N65940l66624K21003p7849J15570j67707J65646
$$ plain form
11113 -362312 289394 184137 48322 265580 85363 -4134 119943 115553 214299 89730 161031
11102 161031 355298 317208 241919 308322 334665 334175 -23639 49972 340493 307374 146226
11090 128906 78263 127804 126762 128431 153270 257750 -40351 276073 37275 130240 203182
11079 203182 422763 146036 219015 272238 216917 451515 -24096 392454 562173 204301
11068 336094 136019 401261 326531 193509 80791 602507 201000 394194 286287 486039
11058 486039 543292 296127 564754 590585 612996 536876 781606 442381 696462 533597
11048 533597 868006 115224 846362 907135 548538 668522 547070 468935 358456 432780
11038 432780 800177 695695 259290 825230 458606 679609 601760 717330 549623 715269
11028G15269j02579j7261M5053J98160J82864r8593l0970A30373K95928K23933
11018F50234j27311j37746P8700J65128m6300J47058k0753k89236K76119j11585
11008E84308Q1302l24100K56931K08127r5480k45977J57535K55818k53161j10550
10998E14753n6864K85053n2621n3758J7044K41937l33345J30342j86072J93143
10988F99612J71669k53956P8555K21759J22187l77179O13771m33919K97842K6584
10978A166925L07655m434P2092M90173J67886M41690k43441M32688M6227n58631
10968B318830L89599r7801l10382p79728k1774Q5695m76547J5257q5052R2565
10958A130662j80877j93100J63343n2872m09908K8391j06274j05761H6158L12911
$$ plain form
11028 715269 612690 595429 640482 838642 1021506 922913 891943 130373 426301 650234
11018 650234 522923 385177 463877 629005 582705 729763 709010 419774 695893 584308
11008 584308 665610 341510 598441 806568 711088 465111 622646 878464 625303 514753
10998 514753 457889 742942 690321 636563 653607 895544 562199 692541 506469 699612
10988 699612 871281 617325 695880 917639 1039826 662647 1276418 842499 1140341 1166925
10978 1166925 1474580 1470146 1542238 2032411 2200297 2641987 2398546 2831234 2877461 2318830
10968 2318830 2708429 2610628 2300246 1520518 1498744 1584439 1107892 1123149 1038097 1130662
10958 1130662 949785 756685 920028 867156 457248 485639 379365 273604 86158 399069
10948C99069j03524a24460A58182L35819n1268g8235G3865K1350D0947J825J25844
10937A68616b02124a9756C41742m0229l5857H6024a53840k62964B6714N3845Q6707
10926A67266E9933a1660n5647A36238a88505j13720C8327L08443F0758a8099A44867
10914d5408B37090a21983A90345c9444r9720G4216L290i5138E0621a99113A00242
10902A08136J4914d99008H7236R7918G7554c23013a40984H1047a80980p385B33056
10890A20593K76471b76910f3945B9740h0379q2359G385J7513L2040P2738f08097
10878A4669P077b32498f8048K7127G3501a74257A08175h6269o1722c3917B48418
10866H9739O6819b76198P8659B07476H0925L9722a88875j0925b095B9126a00026
$$ plain form
10948 399069 295545 -124460 158182 494001 442733 -78235 73865 95215 40947 42772 168616
10937 168616 -202124 -19756 341742 301513 265656 86024 -153840 -416804 26714 80559 167266
10926 167266 59933 -11660 -67307 136238 -188505 -302225 38327 346770 60758 -18099 144867
10914 -45408 237090 -121983 190345 -39444 -139164 74216 77506 -95138 50621 -199113 100242
10902 108136 123050 -499008 87236 185154 77554 -323013 -140984 81047 -180980 -188365 233056
10890 120593 397064 -276910 -63945 29740 -80379 -162738 7385 24898 56938 129676 -608097
10878 14669 21746 -232498 -68048 -40921 73501 -174257 108175 -86269 -147991 -33917 248418
10866 89739 156558 -276198 -197539 207476 80925 120647 -188875 -199800 -2095 29126 -100026
10854a68575c1245j610N026A52849A4445J91499M3675q1232b01259B3343b72798
10842B3199c91807b5171j94804P0793D9582g598A3303a62710A15852b99900C3662
10830G1505K488d500j72754C00879b00822Q2255l74791K31857B44777H8289a57179
10818B38255B2736p92J13609a16022C0622L4200N8735a14786A23136a53662B92324
10806b6241B5922a88916M230h7422E1971b72127B28287b16190j20399F5599d9949
10794b25537j9628g5512K7831j17410j9991P1530l2752k6126f6257F7814b89137
10782c37896A20581l4742M2794b212j39142j4992P591A26019a1861j4664a2188
10770A36620g8109j32238j09475a58439E242b06037J6296D788N6011N5705J17740
$$ plain form
10854 -168575 -31245 -32855 -27829 152849 14445 205944 249619 168387 -201259 23343 -272798
10842 23199 -391807 -25171 -219975 -149182 49582 -7598 13303 -162710 115852 -299900 33662
10830 71505 73993 -4500 -177254 300879 -200822 -118567 -493358 -261501 244777 88289 -157179
10818 238255 22736 21944 135553 -116022 30622 64822 123557 -114786 123136 -153662 292324
10806 -26241 25922 -188916 -184686 -87422 51971 -272127 228287 -216190 -336589 65599 -49949
10794 -225537 -245165 -75512 -47681 -165091 -185082 -113552 -146304 -172430 -66257 67814 -289137
10782 -337896 120581 85839 128633 -2212 -141354 -156346 -148755 126019 -11861 -26525 -12188
10770 136620 -78109 -210347 -319822 -158439 5242 -206037 -189741 4788 60799 116504 234244
10759B34244a56305b9756j91475G769a85411A43548o0814L9600a65724A14501
10748i2376j02848E6428g7702G2910M6649a95046A62252A4810c8558A17910b79659
10736g9212B96750r8899d7078B73257B6026c30059G6531M8362K08665c69744E2987
10724a89720A37765a11449A60916h145j00176A1425K31211h5467a2579B07096
10713I316a19209e2496A1440Q7453d2904B8338d42106K13595h2217A25342M5984
10702A71326J5830m8856B9304J00208a78061m2300e2136p7135A59551b9004C1051
10690C4529K2909a69132B99766c57766A21813C0825a63793D5271A6684b81467
10679h4933B16722d61161a8519l53724L6560B9250a72104A91316E961a75685j90360
$$ plain form
10759 234244 -156305 -29756 -221231 7769 -185411 143548 82734 122334 -165724 114501
10748 -92376 -195224 56428 -77702 72910 119559 -195046 162252 14810 -38558 117910 -279659
10736 -79212 296750 197851 -47078 273257 26026 -330059 76531 124893 333558 -369744 52987
10724 -189720 137765 -111449 160916 -8145 -108321 11425 242636 -85467 -12579 207096
10713 9316 -119209 -52496 11440 98893 -42904 28338 -442106 -228511 -82217 125342 171326
10702 171326 187156 138300 29304 129512 -178061 -220361 -52136 -129271 159551 -29004 31051
10690 34529 57438 -169132 299766 -357766 121813 30825 -163793 45271 16684 -281467
10679 -84933 216722 -461161 -18519 -372243 -335683 29250 -172104 191316 5961 -175685 -366045
10668c66045A76892a38040m2907f5970A12503q616k8637g7014j03914B91805G7153
10656a35027d1615m6397j48398e007j08018F2114N8804f8545B721d49021b7382
10644b91340h2274n1293i505E0109c62390a66746F9215a76836d5929F2857c1512
10632a51784o3086A94439a9617j52758k3077P2704m65966a06531E8527a52539
10621C0058a34565L0374A53979d37173k2681b17604C28265o332A00450b31047
10610c24044J16152A87916a92323C4168P0206e9738A90825b4878j13179j98873
10600c36930A11230c7748A68475J44160A41571b52495a04582k55711J58064a2968
10589D3527J1918k4185M5764K4076e3198k95726C7675g5090A41830c13408a3947
$$ plain form
10668 -366045 176892 -138040 -180947 -65970 112503 103887 75250 -77014 -180928 291805 77153
10656 -135027 -41615 -88012 -236410 -5007 -113025 62114 120918 -68545 2721 -449021 -27382
10644 -291340 -82274 -133567 -9505 50109 -362390 -166746 69215 -176836 -45929 62857 -31512
10632 -151784 -214870 194439 -19617 -172375 -195452 -122748 -588714 -106531 58527 -152539
10621 30058 -134565 -104191 153979 -437173 -459854 -217604 328265 321933 100450 -231047
10610 -324044 -207892 187916 -192323 34168 104374 -59738 190825 -24878 -138057 -336930
10600 -336930 111230 -37748 168475 312635 141571 -252495 -104582 -360293 -202229 -12968
10589 43527 55445 31260 77024 101100 -53198 -348924 37675 -75090 141830 -313408 -13947
10577i5078a0679j6840j46017B77191a74157g1901B80427c74938A27609c33435
10566a65055e9500A22895O4984p9201i805c161j07664A79643E6374a53785K7208
10555a26577k81625A38955b86989F2111c14096d1116A03696o519c13929B66228
10544a21013D8004k3108a68573B75372B1633a2661m26266G2789f9112m804A27555
10532b30956A6332b13953C30865e4537p3210B29611c18256a31747G0044g2806
10521a9190E6723a74929G6778N7816J18824r6455a53841j12718a23341B28765
10510f03665B27625b15061j24251D7333F305J706J66704a37846L9915A13279a32003
10498A9681a02979k2225C7049p517h6443j95172r8566I4550d4230A27137a52796
$$ plain form
10577 -95078 -10679 -27519 -173536 277191 -174157 -71901 280427 -374938 127609 -333435
10566 -165055 -59500 122895 187879 108678 -9805 -3161 -110825 179643 56374 -153785 -126577
10555 -126577 -408202 138955 -286989 62111 -314096 -41116 103696 97177 -313929 266228
10544 -121013 48004 24896 -168573 275372 21633 -12661 -438927 72789 -69112 -73916 127555
10532 -230956 16332 -213953 330865 -54537 -127747 229611 -318256 -131747 70044 -72806
10521 -19190 56723 -174929 76778 134594 253418 156963 -153841 -266559 -123341 228765
10510 -603665 227625 -215061 -339312 47333 6305 8011 174715 -137846 -97931 113279 -132003
10498 19681 -102979 -125204 37049 29532 -86443 -281615 -380181 94550 -44230 127137 -152796
10486c438l33596A64245B23a14010k0450j06470A73433d99931A2343g5261j17247
10475a92508p6043a2740k918k76189C8890a84582A06081a00185B1312a87565p8291
10464b65856J06071c7258r1617a0898o1741J5478A24594B095i240o327B36524
10452A74721b38399e3668A17599i3511l4973I9818K59860a9793B11920j9418a38199
10440A33509K6705A0559i9460k01097C9219a97363c905k14277A57697A6611d8845
10428A88976o451n63b30400B0312J56381g5547A87456a58263j28687I4523a47144
10416a73609m521c9473g585k7871B0871b62412J13069k5294D283K84934A00427
10404a16952l3045B06389a10641e4170A21466a00628A34189i623l2521B01760
$$ plain form
10486 -3438 -337034 164245 223 -114010 -134460 -240930 173433 -499931 12343 -75261 -192508
10475 -192508 -268551 -12740 -15658 -291847 38890 -184582 106081 -100185 21312 -187565 -265856
10464 -265856 -159785 -37258 -128875 -10898 -72639 -57161 124594 2095 -9240 -15567 236524
10452 174721 -238399 -53668 117599 -93511 -128484 99818 359678 -19793 211920 192502 -138199
10440 133509 160214 10559 -99460 -300557 39219 -197363 -3905 -218182 157697 16611 -48845
10428 188976 182525 181962 -230400 20312 176693 -75547 187456 -158263 -286950 94523 -147144
10416 -173609 -178130 -39473 -7585 -35456 20871 -262412 -149343 -174637 4283 289217 100427
10404 -116952 -149997 206389 -110641 -54170 121466 -100628 134189 -9623 -42144 201760
10393C67822j58385k0172p791q476Q6394b3791B69659c11081d8563A03061P5009
10382A78070a76479B1511J07872c34032B8438O3145Q3995J46965l9464Q3666C425
10370A63597Q4579K91930L4956j99768m9106J42287j34288J65608H1117P7520
10360A58637R9072f5030B97671a10265C41067B7085J31423a63525F47846J19435
10350G67281O3469j47618j86920a50553D17311n1647j16116J04495r8575k6922
10340B28546F9082J79533J96597k05984N595J3312b30355C00478J51429j61796
10330B90111b84822I8741J96424D7503M4701G100K73197j10844O2394i914B57282
10318H953K00820B9420L2722h5396D0904K7971i0784A66223b1869B3718g7325
$$ plain form
10393 367822 209437 189265 181474 172998 259392 -23791 269659 -311081 -48563 103061 178070
10382 178070 -176479 21511 129383 -334032 28438 91583 175578 322543 283079 366745 3425
10370 163597 248176 540106 575062 375294 326188 468475 334187 499795 81117 158637
10360 158637 257709 -65030 297671 -110265 341067 27085 158508 -163525 647846 767281
10350 767281 830750 683132 496212 -150553 417311 365664 249548 354043 255468 228546
10340 228546 69082 248615 445212 239228 244823 258135 -230355 300478 451907 290111
10330 290111 -284822 98741 295165 47503 92204 7100 280297 169453 231847 -9914 257282
10318 8953 209773 29420 62142 -85396 40904 68875 -90784 166223 -21869 23718 -77325
10306a20226a8934n7303k5613j6468k20051a01011B94328B7649J51297M1548b29692
10294c2832j76028d7048E0382A7871R5336J57893A14084n6479d08257D81781A67093
10282a13350j39778n1826E1757P4727l4303J25973B5781N3692b83003C0036J17203
10271A47239J28285a52624r4934b4125p6755p0969d8538j70476Q0982e9929D5993
10259a09829a3255F1286f4419B88259b2138D04542n4263e8275B27323A02918J04509
10248B07427a3702B47867A14669k0190a34104j6640q467j01758Q582A32011b9096
10236d7266F4784O9981b08610A48155i1119A59566a08864j30776A16617J0631
10226A27248n083a7037C265J73690E2466k1313L5746J75577a01834A90623E1198
$$ plain form
10306 -120226 -18934 -76237 -101850 -118318 -338369 -101011 294328 27649 178946 220494 -229692
10294 -32832 -208860 -47048 50382 17871 113207 271100 114084 57605 -408257 481781 167093
10282 -113350 -253128 -304954 51757 126484 92181 218154 25781 79473 -283003 30036 147239
10271 147239 275524 -152624 -247558 -24125 -100880 -171849 -48538 -219014 -138032 -59929 45993
10259 -109829 -13255 61286 -64419 288259 -22138 404542 350279 -58275 227323 102918 207427
10248 207427 -13702 247867 114669 94479 -134104 -150744 -159211 -260969 -252387 132011 -29096
10236 -47266 64784 134765 -208610 148155 -91119 159566 -108864 -239640 116617 127248
10226 127248 122165 -17037 3265 176955 52466 31153 66899 242476 -101834 190623 51198
10214b0880A95570a84535J5653A62590a54447P0763k7184j63871k5825A14906
10203a85299j04551b7949R097k11305i0365j62298g0806A18101d45660a28308
10192a50538C3223a94953g6017j19944A07202J89292A2111a03665C02266a80177
10181f8107B73231a81876A64090N2670b58816i4370r3030G1759a10245H6686C893
10169h5741E7216a95245D1745a5115j08868j88543M8508J29562l4524M7956B3132
10157g3046l2048K8972b494A79799b38603i4468j18970r3108A28040e021E2654
10145C6830f1175A54566a36826L3584j57107I0700A9541a95197l44684D7977b09806
10133d2632A49053a94810D7748J1533b0431G8972g0478j34942K7372l2818L160
$$ plain form
10214 -20880 195570 -184535 -168882 162590 -154447 -83684 -110868 -274739 -300564 114906
10203 -185299 -289850 -27949 -18852 -230157 -90365 -252663 -70806 118101 -445660 -128308
10192 -150538 33223 -194953 -76017 -195961 107202 296494 12111 -103665 302266 -180177
10181 -68107 273231 -181876 164090 216760 -258816 -94370 -187400 71759 -110245 86686 3893
10169 -85741 57216 -195245 41745 -15115 -123983 -312526 -264018 -134456 -168980 -121024 23132
10157 -73046 -105094 -76122 -2494 179799 -238603 -94468 -213438 -306546 128040 -5021 52654
10145 36830 -61175 154566 -136826 -103242 -260349 90700 19541 -195197 -539881 47977 -209806
10133 -42632 149053 -194810 47748 59281 -20431 78972 -70478 -205420 -178048 -210866 -207706
10122b07706k64429K18570a7259A5880k176c01633d0193E8926a31333h682C03385
10110B04207B3481a51621d1316m3076A49405p0182b02009H2497A1118a64136B01338
10098a4723k1210m95045A06317g153l21682A33559n4953l6815L7507a13314a2788
10086C9122b29513c3681j11453N5679L1567I2500M0709b14443m0125B5573J4760
10075D0333b52014b5993H104a41101I0770a83773P8969F042d6740j53178N7253
10064a42665j3971k15142i9707l732A10208c87685i6291j03364B66720a80779
10053c2444k29577c992j01576I6038a60612A66771c63355h8067k18992j01090
10043d08149A57446j6400J82309h2818P044D3651h0704l85045I2089J65632a02653
$$ plain form
10122 -207706 -472135 -253565 -17259 15880 13704 -301633 -40193 58926 -131333 -8682 303385
10110 204207 23481 -151621 -41316 -84392 149405 79223 -202009 82497 11118 -164136 201338
10098 -14723 -35933 -530978 106317 -7153 -328835 133559 78606 41791 79298 -113314 -12788
10086 39122 -229513 -33681 -145134 -89455 -57888 92500 133209 -214443 -254568 25573 40333
10075 40333 -252014 -25993 8104 -141101 90770 -183773 -104804 6042 -46740 -199918 -142665
10064 -142665 -156636 -371778 -99707 -103439 110208 -387685 -96291 -199655 266720 -180779
10053 -32444 -262021 -3992 -105568 96038 -160612 166771 -363355 -88067 -307059 -408149
10043 -408149 157446 141046 323355 -82818 -75774 43651 -80704 -465749 92089 257721 -102653
10031a14937j6525k03261p2736A00081m0772Q3651a96925G5096J19275q4656a8491
10019a92467C08412a13264r8964o1878B1092e7736a8140k39293D7472Q9353f1021
10007b93350R1657b9058j2606j27640r9336G9375a52427B57891a82517J6161m0806
9996b07162b4406q46l6943k71485F7220a67580b0065k16345A7163b4761m6780
9985g1541j1530r2936B66393d35912A54492b6884k86126J16849f1802n5228A64218
9973a46753A23455b62688A20174a88401l6936h9329A5430Q7094c516k9854m9527
9962h2897D16768b13316q56g0289I5331a53063C22910j38256b06386K9626O9341
9951a07419A63053j4133e775l57675F7786p534b11654h9179I0886d5177p1925
$$ plain form
10031 -114937 -131462 -334723 -407459 100081 59309 142960 -196925 75096 194371 109715 -18491
10019 -192467 308412 -113264 -212228 -274106 21092 -57736 -18140 -257433 47472 136825 -61021
10007 -293350 -201693 -29058 -41664 -169304 -268640 79375 -152427 257891 -182517 -166356 -207162
9996 -207162 -24406 -25252 -62195 -333680 67220 -167580 -20065 -236410 17163 -24761 -71541
9985 -71541 -83071 -176007 266393 -435912 154492 -26884 -313010 -196161 -61802 -117030 164218
9973 -146753 123455 -262688 120174 -188401 -225337 -89329 15430 102524 -3516 -33370 -82897
9962 -82897 416768 -213316 -214172 -70289 95331 -153063 322910 184654 -206386 -176760 -107419
9951 -107419 163053 148920 -5775 -363450 67786 60252 -211654 -89179 90886 -45177 -117102
9940a17102j929b967I7998a64109L0465C75721b07145j89533a55149p0269B0289
9928h3411b1092j96357i4760m31814b27691B07878c35431a5622E0287J60523I6284
9916C0449c58651A11542i2068r196A5656i3191m0825j63049a42588j84334f9180
9904b1633k0583l6568m7026k76498a15979j05965j83961J73491D1822a01815L7706
9893f4109I605g5363m517B64591a6537A67465D0970a93080M6657j94784A51210
9881c8734A07922c40876A98079a5619l42006Q8913A25916b23690h8014E6544g542
9869c226j48599B20471a5770j9470E8130K69250c04424a28079J3542D8640h169
9857d06013a23181L374E826a35313f0885k08872a17031l01769a78031a3894l06196
$$ plain form
9940 -117102 -119031 -2967 97998 -164109 -133644 375721 -207145 -396678 -155149 -225418 20289
9928 -83411 -21092 -217449 -94760 -526574 -227691 207878 -335431 -15622 50287 210810 96284
9916 30449 -358651 111542 -92068 -101264 15656 -93191 -134016 -297065 -142588 -326922 -69180
9904 -21633 -42216 -78784 -125810 -402308 -115979 -221944 -405905 -232414 41822 -101815 -64109
9893 -64109 9605 -75363 -79880 264591 -16537 167465 40970 -193080 -146423 -341207 151210
9881 -38734 107922 -340876 198079 -15619 -357625 -268712 125916 -223690 -88014 56544 -7542
9869 -3226 -151825 220471 -15770 -35240 58130 327380 -304424 -128079 -114537 48640 -8169
9857 -406013 -123181 -119807 5826 -135313 -60885 -269757 -117031 -418800 -178031 -13894 -320090
9846c20090a31376A54979m6001l1443i7837a3576k33703A70694i7281d1857I0141
9834b10691j25063d5786p4465M7623B47c39140E2571a09825C4941R0068H227J29264
9822A37491b7005k61887I4303c8505G1909a48518B6868d45262F1084O982c40945
9810A36871c14329e3604l6055j53467A10959m6125c55972C4538N505b45036l8605
9799b83641i6993C49975h6460A11168J39059e5746n2037k52173j00061a02948
9788B98712a41826A88790a5913e72B29470A02371P6070H7227F612a9020B1509
9776a07566C22889b16044c2415B23227b91744B7739c7217A81324a01969c1923
9765b9145i513j1437q2968K6434L1194B59303h6499K4257k7223j91830h8615F4828
$$ plain form
9846 -320090 -131376 154979 108978 77535 -97837 -13576 -247279 170694 -97281 -41857 90141
9834 -210691 -335754 -45786 -120251 -72628 247 -339140 52571 -109825 34941 125009 8227 137491
9822 137491 -27005 -288892 94303 -38505 71909 -148518 26868 -445262 61084 68066 -340945
9810 136871 -314329 -53604 -89659 -243126 110959 64834 -355972 34538 40043 -245036 -283641
9799 -283641 -96993 349975 -86460 111168 250227 -55746 -107783 -359956 -460017 -102948
9788 298712 -141826 188790 -15913 -572 229470 102371 178441 87227 6612 -19020 21509
9776 -107566 322889 -216044 -32415 223227 -291744 27739 -37217 181324 -101969 -31923
9765 -29145 -9513 -20950 -103918 -77484 -46290 259303 -86499 -62242 -89465 -281295 -88615 64828
9752A01425g3152k14617A02021e3322r4138b0269l0967j44867n5466A9366g5114
9740a46051A00623a13861b7288k5129j2698j1121k46055a20577A12601D2958f4567
9728b55692h0024B2432r218a66011c3003l43101j0280F4171B8169J79361J01405
9717C08935o1037d2402j0699B45124A15987d57020b26610D5461d1750J1371F403
9705c59387g1650A93030c28533R9488J03486f2276q7888k25043A80506c78036
9694B02955h1317A75147f8765A66370d7916C25568j0373i0761j2576j3741c9784
9682a88441A61668a7947A77539b38520o2087k1171B2595b26300e1406j14139e5939
9670E1340c18730D4868g6026m8611C2954K9975g4159k63233q9272h2631K054k1513
$$ plain form
9752 101425 -73152 -287769 102021 -53322 -147460 -20269 -51236 -196103 -251569 19366 -75114
9740 -146051 100623 -113861 -27288 -52417 -65115 -76236 -322291 -120577 112601 42958 -64567
9728 -255692 -80024 22432 13214 -166011 -33003 -376104 -386384 64171 28169 207530 308935
9717 308935 247898 -42402 -53101 245124 115987 -457020 -226610 45461 -41750 -30379 6403
9705 -359387 -71650 193030 -328533 -229045 -125559 -62276 -150164 -375207 180506 -378036
9694 202955 -81317 175147 -68765 166370 -47916 325568 315195 -90761 -103337 -117078 -39784
9682 -188441 161668 -17947 177539 -238520 -300607 -321778 22595 -226300 -51406 -165545 -55939
9670 51340 -318730 44868 -76026 -124637 32954 62929 -74159 -337392 -426664 -82631 -80577 -102090
9658a02090B2650K05154a0589A13353a7015F8563e3373j77358f9339c2106j00744
9647a32850k19319J64538K1046j9216L2110k704J9343D37719a45335F0608K20827
9636B81435c91325J31211D9710c2611B52782g995l55832b8266H9343b01990m8703
9625b50693j75439A10509a96008J9790j83537B97718a26074f2759C6634M673J12148
9614A53455c04904d3882n3511A07322a53684B76367c9756B4560L0579a14009A965
9602b271A30041b4116l9623j76816G8107L771b02800a6090j55042l1799j81718
9591c84649J19933m1053a4148A9447N263d60806J35002D851d12463J11629a0023
9579b01878f260C9261q379J00915c07101A46734c8714B09619d2707D075K6413
$$ plain form
9658 -102090 22650 227804 -10589 113353 -17015 68563 -53373 -230731 -69339 -32106 -132850
9647 -132850 -352169 -187631 -166585 -185801 -153691 -156395 -137052 437719 -145335 60608 281435
9636 281435 -391325 -260114 49710 -32611 252782 -7995 -363827 -28266 89343 -201990 -250693
9625 -250693 -426132 110509 -196008 -176218 -359755 297718 -126074 -62759 36634 41307 153455
9614 153455 -304904 -43882 -97393 107322 -153684 276367 -39756 24560 55139 -114009 1965
9602 -2271 130041 -24116 -63739 -240555 78107 81878 -202800 -16090 -171132 -202931 -384649
9591 -384649 -264716 -305769 -14148 19447 24710 -460806 -325804 4851 -412463 -300834 -10023
9579 -201878 -6260 39261 30882 131797 -307101 146734 -38714 209619 -42707 4075 30488
9568C0488J43604b77667I490J02514a83313c6256l56087G9417c18558A21948o0348
9557F1600k6847J534a06394d179j66594j88937A20052I642J57373c73529H6600
9545a31461m57221A78625b96373a06135A85732b42229F1314Q2026A9812K3956
9535D3768J99095B1478a41016b2657r1303n9352j20589J05212H9528a10580K3354
9524h7226b2036F6690R6310m2545c26122h5339q4322K6706B1855b7905I0818A583
9511c4819j07992a651G6540g3224k83863a171A8221Q9056b70036L0123A26267
9499B40196A18072J23609h2926F8677e1198D5977a21276p4680j03628h906k38863
9488b47769R3230k1323A10910e3815k75977P1887C47503d28335f9403G0673l5259
$$ plain form
9568 30488 174092 -277667 9490 112004 -183313 -36256 -392343 79417 -318558 121948 61600
9557 61600 34753 36287 -106394 -4179 -170773 -359710 120052 9642 167015 -373529 86600
9545 -131461 -588682 178625 -296373 -106135 185732 -242229 61314 143340 19812 43768
9535 43768 242863 21478 -141016 -22657 -113960 -173312 -293901 -188689 89528 -110580 -87226
9524 -87226 -22036 66690 163000 120455 -326122 -85339 -169661 -142955 21855 -27905 90818 1583
9511 -34819 -142811 -1651 76540 -73224 -357087 -1171 18221 107277 -270036 -239913 126267
9499 240196 118072 241681 -82926 68677 -51198 45977 -121276 -195956 -299584 -8906 -247769
9488 -247769 -154539 -175862 110910 -53815 -329792 -257905 347503 -428335 -69403 70673 35414
9477C5414K3009J14126a44529p2282A3240L2929e1586A80400a43054A17091b10864
9465d3099A14830l5691a90456b1668k89880B8208K61701d2228j301k26967a02101
9453A00615b33678j37799C73805d31322B0534J24782i1859j8633B19719h3909
9442h6323J5516F5874i4425L2213q5699q0654B4199J07866K1234g863k79201d9892
9429H9225c11560L1434J35539K6101I7878m8177P2447a5373j68662d6285A27125
9417b20186K9296A69011e5592H3696c54666I1660a26995j58467g9940j14230i6345
9405b08579C45905a65660l58562a21070l10427a76485h6521C07375a27997o2521
9395a90518q4177A45224b52056D74862b30203A00403K4308P7913D8159c6107l66987
$$ plain form
9477 35414 58423 172549 -144529 -216811 13240 46169 -51586 180400 -143054 117091 -210864
9465 -43099 114830 79139 -190456 -21668 -311548 28208 289909 -42228 -43529 -270496 -102101
9453 100615 -233678 -371477 373805 -431322 20534 145316 -91859 -110492 219719 -83909
9442 -86323 -70807 65874 -94425 -62212 -147911 -228565 24199 132065 153299 -7863 -287064 -49892
9429 89225 -311560 -280126 -144587 -118486 97878 49701 122148 -15373 -184035 -46285 127125
9417 -220186 -190890 169011 -55592 83696 -354666 91660 -126995 -285462 -79940 -194170 -96345
9405 -208579 345905 -165660 -524222 -121070 -431497 -176485 -86521 307375 -127997 -190518
9395 -190518 -274695 145224 -252056 474862 -230203 100403 124711 202624 48159 -36107 -403094
9384d03094a10220A30123b4064A7709M7356C0695b61266B14879d94041d6329B60966
9372B97789A25310J059m3266A0740c1304I3128J19171b18555h0966K6600c893
9360B7527c10589b6697j41113m0859M1251j44264c7107k76812A40627N7013f0921
9348c6254K767j35294E1311a27984e2622k2296D5392j3339b17363A69476a12268
9336a42850f29q6134j61506Q2330B26452b40912J05759f0867o961O689q9993f1906
9323a11256E8856a16532k38832C3561K5636c90677A22801b83840A18305J79202
9313B97507g1301l01422C1516a93439r3487O7102B9353J0612E38J38304a14652
9301a17061c6989j70271j8201B00533a77380P7584k1118j98800O3457j65686J71554
$$ plain form
9384 -403094 -110220 130123 -24064 17709 65065 30695 -261266 214879 -494041 -46329 260966
9372 297789 125310 126369 83103 10740 -31304 93128 212299 -218555 -80966 -54366 -3893
9360 27527 -310589 -26697 -167810 -208669 -167418 -311682 -37107 -313919 140627 197640 -60921
9348 -36254 -33487 -168781 51311 -127984 -52622 -74918 45392 32053 -217363 169476 -112268
9336 -142850 -629 -86763 -248269 -165939 226452 -240912 -135153 -60867 -67828 -61139 -151132 -61906
9323 -111256 58856 -116532 -355364 33561 59197 -390677 122801 -283840 118305 297507
9313 297507 -71301 -372723 31516 -193439 -286926 -219824 29353 39965 538 138842 -114652
9301 -117061 -36989 -207260 -225461 200533 -177380 -99796 -120914 -319714 -256257 -421943 -250389
9290b50389a17895r1846G2052a4713C01039a08362B50356e6364j12949p9196b1159
9278a25693A93507b11635p9307A9035e8660A50689a52992o9534K0099R7520G195
9266b29487c2323o1833r3607j47353P0027e6899A19604A9854J2714a53635M5861
9255a07774L4703r5771j72299A196O222b7040h918D2167a57857l5284B15340h9220
9242A52422m1668J49493B2454K81953d11610J02191f1194B59747f2906J4112A2056
9230b5951k0839k09826A5761d57412J76823G9145a45951j1193A27985a42287j8572
9219a60859c0159B36447F6858b81821A38558a16738j97162P3625A74340d0780
9208E61a22191B68565D2257b04024j7069e9534k14226c6822I1317a83629o7240
$$ plain form
9290 -250389 -117895 -209741 72052 -14713 301039 -108362 250356 -56364 -169313 -248509 -21159
9278 -125693 193507 -211635 -290942 19035 -58660 150689 -152992 -222526 -202427 -104907 7195
9266 -229487 -32323 -94156 -187763 -335116 -265089 -56899 119604 19854 32568 -153635 -107774
9255 -107774 -73071 -168842 -341141 1196 7418 -27040 -8918 42167 -157857 -193141 215340 -89220
9242 152422 110754 260247 22454 304407 -411610 -309419 -61194 259747 -62906 -48794 12056
9230 -25951 -46790 -256616 15761 -457412 -280589 79145 -145951 -157144 127985 -142287 -160859
9219 -160859 -30159 236447 66858 -281821 138558 -116738 -313900 -240275 174340 -40780
9208 561 -122191 268565 42257 -204024 -221093 -59534 -273760 -36822 91317 -183629 -250869
9197b50869D21587b7385j07780B60822G0792b33908d2499A4271b08097H720d7757
9185B45574J4654j27758b44316A98564k726i2107a2470j17027B2999K39610j4636
9174B47973c4832j21315D9272a31393B9563a6758m2014j68875A83228F5045K03970
9163B69015a50138j05720l22649J47431I5416a59864G9368K87410j79941A8288
9152d5983C219K1785c74985J16850g8021r9674b0533l14568J35809J1016B09316
9140a61683n3678D2929R9768b35202D5470b03579B69246c26388c7003k06497c8275
9128a47726A25620d175j40176C1573c30286D43909q6372i3146c2814r5502I5329
9116a73504D9954e1673p7319j33695c4186B2533d02183R4960J24458A63396J61379
$$ plain form
9197 -250869 421587 -27385 -135165 260822 70792 -233908 -42499 14271 -208097 8720 -47757
9185 245574 260228 132470 -244316 198564 195838 -92107 -12470 -129497 22999 262609 247973
9174 247973 -34832 -156147 49272 -131393 29563 -16758 -58772 -227647 183228 65045 269015
9163 269015 -150138 -255858 -578507 -431076 95416 -159864 79368 366778 186837 18288
9152 -45983 3219 25004 -374985 -258135 -78021 -177695 -20533 -335101 -199292 -188276 209316
9140 -161683 -215361 42929 142697 -235202 45470 -203579 269246 -326388 -37003 -243500 -38275
9128 -147726 125620 -4175 -144351 31573 -330286 443909 357537 -93146 -32814 -128316 95329
9116 -173504 49954 -51673 -128992 -262687 -34186 22533 -402183 -307223 -182765 163396 324775
9105C24775j30825D4537j9910b91950p3992O2195A69126a12442B66876j10758
9095A56118c25141B5184R5384a00399D4909c295B1874R1503i9741j26563j84976
9084d11280a71960l42381a67378N2100l7674b91j40752e4995B1443a09895n5203
9073a65098B46018A2983a28546n9301A2976a47265k6791l0461I8355a63630L0468
9062a33162j14443B18305d6782k93367G339J31485b52484M2719b2234l7012G853
9050B76614g3860A49979b83494a12183l0179J0507n2103A36255m5455a34116A37965
9038a71695d4946k55709J01036r5145g7124j31262A21539A1733d19465h7782c3643
9026a11867j9881B43983a51500K4339k66558J87269Q8195K5963l9960M628c5494
$$ plain form
9105 324775 193950 44537 24627 -291950 -365942 -303747 169126 -112442 266876 156118
9095 156118 -325141 25184 120568 -100399 44909 -3295 21874 113377 -99741 -226304 -411280
9084 -411280 -171960 -514341 -167378 -115278 -152952 -291 -141043 -54995 21443 -109895 -165098
9073 -165098 246018 12983 -128546 -187847 12976 -147265 -174056 -204517 98355 -163630 -133162
9062 -133162 -247605 218305 -46782 -340149 7339 138824 -252484 -209765 -22234 -59246 7853
9050 276614 -73860 149979 -283494 -112183 -142362 -131855 -183958 136255 90800 -134116 137965
9038 -171695 -44946 -300655 -199619 -294764 -77124 -208386 121539 11733 -419465 -87782 -33643
9026 -111867 -131748 243983 -151500 -127161 -393719 -206450 -118255 -92292 -132252 -127624 -35494
9014d27473C53435H4288d7319j55788r805O8805A48a12477j51689O3398G3877
9002c57318A16688K52422c9783A74917c06189J03835A19972b44214J06675f6904
8991A4102b2961A31278b71065l2445A94291A0277a50671I0132C4676h8740K6564
8980f2176j15269G4712b2335k85038a18970C9723D755N1945c4279j87873M4302
8969a77850D4093a49869G7506g9335j4961c0418j37973L632A78162h2044i838
8957a97229i2533k25426G0602j4692a0858j94314d7459a5835k9233A07055a64559
8945g355j91718D2753J34705k7000b7952H0621C4169b30779j57458a69548G9203
8933b13124C20466C7285i3071j64621f0915j79432A14847a67825D87816J79924
$$ plain form
9014 -427473 353435 84288 -47319 -203107 -212912 -144107 148 -112477 -264166 -200768 73877
9002 -357318 116688 369110 -39783 174917 -306189 -202354 119972 -244214 -137539 -66904
8991 14102 -22961 131278 -271065 -303510 194291 10277 -150671 90132 34676 -88740 -62176
8980 -62176 -177445 74712 -22335 -307373 -118970 39723 4755 56700 -34279 -222152 -177850
8969 -177850 44093 -149869 77506 -79335 -94296 -30418 -168391 -164759 178162 -82044 -9838
8957 -197229 -92533 -317959 70602 55910 -10858 -205172 -47459 -15835 -45068 107055 -164559
8945 -7355 -199073 42753 177458 150458 -27952 80621 34169 -230779 -388237 -169548 79203
8933 -213124 320466 37285 -93071 -257692 -60915 -240347 114847 -167825 487816 667740
8923F67740M01994L261667L157380A335465F25723J2693l12350L38414A63519
8913B95035a43292b5000A57797o548J23218l1460j14944a76249B5408P8893d3558
8901F022J935N1056a73196B471R653K2370J11799b29975J04796c8158j53180b2693
8888c33896a15202H6239c98690a65769r0596c5627l8550G3879Q501a40847L6237
8877a04610k7960k7987D2001k805a02624p8808h7796D929h3671C85620E3088d77604
8864a52562d6682A17884g7238A30436a34855j00626I4628b36690J06441j51633
$$ plain form
8923 667740 1069734 4331401 7488781 1335465 625723 638416 326066 664480 163519
8913 295035 -143292 -25000 157797 151249 274467 243007 128063 -176249 25408 104301 -43558
8901 6022 7957 59013 -173196 2471 12124 34494 146293 -229975 -125179 -38158 -191338 -22693
8888 -333896 -115202 86239 -398690 -165769 -256365 -35627 -74177 73879 82380 -140847 -104610
8877 -104610 -132570 -160557 42001 39196 -102624 -181432 -87796 4929 -83671 385620 53088 -477604
8864 -152562 -46682 117884 -77238 130436 -134855 -235481 94628 -236690 -130249 -281882
$$ [...]
##END NTUPLES=NMR SPECTRUM
##END=
