
##TITLE=AC1367_2285_7221507_Xg8aSAJzSg
##JCAMPDX= 6.0         $$ Bruker NMR JCAMP-DX V2.0
##DATA TYPE= NMR SPECTRUM
##DATA CLASS= NTUPLES
##ORIGIN= BRUKER
##OWNER= Administrator
$$ 1.72 TOPSPIN		Version 2.1
$$ 2012-12-14 00:23:15.176 -0500  Administrator@X
$$ Compression mode = diff/dup
##.OBSERVE FREQUENCY= 400.02188249412
##.OBSERVE NUCLEUS= ^1H
##.ACQUISITION MODE= SIMULTANEOUS (DQD)
##.ACQUISITION SCHEME= undefined
##.AVERAGES= 64
##.DIGITISER RES= 22
##SPECTROMETER/DATA SYSTEM= spect
##.PULSE SEQUENCE= noesygpps1d.comp
##.SOLVENT NAME= COFFEE_meoh
##.SHIFT REFERENCE= INTERNAL, COFFEE_meoh, 1, 14.96095
##AUDIT TRAIL= $$ (NUMBER, WHEN, WHO, WHERE, PROCESS, VERSION, WHAT)
$$ ##TITLE= Audit trail, TOPSPIN		Version 2.1
$$ ##JCAMPDX= 5.01
$$ ##ORIGIN= Bruker BioSpin GmbH
$$ ##OWNER= Administrator
$$ $$ E:\/data/COFFEE/nmr/AC1367_2285_7221507_Xg8aSAJzSg/22/pdata/1/auditp.txt
$$ ##AUDIT TRAIL=  $$ (NUMBER, WHEN, WHO, WHERE, PROCESS, VERSION, WHAT)
(   1,<2012-12-14 00:23:09.473 -0500>,<Administrator>,<X>,<go>,<TOPSPIN 2.1>,
      <created by zg
	started at 2012-12-14 00:11:39.363 -0500,
	POWCHK enabled, PULCHK disabled,
       configuration hash MD5:
       86 BA 57 50 F2 9D 5C 9B 26 00 A9 28 5F 66 2E 89
       data hash MD5: 64K
       C0 A9 44 5E CE 60 72 98 72 68 94 67 2A 97 B3 B2>)
(   2,<2012-12-14 00:23:12.504 -0500>,<Administrator>,<X>,<proc1d>,<TOPSPIN 2.1>,
      <Start of raw data processing
       efp LB = 0.3 FT_mod = 6 PKNL = 1 PHC0 = 0 PHC1 = 0 SI = 128K 
       data hash MD5: 128K
       4E F9 55 FE 59 87 45 2D B5 22 51 89 BD 66 DA 61>)
(   3,<2012-12-14 00:23:13.582 -0500>,<Administrator>,<X>,<proc1d>,<TOPSPIN 2.1>,
      <pk PHC0 = -79.6344 PHC1 = 0 
       data hash MD5: 128K
       72 5A D1 8C 5D 0C A8 EF B0 FD 25 95 55 B6 D5 6B>)
(   4,<2012-12-14 00:23:14.238 -0500>,<Administrator>,<X>,<proc1d>,<TOPSPIN 2.1>,
      <abs ABSG = 1 
       data hash MD5: 128K
       CE D8 E1 D1 70 5E DE D3 B4 7A 13 83 6B C1 EA E1>)
(   5,<2012-12-14 00:23:14.410 -0500>,<Administrator>,<X>,<proc1d>,<TOPSPIN 2.1>,
      <abs ABSG = 2 
       data hash MD5: 128K
       C8 8D 08 F5 09 03 A6 58 70 34 F8 7F 3B 67 4E 6D>)
(   6,<2012-12-14 00:23:14.566 -0500>,<Administrator>,<X>,<proc1d>,<TOPSPIN 2.1>,
      <abs ABSG = 3 
       data hash MD5: 128K
       A8 E4 52 17 31 2C B8 4F 41 B9 22 8F C8 A7 7F 87>)
(   7,<2012-12-14 00:23:14.738 -0500>,<Administrator>,<X>,<proc1d>,<TOPSPIN 2.1>,
      <abs ABSG = 4 
       data hash MD5: 128K
       3C 13 43 BE 5A D2 55 DC B0 CF 95 4C EC 57 AA 70>)
(   8,<2012-12-14 00:23:14.910 -0500>,<Administrator>,<X>,<proc1d>,<TOPSPIN 2.1>,
      <abs ABSG = 5 
       data hash MD5: 128K
       2F 78 A0 E6 95 EE 0D 15 CA 65 F7 1A B0 97 E4 0D>)
$$ ##END=
$$ 
$$ $$ hash MD5
$$ $$ FF A5 51 12 CB 0C 78 A9 53 A3 AE CA 85 15 85 35
##$RELAX= 
##$RELAX= 
##$RELAX= 
##$RELAX= 
##$RELAX= 
##$RELAX= 
##$RELAX= 
##$RELAX= 
##$RELAX= 
$$ Bruker specific parameters
$$ --------------------------
##$DU= <E:\>
##$EXPNO= 22
$$ [...]
150 150 150 150 150 150 150 150
##$TP07= 0
##$TPNAME0= <>
##$TPNAME1= <>
##$TPNAME2= <>
##$TPNAME3= <>
##$TPNAME4= <>
##$TPNAME5= <>
##$TPNAME6= <>
##$TPNAME7= <>
##$TPOAL= (0..7)
0.5 0.5 0.5 0.5 0.5 0.5 0.5 0.5
##$TPOFFS= (0..7)
0 0 0 0 0 0 0 0
##$TUNHIN= 0
##$TUNHOUT= 0
##$TUNXOUT= 0
##$USERA1= <user>
##$USERA2= <user>
##$USERA3= <user>
##$USERA4= <user>
##$USERA5= <user>
##$V9= 5
##$VALIST= <valist>
##$VCLIST= <CCCCCCCCCCCCCCC>
##$VD= 0
##$VDLIST= <DDDDDDDDDDDDDDD>
##$VPLIST= <PPPPPPPPPPPPPPP>
##$VTLIST= <TTTTTTTTTTTTTTT>
##$WBST= 1024
##$WBSW= 4
##$XGAIN= (0..3)
0 0 0 0
##$XL= 0
##$YL= 0
##$YMAX_a= 5849961
##$YMIN_a= -12616657
##$ZGOPTNS= <>
##$ZL1= 120
##$ZL2= 120
##$ZL3= 120
##$ZL4= 120
##$ABSF1= 14.96095
##$ABSF2= -5.597232
##$ABSG= 5
##$ABSL= 3
##$ALPHA= 0
##$AQORDER= 0
##$ASSFAC= 0
##$ASSFACI= 0
##$ASSFACX= 0
##$ASSWID= 0
##$AUNMP= <proc_prof1d_extract.lims>
##$AXLEFT= 0
##$AXNAME= <>
##$AXNUC= <1H>
##$AXRIGHT= 0
##$AXTYPE= 0
##$AXUNIT= <>
##$AZFE= 0.1
##$AZFW= 0.1
##$BCFW= 0
##$BC_mod= 0
##$BYTORDP= 0
##$COROFFS= 0
##$CY= 15
##$DATMOD= 1
##$DC= 0
##$DFILT= <>
##$DTYPP= 0
##$F1P= 0
##$F2P= 0
##$FCOR= 0.5
##$FTSIZE= 131072
##$FT_mod= 6
##$GAMMA= 0
##$GB= 0
##$INTBC= 1
##$INTSCL= 1
##$ISEN= 128
##$LB= 0.3
##$LEV0= 0
##$LPBIN= 0
##$MAXI= 10000
##$MC2= 0
##$MEAN= 0
##$ME_mod= 0
##$MI= 0
##$NCOEF= 0
##$NC_proc= -2
##$NLEV= 6
##$NOISF1= 0
##$NOISF2= 0
##$NSP= 0
##$NTH_PI= 0
##$NZP= 0
##$OFFSET= 14.96095
##$PC= 1
##$PHC0= -79.6344
##$PHC1= 0
##$PH_mod= 1
##$PKNL= yes
##$PPARMOD= 0
##$PPDIAG= 0
##$PPIPTYP= 0
##$PPMPNUM= 2147483647
##$PPRESOL= 1
##$PSCAL= 4
##$PSIGN= 0
##$PYNMP= <proc.py>
##$REVERSE= no
##$SF= 400.020009657321
##$SI= 131072
##$SIGF1= 0
##$SIGF2= 0
##$SINO= 400
##$SIOLD= 131072
##$SPECTYP= <>
##$SREGLST= <1H.CDCl3>
##$SSB= 0
##$STSI= 131072
##$STSR= 0
##$SW_p= 8223.68421052631
##$SYMM= 0
##$S_DEV= 0
##$TDeff= 65536
##$TDoff= 0
##$TI= <>
##$TILT= no
##$TM1= 0
##$TM2= 0
##$TOPLEV= 0
##$USERP1= <user>
##$USERP2= <user>
##$USERP3= <user>
##$USERP4= <user>
##$USERP5= <user>
##$WDW= 1
##$XDIM= 131072
##$YMAX_p= 403972508
##$YMIN_p= -14178
##$CURPLOT= <Network HP LaserJet P1505>
##$CURPRIN= <$Network HP LaserJet P1505>
##$DFORMAT= <normdp>
##$LAYOUT= <+/1D_H.xwp>
##$LFORMAT= <normlp>
##$PFORMAT= <normpl>
##$SURQMSG= 1
$$ End of Bruker specific parameters
$$ ---------------------------------
##NTUPLES= NMR SPECTRUM
##VAR_NAME=  FREQUENCY,     SPECTRUM/REAL,   SPECTRUM/IMAG
##SYMBOL=    X,             R,               I
##VAR_TYPE=  INDEPENDENT,   DEPENDENT,       DEPENDENT
##VAR_FORM=  AFFN,          ASDF,            ASDF
##VAR_DIM=   131072,        131072,          131072
##UNITS=     HZ,            ARBITRARY UNITS, ARBITRARY UNITS
##FACTOR=    0.0627417313425164, 1,          1
##FIRST=     8223.62146879497, -624,         -53031
##LAST=      0,             448,             -53224
##MIN=       0,             -14178,          0
##MAX=       8223.62146879497, 403972508,    0
$$ Real data points
##PAGE= N=1
##DATA TABLE= (X++(R..R)), XYDATA
$$ [...]
63812H73891m5788m1711l8377l5945l3537l0526k7448k4939k2471j9241j5803
$$ 873891 828103 786392 748015 712070 678533 648007 620559 595620 573149 553908 538105
63801E38105j3574j2908j2785j2373j1773j1138j0184q954q073p831p729p335
$$ 538105 524531 511623 498838 486465 474692 463554 453370 444416 436343 428512 420783 413448
63789D13448o918o821o797o414n625m677l886l700m368n300n381m308k998k348
$$ 413448 406530 399709 392912 386498 380873 376196 372310 368610 364242 358942 353561 349253 346255 343907
63775C43907k133j557l56J183K752M085M844M951M709M169K892P19j684l643n287
$$ 343907 341774 340217 339861 341044 343796 347881 352725 357676 362385 366554 369446 370165 368481 364838 359551
63760C59551o934q150q257p534o941o752o270n058l664k847k640k519k189j846
$$ 359551 352617 344467 336210 328676 321735 314983 308713 303655 299991 297144 294504 291985 289796 287950
63746B87950j824k131k243j529KJ488K129K102K174K534K656K229J734J803K539
$$ 287950 286126 283995 281752 280223 280225 281713 283842 285944 288118 290652 293308 295537 297271 299074 301613
63731C01613L567M435M762M439L879L692L980M288M455M932N949O851O804N897
$$ 301613 305180 309615 314377 318816 322695 326387 330367 334655 339110 344042 349991 356842 363646 369543
63717C69543M979M509M170L601K914K316J599L70j380l208m602n329n491n335
$$ 369543 374522 379031 383201 386802 389716 392032 393631 394001 392621 389413 384811 379482 373991 368656
63703C68656m997m365l319k101j245r82r33o51k63k07m10k16O88J722K101J774
$$ 368656 363659 359294 355975 353874 352629 351647 350714 350063 349800 349593 349183 348967 349655 351377 353478 355252
63687C55252J264Q16L01j93k86j5j9o68j393j320l19R46J800K035J801J498J654
$$ 355252 356516 357332 357633 357440 357154 357139 357120 356452 355059 353739 353420 354366 356166 358201 360002 361500 363154
63670C63154K505L664M534N001N335N569N431M945M493M136L387J992M42o63j405
$$ 363154 365659 369323 373857 378858 384193 389762 395193 400138 404631 408767 412154 414146 414588 413925 412520
63655D12520k277l401m480n326n932o158n810n076m407l932l335k364j135J82
$$ 412520 410243 406842 402362 397036 391104 384946 379136 374060 369653 365721 362386 360022 358887 359069
63641C59069J559K913M029M840N469N865N833N544N630O390P305P703P577P300
$$ 359069 360628 363541 367570 372410 377879 383744 389577 395121 400751 407141 414446 422149 429726 437026
63627D37026O830N868M660L979M156M712N134N539O324P607R318J1442J3812J5961
$$ 437026 443856 449724 454384 458363 462519 467231 472365 477904 484228 491835 501153 512595 526407 542368
63613E42368J7647J9280K1440K4022K6360K8147K9822L1882L4140L5827L6189
$$ 542368 560015 579295 600735 624757 651117 679264 709086 740968 775108 810935 847124
63602H47124L4855L1787K7093K0974J3776O201o49n689q515r670j0114j0371j0327
$$ 847124 881979 913766 940859 961833 975609 981810 981161 975472 966957 957287 947173 936802 926475
63589I26475r861r543j0349j2595j5465j7902j9733k1475k3084k3620k2437k0126
$$ 926475 916614 907071 896722 884127 868662 850760 831027 809552 786468 762848 740411 720285
63577G20285j7795j5764j3558j0992q533o559m810k870p95J023K317L118L665
$$ 720285 702490 686726 673168 662176 653643 647084 642274 639404 638609 639632 641949 645067 648732
63564F48732M258N057N857O282O306O403O993P996R073J0130J1329J2772J4432
$$ 648732 652990 658047 663904 670186 676492 682895 689888 697884 706957 717087 728416 741188 755620
63551G55620J6403J8992K2486K6879L1901L7306M3219N0068N7875O5161O8577
$$ 755620 772023 791015 813501 840380 872281 909587 952806 1002874 1060749 1125910 1194487
63540A194487O4225N0222K8584M644j5819k9432l5897l6630l3360k7884k2128
$$ 1194487 1258712 1308934 1337518 1342162 1326343 1296911 1261014 1224384 1191024 1163140 1141012
63529A141012j7616j4828j3460j3297j4466j6938k0213k3644k6854k9703l2017
$$ 1141012 1123396 1108568 1095108 1081811 1067345 1050407 1030194 1006550 979696 949993 917976
63518I17976l3426l3490l2040k9518k6746k4206k1649j8731j5761j3472j2119
$$ 917976 884550 851060 819020 789502 762756 738550 716901 698170 682409 668937 656818
63507F56818j1225j0231r041p884o983o460o328o496o878p408p806p619o804n980
$$ 656818 645593 635362 626321 618437 611454 604994 598666 592170 585292 577884 570078 562459 555655 549675
63493E49675n686n614n150m410l978l799l229k182j314q74l46M21P21K63R9J398
$$ 549675 543989 538375 533225 528815 524837 521038 517809 515627 514313 513439 513093 513514 514235 514498 514597 515995
63477E15995L767N678O272N995N698N774O050N960M859K787P70j57k11o03j969
$$ 515995 519762 525440 531712 537707 543405 549179 555229 561189 566048 568835 569605 569448 569237 568634 566665
63462E66665l593m297l752k670j911j616j278o34j86n67j479j917j537j101j210
$$ 566665 563072 558775 555023 552353 550442 548826 547548 546914 546728 546161 544682 542765 541228 540127 538917
63447E38917j270l09J657L783N539O973Q167R205J0628J3155J6928K1484K6490
$$ 538917 537647 537338 538995 542778 548317 555290 563457 572662 583290 596445 613373 634857 661347
63434F61347L2067L8623M6701N6352O5690P0404O6261N2699L3387J3138m881j8978
$$ 661347 693414 732037 778738 835090 900780 971184 1037445 1090144 1123531 1136669 1131788 1112810
63422A112810k7708l0201k7222k0687j2103k182Q116J7096K3413K7210K9684L1453
$$ 1112810 1085102 1054901 1027679 1006992 994889 992707 1000823 1017919 1041332 1068542 1098226 1129679
63410A129679L1629K8652K2043J3163M296k953q313j2247j5077j6715j7049j6439
$$ 1129679 1161308 1189960 1212003 1225166 1229462 1226509 1218196 1205949 1190872 1174157 1157108 1140669
63398A140669j5790j6041j7483j9746k2467k5628k9071l2075l3775l3877l2639
$$ 1140669 1124879 1108838 1091355 1071609 1049142 1023514 994443 962368 928593 894716 862077
63387H62077l0470k7861k5359k3145k0768j7842j4741j2145j0142q310o584n208
$$ 862077 831607 803746 778387 755242 734474 716632 701891 689746 679604 671294 664710 659502
63375F59502l985k282K6K288L973N292O723Q400J0144J1734J3047J4268J5938
$$ 659502 655517 653235 653261 655549 659522 664814 671537 679937 690081 701815 714862 729130 745068
63362G45068J8394K1209K3760K6172K9066L2356L5186L7171L8826M0483M1569
$$ 745068 763462 784671 808431 834603 863669 896025 931211 968382 1007208 1047691 1089260
63351A089260M1370L9687L6374L0943K3356J4639O171j299p501j2052j4619j5335
$$ 1089260 1130630 1170317 1206691 1237634 1260990 1275629 1281800 1280501 1273000 1260948 1246329 1230994
63339A230994j4634j3121j1816j1964j3932j6873j9924k3175k6891l0441l2797
$$ 1230994 1216360 1203239 1191423 1179459 1165527 1148654 1128730 1105555 1078664 1048223 1015426
63328A015426l3638l3181l1386k8288k4696k1456j8205j3833q014j231O479J5158
$$ 1015426 981788 948607 917221 888933 864237 842781 824576 810743 802729 801498 807977 823135
63316H23135K2722K4562J6922P24j8507l4382m3232m4961m1724l6202l0433k5446
$$ 823135 845857 870419 887341 888065 869558 835176 791944 746983 705259 669057 638624 613178
63304F13178k1498j8490j6190j4290j2537j0941r815r446r637r676q970p674o474
$$ 613178 591680 573190 557000 542710 530173 519232 509417 499971 490334 480658 471688 464014 457540
63291D57540n809n576n570n716n786n410m652m101m062m126l882l521l240k683
$$ 457540 451731 446155 440585 434869 429083 423673 419021 414920 410858 406732 402850 399329 396089 393406
63277C93406j644q14r15j482j476r42q70j492j852j389p99q17j072r07n44o69
$$ 393406 391762 390948 390033 388551 387075 386133 385263 383771 381919 380530 379731 378914 377842 376935 376391 375722
63261C75722j307j871j976j564n45R42K130K189J173m8p16o22J41J218J850J420
$$ 375722 374415 372544 370568 369004 368459 369401 371531 373720 374893 374845 374129 373507 373648 374866 376716 378136
63245C78136K63n64n35k22m20j123j659j512p93k9K76J7m40o38n32l69j79K24
$$ 378136 378399 377835 377300 377078 376658 375535 373876 372364 371571 371542 371818 371835 371395 370757 370225 369856 369677 369901
63227C69901P19Q64O04N18R55J465J564J623K293L310L770L447L048K998K904
$$ 369901 370620 371484 372088 372606 373561 375026 376590 378213 380506 383816 387586 391033 394081 397079 399983
63212C99983K535K431K962L468L121K136J426J287J211Q18K06m23r06q95k09O53
$$ 399983 402518 404949 407911 411379 414500 416636 418062 419349 420560 421378 421584 421161 420255 419360 419151 419804
63196D19804R42O40L72M42O60J059J939L083L851M269N154O738Q067Q400Q412
$$ 419804 420746 421386 421758 422200 422860 423919 425858 428941 432792 437061 442215 448953 457020 465420 473832
63181D73832R243J0913J2499J3453J3966J4263J4243J3700J2383J0103P259M990
$$ 473832 483075 493988 506487 519940 533906 548169 562412 576112 588495 598598 605857 610847
63169F10847M180M482M837M700M230L577K696J733R07K1j399l461n905q597j1479
$$ 610847 615027 619509 624346 629046 633276 636853 639549 641282 642189 642210 640811 637350 631445 622848 611369
63154F11369j4155j6008j6781j6627j5785j4624j3756j3491j3361j2692j1464
$$ 611369 597214 581206 564425 547798 532013 517389 503633 490142 476781 464089 452625
63143D52625j0085q617o980n615n041m891m291l149k194j735j429j278j714k400
$$ 452625 442540 433923 426943 421328 416287 411396 407105 403956 401762 400027 398598 397320 395606 393206
63129C93206k134n55J066J402P40L19P00J488K190K627K803K904L189L557L602
$$ 393206 391072 390517 391583 392985 393725 394044 394744 396232 398422 401049 403852 406756 409945 413502 417104
63114D17104L393L536M152M519M298M314N333O638O884N933M904M577M710M986
$$ 417104 420497 424033 428185 432704 437002 441316 446649 453287 460171 466104 471008 475585 480295 485281
63100D85281N698P138Q919J0250J0703J0623J0940J2400J4768J6935J8059J8218
$$ 485281 490979 498117 507036 517286 527989 538612 549552 561952 576720 593655 611714 629932
63088F29932J7702J6171J3210R280N381J921j428m829p989j0675j2792j3956j3769
$$ 629932 647634 663805 677015 686295 691676 693597 692169 687340 679351 668676 655884 641928 628159
63075F28159j2661j1803j1881j2467j2727j2255j1085r454p788o510n664n084
$$ 628159 615498 603695 591814 579347 566620 554365 543280 533826 526038 519528 513864 508780
63063E08780m870n174n488m935l420j805p09J31R94J492J400J401K200L408M128
$$ 508780 503910 498736 493248 488313 484893 483088 482379 482510 483504 484996 486396 487797 489997 493405 497533
63048D97533M327M697N346N600N226M950N456O512P448P973Q167Q105P910P879
$$ 497533 501860 506557 511903 517503 522729 527679 533135 539647 547095 555068 563235 571340 579250 587129
63034E87129Q149Q429Q408Q211Q170Q283Q247P899P220O033M160J886j12j489
$$ 587129 595278 603707 612115 620326 628496 636779 645026 652925 660145 666178 670338 672224 672112 670623
63020F70623k592l874n274o310o688o563o341o375o626o487n170k579L75K697
$$ 670623 668031 664157 658883 652573 645885 639322 632981 626606 619980 613493 608323 605744 606119 608816
63006F08816M420O391R033J1858J4211J5965J7257J7986J8000J7486J6801J6028
$$ 608816 613236 619627 628660 640518 654729 670694 687951 705937 723937 741423 758224 774252
62994G74252J5009J3703J2304J1166J0776J1515J3137J4666J5265J5040J4616
$$ 774252 789261 802964 815268 826434 837210 848725 861862 876528 891793 906833 921449
62983I21449J4118J3102J1447R679Q083O068K768j869o975j1616j5425j8498k0956
$$ 921449 935567 948669 960116 969795 977878 983946 986714 984845 977870 966254 950829 932331 911375
62970I11375k2772k3874k4323k4327k4085k3629k2885k1834k0566j9193j7789
$$ 911375 888603 864729 840406 816079 791994 768365 745480 723646 703080 683887 666098
62959F66098j6356j4827j3160j1548j0395r902r803r726r697r980j0442j0520
$$ 666098 649742 634915 621755 610207 599812 589910 580107 570381 560684 550704 540262 529742
62947E29742r899q879p944p251o702o245n886n585n340n245n227n035m605m263
$$ 529742 519843 510964 503020 495769 489067 482822 476936 471351 466011 460766 455539 450504 445899 441636
62933D41636m249m306m055l619l446l549l366k540j531j177j751k569k612j495
$$ 441636 437387 433081 429026 425407 421961 418412 415046 412506 410975 409798 408047 405478 402866 401371
62919D01371J27J155J160P98J016J972K961L400L471L728M335M968N287N198M709
$$ 401371 401498 402653 403813 404611 405627 407599 410560 413960 417431 421159 425494 430462 435749 440947 445656
62904D45656L802K598J477R16J142J993L121M271N373O370P133P597P889Q116
$$ 445656 449458 452056 453533 454449 455591 457584 460705 464976 470349 476719 483852 491449 499338 507454
62890E07454Q082P458O324N302M926M981M742L830K613J712J266Q69J18r36j936
$$ 507454 515536 522994 529318 534620 539546 544527 549269 553099 555712 557424 558690 559559 559677 558741 556805
62875E56805k712l505m627n978p056p588p911q470r073r077q344p588p437p559
$$ 556805 554093 550588 545961 539983 532927 525339 517428 508958 499885 490808 482464 474876 467439 459880
62861D59880p105n926m811m516m885n100m510l189j884j424j929k511k140q27
$$ 459880 452775 446849 442038 437522 432637 427537 423027 419838 417954 416530 414601 412090 409950 409123
62847D09123L80O33J33l95n78m14K6M73M85J24K36J333K537K495J248K58N01J427
$$ 409123 409503 410136 410269 409874 409296 408882 408908 409381 409866 409990 410226 411559 414096 416591 417839 418097 418598 420025
62829D20025K117K500K851K910K340J545J257J515J833K016K184K146J550N82
$$ 420025 422142 424642 427493 430403 432743 434288 435545 437060 438893 440909 443093 445239 446789 447371
62815D47371k26q14j530k300k635k537k514k516j829m20N32J67p73j003m98k08
$$ 447371 447145 446331 444801 442501 439866 437329 434815 432299 430470 430050 430582 430749 429976 428973 428475 428267
62799D28267l67j87P37J745K107J954J803J730J507J164R73R76R32P64Q02J509
$$ 428267 427900 427713 428450 430195 432302 434256 436059 437789 439296 440460 441433 442409 443341 444105 444907 446416
62783D46416K900M393N379N984O931Q456R789J0192J0080J0371J0948J0698R235
$$ 446416 449316 453709 459088 465072 472003 480459 490248 500440 510520 520891 531839 542537 551772
62770E51772P586O703O187N164L806L043L099L216K743J766N82p59k131l205l922
$$ 551772 559358 566061 572248 577412 581218 584261 587360 590576 593319 595085 595667 594908 592777 589572 585650
62755E85650m693n854p225q465r536j0515j1211j1334j0964j0516j0217r883r231
$$ 585650 580957 575103 567878 559413 549877 539362 528151 516817 505853 495337 485120 475237 466006
62742D66006q246p197o379n890n551m951l792k277j142r33j323j405q23k43l79
$$ 466006 457760 450563 444184 438294 432743 427792 424000 421723 420581 419648 418325 416920 416097 415854 415475
62727D15475q71o71N38J913K564K539K417K427K510K798L477M267M554M065L150
$$ 415475 414604 413933 414471 416384 418948 421487 423904 426331 428841 431639 435116 439383 443937 448002 451152
62712D51152K448K470L428N129P099Q983J0703J2109J2847J2902J2974J3810J5374
$$ 451152 453600 456070 459498 464627 471726 480709 491412 503521 516368 529270 542244 556054 571428
62699E71428J7119J8829K0610K2232K3224K3634K4120K5124K6518K8073K9651
$$ 571428 588547 607376 627986 650218 673442 697076 721196 746320 772838 800911 830562
62688H30562L0863L1144L0397K8998K6978K3810J9211J3590P396O92o289j2771
$$ 830562 861425 892569 922966 951964 978942 1002752 1021963 1035553 1042949 1043641 1037352 1024581
62676A024581j8142k2537k6254k9032l0528l1072l1375l1633l1456l0489k8739
$$ 1024581 1006439 983902 957648 928616 898088 867016 835641 804008 772552 742063 713324
62665G13324k6453k4081k2045k0312j8512j6794j5865j5758j5206j3190j0501
$$ 713324 686871 662790 640745 620433 601921 585127 569262 553504 538298 525108 514607
62654E14607q800q363p989o967n875n265m797m193l918m196m233l324k108j771
$$ 514607 505807 497444 489455 482488 476613 471348 466551 462358 458440 454244 450011 446687 444579 442808
62640D42808k341k662k015q80l4M36Q82J341J418Q33j69j055j554j841k075j945
$$ 442808 440467 437805 435790 434910 434876 435312 436194 437535 438953 439786 439617 438562 437008 435167 433092 431147
62624D31147j058K31Q47J56j253k252k375k041j817j918k250k533k411j751q42
$$ 431147 430089 430320 431167 431323 430070 427818 425443 423402 421585 419667 417417 414884 412473 410722 409880
62609D09880n6N46R71R49K89n31p46l36j9j87l90j18M81J016J418J704J682J421
$$ 409880 409824 410370 411341 412290 412579 412048 411302 410966 410947 410760 410370 410252 410733 411749 413167 414871 416553 417974
62591D17974J604K695M121M879M791M421M025L434K920L117L805L784K500R14
$$ 417974 419578 422273 426394 431273 436064 440485 444510 447944 450864 453981 457786 461570 464070 464984
62577D64984R3l42j438l163m472m908n085n500n775n378m419l385k631k341k572
$$ 464984 465077 464735 463297 460134 455662 450754 445669 440169 434394 429016 424597 421212 418581 416240 413668
62562D13668l052l284l073k620k092j453q65o95r13j036q19o09o80p65n61k13
$$ 413668 410616 407332 404259 401639 399547 398094 397229 396534 395621 394585 393766 393157 392477 391712 391151 390938
62546C90938N8L19N84N82L56N25J352K076J902J242J125J664K040J895J743J840
$$ 390938 390996 391315 391899 392481 392837 393362 394714 396790 398692 399934 401059 402723 404763 406658 408401 410241
62530D10241J676J008N84J196K496L394L388K973K918L518M558N652O565P344
$$ 410241 411917 412925 413509 414705 417201 420595 423983 426956 429874 433392 437950 443602 450167 457511
62516D57511Q181R161J0243J1467J2924J4544J6071J7320J8305J9081J9711K0355
$$ 457511 465692 474853 485096 496563 509487 524031 540102 557422 575727 594808 614519 634874
62504F34874K1026K1277K0457J8456J5863J3169J0200O597K658p36k972m210n007
$$ 634874 655900 677177 697634 716090 731953 745122 755322 761919 764577 763841 760869 756659 751652
62491G51652n615n717m900l280j581l84N37J933M136O698Q981J0720J1987J2905
$$ 751652 746037 740320 735420 732140 730559 730175 730712 732645 736781 743479 752460 763180 775167 788072
62477G88072J3606J4046J3730J1921Q518M423P00k434n578r305j3688j8359k2558
$$ 788072 801678 815724 829454 841375 849893 854316 855016 852582 847004 837699 824011 805652 783094
62464G83094k5378k6461k6526k6697k7202k7183k5869k3513k0976j8764j6863
$$ 783094 757716 731255 704729 678032 650830 623647 597778 574265 553289 534525 517662
62453E17662j5176j3654j2058j0069p777n844m881m699m372l181j450l03m35j301
$$ 517662 502486 488832 476774 466705 458928 453084 448203 443504 439132 435951 434501 434198 433763 432462
62439D32462j689j080p9M88N27M88N86O09L77o8o43j249j587j414j042j092j554
$$ 432462 430773 429693 429614 430102 430629 431117 431703 432312 432689 432621 431978 430729 429142 427728 426686 425594 424040
62422D24040j589o88M26O57N2k63L47J197J282N48k22m59k78p4LO5K25L93L78
$$ 424040 422451 421763 422189 422846 422898 422635 422982 424179 425461 426009 425787 425328 425050 424976 424979 425044 425269 425662 426040
62403D26040J85J55N69J168J331Q54K69K15P46J485K285L380M845O211O786O360
$$ 426040 426225 426380 426949 428117 429448 430302 430571 430786 431532 433017 435302 438682 443527 449738 456524 462884
62387D62884N503N066N353N938O370O780P498Q303Q637Q494Q488Q902R350R603
$$ 462884 468387 473453 478806 484744 491114 497894 505392 513695 522332 530826 539314 548216 557566 567169
62373E67169J0132J1344J2813J3872J4554J5286J5952J6072J5877J6439J8543
$$ 567169 577301 588645 601458 615330 629884 645170 661122 677194 693071 709510 728053
62362G28053K1905K5699K9445L3183L7111M1306M5687N0106N4483N8738O2456
$$ 728053 749958 775657 805102 838285 875396 916702 962389 1012495 1066978 1125716 1188172
62351A188172O4729O4597O1616N5899M7814L7947K7204J6547O580k448j0385j7164
$$ 1188172 1252901 1317498 1379114 1435013 1482827 1520774 1547978 1564525 1571105 1568657 1558272 1541108
62339A541108k3010k8333l3384l8080m2057m4802m6012m5949m5170m3787m1428
$$ 1541108 1518098 1489765 1456381 1418301 1376244 1331442 1285430 1239481 1194311 1150524 1109096
62328A109096l8157l4851l2288l0346k8663k7433k6871k6440k5544k4612k4411
$$ 1109096 1070939 1036088 1003800 973454 944791 917358 890487 864047 838503 813891 789480
62317G89480k4543k3758k1804j9825j8712j8093j7286j6235j5024j3342j1096
$$ 789480 764937 741179 719375 699550 680838 662745 645459 629224 614200 600858 589762
62306E89762q946p575o847o142n150l956k732j698j043o38j41M54Q73J171J710
$$ 589762 580816 573241 566394 560252 555102 551146 548414 546716 545673 545035 544894 545348 546221 547392 549102
62291E49102K360K543K297K445L282L980L892L657M162N080N375M881M381M270
$$ 549102 551462 554005 556302 558747 562029 566009 569901 573558 577720 582800 588175 593056 597437 601707
62277F01707M077L355K376J750J783K348L076L683M291N278O709Q194R537J1174
$$ 601707 605784 609139 611515 613265 615048 617396 620472 624155 628446 633724 640433 648627 658164 669338
62263F69338J3642J6971K0914K5383L0237L5012L9424M3886M8970N4448N9297
$$ 669338 682980 699951 720865 746248 776485 811497 850921 894807 943777 998225 1057522
62252A057522O2600O4107O3980O2277N8647N2476M3494L2313K0092P769l952j4073
$$ 1057522 1120122 1184229 1248209 1310486 1369133 1421609 1465103 1497416 1517508 1525277 1521325 1507252
62240A507252k1802k7815l3931m0881m7339n1886n4876n7300n8672n7614n4170
$$ 1507252 1485450 1457635 1423704 1382823 1335484 1283598 1228722 1171422 1112750 1055136 1000966
62229A000966n0077m6577m3247l9204l4502k9943k6216k3467k1249j8794j5864
$$ 1000966 950889 904312 861065 821861 787359 757416 731200 707733 686484 667690 651826
62218F51826j3257j1890j1572j1331j0687r864q937p808o941o971p511p361o180
$$ 651826 638569 626679 615107 603776 593089 583225 574288 566480 559539 552568 545057 537696 531516
62205E31516m919m331m076l667l251k888k049n67P16J086J139K003L802N684O976
$$ 531516 526597 522266 518190 514523 511272 508384 506335 505768 506484 507570 508709 510712 514514 520198 527174
62190E27174P664P992Q272Q871R858J0737J1108J1335J2098J3374J4391J4525
$$ 527174 534838 542830 551102 559973 569831 580568 591676 603011 615109 628483 642874 657399
62178F57399J3851J2852J1851J0777R344P589O317O587Q621J1523J4420J7477
$$ 657399 671250 684102 695953 706730 716074 723663 729980 736567 745188 756711 771131 788608
62166G88608K1381K6237L1488L6569M1114M4652M6726M7207M6022M2655L6557
$$ 788608 809989 836226 867714 904283 945397 990049 1036775 1083982 1130004 1172659 1209216
62155A209216K8111J8742R898K213m375j0168j5557k0956k6469l1725l6205l9628
$$ 1209216 1237327 1256069 1265967 1268180 1263805 1253637 1238080 1217124 1190655 1158930 1122725 1083097
62143A083097m1985m3329m3598m2632m0340l7018l3405l0253k7728k5408k2847
$$ 1083097 1041112 997783 954185 911553 871213 834195 800790 770537 742809 717401 694554
62132F94554k0012j7172j4562j2320j0579r417q635p794o552m981l488k350j421
$$ 694554 674542 657370 642808 630488 619909 610492 601857 594063 587511 582530 579042 576692 575271
62119E75271l67Q78K109L325M959P360J0130J2449J4119J5972J8824K2082K3843
$$ 575271 574904 575782 577891 581216 586175 593535 603665 616114 630233 646205 665029 687111 710954
62106G10954K2517J8156J2144N978P44k656l554k061Q21L771N643N399K392k804
$$ 710954 733471 751627 763771 769749 770493 767837 764283 762222 763043 766814 772457 777856 780248 777444
62092G77444q158j1443j1838j0104p399m293q10L050P013J0647J3707J6423J9275
$$ 777444 769286 757843 746005 735901 728502 724209 723399 726449 733462 744109 757816 774239 793514
62079G93514K2366K5270K7728L0116L2881L5788L8238M0167M2067M4134M5909
$$ 793514 815880 841150 868878 898994 931875 967663 1005901 1046068 1088135 1132269 1178178
62068A178178M6887M7061M6812M6544M6491M6570M6336M5404M3819M1707L8659
$$ 1178178 1225065 1272126 1318938 1365482 1411973 1458543 1504879 1550283 1594102 1635809 1674468
62057A674468L3907K7255J9408J1286L345m252j1191j7042k1717k5756l0053l5120
$$ 1674468 1708375 1735630 1755038 1766324 1769669 1765417 1754226 1737184 1715467 1689711 1659658 1624538
62045A624538m0508m5132m8335n0327n1471n1638n0751m9484m8612m7942m6601
$$ 1624538 1584030 1538898 1490563 1440236 1388765 1337127 1286376 1236892 1188280 1140338 1093737
62034A093737m4325m1686l9096l6385l3407l0402k7527k4715k2052j9708j7414
$$ 1093737 1049412 1007726 968630 932245 898838 868436 840909 816194 794142 774434 757020
62023G57020j4778j2208j0713j0578j0973j1157j1244j1512j1794j1983j2285
$$ 757020 742242 730034 719321 708743 697770 686613 675369 663857 652063 640080 627795
62012F27795j2521j2019j0712r481q744p565n110k186k48O48J722L571N493O799
$$ 627795 615274 603255 592543 583062 574318 566753 561643 559457 559209 559857 561579 565150 570643 577442
61998E77442P752Q862R940J0194R020O599L824J597Rj513l124m236m582m988o369
$$ 577442 585194 594056 603996 614190 623210 629809 633633 635230 635239 633726 630602 626366 621784 616796 610427
61983F10427q460j0259j1327j1783j1457j0107q361p310p085o728n687m479l706
$$ 610427 601967 591708 580381 568598 557141 547034 538673 531363 524278 517550 511863 507384 503678
61970E03678l185k520j712q27K70J381J791J186L05R4N45R20Q78Q24J265K271
$$ 503678 500493 497973 496261 495434 495704 497085 498876 500062 500367 500461 501006 501926 502804 503628 504893 507164
61954E07164L532M631N245N398N512O015O958Q122R444J1043J2907J4777J6470
$$ 507164 510696 515327 520572 525970 531482 537497 544455 552577 562021 573064 585971 600748 617218
61941F17218J8138K0135K2618K5423K8288L1089L3705L5734L6626L6216L4992
$$ 617218 635356 655491 678109 703532 731820 762909 796614 832348 868974 905190 940182
61930I40182L3597L2173L0335K7734K4454K0895J7412J3975J0156N553M08m455
$$ 940182 973779 1005952 1036287 1064021 1088475 1109370 1126782 1140757 1150913 1156466 1156874 1152419
61918A152419q489j1953j5235j7857j8716j7337j4366j0694o502j522M175J0028
$$ 1152419 1143930 1131977 1116742 1098885 1080169 1062832 1048466 1037772 1031270 1029748 1033923 1043951
61906A043951J5485K0251K4056K6464K7135K6121K3750K0255J5566R560K394n337
$$ 1043951 1059436 1079687 1103743 1130207 1157342 1183463 1207213 1227468 1243034 1252594 1254988 1249651
61894A249651j2790j9190k4196k8077l1337l4007l5470l5290l3985l2553l1298
$$ 1249651 1236861 1217671 1193475 1165398 1134061 1100054 1064584 1029294 995309 962756 931458
61883I31458k9676k7327k4694k2420k0684j9486j8946j8882j8510j7243j5411
$$ 931458 901782 874455 849761 827341 806657 787171 768225 749343 730833 713590 698179
61872F98179j3670j1985r888p467n264l256q91J759L734M505M913O159Q379J0847
$$ 698179 684509 672524 662636 655169 649905 646649 645758 647517 651251 655756 660669 666828 675207 686054
61858F86054J3276J6190J9957K4143K8096L1810L5840M0481M5369M9876N3614
$$ 686054 699330 715520 735477 759620 787716 819526 855366 895847 941216 991092 1044706
61847A044706N6427N8266N9363O0206O0848O0309N7279N1552M4205L6129K7046
$$ 1044706 1101133 1159399 1218762 1278968 1339816 1400125 1457404 1508956 1553161 1589290 1616336
61836A616336J6510N329m875j3350k0496k6403k9922k9806k6242k0706j4397p344
$$ 1616336 1632846 1638175 1633300 1619950 1599454 1573051 1543129 1513323 1487081 1466375 1451978 1444634
61824A444634P99R476J7127K2396K5097K5759K4495K0787J4356N704m475j5782
$$ 1444634 1445433 1454909 1472036 1494432 1519529 1545288 1569783 1590570 1604926 1610630 1606155 1590373
61812A590373k7669l8922m8251n5200n9963o2557o2755o0820n7672n4144n0416
$$ 1590373 1562704 1523782 1475531 1420331 1360368 1297811 1235056 1174236 1116564 1062420 1012004
61801A012004m6320m1812l7100l2553k8605k5493k3096k1126j9372j7569j5349
$$ 1012004 965684 923872 886772 854219 825614 800121 777025 755899 736527 718958 703609
61790G03609j2745j0452r043q082o707m990m016m373n264n421m480l107k138j886
$$ 703609 690864 680412 671369 663287 656580 651590 647574 643201 637937 632516 628036 624929 622791 620905
61776F20905j987j752q69J30M34J5l89l83l87p03p59R8J586K865L711M593N707
$$ 620905 618918 617166 616297 616427 616861 616876 616487 616104 615717 615014 614255 614353 615939 618804 622515 627108 632815
61759F32815O608O942O948O962O881O488O027N915O017N654M492L088K238K055
$$ 632815 639423 646365 653313 660275 667156 673644 679671 685586 691603 697257 701749 704837 707075 709130
61745G09130K064K065K313K777K755J687j3j443k272k821l169k804j405N14K017
$$ 709130 711194 713259 715572 718349 721104 722791 722778 721335 719063 716242 713073 710269 708864 709378 711395
61730G11395K691K868L090L552M053M463N021O036P254P823P171N771M759M876
$$ 711395 714086 716954 720044 723596 727649 732112 737133 743169 750423 758246 765417 771188 775947 780823
61716G80823N962P332Q288Q439P811O792N710M504K949J058r18k745m212n115
$$ 780823 786785 794117 802405 810844 818655 825447 831157 835661 838610 839668 838750 836005 831793 826678
61702H26678n529n926o603p217p265o855o537o552o704o852p005o988o561n831
$$ 826678 821149 815223 808620 801403 794138 787283 780746 774194 767490 760638 753633 746645 740084 734253
61688G34253n124m484l829l354l258l179k673k095k196k762k727j753q07o96j031
$$ 734253 729129 724645 720816 717462 714204 711025 708352 706257 704061 701299 698572 696819 696012 695316 694285
61673F94285j167j397k257l308l527k764j935j769j979j850j249p53r07j503j694
$$ 694285 693118 691721 689464 686156 682629 679865 677930 676161 674182 672332 671083 670330 669423 667920 666226
61658F66226r54L12J294J747K008K226K223K118K390L157M013M727N512O341O752
$$ 666226 665272 665584 666878 668625 670633 672859 675082 677200 679590 682747 686760 691487 696999 703340 710092
61643G10092O626O544O923P449P771P994Q052P320N588L682K319R89j095l436
$$ 710092 716718 723262 730185 737634 745405 753399 761451 768771 774359 778041 780360 781349 780254 776818
61629G76818m744m738m318m074l628k607j263J63J811L600M888N264N186N342
$$ 776818 772074 767336 763018 758944 755316 752709 751446 751609 753420 757020 761908 767172 772358 777700
61615G77700N663N380L955J717n23k281l768n415p150q473r249r911j0693j1187
$$ 777700 783363 788743 792698 794415 793892 791611 787843 782428 775278 766805 757556 747645 736952 725765
61601G25765j1147j1105j1533j1806j0976r337q198q056q022p357o565o342o298
$$ 725765 714618 703513 691980 680174 669198 659861 651663 643607 635585 628228 621663 615321 609023
61588F09023n614m509m056m620n333n296m713m411m634m821m488l954l920m566
$$ 609023 603409 598900 594844 590224 584891 579595 574882 570471 565837 561016 556528 552574 548654 544088
61574E44088n293n391m770l930l399l265l253l069k739k566k724k872k481j553
$$ 544088 538795 533404 528634 524704 521305 518040 514787 511718 508979 506413 503689 500817 498336 496783
61560D96783p51o62j100j476j598j736j998k077j749j364j488k116k505j942n84
$$ 496783 496032 495370 494270 492794 491196 489460 487462 485385 483636 482272 480784 478668 476163 474221 473637
61545D73637P23J450J807K023J731O85l66l98L85P57L36J87J164K608L432L610
$$ 473637 474360 475810 477617 479640 481371 482056 481690 481292 481677 482434 482770 482957 484121 486729 490161 493771
61529D93771L671L449K440J005o1r08k398m438n764n666m918m546m548m344l721
$$ 493771 497442 500891 503331 504336 504275 503367 500969 496531 490767 485101 480183 475637 471089 466745 463024
61514D63024k864j944j208j031j398j797j937k128k561k773k430k069k364k934
$$ 463024 460160 458216 457008 455977 454579 452782 450845 448717 446156 443383 440953 438884 436520 433586
61500D33586k708j429j53q4j322k866l568k998j683o05l25o21r81j169j134o82
$$ 433586 430878 429449 429296 429212 427890 425024 421456 418458 416775 416170 415845 415224 414243 413074 411940 411258
61484D11258K37J091J140L35o05j038q99l51N26J387J563Q41J3P3J012J912K133
$$ 411258 411495 412586 413726 414061 413456 412418 411519 411168 411694 413081 414644 415485 415498 415571 416583 418495 420628
61467D20628J903J602J151M04l16n13j77K55M62L78L5l95m66J18Q89R91K48m84
$$ 420628 422531 424133 425284 425688 425372 424859 424682 424937 425399 425777 425812 425417 424951 425069 425958 426949 427197 426713
61449D26713l21O71J647J937J546R83Q24J223J754J922J884K363L603M883N441
$$ 426713 426392 427063 428710 430647 432193 433176 434000 435223 436977 438899 440783 443146 446749 451632 457073
61434D57073N486N756O316O467N835M853M027L276K420J775J718J892J538O49
$$ 457073 462559 468315 474631 481098 486933 491786 495813 499089 501509 503284 505002 506894 508432 509081
61420E09081K36J094K721L958M390M529M656M272L027J490M08l52j365k502l092
$$ 509081 509317 510411 513132 517090 521480 526009 530665 534937 537964 539454 539862 539510 538145 535643 532551
61405E32551l164l545m582n611o029o076o111n879n126m320m022m019l765l313
$$ 532551 529387 525842 521260 515649 509620 503544 497433 491554 486428 482108 478086 474067 470302 466989
61391D66989l052k826k139j078k80p8l14q98j787k460k246j278m19p7K09P43J022
$$ 466989 463937 461111 458972 457894 457614 457536 457222 456324 454537 452077 449831 448553 448134 448057 448266 449009 450031
61374D50031N64j95l56L92J621K743L345L183K348J397R57J187J801K496L118
$$ 450031 450595 450400 450044 450436 452057 454800 458145 461328 463676 465073 466030 467217 469018 471514 474632
61359D74632L516L506L160K837K848L147L526L992M734N702O505P026P832R503
$$ 474632 478148 481654 484814 487651 490499 493646 497172 501164 505898 511600 518105 525131 532963 542466
61345E42466J1601J2939J3060J2886J3540J4990J6380J7241J7601J7173J5352
$$ 542466 554067 567006 580066 592952 606492 621482 637862 655103 672704 689877 705229
61334G05229J2199Q720N806L371Q55j850m342o364q067r630j0889j1439j1033
$$ 705229 717428 726148 731954 735325 736180 734330 729988 723624 715557 705927 695038 683599 672566
61321F72566r825q276o862n869n361n170m925m378l725l375l342l206k757k245
$$ 672566 662741 654465 647603 641734 636373 631203 626278 621900 618175 614800 611458 608252 605495 603250
61307F03250j772r92J81J088J168R65J543L055M631N629O338P275Q470R606J0340
$$ 603250 601478 600486 600667 601755 602923 603888 605431 608486 613117 618746 625084 632359 640829 650435 660775
61292F60775J0285R116O941M211J211j989n026p247q372q740q642p899o345m337
$$ 660775 671060 680176 687117 691328 692539 690550 685524 678277 669905 661165 652523 644624 638279 633942
61278F33942k399p59N18J248J387J368J763K708L884M949N742O227O496O775P193
$$ 633942 631543 630784 631302 632550 633937 635305 637068 639776 643660 648609 654351 660578 667074 673849 681042
61263F81042P611P951Q555R810J1463J2686J3125J3430J4377J5740J6650J7028
$$ 681042 688653 696604 705159 714969 726432 739118 752243 765673 780050 795790 812440 829468
61251H29468J7866J9706K1565K1961K0471J7543J3216P279N10n523j0238j4434
$$ 829468 847334 867040 888605 910566 931037 948580 961796 969075 969585 964062 953824 939390
61239I39390j8454k1143k1452k0135j8752j7761j6592j5055j3452j1615r094o221
$$ 939390 920936 899793 878341 858206 839454 821693 805101 790046 776594 764979 755885 749664
61227G49664m022k938k517k314k280k226j750p34O09K206L940N229N530N184M934
$$ 749664 745642 742704 740187 737873 735593 733367 731617 730883 731492 733698 737638 742867 748397 753581 758515
61212G58515M758M077K961K115J671J043J78j72M03J456K558L702M599M731M443
$$ 758515 763273 767350 770311 772426 774097 775140 775318 775146 775549 777005 779563 783265 787864 792595 797038
61197G97038M956O732Q816J0413J2128J4863J8359K1727K4749K7712L0406L2305
$$ 797038 801994 808726 817542 827955 840083 854946 873305 895032 919781 947493 977899 1010204
61185A010204L3512L4719L6171L7237L7026L5176L2110K8732K5703K2919J9869
$$ 1010204 1043716 1078435 1114606 1151843 1188869 1224045 1256155 1284887 1310590 1333509 1353378
61174A353378J6506J3358J0760Q528O397M219J569k109o710j1423j5725j9753
$$ 1353378 1369884 1383242 1394002 1402530 1408927 1413146 1414715 1412606 1405896 1394473 1378748 1358995
61162A358995k3501k6508k8755l1054l3867l6380l7376l6628l4830l2622l0256
$$ 1358995 1335494 1308986 1280231 1249177 1215310 1178930 1141554 1104926 1070096 1037474 1007218
61151A007218k7837k5286k2374j9226j6488j4559j2958j0938q397n795l453j357
$$ 1007218 979381 954095 931721 912495 896007 881448 868490 857552 849155 843360 839907 838550
61139H38550N42K272L878N191N705M906K756j23k577l446k430m04J506L054M701
$$ 838550 839092 841364 845242 850433 856138 861044 863800 863677 861100 857654 855224 854820 856326 859380 864081
61124H64081O712R151J2459J6996K2065K6463K9963L3291L6656L9446M1523M3510
$$ 864081 870793 879944 892403 909399 931464 957927 987890 1021181 1057837 1097283 1138806 1182316
61112A182316M5516M6858M7431M8056M8954M9141M7963M6019M3903M1254L7770
$$ 1182316 1227832 1274690 1322121 1370177 1419131 1468272 1516235 1562254 1606157 1647411 1685181
61101A685181L3971L0166K5859K0920J6125J1733O858J180m114q250j2411j8017
$$ 1685181 1719152 1749318 1775177 1796097 1812222 1823955 1830813 1831993 1827879 1819629 1807218 1789201
61089A789201k4579l0638l5779m0300m3823m5820m6765m7366m7306m6048m4101
$$ 1789201 1764622 1733984 1698205 1657905 1614082 1568262 1521497 1474131 1426825 1380777 1336676
61078A336676m2237m0207l7534l4684l2135k9230k5447k1906j9843j8496j6252
$$ 1336676 1294439 1254232 1216698 1182014 1149879 1120649 1095202 1073296 1053453 1034957 1018705
61067A018705j3199j0651q825o951n142m084l217j265J491L474M267M948O022
$$ 1018705 1005506 994855 986030 979079 973937 969853 966636 965371 966862 970336 974603 979551 985573
61054I85573O900P547Q756J0575J2150J3400J5190J7682K0027K1971K4207K6949
$$ 985573 992473 1000020 1008776 1019351 1031501 1044901 1060091 1077773 1097800 1119771 1143978 1170927
61042A170927K9622L2096L4848L7752M0129M2025M4022M5887M6885M7364M8437
$$ 1170927 1200549 1232645 1267493 1305245 1345374 1387399 1431421 1477308 1524193 1571557 1619994
61031A619994N0133N1518N2374N3188N3708N3397N3085N4142N6271N8162O0081
$$ 1619994 1670127 1721645 1774019 1827207 1880915 1934312 1987397 2041539 2097810 2155972 2216053
61020B216053O3376O7570P0528P1601P2000P2070P1182P0653P3750Q2005R4302
$$ 2216053 2279429 2346999 2417527 2489128 2561128 2633198 2704380 2775033 2848783 2930788 3025090
61009C025090J09969J29578J51949J73962J94667K16704K43126K76479L21811
$$ 3025090 3135059 3264637 3416586 3590548 3785215 4001919 4245045 4521524 4843335
61000D843335L85770M70914N75204O98676Q45488J017728J214544J441173J711687
$$ 4843335 5229105 5700019 6275223 6973899 7819387 8837115 10051659 11492832 13204519
60991A3204519K038801K430654K898481L434977L942997M191182L907393K989792
$$ 13204519 15243320 17673974 20572455 24007432 27950429 32141611 36049004 39038796
60983C9038796J647304L07533o40000j030138r05207m00377K94549Q93882J050260
$$ 39038796 40686100 40993633 40353633 39323495 38418288 38017911 38312460 39206342 40256602
60974D0256602N35722n75608j922420l076609l774549l984764l822506l438411
$$ 40256602 40792324 40216716 38294296 35217687 31443138 27458374 23635868 20197457
60966B0197457k961560k484444k058282j697604j398063j152656r54340p93642
$$ 20197457 17235897 14751453 12693171 10995567 9597504 8444848 7490508 6696866
60958F696866o61817n54667m70034m03942l51724l10275k76728k47414k20468
$$ 6696866 6035049 5480382 5010348 4606406 4254682 3944407 3667679 3420265 3199797
60949C199797j97088j77957j60672j42834j25289j09871r6235q3678p4029o9611
$$ 3199797 3002709 2824752 2664080 2521246 2395957 2286086 2189851 2106173 2032144 1962533
60939A962533o9528p0608p1151p1226p0278o7177o2278n7154n2479m7947m3841
$$ 1962533 1893005 1822397 1751246 1680020 1609742 1542565 1480287 1423133 1370654 1322707 1278866
60928A278866m0771l8215l5112l1714k9210k7794k6653k5550k4880k4379k3333
$$ 1278866 1238095 1199880 1164768 1133054 1103844 1076050 1049397 1023847 998967 974588 951255
60917I51255k1885k0765j9865j8496j6783j5438j4398j3089j1736j0904j0003
$$ 951255 929370 908605 888740 870244 853461 838023 823625 810536 798800 787896 777893
60906G77893p968n357l990m302m833m628m478n166o071o394o458o845p299p410
$$ 777893 769925 764568 760578 756276 751443 746815 742337 737171 731100 724706 718248 711403 704104 696694
60892F96694p567q308r293r730r417q784q279q138q355q495p991o972o328o557
$$ 696694 689127 680819 671526 661796 652379 643595 635316 627178 618823 610328 602337 595365 589037 582480
60878E82480p079p046o363n487m680l950l367k921k344j492o86l27k84J6J046
$$ 582480 575401 568355 561992 556505 551825 547875 544508 541587 539243 537751 537065 536738 536454 536470 537516
60863E37516K833M895O429O879O591O550P283Q370R244R977J0895J1791J2006
$$ 537516 540349 545244 551673 558552 565143 571693 578976 587346 596590 606567 617462 629253 641259
60850F41259J1082Q894N459J203k665m728m587l246k095j809k310l439n243p641
$$ 641259 652341 661235 666694 667897 665232 660504 655917 652671 650576 648767 646457 643018 637775 630134
60836F30134j0127j2000j2844j2781j2286j1743j1077r887q031o102m962m664
$$ 630134 620007 608007 595163 582382 570096 558353 547276 537389 529358 523256 518294 513630
60824E13630m221k849j215o51j222j351K21K867N041O140O565O466N620M497M313
$$ 513630 509409 506560 505345 504694 503472 502121 502342 505209 510250 516390 522955 529421 535041 539538 543851
60809E43851N531P113P782P419O807O474O404O503O671O621O142N491N115M993
$$ 543851 549382 556495 564277 571696 578503 584977 591381 597884 604555 611176 617318 622809 627924 632917
60795F32917M674L991L306K961K791K330J339k3j464k816m032n030n660n947o258
$$ 632917 637591 641582 644888 647849 650640 652970 654309 654286 652822 650006 645974 640944 635284 629337 623079
60780F23079o987q082r099r736j0071j0151r801r062q459q408q495p912o547n225
$$ 623079 616092 608010 598911 589175 579104 568953 559152 550090 541631 533223 524728 516816 510269 505044
60766E05044m647m532m072l007j858j110o49j78Q9l32j245j572m88J500L100L695
$$ 505044 500397 495865 491793 488786 486928 485818 485169 484991 485080 484748 483503 481931 481443 482943 486043 489738
60750D89738L712L635L379K903K678L110L948M800N787P070Q059P968O895N722
$$ 489738 493450 497085 500464 503367 506045 509155 513103 517903 523690 530760 538819 546787 553682 559404
60736E59404M959M489M396N096O413P380P409O959O586N955M563K889K079K486
$$ 559404 564363 568852 573248 578344 584757 592137 599546 606505 613091 619046 623609 626498 628577 631063
60722F31063L244L250K193O18o14j015q35p49j014j239j183j357k374m039n639
$$ 631063 634307 637557 639750 640368 639754 638739 637904 637155 636141 634902 633719 632362 629988 625949 620310
60707F20310o837p656p885p360o794p291q792r898r614q607q035p876p205n825
$$ 620310 613473 605817 597932 590572 583778 576487 567695 557797 548183 539576 531541 523665 516460 510635
60693E10635m584m079l853l209k253j581j257o91M58J758K649L266M105N019N173
$$ 510635 506051 501972 498119 494910 492657 491076 489819 489128 489586 491344 493993 497259 501364 506383 511556
60678E11556M235L153L242M731O664Q060Q634Q535P955P203O594O079N292M126
$$ 511556 515791 518944 522186 526917 533581 541641 550275 558810 566765 573968 580562 586641 591933 596059
60664E96059K870J619K0k073m113n390n842n974o185o484o754o894o732o159n330
$$ 596059 598929 600548 600568 598495 594382 588992 583150 577176 570991 564507 557753 550859 544127 537968 532638
60649E32638m614m243m123l907l215j930l61R16J410R45l31j865k862k912k466
$$ 532638 528024 523781 519658 515751 512536 510606 510245 511161 512571 513516 513185 511320 508458 505546 503080
60634E03080k292k391k013q70K60N78L59N10J308K152K485K450K608L298M275
$$ 503080 500788 498397 496384 495514 495774 496352 496711 497221 498529 500681 503166 505616 508224 511522 515797
60619E15797M862M573L750L316L775M638N076M825M189L556L254L591M518N498
$$ 515797 520659 525232 528982 532298 536073 540711 545787 550612 554801 558357 561611 565202 569720 575218
60605E75218O126O632P334P858P537O464N524N282N420N384N146N040N147N121
$$ 575218 581344 587976 595310 603168 610705 617169 622693 627975 633395 638779 643925 648965 654112 659233
60591F59233M493L129J452J47m56n93o41p58j099j884k923l494l264k981l520
$$ 659233 663726 666855 668307 668454 667998 667405 666764 666006 664907 663023 660100 656606 653342 650361 646841
60576F46841m524m737l663k096r19j84M27J006J591K500M036O184Q720J1305J3386
$$ 646841 642317 637580 633917 631821 630902 630718 631145 632151 633742 636242 640278 646462 655182 666487 679873
60561F79873J4617J5478J6903J8958K0466K0193J8018J4570J0425O097K323m32
$$ 679873 694490 709968 726871 745829 766295 786488 804506 819076 829501 835598 837921 837489
60549H37489k483m336n723n784m149j349J839N050Q284J1519J4508J6907J8640
$$ 837489 835006 830670 824947 819163 815014 813665 815504 820554 828838 840357 854865 871772 890412
60536H90412K0197K2232K4596K6144K5866K3964K1379J8511J5110J1338Q206O643
$$ 890412 910609 932841 957437 983581 1009447 1033411 1054790 1073301 1088411 1099749 1107955 1114598
60524A114598O704P873R770J2153J4633J6833J8620J9870K0220J9477J8063J6555
$$ 1114598 1121302 1129175 1138945 1151098 1165731 1182564 1201184 1221054 1241274 1260751 1278814 1295369
60512A295369J4827J2312R118O341M821M057K782L79k726n811q438j0352j1334
$$ 1295369 1310196 1322508 1331626 1337967 1342788 1346845 1349627 1350006 1347280 1341469 1333031 1322679 1311345
60499A311345j1255r928o925k006M265J0889J7580K4854L2744M0084M5605M9134
$$ 1311345 1300090 1290162 1283237 1281231 1285496 1296385 1313965 1338819 1371563 1411647 1457252 1506386
60487A506386N0902N0044M4787L4227J9211J373j7890l7167n4496o7895p6480
$$ 1506386 1557288 1607332 1652119 1686346 1705557 1706930 1689040 1651873 1597377 1529482 1453002
60476A453002q0691q1404p9071p3843o6360n8073n0493m4142l8539l3298k8775
$$ 1453002 1372311 1290907 1211836 1137993 1071633 1013560 963067 918925 880386 847088 818313
60465H18313k5424k2998k0892j8952j7366j5995j4508j3049j2025j1201r857p970
$$ 818313 792889 769891 748999 730047 712681 696686 682178 669129 657104 645903 636046 628076
60453F28076o496o092o267o236n980n878n859n627n297n117m790l885k789k412
$$ 628076 621580 615488 609221 602985 597005 591127 585268 579641 574344 569227 564437 560552 557763 555351
60439E55351k905l379l188k679k359k036j461j230k112l637m363l683k517j876
$$ 555351 552446 549067 545879 543200 540841 538805 537344 536114 534002 530365 526002 522319 519802 517926
60425E17926j588j062n81q26j522j688j169r06j429k059j998j333n27L20J091
$$ 517926 516338 515276 514695 513869 512347 510659 509490 508584 507155 505096 503098 501765 501238 501558 502649
60410E02649J247N66k44m05o0L07Q49J852K752K677J812J163J113J149R74R08
$$ 502649 503896 504462 504218 503813 503753 504060 504909 506761 509513 512190 514002 515165 516278 517427 518401 519309
60394E19309J107J329J587K130K648K419J473P61Q79J444J898K070J768P76l96
$$ 519309 520416 521745 523332 525462 528110 530529 532002 532763 533642 535086 536984 539054 540822 541598 541202
60379E41202p56k75m4n84r83m17N70J056J112J159Q64j75j243j285n32j39l48
$$ 541202 540446 540171 540127 539543 538560 538143 538713 539769 540881 542040 542904 542729 541486 540201 539669 539530 539182
60362E39182j86R35K268K699J998Q63J25N9K35Q4k75j15P60J481J242M38M2K75
$$ 539182 538996 539931 542199 544898 546896 547759 547884 547943 548178 548262 547987 547872 548632 550113 551355 551793 551835 552110
60344E52110O75J036J430J624J388J229J839K861L217K700K266K544L019L051
$$ 552110 552785 553821 555251 556875 558263 559492 561331 564192 567409 570109 572375 574919 577938 580989
60330E80989K831K839L027L028K749K291J705J044L69m55j524k345k114p96O09
$$ 580989 583820 586659 589686 592714 595463 597754 599459 600503 600872 600417 598893 596548 594434 593638 594247
60315E94247J209J169J197J653K480L632N075O685Q473J0578J2836J4880J6899
$$ 594247 595456 596625 597822 599475 601955 605587 610662 617347 625820 636398 649234 664114 681013
60302F81013J9753K3864K8623L3389L8184M2447M3819L9789L0682J9607Q975j735
$$ 681013 700766 724630 753253 786642 824826 867273 911092 950881 981563 1001170 1010145 1008410
60290A008410j3900k6556l6546m1537m1718l8640l3606k7603k1771j7028j3486
$$ 1008410 994510 967954 931408 889871 848153 809513 775907 748304 726533 709505 696019
60279F96019j0758q654p177o185n483n136n180n242m954m524m403m447m035l058
$$ 696019 685261 676607 669430 663245 657762 652626 647446 642204 637250 632726 628323 623876 619841 616783
60265F16783k091j506j051n18j62j03J13P97J542J792J612J275N90p06k116k783
$$ 616783 614692 613186 612135 611617 611455 611352 611465 612262 613804 615596 617208 618483 619073 618367 616251 613468
60249F13468k611k280k162j940j402r32q86j041j016q52p91p51m10K63Q29Q10
$$ 613468 610857 608577 606415 604475 603073 602141 601255 600214 599198 598346 597555 596804 596394 596657 597486 598296
60233E98296K38k33J08J317K682L512L783L830L672L190K716K846L496L787L138
$$ 598296 598534 598301 598409 599726 602408 605920 609703 613533 617205 620395 623111 625957 629453 633240 636378
60218F36378J963J050O61O76J062J740K226K105J703J735K313K862L054L199L465
$$ 636378 638341 639391 640052 640728 641790 643530 645756 647861 649564 651299 653612 656474 659528 662727 666192
60203F66192L397K671J826J622J905J814J072M08M86J030J306J082P31O66J008
$$ 666192 669589 672260 674086 675708 677613 679427 680499 680907 681393 682423 683729 684811 685542 686208 687216
60188F87216J563J850J424M86j48NM91O27M13J61k72j157k028k175j832j950k617
$$ 687216 688779 690629 692053 692539 692391 692396 692887 693514 693927 694088 693816 692659 690631 688456 686624 684674 682057
60171F82057k775j780l13P09J207J345Q01m94j638j715j106q62j091r40o5Q02
$$ 682057 679282 677502 677189 677898 679105 680450 681251 680757 679119 677404 676298 675436 674345 673405 673340 674142
60155F74142R19M00j37k44J48P21R08N02J96J016L084N364O779P135O937O732
$$ 674142 675061 675461 675324 675080 675228 675949 676857 677359 677555 678571 681655 687019 693798 700933 707870 714602
60139G14602O923P748R067J0368J1371J2543J4691J7821K0620K1394J9581J6122
$$ 714602 721525 729273 738340 748708 760079 772622 787313 805134 825754 847148 866729 882851
60127H82851J2126P495J439n786j2388j6556j7882j7078j4926j2052r168o859
$$ 882851 894977 902472 903911 898125 885737 869181 851299 834221 819295 807243 798075 791216
60115G91216n231m189l746l657l203j948m49M40P24J034J498J600J105M45O2P
$$ 791216 785985 781796 778050 774393 771190 769242 768793 769233 769957 770991 772489 774089 775194 775639 775701 775708
60099G75708K35P30J242J369J010M14j97o16m03Q11K763M816O688Q438R892J0834
$$ 775708 775943 776673 777915 779284 780294 780708 780511 779895 779492 780303 783066 787882 794570 803008 812900 823734
60083H23734J1721J3354J5555J6889J6143J3626J0614P918N337K130k255p695
$$ 823734 835455 848809 864364 881253 897396 911022 921636 929554 934891 937021 934766 927071
60071I27071j3275j7737k0293k0877j9856j7831j5700j4286j3562j2660j0998
$$ 927071 913796 896059 875766 854889 835033 817202 801502 787216 773654 760994 749996
60060G49996r101p970p785p712o981n861n277n625o222o140n294m365l785l336
$$ 749996 740895 732925 725140 717428 710447 704586 699309 693684 687462 681322 676028 671663 667878 664542
60046F64542k780k274j902j367n47K09P16J309K061K371J976J760K592L870M263
$$ 664542 661762 659488 657586 656219 655672 655881 656597 657906 659967 662338 664314 666074 668666 672536 676799
60031F76799L550K668K184J834J474J274Q65n03k794n133p092q983j0645j1220
$$ 676799 680349 683017 685201 687035 688509 689783 690648 690145 687351 682218 675126 666143 655498 644278
60017F44278j0515r541r054q570p408n825m387l103j985j692k684m231n070m752
$$ 644278 633763 624222 615168 606598 599190 593365 588978 585875 583890 582198 579514 575283 570213 565461
60003E65461l692k364j125m67o29j144j387j344j356j341r00n6P00J096J342J736
$$ 565461 561769 559405 558280 557813 557184 556040 554653 553309 551953 550612 549712 549656 550356 551452 552794 554530
59987E54530K307K864L165L116K943K980L162K993K151Q92l06j202j765k008j994
$$ 554530 556837 559701 562866 565982 568925 571905 575067 578060 580211 581103 580797 579595 577830 575822 573828
59972E73828j789j367q80q77j718k827l191k617j855j355p50K42J276K047K647
$$ 573828 572039 570672 569792 568915 567197 564370 561179 558562 556707 555352 554602 554844 556120 558167 560814
59957E60814K870K138O53l37j58K80j12r64j196p06k07P7M15N79M0r42j466j284
$$ 560814 563684 565822 566475 566138 565980 566260 566148 565184 563988 563282 563075 563152 563567 564146 564186 563244 561778 560494
59939E60494j061j246j511j422j028n81k73l34r05j647j999j803j317o19M65J778
$$ 560494 559433 558187 556676 555254 554226 553645 553372 553038 552133 550486 548487 546684 545367 544748 545213 546991
59923E46991K691K747K125J354Q05M86K63J89O39J775K954L178K438J936K522
$$ 546991 549682 552429 554554 555908 556713 557199 557462 557651 558290 560065 563019 566197 568635 570571 573093
59908E73093L477L556K704J931J856K251K812L443L780L395K576K162K408K702
$$ 573093 576570 580126 582830 584761 586617 588868 591680 595123 598903 602298 604874 607036 609444 612146
59894F12146K582K339K362K532K643K924L685M716N415N429M991M655M736M970
$$ 612146 614728 617067 619429 621961 624604 627528 631213 635929 641344 646773 651764 656419 661155 666125
59880F66125M845M434M524N612P050P701P210O063M633K912J155j25j051k532
$$ 666125 670970 675404 679928 685540 692590 700291 707501 713564 718197 721109 722264 722139 721088 718556
59866G18556n009p641r176r289q580p614o480n147l727k344j037O3O93P28M02
$$ 718556 713547 705906 696730 687441 678861 671247 664767 659620 655893 653549 652512 652575 653268 653996 654398
59851F54398K02N28J456K752M074N217O275P565R265J1053J2348J3065J3922J5597
$$ 654398 654600 655128 656584 659336 663410 668627 674902 682467 691732 702785 715133 728198 742120 757717
59837G57717J7668J8746J7661J4261R281M024J33j100L96L549P039R634R833O394
$$ 757717 775385 794131 811792 826053 835334 839358 839491 838391 838787 842336 849375 859009 868842 875236
59823H75236k11p679j3835j8157k0936k2017k1332j9957j9242j9091j8210j6012
$$ 875236 875025 867346 853511 835354 814418 792401 771069 751112 731870 712779 694569 678557
59811F78557j3304j1060r376p851o258m625l093j890j006p9J008J670J373N70
$$ 678557 665253 654193 644817 636966 630708 626083 622990 621100 620094 620015 621023 622693 624066 624636
59797F24636R8j63j081k787m334n009n089n054m930m770m925n362n390m597l490
$$ 624636 624734 624571 623490 620703 616369 611360 606271 601217 596287 591517 586592 581230 575840 571243 567753
59782E67753k732k250j659j114j060j405j521j058k64N10J221J942K462K317J344
$$ 567753 565021 562771 561112 559998 558938 557533 556012 554954 554690 555200 556421 558363 560825 563142 564486
59767E64486J43k42O12J915K481K015J249Q68Q60R35R97R67O29O8j00N96J772
$$ 564486 564629 564387 564999 566914 569395 571410 572659 573527 574387 575322 576319 577286 577915 577983 577883 578479 580251
59750E80251K572K685K591K800L145L130K719K500K867L424L440K767J929J310
$$ 580251 582823 585508 588099 590899 594044 597174 599893 602393 605260 608684 612124 614891 616820 618130
59736F18130P68J90q4K51Q98J278J190Q65N37L23K96L84L44K7m93j191k105k883
$$ 618130 618898 619088 619004 619255 620153 621431 622621 623486 624023 624346 624642 625026 625370 625397 624904 623713 621608 618725
59718F18725k842j849p05k23l84q10j413j994j820m92J124J756J259N62L58O48
$$ 618725 615883 614034 613329 613106 612722 611912 610499 608505 606685 606193 607317 609073 610332 610894 611252 611900
59702F11900J297K073K327J605N39K00N99P72L90K75J055K235K875K555J454R1
$$ 611900 613197 615270 617597 619202 619741 619941 620540 621312 621702 621977 623032 625267 628142 630697 632151 632242
59686F32242q51j057r41r39o05P34K632L855M036L908L818L248K053Q87l2j355
$$ 632242 631391 630334 629393 628454 627849 628583 631215 635070 639106 643014 646832 650080 652133 653020 652988 651633
59670F51633l200m521m598m118l940l782l021j933j107m43K76M34n87k131k894
$$ 651633 648433 643912 639314 635196 631256 627474 624453 622520 621413 620970 621246 621680 621093 618962 616068
59655F16068k550j825j208n61J93R75J979L386M643M925M290L541K905J783m8
$$ 616068 613518 611693 610485 609924 610117 611092 613071 616457 621100 626025 630315 633856 636761 638544 638496
59640F38496j831k847l285l651l830l380k404j448o69L70J856L210L741L595L485
$$ 638496 636665 633818 630533 626882 623052 619672 617268 615820 615151 615521 617377 620587 624328 627923 631408
59625F31408L560L157K003J097J677L532N122N358M549L413J950j79k718m773
$$ 631408 634968 638125 640128 641225 642902 646434 651556 656914 661463 664876 666826 666647 663929 659156
59611F59156n602n117l824k441j370l54J024K533L400L383L106L115L160K826
$$ 659156 653554 648437 644613 642172 640802 640448 641472 644005 647405 650788 653894 657009 660169 662995
59597F62995K230J586N83r92k390k514j378k81l32j326k296k724k868l120l399
$$ 662995 665225 666811 667394 666402 664012 661498 660120 659839 659507 658181 655885 653161 650293 647173 643774
59582F43774l333k829k258k026k207k670l372m186m727m681m222l720l208k606
$$ 643774 640441 637612 635354 633328 631121 628451 625079 620893 616166 611485 607263 603543 600335 597729
59568E97729k155k033j718n52R87J596Q87k2o5M88Q90J235J991K769K582J329
$$ 597729 595574 593541 591823 591271 592258 593854 594741 594719 594654 595142 596032 597267 599258 602027 604609 605938
59552F05938K44N81K225L783L920K628J193Q85J676K539K847L059L977N863Q356
$$ 605938 606182 606763 608988 612771 616691 619319 620512 621397 623073 625612 628459 631518 635495 641358 649714
59537F49714J0857J2990J5174J8528K3103K6230K4057J5672M869l186o430o312
$$ 649714 660571 673561 688735 707263 730366 756596 780653 796325 801194 798008 791578 785266
59525G85266m728k040J961O649J0823J3817J5831J7398J8630J8892J7356J4010
$$ 785266 780538 778498 780459 787108 797931 811748 827579 844977 863607 882499 899855 913865
59513I13865R954O377L471O71k378n547q648j1570j4002j5507j5932j5543j4777
$$ 913865 923819 930196 933667 934338 931960 926413 917765 906195 892193 876686 860754 845211 830434
59500H30434j3973j3189j2133j0523q655p259o546n812m377k560j331j234j973
$$ 830434 816461 803272 791139 780616 771961 764702 758156 752344 747967 745407 744076 742842 740869
59487G40869k756k684j202J325L719N208O295Q018J0547J3092J5082J6859J9068
$$ 740869 738113 735429 734227 735552 739271 744479 750774 758792 769339 782431 797513 814372 833440
59474H33440K1708K3957K4785K3689K0878J6728J1247M488k608q347j1515j2064
$$ 833440 855148 879105 903890 927579 948457 965185 976432 980920 978312 969965 958450 946386
59462I46386j0484p103k425K581P144J1419J6033K1083K6049L0433L4184L7600
$$ 946386 935902 928799 926374 928955 936099 947518 963551 984634 1010683 1041116 1075300 1112900
59450A112900M1215M5545N0725N6475O2425O7835P0671O7629N5929L5310Q458
$$ 1112900 1154115 1199660 1250385 1306860 1369285 1437120 1507791 1575420 1631349 1666659 1675117
59439A675117k0137m5623o4243p4510p7335p4864o9222o2122n4885m8312m2734
$$ 1675117 1654980 1609357 1545114 1470604 1393269 1318405 1249183 1187061 1132176 1083864 1041130
59428A041130l8274l4738l1333k7194k2246j7006j1577n771j10M428P951J1688
$$ 1041130 1002856 968118 936785 909591 887345 870339 858762 852991 852881 857309 865260 876948
59416H76948J6132K0416K3924K7147L0416L3325L6069L9289M1293L7526K5168
$$ 876948 893080 913496 937420 964567 994983 1028308 1064377 1103666 1144959 1182485 1207653
59405A207653P253r820k1977k8866l1117k9174k4535j9137j3115n653J312K854
$$ 1207653 1214906 1205086 1183109 1154243 1123126 1093952 1069417 1050280 1037165 1031512 1032824 1035678
59393A035678m062j6929l0020l9073m2878m2006l7814l2143k6569k1737j7738
$$ 1035678 1031616 1014687 984667 945594 902716 860710 822896 790753 764184 742447 724709
59382G24709j4654j2389j0538q859p488o491n728n188m843m163k640q99k34q54
$$ 724709 710055 697666 687128 678269 670781 664290 658562 653374 648531 644368 641728 640829 640595 639741
59368F39741j545j403q32m67j66L01N53L93N07J576L199M484N244O006P140Q522
$$ 639741 638196 636793 635961 635494 635328 635629 636182 636575 637082 638658 641857 646341 651585 657591 664731 673253
59352F73253R860J0976J2016J3565J6176J9669K3232K6281K8692L0346L1184L1779
$$ 673253 683113 694089 706105 719670 735846 755515 778747 805028 833720 864066 895250 927029
59340I27029L2838L3944L3731L1677K8755K5853K2504J7814J1768M833k803j0734
$$ 927029 959867 993811 1027542 1059219 1087974 1113827 1136331 1154145 1165913 1170746 1167943 1157209
59328A157209j7739k2766k6157k9023l1679l3452l3850l3095l1626k9697k7483
$$ 1157209 1139470 1116704 1090547 1061524 1029845 996393 962543 929448 897822 868125 840642
59317H40642k5096k2515j9842j7375j5150j2773j0108p787o409n583m393k705
$$ 840642 815546 793031 773189 755814 740664 727891 717783 709996 703587 698004 693611 690906
59305F90906j332q51q51n16M25J577K454L065L925N435P276Q655R268R807J1257
$$ 690906 689574 688723 687872 687356 687781 689358 691812 694877 698802 704237 711513 720168 729436 739243 750500
59290G50500J3917J7323K1027K5037K9319L2769L2852K6866J4376j410j5258k3409
$$ 750500 764417 781740 802767 827804 857123 889892 922744 949610 963986 962576 947318 923909
59278I23909k5605k3970k0575j6288j1279n762j60N124R860J4006J7591K0628
$$ 923909 898304 874334 853759 837471 826192 820430 820270 825394 835254 849260 866851 887479
59266H87479K3129K5046K6034K5577K3611K0731J7403J3347Q269K769k288p061
$$ 887479 910608 935654 961688 987265 1010876 1031607 1049010 1062357 1070626 1073395 1071107 1064046
59254A064046j2323j7746k1781k3579k4028k4264k4122k2756k0091j6815j3480
$$ 1064046 1051723 1033977 1012196 988617 964589 940325 916203 893447 873356 856541 843061
59243H43061j0342p712n659l685j382Q99K633M131O131Q680J1124J3189J5109
$$ 843061 832719 825007 819348 815663 814281 815180 817813 821944 828075 836755 847879 861068 876177
59230H76177J6685J7039J5723J3371J0835Q164M929J199k415n654q972j2803j6758
$$ 876177 892862 909901 925624 938995 949830 957994 962923 964122 961707 956053 947081 934278 917520
59217I17520j9845k1363k1390k0436j8950j7242j5677j4612j4167j4056j3740
$$ 917520 897675 876312 854922 834486 815536 798294 782617 768005 753838 739782 726042
59206G26042j2763j1141r456q387q062q038p878p485o821n771m528l647l345l145
$$ 726042 713279 702138 692682 684295 676233 668195 660317 652832 646011 640240 635712 632065 628720 625575
59192F25575k589j882j349p17L63J404J588J042Q26J520K546L112L164L162L368
$$ 625575 622986 621104 619755 619038 619401 620805 622393 623435 624261 625781 628327 631439 634603 637765 641133
59177F41133L735M213M866N785O884P769Q063Q068Q725J0518J2739J4399J5531
$$ 641133 644868 649081 653947 659732 666616 674385 682448 690516 699241 709759 722498 736897 752428
59164G52428J6903J8743K0496K1774K2720K3328K3127K1729J9200J5883J2220
$$ 752428 769331 788074 808570 830344 853064 876392 899519 921248 940448 956331 968551
59153I68551Q686N324J584k891p468j1240j4172j6780j8931j9967j9881j9315
$$ 968551 977237 982561 984145 981254 973786 962546 948374 931594 912663 892696 872815 853500
59141H53500j8471j7009j5089j3417j2118j0624q891p602o884n954m425k926j933
$$ 853500 835029 818020 802931 789514 777396 766772 757881 750279 743395 737441 733016 730090 728157
59128G28157r96L05J534K216K688L490M575N639O632P457P859Q041Q792J0529
$$ 728157 727161 727466 729000 731216 733904 737394 741969 747608 754240 761697 769556 777597 786389 796918
59114G96918J2789J4907J6639J7855J8393J8433J8210J7233J4897J2049J0621
$$ 796918 809707 824614 841253 859108 877501 895934 914144 931377 946274 958323 968944
59103I68944J1081J1548J0299P871N726L937J660j020l134m331n018n283m849
$$ 968944 980025 991573 1001872 1009743 1015469 1019406 1021066 1020046 1016912 1012581 1007563 1002280 997431
59090I97431l999l458l372l206k703k232k219k808m034n785p666r381j1053j2819
$$ 997431 993432 989974 986602 983396 980693 978461 976242 973434 969400 963615 955949 946568 935515 922696
59076I22696j4311j5048j5094j4858j4414j3495j2091j0581r365q560p966p194
$$ 922696 908385 893337 878243 863385 848971 835476 823385 812804 803439 794879 786913 779719
59064G79719o050m842m041l567k910k069j663j955k330k203j851j909k523l317
$$ 779719 773669 768827 764786 761219 758309 756240 754577 752622 750292 748089 746238 744329 741806 738489
59050G38489l912m199m407m958n885o465n978m708l492k446j098L02Q44N03M10
$$ 738489 734577 730378 725971 721013 715128 708663 702685 697977 694485 692039 690941 691243 692087 692590 693000
59035F93000J149K015K343K491K892L296L609M369N734O975P695Q517R897J1298
$$ 693000 694149 696164 698507 700998 703890 707186 710795 715164 720898 727873 735568 744085 753982 765280
59021G65280J2220J3003J3893J4444J4623J5261J6476J6809J5065J1923Q707N726
$$ 765280 777500 790503 804396 818840 833463 848724 865200 882009 897074 908997 917704 923430
59009I23430K889P70l78j551l410m723l891j326J256L294N532Q208J0684J2661
$$ 923430 926319 927089 926711 925160 921750 917027 913136 911810 913066 916360 921892 930100 940784 953445
58995I53445J4330J5495J5761J5385J4901J4151J2696J0806R066P370N179K334
$$ 953445 967775 983270 999031 1014416 1029317 1043468 1056164 1066970 1076036 1083406 1088585 1090919
58983A090919j269n981j1392j5784j7878j8336j8404j7901j6080j3540j1543r957
$$ 1090919 1089650 1083669 1072277 1056493 1038615 1020279 1001875 983974 967894 954354 942811 932854
58971I32854p657m587j706P87L505O332Q519J0244J2481J5241J7444J8523J8845
$$ 932854 925197 920610 918904 919691 923196 929528 938047 948291 960772 976013 993457 1011980 1030825
58958A030825J8575J7518J5975J4380J2146Q193K594l567r711j5764k0927k4060
$$ 1030825 1049400 1066918 1082893 1097273 1109419 1117612 1120206 1116639 1106928 1091164 1070237 1046177
58946A046177k5218k5352k4569k2273j8867j5625j2780r433n492k098m7O88j67
$$ 1046177 1020959 995607 971038 948765 929898 914273 901493 892060 886568 884470 884423 885111 884944
58933H84944k986o670r157r944j0504j1727j2686j2467j1582j0819j0126r380
$$ 884944 881958 875288 866131 856187 845683 833956 821270 808803 797221 786402 776276 766896
58921G66896q927q682p963o684n561m611k937n13J311J873K337L866N906P297
$$ 766896 757969 749287 741324 734640 729079 724468 721531 721018 722329 724202 726539 730405 736311 743608
58907G43608P991Q669R564J0616J2107J4292J6926J9682K2340K4302K4780K3867
$$ 743608 751599 760268 769832 780448 792555 806847 823773 843455 865795 890097 914877 938744
58895I38744K2559K1343J9747J7693J6164J6058J7391K0155K4813L1248L8165
$$ 938744 961303 982646 1002393 1020086 1036250 1052308 1069699 1089854 1114667 1145915 1184080
58884A184080M4133M8448N0566M9823M6293M0994L4626K7064J8565J0208K443
$$ 1184080 1228213 1276661 1327227 1377050 1423343 1464337 1498963 1526027 1544592 1554800 1557243
58873A557243n665j4894k4492l3154m0422m6156m9537m9761m7245m3252l8683
$$ 1557243 1551578 1536684 1512192 1479038 1438616 1392460 1342923 1293162 1245917 1202665 1163982
58862A163982l3872k9198k5232k2455k1093k0856k0760j9970j8918j8762j9571
$$ 1163982 1130110 1100912 1075680 1053225 1032132 1011276 990516 970546 951628 932866 913295
58851I13295k0058j9395j8172j7066j5710j3640j1368r705q740q213q101q174
$$ 913295 893237 873842 855670 838604 822894 809254 797886 788181 779441 771228 763127 754953
58839G54953p709o427n111m659n069n870o809p600p624o655n372m637m563m668
$$ 754953 747244 740817 735706 731047 725978 720108 713299 705699 698075 691420 686048 681411 676848 672180
58825F72180m451l583k155r05n09m95L06K063L666M424M921N726O288N900M886
$$ 672180 667729 664146 661991 661086 660577 660082 660388 662451 666117 670541 675462 681188 687476 693376 698262
58810F98262M042L514K871J845N50p07j530j901k468l726m981n086m099l144k660
$$ 698262 702304 705818 708689 710534 711084 710377 708847 706946 704478 700752 695771 690685 686586 683442 680782
58795F80782k127j571j796k706k992k091j012m97J92J799L664M848N545O400P378
$$ 680782 678655 677084 675288 672582 669590 667499 666487 665990 666182 667981 671645 676493 682038 688438 695816
58780F95816Q208R044R815R763Q414O314M185K250Q22M38P60N29o40j577j401
$$ 695816 704024 713068 722883 732646 741060 747374 751559 753809 754631 755069 755829 756358 755718 754141 752740
58765G52740q69r54j325j248j004j263j911k361k320j532K55K430L762M208N181
$$ 752740 751871 750917 749592 748344 747340 746077 744166 741805 739485 737953 738208 740638 744400 748608 753789
58750G53789P226Q857Q775P809P373P403P203P142P861Q841R323R764J0854J1870
$$ 753789 761015 769872 778647 786456 793829 801232 808435 815577 823438 832279 841602 851366 862220 874090
58736H74090J1686J0692J0204J0453J0685J0720J0955J1258J1258J1368J2210
$$ 874090 885776 896468 906672 917125 927810 938530 949485 960743 972001 983369 995579
58725I95579J3305J3581J2829J1594J0037Q124O435N668N636N899O798Q748J0932
$$ 995579 1008884 1022465 1035294 1046888 1056925 1065049 1071484 1077152 1082788 1088687 1095485 1104233 1115165
58712A115165J2034J1956J1597J1240J0262Q187N071J125l099o609r059j1473
$$ 1115165 1127199 1139155 1150752 1161992 1172254 1180441 1185512 1186637 1183538 1176929 1167870 1156397
58700A156397j4855j8674k1839k4490k7458l0385l1924l1653l0389k8639k6090
$$ 1156397 1141542 1122868 1101029 1076539 1049081 1018696 986772 955119 924730 896091 870001
58689H70001k2754j9412j6586j4063j1737j0177r952j0897j2216j3063j3026j2283
$$ 870001 847247 827835 811249 797186 785449 775272 765320 754423 742207 729144 716118 703835
58677G03835j1212r911q346o928o118n475m050j900j12R59K246M257O224P687
$$ 703835 692623 682712 674366 667438 661320 655845 651795 649895 649783 650742 652988 657245 663469 671156
58663F71156R452J1993J4280J5340J5701J5980J5277J2542Q559N042K471K82j562
$$ 671156 680608 692601 706881 722221 737922 753902 769179 781721 790280 795322 797793 798075 796513
58650G96513k652l226l871m521m868n155n569n598m937m169l601k540q07L46J94
$$ 796513 793861 790635 786764 782243 777375 772220 766651 761053 756116 751947 748346 745806 744999 745345 745539
58635G45539J35J693M068N442N603N447M874L246J108n35j966l907n604n848n187
$$ 745539 745674 747367 751435 756877 762480 767927 772801 776047 777155 776620 774654 770747 765143 759295 754108
58620G54108m985m768k835Q09M388P113R774J2643J5010J6980J9582K2569K4037
$$ 754108 749123 744355 741520 742329 746717 753830 763604 776247 791257 808237 827819 850388 874425
58607H74425K2797J9545J5304J0242M602o17m556p165q615q964q494p576o253
$$ 874425 897222 916767 932071 942313 946915 946298 941742 934577 925962 916998 908504 900928 894675
58594H94675m682l561l220k891j902q91n50pJ997N008P650R884J2555J5262J6733
$$ 894675 889993 886432 883212 880321 878419 877528 876978 876971 878968 883976 891626 901510 914065 929327 946060
58579I46060J7069J7548J8225J7719J5481J2458R330N923K555K95m93m10L24K118
$$ 946060 963129 980677 998902 1016621 1032102 1044560 1053890 1059813 1062368 1062663 1062170 1061760 1062084 1064202
58565A064202M864P825J0658J3362J5429J6462J7150J8231J8910J7982J5894J3862
$$ 1064202 1069066 1076891 1087549 1100911 1116340 1132802 1149952 1168183 1187093 1205075 1220969 1234831
58553A234831J1485P505K543j371l961o972j1019j4542j6434j7434j8307j8651
$$ 1234831 1246316 1253821 1256364 1254993 1251032 1244060 1233041 1218499 1202065 1184631 1166324 1147673
58541A147673j8316j8115j8330j8153j7347j6908j7291j7483j6535j4803j3071
$$ 1147673 1129357 1111242 1092912 1074759 1057412 1040504 1023213 1005730 989195 974392 961321
58530I61321j1512j0022q489o525l948j603n45m23J41J665L570N525P569R134
$$ 961321 949809 939787 931298 924773 920825 919222 918677 918254 918395 920060 923630 929155 936724 945858
58516I45858R570R403R462R094P088M116K199J830J617Q47L19M90P92J147K172
$$ 945858 955428 964831 974293 983387 990475 994591 996790 998620 1000237 1001084 1001403 1001893 1002685 1003832 1006004
58501A006004L619M394M370M485M977N313N784P101Q389P819N507L600L106K764
$$ 1006004 1009623 1014017 1018387 1022872 1027849 1033162 1038946 1046047 1054436 1062255 1067762 1071362 1074468 1077232
58487A077232J354q67l480o484r146j0246r910r370q749p025m313j965j85K098
$$ 1077232 1078586 1077719 1074239 1067755 1058609 1048363 1038453 1029083 1020334 1013309 1008996 1007031 1006846 1008944
58473A008944M670N782M885L328J828l78l389o042q065j0444j2979j3947j2874
$$ 1008944 1013614 1019396 1024281 1027609 1029437 1029059 1025670 1019628 1011563 1001119 988140 974193 961319
58460I61319j1382j0475r382p727o400n529l976j695j78K73J184K969L948L323
$$ 961319 949937 939462 930080 922353 915953 910424 906448 904753 904575 904848 906032 909001 912949 916272
58446I16272K499K279J401p46k478k456j729j589j509o34N69J636L152N198O581
$$ 916272 918771 921050 922451 921705 919227 916771 915042 913453 911944 911310 911879 913515 916667 921865 928446
58431I28446O785O862P339P243O246N664O226O964P453Q891J1679J4084J4669
$$ 928446 935231 942093 949432 956675 962921 968585 974811 981775 989228 998119 1009798 1023882 1038551
58418A038551J4158J3621J2839J1669J1012J1155J0942R645P827N612K233j953
$$ 1038551 1052709 1066330 1079169 1090838 1101850 1113005 1123947 1133592 1141419 1147031 1149264 1147311
58406A147311n363p818j0732j3902j4974j3275j1187j0337r236o423l127r83M27
$$ 1147311 1141948 1134130 1123398 1109496 1094522 1081247 1070060 1059723 1050487 1044064 1040937 1039954 1040381
58393A040381J977L228L934M969O255O038L786J351j53j984m777o742o596n596
$$ 1040381 1042358 1045586 1049520 1054489 1060744 1066782 1070568 1071919 1071766 1069782 1065005 1058263 1051667 1046071
58379A046071m921l702j455K71O45J212K848L831L032K223K944L832L437L065
$$ 1046071 1041150 1037448 1035993 1036264 1036909 1038121 1040969 1044800 1047832 1050055 1052999 1056831 1060268 1063333
58365A063333M312O218P332Q361J0334J2335J3299J3962J4927J5084J3978J3262
$$ 1063333 1067645 1073863 1081195 1089556 1099890 1112225 1125524 1139486 1154413 1169497 1183475 1196737
58353A196737J3769J3592J1198P969N593L504J147p4O88J770J911K396M254O090
$$ 1196737 1210506 1224098 1235296 1243265 1248858 1252362 1253509 1253435 1254123 1255893 1257804 1260200 1264454 1270544
58339A270544O933Q258J0811J2537J2155J1764J3256J5184J5832J6297J7774J8888
$$ 1270544 1277477 1285735 1296546 1309083 1321238 1333002 1346258 1361442 1377274 1393571 1411345 1430233
58327A430233J8538J8232J8773J7991J4724J1725J1350J1726J0538R213R782J0793
$$ 1430233 1448771 1467003 1485776 1503767 1518491 1530216 1541566 1553292 1563830 1573043 1582825 1593618
58315A593618J0213R377J0368J2234J3352J4654J7042J8664J8258J8064J9927
$$ 1593618 1603831 1613208 1623576 1635810 1649162 1663816 1680858 1699522 1717780 1735844 1755771
58304A755771K1760K1446K0776K1725K2442K0928J9155J9336J9778J8662J8280
$$ 1755771 1777531 1798977 1819753 1841478 1863920 1884848 1904003 1923339 1943117 1961779 1980059
58293A980059K0774K3421K2953K1149K1278K2476K2650K3461K7132L1452L3236
$$ 1980059 2000833 2024254 2047207 2068356 2089634 2112110 2134760 2158221 2185353 2216805 2250041
58282B250041L3662L5179L6442L5458L4391L5807L7605L7024L6218L8198M0909
$$ 2250041 2283703 2318882 2355324 2390782 2425173 2460980 2498585 2535609 2571827 2610025 2650934
58271B650934M1180M1045M4003M8412N0781N2257N5685N9596O1411O3241O8080
$$ 2650934 2692114 2733159 2777162 2825574 2876355 2928612 2984297 3043893 3105304 3168545 3236625
58260C236625P3601P6142P7295Q0201Q3094Q3155Q2794Q5170Q7601Q6565Q4977
$$ 3236625 3310226 3386368 3463663 3543864 3626958 3710113 3792907 3878077 3965678 4052243 4137220
58249D137220Q7156R1003R2901R5666J03343J12730J18741J23596J31841J41020
$$ 4137220 4224376 4315379 4408280 4503946 4607289 4720019 4838760 4962356 5094197 5235217
58239E235217J46662J51737J61329J72694J80774J88658K01871K17255K28712
$$ 5235217 5381879 5533616 5694945 5867639 6048413 6237071 6438942 6656197 6884909
58230F884909K39200K55314K74729K91170L07011L28400L52776L74252L96499
$$ 6884909 7124109 7379423 7654152 7945322 8252333 8580733 8933509 9307761 9704260
58221I704260M26694M61796M95033N30509N76343O28995O80527P35704Q04848
$$ 9704260 10130954 10592750 11087783 11618292 12194635 12823630 13504157 14239861 15044709
58212A5044709Q85589R69906J063421J178387J313591J462074J632853J843054
$$ 15044709 15930298 16900204 17963625 19142012 20455603 21917677 23550530 25393584
58204B5393584K095129K386057K733011L164413L692793M324908N091100O032983
$$ 25393584 27488713 29874770 32607781 35772194 39464987 43789895 48880995 54913978
58196E4913978P169352Q508558J0085104J1943821J4098034J6550863J9347811
$$ 54913978 62083330 70591888 80676992 92620813 106718847 123269710 142617521
58189A42617521K2552800K6175164L0139425L4182646L7505166L8458269L4950819
$$ 142617521 165170321 191345485 221484910 255667556 293172722 331630991 366581810
58182C66581810K5736918J1653780m396911j8854522k9169337l4553545l5630056
$$ 366581810 392318728 403972508 399575597 380721075 351551738 316998193 281368137
58175B81368137l3636618k9826070k5207449k0459191j5910040j1661308p886907
$$ 281368137 247731519 217905449 192698000 172238809 156328769 144667461 136780554
58168A36780554n078774l889154m583389o633610q946373j0549188j1074706j0686849
$$ 136780554 131701780 127812626 123229237 116595627 107649254 97100066 86025360 75338511
58160G5338511r726418q493492p221182o067532n086984m262703l578383l032619
$$ 75338511 65612093 57118601 49897419 43829887 38742903 34480200 30901817 27869198
58152B7869198k604332k254206j960907j722396j525840j348791j187785j055972
$$ 27869198 25264866 23010660 21049753 19327357 17801517 16452726 15264941 14208969
58144A4208969r52972q62744p79814p12833o62133o16256n71075n32083m97532
$$ 14208969 13255997 12393253 11613439 10900606 10238473 9622217 9051142 8519059 8021527
58135H021527m58314m14884l76778l45160l12232k77516k48636k26229k03773
$$ 8021527 7563213 7148329 6771551 6426391 6114159 5836643 5588007 5361778 5158005
58126E158005j82502j71281j70892j72371j71415j71044j69992j62201j48879
$$ 5158005 4975503 4804222 4633330 4460959 4289544 4118500 3948508 3786307 3637428
58117C637428j38200j31835j23651j12521j04427j00699r5776q8185q2753q0363
$$ 3637428 3499228 3367393 3243742 3131221 3026794 2926095 2830319 2742134 2659381 2579018
58107B579018p6065o9039o4460o3655o1956n8021n6001n6757n5827n1988m9342
$$ 2579018 2502953 2433914 2369454 2305799 2243843 2185822 2129821 2073064 2017237 1965249 1915907
58096A915907m9162m7758m4138m1941m1999m0592l6658l3576l2283k9713k5432
$$ 1915907 1866745 1818987 1774849 1732908 1690909 1650317 1613659 1580083 1547800 1518087 1492655
58085A492655k2879k2720k1634j9011j8221k0016k1109k0490k0869k2806k3537
$$ 1492655 1469776 1447056 1425422 1406411 1388190 1368174 1347065 1326575 1305706 1282900 1259363
58074A259363k2605k2620k3590k2639k0020j9257k0516k0110j7399j5884j6472
$$ 1259363 1236758 1214138 1190548 1167909 1147889 1128632 1108116 1088006 1070607 1054723 1038251
58063A038251j5987j3537j2135j2626j2080r714q539r557j0002q851q561r808
$$ 1038251 1022264 1008727 996592 983966 971886 962172 953633 944076 934074 925223 916662 906854
58051I06854r961q376p766q892r084p602p116q339q455o573n567o697p468o588
$$ 906854 896893 888517 880751 871859 862775 855173 848057 839718 831263 824690 819123 812426 804958 798370
58037G98370o185p218p503o222n751p097q017p404p157p928p607n748n071o605
$$ 798370 792185 784967 777464 771242 765491 758394 750377 742973 735816 727888 720281 714533 709462 702857
58023G02857p718o838n902o178n957m347l275l693l700k335j380j595j141M87
$$ 702857 695139 688301 682399 676221 670264 665917 662642 658949 655249 652914 651534 649939 648798 649285
58009F49285R50n74j536m84M89j63q82n33o83k092k724j527o94j746k824k265
$$ 649285 650235 649661 648125 647641 648130 647967 647085 646552 645869 643777 641053 639526 638832 637086 634262 631997
57993F31997j466j774j713J18K320L236L504L953L662K179R97Q04l2k415m580
$$ 631997 630531 628757 627044 627162 629482 632718 636222 640175 643837 646016 647013 647817 647785 645370 640790
57978F40790n019m724m805m646m012m199n349n541m143l143l614l887k959k374
$$ 640790 635771 631047 626242 621596 617584 613385 608036 602495 598352 595209 591595 587708 584749 582375
57964E82375k928k738p57J050J201J237K449L193K028M80J28k79k090l859l972
$$ 582375 579447 576709 575952 577002 578203 579440 581889 585082 587110 587590 587718 587439 585349 581490 577518
57949E77518l647m559n762n716n208n504n679m489k995k760l174k966k572k672
$$ 577518 573871 569312 563550 557834 552626 547122 541443 536954 533959 531199 528025 525059 522487 519815
57935E19815k222k76J978L187L993N164N546M223K708K651L081K350R96L41l9
$$ 519815 517593 517317 519295 522482 526475 531639 537185 541408 544116 546767 549848 552198 553194 553535 553496
57920E53496j060j978j831j496k067k818k935l496n366o944o530n306n322o026
$$ 553496 552436 550458 548627 547131 545064 542246 539311 535815 530449 523505 516975 511669 506347 500321
57906E00321n577m247l709l972l798l352l839n055n627n262m772m388l841l419
$$ 500321 494744 490497 486788 482816 479018 475666 471827 466772 461145 455883 451111 446723 442882 439463
57892D39463l307k730j306j59j12l5J251K727K839K151K310L359M151M469M805
$$ 439463 436156 433426 432120 431961 431849 431814 433065 435792 438631 440782 443092 446451 450602 455071 459876
57877D59876M905M351L713L467K809J152m22r57j479l186n105n735n694o438p492
$$ 459876 464781 469132 472845 476312 479121 480273 479851 478894 477415 474229 469124 463389 457695 451257 443765
57862D43765p323o079n149m730m003l068k546j975o74N64O89O10J901M042N125
$$ 443765 436442 430363 425214 420484 416481 413413 410867 408892 408218 408782 409471 410081 411982 416024 421149
57847D21149M875M761N425O096O377O661O926O827O675O833O543M956K790J354
$$ 421149 426024 430785 436210 442306 448683 455344 462270 469097 475772 482605 489148 494104 496894 498248
57833D98248N30o50k077k965l548m569n681o066o031o275o261n223m093m333n369
$$ 498248 498778 498128 496051 493086 489538 484969 479288 473222 467191 460916 454655 449432 445339 441006 435637
57818D35637n337l989k831k567k387j729r02m7R39J531J283J057J980L514M127
$$ 435637 430300 426311 423480 420913 418526 416797 415895 415848 416787 418318 419601 420658 422638 426152 430279
57803D30279L409J839r00n307j0063j2802j2923j1897j0844r566p969o612n673
$$ 430279 433688 435527 434627 429320 419257 406455 393532 381635 370791 361225 353256 346644 340971
57790C40971m844m247m101l763k574j341j343k162k254j425q69r21o12L82J217
$$ 340971 336127 331880 327779 324016 321442 320101 318758 316596 314342 312917 312048 311127 310515 310897 312114
57775C12114J441J519J655J632J871L091M877O005O252O405O604O242N428M900
$$ 312114 313555 315074 316729 318361 320232 323323 328200 334205 340457 346862 353466 359708 365136 370036
57761C70036M510L411J801Q13N83R5r07j596j822k550m117n578o211o302o118
$$ 370036 374546 377957 379758 380571 381154 381249 380342 378746 376924 374374 370257 364679 358468 352166 346048
57746C46048n407m227l110k152j074k03k23r46j564j957k448k553j577l01k61
$$ 346048 340641 336414 333304 331152 330078 329875 329652 328706 327142 325185 322737 320184 318607 318306 318045
57731C18045j337j896j459j279j918k181j161L56J299J664J772J553J254J552
$$ 318045 316708 314812 313353 312074 310156 307975 306814 307170 308469 310133 311905 313458 314712 316264
57717C16264K293K296J051n06j429j749j610p01P10J466J048L84M19Q40R81J008
$$ 316264 318557 320853 321904 321398 319969 318220 316610 315909 316619 318085 319133 319517 319936 320776 321757 322765
57701C22765J406K022K396K560K829L219L529L684L750L892M279M620M067K279
$$ 322765 324171 326193 328589 331149 333978 337197 340726 344410 348160 352052 356331 360951 365018 367297
57687C67297L47k60M67J219J178P67P33J535L584O945J0814J4325J7811K2259
$$ 367297 367644 367384 367851 369070 370248 371015 371748 373283 376867 383812 394626 408951 426762 449021
57673D49021K7737L3639M0205M8389N8198O8817Q0426R3785J06895J13245J04830
$$ 449021 476758 510397 550602 598991 657189 726006 806432 900217 1007112 1120357 1225187
57662A225187P7459L4012j6073o0814r1463j06083j07992j01459q9741p5948o3042
$$ 1225187 1302646 1336658 1320585 1259771 1168308 1062225 954233 852774 763033 687085 624043
57651F24043n2162m2572l3895k7014k2381j9044j6060j3519j1510r425p089n290
$$ 624043 571881 529309 495414 468400 446019 426975 410915 397396 385886 376461 369372 364082
57639C64082m409l638k349j188r25j207j278j126j095j064p19p0P48J584J867
$$ 364082 359673 356035 353686 352498 351573 350366 349088 347962 346867 345803 345084 345014 345762 347346 349213
57624C49213J012n23j515j599j678k300k806k530j799j147n02J76M29J20j04J93
$$ 349213 350225 349702 348187 346588 344910 342610 339804 337274 335475 334328 333826 334002 334431 334551 334447 334640
57608C34640N43M41J67K09N43Q89J090R61M57J54P25J784K248J978J874K204K139
$$ 334640 335183 335624 335791 336000 336543 337432 338522 339483 339940 340094 340819 342603 344851 346829 348703 350907 353046
57591C53046J330N27J26n32j655k158j271J55R13J017J086J076O90K61K40L80
$$ 353046 354376 354903 355029 354497 352842 350684 349413 349568 350481 351498 352584 353660 354350 354611 354851 355231
57575C55231K72J23L01O61R46J238J481J221M56J7M49J199J504J378J189R83Q64
$$ 355231 355503 355626 355927 356588 357534 358772 360253 361474 361930 361947 362396 363595 365099 366477 367666 368649 369513
57558C69513J257K136K726K590K365K694L188L182K888K985L544M067M257M133
$$ 369513 370770 372906 375632 378222 380587 383281 386469 389651 392539 395524 399068 403135 407392 411525
57544D11525L748L269L045L188L377L255K771K133J820K463L941M895M141K401
$$ 411525 415273 418542 421587 424775 428152 431407 434178 436311 438131 440594 444535 449430 453571 455972
57530D55972J438J626J731J112N37N42O97R56J942L250L227J542J76O82K006K422
$$ 455972 457410 459036 460767 461879 462416 462958 463655 464611 466553 469803 473030 474572 474748 475430 477436 479858
57514D79858K192K597L574M109M199M632N257N178M381L770L619L280K437J654
$$ 479858 482050 484647 488221 492330 496529 501161 506418 511596 515977 519747 523366 526646 529083 530737
57500E30737J522J981K476K400J587O79O18J450K232K328K097J949J761J632K166
$$ 530737 532259 534240 536716 539116 540703 541382 542000 543450 545682 548010 550107 552056 553817 555449 557615
57485E57615L333M111L964L638L760L790L252K864L372M272M758M942N050M544
$$ 557615 560948 565059 569023 572661 576421 580211 583463 586327 589699 593971 598729 603671 608721 613265
57471F13265L245K362K936M181M681M511M708N373N803N892O000N894N292M930
$$ 613265 616510 618872 621808 625989 630670 635181 639889 645262 651065 656957 662957 668851 674143 679073
57457F79073N655O866P314P073P268Q067Q424P781O706N909N650O051O897P338
$$ 679073 684728 691594 698908 705981 713249 721316 729740 737521 744227 750136 755786 761837 768734 776072
57443G76072O757N779N459N848O295O662P106P102O094M794M566N562O668P111
$$ 776072 782829 788608 794067 799915 806210 812872 819978 827080 833174 837968 842534 848096 854764 861875
57429H61875P005O574N986N847O623P707Q135Q037Q223Q622Q425P669P295P620
$$ 861875 868880 875454 881440 887287 893910 901617 909752 917789 926012 934634 943059 950728 958023 965643
57415I65643P995Q083Q293Q804R182R178Q974Q651Q207Q031Q423Q834Q560P986
$$ 965643 973638 981721 990014 998818 1008000 1017178 1026152 1034803 1043010 1051041 1059464 1068298 1076858 1084844
57401A084844Q069Q771R087Q621P978P777Q208R378J0909J1533J0417Q740Q530
$$ 1084844 1092913 1101684 1110771 1119392 1127370 1135147 1143355 1152733 1163642 1175175 1185592 1194332 1202862
57388A202862R944J1171J1112J0579J0587J0963J1201J1366J1540J1448J1193
$$ 1202862 1212806 1223977 1235089 1245668 1256255 1267218 1278419 1289785 1301325 1312773 1323966
57377A323966J1358J1961J2214J1836J1589J2067J2747J2870J2485J2149J2143
$$ 1323966 1335324 1347285 1359499 1371335 1382924 1394991 1407738 1420608 1433093 1445242 1457385
57366A457385J2438J2922J3374J3555J3530J3532J3587J3723J4202J5013J5374
$$ 1457385 1469823 1482745 1496119 1509674 1523204 1536736 1550323 1564046 1578248 1593261 1608635
57355A608635J4701J3689J3561J4487J5662J6666J7564J8028J7602J6795J6596
$$ 1608635 1623336 1637025 1650586 1665073 1680735 1697401 1714965 1732993 1750595 1767390 1783986
57344A783986J6948J6987J6689J6884J7627J8027J7850J7833J8088J7774J6781
$$ 1783986 1800934 1817921 1834610 1851494 1869121 1887148 1904998 1922831 1940919 1958693 1975474
57333A975474J6247J6811J7716J8186J8408J8524J8041J7019J6605J7472J8675
$$ 1975474 1991721 2008532 2026248 2044434 2062842 2081366 2099407 2116426 2133031 2150503 2169178
57322B169178J9008J8509J7946J7648J7633J8046J8716J8967J8636J8482J9033
$$ 2169178 2188186 2206695 2224641 2242289 2259922 2277968 2296684 2315651 2334287 2352769 2371802
57311B371802J9755J9978J9845J9730J9505J9057J8856J9275K0019K0746K1583
$$ 2371802 2391557 2411535 2431380 2451110 2470615 2489672 2508528 2527803 2547822 2568568 2590151
57300B590151K2459K2704K2000K1090K0910K1515K2356K2950K2928K2150K1257
$$ 2590151 2612610 2635314 2657314 2678404 2699314 2720829 2743185 2766135 2789063 2811213 2832470
57289B832470K1294K2305K3060K2720K1904K1530K1494K1270K0979K0978K1009
$$ 2832470 2853764 2876069 2899129 2921849 2943753 2965283 2986777 3008047 3029026 3050004 3071013
57278C071013K0597J9853J9218J8836J8738J9079J9681J9904J9530J9222J9614
$$ 3071013 3091610 3111463 3130681 3149517 3168255 3187334 3207015 3226919 3246449 3265671 3285285
57267C285285K0497K1421K2350K3249K3704K3633K3628K4016K4257K3933K3608
$$ 3285285 3305782 3327203 3349553 3372802 3396506 3420139 3443767 3467783 3492040 3515973 3539581
57256C539581K4006K4857K5332K5072K4277K3192K2164K1624K1579K1603K1652
$$ 3539581 3563587 3588444 3613776 3638848 3663125 3686317 3708481 3730105 3751684 3773287 3794939
57245C794939K2091K2602K2130K0518J9118J8979J9418J9341J8982J9211J9903
$$ 3794939 3817030 3839632 3861762 3882280 3901398 3920377 3939795 3959136 3978118 3997329 4017232
57234D017232K0164J9686J8819J7886J7271J7607J8816J9631J9080J7871J7233
$$ 4017232 4037396 4057082 4075901 4093787 4111058 4128665 4147481 4167112 4186192 4204063 4221296
57223D221296J7040J6290J4904J3687J2902J2178J1602J1551J1585J0744R021
$$ 4221296 4238336 4254626 4269530 4283217 4296119 4308297 4319899 4331450 4343035 4353779 4362800
57212D362800P434O561N991N224M194K874J328J00l29m31j082k160k626k095j345
$$ 4362800 4370234 4376795 4382786 4388010 4392204 4395078 4396406 4396506 4396177 4395746 4394664 4392504 4389878 4387783 4386438
57197D386438j197j741k720l807m384m009l294l484m813o095o310n869n915o869
$$ 4386438 4385241 4383500 4380780 4376973 4372589 4368580 4365286 4361802 4356989 4350894 4344584 4338715 4332800 4325931
57183D325931q145q979r245r573j0699j2510j3947j4172j3599j3320j3774j4563
$$ 4325931 4317786 4308807 4299562 4289989 4279290 4266780 4252833 4238661 4225062 4211742 4197968 4183405
57171D183405j5293j5865j6064j5678j5033j4687j4560j4021j2872j1619j0693
$$ 4183405 4168112 4152247 4136183 4120505 4105472 4090785 4076225 4062204 4049332 4037713 4027020
57160D027020j0019r489r183q989q618q093p834q078q724r714j1134j2876j4702
$$ 4027020 4017001 4007512 3998329 3989340 3980722 3972629 3964795 3956717 3947993 3938279 3927145 3914269 3899567
57147C899567j6719j9263k2306k5422k8436l1590l4979l8287m1085m3117m4185
$$ 3899567 3882848 3863585 3841279 3815857 3787421 3755831 3720852 3682565 3641480 3598363 3554178
57136C554178m4182m3195m1273l8191l3807k8452k2678j6893j1749q453p983j0029
$$ 3554178 3509996 3466801 3425528 3387337 3353530 3325078 3302400 3285507 3273758 3265305 3257322 3247293
57124C247293j3340j6953k0583k4059k7096k9426l0473k9138k4718j7943j0403
$$ 3247293 3233953 3217000 3196417 3172358 3145262 3115836 3085363 3056225 3031507 3013564 3003161
57113C003161l054L976J0528J6439K2346K9409L8163M8683O1868P9342J01878
$$ 3003161 3000107 3004083 3014611 3031050 3053396 3082805 3120968 3169651 3231519 3310861 3412739
57102C412739J29008J60606J97880K42630K96675L62405M42614N39005O51538
$$ 3412739 3541747 3702353 3900233 4142863 4439538 4801943 5244557 5783562 6435100
57093F435100P79317R20723J071970J226788J378358J520419J646103J747669
$$ 6435100 7214417 8135140 9207110 10433898 11812256 13332675 14978778 16726447
57085A6726447J818709J854765J850618J800611J706410J582790J448302J305504
$$ 16726447 18545156 20399921 22250539 24051150 25757560 27340350 28788652 30094156
57077C0094156J132718Q99338N90071K14885j99684o23006j025313j378725j661048
$$ 30094156 31226874 32126212 32716283 32931168 32731484 32108478 31083165 29704440 28043392
57068B8043392j860429j975557k012359j981966j900150j784778j651305j510362
$$ 28043392 26182963 24207406 22195047 20213081 18312931 16528153 14876848 13366486
57060A3366486j368626j230129j096401r67458q44304p30018o27825n38979m63155
$$ 13366486 11997860 10767731 9671330 8703872 7859568 7129550 6501725 5962746 5499591
57051E499591l99809l47940l05342k69641k39953k16414j98297j83796j71680
$$ 5499591 5099782 4751842 4446500 4176859 3936906 3720492 3522195 3338399 3166719
57042C166719j61876j54091j46891j38885j30177j22040j15357j09724j03841
$$ 3166719 3004843 2850752 2703861 2564976 2434799 2312759 2197402 2087678 1983837
57033A983837r6594q7933p8862p0530o3348n7014n1073m5151l8840l1803k3848
$$ 1983837 1887243 1799310 1720448 1649918 1586570 1529556 1478483 1433332 1394492 1362689 1338841
57022A338841j4679l928Q306K1436L5376N1092O9993R3431J22491J55202J81382
$$ 1338841 1324162 1320234 1328540 1349976 1385352 1436444 1506437 1599868 1722359 1877561 2058943
57011B058943J82571J43104O4928k9732j12498j66089j89233j89456j75146j53308
$$ 2058943 2241514 2384618 2449546 2419814 2307316 2141227 1951994 1762538 1587392 1434084
57001A434084j29796j08450r0464p5599o3685n4563m7595m1989l7323l3279k9345
$$ 1434084 1304288 1195838 1105374 1029775 966090 911527 863932 821943 784620 751341 721996
56990G21996k5247k1371j8237j5759j3425j0937q293n452k448O1Q73p45m288q437
$$ 721996 696749 675378 657141 641382 627957 617020 608727 603275 600827 600888 601761 601016 596728 588291
56976E88291j2109j4883j6623j7199j6743j5802j4887j3957j2632j0809q766o670
$$ 588291 576182 561299 544676 527477 510734 494932 480045 466088 453456 442647 433881 427211
56964D27211m347j669J060L326M982O443Q312J0824J3524J5386J5333J2776P869
$$ 427211 422864 421195 422255 425581 430563 437006 445318 456142 469666 485052 500385 513161 521030
56951E21030J357n682j2046j6583j8574j8203j6542j4750j3099j1057q357n538
$$ 521030 522387 516705 504659 488076 469502 451299 434757 420007 406908 395851 387494 381956
56939C81956l139q54J860M766P239R487J2316J5701J8621K0529K1723K1807J9037
$$ 381956 378817 377963 379823 384589 391828 401315 413631 429332 447953 468482 490205 512012 531049
56926E31049J2312K991o273j3879j9489k2799k3535k2372k0569j8591j6159j3497
$$ 531049 543361 546352 540079 526200 506711 483912 460377 438005 417436 398845 382686 369189
56914C69189j1384j0015q900p943p474p147o032m156k796k701l007k530j245J40
$$ 369189 357805 347790 338890 330947 323473 316326 310294 306138 303342 300641 297634 295104 293859 293999
56900B93999J276K148K628K803L276M421N717O483O960Q013R889J1914J3385J4359
$$ 293999 295275 297423 300051 302854 306130 310551 316268 322751 329711 337724 347613 359527 372912 387271
56886C87271J5448J7033J8674J9157J7180J2219M904l200j0197j4677j6475j6592
$$ 387271 402719 419752 438426 457583 474763 486982 491886 488686 478489 463812 447337 430745
56874D30745j6046j4917j2796r749o275k591J285M960Q049J1107J5266K0780K6745
$$ 430745 414699 399782 386986 377237 370962 368371 369656 374616 382665 393772 409038 429818 456563
56861D56563L2467L8237M4329M9765N2453N0145M1343K6247P331j1433k6480l5900
$$ 456563 489030 527267 571596 621361 673814 723959 765302 791549 798880 787447 760967 725067
56849G25067l9346l7709l2868k6835k0591j4211p900k085L539R912J7278K4918
$$ 725067 685721 648012 615144 588309 567718 553507 545607 543522 547061 556973 574251 599169
56837E99169L2510M0653M9681N9039O8224P6849Q2744Q1270O8232M3551J1709
$$ 599169 631679 672332 722013 781052 849276 926125 1008869 1090139 1158371 1201922 1213631
56826A213631k0844m8282o6919p5961p7097p2742o4725n4616m4168l4486k5461
$$ 1213631 1192787 1144505 1077586 1001625 924528 851786 787061 732445 688277 653791 628330
56815F28330j6787q926k181M363J1772J9742K7251L4316M1793M9484N5385N6649
$$ 628330 611543 602617 600436 604799 616571 636313 663564 697880 739673 789157 844542 901191
56803I01191N0596L5615J2767j3307l6479n2822o1938o5052o3172n7301m9155
$$ 901191 951787 987402 1000169 986862 950383 897561 835623 770571 707399 650098 600943
56792F00943m0653l2884k6007j9792j4070q843m125L95N246J0470J5422J9650
$$ 600943 560290 527406 501399 481607 467537 458694 454569 454964 460210 470680 486102 505752
56780E05752K3496K6958K8427K5580J7630N977p213k0097l0853l7657l9813l8455
$$ 505752 529248 556206 584633 610213 627843 633820 626607 606510 575657 538000 498187 459732
56768D59732l5511l2150k8503k4454k0333j6855j4577j3376j2577j1669j0695
$$ 459732 424221 392071 363568 339114 318781 301926 287349 273973 261396 249727 239032
56757B39032r736q394o360m246l183l518m448m952m651l762k728k028j960k319
$$ 239032 229296 220902 214542 210296 207113 203595 199147 194195 189544 185782 183054 181026 179066 176747
56743A76747k588k462k055j692j620j845k047j862j425j317j708j918j264L8J163
$$ 176747 174159 171697 169642 167950 166330 164485 162438 160576 159151 157834 156126 154208 152944 152982 154145
56728A54145J577J223K69q02j222o66L09J059J659K362K764K348J449Q31O02L99
$$ 154145 155722 156945 157214 156412 155190 154524 154833 155892 157551 159913 162677 165025 166474 167305 167907 168306
56712A68306K91N36P04J58p06q71l49k32r58j650j477p13p7M8n14j688k585k040
$$ 168306 168597 169133 169837 169995 169289 168418 168069 167837 166879 165229 163752 163039 162962 163010 162496 160808 158223 156183
56694A56183j80J430J717J288J107J001L65m53o03r1K74J34j06r1Q7L34O93R25
$$ 156183 156003 157433 159150 160438 161545 162546 162911 162458 161855 161764 162038 162172 162066 161975 162062 162396 163089 164014
56676A64014O13j63o64l23N05R36N71k7pP73J568J604Q73m8o98r64q38m07n6j99
$$ 164014 164627 164464 163800 163477 163982 164918 165489 165462 165455 166228 167796 169400 170273 170225 169527 168563 167725 167318 167262 167063
56656A67063p21r77n53K63Q37Q34M82K79M30N20rj013j626j370q19p32r62q00
$$ 167063 166342 165365 164812 165075 165912 166746 167228 167507 167937 168457 168448 167435 165809 164439 163620 162888 161926 161126
56638A61126j00O48J116J306J125N58J46M80J283J749J732J728J706J069o3o08
$$ 161126 161026 161674 162790 164096 165221 165779 165925 166405 167688 169437 171169 172897 174603 175672 175609 175001
56622A75001j18M28Q1n51k03J120K052J651N15n9M11J255J615J402J128J030Q44
$$ 175001 174883 175311 175392 174841 174638 175758 177810 179461 179976 179917 180328 181583 183198 184600 185728 186758 187602
56605A87602N05M27P60R51O08K19K92L64j93q46n57M64R41N04J30M33Q45R13J117
$$ 187602 188107 188534 189294 190245 190853 191072 191364 191728 191535 190689 190132 190596 191537 192041 192171 192604 193449 194362 195479
56586A95479J728K026J471P26O36R45Q80M20J06O5J07L56R60J496J453J144J356
$$ 195479 197207 199233 200704 201430 202066 203011 203891 204311 204417 204482 204589 204945 205905 207401 208854 209998 211354
56569B11354K201K952L032K640K343K496L112L985M803N384N855O549P626Q731
$$ 211354 213555 216507 219539 222179 224522 227018 230130 234115 238918 244302 250157 256706 264332 273063
56555B73063R021P860N671L836L371L925M439M462M232L811L003K020J365R81
$$ 273063 282084 289944 295615 299451 302822 306747 311186 315648 319880 323691 326694 328714 330079 331060
56541C31060K88q92k151l187l916l991l204k373k688l990m904m807m531m702m773
$$ 331060 331348 330456 328305 325118 321202 317211 314007 311634 308946 304956 300052 295245 290714 286012 281239
56526B81239m340m106m655n297n081m187l356k793k393k348k618k501j659r65
$$ 281239 276899 272793 268138 262841 257760 253573 250217 247424 245031 242683 240065 237564 235905 234940
56512B34940j360k414k943k636k163k001k031k047j949j588r88n02l34k25M3L39
$$ 234940 233580 231166 228223 225587 223424 221423 219392 217345 215396 213808 212820 212318 211984 211759 211802 212141
56496B12141O76J279J840J527K97p10p40m64o45p74j04Q33R55L49PK31M23K26
$$ 212141 212817 214096 215936 217463 217760 217050 216310 215846 215201 214427 214323 215156 216111 216460 216467 216698 217121 217347
56478B17347j31l89m22m1N96Q19L82J7L72J037J473K029K986L412K339N64k24
$$ 217347 217216 216827 216405 216364 216960 217779 218161 218178 218550 219587 221060 223089 226075 229487 231826 232390 232166
56461B32166K61Q43Q66P85Q57O88K36J06N95J306J762J690Q84l08q02q2O85J44
$$ 232166 232427 233270 234136 234921 235778 236466 236702 236808 237403 238709 240471 242161 243045 242737 241935 241853 242538 242682
56443B42682j085j228o3Q47P05M38P47Q73Q4r95j395j110n75K42J375K195K040
$$ 242682 241597 240369 240306 241153 241858 242296 243043 243916 244000 243005 241610 240500 239925 240167 241542 243737 245777
56426B45777J098J24l61l05j1l0o62j376j277k71Q04J292J277J012N92L92R15
$$ 245777 246875 246999 246638 246333 246322 246292 245630 244254 242977 242706 243510 244802 246079 247091 247683 248075 248990
56409B48990J880K248J534M82J6J81M49M95L14Lk58l78n83j017j165l70J019J761
$$ 248990 250870 253118 254652 255134 255150 255331 255780 256275 256589 256592 256334 255956 255373 254356 253191 252821 253840 255601
56391B55601J253K31l11k15J18M38O79P50P03P19P56N87L27L89P67Q90M10k95
$$ 255601 256854 257085 256774 256559 256677 257115 257794 258544 259247 259966 260722 261309 261636 262025 262792 263682 264092 263797
56373B63797n94k66M80J255J741J874J866J780J413Q87Q98J711K381J809L46n95
$$ 263797 263203 262937 263417 264672 266413 268287 270153 271933 273346 274233 275131 276842 279223 281032 281378 280783
56357B80783m01K75Q08J277J698J634R35Q8n27j041j490j491q31J75J072J616
$$ 280783 280382 280657 281465 282742 284440 286074 287009 287097 286570 285529 284039 282548 281717 281892 282964 284580
56341B84580J606R93J72k82k21J90R77K113L036L149K667K312K286K331K462K790
$$ 284580 286186 287179 287351 287069 286848 287038 288015 290128 293164 296313 298980 301292 303578 305909 308371 311161
56325C11161K871K213J254Q45J027J267J581K176K406J506J86q3O80J020M55Q8
$$ 311161 314032 316245 317499 318344 319371 320638 322219 324395 326801 328307 328493 328410 329090 330110 330565 330653
56309C30653N04Q01L19k82k79J02O37J600K718L043K575K611L698M602M281L360
$$ 330653 331157 331958 332277 331995 331716 331818 332455 334055 336773 339816 342391 345002 348700 353302 357583 360943
56293C60943K725K004P70r8L59J451J818J392J158J522K120K756L410L736L558
$$ 360943 363668 365672 366442 366344 366703 368154 369972 371364 372522 374044 376164 378920 382330 386066 389624
56278C89624L406L680L753K857J502J014J949L720N489O702P045O682O285O297
$$ 389624 393030 396710 400463 403320 404822 405836 407785 411505 416994 423696 430741 437423 443708 450005
56264D50005O354N941N301N145N713O556O961O388M951L744M070N934P859Q603
$$ 450005 456359 462300 467601 472746 478459 485015 491976 498364 503315 507059 511129 517063 524922 533525
56250E33525Q462Q552R466J1084J3123J5269J7158J8680K0033K1290K2330K3146
$$ 533525 541987 550539 560005 571089 584212 599481 616639 635319 655352 676642 698972 722118
56238G22118K3704K3562K2363K0646J9185J7700J5200J1625P858M125j75m845
$$ 722118 745822 769384 791747 812393 831578 849278 864478 876103 883961 888086 887911 883066
56226H83066q654j1186j3435j5988j8091j9153j9711k0141j9851j8637j7472j6953
$$ 883066 874412 863226 849791 833803 815712 796559 776848 756707 736856 718219 700747 683794
56214F83794j6308j4865j3213j1893j0346q257o702o604p143o984o130n385m882
$$ 683794 667486 652621 639408 627515 617169 608912 602210 595606 588463 581479 575349 569964 565082
56201E65082m382m052l891l206j753m68o0J09P16J158P70K37N06J219J565J823
$$ 565082 560700 556648 552757 549551 547798 547330 547270 547379 548095 549253 550023 550260 550766 551985 553550 555373
56185E55373K617L448L375K633K261K603L244L855M238M127L769L963M760N097
$$ 555373 557990 561438 564813 567446 569707 572310 575554 579409 583647 587774 591543 595506 600266 605363
56171F05363M389L424K832K089R83N98J568K737K917K721L208M016M356M658N608
$$ 605363 609752 613176 616008 618097 619080 619678 621246 623983 626900 629621 632829 636845 641201 645859 651467
56156F51467O648P095P590Q853J0093J0350J0340J1188J2392J2818J2704J2997
$$ 651467 658115 665210 672800 681653 691746 702096 712436 723624 736016 748834 761538 774535
56144G74535J3696J4614J6594K0020K3250K4601K4978K6467K9269L2247L5603
$$ 774535 788231 802845 819439 839459 862709 887310 912288 938755 968024 1000271 1035874
56133A035874M0557M7005N3893O1583P1483Q3524R5971J07559J17786J25203J27429
$$ 1035874 1076431 1123436 1177329 1238912 1310395 1393919 1489890 1597449 1715235 1840438 1967867
56122A967867J23028J12282R6551P8430O1810M9919M3255M0230L8822L6350K9479
$$ 1967867 2090895 2203177 2299728 2378158 2439968 2489887 2533142 2573372 2612194 2648544 2678023
56111B678023J6933J588j2106k2012k8235l1050l1599l3488m0542n3069o8446
$$ 2678023 2694956 2696544 2684438 2662426 2634191 2603141 2571542 2538054 2497512 2444443 2375997
56100B375997q4387r9241j10065j13805j10465j02698r2397q0032o6780n4637
$$ 2375997 2291610 2192369 2082304 1968499 1858034 1755336 1662939 1582907 1516127 1461490
56090A461490m4286l5194k7554k1994j7733j3358r114o177m227k076n3Q05J327
$$ 1461490 1417204 1382010 1354456 1332462 1314729 1301371 1292257 1286080 1281853 1279777 1279724 1280529 1281856
56077A281856L234O071P886Q572R741J1552J2568J2623J3121J4438J5623J6523
$$ 1281856 1285090 1291161 1299047 1307619 1317360 1328912 1341480 1354103 1367224 1381662 1397285 1413808
56065A413808J7826J9221J9973K0841K2924K5161K5635K4732K4303K4406K3759
$$ 1413808 1431634 1450855 1470828 1491669 1514593 1539754 1565389 1590121 1614424 1638830 1662589
56054A662589K2541K1805K0941J8970J7343J8025J9802K0056J9318K0110K2227
$$ 1662589 1685130 1706935 1727876 1746846 1764189 1782214 1802016 1822072 1841390 1861500 1883727
56043A883727K3409K3972K6228K9745L1737L2028L3055L5011L5660L5052L5733
$$ 1883727 1907136 1931108 1957336 1987081 2018818 2050846 2083901 2118912 2154572 2189624 2225357
56032B225357L7914L9190L9355M0873M4041M6403M7514M9615N2943N5143N6003
$$ 2225357 2263271 2302461 2341816 2382689 2426730 2473133 2520647 2570262 2623205 2678348 2734351
56021B734351N7951O1214O3242O3700O5186O8270P0740P2512P6173Q1820Q6439
$$ 2734351 2792302 2853516 2916758 2980458 3045644 3113914 3184654 3257166 3333339 3415159 3501598
56010C501598Q9249R2642R7207J01073J04703J10716J18352J23959J27539J32721
$$ 3501598 3590847 3683489 3780696 3881769 3986472 4097188 4215540 4339499 4467038 4599759
56000D599759J39783J45320J49583J57048J68465J79402J88192J98176K10594
$$ 4599759 4739542 4884862 5034445 5191493 5359958 5539360 5727552 5925728 6136322
55991F136322K22536K33611K47143K63166K77853K91487L08976L30902L52619
$$ 6136322 6358858 6592469 6839612 7102778 7380631 7672118 7981094 8311996 8664615
55982H664615L73806L99856M31965M65461N00024N41394N90593O42171O95794
$$ 8664615 9038421 9438277 9870242 10335703 10835727 11377121 11967714 12609885 13305679
55973A3305679P58448Q32450R13118J001366J105991J230466J371100J531817
$$ 13305679 14064127 14896577 15809695 16811061 17917052 19147518 20518618 22050435
55965B2050435J726269J962010K238827K566926K969590L464121M059995M780401
$$ 22050435 23776704 25738714 27977541 30544467 33514057 36978178 41038173 45818574
55957D5818574N662959O733442Q003257R497761J1257177J3303750J5644879J8317592
$$ 45818574 51481533 58214975 66218232 75715993 86973170 100276920 115921799 134239391
55949A34239391K1386183K4879038K8744187L2767676L6278717L7797492L5254454
$$ 134239391 155625574 180504612 209248799 242016475 278295192 316092684 351347138
55942C51347138K7132342J3820098k104169j7091057k8358637l4830311l6916744
$$ 351347138 378479480 392299578 390195409 373104352 344745715 309915404 272998660
55935B72998660l5769340l2667771k8695229k4597372k0781445j7424640j4585261
$$ 272998660 237229320 204561549 175866320 151268948 130487503 113062863 98477602
55928I8477602j2247691j0344113q795724p539752o517877n667110m939591m314849
$$ 98477602 86229911 75885798 67090074 59550322 53032445 47365335 42425744 38110895
55920C8110895l780724l317507k909526k554936k252261j989989j758216j557609
$$ 38110895 34330171 31012664 28103138 25548202 23295941 21305952 19547736 17990127
55912A7990127j388213j241133j109246r95050r00340q18371p43209o77025o21463
$$ 17990127 16601914 15360781 14251535 13256485 12356145 11537774 10794565 10117540 9496077
55903I496077n71177n22383m78850m43082m10003l75506l43209l16747k93012
$$ 9496077 8924900 8402517 7923667 7480585 7070582 6695076 6351867 6035120 5742108
55894E742108k68834k46954k29542k12734j93482j75308j61601j49192j34129
$$ 5742108 5473274 5226320 4996778 4784044 4590562 4415254 4253653 4104461 3970332
55885C970332j18102j03871q9606p2965n5789l9795k2421j666J9375L7158N2238
$$ 3970332 3852230 3748359 3658753 3585788 3529999 3490204 3467783 3466117 3485492 3522650 3574888
55874C574888O4702O9606O1884M2349J4833j8931n7584r6936j32399j61765j82652
$$ 3574888 3639590 3709196 3771080 3813429 3828262 3809331 3751747 3654811 3522412 3360647 3177995
55863C177995j91161j86633j74364j60222j45611j30303j16142j04553r3992q3303
$$ 3177995 2986834 2800201 2625837 2465615 2320004 2189701 2073559 1969006 1875014 1791711
55853A791711p4320o8117o2256n4928m8354m4761m2450l9204l6260l5297l4680
$$ 1791711 1717391 1649274 1587018 1532090 1483736 1438975 1396525 1357321 1321061 1285764 1251084
55842A251084l2267k9142k7130k5362k2541k0019j9247j8853j7342j6112j6708
$$ 1251084 1218817 1189675 1162545 1137183 1114642 1094623 1075376 1056523 1039181 1023069 1006361
55831A006361j7693j7392j7018j7876j8267j6500j4356j4043j4227j2808j1165
$$ 1006361 988668 971276 954258 936382 918115 901615 887259 873216 858989 846181 835016
55820H35016j1712j3360j3402j2270j2377j3541j3478j1933j0716j0192r047p101
$$ 835016 823304 809944 796542 784272 771895 758354 744876 732943 722227 712035 702988 695887
55808F95887n423m140k567j008r9Q64K821M980O119O792Q119R502R670Q929Q192
$$ 695887 690464 686324 683757 682749 682650 683514 686335 691315 697434 704226 712345 721847 731517 740446 748638
55793G48638O893M095O00k248m817q096j1383j3328j4230j5080j5260j3562j0827
$$ 748638 755531 759626 760226 757978 753161 745065 733682 720354 706124 691044 675784 662222 651395
55780F51395r393j0310j2853j6072j9052k0428j9427j6875j3903j0499o597l219
$$ 651395 642002 631692 618839 602767 583715 563287 543860 526985 513082 502583 495986 492767
55768D92767j022R41L335M793L866J382r72l091n558p661q417q423q630q459p096
$$ 492767 491745 492686 496021 500814 504680 506062 505090 501999 496441 488780 480363 471940 463310 454851 447755
55753D47755n583n406o052o089n629n642n825n378n014n887p243p360o204n133
$$ 447755 442172 436766 430714 424625 418996 413354 407529 402151 397137 391250 384007 376647 370443 365310
55739C65310m506l644k590k019j805j492j535k410l218k908k109j974k124j647
$$ 365310 360804 357160 354570 352551 350746 349254 347719 345309 342091 339183 337074 335100 332976 331329
55725C31329j214k119l895n013n267n506n658n121m487m754n246m469k574j019
$$ 331329 330115 327996 324101 319088 313821 308315 302657 297536 293049 288295 283049 278580 276006 274987
55711B74987j96O48J550J970K334L406M475M188K917K138J770L64k154m156m905
$$ 274987 274791 275439 276989 278959 281293 284699 289174 293362 296279 298417 300187 300551 298397 294241 289336
55696B89336n477o657p680p597o479m988l781l422l783l729k506r74l54l59N9
$$ 289336 283859 277202 269522 261925 255446 250458 246677 243255 239472 235743 233237 232263 231909 231550 231609
55681B31609Q01J030R31J337K067K326K247K353K031L44k010l394l572l567l565
$$ 231609 232410 233440 234371 235708 237775 240101 242348 244701 246732 247076 245066 241672 238100 234533 230968
55666B30968k947k049j922k397k308j520r45o24L08J761K689K951L458M435N225
$$ 230968 228021 225972 224050 221653 219345 217825 216880 216256 216564 218325 221014 223965 227423 231858 237083
55651B37083N781O646P495P437O685O162N577L818J150r37k127l500n258o385
$$ 237083 242864 249510 257005 264442 271127 277289 282866 286684 287834 286897 284770 281270 276012 269627
55637B69627o799p669r106r606q493p044o360n872m721l197k013j339j215j707
$$ 269627 262828 255159 246053 236447 227954 220910 214550 208678 203957 200760 198747 197408 196193 194486
55623A94486k293k193j597j335j339q73k07l49r64n43R80J738P17p95j356j283
$$ 194486 192193 190000 188403 187068 185729 184856 184649 184300 183336 182793 183773 185511 186228 185433 184077 182794
55607A82794j436j648j459j185j266j443j469j687k235k519k094j255m26K15K58
$$ 182794 181358 179710 178251 177066 175800 174357 172888 171201 168966 166447 164353 163098 162672 162887 163145
55592A63145o76j993k526k095j562j201l41J081K064K067J703J511J308J114J412
$$ 163145 162469 160476 157950 155855 154293 153092 152751 153832 155896 157963 159666 161177 162485 163599 165011
55577A65011K005K045J585J746K852L769L777L632M108M857N444O170P006O947
$$ 165011 167016 169061 170646 172392 175244 179013 182790 186422 190530 195387 200831 207001 214007 220954
55563B20954N368L041R97o77k192l275l766m082m468m550m212m007m224m464m546
$$ 220954 226322 229363 230360 229683 227491 224216 220450 216368 211900 207350 203138 199131 194907 190443 185897
55548A85897m770m941m333l099k473k959l499l097k109j258o06j73l51r18p89
$$ 185897 181127 176186 171853 168754 166281 163322 159823 156726 154617 153359 152753 152580 152229 151311 150522
55533A50522L18J164P62j40l56N5L05J88j41q11j693j966j188j38J91j60n89q43
$$ 150522 150840 152004 152766 152626 152270 152325 152630 152818 152677 151866 150173 148207 147019 146881 147072 146912 146323 145480
55515A45480q27k52P02J171P21pl96p60j468k038j883j211m92K21P80O71m0l92
$$ 145480 144653 144401 145103 146274 146995 146988 146592 145832 144364 142326 140443 139232 138740 138961 139741 140412 140372 139980
55497A39980P3N28K60j67l4K32Ok65M2L54k23j215j326m11L59J70o09j227j315
$$ 139980 140053 140581 140841 140674 140640 140872 140878 140613 140655 141009 140786 139571 138245 137834 138193 138363 137754 136527 135212
55478A35212r19m14l36p33r11l11O24J037P97M91M75N01J92m80j105j119m00L68
$$ 135212 134293 133879 133543 132810 131899 131588 132212 133249 134046 134537 135012 135513 135705 135225 134120 133001 132601 132969
55460A32969M25o6k43J96P31R71J012P58j6q15p72j49k78j524k544k221j099j61
$$ 132969 133394 133328 133085 133281 134012 134983 135995 136753 136737 135922 135150 135001 134723 133199 130655 128434 127335 127174
55442A27174O14J481J867J210J58k07J86O29P22N10P3k99k21N8k16r40r56J18
$$ 127174 127788 129269 131136 132346 132504 132297 132483 133112 133834 134344 134417 134118 133897 133955 133739 132799 131843 131961
55424A31961J042Q21K55M87J143J214Q77R99J488J624J522J850K406K314J517
$$ 131961 133003 133824 134079 134566 135709 136923 137800 138799 140287 141911 143433 145283 147689 150003 151520
55409A51520Q37O10L82j17o25r53j161j138p53l84n91j370k208k706k747k342
$$ 151520 152357 152967 153349 153232 152607 151654 150493 149355 148602 148218 147627 146257 144049 141343 138596 136254
55393A36254j732j312j038m66L22N63K4m63k62J26R7K7M66R90Q81K43m55j190
$$ 136254 134522 133210 132172 131706 132028 132591 132615 132152 131890 132016 132113 132140 132606 133596 134477 134720 134265 133075
55375A33075j891j843p47L25J94o79q62P5J281J897J661O65m82p86j5P24M90j02
$$ 133075 131184 129341 128594 128919 129113 128434 127572 127647 128928 130825 132486 133151 132669 131883 131868 132592 133082 132980
55357A32980j9M45L37j87k51M3j93r62j284p38J15P85J235J287P33k1l82m57o14
$$ 132980 132961 133406 133743 133556 133305 133348 133155 132193 130909 130171 130286 131071 132306 133593 134326 134305 133923 133466 132852
55338A32852n49J05O40J04j047j440q74m27n69n46N4N87N71N31J013J691J939
$$ 132852 132303 132408 133048 133152 132105 130665 129791 129364 128795 128249 128303 128890 129461 129992 131005 132696 134635
55321A34635J607R25J36n01q19r38j014r76q93j187j866k089j248m1M94N32R26
$$ 134635 136242 137167 137303 136802 135983 135045 134031 133055 132162 130975 129109 127020 125772 125731 126225 126757 127683
55304A27683J571J502N24n07r16p23m3R39J509J027Qm21l8M78Q25J237J537J243
$$ 127683 129254 130756 131280 130773 129857 129134 129091 130030 131539 132566 132574 132153 132115 132593 133418 134655 136192 137435
55286A37435O14M21P11Q95R26J123J066Q9j140j172r6L45n78j434q62M29Q67J92
$$ 137435 138049 138470 139181 140076 141002 142125 143191 143280 142140 140968 140872 141217 140639 139205 138343 138772 139639 139831
55268A39831n80o93k62K35M42L23J17l3l22p27o41K53J152J100M63L02N98M19
$$ 139831 139251 138558 138296 138531 138973 139296 139413 139380 139058 138331 137690 137943 139095 140195 140658 140960 141558 141977
55250A41977l26p82p56q78j087o09L00L35o41j097k90N18J81n24m61p0l65j026
$$ 141977 141651 140869 140113 139235 138148 137539 137839 138174 137533 136436 136146 136664 136845 136321 135860 135790 135425 134399
55232A34399j005l23Q5n9j96k4J56M7l69r49j237o51O98J829K059J755J491J099
$$ 134399 133394 133071 133156 133097 132901 132877 133033 133080 132711 131762 130525 129874 130572 132401 134460 136215 137706 138805
55214A38805L63r1N08J750K330J575R3j038j267p96k06J64M75R88J470J470J057
$$ 138805 139168 139077 139585 141335 143665 145240 145333 144295 143028 142232 142026 142190 142665 143653 145123 146593 147650
55197A47650P29N92K81k27m79l72l93p89j160j075m98M96J631K123J395J39l54
$$ 147650 148379 148971 149252 149025 148546 148174 147781 146992 145832 144757 144259 144755 146386 148509 149904 150043 149689
55180A49689l4o1p70j105n53r6m50p75k13M90J98p22r90k75P93J848K833L276
$$ 149689 149655 149594 148824 147719 147166 147070 146620 145845 145632 146122 146320 145598 144608 144333 145126 146974 149807 153083
55162A53083K655J335J86m62o71j88J091K277K176Q20o05j260j325j245j090q39
$$ 153083 155738 157073 157259 156797 156126 155938 157029 159306 161482 162302 161697 160437 159112 157867 156777 155938
55146A55938o54o96r29j140j014m42J11J2o17q95m28R9m2o38j119j412j582j308
$$ 155938 155284 154588 153659 152519 151505 151063 151174 151186 150569 149674 149246 149345 149303 148665 147546 146134 144552 143244
55128A43244m80K71M01K80M30N72K37j82k1M73N46J91k3m1k34m26m3P43J114P83
$$ 143244 142764 143035 143436 143716 144146 144718 144955 144773 144752 145225 145771 145962 145939 145898 145664 145238 145195 145938 147052 147835
55108A47835K70o7l49n30k93K11L91J56J18O18J233J450J320J162J145J286J478
$$ 147835 148105 148038 147689 147159 146866 147077 147468 147624 147742 148360 149593 151043 152363 153525 154670 155956 157434
55091A57434J402Q43J15k22p5K28N11P64O91or26j321j207j329j859j965j107
$$ 157434 158836 159679 159794 159572 159497 159725 160236 161000 161691 161685 160759 159438 158231 156902 155043 153078 151971
55074A51971j1K98j39m23q6M92Q28Q88Q03N57J28l00m61k79O7L40L73J29l00o67
$$ 151971 151960 152258 152119 151696 151610 152102 152930 153818 154621 155178 155306 155006 154545 154266 154333 154673 155046 155175 154875 154208
55054A54208p12m08n9m4m39r31j123q55k96J33O0m30p45m04L53Q38P33L93L27
$$ 154208 153496 153088 153029 152985 152546 151615 150492 149637 149341 149474 149534 149104 148359 147955 148308 149146 149879 150272 150599
55035A50599O49J087J240Q22k7p37q36m68o6K77P00R54N60l94j171j256q01j78
$$ 150599 151248 152335 153575 154397 154370 153633 152797 152329 152263 152540 153240 154194 154754 154360 153189 151933 151132 150954
55017A50954L96O74M79O5r0jj08m89p77q81j055j138o17K97O20l1p53n94L36J404
$$ 150954 151350 152024 152503 152568 152478 152477 152369 151880 151103 150222 149167 148029 147412 147709 148329 148298 147545 146951 147287 148691
54997A48691K255K645K278J397Q50R64J120R62J053J645J750N02j288k057j410
$$ 148691 150946 153591 155869 157266 158116 159080 160200 161162 162215 163860 165610 166112 164824 162767 161357
54982A61357j81R27J703J873J285M65P3j0k85o30n88k71j36j15J15L41K42K70
$$ 161357 161176 162103 163806 165679 166964 167429 167502 167492 167207 166577 165989 165718 165582 165467 165582 165923 166165 166435
54964A66435R98J825J515N3j194j334q90n82k02P23J835K254J677P79M25O77O71
$$ 166435 167433 169258 170773 170826 169632 168298 167408 166826 166624 167347 169182 171436 173113 173892 174317 174994 175665
54947A75665k68j472j532k17J017R35R8k82j11J9L22J387K645K800J733O57L03
$$ 175665 175397 173925 172393 172176 173193 174128 174226 173944 173833 173852 174174 175561 178206 181006 182739 183396 183699
54930A83699L10N38J535L199M327M223L741M071N276O693P990R145R986J0436
$$ 183699 184009 184547 186082 189281 193608 197831 201572 205643 210919 217612 225602 234747 244733 255169
54916B55169J0722J0809J0021P785M397O73k778n659p784r220j0218j0706j0261
$$ 255169 265891 276700 286721 294506 298903 299576 296798 291139 283355 274135 263917 253211 242950
54903B42950q920p503o621n814m317k383j200j447k470l098k874k248j727j270
$$ 242950 234030 226527 219906 214092 209775 207392 206192 204745 202275 199177 196303 194055 192328 191058
54889A91058o19J15N94R41J684K857L695L599L020K965L938N728P839R642J0536
$$ 191058 190439 190554 191148 192089 193773 196630 200325 203924 206944 209909 213847 219575 227414 237056 247592
54874B47592J0560J0489J0643J0043P551L547m06l462n993q294r846j0198r727
$$ 247592 258152 268641 279284 289327 296878 300425 300019 296557 290564 282270 272424 262226 252499
54861B52499r050q336p489o554n589m625l846l463l296k937k425k213k460k805
$$ 252499 243449 235113 227624 221070 215481 210856 207010 203547 200251 197314 194889 192676 190216 187411
54847A87411k919k755k347j807j495j610j714j289o18l80m99l04K46M63J82QJ40
$$ 187411 184492 181737 179390 177583 176088 174478 172764 171475 170857 170477 169978 169674 169920 170383 170565 170573 170713
54830A70713L0m11m03L29P81J02j061j521j216r44r10n97J20O97Q34Q91J126J114
$$ 170713 170743 170332 169929 170258 171039 171141 170080 168559 167343 166399 165489 164892 165012 165709 166543 167434 168560 169674
54812A69674L44q51j351m16J391K669K685K037J644J469P96m59j444j450o86J46
$$ 169674 170018 169167 167816 167400 168791 171460 174145 176182 177826 179295 180091 179632 178188 176738 176052 176198
54796A76198N53M31N4j3O04J486J768J166K30l82m35%O88J161J135R58J171J639
$$ 176198 176751 177182 177236 177223 177827 179313 181081 182247 182477 182095 181660 181660 182348 183509 184644 185602 186773 188412
54778A88412J806J692J818K160K084J546J424K358M006N738P291Q465R029R342
$$ 188412 190218 191910 193728 195888 197972 199518 200942 203300 207306 213044 220335 228800 237829 247171
54764B47171J0200J1623J2508J1968J0291Q128N566K546n29l343o113q876j0912
$$ 247171 257371 268994 281502 293470 303761 311889 317455 320001 319472 316129 310016 301140 290228
54751B90228j1632j1449j1029j0244q626o529m871l964l311k487j599r66p80j016
$$ 290228 278596 267147 256118 245874 237248 230719 225848 221884 218573 216086 214487 213521 212741 211725
54737B11725j314j129l58M06N54J63k00j25M15J181J810K179K739M023N754P059
$$ 211725 210411 209282 208924 209330 209884 210047 209847 209722 210137 211318 213128 215307 218046 222069 227823 234882
54721B34882P686Q278R178R743R328Q090O352L904O07k909n911q311j0215j1278
$$ 234882 242568 250846 260024 269767 279095 287185 293537 297441 298048 295139 289228 280917 270702 259424
54707B59424j1208j0323r007p208n123l608l162l075k502j743j562j806j796j586
$$ 259424 248216 237893 228886 221678 216555 212947 209785 206710 204208 202465 200903 199097 197301 195715
54693A95715j718k055j980j525j276j270j055o97o68q01m24M07Q19M32j26k11
$$ 195715 193997 191942 189962 188437 187161 185891 184836 184139 183471 182670 182246 182653 183472 183904 183778 183567
54677A83567J55O70J016O80o09k070k374j304j04J40l29o91p46q15r61r03m43
$$ 183567 183722 184392 185408 186088 185479 183409 181035 179731 179627 179767 179438 178747 178001 177186 176225 175322 174879
54660A74879L57J193J566J146K76k72j91P5Q6oJ78O03Q54O47J60o7L58J158J517
$$ 174879 175236 176429 177995 179141 179417 179145 178954 179029 179115 179109 179287 179890 180744 181391 181551 181484 181842 183000 184517
54641A84517J011J15n09q95j339j502q08L83R10L80l07k46K94M57l8p14r52m52
$$ 184517 185528 185643 185134 184239 182900 181398 180590 180973 181883 182263 181956 181710 182004 182461 182423 181709 180757 180305
54623A80305N49J242Q83k72j026o36L02P13M40K63P15J410J620J133M01m6k11
$$ 180305 180854 182096 182979 182707 181681 181045 181347 182060 182500 182763 183478 184888 186508 187641 188042 187996 187785
54606A87785n17j108j483j128l36O6k36p32q85p16m09R4P32J091R38O51O23N70
$$ 187785 187268 186160 184677 183549 183213 183279 183043 182311 181426 180710 180301 180395 181127 182218 183156 183807 184430 185000
54588A85000M4n80m73L59Q66M29j81R4J049J506J023M38N09Q19N40k23o05k03
$$ 185000 185044 184464 183991 184350 185216 185645 185464 185558 186607 188113 189136 189574 190083 190902 191442 191219 190614 190411
54570A90411N31J054J258J159O96J3n34q07r35q19j77P86J357J212P82L73l45
$$ 190411 190942 191996 193254 194413 195109 195122 194588 193781 192846 192027 191850 192636 193993 195205 195987 196360 196015
54553A96015j507k341k027q31L08R58J320J455J174N56o9o26j177j430r60J25
$$ 196015 194508 192167 190140 189309 189617 190575 191895 193350 194524 195080 195011 194385 193208 191778 190818 190943
54537A90943J302K265K977L156K449J162J48j40J5K83P23J320J672J467R65P25
$$ 190943 192245 194510 197487 200643 203092 204254 204402 204262 204277 204560 205283 206603 208275 209742 210707 211432
54521B11432R84J352J093j38j640k083j002M70R11L37j57j75m65j401k135j797
$$ 211432 212416 213768 214861 214723 213083 211000 209998 210468 211379 211716 211559 211384 210919 209518 207383 205586
54505B05586p83j83l78p72p33k53K46M12K84K09L84M75J4q20j202o34L82R47Q05
$$ 205586 204803 204620 204242 203470 202737 202484 202730 203142 203426 203635 204019 204494 204508 203688 202486 201852 202234 203181 203986
54486B03986M73M70P18P88N72M94Q92J381J223L94k33n6M24M20P9J94R66J821
$$ 203986 204459 204929 205647 206435 207007 207501 208393 209774 210997 211391 211158 211102 211526 211946 212025 212219 213185 215006
54468B15006K346K641K767K545K070J724J538J094L00m39q92j278j662j654j074
$$ 215006 217352 219993 222760 225305 227375 229099 230637 231731 232031 231592 230700 229422 227760 226106 225032
54453B25032l04K62O56R69J068R23P07L39m85j540k013j657j282j550j897j398
$$ 225032 224728 224990 225646 226615 227683 228606 229313 229652 229167 227627 225614 223957 222675 221125 219228 217830
54437B17830k71L78N4n89p44l13K72N95M65m0n82q26p44n33l40j81n9J02M35Q90
$$ 217830 217559 217937 217991 217402 216658 216345 216617 217212 217677 217637 217055 216229 215485 214952 214612 214431 214372 214474 214909 215799
54417B15799J180J148J023R52O06l60j539j997j335k03M61M41K54L09L95P3n90
$$ 215799 216979 218127 219150 220102 220708 220348 218809 216812 215477 215274 215735 216176 216430 216739 217134 217207 216617
54400B16617r90p36j61J47R9J39N76J218J654J646J171M99J54N02J234J632J407
$$ 216617 215627 214891 214730 214877 214976 215115 215691 216909 218563 220209 221380 221879 222033 222535 223769 225401 226808
54383B26808Q95L50l45j100j324p67j20k00p84r39l66K88M88M60N87P07M73L5
$$ 226808 227703 228053 227708 226608 225284 224517 224397 224197 223413 222474 222108 222396 222884 223344 223931 224638 225111 225146
54365B25146j72o1Q6K00M42P09N99J05j25L18Q96Q17K08r3J11O0p68j799k220
$$ 225146 224974 224913 224999 225199 225641 226350 226949 227054 226929 227247 228143 228960 229168 229075 229186 229246 228478 226679 224459
54346B24459k064j847j626j015k0Q37J071N44n98j820k253j505l32J06l72r12
$$ 224459 222395 220548 218922 217907 217887 218724 219795 220339 219741 217921 215668 214163 213831 213937 213565 212653
54330B12653q41l83j02k76q57j504j597p84M19J117J136J084J220J047K04q85
$$ 212653 211812 211429 211327 211051 210194 208690 207093 206309 206728 207845 208981 210065 211285 212332 212536 211651
54314B11651j585j663j116NJ247J868J669J217R42N74o9m43jQ62J251Q64J41m65
$$ 211651 210066 208403 207287 207292 208539 210407 212076 213293 214235 214809 214740 214297 214296 215158 216409 217273 217414 216949
54296B16949q02q07n02j66k01p59j632k388k533j854p40J19N09Q21J309J694J697
$$ 216949 216147 215340 214838 214672 214471 213712 212080 209692 207159 205305 204565 204684 205193 206014 207323 209017 210714
54279B10714J490J263Q52J73l75m00r2N1k10q55j775k500k308j079K29N56o3p39
$$ 210714 212204 213467 214319 214492 214117 213717 213625 213676 213466 212611 210836 208336 206028 204949 205178 205734 205671 204932
54261B04932r32q53q18p82n19O5Q64J562J831J696J460J173N31m44j153j219j058
$$ 204932 204000 203147 202329 201547 201028 201093 201957 203519 205350 207046 208506 209679 210210 209766 208613 207394 206336
54244B06336j129j141o62q7j14n44m64L62J167J320J046P47L63j97n27k58K78
$$ 206336 205207 204066 203404 203317 203203 202659 202195 202557 203724 205044 206090 206837 207200 207003 206476 206218 206496
54227B06496L97N1l3N98J335J138p1j082q14K86Q42L93o0M84J718K609K638J936
$$ 206496 206893 206944 206911 207509 208844 209982 209911 208829 208015 208301 209143 209536 209476 209960 211678 214287 216925 218861
54209B18861P31o50j548j558j211j419k280k955k712j650l79N22P55M01j60o58
$$ 218861 219592 218942 217394 215836 214625 213206 210926 207971 205259 203609 203230 203752 204507 204908 204748 204090
54193B04090j085j355j078j32R44J569J793J904J734J028J72l10o62j431k231
$$ 204090 203005 201650 200572 200440 201384 202953 204746 206650 208384 209412 209584 209274 208612 207181 204950
54178B04950k010o96M95O23R5k74l20k03J77P63R33K75o50j004p91o73r39j300
$$ 204950 202940 202244 202739 203362 203457 203183 202863 202660 202837 203600 204533 204808 204158 203154 202363 201690 200751 199451
54160A99451j536j653j479p64J75N22qo74n44L54J099R55R8p29j012p87l50J06
$$ 199451 197915 196262 194783 194019 194194 194716 194708 194034 193490 193844 194943 195898 195996 195267 194255 193468 193118 193224
54142A93224M96P32P50O42N75N85N30L10P9R8L99O52N07M3k67j61Rk25p03p47
$$ 193224 193720 194452 195202 195844 196419 197004 197534 197844 197923 198021 198420 199072 199579 199622 199355 199194 199203 198978 198275 197528
54122A97528j12N88O72K73J00M83J045J274J067P10N23O09Q74J178J478J767J896
$$ 197528 197416 198004 198676 198949 199049 199532 200577 201851 202918 203628 204151 204760 205634 206812 208290 210057 211953
54105B11953J678J199P85N53K51l16r21j209j098p66m12k82n75j105j282p05L33
$$ 211953 213631 214830 215615 216168 216419 216103 215182 213973 212875 212109 211697 211415 210840 209735 208453 207748 208081
54088B08081J202J518J232M31n76j293j511j527j573j309l89Q47J705J983J944
$$ 208081 209283 210801 212033 212464 211888 210595 209084 207557 205984 204675 204286 205133 206838 208821 210765
54073B10765J693J186P16O89R12P98L29J23M54P69N39L8j36J23M06L54n6n36o40
$$ 210765 212458 213644 214360 215049 215961 216759 217088 217211 217665 218434 218973 219011 218875 218998 219404 219758 219702 219166 218526
54054B18526j61M37L55n83j577j781j285q09o22l26L46J057J416J574J830J948
$$ 218526 218365 218802 219157 218574 216997 215216 213931 213122 212500 212174 212520 213577 214993 216567 218397 220345
54038B20345J415M48P9Q71K090K658K572K685L260L714L812M099M766M950L894
$$ 220345 221760 222208 222287 223158 225248 227906 230478 233163 236423 240137 243949 248048 252814 257764 261658
54023B61658K208J179J246J767K025J772J030J21l36j0O08P95N02J93K8j27k19
$$ 261658 263866 265045 266291 268058 270083 271855 272885 273006 272670 272660 273268 274063 274565 274758 274786 274659 274440
54006B74440k06n46j690l185m036l938l403k805k129j624j695k010j687o66k2
$$ 274440 274234 273688 271998 268813 264777 260839 257436 254631 252502 250878 249183 247173 245486 244820 244798
53991B44798m53j256j351p19j59j28l89n90o39o17o58q29j036j150j188j187r66
$$ 244798 244345 243089 241738 241019 240860 240732 240343 239753 239114 238497 237839 237010 235974 234824 233636 232449 231483
53974B31483m18M2j28q35j465j659j441p21N22J550J423L70k76Q8N46K67j55K94
$$ 231483 231065 231107 230979 230144 228679 227020 225579 224858 225380 226930 228353 228723 228447 228535 229081 229348 229193 229487
53956B29487J378J999J777J310J110J019P34K39k64m52n6P67J400J485J375J537
$$ 229487 230865 232864 234641 235951 237061 238080 238814 239053 238789 238337 238281 239048 240448 241933 243308 244845
53940B44845J817J820J657J755K129K446K639K891L090K934K558K570L209L943
$$ 244845 246662 248482 250139 251894 254023 256469 259108 261999 265089 268023 270581 273151 276360 280303
53926B80303M017L230K042J162R93J294J376Q06j61r06j044n12O38K156L418L813
$$ 280303 284320 287550 289592 290754 291747 293041 294417 295223 295062 294156 293112 292600 293238 295394 298812 302625
53910C02625L362K729K512K733L051L219L253L257L142K644J619L23p04j103r61
$$ 302625 305987 308716 311228 313961 317012 320231 323484 326741 329883 332527 334146 334469 333765 332662 331701
53895C31701o08l46l30m85n68m75n35j215k446l572m006l782l371l240l576m172
$$ 331701 331093 330747 330417 329932 329364 328889 328354 327139 324693 321121 317115 313333 309962 306722 303146 298974
53879B98974m532m378m010l830l669l061k111j356p93J01J162J307Q0j406j848
$$ 298974 294442 290064 286054 282224 278555 275494 273383 272027 271234 271335 272497 273804 273884 272478 270630
53864B70630j435j257j611j849j702j687k052k237j688o79J0p9p39j328j241m10
$$ 270630 269195 267938 266327 264478 262776 261089 259037 256800 255112 254433 254443 254364 253625 252297 251056 250646
53848B50646N61R57O49J34j04lJ98K79K04J18J71K82K34O5J07M59O91L32m70j077
$$ 250646 251207 252164 252813 252947 252843 252840 253038 253317 253521 253639 253810 254092 254326 254391 254498 254957 255648 255980 255510 254433
53828B54433j017l41N06J070J197J106J029Q14K29m24m44L24J202J550J451J311
$$ 254433 253416 253075 253581 254651 255848 256954 257983 258797 259026 258602 258158 258482 259684 261234 262685 263996
53812B63996J298J476J939K428K373J838J742K634L844M608N347O965R291J1364
$$ 263996 265294 266770 268709 271137 273510 275348 277090 279724 283568 288176 293523 300488 309779 321143
53798C21143J2984J4884J7418K0169K3043K6625L0951L4546L5160L1187K2406
$$ 321143 334127 349011 366429 386598 409641 436266 467217 501763 536923 568110 590516
53787E90516J0084l312j5053k3359k7748k8493k6367k2819j9572j7509j6256j5046
$$ 590516 600600 597288 582235 558876 531128 502635 476268 453449 433877 416368 400112 385066
53775C85066j3544j1754r698p578n834m750m253m221m578m985m906m244l571l372
$$ 385066 371522 359768 350070 342492 336658 331908 327655 323434 318856 313871 308965 304721 301150 297778
53761B97778l493l495l260k902k471k095k093k567l031k841j938q98l15l17n85
$$ 297778 294285 290790 287530 284628 282157 280062 277969 275402 272371 269530 267592 266694 266379 266062 265477
53746B65477o58k71M44J067J271J062O50K01k75q08j246j232n48L85P50L36r7
$$ 265477 264819 264548 264992 266059 267330 268392 269042 269243 268968 268160 266914 265682 265134 265519 266269 266605 266508
53729B66508J88Q27R15L76J1K62P19J081J655K464K687J712L12j00P69J778J738
$$ 266508 266696 267523 268438 268814 268825 269087 269806 270887 272542 275006 277693 279405 279717 279617 280386 282164 283902
53712B83902O42o04j129o75L95J388J760J577J353J421J522J246P67Q35J842L170
$$ 283902 284544 283940 282811 282136 282531 283919 285679 287256 288609 290030 291552 292798 293565 294400 296242 299412
53696B99412L788L471L008L103L467L371K662J788J023L12k61m02j35J67L24M95
$$ 299412 303200 306671 309679 312782 316249 319620 322282 324070 325093 325405 325144 324742 324607 324774 325098 325593
53680C25593O35M33m8k39Q6L61Q4l76l49O5J75k42p19r27j082j337j345q10j32
$$ 325593 326228 326661 326613 326374 326460 326821 326905 326529 326180 326245 326420 326178 325459 324532 323450 322113 320768 319958 319826
53661C19826jm20o78l85r4m85j215j242l06N54L21o39j171r01n21n76p62n93j25
$$ 319826 319825 319405 318727 318342 318248 317763 316548 315306 315000 315554 315875 315236 314065 313164 312643 312067 311305 310712 310587
53642C10587L90R86J648J938J418L30o15r33o20J37J077J834K164K139J945J588
$$ 310587 310977 311963 313611 315549 316967 317297 316682 315749 315129 315266 316343 318177 320341 322480 324425 326013
53626C26013J103Q64J287K210K977L187L038K874K737K549K418K465K543K472
$$ 326013 327116 327980 329267 331477 334454 337641 340679 343553 346290 348839 351257 353722 356265 358737
53612C58737K480L048M140M951M735L734K913K841L145L207K975K788K777K863
$$ 358737 361217 364265 368405 373356 378091 381825 384738 387579 390724 393931 396906 399694 402471 405334
53598D05334L135L723M382M672M623M732N223N740O026O405P329Q724J0198J1704
$$ 405334 408469 412192 416574 421246 425869 430601 435824 441564 447590 453995 461324 470048 480246 491950
53584D91950J3580J5962J8223J8970J6619J0541J943o565j2789j6237j7629j7583
$$ 491950 505530 521492 539715 558685 575304 585845 587788 581223 568434 552197 534568 516985
53572E16985j6321j4370j2631j1516j0570r293p943p120o836o445n569m626m258
$$ 516985 500664 486294 473663 462147 451577 442284 434341 427221 420385 413940 408371 403745 399487
53559C99487m373m108k772p36Q91J382J029N67K66k3j87K51J265J923J384J03
$$ 399487 395114 391006 388234 387498 388389 389771 390800 391367 391633 391610 391423 391674 392939 394862 396246 396349
53543C96349n57N0J166J771J889K276L189M110M615M915N376N952O374O585O751
$$ 396349 395792 395842 397008 398779 400668 402944 406133 410243 414858 419773 425149 431101 437475 444060 450811
53528D50811P079P768Q896J0134J0904J1046J1128J1760J2834J3782J4385J4915
$$ 450811 457890 465658 474554 484688 495592 506638 517766 529526 542360 556142 570527 585442
53516E85442J5553J6173J6732J7557J9026K1074K3098K4324K4398K3804K3590
$$ 585442 600995 617168 633900 651457 670483 691557 714655 738979 763377 787181 810771
53505H10771K4362K5658K6448K6172K5040K3538K2060K0986K0614K0808K1053
$$ 810771 835133 860791 887239 913411 938451 961989 984049 1005035 1025649 1046457 1067510
53494A067510K1054K1054K1394K1946K2201K1908K1422K1324K1649K1736K1009
$$ 1067510 1088564 1109618 1131012 1152958 1175159 1197067 1218489 1239813 1261462 1283198 1304207
53483A304207J9800J8973J8640J7898J6106J3917J2452J1833J1233J0137Q822
$$ 1304207 1324007 1342980 1361620 1379518 1395624 1409541 1421993 1433826 1445059 1455196 1464018
53472A464018P613O405N071L705K242L57k073m819p752j0907j3966j6212j7362
$$ 1464018 1471631 1478036 1483107 1486812 1489054 1489411 1487338 1482519 1474767 1463860 1449894 1433682 1416320
53459A416320j7992j8824j9915k0860k1507k2092k2881k3905k4923k5499k5328
$$ 1416320 1398328 1379504 1359589 1338729 1317222 1295130 1272249 1248344 1223421 1197922 1172594
53448A172594k4574k3683k2840k1930k1031k0443k0128j9581j8497j7160j5905
$$ 1172594 1148020 1124337 1101497 1079567 1058536 1038093 1017965 998384 979887 962727 946822
53437I46822j4617j3028j1179r336p743o600n913n164l601j146J451L572N392
$$ 946822 932205 919177 907998 898662 890919 884319 878406 873242 869641 868495 869946 873518 878910
53424H78910P239Q962J0410J1995J4125J6439J8282J9627K0938K2347K3662K4999
$$ 878910 886149 895111 905521 917516 931641 948080 966362 985989 1006927 1029274 1052936 1077935
53412A077935K6698K8636L0301L1623L3071L4817L6400L7439L8221L9307M0914
$$ 1077935 1104633 1133269 1163570 1195193 1228264 1263081 1299481 1336920 1375141 1414448 1455362
53401A455362M2951M5273M7659M9793N1639N3622N6150N8942O1090O1931O1724
$$ 1455362 1498313 1543586 1591245 1641038 1692677 1746299 1802449 1861391 1922481 1984412 2046136
53390B046136O1347O1353O1497O1308O0841O0535O0426N9914N8377N5734N2239
$$ 2046136 2107483 2168836 2230333 2291641 2352482 2413017 2473443 2533357 2591734 2647468 2699707
53379B699707M8125M3626L8966L4054K8493K2188J5665R580M127p78n165r208
$$ 2699707 2747832 2791458 2830424 2864478 2892971 2915159 2930824 2940404 2944531 2943753 2938588 2929380
53367B929380j3436j8226k3317k8220l2883l7521m2087m6421n0752n5359n9857
$$ 2929380 2915944 2897718 2874401 2846181 2813298 2775777 2733690 2687269 2636517 2581158 2521301
53356B521301o3427o5763o7207o7893o7383o5397o2473n9595n7418n5924n4607
$$ 2521301 2457874 2392111 2324904 2257011 2189628 2124231 2061758 2002163 1944745 1888821 1834214
53345A834214n2924n0843m8977m7905m7449m7012m6494m6369m6729m6900m6250
$$ 1834214 1781290 1730447 1681470 1633565 1586116 1539104 1492610 1446241 1399512 1352612 1306362
53334A306362m4883m3198m1136l8280l4560l0579k7202k4839k3002k0657j7340
$$ 1306362 1261479 1218281 1177145 1138865 1104305 1073726 1046524 1021685 998683 978026 960686
53323I60686j3862j1410r983q410o048l749k580k237j482J85K128L738N168O700
$$ 960686 946824 935414 925431 917021 910973 907224 904644 902407 900925 901110 903238 906976 912144 918844
53309I18844Q086Q942R429J0082J1115J2236J3093J3736J4640J6316J8851K1730
$$ 918844 926930 935872 945301 955383 966498 978734 991827 1005563 1020203 1036519 1055370 1077100
53297A077100K4207K5955K7271K8603L0016L1165L1725L1759L1710L2018L2569
$$ 1077100 1101307 1127262 1154533 1183136 1213152 1244317 1276042 1307801 1339511 1371529 1404098
53286A404098L2530L1000K8037K4823K2451K0751J8679J5800J2810J0442Q446
$$ 1404098 1436628 1467628 1495665 1520488 1542939 1563690 1582369 1598169 1610979 1621421 1629867
53275A629867O059L113J38k465m723o632q015r052j0444j2663j5363j7881k0072
$$ 1629867 1635926 1639039 1639177 1636712 1631989 1625357 1617342 1608290 1597846 1585183 1569820 1551939 1531867
53262A531867k2239k4408k6166k7353k8499l0289l2798l5442l7610l9024l9555
$$ 1531867 1509628 1485220 1459054 1431701 1403202 1372913 1340115 1304673 1267063 1228039 1188484
53251A188484l9124l8022l7027l6732l6779l6159l4437l2285l0596k9449k8260
$$ 1188484 1149360 1111338 1074311 1037579 1000800 964641 930204 897919 867323 837874 809614
53240H09614k6761k5346k4594k4664k5142k5212k4206k2317k0571j9740j9420
$$ 809614 782853 757507 732913 708249 683107 657895 633689 611372 590801 571061 551641
53229E51641j8604j6915j4764j2565j0520r074q676q899q629p454o187n640n557
$$ 551641 533037 516122 501358 488793 478273 469199 460523 451624 442995 435541 429354 423714 418157
53216D18157n261m748m516m718n042n175m922m186l241k703k791k917k537k012
$$ 418157 412896 408148 403632 398914 393872 388697 383775 379589 376348 373645 370854 367937 365400 363388
53202C63388k079k714l159k997k642k702l310m041m228l467k119j194j393k365
$$ 363388 361309 358595 355436 352439 349797 347095 343785 339744 335516 332049 329930 328736 327343 324978
53188C24978l222l512l384l010k420j784j414j456j818k320k704k665k174j580
$$ 324978 321756 318244 314860 311850 309430 307646 306232 304776 302958 300638 297934 295269 293095 291515
53174B91515j191r84q46p50m86K23J068J208N09kM99J395J560Q70n0r48j705j602
$$ 291515 290324 289340 288494 287744 287258 287481 288549 289757 290266 290264 290763 292158 293718 294588 294538 293590 291885 290283
53156B90283j94J411J585M76k42N3J99n10j080n73K56K78k07j47M83P89M18j37
$$ 290283 290089 291500 293085 293561 293319 293372 293571 293061 291981 291408 291664 291942 291735 291588 292071 292860 293278 293141
53138B93141m35m04J1P03J121Q54L03J66M41O29O61Q68J173J091N51P7R0N24J189
$$ 293141 292706 292302 292313 293016 294137 294991 295294 295460 295901 296530 297191 298059 299232 300323 300874 300951 301041 301565 302754
53119C02754J927K359K079J238N18L62O31J029J442J703J519Q94L07K00M49N41
$$ 302754 304681 307040 309119 310357 310875 311237 311868 312897 314339 316042 317561 318455 318762 318962 319411 319952
53103C19952J33o78j464j775j511j068r81j259j385j022m70l06p06j447k308l114
$$ 319952 320085 319407 317943 316168 314657 313589 312608 311349 309964 308942 308472 308166 307460 306013 303705 300591
53087C00591l417k661r48O53J004J30p79o79K94J198J371Q75J14o22j196j541
$$ 300591 297174 294513 293565 294218 295222 295352 294573 293894 294188 295386 296757 297632 297746 297124 295928 294387
53071B94387j664j668j692j880k254k551k374j676r41n95m92k82n3j41m47n83
$$ 294387 292723 291055 289363 287483 285229 282678 280304 278628 277687 277092 276600 276318 276265 276124 275677 275094
53055B75094o29j131k126k816k532j551o19q5P8j59p38j151q09J52Q84P12k09
$$ 275094 274465 273334 271208 268392 265860 264309 263690 263605 263683 263524 262786 261635 260826 260978 261862 262574 262365
53038B62365j165j582j426j033o68k98J67M92K93l23o70k29O77J200R25J81m36
$$ 262365 261200 259618 258192 257159 256491 256193 256360 256852 257145 256822 256152 255923 256600 257800 258725 258906 258470
53021B58470o28m52q4L80Q57J175J121P68N87R62J607J765J098R8n08m64O8R03
$$ 258470 257842 257390 257306 257686 258543 259718 260839 261607 262194 263156 264763 266528 267626 267724 267216 266752 266820 267723
53003B67723J821K402K285J623R55O25N21M03K01n9m16q97j319j411j164r09q93
$$ 267723 269544 271946 274231 275854 276809 277434 277955 278358 278559 278500 278084 277187 275868 274457 273293 272384 271491
52986B71491q93m97J83M65m6q61j187q99n13l82l70k78j62q6J0K03O07J381K316
$$ 271491 270598 270101 270284 270749 270703 269842 268655 267756 267243 266861 266491 266213 266051 265965 265975 266178 266785 268166 270482
52967B70482K655J948R86R89J874K284J620R56J293J919J489J3j389k220k862
$$ 270482 273137 275085 276071 277060 278934 281218 282838 283794 285087 287006 288495 288508 287119 284899 282037
52952B82037l315l006k015j309j352j459j060o97j039j674j738j260r83j083j014
$$ 282037 278722 275716 273701 272392 271040 269581 268521 267824 266785 265111 263373 262113 261130 260047 259033
52937B59033o01l50m32k26O53J543J586R02K59j52p61j609k066j765j112n56j4
$$ 259033 258432 258082 257650 257424 258077 259620 261206 262108 262367 262215 261454 259845 257779 256014 254902 254346 254332
52920B54332O75J220J341J289J364J335R17M29L97O76P28N22M91O31M50k11r81
$$ 254332 255007 256227 257568 258857 260221 261556 262473 262902 263299 263975 264703 265225 265716 266347 266797 266586 265605
52903B65605j620k136k208j316K87J466J429N31l17m91K68J763L040L043K003
$$ 265605 263985 261849 259641 258325 258612 260078 261507 262038 261721 261230 261498 263261 266301 269344 271347
52888B71347J442K172L102K714J047o79j825k654l248l212k482j610j045p40n56
$$ 271347 272789 274961 278063 280777 281824 281145 279320 276666 273418 270206 267724 266114 265069 264329 263773
52873B63773n10n84p10r71j375j502r20O8O20L39l22p44p96o81n20k22L59J226
$$ 263773 263263 262679 261969 260998 259623 258121 257201 257269 257889 258228 257906 257162 256366 255685 255165 254943 255302 256528
52855B56528K060K319J735O49k71o00l07L61R76J131Q31M95L50J47l13p08o47
$$ 256528 258588 260907 262642 263291 263020 262420 262113 262474 263450 264581 265412 265907 266257 266404 266091 265383 264736
52838B64736k25K70P91J291J433J087O72N02K07m92q74m5J653L011L593L922M058
$$ 264736 264511 264781 265572 266863 268296 269383 270055 270557 270764 270272 269398 269353 271006 274017 277610 281532 285590
52821B85590L270J444k62q34o45o77j117j401j144l64Q61K362L698M637N651P428
$$ 285590 288860 290304 290042 289208 288563 287886 286769 285368 284224 283860 284721 287083 290781 295418 301069 308497
52805C08497R777J1344J0558O843J137m607q624j0390j0618j0219r496q372o989
$$ 308497 318274 329618 340176 347019 348156 343549 334925 324535 313917 303698 294202 285830 278841
52792B78841n737m743l761k611j611j283j658k027j701r16o34j242j911j598l37
$$ 278841 273104 268361 264600 261989 260378 259095 257437 255410 253709 252793 252159 250917 249006 247408 247071
52777B47071R19J483J382Q32K1o07n27J68P84R01P26M57p9q75j380j171n08J06
$$ 247071 247990 249473 250855 251687 251708 251101 250574 250742 251526 252427 253153 253610 253531 252656 251276 250105 249597 249703
52759B49703O32J280J893K032J530O48k22p59p67l44J07K49J30K1J09M43R49J343
$$ 249703 250335 251615 253508 255540 257070 257718 257496 256737 255970 255626 255733 255982 256112 256133 256242 256685 257634 258977
52741B58977J301R66Q91J281J542J083K29j54J56M45J23m48m54L08J204J555J395
$$ 258977 260278 261244 262135 263416 264958 266041 266270 266116 266272 266717 266840 266392 265938 266246 267450 269005 270400
52724B70400J310J581J740J130j98j445j987k017k063k190k071j667j308j096
$$ 270400 271710 273291 275031 276161 275963 274518 272531 270514 268451 266261 264190 262523 261215 260119
52710B60119p04q5J56m86j544k007j592r58o14k84L04N98jr63j062o2R01Q20P
$$ 260119 259415 259330 259486 259000 257456 255449 253857 252899 252285 252001 252305 252903 252902 251939 250877 250815 251716 252536 252543
52691B52543n58m76OO45J321J788J911J945K084J942J094n5n61j13O12Q98P76
$$ 252543 251985 251509 251515 252160 253481 255269 257180 259125 261209 263151 264245 264190 263629 263516 264128 265026 265802
52674B65802P18R20J149J109P91M99N13P12O66K26k87o17q92j143r64j25Q72J413
$$ 265802 266520 267440 268589 269698 270489 270988 271501 272213 272879 273105 272818 272201 271309 270166 269202 269077 269949 271362
52656B71362J634J983K240J801Q65L95Q48J679K297K687K856K375J027o74k011
$$ 271362 272996 274979 277219 279020 279885 280280 281128 282807 285104 287791 290647 293022 294049 293375 291364
52641B91364k812l301l504l169k118n52Q80J458J140Q37J457K765L811M336N011
$$ 291364 288552 285251 281747 278578 276460 275908 276788 278246 279386 280223 281680 284445 288256 292592 297603
52626B97603O208P348P693O964M964J575k401n292o198n984n935o051n514m315
$$ 297603 303811 311159 318852 325816 330780 332355 329954 324662 318464 312480 306545 300494 294980 290665
52612B90665l353l077k949k407j652j199j131j071o74rM64L34k65p40o79k11L36
$$ 290665 287312 284235 281286 278879 277227 276028 274897 273826 273152 273143 273607 273941 273676 272936 272257 272046 272382
52595B72382P87R60O21o0l50K32J244J798J597J037M79o6o07r62j027r29p74m48
$$ 272382 273169 274129 274750 274690 274340 274572 275816 277614 279211 280248 280727 280661 280054 279092 278065 277136 276362 275914
52577B75914J86R98J564J511R49L79J72J99K30L72P11Q15K41n54o30n4m1j209
$$ 275914 276100 277098 278662 280173 281122 281501 281673 281872 282102 282474 283185 284000 284241 283687 283057 283003 282962 281753
52559B81753k476k458j261j61J62J66M30R13J302J454J269O69j22n77l48L83J069
$$ 281753 279277 276819 275558 275397 275559 275725 276155 277068 278370 279824 281093 281762 281640 281063 280715 281098 282167
52542B82167J269R85N72L60L11K38J45R0j87r06j547j218P6J228J469J299J454
$$ 282167 283436 284421 284993 285353 285664 285902 286047 286137 285950 285044 283497 282279 282355 283583 285052 286351 287805
52525B87805J675J239K26n97r22j065j129p91OP97J182J268J395J694J985J878
$$ 287805 289480 290719 290945 290348 289426 288361 287232 286441 286447 287244 288426 289694 291089 292783 294768 296646
52509B96646J179L17J23R00K000K606K544J956P56r36k304k557j980j543j630
$$ 296646 297825 298142 298265 299165 301165 303771 306315 308271 309027 308091 305787 303230 301250 299707 298077
52494B98077j837j873j814j615j096m92k76l27l7O67J195J278J362J720J916J535
$$ 298077 296240 294367 292553 290938 289842 289350 289074 288747 288710 289377 290572 291850 293212 294932 296848 298383
52478B98383Q96N51N44O06P28J063J504J782J888K003K106J955J503J138J305
$$ 298383 299279 299830 300374 300980 301708 302771 304275 306057 307945 309948 312054 314009 315512 316650 317955
52463C17955J900K213J678O51Q7L02N03j35j326k045j859j310j134j559k341k970
$$ 317955 319855 322068 323746 324397 324484 324786 325289 325154 323828 321783 319924 318614 317480 315921 313580 310610
52447C10610k909k125j296j091j281j146o05k83m33n38j82L85P36Q18O57J18o79
$$ 310610 307701 305576 304280 303189 301908 300762 300157 299874 299441 298903 298721 299106 299842 300660 301317 301435 300756
52430C00756j170j007o11n92q61p90j75M02K84m14r10o74r8J9l66l22Q11K317
$$ 300756 299586 298579 297968 297376 296515 295725 295550 295952 296236 295822 294912 294238 294140 294159 293793 293471 294282 296599
52412B96599K760J700K33j95Q13K439L494L472L053L543N455P816R253R595R659
$$ 296599 299359 301059 301292 301097 301910 304349 307843 311315 314368 317911 323366 331182 340435 350030 359689
52397C59689R605Q359N024K10m420p467q479p848o489n287m448l605k633j951
$$ 359689 369294 377653 382677 382887 378467 371000 362521 354673 348184 342897 338449 334844 332211 330260
52383C30260j755j542q53n4J53k20m85k59J60M13N72Q15J031J093J297K057L127
$$ 330260 328505 326963 326110 326056 326209 325989 325504 325245 325405 325818 326390 327205 328236 329329 330626 332683 335810
52366C35810L597K958J882J378J346O41j229l149l664k711j483r19r86j220j302
$$ 335810 339407 342365 344247 345625 346971 347612 346383 343234 339570 336859 335376 334457 333471 332251 330949
52351C30949j057m57J75M52L46J37rJ1M23J212J770J560R45P52J128J531J688
$$ 330949 329892 329435 329610 330062 330408 330545 330536 330547 330970 332182 333952 335512 336457 337209 338337 339868 341556
52334C41556J830K071K320K789L687M501M509M135M606O083P272P295O838O818
$$ 341556 343386 345457 347777 350566 354253 358754 363263 367398 372004 378087 385359 392654 399492 406310
52320D06310O986O685O098N775N554M896L901L116K646K224J821J633J628J732
$$ 406310 413296 419981 426079 431854 437408 442304 446205 449321 451967 454191 456012 457645 459273 461005
52306D61005K168L099M138M701M615M051L231K604K767L722M591M604L902K948
$$ 461005 463173 466272 470410 475111 479726 483777 487008 489612 492379 496101 500692 505296 509198 512146
52292E12146J752L21p71j095j158j587j932j309Q0J083J170Q79P07N52M04P04
$$ 512146 513898 514219 513448 512353 511195 509608 507676 506367 506447 507530 508700 509579 510286 510838 511242 511946
52276E11946J613K541K751K103J123O26J193K522L492L308K513K255K770L340
$$ 511946 513559 516100 518851 520954 522077 522703 523896 526418 529910 533218 535731 537986 540756 544096
52262E44096L476L373L167K762K525L177M653N894O249O304O798P427P371O516
$$ 544096 547572 550945 554112 556874 559399 562576 567229 573123 579372 585676 592474 599901 607272 613788
52248F13788N393M246K904J453M02N2J59L30N30R84J776K673L315L545L553L684
$$ 613788 619181 623427 626331 627784 628186 628238 628397 628727 629257 630241 632017 634690 638005 641550 645103 648787
52232F48787M108M659M960M740M115L642L803M419M755M372L683L410L739M253
$$ 648787 652895 657554 662514 667254 671369 675011 678814 683233 687988 692360 696043 699453 703192 707445
52218G07445M480M201L540K961K978L477L698L337L182M042N395O009N698N480
$$ 707445 711925 716126 719666 722627 725605 729082 732780 736117 739299 743341 748736 754745 760443 765923
52204G65923N887O164N513M250L222K644K135J538J128J216J902L030M161M789
$$ 765923 771810 777974 783487 787737 790959 793603 795738 797276 798404 799620 801522 804552 808713 813502
52190H13502M865M819M966N173N188M965M454L538K337J180P6j317k908l971m120
$$ 813502 818367 823186 828152 833325 838513 843478 847932 851470 853807 854987 855063 853746 850838 846867 842747
52175H42747l946m216m819n080m735m068l356k791k661l041l397l076k111j012
$$ 842747 838801 834585 829766 824686 819951 815883 812527 809736 807075 804034 800637 797561 795450 794438
52161G94438j5R28J574J565J173J102J437J461P61j77q10j269j791j939j138L31
$$ 794438 794423 795351 796925 798490 799663 800765 802202 803663 804424 804247 803437 802168 800377 798438 797300 797631
52145G97631J499J862J795J842K009J894J207N3j116j805j950k037k552l379l976
$$ 797631 799130 800992 802787 804629 806638 808532 809739 809792 808676 806871 804921 802884 800332 796953 792977
52130G92977m033l580k606j109M63J476J992K833M327N640N958N812O399P811
$$ 792977 788944 785364 782758 781649 782112 783588 785580 788413 792740 798380 804338 810150 816549 824360
52116H24360Q867Q739P842O936O136N279M546M130L748L069K315J880J733J773
$$ 824360 833227 841966 849808 856744 862880 868159 872705 876835 880583 883652 885967 887847 889580 891353
52102H91353K477M454P408J0185J1893J2534J2625J2754J3428J4669J5522J4577
$$ 891353 893830 898284 905692 915877 927770 940304 952929 965683 979111 993780 1009302 1023879
$$ [...]
##END NTUPLES=NMR SPECTRUM
##END=
