
##TITLE=AC1367_2285_7221507_Xg8aSAJzSg
##JCAMPDX= 6.0         $$ Bruker NMR JCAMP-DX V2.0
##DATA TYPE= NMR SPECTRUM
##DATA CLASS= NTUPLES
##ORIGIN= BRUKER
##OWNER= Administrator
$$ 1.72 TOPSPIN		Version 2.1
$$ 2012-12-17 16:01:49.851 -0500  Administrator@X
$$ Compression mode = diff/dup
##.OBSERVE FREQUENCY= 400.02188249412
##.OBSERVE NUCLEUS= ^1H
##.ACQUISITION MODE= SIMULTANEOUS (DQD)
##.ACQUISITION SCHEME= undefined
##.AVERAGES= 8
##.DIGITISER RES= 22
##SPECTROMETER/DATA SYSTEM= spect
##.PULSE SEQUENCE= zg30
##.SOLVENT NAME= COFFEE_meoh
##.SHIFT REFERENCE= INTERNAL, COFFEE_meoh, 1, 14.98509
##AUDIT TRAIL= $$ (NUMBER, WHEN, WHO, WHERE, PROCESS, VERSION, WHAT)
$$ ##TITLE= Audit trail, TOPSPIN		Version 2.1
$$ ##JCAMPDX= 5.01
$$ ##ORIGIN= Bruker BioSpin GmbH
$$ ##OWNER= Administrator
$$ $$ E:\/data/COFFEE/nmr/AC1367_2285_7221507_Xg8aSAJzSg/30/pdata/1/auditp.txt
$$ ##AUDIT TRAIL=  $$ (NUMBER, WHEN, WHO, WHERE, PROCESS, VERSION, WHAT)
(   1,<2012-12-17 16:01:41.726 -0500>,<Administrator>,<X>,<go>,<TOPSPIN 2.1>,
      <created by zg
	started at 2012-12-17 16:00:34.990 -0500,
	POWCHK enabled, PULCHK disabled,
       configuration hash MD5:
       86 BA 57 50 F2 9D 5C 9B 26 00 A9 28 5F 66 2E 89
       data hash MD5: 64K
       94 C2 AE 55 C2 5F ED A2 79 AD 7D 63 6C CA 54 CE>)
(   2,<2012-12-17 16:01:44.866 -0500>,<Administrator>,<X>,<proc1d>,<TOPSPIN 2.1>,
      <Start of raw data processing
       efp LB = 0 FT_mod = 6 PKNL = 1 PHC0 = 0 PHC1 = 0 SI = 32K 
       data hash MD5: 32K
       C9 55 11 39 1B FE 69 27 FC 96 8E B7 82 38 AE C5>)
(   3,<2012-12-17 16:01:45.335 -0500>,<Administrator>,<X>,<proc1d>,<TOPSPIN 2.1>,
      <pk PHC0 = 97.08069 PHC1 = 0 
       data hash MD5: 32K
       72 29 3B 09 EC CF D7 72 48 61 ED 5A 66 05 EE CE>)
(   4,<2012-12-17 16:01:45.554 -0500>,<Administrator>,<X>,<proc1d>,<TOPSPIN 2.1>,
      <abs ABSG = 1 
       data hash MD5: 32K
       67 3C D6 64 BB C6 23 ED A8 94 CE D3 91 40 E9 3D>)
(   5,<2012-12-17 16:01:45.710 -0500>,<Administrator>,<X>,<proc1d>,<TOPSPIN 2.1>,
      <abs ABSG = 2 
       data hash MD5: 32K
       D2 B3 CD 3D 14 E3 66 B7 DC 35 37 8F 5C 8C 6C 90>)
(   6,<2012-12-17 16:01:45.851 -0500>,<Administrator>,<X>,<proc1d>,<TOPSPIN 2.1>,
      <abs ABSG = 3 
       data hash MD5: 32K
       8F 06 B7 B5 2A 85 07 8D 83 DA 68 E8 90 E8 35 64>)
(   7,<2012-12-17 16:01:45.991 -0500>,<Administrator>,<X>,<proc1d>,<TOPSPIN 2.1>,
      <abs ABSG = 4 
       data hash MD5: 32K
       7B AE FE 9E 1C B6 BC F7 C7 FF CB FB 85 46 70 00>)
(   8,<2012-12-17 16:01:46.132 -0500>,<Administrator>,<X>,<proc1d>,<TOPSPIN 2.1>,
      <abs ABSG = 5 
       data hash MD5: 32K
       1B 9A 6F 69 7F BD E9 47 2C BA 24 2B E7 B0 A8 0E>)
$$ ##END=
$$ 
$$ $$ hash MD5
$$ $$ 87 8C 00 9B 18 1F 4F E4 A3 F1 DF EA 0A 9D 00 BE
##$RELAX= 
##$RELAX= 
##$RELAX= 
##$RELAX= 
##$RELAX= 
##$RELAX= 
##$RELAX= 
$$ Bruker specific parameters
$$ --------------------------
##$DU= <E:\>
##$EXPNO= 30
##$NAME= <AC1367_2285_7221507_Xg8aSAJzSg>
##$PROCNO= 1
$$ [...]
150 150 150 150 150 150 150 150
##$TP07= 0
##$TPNAME0= <>
##$TPNAME1= <>
##$TPNAME2= <>
##$TPNAME3= <>
##$TPNAME4= <>
##$TPNAME5= <>
##$TPNAME6= <>
##$TPNAME7= <>
##$TPOAL= (0..7)
0.5 0.5 0.5 0.5 0.5 0.5 0.5 0.5
##$TPOFFS= (0..7)
0 0 0 0 0 0 0 0
##$TUNHIN= 0
##$TUNHOUT= 0
##$TUNXOUT= 0
##$USERA1= <user>
##$USERA2= <user>
##$USERA3= <user>
##$USERA4= <user>
##$USERA5= <user>
##$V9= 5
##$VALIST= <valist>
##$VCLIST= <CCCCCCCCCCCCCCC>
##$VD= 0
##$VDLIST= <DDDDDDDDDDDDDDD>
##$VPLIST= <PPPPPPPPPPPPPPP>
##$VTLIST= <TTTTTTTTTTTTTTT>
##$WBST= 2048
##$WBSW= 25
##$XGAIN= (0..3)
0 0 0 0
##$XL= 0
##$YL= 0
##$YMAX_a= 672633
##$YMIN_a= -571618
##$ZGOPTNS= <>
##$ZL1= 120
##$ZL2= 120
##$ZL3= 120
##$ZL4= 120
##$ABSF1= 14.98509
##$ABSF2= -5.573092
##$ABSG= 5
##$ABSL= 3
##$ALPHA= 0
##$AQORDER= 0
##$ASSFAC= 0
##$ASSFACI= 0
##$ASSFACX= 0
##$ASSWID= 0
##$AUNMP= <proc_prof1d_extract_pilot.lims>
##$AXLEFT= 0
##$AXNAME= <>
##$AXNUC= <1H>
##$AXRIGHT= 0
##$AXTYPE= 0
##$AXUNIT= <>
##$AZFE= 0.1
##$AZFW= 0.1
##$BCFW= 0
##$BC_mod= 0
##$BYTORDP= 0
##$COROFFS= 0
##$CY= 15
##$DATMOD= 1
##$DC= 0
##$DFILT= <>
##$DTYPP= 0
##$F1P= 0
##$F2P= 0
##$FCOR= 0.5
##$FTSIZE= 32768
##$FT_mod= 6
##$GAMMA= 0
##$GB= 0
##$INTBC= 1
##$INTSCL= 1
##$ISEN= 128
##$LB= 0
##$LEV0= 0
##$LPBIN= 0
##$MAXI= 10000
##$MC2= 0
##$MEAN= 0
##$ME_mod= 0
##$MI= 0
##$NCOEF= 0
##$NC_proc= -8
##$NLEV= 6
##$NOISF1= 0
##$NOISF2= 0
##$NSP= 0
##$NTH_PI= 0
##$NZP= 0
##$OFFSET= 14.98509
##$PC= 1
##$PHC0= 97.08069
##$PHC1= 0
##$PH_mod= 1
##$PKNL= yes
##$PPARMOD= 0
##$PPDIAG= 0
##$PPIPTYP= 0
##$PPMPNUM= 2147483647
##$PPRESOL= 1
##$PSCAL= 4
##$PSIGN= 0
##$PYNMP= <proc.py>
##$REVERSE= no
##$SF= 400.02
##$SI= 32768
##$SIGF1= 0
##$SIGF2= 0
##$SINO= 400
##$SIOLD= 32768
##$SPECTYP= <>
##$SREGLST= <1H.CDCl3>
##$SSB= 0
##$STSI= 32768
##$STSR= 0
##$SW_p= 8223.68421052631
##$SYMM= 0
##$S_DEV= 0
##$TDeff= 65536
##$TDoff= 0
##$TI= <>
##$TILT= no
##$TM1= 0
##$TM2= 0
##$TOPLEV= 0
##$USERP1= <user>
##$USERP2= <user>
##$USERP3= <user>
##$USERP4= <user>
##$USERP5= <user>
##$WDW= 1
##$XDIM= 32768
##$YMAX_p= 470555556
##$YMIN_p= -705261
##$CURPLOT= <Network HP LaserJet P1505>
##$CURPRIN= <$Network HP LaserJet P1505>
##$DFORMAT= <normdp>
##$LAYOUT= <+/1D_H.xwp>
##$LFORMAT= <normlp>
##$PFORMAT= <normpl>
##$SURQMSG= 1
$$ End of Bruker specific parameters
$$ ---------------------------------
##NTUPLES= NMR SPECTRUM
##VAR_NAME=  FREQUENCY,     SPECTRUM/REAL,   SPECTRUM/IMAG
##SYMBOL=    X,             R,               I
##VAR_TYPE=  INDEPENDENT,   DEPENDENT,       DEPENDENT
##VAR_FORM=  AFFN,          ASDF,            ASDF
##VAR_DIM=   32768,         32768,           32768
##UNITS=     HZ,            ARBITRARY UNITS, ARBITRARY UNITS
##FACTOR=    0.250966925370066, 1,           1
##FIRST=     8223.43324360094, 41213,        -34892
##LAST=      0,             -180409,         -13552
##MIN=       0,             -705261,         0
##MAX=       8223.43324360094, 470555556,    0
$$ Real data points
##PAGE= N=1
##DATA TABLE= (X++(R..R)), XYDATA
$$ [...]
19515A04735a60383C35608B2689c11818c407p1149B949b97662N4479a0846D8460
19503b47717b4285k06403D6528J39231c748A50584o7015B3404a70767P1128C02298
19491b81873B34682h6925N150A32967b83590a18411A0726L395g9861j06987R2176
19480i4672j33310H6143a55851l7648H7934K3183d17443c1609j81068F2K09156
19469B09218F6768a5001B07582h0021B4063e2011k01186e4392m6247j07185f4074
19457b2384C7781b85009a5012m4482k79215g8142B45763l4954p6871K12709b35778
19445a56358A70497f3893j57862l6221k5123A89185a63051j97788H5148E814K14720
19434B20534a62077M3559c1085A76013c635l27354A22119L13532f3078p2370B06587
$$ plain form
19515 104735 -160383 335608 22689 -311818 -3407 -74556 2949 -297662 -243183 -10846 48460
19503 -247717 -24285 -230688 46528 185759 -3748 150584 83569 23404 -170767 -99639 302298
19491 -281873 234682 -86925 -81775 132967 -283590 -118411 10726 14121 -79861 -186848 -94672
19480 -94672 -227982 86143 -155851 -193499 87934 111117 -417443 -31609 -212677 62 209218
19469 209218 66768 -15001 207582 -80021 24063 -52011 -253197 -54392 -100639 -207824 -64074
19457 -22384 37781 -285009 -15012 -59494 -338709 -78142 245763 210809 133938 346647 -235778
19445 -156358 170497 -63893 -221755 -257976 -283099 189185 -163051 -360839 85148 5814 220534
19434 220534 -162077 -118518 -31085 176013 -3635 -330989 122119 435651 -63078 -135448 206587
19422b08164B47329a79032R339g772k63853C5218M10811A53356j7833l846a07308
19410E276g6585B3352J68255l3134B4375a52911c0435I5293a32392d1747A35002
19398d64589G1967O1912i3783j05950a3190p4205J6280j4939r4323j75332H6353
19386a93737o0803a2063j94520A76679q2532F350a84303l7433K9502N1188m5487
19375a86533n8481i6197k20429A35187a42735A20091c06505b113k25843A0373
19364E7819J72906a03858l5701d0915n2380M1958o7356q0443B46004b24997L3722
19353a91275j61686P6607L4910G7250a75856q3930C4783O2222J43216c0097o5444
19342i5541n88585b89917E8997J57695c42254F9616K0185c7069p1533j06591A5328
$$ plain form
19422 -208164 247329 -179032 -169693 -7772 -271625 35218 446029 153356 135523 131677 -107308
19410 5276 -76585 23352 191607 158473 24375 -152911 -30435 95293 -132392 -41747 135002
19398 -464589 71967 133879 -93783 -199733 -13190 -87395 -71115 -86054 -180377 -355709 86353
19386 -193737 -254540 -12063 -206583 176679 94147 6350 -184303 -221736 -192234 -141046 -186533
19375 -186533 -245014 -96197 -316626 135187 -142735 120091 -306505 -2113 -227956 10373
19364 57819 230725 -103858 -139559 -40915 -93295 -51337 -118693 -199136 246004 -224997 -191275
19353 -191275 -352961 -276354 -241444 77250 -175856 -259786 34783 97005 240221 -30097 -95541
19342 -95541 -684126 -289917 58997 216692 -342254 69616 89801 -37069 -108602 -215193 15328
19330a89671C2787b61577K3632j0426A3835b73106c1922j11453I5242M6266c72767
19318A78560a12312M2304j31795h8106G1659b60778B00673H1512a59718k46292
19308d06010a76103B8743a57809M7923k4306F5796I206J95517i6018i797l64929
19297c74726B7617A776a87275j21635i4032a4835A420K89923a3881B49994R5237
19286C45231a34095C9239c4819A31301a22615j844e5518j81226A35054a50503
19275a60658h62B01270a05576L5829L94j33631A48235a50977F1493c42085D66112
19263A19680M1234E5763J91780H2588c34787J66144J0825k1238I6327a83047k745
19252a85792e5333k1981k92464A39358o8772R7529a87768n957N3428H3684a54299
$$ plain form
19330 -189671 32787 -261577 -237945 -248371 13835 -273106 -31922 -143375 95242 141508 -372767
19318 178560 -112312 -70008 -201803 -88106 71659 -260778 200673 81512 -159718 -406010
19308 -406010 -176103 28743 -157809 -109886 -134192 65796 9206 204723 -96018 -9797 -374726
19297 -374726 27617 1776 -187275 -308910 -94032 -14835 1420 291343 -13881 249994 345231
19286 345231 -134095 39239 -34819 131301 -122615 -124459 -55518 -236744 135054 -150503
19275 -160658 -862 201270 -105576 -69747 -69353 -202984 148235 -150977 61493 -342085 466112
19263 119680 160914 55763 247543 82588 -334787 -168643 -157818 -179056 96327 -183047 -185792
19252 -185792 -55333 -77314 -369778 139358 70586 168115 -187768 -193725 -140297 83684 -154299
19240A80309J99881c31202e8525F2449b10380J04768H5158A0737a7185C00563
19229A86235D285P0752a08960M4341B6735g838n0237k21336B3319N6875b72930
19217A58307o5871i4662k20353b9756B9811N403e0310a7828j21311j98132f3827
19205c33346a28152l11521K1159h0541B80598g9999c5933J6859B50453c33587
19194a54928b9210A34496f1719J2442A16222b0181k59158a14208M326m3723B02542
19182A71292a71064A26472a69895j05914J03285B64604A27783a88773a808A828
19171b5101B41767a01484q2201K1580l2900I868h4267j64701a3261G1770b77562
19159b92561M538R2366c5672j59840A08487a28534A64556H491o75a65889M9744
$$ plain form
19240 180309 380190 -331202 -58525 62449 -210380 -105612 85158 10737 -17185 300563
19229 186235 4285 75037 -108960 -64619 26735 -7838 -58075 -279411 23319 80194 -272930
19217 158307 92436 -94662 -315015 -29756 29811 35214 -50310 -17828 -139139 -337271 -63827
19205 -333346 -128152 -439673 -418514 -80541 280598 -79999 -35933 -19074 250453 -333587
19194 -154928 -29210 134496 -61719 -49277 116222 -20181 -279339 -114208 -109882 -153605 202542
19182 171292 -171064 126472 -169895 -275809 -172524 264604 127783 -188773 -1808 1828
19171 -25101 241767 -101484 -183685 -162105 -195005 9868 -84267 -248968 -13261 71770 -277562
19159 -292561 -288023 -195657 -35672 -195512 108487 -128534 164556 8491 7816 -165889 -116145
19148a16145A80923H293J89681a57927j23256i646o8359b4226j21999l30173e7038
19136a64199C7184c01144i7894E7860a4801m66669a11210A4512a87988j1145A30023
19124B9944J3761J57571a2326N978m7463B426b39947c326H3857a251F4951c1413
19111B37770A3685h4349M515K8845A5712d8736A2479e3802k70220D53981c340
19099a24861L5487m2940N3360n4429A68382g5711G9719A0645b93190a12054l2967
19088a45021c9910j65468A64049c43136A43170b7087j656l0713G6012c66876B29323
19076a20622a0830k61369B92817l9877H2923c382I0111a52475B4843a16580M0042
19065g6538g350I6133e0894j37903r9261J30322A0368J08495j0220k0592b79880
$$ plain form
19148 -116145 180923 8293 197974 -157927 -281183 -9646 -78005 -24226 -146225 -476398 -57038
19136 -164199 37184 -301144 -97894 57860 -14801 -481470 -111210 14512 -187988 -199133 130023
19124 29944 43705 201276 -12326 -6348 -53811 2426 -239947 -3326 83857 -1251 64951 -31413
19111 237770 13685 -84349 -79834 -50989 15712 -48736 12479 -53802 -324022 453981 -3340
19099 -124861 -89374 -132314 -78954 -133383 168382 -75711 79719 10645 -293190 -112054 -145021
19088 -145021 -39910 -205378 164049 -343136 143170 -27087 -28743 -59456 76012 -366876 229323
19076 -120622 -10830 -272199 292817 252940 82923 -3382 90111 -152475 24843 -116580 -76538
19065 -76538 -7350 96133 -50894 -188797 -288058 -157736 10368 118863 108643 88051 -279880
19053A8458J52322n9689a35561B34719b3923A1300c0878C29429h0199A46072o3279
19042H2793J33916a83596a03j98225D8547c04917E6324e7106H0419b44429k04835
19031d49264K10377I997J83290a58962B59933h4552A25344b48740p5831a6536
19020a16874B05849a47669d8786I0952r863b4882F4934b41009I0491b81714Q9287
19009a92427j34993A21507K5600c28077f8268k9254j72241B36754b29976F2060
18998A74193a67419B9L6764J85816J18355a69028B25497d7472A35515c42548a28245
18986e8288A04165P0308c79918a77436L3092A1690a23308A53528d02803d7772
18975i8749D8105a15208B61202e7599j81746G7868d19567c5033A81153a82889
$$ plain form
19053 18458 170780 111091 -135561 234719 -23923 11300 -30878 329429 -80199 146072 82793
19042 82793 216709 -183596 -103 -198328 48547 -304917 56324 -57106 80419 -244429 -449264
19031 -449264 -238887 9997 193287 -158962 259933 -84552 125344 -248740 -324571 -16536
19020 -116874 205849 -147669 -48786 90952 81089 -24882 64934 -241009 90491 -281714 -192427
19009 -192427 -327420 121507 147107 -328077 -68268 -97522 -269763 236754 -229976 62060
18998 174193 -167419 29 36793 222609 340964 -169028 225497 -47472 135515 -342548 -128245
18986 -58288 104165 174473 -379918 -177436 -144344 11690 -123308 153528 -402803 -47772
18975 -98749 48105 -115208 261202 -57599 -239345 77868 -419567 -35033 181153 -182889
18964h0640B16669D1503g0430a4815k13257B5481d2779F0101a11789C20895a42996
18952b9132C8406c01157a11979g012A64811a02205n72123A11021d23451F872O633
18941A3505L656i6539p9756d9157A61951a24978j53523e9052J0472j66201G7680
18929a39607j45011J14050H5604i6798j23886C303i8888A02371b99585a39662
18918a23709p752l00715C8058J06431b07589E1588h0639A06883P3224G7218e6585
18906E5492d7655j79253R1727o4817R7389p8551M2960G3701a48479j98577o0032
18895d07088J39865B59490a70784A48506E0661J559b20036B16720d3978m3072
18885h7050k184I1423a39972I3499c308j69595A90663c06375H795a73981k25318
$$ plain form
18964 -80640 216669 41503 -70430 -14815 -228072 25481 -42779 60101 -111789 320895 -142996
18952 -29132 38406 -301157 -111979 -7012 164811 -102205 -674328 111021 -423451 6872 13505
18941 13505 17161 -96539 -176295 -49157 161951 -124978 -278501 -59052 -48580 -214781 77680
18929 -139607 -284618 -170568 85604 -96798 -220684 3303 -98888 102371 -299585 -139662
18918 -123709 -131461 -432176 38058 144489 -207589 51588 -80639 106883 180107 77218 -56585
18906 55492 -47655 -226908 -135181 -199998 -102609 -181160 -138200 73701 -148479 -347056 -407088
18895 -407088 -267223 259490 -170784 148506 50661 52220 -220036 216720 -43978 -87050
18885 -87050 -89234 91423 -139972 93499 -3308 -172903 190663 -306375 8795 -173981 -399299
18874c99299i2374n0397B784A005K6201P9112g9865m2871c9393A6197a44973k29282
18862c74255j51623g1891k95942P4088g7466j40456O4581k3687J8078j28025a15529
18850h2201B88751c06441g812E7a04885f772D8033b5023l13128A4811b84846A3988
18837C4673J54308b3698l09409A8729c23417G4262h7834j712G4929a608C5501
18825B62533b6149A73169f3217k2972A5014a57576f6296A70094a1839j24133B75122
18813c6800k183A45623J37117r6615b02418Q6823a4675B50751G2217a95476i6600
18801f062n8327E01618f2587m4226o1912f8932B58333a75502A906Q9371e0981
18789a251D8032b33586O7385g5893C10737b03720A61449M0228D7127a37678d9921
$$ plain form
18874 -399299 -92374 -142771 2784 1005 27206 106318 -79865 -122736 -39393 16197 -144973 -374255
18862 -374255 -525878 -71891 -367833 -293745 -77466 -217922 -153341 -177028 -158950 -286975 -115529
18850 -82201 288751 -306441 -7812 57 -104885 -6772 48033 -25023 -338151 14811 -284846 13988
18837 34673 188981 -23698 -333107 18729 -323417 74262 -87834 -89546 74929 -1608 35501
18825 262533 -26149 173169 -63217 -86189 15014 -157576 -66296 170094 -11839 -135972 275122
18813 -36800 -38983 145623 282740 186125 -202418 -115595 -14675 250751 72217 -195476 -96600
18801 -6062 -64389 501618 -62587 -106813 -168725 -68932 258333 -175502 1906 91277 -50981
18789 -1251 48032 -233586 -166201 -75893 310737 -203720 161449 201677 47127 -137678 -49921
18777h7317C8745K45255d5036J6941j52397A42836b34566D34497c50936N7309
18767b93627E1277e18657F680h6601p843j19702L1457A32131B6391j1764O9599
18756H4226K7664L7753a01325C12648o9555f1726H697b00735C9326c8694k75722
18745c14416a06656K3453k05881J43236J9006j9704O8610p573L0237r3624j7360
18734a66256M297M7565C6838J13723f0259j0576p8526a3338G0868O8447b0984
18722A56952J47317a80893B8224J51659l5347O4880a77840A94228a00173A78232
18711a48290A44769f6413j81612B27500A7367J13983I668J66881a66016k3334
18701a89350E1429b24438A28542J12579a81171k61779A37087b21283i5042K7419
$$ plain form
18777 -87317 38745 284000 -45036 -28095 -180492 142836 -234566 434497 -350936 -293627
18767 -293627 51277 -518657 6680 -86601 -94444 -214146 -182689 132131 26391 14627 84226
18756 84226 111890 149643 -101325 312648 243093 -61726 8697 -200735 39326 -38694 -314416
18745 -314416 -106656 -83203 -289084 -145848 -126842 -146546 -77936 -85509 -55272 -148896 -166256
18734 -166256 -161959 -114394 36838 150561 -60259 -70835 -149361 -13338 70868 139315 -20984
18722 156952 304269 -180893 28224 179883 144536 209416 -177840 194228 -100173 178232
18711 -148290 144769 -66413 -248025 227500 17367 131350 9668 176549 -166016 -189350
18701 -189350 51429 -224438 128542 241121 -181171 -442950 137087 -221283 -95042 -67623
18691f7623K0749A08487c54908d7885r8297j38940m20139a76387P9539J3367A64702
18679a41493A02621a73722p536B92016A32873J0417o4923A1061J00507c76979
18668b31762A31890c73551E8756a54080j22484m6335a3460q0171A26748b22164
18657A73184B3723c04734A26698c67514J31310Q8352C01449f6952I0154O2520
18647A52674n6651b67605G3691a47532n9321B8279d56276N1548h9044A61598J4015
18636A75613m0341d59897A37671o8492P7312b88283C7278b62275A85217k6210
18626A59007c4934J6503j63089B12139b00911k716B3750p493Q2528a71874A2862
18614f03918B37501b04167g7606B61464C2455e1879G6545d73968a33000l30157
$$ plain form
18691 -67623 -46874 108487 -354908 -47885 -146182 -285122 -705261 -176387 -96848 -83481 164702
18679 -141493 102621 -173722 -181258 292016 132873 143290 78367 11061 111568 -376979
18668 -231762 131890 -373551 58756 -154080 -276564 -322899 -13460 -93631 126748 -222164
18657 173184 23723 -304734 126698 -367514 -236204 -147852 301449 -66952 90154 152674
18647 152674 96023 -267605 73691 -147532 -206853 28279 -456276 -404728 -89044 161598 175613
18636 175613 135272 -459897 137671 69179 146491 -288283 37278 -262275 185217 159007
18626 159007 -34934 -18431 -181520 212139 -200911 -203627 23750 16257 98785 -171874 12862
18614 -603918 237501 -204167 -77606 261464 32455 -51879 76545 -473968 -133000 -463157
18604d63157J48210E6151a38365A71664H3450l7570b3583q8910A36410h7345E7580
18592A96392c17799a21982F9199b65628f0108K6478j14184c1877l13169A6873
18581b1623j64179B70941b46373a23044j00187m0115F0724L7234K0377b83547
18570c05787A3027J85312f5998A41396f3533m4208j37106J02912o5846j61372
18560c69153a19619B39838J41550n7775a37910l47861M6537F2580J12927p8861
18550I6646m5864j4961a44698A35585d1087m7330I1683d2827G1615a71546C80542
18538E2260J05008a46876B40572i2806A34839a28457o3482F1862m767a95542D3231
18526a32777f2612I8654c374B33351a55926D2983M138a23856C10352b12387D9983
$$ plain form
18604 -463157 -314947 56151 -138365 171664 83450 45880 -23583 -112493 136410 -87345 57580
18592 196392 -317799 -121982 69199 -265628 -60108 -33630 -147814 -31877 -345046 16873
18581 -21623 -185802 270941 -246373 -123044 -223231 -263346 60724 97958 118335 -283547
18570 -305787 13027 198339 -65998 141396 -63533 -107741 -244847 -141935 -207781 -369153
18560 -369153 -119619 239838 381388 323613 -137910 -485771 -439234 62580 175507 96646
18550 96646 50782 35821 -144698 135585 -41087 -88417 91683 -42827 71615 -171546 380542
18538 52260 157268 -146876 240572 -92806 134839 -128457 -191939 61862 57095 -195542 43231
18526 -132777 -62612 98654 -3374 233351 -155926 42983 47121 -123856 310352 -212387 49983
18514a84495H3032l7246P2986k8546L54560d4671H5867i0073A79425a58953F5941
18502A34174d49265a03974A790J35960b74877F7048b6439B65881F5860f4752a8797
18490G7904h9643j64016A91456O3253d89724b30428d461m7627F3965a20172F2031
18478d81415A36204e0762A26770C0772K76349b59189H6J37468J756a73293k80706
18467d53999C15632I9662c85557D5025K3145k7828K65133d4863l89246A94271
18456a44705F5882Q8555B7759K84567a20808n8870A28111a4604m76091a09889
18445b38694b5294A7452a49286e7113I3214J75141a11870k10606B3433a5783k06310
18434b22093A13579a36031j33581a5836F1607P0026N1565C3762a57698A05440
$$ plain form
18514 -184495 83032 45786 118772 90226 444786 -44671 85867 -90073 179425 -158953 65941
18502 134174 -449265 -103974 1790 137750 -274877 67048 -26439 265881 65860 -64752 -18797
18490 77904 -89643 -253659 191456 254709 -489724 -230428 -4461 -52088 63965 -120172 62031
18478 -481415 136204 -50762 126770 30772 307121 -259189 86 137554 139310 -173293 -453999
18467 -453999 315632 99662 -385557 45025 68170 40342 305475 -44863 -434109 194271
18456 -144705 65882 154437 27759 312326 -120808 -179678 128111 -14604 -490695 -109889
18445 -238694 -25294 17452 -149286 -57113 93214 268355 -111870 -322476 23433 -15783 -222093
18434 -222093 113579 -136031 -269612 -15836 61607 131633 183198 33762 -157698 105440
18423a28265C8747e0112B65193a22699l4102j00785a26243b2622j89640e0305
18412f9216N830A62728b93051f8438a6331p4723D5100L68783B02436F7571e0262
18400b57894I1313C6569R4464b08893B5558c77003J44060K5679M0793d2898F9770
18388i8936j57628I1546b09798h4948k28009B98488d06659h4578A37098a19200
18377a18519m6325b220j93842g6678k91189C31816a08741k26468d1655A57905
18366a10137c4683A00514b17537g8721a9549C19375G5311i1872B84242f2553N664
18355e6889B66390b67844h8394A65540d8886A41107D5420a70515a6552C2691c6992
18343a53594M4447A36663h8402H1365O8982j0815B0053a42283b5541B3479G501
$$ plain form
18423 -128265 38747 -50112 265193 -122699 -156801 -257586 -126243 -22622 -212262 -50305
18412 -69216 -63386 162728 -293051 -68438 -16331 -91054 45100 413883 202436 67571 -50262
18400 -257894 91313 36569 131033 -208893 25558 -377003 -232943 -207264 -166471 -42898 69770
18388 -98936 -256564 91546 -209798 -84948 -312957 298488 -406659 -84578 137098 -119200
18377 -118519 -164844 -2220 -196062 -76678 -367867 331816 -108741 -335209 -41655 157905
18366 -110137 -34683 100514 -217537 -78721 -19549 319375 75311 -91872 284242 -62553 -56889
18355 -56889 266390 -267844 -88394 165540 -48886 141107 45420 -170515 -16552 32691 -36992
18343 -153594 -109147 136663 -88402 81365 150347 139532 20053 -142283 -25541 23479 7501
18331a3276l12171B07913b5791j50573A54268J4876c32646C96406b2845l1706
18321e4551R448n4143a6725r9182D9233K59217a19139A17878a47996b9391C9860
18309f2344A83968H9685J06759i8007L5245A1803d8113B06716p0499H118c71120
18297i4605m200j29569A36282D9919b23955G0719b61128P3621E517a48418o6161
18286b14579g8147F1808N4278k8645a54452J6351j99736H2128L8808m970a75000
18274a38772r0490g2137k68270r7947J56467C3545a40361r7766E1536c00371b4635
18262D4221a76994a4446A3696f7058j8768k03704D122J14796a67627A68634H2491
18250a65916c8270A7964d3187k41188b106G094d9089n2225j43407C04346a9343
$$ plain form
18331 -13276 -325447 207913 -25791 -176364 154268 169144 -332646 396406 -22845 -54551
18321 -54551 -45103 -99246 -16725 -115907 49233 308450 -119139 117878 -147996 -29391 39860
18309 -62344 183968 89685 196444 -98007 -62762 11803 -48113 206716 136217 8118 -371120
18297 -94605 -98805 -228374 136282 49919 -223955 70719 -261128 -187507 5517 -148418 -214579
18286 -214579 -78147 61808 116086 87441 -154452 -138101 -337837 82128 120936 115966 -175000
18274 -138772 -229262 -72137 -340407 -438354 -281887 33545 -140361 -238127 51536 -300371 -24635
18262 44221 -176994 -14446 13696 -67058 -85826 -289530 4122 118918 -167627 168634 82491
18250 -165916 -38270 17964 -43187 -284375 -2106 7094 -49089 -101314 -244721 304346 -19343
18238b28851I7875J96340D3854c89668a4734k40772K831J16313f431B78194J1887
18227B90081d0223L828k60634f5655j23392A27071J8240c2279j87119i3312k94153
18216c87465b2067B65982M94a79617F0081c47962B18755r6012C2026K05247b54521
18204A00386D3457a82387j49352k1998I8201b24522j14543a03989k72211J82010
18194a94190a2767j27134B15164b66873C30153d7640J2606B90131j31232E5907
18183E0607J29487b49195I7288a35164p1012A0034J87526i6580B78048g3226r899
18172h3125p4528A03033c04843N3631d0717G8127e4123A22391e7705n9716B8870
18160a79623A35455C6082J22635g0568j14553A389M5530a62923M8617l47426E4606
$$ plain form
18238 -228851 97875 294215 43854 -389668 -14734 -255506 -252675 -136362 -6431 278194 290081
18227 290081 -40223 -36395 -297029 -65655 -189047 127071 145311 -32279 -219398 -93312 -387465
18216 -387465 -22067 265982 266476 -179617 60081 -347962 218755 122743 32026 237273 -254521
18204 100386 43457 -182387 -331739 -353737 98201 -224522 -339065 -103989 -376200 -194190
18194 -194190 -12767 -139901 215164 -266873 330153 -47640 -35034 290131 158899 55907
18183 50607 180094 -249195 97288 -135164 -206176 10034 197560 -96580 278048 -73226 -83125
18172 -83125 -157653 103033 -304843 -251212 -40717 78127 -54123 122391 -57705 -117421 28870
18160 -179623 135455 36082 158717 -70568 -185121 1389 46919 -162923 -114306 -461732 54606
18148B9515b09672b9126B70479D7112a63797A38974n9463J10287m8290h8814B090
18136C8587f8171B18490e29043G1007i5808A08833a57331A18869a56526B90988
18125c30544a32128n5392B82026D8169b57758q4907B64812A04102b56771B29554
18114B33810c09458A84497f8609J6227J7344C40718i8667A09070d14796H042J09312
18103A17354i5754j2673k092m2923a523B0157c00906a22561e7268r7025A18567
18091a39263K0923B02112a38226M9983F0932J814N6099f9888H6546F681b14968
18079c4571A79506a81577K4374P5608n785j66310B9275J82813C9320a26819c8767
18067B7761a60726G1828P9423A3407a48477j32475A89735F7241a53283O2726D7857
$$ plain form
18148 29515 -209672 -29126 270479 47112 -163797 138974 79511 189798 141508 -88814 2090
18136 38587 -68171 218490 -529043 71007 -95808 108833 -157331 118869 -156526 290988
18125 -330544 -132128 -187520 282026 48169 -257758 -342665 264812 104102 -256771 229554
18114 233810 -309458 184497 -68609 -52382 -35038 340718 -98667 109070 -414796 8042 117354
18103 117354 -95754 -108427 -110519 -153442 -1523 20157 -300906 -122561 -57268 -154293 118567
18091 -139263 -118340 202112 -138226 -88243 60932 62746 118845 -69888 86546 6681 -214968
18079 -34571 179506 -181577 -157203 -81595 -87380 -253690 29275 212088 39320 -126819 -38767
18067 27761 -160726 71828 151251 13407 -148477 -280952 189735 67241 -153283 -90557 47857
18055c9762r1559d0060A84243M4349a46347k28690A577a26113E215P3071a38621
18043A81885a03685J9010A99277C7374a88082H9814c08760a38113I1782c50596
18032D3968a61058j9614A30217b93743a24158A64335D3594J21973A9472K5835
18022D5307e6122l31562a82701M0573L7007E5940g6388j24886Q6052a3312B05082
18010A24090E2516e4074q40b564l5753m3979A36066h2979m1032C960f3418C32224
17997D8246J0835a70286g1989j0115D9162a40929n6054B09694b90499a13250m6792
17986a60042D9437L1993Q9509b87343A69514a32681O3043D190d442k86673A02266
17974A13260b01589G669K81513f9241h830k70698J7321A7508K7358k0434b3587
$$ plain form
18055 -39762 -131321 -40060 184243 228592 -146347 -375037 1577 -126113 5215 78286 -138621
18043 181885 -103685 -84675 199277 37374 -188082 89814 -308760 -138113 91782 -350596
18032 43968 -161058 -180672 130217 -293743 -124158 164335 43594 165567 19472 45307
18022 45307 -56122 -387684 -182701 -142128 -105121 55940 -76388 -201274 -115222 -13312 205082
18010 124090 52516 -54074 -54914 -2564 -38317 -82296 136066 -82979 -124011 3960 -63418 332224
17997 48246 59081 -170286 -71989 -82104 49162 -140929 -196983 209694 -290499 -113250 -160042
17986 -160042 49437 81430 170939 -287343 169514 -132681 -69638 4190 -4442 -291115 102266
17974 113260 -201589 7669 289182 -69241 -8830 -279528 -262207 17508 44866 24432 -23587
17962G4481L7085B7270L7442k7037K70608a92211c447B71358h2722c5435C73148
17950E6688J72443A1796a41053C9678b2018A11404h4292l6350j70824B05257C5422
17938A17760c19911C5459O3525P0133b63597a17362B9232d4466J8139Q818B4557
17926b38569A62927b83451C83080B9687d0405B6555K24955E7112I661J32583n9624
17915H2620J2786i2309k21038J16849A34732b63097c1819a3647B22989a61564
17904H913J58707a42588D1865c27674e0507r3632f0592K204J4434F1960b36749
17892B4817f9658n5096D4777e287k52812m061J15562A52921i3817g876j42945
17881a50821B24707b344A15917K4591i0902G3694j1194f269A84166b1553A00196
$$ plain form
17962 74481 111566 27270 64712 37675 308283 -192211 -3447 271358 -82722 -35435 373148
17950 56688 229131 11796 -141053 39678 -22018 111404 -84292 -120642 -291466 205257 35422
17938 117760 -319911 35459 98984 169117 -263597 -117362 29232 -44466 -26327 -17509 24557
17926 -238569 162927 -283451 383080 29687 -40405 26555 251510 57112 9661 142244 82620
17915 82620 95406 -92309 -313347 -196498 134732 -263097 -31819 -13647 222989 -161564
17904 8913 167620 -142588 41865 -327674 -50507 -144139 -60592 -58388 -43954 61960 -236749
17892 24817 -69658 -124754 44777 -5287 -258099 -262160 -146598 152921 -93817 -7876 -150821
17881 -150821 224707 -2344 115917 140508 -90902 73694 62500 -6269 184166 -21553 100196
17869B37027c9355j55474M3985j08879B06770H4145J694e3691G8313J27853K1063
17858B27229K02838a29335j99550f73j31505L9280C6630i6109F3856b1555A81974
17846C77340c31055a31251H495P3276N8765a27362k4581c2378j3630p5274B74721
17834c53362a30127A40923f0176G0920c24722a46127j95607a05505j96702C17614
17823B08544m5559b94013B42616a17269C19704F0611P465J06448b31776f1946
17812F8270a89278O404b9024k42468a29745A25259J89075j32075J96311c1899
17801G9314o426N172K0204f071k03945j22397a59370F5984e0981F7514J07701
17790A75215i1323B05589g7313r386j06697h211l73594D7062c80450i2020o7189
$$ plain form
17869 237027 -39355 -194829 -150844 -259723 206770 84145 85839 -53691 78313 206166 227229
17858 227229 430067 -129335 -328885 -673 -132178 -92898 36630 -96109 63856 -21555 181974
17846 377340 -331055 -131251 8495 81771 140536 -127362 -151943 -32378 -46008 -121282 274721
17834 -353362 -130127 140923 -60176 70920 -324722 -146127 -341734 -105505 -302207 317614
17823 208544 162985 -294013 242616 -117269 319704 60611 68076 174524 -231776 -61946
17812 68270 -189278 -182874 -29024 -271492 -129745 125259 314334 182259 378570 -31899
17801 79314 72888 78060 98264 -6071 -210016 -332413 -159370 65984 -50981 67514 175215
17790 175215 -91323 205589 -77313 -86699 -193396 -8211 -381805 47062 -380450 -92020 -159209
17779a59209J4406a7756j77172d6394j49560D1676d266B19215a95004P9336b4908
17767H3584h0525m3140I8766N309b10976D16933c6199H3213Q7136b9471l38870
17756c68341b3954k95184B608i6057A71709e3772A12648b18985F5036i1688A52136
17744A57274m2226g181C17320b17685B15930a07407d2864k1727i088j41566B01934
17732B47162D8672J39781K9881a09715B41119b0140a0008A582a53175c340l3304
17721c6644A72944h7353C91268A3204c5578C18449c00066I5887a52772r9868j27555
17710c80195B11406d13545a64000j05081Q1417A29715R936f0417D9088c77672
17699A52305J13223A03543K42793C3427a68084l567c8204A47166C5572Q3635b84466
$$ plain form
17779 -159209 -144803 -17756 -194928 -46394 -195954 41676 -4266 219215 -195004 -115668 -24908
17767 83584 -80525 -123665 98766 104075 -210976 416933 -36199 83213 170349 -29471 -368341
17756 -368341 -23954 -319138 2608 -96057 171709 -53772 112648 -218985 65036 -91688 152136
17744 157274 115048 -7181 317320 -217685 215930 -107407 -42864 -64591 -9088 -150654 201934
17732 247162 48672 188453 218334 -109715 241119 -20140 -10008 1582 -153175 -3340 -36644
17721 -36644 172944 -87353 391268 13204 -35578 318449 -300066 95887 -152772 -252640 -380195
17710 -380195 211406 -413545 -164000 -269081 -187664 129715 139651 -60417 49088 -377672
17699 152305 265528 103543 346336 33427 -168084 -171651 -38204 147166 35572 119207 -284466
17687C8775M5689J83292a2712I4790h5563F420c13805A3503Q3321J40670n3627
17676A83867D0834O8445b16608A46341a35689D0653M9899a06731B96590A8317
17665G1001M6994m03c52407J48435h5317M0765A30314n9478a50148E5434N2680
17654A08114A7284J57738p9302J50926g1910C77671a80636B94596a74015n6284
17644b30299A63923F8254b55853B29399E5237N5856O099b5111j05711e6405F0471
17632g3316G2578a8316E0741L68176j17078j02787m2158d3817k6974N820B48139
17620g7149Q335m31243J50170C2052J13835D9428b01189A8183m650M4822M0636
17609I8991b78787A27332d57104J54270a4997B42563E9440K05357c37063i2400
$$ plain form
17687 38775 84464 267756 -12712 94790 -85563 6420 -313805 13503 96824 237494 183867
17676 183867 40834 109279 -216608 146341 -135689 40653 90552 -106731 296590 18317
17665 71001 117995 117592 -352407 -203972 -85317 -44552 130314 70836 -150148 55434 108114
17654 108114 17284 175022 95720 246646 -71910 377671 -180636 294596 -174015 -230299
17644 -230299 163923 68254 -255853 229399 55237 111093 117192 -25111 -130822 -56405 60471
17632 -73316 72578 -18316 50741 418917 301839 199052 156894 -43817 -70791 -64971 248139
17620 -77149 -68814 -500057 -349887 32052 145887 49428 -201189 18183 13533 58355 98991
17609 98991 -278787 127332 -457104 -302834 -14997 242563 59440 264797 -337063 -92400
17598g3256j2079B90466a06910c2166E3832f7657B32157i4884k37390a6715B94470
17586B64205c5810A83539n2128r40a66981A71540L2383a06978B3040A0a1343l01
17574a1644k02406e5299D695J33207C7153K46078A40244C4109a96445B93935q5491
17563B08444H2630C9305a3355j30786G2390J96138J01646i3866m9314f419C62235
17551b99768A8834b16542O4718C21508F259a2682C96216j52698R8131r4571p1064
17540A76014c91382P2471a07934k19313E7042F816M20419A73428a2275B59086
17529b35630F3365f6373B46110p1026B9115a38570m530F2942c264A90676p6504
17518A14172J11931C0041L9288b8399A63635K375E7875K70094b12622A18610J43344
$$ plain form
17598 -73256 -85335 290466 -106910 -32166 53832 -67657 232157 -94884 -332274 -16715 294470
17586 264205 -35810 183539 131411 130471 -166981 171540 203923 -106978 23040 10 -11343 -11644
17574 -11644 -214050 -55299 4695 137902 37153 283231 140244 34109 -196445 293935 208444
17563 208444 82630 39305 -13355 -144141 72390 268528 370174 -93866 -143180 -6419 362235
17551 -299768 18834 -216542 -151824 321508 6259 -12682 396216 243518 341649 247078 176014
17540 176014 -391382 -318911 -107934 -327247 57042 6816 427235 173428 -12275 259086
17529 -235630 63365 -66373 246110 175084 29115 -138570 -143100 62942 -3264 190676 114172
17518 114172 226103 30041 69329 -28399 163635 166010 57875 327969 -212622 118610 261954
17507B61954k7840I9962c18351P0787J00084l36023J77527I1845a4408E9761J98272
17496B58033o8870a8907A08605J01793c8201E23769c68555b2748C34750A01189
17485d09373E8248L26851j15290J08606j05519A18415G924b39848c1390A02360
17474a1733D5484J99325f7399A23567K33318p921j7778C0169K9318g986j57061
17463a65047A73587J35775d4300C62733A19206J52291P5498B5065P8597N5905
17453A59567p9460Q7667J15255L48701A36083J36257Q5326J731j55996D4382L9201
17442H3583L15490d316C32245o8254Q0784p8608L75235B93939K4116c8279C01914
17430D44859A00450K24959J99240A75406K7091P7962r0732L3912K6431K07745
$$ plain form
17507 261954 234114 99962 -318351 -247564 -147480 -483503 -305976 91845 -14408 59761 258033
17496 258033 189163 -18907 108605 210398 -38201 523769 -368555 -22748 334750 101189
17485 -409373 58248 385099 269809 378415 272896 118415 7924 -239848 -31390 102360
17474 -11733 45484 244809 -67399 123567 356885 348964 331186 30169 59487 -7986 -165047
17463 -165047 173587 309362 -44300 362733 119206 271497 346995 25065 103662 159567
17453 159567 80107 167774 283029 631730 136083 272340 357666 359397 203401 44382 83583
17442 83583 399073 -4316 332245 263991 344775 266167 641402 293939 318055 -38279 301914
17430 444859 100450 325409 524649 175406 202497 280459 189727 223639 250070 457815
17420D57815A72344J54786N4812p4086I2350k4350L46098A32526R3615r4085M7215
17409A79271P009R4438a21176B30445L1669p6705p4362a1284k4658k5638A00385
17397B5748L35523J04461A45150K5789J6652c49825B12344J70803E3427M3526
17387I6953N67295C3236f907j92463G0566K8508a27988A22962J30478a3278B49650
17375B33196l9513Q3408c36705A04476J15618D5875a23861E2572L2843M0623J00579
17364B26617N7250c4069A72938F5735J03017E1256K67385j48529E9711K41422
17354C01133d5433F0048c1203C4102K096M4962K30690i3895B270Q7787K74401
17343C64458G1899J46591p1528n4488o479J89764J4912c0604I9922q551O0648
$$ plain form
17420 457815 172344 327130 381942 307856 92350 68000 414098 132526 226141 132056 179271
17409 179271 186280 280718 -121176 230445 262114 185409 111047 -11284 -35942 -61580 100385
17397 25748 361271 465732 145150 170939 187591 -349825 212344 383147 53427 96953
17387 96953 664248 33236 -6907 -199370 70566 99074 -127988 122962 253440 -13278 249650
17375 233196 193683 277091 -336705 104476 220094 45875 -123861 52572 85415 126038 226617
17364 226617 283867 -34069 172938 65735 168752 51256 318641 170112 59711 301133
17354 301133 -45433 60048 -31203 34102 36198 81160 311850 -93895 2270 90057 364458
17343 364458 71899 218490 146962 92474 85995 275759 290671 -30604 99922 91371 152019
17332A52019Q7320j4944q0683K49395j24652E8717J87402I1651J69440H595L07255
17321C15850j49547D2180P0821J19533j01744a79886C66628A02170a04579d0512
17310A49530p0486J43315l8666O4824f1213D9321J24476e4459j3730i84A60591
17298b88009d2780J8196B71795e0431A52895J51540p3311J77785A78098K6885
17288B04983K19695B05126h3411A51627A3311J15974L53873j38673E8247i6285
17277I2574Q1102E2344B2483R123N5244K60066C8454b08758D4298L61587b17705
17265E96019k43943j06033a03525B81716A8613J34357O4147J2540p8252J36295
17255B87700a89024A61557n2342l1789c63326C52894f6280G5812b6824a2445m1502
$$ plain form
17332 152019 239339 224395 143712 393107 268455 58717 246119 91651 261091 8595 315850
17321 315850 166303 42180 113001 232534 130790 -179886 366628 102170 -104579 -40512
17310 149530 79044 222359 183693 248517 -61213 49321 173797 -54459 -68189 -984 160591
17298 -288009 -42780 -24584 271795 -50431 152895 304435 231124 408909 178098 204983
17288 204983 424678 205126 -83411 151627 13311 129285 483158 344485 58247 -96285
17277 92574 173676 52344 22483 31606 86850 346916 38454 -208758 44298 405885 -217705
17265 596019 352076 246043 -103525 281716 18613 152970 217117 229657 151405 287700
17255 287700 -189024 161557 109215 77426 -363326 352894 -66280 75812 -26824 -12445 -53947
17244e3947a4021D18992r4721r8744J39047g0749B04079L515m2202a20745C47655
17232D99990a62579A11614M55346A00782L09389A26874a12632k03944C12715j3314
17222B99401n4885I8458J36774G0730P8445K78831A75758o357L410l1075K84719
17211D26455r4686p0390j11380E8782b1496B9599K89739h8880A27447k9051J54299
17200B52695K8083r2459M9168J54110J80641k06691j14547a06667B51779J53747
17190D05526D1168J14071l1922A9088L99335A25125J59437e9201F4723J76213
17180B40936J1613K75766j31691L3555B08145L98404j27584q3093j71680q6942
17170A37250a48503C03988M4788F9211a1210C17929K69387A67256Q3533m1049
$$ plain form
17244 -53947 -14021 418992 324271 225527 364574 -70749 204079 207594 165392 -120745 347655
17232 499990 -162579 111614 566960 100782 410171 126874 -112632 -316576 312715 299401
17222 299401 244516 98458 235232 70730 149175 428006 175758 169401 172811 141736 426455
17211 426455 331769 261379 149999 58782 -21496 29599 319338 -88880 127447 98396 252695
17200 252695 280778 188319 237487 391597 572238 365547 251000 -106667 251779 405526
17190 405526 41168 155239 123317 19088 418423 125125 284562 -59201 64723 240936
17180 240936 252549 528315 396624 430179 208145 606549 478965 395872 224192 137250
17170 137250 -148503 303988 348776 69211 -11210 317929 587316 167256 250789 209740
17160B09740K66858j22633R5489j63117J47179o9611k6317A613K13000O4931B2403
17148A39188K15666n6963K51114A36919J69706K16959A09150l3663M48162A17468
17137E8363A2158Q7220L93368j02304j03131J44363I9175K93413G026L61194m0987
17126C27233j25749O67550C89623A94271Q3370A23000J01249I2757L36717g4222
17115E27077B1623M22598q6904j2053r7802M79097C42004o3423B9199L30078K84084
17104F43361j93990j79511j1137M5810l4221n3472Q9280d4299E51283k19703M3218
17093C74798C6712L31793L4626j47405K66775k31316K22522A55911K86514r0395
17083C52030j73598L22810k07659k5067J74684B02132a38340A17331K79109M6107
$$ plain form
17160 209740 476598 353965 449454 286337 433516 363905 337588 1613 214613 279544 22403
17148 139188 354854 297891 549005 136919 306625 523584 109150 75487 523649 117468
17137 58363 12158 99378 492746 390442 287311 431674 99175 392588 7026 368220 327233
17126 327233 201484 869034 389623 194271 277641 123000 224249 92757 429474 -74222
17115 527077 21623 444221 357317 345264 247462 726559 342004 278581 29199 359277 643361
17104 643361 449371 269860 258723 304533 270312 216840 306120 -44299 551283 331580 374798
17093 374798 36712 368505 403131 255726 522501 291185 513707 155911 442425 352030
17083 352030 178432 501242 293583 268516 443200 202132 -138340 117331 396440 442547
17073D42547j16122p2763K77655k20994K83246B15195k2388j1839K51315q1708
17063C50575L43432j22720K9048B62469K94337j62129k7815J99808l474A78163
17052F23095l0245j97310K73971J27336j74068l8473o4073o7718K02742C11780
17041G02128k09143j00875J02151K36933k31584k3830j38769J73543j945l2015
17031D76594k31139J4091K06017K28095N4301l29928M01147C78025L48333j81570
17021E44788R9789M040m5390j59984J04869J10084k04335L56276B52892L65375
17011F18267k50175K53190K02046k13353R0426N3023k42010j8839J8100J81764
17001F92439j58187K69658r8047j90216J74349J1641k55251J62854o1870j47014
$$ plain form
17073 442547 326425 253662 531317 310323 593569 215195 192807 180968 432283 350575
17063 350575 694007 571287 600335 262469 556806 394677 366862 566670 563196 178163
17052 623095 592850 395540 669511 796847 622779 584306 520233 452515 655257 311780
17041 702128 492985 392110 494261 731194 499610 475780 337011 510554 508609 476594
17031 476594 245455 259546 465563 693658 747959 418031 819178 378025 726358 544788
17021 544788 644577 648617 603227 443243 548112 658196 453861 810137 252892 618267
17011 618267 368092 621282 823328 609975 700401 753424 511414 492575 510675 692439
17001 692439 534252 803910 705863 515647 689996 701637 446386 609240 547370 400356
16991D00356O31432C81136J93680m2645m6678M47373k76234Q8091K28487l00652
16981F72558J73350N773p1056l65991M53703j63427m8919j54985L13457k99884
16971E14579K32123k07003M80007j15831k46909M31929k65756p9260J47224M4585
16961I35688K22174k52884n40l06191M93475r8616m04794L50810j04473L2183
16951H66832j03729K15366j4341J54520j08907J85597l98595O53009n44048n1513
16941H54191K32450J89328j7912j90758J73994k21906K03349n14624K50634K85615
16931A244361L559l25689O0155K14677K05293j73454O0493j28608O3082J43466
16921A367335k47574N50146o27757K40124r963q0549L73215J13519k92642j52780
$$ plain form
16991 400356 1031788 381136 574816 532171 485493 932866 656632 744723 973210 672558
16981 672558 845908 851681 780625 414634 868337 704910 655991 501006 814463 514579
16971 514579 746702 539699 1019706 903875 656966 1088895 823139 743879 891103 935688
16961 935688 1157862 904978 904438 598247 1091722 993106 588312 939122 834649 866832
16951 866832 763103 978469 964128 1118648 1009741 1195338 796743 1449752 905704 854191
16941 854191 1086641 1275969 1258057 1067299 1241293 1019387 1222736 708112 958746 1244361
16931 1244361 1247920 922231 982386 1197063 1402356 1228902 1289395 1160787 1223869 1367335
16921 1367335 1119761 1669907 1042150 1282274 1272311 1191762 1564977 1678496 1385854 1233074
16911A233074N19933H73067O99953l133l2935l92440L84101q7768j12491K13666
16901A542020Q0601Q8777o1054j97022K02588m01886O90923j15021j53666o0214
16891A616046K60394M0216k45748L59781m41933n6341M21213l23179M88171k55110
16881A863510p9496L16294k6911j40436P0066l2806J54675J10161k8474k5173
16871B181410J56733j51419L91138j47464n6479k79931Q6721j838J29389q3847
16861B224413L05522J00854J78957k74997L40005q9756p4394J06510J89399Q4862
16851C091375k88132K64317m9420j74212J29250j41577K26446K99047j79039O3855
16841C241910J54336M1546L55004j96210L2825J57006j9051o5161J60584j44235
$$ plain form
16911 1233074 1753007 873067 1573020 1569887 1536952 1144512 1528613 1440845 1328354 1542020
16901 1542020 1622621 1711398 1650344 1453322 1655910 1254024 1944947 1829926 1676260 1616046
16891 1616046 1876440 1916656 1670908 2030689 1588756 1532415 1953628 1630449 2118620 1863510
16881 1863510 1784014 2100308 2073397 1932961 2003027 1970221 2124896 2235057 2206583 2181410
16871 2181410 2338143 2186724 2577862 2430398 2373919 2093988 2180709 2178871 2308260 2224413
16861 2224413 2529935 2630789 2809746 2534749 2874754 2784998 2710604 2817114 3006513 3091375
16851 3091375 2803243 3067560 3018140 2843928 2973178 2831601 3058047 3357094 3178055 3241910
16841 3241910 3396246 3437792 3792796 3596586 3629411 3786417 3767366 3702205 3862789 3718554
16831C718554K67892k37164M78244J28758j11569R7692J58540J670J33307M7222
16821D683146Q7290K17065O4586j99625Q0581K90692L51684o93684O65702J96564
16811E744001r7636K37141K44040j21652N90076o36881N41544J67894J67977K12343
16801G048847J52805J69817L60301j01809L56548j21127N79151K90096J65366
16792H899995K66838j03419L57640L93071j07536O62938j52073L38792M65485
16783A1021731K0491M88220L05863N08143M61453j28662O92353M27587N57805
16774A4354984J27666M73315M96383L22302O12396O92814P59802N17345M63554
16765A8820561P18010J051241P63392M73577J131278R60186Q77222R74672Q27347
$$ plain form
16831 3718554 3986446 3749282 4227526 4356284 4244715 4342407 4500947 4502617 4635924 4683146
16821 4683146 4770436 4987501 5052087 4852462 4933043 5223735 5575419 4881735 5547437 5744001
16811 5744001 5646365 5883506 6127546 6005894 6595970 5959089 6500633 6668527 6836504 7048847
16801 7048847 7201652 7371469 7731770 7629961 7986509 7865382 8444533 8734629 8899995
16792 8899995 9166833 9063414 9421054 9814125 9706589 10369527 10217454 10556246 11021731
16783 11021731 11042222 11530442 11836305 12344448 12805901 12677239 13369592 13797179 14354984
16774 14354984 14482650 14955965 15452348 15774650 16387046 17079860 17839662 18357007 18820561
16765 18820561 19538571 20589812 21353204 21826781 22958059 23918245 24795467 25770139 26597486
16756B6597486J050859J209653J185822J280080J748437J901061J293639J514338
16748C7781375J905514K176810J963668K136663K301599K861341K644398L010700
16740E6782068L095732L576797M065780L394632M398700M605945M808021N429289
16732I0156964N714034O060456O742585O576662P380852P365128Q341456P908368
16724A46246505Q431505Q890404Q204248Q021604P530642P084978O063320M690166
16716B05163372L616962J841324P56760j341695k626552m469082n034560p096223
16708A90810306p312623p797308q832349q129878q679301q898430q172615q004367
16700A24983435p556213p101369p224046o370490n728063n581458n129160n074173
$$ plain form
16756 26597486 27648345 28857998 30043820 31323900 33072337 34973398 36267037 37781375
16748 37781375 39686889 41863699 43827367 45964030 48265629 51126970 53771368 56782068
16740 56782068 59877800 63454597 67520377 70915009 75313709 79919654 84727675 90156964
16732 90156964 95870998 101931454 108674039 115250701 122631553 129996681 138338137 146246505
16724 146246505 154678010 163568414 171772662 179794266 187324908 194409886 200473206 205163372
16716 205163372 208780334 210621658 211378418 210036723 207410171 202941089 197906529 190810306
16708 190810306 183497683 175700375 166868026 158738148 150058847 141160417 132987802 124983435
16700 124983435 117427222 110325853 103101807 96731317 91003254 85421796 80292636 75218463
16692G5218463m135234m323115l897520l474907l276556l044451k719320k762558
16684D7584802k503028k475477j978285k335916j513400j476620j809404j669256
16676C1823416j186417j409488j271718r86620j439661j290012j099637n56522
16668B2583341q29643r07328q45724m70892n83204j044799j022737J18714o93379
16659A6304349q97440n06476m06220m53480n85589l85770m82165l82119J7222
16650A2222312o77802m34254R674o52171k59794l54097q1783l30044k90335k20306
16640H931400o328j47975p14872K9740l29070K7650k75188m34994k6441N3306
16630G107228l36655n1106l39658r1855j58354k17571P286m17114Q0443k03464
$$ plain form
16692 75218463 71083229 66760114 62862594 59387687 56111131 53066680 50347360 47584802
16684 47584802 45081774 42606297 40628012 38292096 36778696 35302076 33492672 31823416
16676 31823416 30636999 29227511 27955793 26969173 25529512 24239500 23139863 22583341
16668 22583341 21753698 20846370 20000646 19529754 18946550 17901751 16879014 16997728 16304349
16659 16304349 15406909 14900433 14494213 14040733 13455144 13069374 12587209 12205090 12222312
16650 12222312 11544510 11110256 11119930 10467759 10207965 9853868 9772085 9442041 9151706 8931400
16640 8931400 8925072 8777097 8062225 8091965 7762895 7790545 7515357 7080363 7053922 7107228
16630 7107228 6770573 6719467 6379809 6287954 6129600 5912029 5919315 5502201 5582644 5379180
16620E379180j36807K3418k07767q5044j38177J76268l44973M2548k97983j38825
16610D271838O3603k9457j88325L3765j26412R284l14776j25205L03663j62907
16600C735071j64886J26551j5516l22257q7335k6609L17888k14705j79425j4445
16590C154332l42965M37537k28641k94206J57467M3837j58799L1844K7930J19150
16580B947486l24560O835o0951k56940J81344l70108K01324K02037n57532J75430
16570B144365J55391p234j23454K97183l48918m2620R0643n5897k08371K37476
16560B138564k24345k72885L81769l33481k6300Q4292P4543m1340k63064M91449
16550B009202n37101k243J10957J10183j42268j75917K38000j04267N9053o2160
$$ plain form
16620 5379180 5242373 5265791 5058024 4972980 4834803 5011071 4666098 4708646 4410663 4271838
16610 4271838 4335441 4305984 4117659 4151424 4025012 4034296 3719520 3594315 3897978 3735071
16600 3735071 3570185 3696736 3681220 3358963 3271628 3245019 3562907 3348202 3168777 3154332
16590 3154332 2811367 3248904 3020263 2726057 2883524 2927361 2768562 2800406 2828336 2947486
16580 2947486 2622926 2629761 2568810 2311870 2493214 2123106 2324430 2526467 1968935 2144365
16570 2144365 2299756 2292522 2169068 2466251 2117333 2074713 2165356 2109459 1901088 2138564
16560 2138564 1914219 1641334 2023103 1689622 1663322 1747614 1822157 1780817 1517753 2009202
16550 2009202 1472101 1469858 1580815 1690998 1548730 1372813 1610813 1506546 1565599 1503439
16540A503439k25161q9934n689M95052k05704k15042L2443j00630K82905p7716
16530A393963K31935n75870M15314k75507O9815O2420K06109p61018N25579j8079
16520A274661j31030J81517O9549K26291n13149j46311j31397K83366J35179m38626
16510H10050m1166L56102K8682j87035j9391k20144O25863E33563N03033K05248
16500A241844D84817M77994M8949P6641m25695J06616p1418K70956M4042j80793
16490H32109k91099J41573j78247M16491J05072k27165N9730L03576k91484J20682
16480I91238j3275l83760L63375O164l42759J10843j46494K31192J454R8347j83383
16469G32942j36268K48251j73586j13917J54592k91522L95029o3773l0338R4905
$$ plain form
16540 1503439 1278278 1188344 1182655 1677707 1472003 1256961 1289404 1188774 1471679 1393963
16530 1393963 1625898 1050028 1465342 1189835 1259650 1322070 1528179 767161 1292740 1274661
16520 1274661 1143631 1325148 1394697 1620988 1107839 961528 830131 1113497 1248676 810050
16510 810050 768884 1124986 1153668 966633 947242 727098 1352961 533563 1036596 1241844
16500 1241844 484817 962811 1011760 1088401 662706 769322 697904 968860 1012902 832109
16490 832109 541010 682583 504336 920827 1025899 798734 858464 1162040 870556 991238
16480 991238 977963 594203 957578 963742 620983 731826 585332 816524 817978 916325 732942
16469 732942 596674 844925 671339 557422 712014 420492 815521 751748 721410 816315
16459H16315k06105K31561j23620j64548k13573J83922j8622j40843M9643J86393
16449F00523L72702k78530Q476j26659K09803q3280B31731L93387J7691o2787
16439E80022J98280r5076j59587k47716J43354J19684J10938B61568L03749j71588
16429C93729K26651p5670k44930L21946C04865K10072j57966A41547K01058J99404
16419E42009j48004K43314p3170k18821J18917L06987B12546K5395O12313k94976
16409E55278j9117n9878L02598k2447q1080j40953j15510O9855M1906k05447J93069
16398E18274j82647N2557A75581N42090l00288K78632j79955K61316k79022k12292
16388B86062O3358K34227l2558A61469J4286K39032A44735K51486j12699J77611
$$ plain form
16459 816315 610210 841771 718151 553603 340030 523952 505330 364487 414130 600523
16449 600523 973225 694695 703171 576512 786315 703035 231731 625118 642809 580022
16439 580022 778302 683226 523639 275923 419277 538961 649899 261568 565317 393729
16429 393729 620380 544710 299780 621726 304865 514937 356971 141547 342605 542009
16419 542009 394005 637319 564149 345328 464245 771232 212546 237941 850254 555278
16409 555278 536161 476283 778881 756434 675354 534401 418891 488746 530652 325205 518274
16398 518274 335627 388184 175581 717671 417383 696015 516060 777376 498354 286062
16388 286062 349420 583647 551089 161469 175755 414787 144735 396221 283522 461133
16378D61133B01221M00162r7311P9594k30085M5416M3199j67087J83489k25424
16368B33174K29034K6717M6565K03738k13353q5450k11460G5067J68659C5180
16357D74800q4781K22729A93086K50283J03972k26606K57352k1109B65837L54943
16347F20780C05270k7022R774K47514j17845p0860j61641B2461O14648k90970
16337C46139n0282j35139M82462A58456K5781o9545J75671P8209Q7531B11819
16326C66693A21590J78026K03760M9720j79776J26046j44077J27946A03327K95022
16316C98349R9576q6236J1491j68624L82812k01238j68454K2518G6983K65618
16306C42601q7937J04696l5780R8374j05134J99236j5399C4590M56635k05663
$$ plain form
16378 461133 201221 601383 504072 583666 353581 398997 442196 275109 458598 233174
16368 233174 462208 488925 535490 739228 525875 440425 228965 75067 243726 35180
16357 474800 390019 612748 193086 443369 547341 320735 578087 556978 265837 620780
16347 620780 305270 278248 288022 535536 417691 346831 185190 22461 637109 346139
16337 346139 295857 160718 643180 158456 184237 114692 290363 368572 456103 211819
16326 366693 121590 299616 503376 553096 373320 499366 355289 483235 103327 398349
16316 398349 497925 411689 423180 254556 637368 436130 267676 290194 76983 342601
16306 342601 254664 359360 323580 421954 316820 516056 500657 34590 491225 285562
16296B85562J64592l7967q4366A38917Q0581L57546m7043A52077K73029Q4581
16286E09687B52474h794D33870H5139L10237A02675L59966j71239K36130k49265
16276B78267p8940K10520G7863N4582K9421L16701m4217j12955J66303A19026
16265C20888o7397M5810c67685C12799K0354K1005Q6454j62212K4912l2198m5455
16254B25659m5371J47827A221M50421B02285K06233A660a9995B22899M5343J05763
16243C74005H6291A7475L67711j28655J51207A02998J03009L8961L17166h620
16232B10955P276P5650A11149j5338a1940H5872M04064A84346a26359B38510J40078
16221C78588j67431n2653R7301m5053h6549A07463J883J44876C0142J93782J973
$$ plain form
16296 285562 450154 412187 327821 138917 219498 577044 530001 152077 425106 509687
16286 509687 252474 -8794 433870 85139 395376 102675 462641 291402 527532 278267
16276 278267 199327 409847 77863 132445 161866 478567 434350 321395 487698 119026
16265 320888 253491 299301 -367685 312799 333153 354158 440612 278400 303312 271114 225659
16254 225659 180288 328115 1221 451642 202285 408518 1660 -19995 222899 268242 374005
16243 374005 86291 17475 385186 256531 407738 102998 206007 244968 562134 -8620
16232 210955 218231 293881 111149 95811 -11940 85872 489936 184346 -126359 238510 378588
16221 378588 211157 158504 255805 210752 -86549 107463 109346 254222 30142 223924 225897
16210B25897m7418J59489m7325A5031M02618j91554m3497B7573L22330c0136C29198
16198A17754l1112P8716C3696R2039K4479D0197K29311p4619J6337a5240r4866
16187a10106B55581D9629K14677J75980A55966a79278F5080L8783D1009K49720
16177B90729l2596A26774L14910A86848C1897d9206H8512j1673K89015J1877a31534
16165B10144m1118a87155h035A624J5975O6861J57830E5410j0200J95111O0539
16154C00860c40732C56754a99354I2870m589J66817c95240G9028a4331G9706J18677
16143A98383J43433p0834a96765A33994C6275a05974L9810l862j15988k2610J5428
16132a93196B45639c68978f5463F9283L17505j70538m4768F745J6268J39119a1296
$$ plain form
16210 225897 178479 337968 290643 15031 417649 226095 182598 27573 349903 -30136 329198
16198 117754 86642 165358 33696 125735 150214 40197 269508 194889 211226 -15240 -110106
16187 -110106 255581 49629 264306 440286 155966 -179278 65080 103863 41009 290729
16177 290729 258133 126774 441684 186848 31897 -49206 88512 76839 365854 377731 -131534
16165 210144 169026 -187155 -8035 1624 17599 84460 242290 55410 45210 240321 300860
16154 300860 -340732 356754 -199354 92870 88281 255098 -395240 79028 -14331 79706 198383
16143 198383 341816 270982 -196765 133994 36275 -105974 -66164 -70026 -186014 -208624 -193196
16132 -193196 245639 -368978 -65463 69283 386788 216250 171482 6745 23013 162132 -11296
16120B3379O630J71088I8871J31774q1645K1304c79192J36702G2716L49733a05536
16108F0553e0462m8428A58791B3239N7866O5365J20092E5083J1318L44203j05438
16097C05166q4570l757e2222A09149l3628R3616b37017F4305L61941a04821D6936
16085I8256K21548A51544b26878A1904J26244a4533m4233A03447A1708a61310
16074A43285a32435A80460b12547G2731j1106Q8439R2425C4177g8126a9809N323
16063a4486j78483A46026m6906b50749M7061A17826J98747k0230m5951M987F4075
16051G5595i4541F1596a96745k8061j78996a0142C25741a50463g4544k5996j08851
16040b09391G9289b65424A81355b6427E254a53483N4341A74234E0607P1048b7453
$$ plain form
16120 23379 30009 201097 98871 230645 149000 170304 -379192 -242490 72716 422449 -105536
16108 60553 -50462 -98890 158791 23239 81105 146470 266562 55083 66401 410604 305166
16097 305166 220596 216839 -52222 109149 75521 169137 -237017 64305 426246 -104821 46936
16085 98256 319804 151544 -226878 11904 138148 -14533 -58766 103447 11708 -161310
16074 143285 -132435 180460 -212547 72731 61625 150064 242489 34177 -78126 -19809 -14486
16063 -14486 -192969 146026 99120 -250749 -203688 117826 316573 296343 250392 255379 64075
16051 75595 -94541 61596 -196745 -224806 -403802 -10142 325741 -150463 -74544 -100540 -209391
16040 -209391 79289 -265424 181355 -26427 5254 -153483 -99142 174234 50607 121655 -27453
16028a86410q4461a19768n248A46368B8241b73643g1641b6096B48265a56954q1346
16017b38300P7459G3099i7633j12137R7666r9865B14242d9329D9652d7954j19493
16006a67447B75010a34675l64810a92752H3791c94996J04557B27196A0604Q772
15996A9376c07907J49303A7709L2703K4426b5720k9477j59317I9982D2338e1537
15984d7503m7104b0700A91451e5876l1762j09781D622h67A8975J3107a58567B3944
15971c62888P3531A61160e5141j66795H6768b4301G8577a14896N6117F7800Q6586
15960A54386J35354i6674J2152l44473J08962c0706B60863b349l4946j61120G0791
15948c07330A37525a1616B66599b17649Q4000E1943M971a60170A1648b39389K3962
$$ plain form
16028 -186410 -270871 -119768 -125016 146368 28241 -273643 -71641 -26096 248265 -156954 -238300
16017 -238300 -160841 73099 -97633 -209770 -112104 -211969 214242 -49329 49652 -47954 -167447
16006 -167447 275010 -134675 -499485 -192752 83791 -394996 -290439 227196 10604 19376
15996 19376 -307907 -158604 17709 50412 74838 -25720 -55197 -214514 99982 42338 -51537
15984 -47503 -94607 -20700 191451 -55876 -87638 -197419 4622 -867 18975 32082 -158567 23944
15971 -362888 -289357 161160 -55141 -221936 86768 -24301 78577 -114896 -58779 67800 154386
15960 154386 289740 -96674 -84522 -428995 -320033 -30706 260863 -2349 -37295 -198415 70791
15948 -307330 137525 -11616 266599 -217649 -133649 51943 56914 -160170 11648 -239389 -215427
15937b15427B2563i2682j55953j49601J53677c3291i533j36899m6375j70582J1549
15926c51840J50933a4539j62779Q0199A84597b22212B01816g8339n6766b8269
15915H9347L36676c1804k3170j70302F8956b8364o9797k05107C04693F569a453
15903a76044c039m3225a4449E0940a8731l6541I2859D697J84373A1626O1856h7235
15890C4931J41509H8023c04620f0659A36196M3926e806m11998C83464j38892c95325
15878B21828a53242L1247A64788J40726a09820g154p9236C627b50433a7988j51965
15867a69953E1284B4414N0018e792F9873i8414J6651K6222p7711A59747a13981
15855a43232A37139a11126A56565L6368a58726A41717I267g036G5027N860R6947
$$ plain form
15937 -215427 22563 -92682 -248635 -398236 -244559 -33291 -9533 -146432 -192807 -363389 -351840
15926 -351840 -200907 -14539 -177318 -97119 184597 -222212 201816 -78339 -135105 -28269
15915 89347 426023 -31804 -54974 -225276 68956 -28364 -98161 -303268 304693 6569 -1453
15903 -176044 -3039 -46264 -14449 50940 -18731 -55272 92859 4697 189070 11626 73482 -87235
15890 34931 176440 88023 -304620 -60659 136196 180122 -5806 -417804 383464 244572 -395325
15878 221828 -153242 -121995 164788 305514 -109820 -7154 -86390 3627 -250433 -17988 -169953
15867 -169953 51284 24414 74432 -5792 69873 -98414 -81763 -55541 -133252 159747 -113981
15855 -143232 137139 -111126 156565 192933 -158726 141717 9267 -7036 75027 80887 177834
15844A77834N740b87138A17269a83549f9384C00192C5653d051B6223g4302o9344
15833a43646e1126J7093h08B03896J05072c97643A93900H5232E534f6705m7492
15822a14197B4998J89875A8290R0843l0072J54081a6366A16388a70290o1451L4357
15811a97384a0293j64402H4265b64052P0755f4847A46564a11940k1386N7933b5356
15799e2173r1492A66524h9080B85151E3794g9851k53702R2239A75525a32546a3734
15787B88241D0713b14665j25149E7933b59907j37933E6271a36200C10421b18064
15776c3962A9324L47346i3321j91856J01932H3886c22953F967Q6058f1612j02599
15765a64211C6504b35930A05449a39239A0832J39192B529e1670G9904c53865M2525
$$ plain form
15844 177834 183574 -287138 117269 -183549 -69384 300192 35653 -4051 26223 -74302 -143646
15833 -143646 -51126 -34033 -808 203896 308968 -397643 193900 85232 5534 -66705 -114197
15822 -114197 24998 214873 18290 109133 79061 233142 -16366 116388 -170290 -231741 -197384
15811 -197384 -10293 -174695 84265 -264052 -193297 -64847 146564 -111940 -133326 -75393 -25356
15799 -52173 -143665 166524 -89080 285151 53794 -79851 -333553 -241314 175525 -132546 -13734
15787 288241 40713 -214665 -339814 57933 -259907 -397840 56271 -136200 310421 -218064
15776 -33962 19324 366670 -93321 -285177 -183245 83886 -322953 6967 93025 -61612 -164211
15765 -164211 36504 -235930 105449 -139239 10832 150024 2529 -51670 79904 -353865 -311340
15754c11340C4626K80959j53914A27c79981E4631a4806p4165L2849k1418p6648
15743a54188B36708a25467c9025H584d2081k6897n8613m3484A99579h5343j412
15732h6755k712j18730B61250a67111H4620c39455a06328K9662m2393F054K44238
15721B50292c31079q3774h9661A2796L6164J01468a3198k11043l3149H5489J01129
15710A86618a74938B9197b9216k79346O2888D2763b61592Q9545q1958C9392b04236
15698b7895j12817j36536e9655k52687D7810h1269C4719J02127a3596p3329p5699
15687a62624M1692o1975E1457b89892B89872i5872A06204E2279J12732A0219f4316
15675a92063A13057g2679A8853q049a95749M8366A25350l6767K70819d9880j35298
$$ plain form
15754 -311340 34626 315585 161671 127 -379981 54631 -14806 -88971 -56122 -77540 -154188
15743 -154188 236708 -125467 -39025 8584 -42081 -68978 -127591 -171075 199579 -85343 -86755
15732 -86755 -89467 -208197 261250 -167111 84620 -339455 -106328 -76666 -119059 6054 250292
15721 250292 -331079 -414853 -89661 12796 48960 150428 -13198 -224241 -257390 85489 186618
15710 186618 -174938 29197 -29216 -308562 -245674 42763 -261592 -172047 -254005 39392 -204236
15698 -27895 -140712 -277248 -59655 -312342 47810 -81269 34719 136846 -13596 -86925 -162624
15687 -162624 -120932 -182907 51457 -289892 289872 -95872 106204 52279 165011 10219 -64316
15675 -192063 113057 -72679 18853 10804 -195749 -147383 125350 88583 359402 -49880 -185178
15664a85178k6684a418I6452J23865K9833a35120m8365j35629C84209e0080m1429
15653i1509j80751A62555d15207c0539j9872B34670A2752e8577k79606A49271
15642H6299K25265a7647o6342c6770k48895J6875f8026R204j62185A75319b21897
15630b17566F6421L7567L8206g5642A38236A7137a67352o605A99462a38243m6738
15619a84981h1636H0474b53102R3385L2338C0129b07866C48823b52945J07336
15609a45609g907j20300A48827a74376c9106K171k57636n5511f6740m7678B08466
15597b39084A8751i9807G8220g6230j5249L2200B22629a23184B73039a31116A8881
15585A07999P5788b98865g9751k52973a32998j50023O3240F1981b34452j5771
$$ plain form
15664 -185178 -211862 -1418 96452 220317 250150 -135120 -183485 -319114 384209 -50080 -91509
15653 -91509 -272260 162555 -415207 -30539 -50411 234670 12752 -58577 -338183 149271
15642 86299 311564 -17647 -83989 -36770 -285665 -268790 -68026 -58822 -221007 175319 -221897
15630 -217566 66421 103988 142194 -75642 138236 17137 -167352 -173957 199462 -138243 -184981
15619 -184981 -81636 80474 -253102 -159717 -127379 30129 -207866 348823 -252945 -145609
15609 -145609 -7907 -128207 148827 -174376 -39106 -36935 -294571 -350082 -66740 -114418 208466
15597 -239084 18751 -99807 78220 -76230 -91479 -59279 222629 -123184 273039 -131116 18881
15585 107999 183787 -298865 -79751 -332724 -132998 -283021 -219781 61981 -234452 -250223
15575b50223a19176A04768k5022c90706J05473G508K73755a46816J0538d1447
15564A30103j8287O6840L4272p0661b751j20560B7501d9009B71545a41933k46128
15553c88061J93648E0018R7035J11708a58307o6440B12823J38303a21795A47393
15542I339g3658A43896a37214A29250J40010q7565a28091j71573g8668J2296B25577
15530F8824J4626a67838A13799f1205E8831K66591A255a05607A52722J6860L1468
15519B01050a84550E29804a9045C0666Q7894P9885q6683P8673P3957h1854b2539
15507A5090L16493b54580h6534A6249c7147C00330A1336a01575A58360c7677A09309
15495b97190A51883b496B15854K18356A85895H1020b70115O1620N3200A04809
$$ plain form
15575 -250223 -119176 104768 79746 -390706 -285233 7508 281263 -146816 -136278 -41447
15564 130103 111816 178656 212928 142267 -2751 -123311 27501 -49009 271545 -141933 -388061
15553 -388061 -194413 50018 147053 258761 -158307 -224747 212823 351126 -121795 147393
15542 9339 -73658 143896 -137214 129250 269260 181695 -128091 -299664 -78668 -66372 225577
15530 68824 83450 -167838 113799 -61205 58831 325422 1255 -105607 152722 169582 201050
15519 201050 -184550 529804 -19045 30666 118560 198445 111762 190435 264392 -81854 -22539
15507 15090 331583 -254580 -86534 16249 -37147 300330 11336 -101575 158360 -37677 109309
15495 -297190 151883 -2496 215854 434210 185895 81020 -270115 -208495 -155295 104809
15484a80797j85580i3187c3104D02023c30308i9062L6901j3414B8170b24236c1197
15472b1344o4885B29224A510c31747B01616f3012J4214n0923k5695A81684n7027
15461A24657k5236K38880j69066K4326b2563m6652A27412o1169P6261C2574d1930
15449b05980A25116e596A10007b7315A16247b8433B01356a4539A62019n547Q021
15438A64493a55713F1567b96710B47344j01826d15073J39679p7699A09898i2059
15427B1068L26895f419l811n3428l0636h291A00896J56656a11235F1439K78144
15416C39583c71421E7576f57o2217A42454Q2607q2971j7651g7890g590l88553
15405c96143a19382l01405J54712K7917N6021A65905B4377H821a35619j80624
$$ plain form
15484 -180797 -366377 -93187 -33104 402023 -330308 -99062 -62161 -75575 28170 -224236 -31197
15472 -21344 -86229 229224 1510 -331747 201616 -63012 -48798 -99721 -125416 181684 124657
15461 124657 99421 338301 169235 193561 -22563 -69215 127412 66243 142504 32574 -41930
15449 -205980 125116 -5596 110007 -27315 116247 -28433 201356 -14539 162019 156472 164493
15438 164493 -155713 61567 -296710 247344 145518 -415073 -275394 -353093 109898 -92059
15427 21068 347963 -6419 -10230 -63658 -94294 -8291 100896 257552 -111235 61439 339583
15416 339583 -371421 57576 -657 -62874 142454 225061 142090 124439 -77890 -7590 -396143
15405 -396143 -119382 -420787 -266075 -238158 -182137 165905 24377 8821 -135619 -316243
15395c16243A44280P107g8403C02292i679D5956k0576g4569k1854B89117b4939
15383e82556b3191C7777a96313c7868j36305C8262a54949D43613G6153b66566
15372a41896G9193J99058G4223J23045K0544R809h2515q4958D1450q227K22879
15361B56102A2874M10333b9661r6218A98812n1275a05187L8975F3198a19518k966
15350a22484L8612l08689d6713j92665B44127J84892h508A3820R7734n5551d3752
15338B17007C531M4970a47905b2600r035o4343d773l36478A55687d0239A24904
15326A76826q2012k3605a74162D6416f7977B51011j01656M6636j5874a79971N1897
15315a28074A20148B4805O3503M7422a11440j39789b0905B46387I1506i8701C17183
$$ plain form
15395 -316243 144280 151387 -78403 302292 -9679 45956 25380 -74569 -96423 289117 -24939
15383 -582556 -23191 37777 -196313 -37868 -174173 38262 -154949 443613 76153 -266566
15372 -141896 79193 278251 74223 197268 217812 227621 -82515 -167473 41450 33223 256102
15361 256102 12874 423207 -29661 -125879 198812 147537 -105187 -66212 63198 -119518 -122484
15350 -122484 -83872 -392561 -46713 -239378 244127 429019 -8508 13820 111554 56003 -43752
15338 217007 3531 48501 -147905 -22600 -31635 -95978 -4773 -341251 155687 -40239 124904
15326 176826 94814 71209 -174162 46416 -67977 251011 149355 195991 180117 -179971 -128074
15315 -128074 120148 24805 88308 135730 -111440 -251229 -20905 246387 91506 -98701 317183
15303a52190B15595n7338a2352L799A43928K09080g7258E1046a27647A06091b15788
15291d1294H8047L88095k05434F5295R8455F2737k0233a60634C34352A27475a51515
15279a29629A37727e0977A22436K42680G1992A5493K1577J4232L1811J9135J56201
15268B58449j26445K69968c3438p7676A78733k0786a756o0000a8023A51159P5643
15257B26802L832a54201A2974K1885J90592f710D26543j70543M68816P18191Q93951
15246B336958o55603L9101J77681C85666E0704O8172J92983p6088d7141A37063
15235A17879n1366j2947d58053f4771D31297O917j80765J8337E9570b76964B5218
15223E7784N331L1829A6045a10502D1169J75260I0092J52378c25722I8775A7339
$$ plain form
15303 -152190 215595 158257 -12352 -8553 143928 353008 -77258 51046 -127647 106091 -215788
15291 -41294 88047 476142 270708 65295 163750 62737 42504 -160634 334352 127475 -151515
15279 -129629 137727 -50977 122436 365116 71992 15493 37070 51302 83113 102248 258449
15268 258449 132004 401972 -33438 -111114 178733 157947 -1756 -61756 -18023 151159 226802
15257 226802 230634 -154201 12974 34859 225451 -6710 426543 256000 724816 1443007 2336958
15246 2336958 1681355 1720456 1898137 385666 50704 118876 311859 235771 -47141 137063
15235 117879 66513 53566 -458053 -64771 431297 438214 257449 275786 59570 -276964 25218
15223 57784 63115 94944 16045 -110502 41169 216429 90092 242470 -325722 98775 17339
15211A23864n7363c2135B97269H8496L00372m8520N2406a08970A95500a76558
15200D335J38147F5994k8189N52250h7664j15994i1077A82841g0540I8042K9827
15189A27869M11133B56237a61918B4943b5368r8594B40810K5194A03821H580R0160
15178I8740i6459C39009H7922h2054A65564A6956J47460j0362b9451J773j87556
15167b15234Q1240H2240i3606j76698B56983C3072K30883B7461a02621D13814
15156a36837C55897j40060c51238I7111a8478A08647O7603a6915A34072J84349
15146C18421A42662R6260G114J46834L90131E0462K28547G2154f6717B37974j2549
15135B25425q0115J07794A1689L81351A47118i602B39232r4842L44479A75909
$$ plain form
15211 123864 66501 -32135 297269 88496 388868 340348 392754 -108970 195500 -176558
15200 4335 142482 65994 37805 590055 -87664 -203658 -91077 182841 -70540 98042 127869
15189 127869 539002 256237 -161918 24943 -25368 -123962 240810 266004 103821 8580 98740
15178 98740 -96459 339009 87922 -82054 165564 16956 164416 154054 -29451 -27678 -215234
15167 -215234 -133994 82240 -93606 -270304 256983 33072 263955 27461 -102621 413814
15156 -136837 355897 215837 -351238 97111 -18478 108647 176250 -16915 134072 318421
15146 318421 142662 238922 7114 153948 544079 50462 279009 72154 -66717 237974 225425
15135 225425 145310 253104 11689 393040 147118 -9602 239232 144390 488869 175909
15124C03649J4188J9663j01459n2644a48206k4905B82643g6388B57769J32232
15114C90001E6268a9995n2410D30612A46744o7726e7401C54382A73399n2542c7014
15102a60645A55130L1565b45671E4415J98908J91865a18578A5080K70781J62915
15092D48776j29041a18935m0374C58179C4222P5627J4929J65099A00806b570A79313
15080A96596O7336f3608n334E2912K06131f1780C86261e3649F45613A77617J9883
15069A97500J05372c7166A10760C6397M39893k21900H6956J48919a42568A36823
15058A97664K32979P3036B49357F6120a73640a7205o7431A91997c4773A93088
15047A03711K93923j13334n3204o5130J56896o5561m8464O3512n5975J41440A40891
$$ plain form
15124 303649 317837 337500 236041 183397 -148206 -173111 282643 -76388 257769 390001
15114 390001 56268 -19995 -72405 430612 146744 79018 -57401 354382 173399 120857 -37014
15102 -160645 155130 186695 -245671 54415 253323 445188 -118578 15080 285861 448776
15092 448776 319735 -118935 -159309 358179 34222 109849 124778 289877 100806 -2570 179313
15080 196596 263932 -63608 -68942 52912 259043 -61780 386261 -53649 645613 177617 197500
15069 197500 302872 -37166 110760 36397 476290 254390 86956 235875 -142568 136823
15058 197664 430643 503679 249357 66120 -173640 -17205 -84636 191997 -34773 193088
15047 103711 397634 284300 231096 165966 322862 257301 208837 272349 216374 357814 140891
15035C93597j91215J77580A46175D5075a29092c7150D60581k28026n2732a9803
15024D08091j74355o5227O9820A11741K38803d1216A23869j7351L51465A31982
15013H264K80245O6873c7689A64761J25102O4434p673l7905A37717R302D5208
15001G5437L15681A60322E5038K15108n4551O1122j04871a2200j38880C33120
14990B28702J55045J28990H2068L58027A47716K3916J96599A20792O2084J54450
14980C37326b2972C58597m4134k9146A0310K74392l6655K3357E3406J87759K0667
14969B61832M8269M491G479L04838I1388L06717m0081A44073M44703j02829B10183
14957B04607p082k0139n3171J51485A12369J14748K39039j42979j8251b61442
$$ plain form
15035 393597 202382 379962 146175 45075 -129092 -37150 460581 232555 179823 -19803
15024 408091 233736 168509 238329 111741 350544 -41216 123869 106518 457983 131982
15013 8264 288509 355382 -37689 164761 289863 354297 346624 308719 137717 147019 45208
15001 75437 391118 160322 55038 270146 215595 276717 171846 -12200 -151080 333120
14990 228702 383747 512737 82068 440095 147716 171632 368231 120792 182876 337326
14980 337326 -22972 358597 314463 285317 10310 284702 248047 271404 53406 241165 261832
14969 261832 310101 314592 7479 312317 91388 398105 358024 144073 588776 485947 210183
14957 204607 197525 177386 124215 275700 112369 227117 466156 323177 304926 -261442
14946D05940A03081P0508G0336N4346L50621j46318J70014B32466L00780E7832
14935D98797j78551n0634j7861M0931o361A20280b3018B52071J99830A86383K81802
14924D68185l6677j84889r6512J30554K91986H7904J81015A5277J35816q207n3968
14913H8918L04632L4433g5305D17996A73710J42402M11056B19962J4928P2968
14903C07858a1295E64179A82308M73368j14810j80665A53359P0639O2161N02550
14893G88709B31502M5951J58639j37682K53825j32849j31248K60998l5492q9215
14883D24429I8946J42619K57785D1982O48682B36931K3555K1286J86459A36261
14872C94222J14248m0092J20989k42463O9722J23059k9980A38534L58327k41112
$$ plain form
14946 405940 103081 173589 70336 124682 475303 328985 498999 232466 533246 57832
14935 498797 320246 269612 251751 292682 286321 120280 -23018 252071 451901 186383 468185
14924 468185 431508 246619 150107 280661 572647 87904 268919 15277 151093 142886 88918
14913 88918 393550 427983 -75305 417996 173710 316112 727168 219962 234890 307858
14903 307858 -11295 564179 182308 655676 540866 360201 153359 223998 286159 788709
14893 788709 231502 277453 436092 298410 552235 419386 288138 549136 513644 424429
14883 424429 98946 241565 499350 41982 690664 236931 260486 281772 468231 136261
14872 394222 508470 468378 589367 346904 416626 539685 509705 138534 496861 255749
14862B55749J75539O4644j47915P5789j33256L42545k72019N9357J22979J59513
14852G02925J83328C16748L8758m3663J93010o4499J28214J99222B19254M41556
14842F60810r2892k72090L63047A68170n1558M64237J3368A50701N09245B58592
14831E98818k01759M6836L37608l55112J42914J23435J71315k00066k51026P7306
14821D90269L54103B97595O3665j58376J53046J89965J28434k22642O4556O4316
14811E80559k72023K07935J85844n1251j53980n3575P576A89470K28752R9398
14801E17620k12839J89076N3649J47895k02778J91994j48695j51872K39933K6220
14791F50203B79260M62714k13199M07619k15168l02224L60432m7185p1226l6612
$$ plain form
14862 255749 431288 495932 348017 423806 290550 633095 361076 420433 543412 702925
14852 702925 886253 316748 355506 311843 504853 440354 568568 767790 219254 660810
14842 660810 567918 295828 658875 168170 116612 580849 594217 150701 659946 258592
14831 598818 397059 443895 781503 426391 569305 692740 864055 663989 412963 490269
14821 490269 844372 297595 361260 202884 355930 545895 674329 451687 516243 580559
14811 580559 308536 516471 702315 651064 497084 443509 451085 189470 418222 517620
14801 517620 304781 493857 547506 695401 492623 684617 535922 384050 623983 650203
14791 650203 279260 741974 528775 936394 721226 419002 779434 732249 661023 624411
14781F24411J79196q3173n1469m9970J23744J67411j09180r7502J27440k46160
14771E84748P2521M7511k44748J41191K08142j93811j71321M32034C49791N70432
14761I20223j73697n0826J32803l90849L82158k74500p7785L46877n2062l9057
14751G23285k0118J07384l54765J16020M01439J8711j3037J43646D13736K39886
14741F53622o2745L56955k1927k62260j9727K01452O4300l20003K49170C62424
14730G11121j9886K10791j59837J8081k26946N15280k11884j26539K34489J18632
14720A063302j04432p4642l30397L23436L7808O5342j77252J40082J8208k32190
14710G29265M1456r8592o5980L11210j21133M15604n96777R9479K22659l63254
$$ plain form
14781 624411 803607 720434 668965 618995 742739 910150 800970 703468 830908 584748
14771 584748 657269 704780 460032 601223 809365 615554 444233 876267 349791 920223
14761 920223 746526 695700 828503 437654 819812 545312 467527 814404 762342 723285
14751 723285 703167 810551 455786 571806 973245 991956 978919 1122565 413736 653622
14741 653622 590877 947832 925905 663645 643918 845370 909670 589667 838837 362424
14730 711121 691235 902026 742189 760270 533324 1048604 836720 710181 944670 1063302
14720 1063302 958870 884228 553831 877267 915075 980417 803165 943247 961455 729265
14710 729265 770721 672129 606149 917359 796226 1211830 615053 714532 937191 573937
14700E73937Q71623n35900M4079J88985K52420o22143J11126L43422l36061m3241
14690H48247K72697l48498L08804k47882K31048n0568J76995L3813k25342R1016
14680A090330L2831m2985J7252P9325j7822k84166K10523J57051j0049j39458
14670A092832o4574J10587j89315K15676M1640P6368k99722K14676M3458m36882
14660H04744M21484k52335L55899n5227l5859N9145k12317K59388k63009J70331
14650A252244k20278K30393k00775M78809p6847j80275p4995J60533j35363J84535
14640A417981m5733J45210k58067p1894j6801j60212K93438J19315k36886j36914
14630A049437K97815n4026K58632M5556l07504N64971n9782l54431k32786M16373
$$ plain form
14700 573937 1445560 909660 953739 1142724 1395144 773001 884127 1227549 891488 848247
14690 848247 1120944 772446 1081250 833368 1064416 1013848 1190843 1224656 999314 1090330
14680 1090330 1123161 1080176 1097428 1176753 1158931 874765 1085288 1242339 1232290 1092832
14670 1092832 1028258 1138845 949530 1165206 1206846 1283214 983492 1198168 1241626 804744
14660 804744 1226228 973893 1329792 1274565 1238706 1297851 1085534 1344922 1081913 1252244
14650 1252244 1031966 1262359 1061584 1540393 1463546 1283271 1208276 1368809 1233446 1417981
14640 1417981 1372248 1517458 1259391 1187497 1170696 1010484 1303922 1423237 1186351 1049437
14630 1049437 1347252 1293226 1551858 1597414 1289910 1854881 1795099 1440668 1207882 1624255
14620A624255J97815m09234J38257j74042J69294L77728m02046p049M95284n15818
14610A494444L91862j60679q6844L92729l90513Q0350L5799J74113j23421j32817
14600A675023K23954m40598O73732k70544k2724J89595l03477J9159J67460K94197
14590B205777j23185k55710K04798j50335L92365l78732L53167j28566o5426L94142
14580B448295k36028k27526J42727L9685L75437J854m75896M42531j00624j4084
14570B396371p8244j03752K79725K98884k30605q9711L41308k34093N23216k82540
14560B820559K24138J52250J39740l0949K97699m1078O12915M72516N99281M71310
14550E718381J177035K791951L824691Q539439J3510271J697041j5339498p688570
$$ plain form
14620 1624255 1822070 1412836 1551093 1377051 1546345 1924073 1522027 1514978 2010262 1494444
14610 1494444 1886306 1725627 1638783 2031512 1640999 1721349 1757148 1931261 1807840 1675023
14600 1675023 1898977 1458379 2132111 1861567 1838843 2028438 1724961 1744120 1911580 2205777
14590 2205777 2082592 1826882 2031680 1881345 2273710 1894978 2248145 2119579 2054153 2448295
14580 2448295 2212267 1984741 2127468 2167153 2542590 2544444 2068548 2511079 2410455 2396371
14570 2396371 2318127 2214375 2494100 2792984 2562379 2472668 2813976 2579883 3103099 2820559
14560 2820559 3044697 3196947 3336687 3305738 3603437 3562359 4175274 4647790 5247071 5718381
14550 5718381 6895416 9687367 13512058 22051497 35561768 37258809 21919311 14230741
14542A4230741o325122l534849r70390o25387q7232o20717K55747j03755P5762
14533B294798J60712j49488J70408j65375R6551J24315j61274M40989j34067j03406
14523B574163K0134L20439l38232o1676K91671K07935m54046N12474m93237O51503
14513C231128n07474J53207M51813l98051J00097K30716j53049L91071j95788
14504C303670L61152n5057o19893J98046J73250j22393L56898N7266l98546J43590
14494C397983N58406l47738j56016K10827q4823K28258j32488M85185j81129r6709
14484C881756j07601K94116J70845k63489M77217p2651q2528o6877m255l8295
14474D188238J89915M36549l66927L10975j73258O232J70682K28135j77726Q350
$$ plain form
14542 14230741 7905619 4370770 3400380 2774993 2687761 2067044 2322791 2219036 2294798
14533 2294798 2455510 2306022 2476430 2311055 2407606 2531921 2370647 2811636 2677569 2574163
14523 2574163 2594297 2914736 2576504 2514828 2806499 3014434 2560388 3072862 2579625 3231128
14513 3231128 2723654 2876861 3328674 2930623 3030720 3261436 3108387 3499458 3303670
14504 3303670 3664822 3609765 2989872 3187918 3361168 3238775 3595673 3652939 3254393 3397983
14494 3397983 3956389 3608651 3452635 3663462 3578639 3806897 3674409 4159594 3978465 3881756
14484 3881756 3774155 4068271 4239116 3975627 4452844 4380193 4297665 4230788 4226533 4188238
14474 4188238 4378153 4814702 4447775 4758750 4585492 4591724 4762406 4990541 4812815 4821165
14464D821165j59102L95616M4106k18250K13567K3469K59630L5372K55J64725
14454E580553K13760k24329k52839N03713J811k85186L48785Q3228J40818K28360
14444F338674J80208M743M6096l26407K66116N32229q5392k28264N6816J19550
14434F904369L11804q9752J91637N40667j84436l6292M465R7009j67420K89147
14424G861198L02078k89500M88687o7658P5117L26248n1020L84009K46695j65611
14414I110243L26053L00981l2113k3121O4199J22367J20582J21451L39632k8898
14404A0421376N83351J02984k24320K17753J93078L01056N16466k21961L95072
14395A2284855J60560j68869L55829K97402K94433J30598K50102L07780P8954
$$ plain form
14464 4821165 4662063 5057679 5101785 4883535 5097102 5120571 5380201 5415573 5415828 5580553
14454 5580553 5794313 5569984 5317145 5820858 5822669 5537483 5886268 5969496 6110314 6338674
14444 6338674 6518882 6523625 6569721 6243314 6509430 7041659 6956267 6728003 6784819 6904369
14434 6904369 7216173 7126421 7318058 7858725 7674289 7637997 7642462 7739471 7572051 7861198
14424 7861198 8163276 7873776 8362463 8294805 8369922 8696170 8645150 9029159 9275854 9110243
14414 9110243 9436296 9737277 9705164 9682043 9746242 9868609 9989191 10110642 10450274 10421376
14404 10421376 11004727 11107711 10883391 11101144 11294222 11595278 12111744 11889783 12284855
14395 12284855 12445415 12276546 12632375 12929777 13224210 13354808 13604910 13912690 13991644
14386A3991644M50373L57671K77061o5337K64427O22237Q9198L57713L95075J87420
14376A6927482M54890L93552J65760L68194L27573O32556P1715L89028P15218
14367B0445968k95021J019195L81329M15651M41089N23847N02821M93286N67190
14358B4495355M80487O04237O51042P37371N08240L76677J006356M10996M68735
14349B9739496Q06333J122203O45868J142980P83926O46237J051732J151558R06661
14340C7996994R02887J470938N69856J052632J320797J313763J090158J406788
14332D7124813J213662J326520K069243J496690J428136K014213J633922J969422
14324F0276621J964589K272280K029938K525897K373080K693947K737749K383769
$$ plain form
14386 13991644 14442017 14799688 15076749 15011412 15275839 15898076 15987274 16344987 16740062 16927482
14376 16927482 17382372 17775924 17941684 18309878 18637451 19270007 19341722 19730750 20445968
14367 20445968 20150947 21170142 21551471 21967122 22408211 22932058 23434879 23928165 24495355
14358 24495355 24975842 25580079 26231121 26968492 27476732 27853409 28859765 29270761 29739496
14349 29739496 30545829 31668032 32313900 33456880 34240806 34887043 35938775 37090333 37996994
14340 37996994 38899881 40370819 40940675 41993307 43314104 44627867 45718025 47124813
14332 47124813 48338475 49664995 51734238 53230928 54659064 56673277 58307199 60276621
14324 60276621 62241210 64513490 66543428 69069325 71442405 74136352 76874101 79257870
14316G9257870K994803L022711L561114L650375L517302L614403M281295M385655
14308A08285528M387649M495964N153168N340295N618250O126427O140467O900317
14300A52448065O978612P384817Q140756P919600Q805038R244755R911118J0081441
14292B20914202J0932316J1271140J2289537J2236698J2965768J3184916J3907789
14285C07702366J4246202J4629842J4492266J5025918J4561715J4573098J3996558
14278D09227965J3327594J2273255J0983294R405714P443831N134958K584148
14271D70380759J74797r43993k263469m395166n849202p107491r251462j0858469
14263D29886304j2952227j3609758j4857006j5304207j5400185j5374618j5398798
$$ plain form
14316 79257870 82252673 85275384 88836498 92486873 96004175 99618578 103899873 108285528
14308 108285528 112673177 117169141 122322309 127662604 133280854 139407281 145547748 152448065
14300 152448065 159426677 166811494 174952250 182871850 191676888 200921643 210832761 220914202
14292 220914202 231846518 243117658 255407195 267643893 280609661 293794577 307702366
14285 307702366 321948568 336578410 351070676 366096594 380658309 395231407 409227965
14278 409227965 422555559 434828814 445812108 455217822 462661653 467796611 470380759
14271 470380759 470555556 469611563 467348094 462952928 457103726 449996235 440744773 429886304
14263 429886304 416934077 403324319 388467313 373163106 357762921 342388303 326989505
14256C26989505j5065549j4699586j3866127j2394141j3077015j2639901j1919016
14249B33328170j1393995j0465131j0011970r594302r177568p902889p976464
14242A66805851p996738p169848o680167o290202o073513n271837n791018m901391
14234A16631137m623696n204626l647207l686825l822532l836992l505841l362581
14226H4940837l310290l249296k357706k447100k805857k472396k274442j940669
14218F4083081k399029k292046j745400j487920j589496j560177j701882j493891
14210D9813240j888254j021054j273872q70588j428901j071144j431518j057174
14202C9770735r01442j172179p00595j257184j075368q23873q52783o87749p69404
$$ plain form
14256 326989505 311923956 297224370 283358243 270964102 257887087 245247186 233328170
14249 233328170 221934175 211469044 201457074 191862772 182685204 174782315 166805851
14242 166805851 158809113 151639265 144959098 138668896 132595383 127323546 121532528 116631137
14234 116631137 112007441 106802815 103155608 99468783 95646251 91809259 88303418 84940837
14226 84940837 81630547 78381251 76023545 73576445 70770588 68298192 66023750 64083081
14218 64083081 61684052 59392006 57646606 56158686 54569190 53009013 51307131 49813240
14210 49813240 47924986 46903932 45630060 44759472 43330571 42259427 40827909 39770735
14202 39770735 38869293 37697114 36996519 35739335 34663967 33840094 32987311 32299562 31530158
14193C1530158o30217j097188m52723q32806m33577o59517n74377r01814o01067
14184B5346872o38599j83635q76106m73381L5037j026848n22764l77551l27973
14175B0955052l00910m28030m87134j90514p50006M14054r67214k89739k26011
14166A7729548k41028n05456p7634l38967n84506o1013n55585K73835p22933k75910
14156A4640351J44352l80932m31205j77045k53594j30951q1209l70968j26385
14147A2832414k42868k54884j52683K1111m68627l99891J3250r390j20862j35402
14137A1082168j90985l60496j41816j36582k09800k01387j02047p3445N5875o81785
14127I039700K73345O0543j34582j38876n4416k26042j44606j24933J68130n67338
$$ plain form
14193 31530158 30899941 29802753 29350030 28517224 28083647 27424130 26849753 25947939 25346872
14184 25346872 24708273 24524638 23648532 23175151 23210188 22183340 21660576 21283025 20955052
14175 20955052 20654142 20226112 19738978 19548464 18798458 19212512 18245298 17955559 17729548
14166 17729548 17488520 16983064 16905430 16566463 15981957 15920944 15365359 15639194 14916261 14640351
14156 14640351 14784703 14403771 13972566 13795521 13541927 13410976 13329767 12958799 12832414
14147 12832414 12589546 12334662 12181979 12203090 11734463 11334572 11347822 11338432 11217570 11082168
14137 11082168 10891183 10530687 10388871 10252289 10042489 9841102 9739055 9665610 9721485 9039700
14127 9039700 9313045 9373588 9239006 9100130 9045714 8819672 8675066 8550133 8718263 8150925
14117H150925L9068l92221J59846l70292j93677J56407M7241j49697j18039n4642
14107G274919K792j47052p6302l45123M5426l17251K29048j09217R8424n22883
14097F132781L53129k01100j16582j76697K28929j60402o6186k50348k64984k6840
14087E451700J47680L32619n78476J80522k06693k67660M04624j50247l19426
14078D994643J28334k21645j42683N94047o30396l5528Q9811J75993K3916k99544
14068D676948J45400n2646j92542l41238P26134n71822p7387J68043l99339q7077
14058C994474J95205o1725P0279j39124M5655n1647M0509j95882j28477J08512
14048C877779q7488j07466L04430p46791L67677k33861J91640J3807J38554j96046
$$ plain form
14117 8150925 8189993 7797772 7957618 7587326 7393649 7550056 7597297 7447600 7329561 7274919
14107 7274919 7277711 7130659 7054357 6709234 6754660 6437409 6666457 6557240 6655664 6132781
14097 6132781 6485910 6284810 6168228 5991531 6220460 6060058 5993872 5743524 5478540 5451700
14087 5451700 5599380 5931999 5353523 5534045 5327352 5059692 5464316 5314069 4994643
14078 4994643 5122977 4901332 4758649 5352696 4722300 4686772 4776583 4952576 4976492 4676948
14068 4676948 4822348 4769702 4577160 4235922 4962056 4390234 4312847 4480890 4081551 3994474
14058 3994474 4189679 4127954 4198233 4059109 4104764 4053117 4093626 3897744 3769267 3877779
14048 3877779 3790291 3682825 3987255 3240464 3608141 3374280 3565920 3579727 3718281 3522235
14038C522235R8419l23137J22494j33763J75551q6057p9214J70159k13654n1256
14028C201777K1852k78465J20831K25824l52477M30368o64111L19383k58077K7056
14018B793961N3205j62454K90672j79802P4583J61628n00189J4519J84473L25341
14008C055937p24109M85094l96345K75761l61156K31059K65228m76832P3636Q6537
13998B514810n8553r593J29964O9391k23374N16273p7580L48611J043232J179983
13988E433164L602185P043128J4588280P706905j3523371j0374005n225344k338647
13980F912295r91571j042387o56110o23563l269l10824L01942o72617o8400k17895
13970B627601J35954j97928L2147J89169l4327q9382J41o6604J50763m78003K10648
$$ plain form
14038 3522235 3620654 3297517 3420011 3286248 3461799 3375742 3296528 3466687 3253033 3201777
14028 3201777 3223629 2945164 3065995 3291819 2939342 3369710 2705599 3024982 2766905 2793961
14018 2793961 2847166 2684712 2975384 2795582 2870165 3031793 2531604 2546123 2730596 3055937
14008 3055937 2331828 2816922 2420577 2696338 2335182 2566241 2831469 2354637 2428273 2514810
13998 2514810 2456257 2446664 2576628 2646019 2422645 2938918 2861338 3209949 4253181 5433164
13988 5433164 9035349 16078477 30666757 38373662 24850291 14476286 9250942 6912295
13980 6912295 5920724 4878337 4222227 3598664 3595395 3284571 3586513 2913896 2845496 2627601
13970 2627601 2763555 2565627 2597774 2786943 2752616 2663234 2663375 2596771 2747534 2269531 2480179
13959B480179k26667R8219k46957j28506M14536P8674n42915m2814K30987k44219
13949A870517L31300l10981L61318l20352K74298j92657n7034L7473J87113l17702
13939A863293J04442j97333J58863m84741L77176n8802q5671L22282k40541p1112
13929A687856k03283J17141J57052j18726K79288n54588L13912L42474l71641
13920A649485k90038L79688k95587M07218j01993N7822n3875p9063k02337J56438
13910A627758j47551K89337k26840p312M194j24766J99017J38145n3562k03085
13900A495335K75203l86671k26050M79684K4288j8100l75762K25791m7168N83271
13890B029821l43219k64966J55617m35631K88907m3533R2882k436o02746L63759
$$ plain form
13959 2480179 2253512 2351731 2104774 1976268 2390804 2469478 1926563 1883749 2114736 1870517
13949 1870517 2201817 1890836 2252154 1931802 2206100 2013443 1956409 1993882 2180995 1863293
13939 1863293 1967735 1770402 1929265 1444524 1821700 1762898 1677227 1999509 1758968 1687856
13929 1687856 1484573 1601714 1758766 1640040 1919328 1364740 1678652 2021126 1649485
13920 1649485 1359447 1739135 1443548 1850766 1748773 1806595 1752720 1673657 1471320 1627758
13910 1627758 1480207 1769544 1542704 1535392 1539586 1414820 1613837 1751982 1698420 1495335
13900 1495335 1770538 1383867 1157817 1637501 1661789 1643689 1267927 1493718 1446550 2029821
13890 2029821 1686602 1421636 1577253 1141622 1430529 1386996 1479878 1477442 874696 1238455
13880A238455n8135l4680L73238k62144k8479k49927K89736K35995m66660j63802
13870H73597N91747q6324o06618J18926L05589q3101J451j46794L71856J83413
13860A523742n37754k1196q3814M29069q5536j93065J39595j16792r339q0333
13850I64577k98218M57858j15316M17732J02258k92475k2646l58813K65954Q7178
13840A208089k93217m1066j12062L80237m60175J31072J79116P1480j15925O7946
13830A015495j84806K38624l357k40001N5940J8188k27973K52762q03r5029r543
13819H19497K38247j49873O8282p0698k1694K40439j64017k36243P091K85699
13809A016730Q7146j07221j37065J46148k49309L3587q4743J658L28890j0318
$$ plain form
13880 1238455 1180320 1145640 1518878 1256734 1228255 978328 1268064 1504059 1037399 873597
13870 873597 1465344 1379020 772402 891328 1196917 1113816 1115267 968473 1340329 1523742
13860 1523742 985988 964792 880978 1310047 1224511 1031446 1171041 1054249 1044910 964577
13850 964577 666359 1124217 1008901 1426633 1528891 1236416 1213770 854957 1120911 1208089
13840 1208089 914872 873806 761744 1141981 681806 812878 991994 1063474 947549 1015495
13830 1015495 830689 1069313 1065956 825955 881895 900083 672110 924872 924069 829040 819497
13819 819497 1057744 907871 976153 905455 883761 1124200 960183 723940 731031 1016730
13809 1016730 1103876 996655 859590 1005738 756429 790016 705273 706931 1035821 1025503
13799A025503M5501p5200K18966l64770J00126R8303j85763j02077k02447L32110
13789H90252J48607k90522q0041M04855j54567k22411O2020k27277N42543m24740
13779F48719L05440m76743J34883K60092M0905m0685J36487k66485k02557L40115
13769H80171K45964k85954k21202Q9754M33543j88842l65321K64173l60702K12503
13759G04087J42901Q6595r6424j30160m2488j11113O44450k73672l7553k62495
13749F24128r864M2947Q4129j75131O06153n78508J81488J62728m60960Q4563
13739E61673j2620K7454J56922k78445K06819p0873n6223q3818L79057P1865M2855
13728I44666k26330o9162j00782J15226K70741m04833J26511J13508B54007L35996
$$ plain form
13799 1025503 1071004 995804 1214770 850000 950126 1048429 862666 760589 558142 890252
13789 890252 1038859 748337 668296 1073151 918584 696173 758193 530916 1073459 648719
13779 648719 954159 477416 612299 872391 913296 872611 1009098 742613 540056 880171
13769 880171 1126135 840181 618979 708733 1142276 953434 588113 852286 491584 704087
13759 704087 846988 933583 837159 706999 664511 553398 1197848 924176 886623 624128
13749 624128 614264 657211 741340 566209 1172362 593854 775342 938070 477110 561673
13739 561673 549053 576507 733429 454984 661803 590930 534707 450889 829946 901811 944666
13728 944666 718336 649174 548392 663618 934359 529526 656037 769545 254007 590003
13718E90003J32656j20311M6855j37201J62650J3044l997k75028K04806j40183
13708D73294j46965K80492K40412j5358l80158j63583L54544K9194j58424L3289
13698E46737k58368M24651J34070l30527K06038l39902R6276Q7339l7956N4133
13688E82491q936r980J41130j57368M17680B04696M48711j03628j18334J91485
13678F22930j80379A53148Q06696D50301P1228K5055k36435L89845j70477k14718
13668C14799L42498k25580M6919j72615M14620A75116O18199C52649K46117J60536
13658G59302C79108M60572m04732J18207j52098J52328B45701J85267n1862K45425
13648F24531l07558K00977j62964O7312O6027J50785j16270J51829k32018p3142
$$ plain form
13718 590003 722659 602348 649203 512002 674652 687696 683699 408671 613477 473294
13708 473294 326329 606821 847233 831875 451717 288134 642678 671872 513448 546737
13698 546737 288369 713020 847090 516563 722601 382699 478975 566314 528358 582491
13688 582491 573555 563575 704705 547337 965017 204696 653407 549779 431445 622930
13678 622930 442551 153148 959844 450301 521529 546584 310149 699994 529517 314799
13668 314799 657297 431717 478636 306021 720641 175116 793315 352649 598766 759302
13658 759302 379108 839680 434948 553155 401057 553385 245701 430968 379106 624531
13648 624531 316973 517950 354986 422298 488325 639110 522840 674669 442651 369509
13638C69509Q8121l3195J47036j32687q0061j45972L64616j95372J14609A03715
13627D77791K97150j84490j48463A09321L22499K2723j78302j04223K15247J39120
13617E26385A29341K28748M48710C86197N3366q6637J64548M620p4819J80283
13607F27558P0550B95212M9395Q5692n5912j02665K56273j33222j50148K99751
13597E44376k59234K90924j55702j47963J11012j20868m7638K88238j46868J02397
13587D58674J89404C1069L91717A69424J82643L30855k00202E3846L71646A65747
13576E04004k6148j12510C7309K55895R9353j56229J36446A8988L54583n9426
13566C14145j48739O7389K6033K2914o6305L52542J38794j37242B12840P8377
$$ plain form
13638 369509 457630 424435 571471 438784 358723 212751 577367 381995 496604 103715
13627 477791 774941 590451 441988 109321 431820 454543 276241 172018 387265 526385
13617 526385 129341 358089 806799 386197 439563 352926 517474 522094 447275 627558
13607 627558 698108 295212 344607 430299 374387 271722 527995 394773 244625 544376
13597 544376 285142 576066 420364 272401 383413 262545 214907 503145 356277 458674
13587 458674 648078 31069 422786 169424 352067 682922 482720 53846 425492 165747
13576 504004 477856 365346 37309 293204 392557 236328 372774 18988 373571 314145
13566 314145 165406 232795 258828 281742 215437 567979 706773 569531 212840 291217
13556B91217J92484j99094j08568M1103k1879l1686J368M24527E1217L22310L0505
13545D04032K8474q3482A49640R5014L36864k81142R004Q072M6885E2196L17670
13534C69866j38242M25056l1589k67526a5869A31188d6348A17672a5255j04684
13524a19939B33882J09452I3134K86883j67079J41339m3476a23917B51552p3663
13514A77889O2466K10445a8398B51221I9189K30076P3409N1903J84471j62591
13504D76457j77050p9281q2944M3559M2933J46213b0674j1042B70615L97424k12360
13493D55679K0214h9384B79852C2629J50320P3025L68177j99204A04338L64152
13483D68490j14265R5569j64408r7680J28809n1132J02400j71923k2767J28658
$$ plain form
13556 291217 483701 284607 176039 217142 195263 163577 164945 589472 51217 373527 404032
13545 404032 432506 349024 149640 244654 581518 300376 309380 317452 364337 52196 369866
13534 369866 231624 656680 625091 357565 -15869 131188 -46348 117672 -15255 -119939
13524 -119939 233882 343334 93134 380017 212938 354277 310801 -123917 251552 177889
13514 177889 240355 450800 -18398 251221 99189 329265 402674 454577 639048 476457
13504 476457 299407 220126 137182 180741 223674 369887 -20674 -31716 270615 668039 455679
13493 455679 475893 -89384 279852 32629 182949 255974 624151 424947 104338 468490
13483 468490 354225 449794 285386 187706 316515 265383 367783 195860 173093 301751
13473C01751J15324q6485l6388k0380F8530h9686D49132O2591a1937B07820J99761
13462D07581q0890A0948K00328J24021A59792k1951J52617j16283K6755Q9319
13452B90249o0670J02389C0340L78350L43668A00739j3586J49194Q6193J659j21830
13441B02369k6521L71786j60725p947i0907A51592R6857J94662k19684K1177M7310
13430B91914A32217k3815J30516M5565n7927R3976J02767j231j45434R134j09496
13419A76272L00416A66818K84281j17241K3940A73041B1760M15030A34189c8917
13408C08215j09075r738E3455M59292B28722B785N44521j67860M2430a26703B87046
13396C69917r1744h5692B00060G4682J62085n4149J01752k4995N4386b0279N476
$$ plain form
13473 301751 417075 330590 294202 273822 68530 -89686 449132 511723 -11937 207820 407581
13462 407581 326691 10948 211276 335297 159792 137841 290458 174175 200930 290249
13452 290249 229579 331968 30340 408690 752358 100739 87153 236347 322540 324199 202369
13441 202369 175848 547634 386909 378962 -90907 151592 248449 443111 223427 244604 291914
13430 291914 132217 108402 238918 284483 226556 320532 423299 422068 276634 285768 176272
13419 176272 476688 166818 451099 333858 357798 173041 21760 436790 134189 -38917
13408 308215 199140 189402 53455 512747 228722 2785 547306 379446 421876 -126703 287046
13396 369917 278173 -85692 200060 74682 236767 182618 284370 259375 313761 -20279 -14803
13385a4803B33554K5357R0417p4909n2504L61424B89302k1909n3267l497I1795
13373f7988E21870A94080J60523J24825A32090h3028E48273B22868J22882K22023
13363E67773d9562C86732e4916D00131r8373a8589D6858J80493j1065K1031k1587
13352B15730m7305H2040M05810A74374k12D4317L63092L94541A62167M1638M03929
13341F07734A15377N45636B00070L86586h384A92762I1549J89550J2384J29390
13331D22873J38075g7364B07198R8053e1125b3663B78110R8745E3905K46013L8119
13320C38037h5219F6459r881B9h9182A97270n4719K54702G8850L40950H2580M72766
13308E55346h3114A78974J90370A0009K5064c02158a27772e458B83309I3636b14306
$$ plain form
13385 -14803 233554 258911 349328 274419 221915 583339 289302 267393 214126 210629 91795
13373 -67988 521870 194080 354603 479428 132090 -83028 548273 222868 345750 567773
13363 567773 -49562 386732 -54916 400131 301758 -18589 46858 227351 216286 237317 215730
13352 215730 168425 82040 487850 174374 174162 44317 407409 801950 162167 203805 607734
13341 607734 115377 661013 200070 586656 -8384 192762 91549 281099 293483 422873
13331 422873 560948 -77364 207198 305251 -51125 -23663 278110 376855 53905 299918 338037
13320 338037 -85219 66459 56578 29 -89182 197270 142551 397253 78850 419800 82580 555346
13308 555346 -83114 178974 369344 10009 35073 -302158 -127772 -5458 283309 93636 -214306
13296A40949J18801A28326d7913k1762C30630J349D6031L54306J04687B9633a20442
13284G5663B6743b88107D81089I1404B6551J26142J87654H3964K83774j10789
13274B56949i3554F04397k12841C7712K66572A26197P1042A053M7709Q5376K13593
13263C47731A8508a17634G1354A3276O1399b23015A63812E6952L19772A56765
13252D20713A5522F599K45310m2604A509J33868M80640F3093a45086C79718a61292
13240d44542D77394m1555e7761H2618g83r6206A87022n011B371K77990m2763J84380
13228D21978h8825B82693o4679A06830a5904a366F5192j2316b9355A42758J73410
13217C16168b3374E9597R355c0151m88620C59880k6303j17329O9486A4395a11194
$$ plain form
13296 140949 259750 128326 -47913 -69675 330630 331979 46031 400337 505024 29633 -120442
13284 75663 26743 -288107 481089 91404 26551 152693 340347 83964 367738 256949
13274 256949 -93554 604397 391556 37712 304284 126197 197239 1053 48762 134138 347731
13263 347731 18508 -117634 71354 13276 74675 -223015 163812 56952 376724 156765
13252 420713 15522 6599 251909 209305 1509 135377 616017 63093 -145086 379718 -161292
13240 -444542 477394 435839 -57761 82618 -783 -96989 187022 182011 2371 280361 237598 421978
13228 421978 -88825 282693 218014 106830 -15904 -1366 65192 52876 -29355 142758 316168
13217 316168 -23374 59597 68952 -30151 -518771 359880 333577 216248 285734 14395 -111194
13205E6960f6967E6482a22603A44189b08052N0029B99462K26988A02787a94564
13194D15790E0964H672J22682M03619B22296E7085K42923q3304n9908D76J24388
13183A24864b29039A82001m154i6232D5736K22669p0978C1761J86742d2854C14190
13171i4651I9050J45879d9709l4307B02362c2575F6021J16825b78085D46125I2043
13159a70015C53518a32166B71161k6135b1423G989M07735n3256a85166I2512B8355
13147a47073G5396k3934K44342b15302A61077K35744c0363G7656b13559A6066
13136h8224b8648A64893c91107D933K41757j0382c6568C35364h7768c5911B15440
13124F6366e2719j00188A95754J78155a46917m4820A56522j8336J09463B2685
$$ plain form
13205 56960 -66967 56482 -122603 144189 -208052 -158023 299462 526450 102787 -194564
13194 415790 50964 8672 131354 534973 222296 57085 300008 216704 156796 476 124864
13183 124864 -229039 182001 177847 -96232 45736 268405 197427 31761 218503 -42854 314190
13171 -94651 99050 244929 -49709 -84016 202362 -32575 66021 182846 -278085 446125 92043
13159 -170015 353518 -132166 271161 245026 -21423 7989 415724 362468 -185166 92512 28355
13147 -147073 75396 51462 295804 -215302 161077 396821 -30363 77656 -213559 16066
13136 -88224 -28648 164893 -391107 4933 246690 236308 -36568 335364 -87768 -35911 215440
13124 66366 -52719 -152907 195754 373909 -146917 -191737 156522 138186 247649 22685
13113C35446f9880B34471n1790L20453A03376D2543J5279K34480a02383B19661
13102a85303f7564B84420b71117E4240k0991P3417e118b516p1987C40528F9909
13090H8326d2314A12779K10898N0947j2181i3362A96388p7153L85238a74112C14022
13078c8707B99517G3936A3954C139d6858B83215N6610b7751H8051J71830d125
13066A60468N5065C9982A9081K67857b31126A9597O3857M4326a04952C11733i9670
13054a0577A18547K55657I8450a9245F8077Q9442l1798n8413c0380n4773a9137
13042b21768D8425J16928j6274O9101p1556d0462k13384e5723J1657C6747a52415
13030A3410b086B10239o8790a67569A13406J37064b44203A23047a40692k25458
$$ plain form
13113 335446 -69880 234471 182681 503134 103376 42543 57822 292302 -102383 219661
13102 -185303 -67564 284420 -271117 54240 33249 106666 -5118 -2516 -74503 340528 69909
13090 88326 -42314 112779 323677 374624 362443 -93362 196388 119235 504473 -174112 314022
13078 -38707 299517 73936 13954 3139 -46858 283215 339825 -27751 88051 259881 -4125
13066 160468 215533 39982 19081 286938 -231126 19597 83454 127780 -104952 311733 -99670
13054 -10577 118547 374204 98450 -19245 68077 157519 125721 67308 -30380 -85153 -19137
13042 -221768 48425 165353 149079 218180 146624 -40462 -253846 -55723 -44066 36747 -152415
13030 13410 -2086 210239 141449 -167569 113406 250470 -244203 123047 -140692 -366150
13020c66150D4306P0809J7173d5063A58425F5681J58622A1007E459O8261g1010
13008a41936D2221a50781G6401d6878D64965n9381a29488F9369a03805A42349
12997g1493D8247K33793a30080B69008r5479a191B16660p3226J83900F7762J21381
12986A89143J33860a86799j312r4478E4263a17945A76918A4096d5617C01110d8402
12974A93903b65288C5704J29217M6409L2855a73552C43865j44980e0383p302A52838
12962a0128k35966G3127K58140B4770Q1411N2579R9965d8180B13923e1963b1078
12950H0909K58811a87079j2916C16559a14302A5431J51294o9134m4967L69834
12940D22458C1561B582L47367b02111c7119A80995j6443a15143A62197A4391J40007
$$ plain form
13020 -366150 44306 115115 132288 -45063 158425 65681 224303 11007 5459 73720 -71010
13008 -141936 42221 -150781 76401 -46878 464965 405584 -129488 69369 -103805 142349
12997 -71493 48247 282040 -130080 269008 173529 -1191 216660 143434 327334 67762 189143
12986 189143 323003 -186799 -188111 -282589 54263 -117945 176918 14096 -45617 301110 -48402
12974 193903 -265288 35704 164921 211330 244185 -173552 343865 198885 -50383 -57685 152838
12962 -10128 -246094 73127 331267 24770 106181 158760 258725 -48180 213923 -51963 -21078
12950 80909 339720 -187079 -199995 316559 -114302 15431 166725 97591 52624 422458
12940 422458 31561 2582 349949 -202111 -37119 180995 164552 -115143 162197 14391 154398
12929A54398l018p0180i2825E84663a80301C34679d19029B58182b45157d4349
12918a50339A90191R0864i5643k50708a12371B3561a82686B96584b92556B17525
12907b08729B57691p1064a8803h465B49687e6908B36827F5552K17618b8891A98511
12895C57892b40283R6270B53147L141I9897K64489A07891a95531C8163j5951a73435
12883h9221A5881K84053a8989A33906b42118A19769a680A36484E8114f0352B23183
12871B10692p5495F1189Q2041d3611k7404H6139J62073o5007H9033c2066j09585
12860a41651N098A10405O7011a77011D9382J39209K5256J5931a60007B50007b05682
12848a8119E2339b49250m2332B0200b2520P330D11434j77948l2089b94487A11987
$$ plain form
12929 154398 151380 81200 -92825 584663 -180301 334679 -419029 258182 -245157 -44349
12918 -150339 190191 281055 -95643 -346351 -112371 23561 -182686 296584 -292556 217525
12907 -208729 257691 186627 -18803 -8465 249687 -56908 236827 65552 283170 -28891 198511
12895 357892 -240283 -144013 253147 256288 99897 364386 107891 -195531 38163 22212 -173435
12883 -89221 15881 299934 -18989 133906 -242118 119769 -1680 136484 58114 -60352 223183
12871 210692 135197 61189 143230 -43611 -71015 86139 248212 183205 89033 -32066 -141651
12860 -141651 -136553 110405 177416 -177011 49382 188591 213847 229778 -160007 250007 -205682
12848 -18119 52339 -249250 -291582 20200 -22520 -15190 411434 233486 201397 -294487 111987
12836a22303A58449a04964k5920H8434l6483a01655m1747e3159H7977P9757F0155
12824a59459i130B10590o4934O06J87172b21298i4421r3870I5565l3620J3020
12813G4965b09745j18764B53093q0086a51681A39222M1517p8863J98057B354J95332
12802A97686E8116b3579m8036a7508j86643e849A01656P7187l7428d8567k2290
12791g0857a5147C00652h9101A79665a79207F8485J76793D935J03029h735A24772
12779a21536B2379J2441d5154A81244p3396M814j0102D6464D40J24762K306c86692
12766a15767B54261k6495n6888G5864C2817K28347a82274A10437i0309A79663
12755E0046K85458d6605q0120A52642c3161B53280a97771K9380b7888A37345a03763
$$ plain form
12836 -122303 158449 -104964 -130884 88434 51951 -101655 -143402 -53159 87977 167734 60155
12824 -159459 -9130 210590 145656 146262 333434 -221298 -94421 -188291 95565 61945 74965
12813 74965 -209745 -328509 253093 173007 -151681 139222 180739 101876 299933 2354 197686
12802 197686 58116 -23579 -71615 -17508 -204151 -5849 101656 178843 141415 -48567 -70857
12791 -70857 -15147 300652 -89101 179665 -179207 68485 245278 4935 107964 -8735 124772
12779 -121536 22379 34820 -45154 181244 107848 112662 102560 46464 440 125202 127508 -386692
12766 -115767 254261 227766 170878 75864 32817 261164 -182274 110437 -90309 179663
12755 50046 335504 -46605 -126725 152642 -33161 253280 -197771 -168391 -27888 137345 -103763
12743C07437H4119G973J76503n7804c6005C06067g2072C53565a20477k17834A80722
12731A49011b0351A73114e2861A20776b7132E8604Q9773A6092K07977D278g4483
12719b40399c4270A25552a37507B19516a27456A5731K45399G0642a07183B80808
12708B50191A19034f1293K4411A1392a07808B6315J01763M0108i2704A64511E514
12696A60355D1837J61891I865L43178c4577A31736m0211M5447P4785B3957J22861
12685A46818K24832A45200b90397Q1493A11054K44781j51653i4992G3435h2597
12674b77673A40097a59480B00147R1471j22995d336n8917A20621L06061I388J15137
12663A24525K756J04713A09038m0516J22734q9140L401R5782M4522I2714g4437
$$ plain form
12743 307437 84119 7973 184476 126672 -36005 306067 -72072 353565 -120477 -338311 180722
12731 149011 -20351 173114 -52861 120776 -27132 58604 148377 16092 224069 4278 -74483
12719 -240399 -34270 125552 -137507 219516 -127456 15731 261130 70642 -107183 280808
12708 250191 119034 -61293 -36882 11392 -107808 26315 128078 168186 -92704 164511 5514
12696 160355 41837 203728 9865 353043 -34577 131736 91525 136972 211757 23957 146818
12685 146818 371650 145200 -290397 -208904 111054 355835 204182 -94992 73435 -82597
12674 -277673 140097 -159480 200147 291618 168623 -4336 -63253 120621 426682 9388 124525
12663 124525 127281 231994 109038 68522 191256 102116 105517 201299 245821 92714 -74437
12651i1884D9283b39904B02143J42910A33633a12093G3782J2698N9364g4859D57757
12639I0326P6628l0166f5084D01054B2606g2998F739M21866A91643J07728l7519
12628B61852B431M60234f2562A54721P913L15665d9418C07320A21304f6735b2741
12616B76961i4819D5303a70058h1485K9181j03964j0932A62054B1887a33393B22582
12604A85638p8279B9416L409f9690A48939G0063a12742C32033b19364B93336j5058
12593B78278d4998J6148A02764k5195J45215r1541m6634a79802g3535A75674g1860
12581b16677A37637R3287a68501B55216a77929G1449i5004I4344h0341q7967A17953
12569C0496b27413f3770A69673B2029J78678E3287a55738A58053n5742a96289
$$ plain form
12651 -91884 49283 -239904 202143 345053 133633 -112093 73782 86480 145844 -74859 457757
12639 90326 166954 136788 -65084 401054 22606 -72998 6739 428605 191643 299371 261852
12628 261852 2431 462665 -62562 154721 162634 478299 -49418 307320 121304 -66735 -22741
12616 276961 -94819 45303 -170058 -81485 -52304 -156268 -167200 162054 21887 -133393 222582
12604 185638 107359 29416 32825 -69690 148939 70063 -112742 332033 -219364 293336 278278
12593 278278 -44998 -28850 102764 77569 222784 131243 84609 -179802 -73535 175674 -71860
12581 -216677 137637 230924 -168501 255216 -177929 71449 -95004 94344 -80341 -168308 117953
12569 30496 -227413 -63770 169673 22029 200707 53287 -155738 158053 102311 -196289
12558A48366L3352F3099g5585K3131n4212H3032f9556A89060e8399B11043b4065
12546b96219M3468f6066g568n2992A28706a43912C83944F2304a64600B88800j07290
12535A81510K3649a25246J9406o4489d7148A47716j0482J36914j07646B0536K37154
12524B57690b21029b8596B27164A08968j0763a14800A30207b39128h2606L3427
12514d9179D48388b6290B66909a08760B64750d7942j1136B37011I6138b97869
12503a92650C0580M0519e4212E6858K46505B4121a06845a3487o3132B13837K0489
12492B34326m2792B3660J41694K88768A83152a32106f2242A73254J96100a09232
12481b74020d6949J5467B8220b01136B8209N7350f2374B48920C7044K28097a68086
$$ plain form
12558 148366 181718 63099 -75585 -52454 -106666 83032 -69556 189060 -58399 211043 -24065
12546 -296219 -252751 -66066 -7568 -60560 128706 -143912 383944 62304 -164600 288800 181510
12535 181510 205159 -125246 -105840 -170329 -47148 147716 137234 274148 166502 20536 257690
12524 257690 -221029 -28596 227164 108968 98205 -114800 130207 -239128 -82606 -49179
12514 -49179 448388 -26290 266909 -108760 264750 -47942 -59078 237011 96138 -297869
12503 -192650 30580 71099 -54212 56858 303363 24121 -106845 -13487 -76619 213837 234326
12492 234326 191534 23660 165354 454122 183152 -132106 -62242 173254 369354 -109232
12481 -274020 -46949 -31482 28220 -201136 28209 85559 -62374 248920 37044 265141 -168086
12469B9004a533j9724C65762A3816c2534P068A70091J7546m2589l0036a6067C43395
12456A02455D0554P5753n7732j0465N378e0044q5681H2491K9915K1321a49258
12444A4775b73897K4203B03651R2612a13195d0143J6987I2075e9340p6460A39017
12432a4938j90916o5358A36897m0465a20683M445C20704e6758P602B9122a02832
12420i8731o2010k49780g9442c692q7390A48567C0085q269K75256A4062b42547
12408A88902B8583Q5992a20941E9893b96286A34167J5332M6421a08314E1693d8455
12396A3171P2473a95179C38778k4262d6314k46144r0560J81306B26530r5624J41467
12385B72373a97542C36389A40140h1533n9005E708a33117H4206c41378a28344
$$ plain form
12469 29004 -1533 -21257 365762 13816 -32534 -25466 170091 187637 145048 115012 -16067 343395
12456 102455 40554 116307 58575 48110 53488 -50044 -135725 82491 112406 133727 -149258
12444 14775 -273897 -249694 203651 296263 -113195 -40143 -23156 92075 -59340 -135800 139017
12432 -14938 -205854 -271212 136897 96432 -120683 -116238 320704 -56758 -49156 29122 -102832
12420 -98731 -160741 -410521 -79442 -3692 -91082 148567 30085 21816 297072 14062 -242547
12408 188902 28583 114575 -120941 59893 -296286 134167 149499 195920 -108314 51693 -48455
12396 13171 85644 -195179 338778 314516 -46314 -292458 -383018 -201712 226530 130906 272373
12385 272373 -197542 336389 140140 -81533 -140538 5708 -133117 84206 -341378 -128344
12374B20304K06550A43093c28821B2746d23047a628k4402B68897a7967F6185M7684
12363A13869J50829F5384e45533f5316a629A13320b2844C30840I3453i6092k01371
12352b97463F4683M4501N3558a2640k3036C173b04305B24730B1020b60923A63373
12340C49548A40225g8691A59219n3297e0644J28p0517A68954a26365d9870l522
12329e3392F1527b73265C02906j45751B1491K4989b35715B372b71479i5516A48820
12317B19650f3688B50967c74913I7239J83800q6400a70314c7449j464k36579G0925
12305A8576b53172A83520a6665A60161i5882D8197J68418n2819a50892C53824
12294a58583K5312A81656a70916C0837h4730k75491A87936b60051e8625k51456
$$ plain form
12374 220304 426854 143093 -328821 22746 -423047 -1628 -26030 268897 -17967 66185 113869
12363 113869 264698 65384 -545533 -65316 -1629 113320 -22844 330840 93453 -96092 -297463
12352 -297463 64683 109184 162742 -12640 -35676 3173 -204305 224730 21020 -260923 163373
12340 349548 140225 -78691 159219 105922 -50644 -50516 -121033 168954 -126365 -49870 -53392
12329 -53392 61527 -273265 302906 157155 21491 46480 -235715 2372 -271479 -95516 148820
12317 219650 -63688 250967 -374913 97239 281039 194639 -170314 -37449 -38913 -275492 70925
12305 18576 -253172 183520 -16665 160161 -95882 48197 216615 163796 -150892 353824
12294 -158583 -133271 181656 -170916 30837 -84730 -360221 187936 -260051 -58625 -310081
12284c10081j8405c8898o8126B12424J59388d5563D14939B9915c2584h576A69576
12272C41516c10983A88301b33346J0641H702J93760B5622L99413A25789D9434
12261a59191A81637j9158J5947g3465j70230A36728B6587L46182j22874n9683
12251A90212I4449L43213a24933H2461e8810B9932f5380C8999a33528A53354a05690
12239B09557L7286j02731J9979G0067n502a64739A84603L9310L48823a15040D7411
12227B76352A32112K24207i3093B74365h1434B1816J89250o2599C7173N5736a16841
12215B351J91036d0808B53888k8847f669A42407n6239J31132E2278M15032G0687
12203d1555D12091f0228E76441B76687A34903K33711j79067K43356B06299J18658
$$ plain form
12284 -310081 -328486 -38898 -107024 212424 371812 -45563 414939 29915 -32584 -8576 169576
12272 341516 -310983 188301 -233346 -222705 8702 202462 25622 425035 125789 49434
12261 -159191 181637 162479 178426 -73465 -243695 136728 26587 372769 249895 190212
12251 190212 94449 437662 -124933 82461 -58810 29932 -65380 38999 -133528 153354 -105690
12239 209557 246843 144112 164091 70067 64565 -164739 184603 223913 572736 -115040 47411
12227 276352 132112 356319 -93093 274365 -81434 21816 211066 148467 37173 92909 -116841
12215 2351 193387 -40808 253888 225041 -6669 142407 86168 217300 52278 467310 70687
12203 -41555 412091 -60228 576441 276687 134903 368614 189547 432903 206299 324957
12193C24957A38723J36242p1708J32143K19968h9762A49549Q4636A05153c53549
12182C25487a4764C24111b39938H3601Q7237J46246A9654N0055M23089a0513E8298
12170B79350c1448A12153C6431c3104j4135j6066B840N4839J29251b80803a3122
12158C35388F6435a88292A36163i829j86814o9292K0895B19124m3617E078b22133
12146A97862E5618g5808a8602C15789b07817h5746B01802a30760j50125A2727
12135H0621L608j3981g4818b7606A51h1366G7447g6590D1676a35106I5730g18
12122A67443K17647A57591c70594B18208b46683B93991G851J45538g0850j9442
12112i0292L9923H2503R4148b72426h5729A98006P460h3599c7369A1286J59562
$$ plain form
12193 324957 138723 274965 203257 335400 555368 -89762 149549 234185 105153 -353549
12182 325487 -14764 324111 -239938 83601 170838 317084 19654 69709 492798 -10513 58298
12170 279350 -31448 112153 36431 -33104 -47239 -63305 2840 57679 186930 -280803 -13122
12158 335388 66435 -188292 136163 -9829 -196643 -265935 -245040 219124 175507 5078 -222133
12146 197862 55618 -75808 -18602 315789 -207817 -85746 201802 -130760 -280885 12727
12135 80621 84229 70248 -74818 -27606 151 -81366 77447 -76590 41676 -135106 95730 -718
12122 167443 385090 157591 -370594 218208 -246683 293991 7851 153389 -70850 -90292
12112 -90292 -50369 82503 176651 -272426 -85729 198006 205466 -83599 -37369 11286 170848
12101A70848C4491b11379R5454j65632E0407h9774k29314H6184K05262b19527
12090b5610B59768D5520J70023b33042B91769G9195B8304E947b3199A98017C4714
12078A89739a60512A68205g483q1003E5767f117A89643a34421n68k06401d7061
12066A40323n1040d50273D7932h0666k08447c4224j18826L4111A06251m1041j4883
12055E0327a22957A43345a20169J6467q9295P8259A14603e5305k08094A72370
12044A38276g5040A98008p6208l2476L0984C7927a39617k40851C06095d468C96629
12032A001487C86516n7123i1286a0025k9892E0571c23120e3370j94610R1543M3
12021a56394A63912F6671a2404O98C4693K88768c7849A15488b39963B52682a08995
$$ plain form
12101 170848 34491 -211379 -115925 -281557 50407 -89774 -319088 86184 291446 -219527
12090 -25610 259768 45520 215543 -233042 291769 79195 28304 5947 -23199 198017 34714
12078 189739 -160512 168205 -7483 -88486 55767 -6117 189643 -134421 -134989 -341390 -47061
12066 140323 89283 -450273 47932 -80666 -289113 -34224 -153050 -118939 106251 65210 50327
12055 50327 -122957 143345 -120169 -103702 -192997 -114738 114603 -55305 -263399 172370
12044 138276 -75040 198008 121800 89324 120308 37927 -139617 -380468 306095 -4468 396629
12032 1001487 386516 329393 -91286 -10025 -39917 50571 -323120 -53370 -247980 -156437 -156394
12021 -156394 163912 66671 -12404 -11706 34693 323461 -37849 115488 -239963 252682 -108995
12009c22956E7212a28600k3680m6657c7125B17846F5470J4500b6844B7997L3990
11998F1987c08087G398d1618B42547b4505o4753k6193a5130C0535K5164c46603
11986a45572p8527e3727A43577h1735l7338c5708p1468j03287d387k776m00165
11975d07328i9416l1932D82360A71248G9843b1955A74835h8709G7091J7088K3947
11964A18126j5894g995j46573E0163e8532k43527h3992b6049H2972a39793F2481
11952b59793k8347J2870a2429j26244A36914a48180B24745a05200E2223b56226
11941H7458b04195M7713j30453C14478C2001b90887a0414j76918A04393a53276
11930A73574a36694B49433b19903A08382a73012C465b86535A33504c625A33525
$$ plain form
12009 -322956 57212 -128600 -152280 -198937 -37125 217846 65470 79970 -26844 27997 61987
11998 61987 -308087 7398 -41618 242547 -24505 -89258 -115451 -15130 30535 55699 -346603
11986 -145572 -224099 -53727 143577 -81735 -119073 -35708 -107176 -210463 -4387 -7163 -407328
11975 -407328 -99416 -131348 482360 171248 79843 -21955 174835 -88709 77091 94179 118126
11964 118126 102232 -7995 -154568 50163 -58532 -302059 -83992 -26049 82972 -139793 62481
11952 -259793 -288140 -275270 -12429 -138673 136914 -148180 224745 -105200 52223 -256226
11941 87458 -204195 -156482 -286935 314478 32001 -290887 -10414 -187332 104393 -153276
11930 173574 -136694 249433 -219903 108382 -173012 3465 -286535 133504 -3625 133525
11919A63812f6295j0509k0339k01335B1855f0266C1697c61220C05683c71127a44502
11907A8530a73806B64333j11937a29407n2961B12174b16297B27162c7704H9149
11896i2443E0268e1319O094A59976a41763f564l297I2084J09267G3471a30893
11884b85817O8904A25962c38527B1928a06629n0369D1922a39674H8564Q1105G2409
11872a90282A97498b69792a3138B95640h2777A05105f0030k69532a62111P8649
11862h3462m2602H0591b01744D30294a03479B92145b5521j00275q599O749k1709
11851a49355F4380a5991A59782i2875b6804j51047j1258f118G617d6011I7900
11839b54660A22894a67560A20530N5164J04569f1935n8039q7370c7057B47864
$$ plain form
11919 163812 -66295 -76804 -97143 -298478 21855 -60266 31697 -361220 305683 -371127 -144502
11907 18530 -173806 264333 152396 -129407 -182368 212174 -216297 227162 -37704 89149
11896 -92443 50268 -51319 -45225 159976 -141763 -6564 -9861 92084 201351 73471 -130893
11884 -285817 -216913 125962 -338527 21928 -106629 -156998 41922 -139674 88564 169669 72409
11872 -190282 197498 -269792 -13138 295640 -82777 105105 -60030 -329562 -162111 -83462
11862 -83462 -126064 80591 -201744 430294 -103479 292145 -25521 -125796 -134395 -127646 -149355
11851 -149355 64380 -15991 159782 -92875 -26804 -177851 -189109 -6118 7617 -46011 97900
11839 -254660 122894 -167560 120530 175694 280263 -61935 -119974 -207344 -37057 247864
11828A23296g6766j40287A42366a6751A53711F3338P4589N8397B6972a08577j06672
11817b15249n147K8607Q4677j81186G8474J70167a76830B40492j9155a06818L0820
11806g5998E7319k1553a05393c5335A26161c00l57854B2626Q8188J7611a76235
11794A35036o2329b10017C38916b1450A53042f3321a2103G3552J06170C3322f484
11782F4638R7959I662a57219j95333f2587c0569j02394B9505f0398E6332d8831
11770d12300Q6382g6687A21531a11994L8032b7968l1140A56869Q9089f25710K80529
11759c45181p38B96490I2041B9687p81a98626R5987E0249c2370B00044l8002c52848
11746h4673G916a37456C8645j2489g8922F3449b76750k671A34743J1851d32682
$$ plain form
11828 123296 -76766 -217053 142366 -16751 153711 63338 137927 196324 26972 -108577 -215249
11817 -215249 -220396 -191789 -107112 -288298 78474 248641 -176830 240492 221337 -106818 -75998
11806 -75998 57319 35766 -105393 -35335 126161 -300 -358154 22626 110814 128425 -176235
11794 135036 72707 -210017 338916 -21450 153042 -63321 -12103 73552 179722 33322 -6484
11782 64638 162597 9662 -157219 -352552 -62587 -30569 -132963 29505 -60398 56332 -48831
11770 -412300 -325918 -76687 121531 -111994 -73962 -27968 -59108 156869 245958 -625710 -345181
11759 -345181 -345919 296490 92041 29687 28906 -198626 -102639 50249 -32370 200044 162042 -352848
11746 -84673 7916 -137456 38645 26156 -78922 63449 -276750 -279421 134743 146594 -432682
11734A60324Q4764o6175C3058J11857k60j4613a59655g4600l8000d5721j57355
11723b03076B71881C1993c31782B4525J0477b0600j03995q6072c200l15612E4834
11711b09921A38282b91055j11761j5615d113n9255A02360M8934l3791a99530C1901
11699B63783A5891K70355c62021R3691A4899i1871M5168A20591b37657a06408
11688a87607C9866N4290a94570A84236K1744d65356f4562j4569o8557A1963b11433
11676a43272B65537a47696q478C25912e3248C30408i2642C53573g8923Q910A18482
11664A23418a65096P1876q5120f5602l3150A91963C7241b926n6667k45311G4217
11652b54786C0123a49485O2130D2185c39636c8340A72200a65327g8918E8048a15896
$$ plain form
11734 160324 245088 178913 33058 144915 144655 130042 -159655 -74600 -112600 -45721 -203076
11723 -203076 271881 31993 -331782 24525 35002 -20600 -124595 -210667 -3200 -318812 54834
11711 -209921 138282 -291055 -402816 -418431 -4113 -63368 102360 151294 117503 -199530 31901
11699 263783 15891 286246 -362021 -268330 14899 -91871 -46703 120591 -237657 -106408
11688 -187607 39866 94156 -194570 184236 205980 -465356 -64562 -79131 -147688 11963 -211433
11676 -143272 265537 -147696 -156174 325912 -53248 330408 -92642 353573 -78923 -70013 118482
11664 123418 -165096 -93220 -178340 -65602 -98752 191963 37241 -2926 -59593 -304904 74217
11652 -254786 30123 -149485 -87355 42185 -339636 -38340 172200 -165327 -78918 58048 -115896
11640a93832d4640B61395H0798c1529l8233A92362a569j82016P4573B9297J00909
11629A30206E6135g3277m8675n9567H3240g6419g753k76074B55835a07865j40342
11618b48207e3302q4803I6749b08222A17332J24089a1662E842d05657B9205a70619
11606b63447A79136o1477a4072A90547f6800n927E5809O4651f2179k28246c0966
11594c133D8809J96642d89651a72186j73454J48668d9627B63998j12110b13749
11583A16869c1553B11672a00933A90890b76508J29103A11486O5069b97254B24388
11572a75248F8463J3415i6678A72867b95065C65195d7897C67830a54111B84416
11561e9702a3361k16188e5607A21403c0150H3956J86594d6220A07307B6807a86870
$$ plain form
11640 -193832 -44640 261395 80798 -31529 -69762 192362 -1569 -183585 -109012 29297 130206
11629 130206 56135 -73277 -121952 -181519 83240 -76419 -7753 -283827 255835 -107865 -248207
11618 -248207 -53302 -138105 96749 -208222 117332 241421 -11662 5842 -405657 29205 -170619
11606 -263447 179136 117659 -14072 190547 -66800 -72727 55809 120460 -62179 -290425 -30966
11594 -3133 48809 245451 -489651 -172186 -345640 -196972 -49627 263998 151888 -213749
11583 116869 -31553 211672 -100933 190890 -276508 -147405 111486 176555 -297254 224388
11572 -175248 68463 81878 -96678 172867 -295065 365195 -47897 367830 -154111 284416
11561 -59702 -13361 -229549 -55607 121403 -30150 83956 270550 -46220 107307 26807 -186870
11549b18740i8432A12573J25698a76428d0724k57416l7088J51066B38619r6645
11539A41974c298C9991a94400b498E0160K14861A01928f6928e650E1549J20737
11528A72286g1372G3731a36866K7419G4142J45522a1414A60818H0158j7758c4375
11516a61021F0344P5443o1031L0409c3268p2763k5009M7987j7823d635C96122
11504a68256C36165A2288J62555K2539F9124K91347j45211H5183a1676r7762A88751
11492B43571a7956C99454A78635E5009M17777A05067D8022Q971L4265K15810c21804
11480C46303i9921C28315E7038J08476g7583G2012K32332L3952k3053I3153P1702
11469A64855P1783a9785B8070a67067q157d7648C2670K82034q5214A08813K81193
$$ plain form
11549 -218740 -98432 112573 238271 -176428 -40724 -298140 -335228 -184162 238619 141974
11539 141974 -3298 39991 -194400 -2498 50160 265021 101928 -66928 -5650 51549 172286
11528 172286 -71372 73731 -136866 -109447 74142 219664 -11414 160818 80158 62400 -34375
11516 -161021 60344 135787 74756 105165 -33268 -106031 -131040 -83053 -100876 -4635 396122
11504 -168256 336165 12288 174843 197382 69124 360471 215260 85183 -11676 -109438 188751
11492 243571 -17956 399454 178635 55009 472786 105067 48022 56993 91258 307068 -321804
11480 346303 -99921 328315 57038 165514 -77583 72012 304344 338296 315243 93153 164855
11469 164855 236638 -19785 28070 -167067 -175224 -47648 32670 314704 229490 108813 390006
11458C90006j06542e7459G1792M7576N4261j593l3814a4522A08031M18236D6956
11446C31504d8319A62411m6242c7138I7795b42982B849b77714G871i2421C27306
11434b2147o2658J4681A43492b24371b3552m0179C1861b66638c0440A67322o9484
11423I7838b8200B19021m9222J51461b07784A67472a9646o9937A75159b99805
11412a96561g7642l4150j76171A2529c8940G4793J1232h6448l56499q3969C3339
11400c13847a07873d0741A34059i2650l2352A9685L36738r4277a47753l6154A3246
11388b95416a05185j12913A27983c2841A49694b17238A2946b60095j78624a85157
11377A79782m5575L7738Q0337a76585a1174A409K37761i8826E941a10477A82151
$$ plain form
11458 390006 283464 -57459 71792 119368 173629 172036 138222 -14522 108031 526267 46956
11446 331504 -48319 162411 116169 -37138 97795 -242982 2849 -277714 7871 -92421 327306
11434 -22147 -84805 -70124 143492 -224371 -23552 -63731 31861 -266638 -30440 167322 97838
11423 97838 -28200 219021 169799 321260 -207784 167472 -19646 -89583 175159 -299805
11412 -196561 -77642 -111792 -287963 12529 -38940 74793 86025 -86448 -442947 -526916 33339
11400 -313847 -107873 -40741 134059 -92650 -125002 19685 356423 262146 -147753 -183907 13246
11388 -295416 -105185 -218098 127983 -32841 149694 -217238 12946 -260095 -438719 -185157
11377 179782 134207 171945 252282 -176585 -11174 1409 239170 -98826 5941 -110477 182151
11365A08554a75844g0966A90172a67587A02201k295N0671b90852B5378e1424k00656
11354b52080A71072g5951A31160M6633B4221K33751e6759H6057e4582A97734M471
11343B02205B5770b68591C29469H96b04414C65307d49458O5270e396E1481B4373
11331i5156A33464A251a9028F3064M2126a63623a509k9860A51988a74564K2849
11320a51715D9212J31780b76759h4679E0635l003b55319a09544C7395K83708a37620
11308C30022b00965b4288J1798k15933c6988F3489P665J50869a05580F1899A6328
11296A72318a16725B43639b71335A2646b13858r6739J37490A03289K62529e5129
11285b51441A32038f2007A87336a70382A08100a84113A61507d6939r3184F683
$$ plain form
11365 108554 -175844 -70966 190172 -167587 102201 99906 150577 -290852 25378 -51424 -252080
11354 -252080 171072 -75951 131160 177793 24221 257972 -56759 86057 -54582 197734 202205
11343 202205 25770 -268591 329469 896 -204414 365307 -449458 -384188 -5396 51481 24373
11331 -95156 133464 1251 -19028 63064 105190 -163623 -1509 -31369 151988 -174564 -151715
11320 -151715 49212 180992 -276759 -84679 50635 47632 -255319 -109544 37395 321103 -137620
11308 330022 -200965 -24288 -12490 -228423 -36988 63489 71154 222023 -105580 61899 16328
11296 172318 -116725 243639 -271335 12646 -213858 -310597 -173107 103289 365818 -55129
11285 -251441 132038 -62007 187336 -170382 108100 -184113 161507 -46939 -140123 6683
11274b6295B06842K10279B4752h4998A39105J3085C8155L0679d2385A24427a86194
11262A90876h0900p0764C4911a32590C58909h1836D5582a84388C11042q9529b79380
11250a39488j64895K0858Q6208I1938J32810J97635b13042j53710E5059a07333
11239b91570A23358a96856i7625c8532j6387p7966l29795a59148I8928h7419G543
11227b96853J05748j62767E5580d4873m2818L8348o2419b7476j10431A40126J67469
11216C07595A3384a08855J9898B0013h1328l9773d6750J3674F1540e5396A0333
11204A51308a33234C7356A1457a44178d6851b1857j92032A91184b56405a06908
11193G0016k2522a06332A51471b9985C43037Q7770c6299A69207e1838C2141R83
$$ plain form
11274 -26295 206842 417121 24752 -84998 139105 152190 38155 68834 -42385 124427 -186194
11262 190876 -80900 -151664 34911 -132590 358909 -81836 45582 -184388 311042 221513 -279380
11250 -139488 -304383 -283525 -197317 91938 224748 422383 -213042 -366752 55059 -107333
11239 -291570 123358 -196856 -97625 -38532 -54919 -132885 -462680 -159148 98928 -87419 7543
11227 -296853 -191105 -353872 55580 -44873 -87691 -49343 -111762 -27476 -137907 140126 307595
11216 307595 13384 -108855 -88957 20013 -81328 -121101 -46750 -33076 61540 -55396 10333
11204 151308 -133234 37356 11457 -144178 -46851 -21857 -213889 191184 -256405 -106908
11193 70016 47494 -106332 151471 -29985 343037 430807 -36299 169207 -51838 32141 33124
11182C3124f291k02471J4096B70422c9220j14277a7024l99563A2906a19244p0999
11171a90243A20844c0105k3173j48837B086a85778A14339R4437l4807d71380i9672
11159c61797A87488a8753j5804j76191Q2490j52092J3718C00997b94371j43400
11149d37771A2741a43477A58151c49197b2203A63606p2653A9145a37987K9723
11139a08264A77990a54087a0257B22525j02986I060a1338A44811c8892B90859
11128A08384J02253F5102J87211h2583B29738j01087b95498M1152A617b17260
11117A16858c2894A03683J07045R0970N4750A53251H208L12170A5827L37552j64871
11106A88508I0799K49603J05089K40608j20501j72043a71958j1920B5220b56664
$$ plain form
11182 33124 -6291 -208762 -194666 270422 -39220 -153497 -17024 -416587 12906 -119244 -190243
11171 -190243 120844 -30105 -53278 -202115 2086 -185778 114339 208776 173969 -471380 -99672
11159 -361797 187488 -18753 -34557 -210748 -128258 -280350 -266632 300997 -294371 -437771
11149 -437771 12741 -143477 158151 -349197 -22203 163606 90953 19145 -137987 -108264
11139 -108264 177990 -154087 -10257 222525 119539 9060 -11338 144811 -38892 290859
11128 108384 210637 65102 252313 -82583 229738 128651 -295498 -254346 1617 -217260
11117 116858 -32894 103683 210728 301698 356448 153251 8208 320378 15827 353379 188508
11106 188508 90799 340402 445491 686099 565598 393555 -171958 -183878 25220 -256664
11095D79434j20481B9423J67481Q6269j779N2457A58290J51338k1429f975A48099
11083a77387F3131J49139p2680J60711B857L73409j00521K1267K74626j59399
11073D12239l6862m4840o9700D1289K69956q8098l355L09137L4938j8278j26582
11062D19007j09180M68222l51362Q4121j02185J56631n1771j59845J57036K88851
11052G99525j59848J64303J324j52764J13478o9845k25966q0750M07102K48088
11042A044647m101j76304j49904j24888Q8798K09654J7376k25268M0244J6487
11032G36741L0527j33880M43679l12929J1006k35495J74785R6087j39199L25748
11022I97070l29009p8128L32573C19146L81979J13091l86897K23974j80895L31003
$$ plain form
11095 479434 358953 29423 196904 283173 281394 333851 158290 309628 288199 -6975 148099
11083 -177387 63131 212270 139590 300301 2857 376266 275745 297012 571638 412239
11073 412239 375377 330537 260837 41289 311245 223147 219792 528929 563867 545589 419007
11062 419007 309827 778049 426687 510808 408623 565254 513483 353638 510674 799525
11052 799525 639677 803980 805304 652540 766018 696173 470207 389457 796559 1044647
11042 1044647 1040546 864242 714338 589450 678248 887902 905278 680010 720254 736741
11032 736741 767268 633388 1077067 764138 775144 539649 714434 810521 671322 997070
11022 997070 668061 589933 922506 319146 701125 814216 427319 651293 470398 801401
11012H01401j02049J6955R5754o489J62163A97903K45564K28754l242J01137K0156
11001G90272l11961O8252K31230k07581J34489C19192N4397K42494J79499P7037
10991H72619N0640k57824k9858L31991J31796m14799L68205m4147m3736J16418
10981A081305L29229l13445N51078J15655J82366K81895N45963N5289L00589J65039
10971C294963k6653q9181o09972M23466n38898o06309o48540K25945k02524K1305
10961A243602k70290L44540m69355j09097j4955J99420q9679k89426k69253j19106
10951A56401D9089L11442D8500f7254B84053B4604N39937F2234L77333b90325
10940A3427l123K09094e1341r850C39885b2976B28212P8720g2800C29449r5442
$$ plain form
11012 801401 699352 716307 812061 805572 967735 197903 443467 672221 668979 770116 790272
11001 790272 478311 546563 777793 570212 704701 319192 373589 616083 795582 872619
10991 872619 923259 665435 635577 967568 1099364 684565 1052770 1008623 964887 1081305
10981 1081305 1410534 1097089 1648167 1763822 1946188 2228083 2774046 2829335 3129924 3294963
10971 3294963 3268310 3179129 2569157 2992623 2453725 1847416 1198876 1424821 1222297 1243602
10961 1243602 973312 1317852 848497 739400 724445 923865 834186 544760 275507 156401
10951 156401 49089 360531 48500 -67254 284053 24604 564541 62234 439567 -290325
10940 13427 10304 219398 -51341 -61191 339885 -22976 228212 306932 -72800 329449 234007
10929B34007L2943l7961P292a76794f3258A45339a66041l4843B8434d3906E1716
10917A71437A6354J48044a03102A57447a27537A13072g8177j9505j14983M0674
10907a71991A41121J53793A25699f8212j15599B54365A4120d61714d4446d055
10896G3080a93129i31k55453H4750L3940a21679L3798A89736a02744c8509E9477
10884b8909n3279j33433E874a28444K8039C5922a75179C2514b9193n6636n9790
10873a45619i978q0792C5771a92666B48713H3863c06505d3118H2422k1652c1637
10861A5803a72996g6350J1188j47790Q2514B76965a33751j63154i5397c7675k18638
10850b56313B02783H8121g8230o4595B17631J05154j24458K3861i3771j44921
$$ plain form
10929 234007 266950 228989 236281 -176794 -63258 145339 -166041 -200884 28434 -43906 51716
10917 171437 16354 164398 -103102 157447 -127537 113072 -78177 -97682 -212665 -171991
10907 -171991 141121 294914 125699 -68212 -183811 254365 14120 -461714 -44446 -4055
10896 73080 -193129 -931 -256384 84750 118690 -121679 -87881 189736 -102744 -38509 59477
10884 -28909 -82188 -215621 5874 -128444 -100405 35922 -175179 32514 -29193 -85829 -145619
10873 -145619 -9978 -90770 35771 -192666 248713 83863 -306505 -43118 82422 60770 -31637
10861 15803 -172996 -76350 -65162 -212952 -130438 276965 -133751 -296905 -95397 -37675 -256313
10850 -256313 202783 88121 -78230 -142825 217631 322785 198327 222188 -93771 -238692
10840b38692J04287B19108d4234A35209D9932b33101g5996l34269h9665C21509
10829g7879A935K89136C8863f4057D6123M5599c4416k23310R2451o7933B94217
10817H2767a45369a5192o1440C477Q6849a5790B20125b36256O0723B92181C8751
10805a95491I5698f2060q5559K6981N7157B68761B7586K20604b3464l3568B58575
10793d9959A75361c55310i9361m7091o3457B56186B0797e029A83702J01956j29109
10782A56549b13363J5143N056l17249H2856C0913a38615I4950B3738a34698B4237
10770i0019C86967F5535i7379q1369q0485B46397O1139a41304B22540a14389C70681
10758B53249a65011j03894C1248K89393a06785C7507K5571O2350b87986h8970
$$ plain form
10840 -238692 -134405 219108 -44234 135209 49932 -233101 -75996 -410265 -89665 321509
10829 -77879 1935 291071 38863 -64057 46123 91722 -34416 -257726 -165275 -233208 294217
10817 82767 -145369 -15192 -76632 3477 90326 -15790 220125 -236256 -175533 292181 38751
10805 -195491 95698 -62060 -147619 -120638 -63481 268761 27586 248190 -23464 -57032 258575
10793 -49959 175361 -355310 -99361 -146452 -209909 256186 20797 -5029 183702 285658 156549
10782 156549 -213363 -198220 -193164 -510413 82856 30913 -138615 94950 23738 -134698 24237
10770 -90019 386967 65535 -97379 -178748 -259233 246397 307536 -141304 222540 -114389 370681
10758 253249 -165011 -268905 31248 320641 -106785 37507 63078 125428 -287986 -88970
10747b2834G2108J70065q5654r848L5701G1816J66033J04211j23256g0257j74258
10736b44515h5005p0712J1306B63301D4803a18276B6845d08656C7264K0920Q9229
10725A47413K67249a41648p363k2694e0514A0151J50233l9524K06196b0645k68000
10714b88645C8466a44448k40866a67015N852A55349b76133J25051n120L8566F0043
10702C2837O6581i658l15252o5249i0505E9440K8635b78516J29552a1393m96470
10691e07863p360D49281b09909g8585o331c6811j04902D567a99363N6037B54378
10679b62538J6643F6639a36400D04130D7856a38355m143r225a3685n21421A9030
10667C49a5715j81068I2886J27209f8272A59873a5655j80078j66430a14675e3385
$$ plain form
10747 -22834 72108 242173 156519 146671 182372 71816 237849 342060 218804 -70257 -244515
10736 -244515 -85005 -155717 -144411 263301 44803 -118276 26845 -408656 37264 58184 147413
10725 147413 414662 -141648 -149011 -171705 -50514 10151 160384 120860 327056 -20645 -288645
10714 -288645 38466 -144448 -385314 -167015 -161163 155349 -276133 -151082 -156202 -117636 60043
10702 32837 99418 -9658 -324910 -390159 -90505 59440 88075 -278516 -148964 -11393 -507863
10691 -507863 -515223 449281 -209909 -78585 -84916 -36811 -141713 4567 -199363 -143326 254378
10679 -262538 -245895 66639 -136400 404130 47856 -138355 -142498 -151723 -13685 -535106 19030
10667 349 -15715 -196783 92886 220095 -68272 159873 -15655 -195733 -362163 -114675 -53385
10655E1836f6076m0425E4986b79095P2234B97440d7430C48079D0094a31746j45332
10644b77078A71941a54773j3638k65666A09846a16758j36186C1769P1443b2470
10633A26661a30911A60303c9673E1592c33936e8362J0174B03976o1487i6640k10616
10622c07256a40464n7170i0433A87808B6961J46184a31552M4972A60840f6510
10611b49808C2243J02065a72702c406j44528M3747I8161a60458m2591A61583o5605
10600I5978d2883q5339a9941k54308c7310k0516I0030h5727k49826A32728k1402
10589A11326L728J0368A9567c0837I2223a09183k8526M9122d0823A56049b29443
10577b43706F9960a49936j72511J23750P2936A52388a85923A64452b16439I7821
$$ plain form
10655 51836 -66076 -106501 54986 -279095 -206861 297440 -47430 348079 40094 -131746 -277078
10644 -277078 171941 -154773 -168411 -434077 109846 -116758 -252944 31769 103212 -22470
10633 126661 -130911 160303 -39673 51592 -333936 -58362 -48188 203976 142489 -96640 -307256
10622 -307256 -140464 -197634 -90433 187808 26961 173145 -131552 -86580 160840 -66510
10611 -249808 32243 134308 -172702 -3406 -147934 -104187 98161 -160458 -203049 161583 95978
10600 95978 -42883 -128222 -19941 -274249 -37310 -57826 90030 -85727 -335553 132728 111326
10589 111326 115054 125422 19567 -30837 92223 -109183 -137709 -88587 -40823 156049 -229443
10577 -243706 69960 -149936 -322447 -198697 -125761 152388 -185923 164452 -216439 97821
10566b1183A60070a49734j97377a04489m88924b79253B39115a17256k09906J13679
10556b13483a4508B48173b31747g5271j56746G501K40033A02569M5518a60458
10545C5160a73497B7694K5916f3457A02263e1979A5082J0894a98253g598o3243
10534g0841B2734c56665b8019D7518a21679M2155D1086a25593b4921A54298b63744
10522i4685r0959A03173h1786k41603F7857a4062A63462M233b8532O716j05974
10511a27790m99236i9347b0543k13983B78589F617a61988r5052B2749N1621J37942
10500B12312d3359A63011j512e2373H5792Q2344b4940o2896l6374A36180m4001
10489I2179k9560a38297G5916L3321c9465F2884g2423B89269i18l51818E2066
$$ plain form
10566 -21183 160070 -149734 -347111 -104489 -593413 -279253 239115 -117256 -327162 -213483
10556 -213483 -14508 248173 -231747 -75271 -232017 7501 247534 102569 148087 -160458
10545 35160 -173497 27694 53610 -63457 102263 -51979 15082 25976 -198253 -7598 -70841
10534 -70841 22734 -356665 -28019 47518 -121679 -79524 41086 -125593 -24921 154298 -263744
10522 -94685 -185644 103173 -81786 -323389 67857 -14062 163462 167695 -28532 -21816 -127790
10511 -127790 -627026 -99347 -20543 -234526 278589 6617 -161988 -257040 22749 74370 212312
10500 212312 -43359 163011 161499 -52373 85792 168136 -24940 -87836 -124210 136180 92179
10489 92179 62619 -138297 75916 109237 -39465 62884 -72423 289269 -918 -352736 52066
10477A56797J49924h312E8565J80268j3854n6488c3129j08679A79877p1027a37027
10465A4968J09610b89027j07488G3467a77407D66253A73167b20829N9526O8068
10455i3235B18463h9922m3228J5048B9740b53610A41810C7136Q007K07201a13160
10443A8466c015B654J502K28526B5648J50286C1396a2255l54612e7004B13644
10431G0324k7811a90835A67384G9311b3381o1974l5306A5920K01925L8438B100
10419B32512F0283h3364j10022L605D2252d8702k1782n2991j45947A73742g054
10407I0833D1294J60711F8050J24788k2636A3575a34048F6766a04954F8993M4414
10396A13407J6088O3443J14219b4209B17235B3596a50127A07712b03234a2152
$$ plain form
10477 156797 306721 -8312 58565 238833 224979 168491 -33129 -141808 179877 108850 -137027
10465 14968 124578 -289027 -396515 73467 -177407 466253 173167 -220829 -161303 -93235
10455 -93235 218463 -89922 -133150 -118102 29740 -253610 141810 37136 45143 252344 -113160
10443 18466 -3015 2654 4156 232682 25648 175934 31396 -12255 -366867 -57004 213644
10431 70324 42513 -190835 167384 79311 -23381 -85355 -120661 15920 217845 256283 2100
10419 232512 60283 -83364 -193386 -189781 42252 -48702 -70484 -123475 -269422 173742 -7054
10407 90833 41294 202005 68050 192838 170202 13575 -134048 66766 -104954 68993 113407
10396 113407 129495 192938 307157 -24209 217235 23596 -150127 107712 -203234 -12152
10385E8177Q3602m5006c7824C50157m9868a03781H7067P5943M02134B03911J44351
10374C48262r2713O8403O7057j0963K10162A54753O09622l04613k4141A49845
10363C56187M9852R2842A95427r1219K07443a1716F1708Q1328K94456P1349n7863
10352D50978J48986j86431K86886B72252M6253o8897J45880A59431E3896P1829
10342A25725K3403G2543J47775L45947A51260a37170B83461A21348K26449c73577
10331C47093j70889E3953M266J9581g2970A55153h6120D7422K55846J28074J2709
10320D44051b2815A40860I224K60587J97306E592N76465B13384g4385l17059J29903
10309b61541J29920A21711b70348P2962R0523F4656a58515K4836B9928J3359J61890
$$ plain form
10385 58177 141779 96773 -37824 350157 300289 -103781 87067 163010 565144 203911 348262
10374 348262 255549 323952 391009 380046 590208 154753 764375 459762 435621 149845
10363 356187 406039 498881 195427 104208 311651 -11716 61708 143036 437492 508841 450978
10352 450978 599964 413533 700419 272252 318505 249608 395488 159431 53896 125725
10342 125725 149128 72543 220318 566265 151260 -137170 283461 121348 347797 -373577
10331 347093 176204 53953 58219 77800 -72970 155153 -86120 47422 303268 431342 444051
10320 444051 -22815 140860 9224 269811 467117 5592 582057 213384 -74385 -391444 -261541
10309 -261541 -131621 121711 -270348 -197386 -106863 64656 -158515 -133679 29928 43287 205177
10298B05177H3460a30088H1324L8204a44057M5249J5279j46119A66193a78700
10287c30974b5352m2115j8580p4409l75351h0715m39887K45536F9884b24308j60396
10276c84704J27232f5834A30852c39232H777a18197B64696a17054j13525d8041
10265E1651N3013B0685b3553B33898j10205J97414j32492G7268b06861C53582
10254B943a43003n0338Q0922k16120i8495C3645f5948p2804k8672A6911J14475
10243A31386k8990N2930b13396A32269m2471b84794i8245a7602k62994a26857
10232c8029j2027j47315n3290b5499J0638o6637q3578B12871a57804j42828A83966
10220A62883b56778a5916k70830A02478C4604h2213b554A06881b65593C86572
$$ plain form
10298 205177 83460 -130088 81324 119528 -144057 -98808 -83529 -229648 166193 -178700
10287 -330974 -25352 -67467 -86047 -160456 -535807 -80715 -520602 -275066 69884 -224308 -384704
10276 -384704 -257472 -65834 130852 -339232 8777 -118197 264696 -117054 -230579 -48041
10265 51651 104664 20685 -23553 233898 123693 321107 188615 77268 -206861 353582
10254 2943 -143003 -193341 -112419 -328539 -98495 33645 -65948 -138752 -167424 16911 131386
10243 131386 102396 155326 -213396 132269 89798 -284794 -98245 -17602 -280596 -126857
10232 -38029 -50056 -197371 -250661 -25499 -14861 -81498 -165076 212871 -157804 -300632 183966
10220 162883 -256778 -15916 -286746 102478 34604 -82213 -2554 106881 -265593 386572
10209a61495L9892A01L6103a57226q1829A0524b19344N4752P7078F7011a48183
10197B53584n6534b765F9705A4418l824R6644a94272a2057A54712F2630O6225
10186A28855B7685a49847m9517p7177c3325k6276p1739A51154E4174p520c40399
10174a24210A52272l5464C0332c83449a22187p2488e59A54733a40509j65434r1411
10163c97354J66266h0411j17902q9382i5825c0593l26374F7640O7244a73899B14832
10151a10560q2769F144a07131B44748b13504d7568k8923l2482N2155D1075a02508
10139a5427j20866A89337a18706C77737i8490D9985J76315a37514j92014A52453
10128b21403A55833a63301K6698M7602F8351l735r238a72736A60448a85099f27
$$ plain form
10209 -161495 -121603 101 36204 -157226 -239055 10524 -219344 -164592 -87514 67011 -148183
10197 253584 197050 -2765 69705 14418 10594 107238 -194272 -12057 154712 62630 128855
10186 128855 27685 -149847 -199364 -276541 -33325 -59601 -131340 151154 54174 46654 -340399
10174 -124210 152272 116808 30332 -383449 -122187 -194675 -559 154733 -140509 -305943 -397354
10163 -397354 -231088 -80411 -198313 -287695 -95825 -30593 -356967 67640 134884 -173899 214832
10151 -110560 -193329 6144 -107131 244748 -213504 -47568 -76491 -108973 -56818 41075 -102508
10139 -15427 -136293 189337 -118706 377737 -98490 49985 226300 -137514 -329528 152453
10128 -221403 155833 -163301 -136603 -89001 68351 64616 55378 -172736 160448 -185099 -627
10116g3599B04752a5927l10708a06928k23520L4624B41603G6338h2795A53165
10105E1652g0606B00562B5315K47954c66197F1587N9072d070C19623b53963c6814
10093A22687a38878B77636c74852J68317L7384d4003o5262k5201B50427f519j03269
10082a09788b5561l31219A30970a61194d9599C6109b79851j01396G9678l881b50513
10070A7158O3054L7945i8996B07694b8165I5872a46193I1681c41473a27406j1613
10059a39019B9957b45023i7352l17164H8016D3132j0683b76926G9886C1534c0200
10047a1448A58561D6706b00830a4095n0446A20578e2957B30643C5561f1819j07659
10036a69478m78180a55585D9376A6706K49479F1602a75407B14642G3368K7231
$$ plain form
10116 -73599 204752 -15927 -326635 -106928 -330448 -295824 241603 76338 -82795 153165
10105 51652 -70606 200562 25315 273269 -366197 61587 120659 -4070 319623 -253963 -36814
10093 122687 -138878 277636 -374852 -206535 -169151 -44003 -109265 -134466 250427 -6519 -109788
10082 -109788 -25561 -356780 130970 -161194 -49599 36109 -279851 -381247 79678 75797 -250513
10070 17158 80212 118157 -98996 207694 -28165 95872 -146193 91681 -341473 -127406 -139019
10059 -139019 29957 -245023 -97352 -414516 88016 43132 32449 -276926 79886 31534 -30200
10047 -11448 158561 46706 -200830 -14095 -64541 120578 -52957 230643 35561 -61819 -169478
10036 -169478 -647658 -155585 49376 16706 266185 61602 -175407 214642 73368 100599
10026A00599d1535j72873A12030k9037a12419A65496A2706R5942f714l48267J19796
10015b35185C44096H9850J8453a09431B98762A28704J64931A4334J98188d35997
10004b33745Q6508n0001i1162l5444f1498A0596J51449a02302l2764R21A50511
9992a09728F9997B2347J72052a07913I2663D4756C348K0264b36410k01050I2274
9980a76999G0792c49852J60396M2438f8365m993A02145a32627j38641A04834b05891
9968b9071B8269R6092M3017a62517L0729A96136b72734H5689d08776F5944b24743
9956h5291A70220e4351a4289k63508b6884j8982q38h997j62792G9892e62992I4715
9943b71379g6814L6139j89869D06692i6353b5816j71746A6576c9679j82691r5121
$$ plain form
10026 100599 -41535 -214408 112030 82993 -112419 165496 12706 108648 -6714 -354981 -235185
10015 -235185 344096 89850 108303 -109431 298762 128704 293635 14334 212522 -435997
10004 -233745 -147237 -197238 -91162 -126606 -61498 10596 162045 -102302 -135066 -134145 150511
9992 -109728 69997 22347 194399 -107913 92663 44756 3348 23612 -236410 -437460 92274
9980 -176999 70792 -349852 -189456 -147018 -68365 -73358 102145 -132627 -271268 104834 -205891
9968 -29071 28269 124361 167378 -162517 -131788 196136 -272734 85689 -408776 65944 -224743
9956 -85291 170220 -54351 -14289 -277797 -26884 -45866 -46704 -8997 -171789 79892 -562992 94715
9943 -271379 -76814 -40675 -230544 406692 -96353 -25816 -197562 16576 -39679 -222370 -317491
9932c17491h8704B2288e8333h06A1091P6365j8929e38456a68737A69980e4976
9920b5280q5878B5316e9006k52621d3215B9875f7957K4585j00216R777M0135K6520
9908f7156F9366d02720a80098j18286e2205q2674J4483J1459B99614a5320q0485
9897i5805A24544c6864q4779G0690Q7660B1718b27478A88097N6676a44254B19469
9885A95056G4487A3034h8818G4092J25344I2679a26398B92019j30054b04A4134
9873b35590A43482a04045n6570A04044b61525e3371j27827N9467K6779E5509O8030
9862A23539D1707f3064k3476m7173O0425k0811I2229i250E2118a00274C3889h0166
9849e29077a95997D4225g0369j46835i6075k57617h9962j1097c6550j6862k78127
$$ plain form
9932 -317491 -88704 22288 -58333 -806 11091 87456 68527 -538456 -168737 169980 -54976
9920 -25280 -111158 25316 -59006 -311627 -43215 29875 -67957 -43372 -143588 -133811 -93676 -67156
9908 -67156 69366 -402720 -180098 -298384 -52205 -134879 -120396 -108937 299614 -15320 -95805
9897 -95805 124544 -36864 -121643 70690 158350 21718 -227478 188097 244773 -144254 219469
9885 195056 74487 13034 -88818 74092 199436 92679 -126398 292019 161965 -204 14134
9873 -235590 143482 -104045 -160615 104044 -261525 -53371 -181198 -121731 -94952 55509 123539
9862 123539 41707 -63064 -86540 -133713 -73288 -94099 92229 -9250 52118 -100274 33889 -80166
9849 -529077 -195997 44225 -70369 -217204 -96075 -353692 -89962 -101059 -36550 -53412 -331539
9838c31539f2544j34623N38G4286i9062E4966r968c15349J16642I3280a76735
9826a44710k56178J23836B5048c7637B87417E4471a72881N9853l36519A52378
9815A89463b17445J4984C2728A1293c74241B33814p8067c6423B6260J4875b39355
9803G1550d49002a46898E6192A2092K81053i1571n140m2002B8544J07429c41860
9791a75616e6545C34536E2556i2047B15626B5381o564a15336D292L027b1264j78398
9779a99662A63624b89513A2125K8213a9071p9979D6406J18265H902b749j36303
9768a39052F6106J23147b49249j73640A70451e5977h843k81927C6966j4469a51021
9756h0501j42900g8484o6870k98644a35582j24034A4909f9291r2703B92892E5916
$$ plain form
9838 -331539 -62544 -197167 -196629 74286 -99062 54966 44998 -315349 -198707 93280 -176735
9826 -144710 -400888 -277052 25048 -37637 287417 54471 -172881 -113028 -449547 152378
9815 189463 -217445 -202461 32728 11293 -374241 233814 155747 -36423 26260 41135 -239355
9803 71550 -449002 -146898 56192 12092 293145 -91571 -96711 -138713 28544 135973 -341860
9791 -175616 -56545 334536 52556 -92047 215626 25381 18817 -115336 4292 7319 -21264 -199662
9779 -199662 163624 -289513 12125 40338 -19071 -99050 46406 164671 8902 -2749 -139052
9768 -139052 66106 189253 -249249 -422889 170451 -55977 -8843 -290770 36966 22497 -151021
9756 -80501 -223401 -78484 -145354 -443998 -135582 -259616 14909 -69291 -161994 292892 55916
9744a4818A54246a70573O1927r9369B05002c06168M9525B12791J29504h8796j64954
9733b53750A13000b95451K7711J06274r6060C00137a66479j37084n8802a6272
9722a78629j46696a16292k92512a08759I9716B4249b1349r3810m4448N4050j66835
9711b72392e7229C7899b82121A59269g597B12726b52834a2864A94358a12433K1159
9700i1274F1346J50500D4955c21252a4519k6679B1815d3387A59592b56629A56289
9688b02066q498j86198B10701b8068B48321a97863B6965O0549A2501a71406j20043
9677b91449J32495l4P1911j04270a4015O946K244q0732j51390f4267A8409J3109
9665C1518a31503k95384J74373I5491a94142c2953k3386g536l86698A58546B9169
$$ plain form
9744 -14818 154246 -170573 -108646 -208015 205002 -306168 -256643 212791 342295 -88796 -253750
9733 -253750 113000 -295451 -267740 -161466 -257526 300137 -166479 -303563 -362365 -16272
9722 -178629 -325325 -116292 -408804 -108759 99716 24249 -21349 -115159 -159607 -105557 -272392
9711 -272392 -57229 37899 -282121 159269 -7597 212726 -252834 -12864 194358 -112433 -91274
9700 -91274 61346 211846 44955 -321252 -14519 -41198 21815 -43387 159592 -256629 156289
9688 -202066 -210564 -396762 210701 -28068 248321 -197863 26965 87514 12501 -171406 -291449
9677 -291449 -158954 -158988 -87077 -191347 -14015 -7069 -4825 -85557 -236947 -64267 18409 31518
9665 31518 -131503 -426887 -252514 95491 -194142 -32953 -56339 -7536 -394234 158546 29169
9653A07855J04979b5537l05802A15482a79215k27184A78761m5537a83417B3166
9642D7249K90595a82312g7474j06595P5127B123a44739c7959A43668a27448G3620
9630B95473b46313A26241J08762a13622c2603A5035a12672J9310a4714A97158
9619A39615c06872d5290o9353I6055a3026k74900F1405j3679j2524J79908f9211
9607a1335G4048b7756n9124J2706A88089c17598a10917D9094a97031d5780I4647
9595c4839p6084q9826b7984l04330J15964R6721e2106C6795d4628A81997J25221
9584C07218p9983g8574A50393o7514Q9203d9781k36907J00280b3155D7851a6659
9572D7792O3962l2721Q1453F1614b23458a00269L2270m8963A51664a19091M5856
$$ plain form
9653 107855 212834 -25537 -331339 115482 -179215 -406399 178761 133224 -183417 23166
9642 47249 337844 -182312 -77474 -184069 -108942 2123 -144739 -37959 143668 -127448 73620
9630 295473 -246313 126241 235003 -113622 -32603 15035 -112672 -93362 -14714 197158
9619 139615 -306872 -45290 -114643 96055 -13026 -287926 61405 47726 35202 215110 -69211
9607 -11335 74048 -27756 -86880 -74174 188089 -317598 -110917 49094 -197031 -45780 94647
9595 -34839 -110923 -200749 -27984 -332314 -216350 -119629 -52106 36795 -44628 181997 307218
9584 307218 227235 -78574 150393 82879 172082 -49781 -286688 -186408 -23155 47851 -16659
9572 47792 111754 79033 160486 61614 -223458 -100269 -67999 -116962 151664 -119091 -73235
9561g3235A03446f5259n0709a5740C85512f691B7282b6054n1414B4225b6760k9136
9549e5896A0321b42370a2480A89329a32123b31l00353a9043G024b4733P264m8268
9537f5737m4049I4946m3410f7442k77100g5076q8999k27959E028f0417j37377
9526a97794o316A04094j1961b47781g5893H1899f8423j12165m0179A21998b80237
9514a90015k9492B7997K688a94692A58529i3776J8323l42079H6538a67955J3224
9503a54731o1139b2316D9341b96262d144m66157b19105L6034O5630B70489I0273
9491i7222l43960J24623f3393p2518B68979d7666k362m1436j34951j28515A70512
9479a40545A25340g4079k45372c2033j83600d3127j44857L2279C3638b25785C0428
$$ plain form
9561 -73235 103446 -65259 -115968 -15740 385512 -6691 27282 -26054 -77468 24225 -26760 -55896
9549 -55896 10321 -242370 -12480 189329 -132123 -231 -300584 -19043 7024 -24733 -17469 -65737
9537 -65737 -109786 94946 51536 -67442 -344542 -75076 -164075 -392034 5028 -60417 -197794
9526 -197794 -204110 104094 92133 -247781 -75893 81899 -68423 -180588 -220767 121998 -280237
9514 -190015 -219507 27997 30685 -194692 158529 -93776 -75453 -417532 86538 -167955 -154731
9503 -154731 -215870 -22316 49341 -296262 -4144 -470301 -219105 -183071 -117441 270489 90273
9491 -97222 -441182 -316559 -63393 -135911 268979 -47666 -50028 -91464 -226415 -354930 170512
9479 -140545 125340 -74079 -319451 -32033 -215633 -43127 -187984 -155705 33638 -225785 30428
9467a16299F8235a32709E296J31813c28430a41549E7780J13136a03225A051L4815
9456C5866g5604D04382A23562a55142l15N1814K5083f827m36804g7978A19665
9444B93249A0893b33061J09828A9056a0001E4730e6007O157r9663B7179a71716
9432d00514e8193B18574K67367a4510j10172A60478b2140A14278n6909a55186
9421B0294r540b68612C6478L64389H3737j6332b84520a10635j8618j02441p6150
9410c07844B24887b29740l5106B56765a49509q0727o048n3720H0932b76912a0982
9398a85430b6783j03837A2212J59850F0474a45979J1375B16752N5826b60668L5512
9387b25156g6322B13302b521k46188D208R2959f4995K2412F2789P8575a28660
$$ plain form
9467 -116299 68235 -132709 5296 137109 -328430 -141549 57780 170916 -103225 1051 35866
9456 35866 -75604 404382 123562 -155142 -155457 -103643 -78560 -6827 -443631 -77978 119665
9444 293249 10893 -233061 -123233 19056 -10001 54730 -56007 -49850 -149513 27179 -171716
9432 -400514 -58193 218574 485941 -14510 -124682 160478 -22140 114278 57369 -155186
9421 20294 10754 -268612 36478 400867 83737 67405 -284520 -110635 -129253 -231694 -307844
9410 -307844 224887 -229740 -264846 256765 -149509 -230236 -236284 -290004 80932 -276912 -10982
9398 -185430 -26783 -130620 12212 172062 60474 -145979 -134604 216752 272578 -260668 -225156
9387 -225156 -76322 213302 -2521 -248709 4208 97167 -64995 -42583 62789 141364 -128660
9375A3010J34347G2572b18645k5255B7883I35b95421A09671C0559f9934r6578
9364a66512k3829B12022b49179j8709a4614I1913f6307l63296J93688B66272N2357
9353C18629b26632i9388l5660j9103l12942b8147A92311r5261N8250p7627c05122
9341d9192B059R7079B6076d5710A01608d110n1416A06381g1816b5444I816a56753
9328B75598c4391N614q8139a551k55110R2209l2560A15719K80069a197A08225
9316e9601d800k6767A53289a68121M1910A56250O2493g9144j17956k1660N0320
9305a68440b3521o6894l72144d9484A71449D4821b85199B49322B533a95772A30079
9293b43023j68547G4217l6578J15898b1331k16921O3793E237b40616b2453A49634
$$ plain form
9375 13010 147357 72572 -218645 -243900 27883 935 -295421 109671 30559 -69934 -166512
9364 -166512 -190341 212022 -249179 -267888 -14614 91913 -66307 -429603 -235915 266272 318629
9353 318629 -226632 -99388 -135048 -154151 -467093 -28147 192311 97050 155300 77673 -305122
9341 -49192 2059 99138 26076 -45710 101608 -4110 -55526 106381 -71816 -25444 9816 -156753
9328 275598 -34391 -28777 -116916 -1551 -256661 -164452 -197012 115719 395788 -1197 108225
9316 -59601 -4800 -31567 153289 -168121 -126211 156250 218743 -79144 -197100 -218760 -168440
9305 -168440 -23521 -90415 -462559 -49484 171449 44821 -285199 249322 2533 -195772 130079
9293 -243023 -411570 74217 37639 153537 -21331 -238252 -174459 5237 -240616 -22453 149634
9281g0720a7881o1459B9018b38186Q6158B97084a31019f5413j59659B37467a06209
9269A54108f7130A05212b04234C10519b25403f5457J2430m7863m976c5713o1816
9258i7529p5533l5978A0509b31604O9215F5121b28919G9342a52398a2636k45724
9247b58360L2680F15N7452f1924j62488f0501l46289a53368a1323k5730E22962
9235c31150M0538a24873j64420M0317h708B45995h6925A75332i3681F2721a92678
9223c153l2222D01258f3596k73592f1254j10568A95311r2700C1706a24663A74445
9211a61210B89469j12659a8480k43500G584b30837C1401c55724a49003b7753k00704
9200b28457P0889b4822j03719R460k11046h3580A35320i1706I0318a04470a6918
$$ plain form
9281 -70720 -17881 -79340 29018 -238186 -152028 297084 -131019 -65413 -225072 237467 -106209
9269 154108 -67130 105212 -204234 310519 -225403 -65457 -53027 -100890 -105866 -35713 -97529
9258 -97529 -173062 -209040 10509 -231604 -162389 65121 -228919 79342 -152398 -12636 -258360
9247 -258360 -225680 615 58067 -61924 -224412 -60501 -406790 -153368 -11323 -37053 522962
9235 -331150 -290612 -124873 -289293 -248976 -8708 245995 -86925 175332 -93681 62721 -192678
9223 -3153 -35375 401258 -63596 -337188 -61254 -171822 195311 102611 31706 -124663 174445
9211 -161210 289469 176810 -18480 -261980 7584 -230837 31401 -355724 -149003 -27753 -228457
9200 -228457 -157568 -24822 -128541 -119081 -330127 -83580 135320 -91706 90318 -104470 -16918
9188c7735j60957I3804b4377g13I6839A4251L9779b1646G4340R1324R211c37410
9175a4278A96528c09945c1305A05086m7156g8312C77532b79941Q4273L4129A30965
9163c73160A9626d81510a69234q9782A3703b38677k78824C52872A07994c45286
9152i1579o0647M1113A23175n9758a39990j37985A26690N838e7552p9602H8503
9140c21560R5271a01288m2327A16198D6040a62301j6233D12458k00217a01487
9129b10320g2256j73377j05115C66407b2231A81400d3924k3000H1647b95340F2325
9117B57939b0018q7419G3540b32606j22468J70168M7065k75018R8540j09114C7488
9105C3484h2289k81254g1842n1254j88315Q7447h4916r726B06749a30159A7731
$$ plain form
9188 -37735 -198692 93804 -24377 -713 96839 14251 54030 -21646 74340 165664 174875 -337410
9175 -14278 196528 -309945 -31305 105086 57930 -78312 377532 -279941 -195668 -161539 130965
9163 -373160 19626 -481510 -169234 -259016 13703 -238677 -517501 352872 107994 -345286
9152 -91579 -152226 -111113 123175 63417 -139990 -277975 126690 132528 -57552 -137154 88503
9140 -321560 -226289 -101288 -143615 116198 46040 -162301 -178534 412458 212241 -101487
9129 -210320 -72256 -245633 -350748 366407 -22231 181400 -43924 -66924 81647 -295340 62325
9117 257939 -20018 -107437 73540 -232606 -355074 -184906 -137841 -412859 -314319 -423433 37488
9105 33484 -82289 -363543 -71842 -123096 -311411 -223964 -84916 -94642 206749 -130159 17731
9093C7611g9835A71830p4512B2727a09369j25812A58901b12365J5908g7920b7855
9081A14510a46740D31613f52859A9831K03853c17536a21506l6115I4058J23900
9071B17958K6726b12912A77948h7848p1806q2469I9621K75896a84569e2167A42593
9059c47922C49169b7143n651G9593a9242j24913I9731a79028h719d141j88737
9048a92878A49083a23618j21254A66868q1337j568i2325J0531A32267c55003A96869
9036C8706c21560E8531h3912j03475A37348l1652J32913b86467A24483a27270
9025A05561K0121P6155d0471k26156G1998K74B3280i6057D7099L5323a48341j62124
9013c10465B5529b286q9355H3220a42039m0621e4814A52902b1486N973F7939J84013
$$ plain form
9093 37611 -79835 171830 97318 22727 -109369 -235181 158901 -212365 -196457 -77920 -27855
9081 114510 -146740 431613 -652859 19831 223684 -317536 -121506 -157621 94058 217958
9071 217958 244684 -212912 177948 -87848 -159654 -242123 99621 375517 -184569 -52167 142593
9059 -347922 349169 -27143 -32794 79593 -19242 -144155 99731 -179028 -8719 -4141 -192878
9048 -192878 149083 -123618 -244872 166868 85531 83963 -92325 -81794 132267 -355003 196869
9036 38706 -321560 58531 -83912 -187387 137348 105696 238609 -286467 124483 -127270
9025 105561 125682 201837 -40471 -266627 71998 72272 23280 -96057 47099 82422 -148341 -310465
9013 -310465 25529 -2286 -91641 83220 -142039 -182660 -54814 152902 -21486 -15513 67939 251952
9001B51952i8827E2737a0955k07583j06293J53696j77436c9577A66655C8326f6207
8989e8354k1963b7683j0217l0893B1156J62123d0541l9243j2778c3771B68760
8977A04345e04215B60231e9324A4726b15423B56590r8565d6815n3860C24187f6004
8965a88115C4734b44601f8655K315l58215A28987a71682A82269b21076E0792b69929
8953b18823K9935A7728K22948a83843A71217B6367a13934k25333A67350b87309
8942C02108a33954I3715h9431A78742b71909A26139a01903A22118e6472N538I1350
8930D99481b1581E0019J64910p4080L90610j58872N45585J078308L191905B075411
8919F44285A95952F381K02619j00388R064i2674j74745r0119a68235j98323C7508
$$ plain form
9001 251952 -98827 52737 -10955 -218538 -324831 -171135 -348571 -39577 166655 38326 -66207
8989 -58354 -80317 -27683 -37900 -68793 21156 183279 -40541 -79784 -92562 -33771 268760
8977 104345 -504215 260231 -59324 14726 -215423 256590 158025 -46815 -100675 324187 -66004
8965 -188115 34734 -244601 -68655 -66340 -424555 128987 -171682 182269 -221076 50792 -269929
8953 -218823 -188888 17728 240676 -183843 171217 26367 -113934 -339267 167350 -287309
8942 302108 -133954 93715 -89431 178742 -271909 126139 -101903 122118 -56472 -50934 91350
8930 499481 -21581 50019 214929 140849 531459 372587 918172 1996480 5188385 2075411
8919 644285 195952 6381 209000 108612 117676 -92674 -267419 -357538 -168235 -366558 37508
8907A67230b07080A46112g8569m5764L5217b7877o8107j95208A71102M9943b56103
8895c34185J13467R5158A80522c1287A85969h0339F1880k7438b74416L1909J06784
8884a35723n0210f8505C1272c20642A7188h2265o3651e4827A27290D3140J96442
8873B39582C277J44436a84570I5637P8994c59496i1564A746L6633a18592H0639
8861c02174I5015G026L9797j6578b36610O1119j78708f4331k87952i0144A63308
$$ plain form
8907 167230 -207080 146112 -78569 -124333 -89116 -27877 -95984 -291192 171102 221045 -256103
8895 -334185 -220718 -125560 180522 -31287 185969 -80339 61880 34442 -274416 -242507 -135723
8884 -135723 -185933 -68505 31272 -320642 17188 -82265 -145916 -54827 127290 43140 239582
8873 239582 3277 147713 -184570 95637 174631 -359496 -91564 1746 38379 -118592 80639
8861 -302174 95015 7026 46823 30245 -236610 -175491 -354199 -64331 -352283 -90144 163308
$$ [...]
##END NTUPLES=NMR SPECTRUM
##END=
