
##TITLE=AC1367_2285_7221507_Xg8aSAJzSg
##JCAMPDX= 6.0         $$ Bruker NMR JCAMP-DX V2.0
##DATA TYPE= NMR SPECTRUM
##DATA CLASS= NTUPLES
##ORIGIN= BRUKER
##OWNER= Administrator
$$ 1.72 TOPSPIN		Version 2.1
$$ 2012-12-17 16:14:52.895 -0500  Administrator@X
$$ Compression mode = diff/dup
##.OBSERVE FREQUENCY= 400.02188249412
##.OBSERVE NUCLEUS= ^1H
##.ACQUISITION MODE= SIMULTANEOUS (DQD)
##.ACQUISITION SCHEME= undefined
##.AVERAGES= 64
##.DIGITISER RES= 22
##SPECTROMETER/DATA SYSTEM= spect
##.PULSE SEQUENCE= noesygpps1d.comp
##.SOLVENT NAME= COFFEE_meoh
##.SHIFT REFERENCE= INTERNAL, COFFEE_meoh, 1, 14.96059
##AUDIT TRAIL= $$ (NUMBER, WHEN, WHO, WHERE, PROCESS, VERSION, WHAT)
$$ ##TITLE= Audit trail, TOPSPIN		Version 2.1
$$ ##JCAMPDX= 5.01
$$ ##ORIGIN= Bruker BioSpin GmbH
$$ ##OWNER= Administrator
$$ $$ E:\/data/COFFEE/nmr/AC1367_2285_7221507_Xg8aSAJzSg/32/pdata/1/auditp.txt
$$ ##AUDIT TRAIL=  $$ (NUMBER, WHEN, WHO, WHERE, PROCESS, VERSION, WHAT)
(   1,<2012-12-17 16:14:46.612 -0500>,<Administrator>,<X>,<go>,<TOPSPIN 2.1>,
      <created by zg
	started at 2012-12-17 16:03:16.882 -0500,
	POWCHK enabled, PULCHK disabled,
       configuration hash MD5:
       86 BA 57 50 F2 9D 5C 9B 26 00 A9 28 5F 66 2E 89
       data hash MD5: 64K
       49 2A 37 B0 6D 0F 55 44 C6 5F 49 E9 37 2E B5 C8>)
(   2,<2012-12-17 16:14:50.015 -0500>,<Administrator>,<X>,<proc1d>,<TOPSPIN 2.1>,
      <Start of raw data processing
       efp LB = 0.3 FT_mod = 6 PKNL = 1 PHC0 = 0 PHC1 = 0 SI = 128K 
       data hash MD5: 128K
       20 8D 6D 5D 4A 30 A8 4D 3C 4D 37 FE 5B 39 B9 41>)
(   3,<2012-12-17 16:14:51.160 -0500>,<Administrator>,<X>,<proc1d>,<TOPSPIN 2.1>,
      <pk PHC0 = -80.86487 PHC1 = 0 
       data hash MD5: 128K
       39 10 9F FD B9 DA BE 65 B8 E5 69 36 0A D5 30 21>)
(   4,<2012-12-17 16:14:51.817 -0500>,<Administrator>,<X>,<proc1d>,<TOPSPIN 2.1>,
      <abs ABSG = 1 
       data hash MD5: 128K
       72 C5 20 A3 19 F2 46 CF E8 D1 07 B6 E1 9D B8 51>)
(   5,<2012-12-17 16:14:52.019 -0500>,<Administrator>,<X>,<proc1d>,<TOPSPIN 2.1>,
      <abs ABSG = 2 
       data hash MD5: 128K
       64 FF 24 A5 0C 23 DA 80 99 A0 23 E6 91 50 3F 42>)
(   6,<2012-12-17 16:14:52.154 -0500>,<Administrator>,<X>,<proc1d>,<TOPSPIN 2.1>,
      <abs ABSG = 3 
       data hash MD5: 128K
       E6 BA 15 9F F1 5D EB C6 9F 31 35 B0 47 0D 5F 51>)
(   7,<2012-12-17 16:14:52.339 -0500>,<Administrator>,<X>,<proc1d>,<TOPSPIN 2.1>,
      <abs ABSG = 4 
       data hash MD5: 128K
       41 B8 BC CF 9D 65 68 E1 B5 D4 38 30 B2 8C FA B5>)
(   8,<2012-12-17 16:14:52.558 -0500>,<Administrator>,<X>,<proc1d>,<TOPSPIN 2.1>,
      <abs ABSG = 5 
       data hash MD5: 128K
       08 63 07 F6 14 89 BD 0A 8E B2 2A EC 48 7D DF 77>)
$$ ##END=
$$ 
$$ $$ hash MD5
$$ $$ 3D C3 5A 46 7D 82 D0 78 A5 5B D7 AD DA AB BF DA
##$RELAX= 
##$RELAX= 
##$RELAX= 
##$RELAX= 
##$RELAX= 
##$RELAX= 
##$RELAX= 
##$RELAX= 
$$ Bruker specific parameters
$$ --------------------------
##$DU= <E:\>
##$EXPNO= 32
$$ [...]
##$TP07= 0
##$TPNAME0= <>
##$TPNAME1= <>
##$TPNAME2= <>
##$TPNAME3= <>
##$TPNAME4= <>
##$TPNAME5= <>
##$TPNAME6= <>
##$TPNAME7= <>
##$TPOAL= (0..7)
0.5 0.5 0.5 0.5 0.5 0.5 0.5 0.5
##$TPOFFS= (0..7)
0 0 0 0 0 0 0 0
##$TUNHIN= 0
##$TUNHOUT= 0
##$TUNXOUT= 0
##$USERA1= <user>
##$USERA2= <user>
##$USERA3= <user>
##$USERA4= <user>
##$USERA5= <user>
##$V9= 5
##$VALIST= <valist>
##$VCLIST= <CCCCCCCCCCCCCCC>
##$VD= 0
##$VDLIST= <DDDDDDDDDDDDDDD>
##$VPLIST= <PPPPPPPPPPPPPPP>
##$VTLIST= <TTTTTTTTTTTTTTT>
##$WBST= 2048
##$WBSW= 25
##$XGAIN= (0..3)
0 0 0 0
##$XL= 0
##$YL= 0
##$YMAX_a= 6004416
##$YMIN_a= -11916970
##$ZGOPTNS= <>
##$ZL1= 120
##$ZL2= 120
##$ZL3= 120
##$ZL4= 120
##$ABSF1= 14.96059
##$ABSF2= -5.597591
##$ABSG= 5
##$ABSL= 3
##$ALPHA= 0
##$AQORDER= 0
##$ASSFAC= 0
##$ASSFACI= 0
##$ASSFACX= 0
##$ASSWID= 0
##$AUNMP= <proc_prof1d_extract.lims>
##$AXLEFT= 0
##$AXNAME= <>
##$AXNUC= <1H>
##$AXRIGHT= 0
##$AXTYPE= 0
##$AXUNIT= <>
##$AZFE= 0.1
##$AZFW= 0.1
##$BCFW= 0
##$BC_mod= 0
##$BYTORDP= 0
##$COROFFS= 0
##$CY= 15
##$DATMOD= 1
##$DC= 0
##$DFILT= <>
##$DTYPP= 0
##$F1P= 0
##$F2P= 0
##$FCOR= 0.5
##$FTSIZE= 131072
##$FT_mod= 6
##$GAMMA= 0
##$GB= 0
##$INTBC= 1
##$INTSCL= 1
##$ISEN= 128
##$LB= 0.3
##$LEV0= 0
##$LPBIN= 0
##$MAXI= 10000
##$MC2= 0
##$MEAN= 0
##$ME_mod= 0
##$MI= 0
##$NCOEF= 0
##$NC_proc= -2
##$NLEV= 6
##$NOISF1= 0
##$NOISF2= 0
##$NSP= 0
##$NTH_PI= 0
##$NZP= 0
##$OFFSET= 14.96059
##$PC= 1
##$PHC0= -80.86487
##$PHC1= 0
##$PH_mod= 1
##$PKNL= yes
##$PPARMOD= 0
##$PPDIAG= 0
##$PPIPTYP= 0
##$PPMPNUM= 2147483647
##$PPRESOL= 1
##$PSCAL= 4
##$PSIGN= 0
##$PYNMP= <proc.py>
##$REVERSE= no
##$SF= 400.020009801921
##$SI= 131072
##$SIGF1= 0
##$SIGF2= 0
##$SINO= 400
##$SIOLD= 131072
##$SPECTYP= <>
##$SREGLST= <1H.CDCl3>
##$SSB= 0
##$STSI= 131072
##$STSR= 0
##$SW_p= 8223.68421052631
##$SYMM= 0
##$S_DEV= 0
##$TDeff= 65536
##$TDoff= 0
##$TI= <>
##$TILT= no
##$TM1= 0
##$TM2= 0
##$TOPLEV= 0
##$USERP1= <user>
##$USERP2= <user>
##$USERP3= <user>
##$USERP4= <user>
##$USERP5= <user>
##$WDW= 1
##$XDIM= 131072
##$YMAX_p= 345512189
##$YMIN_p= -15394
##$CURPLOT= <Network HP LaserJet P1505>
##$CURPRIN= <$Network HP LaserJet P1505>
##$DFORMAT= <normdp>
##$LAYOUT= <+/1D_H.xwp>
##$LFORMAT= <normlp>
##$PFORMAT= <normpl>
##$SURQMSG= 1
$$ End of Bruker specific parameters
$$ ---------------------------------
##NTUPLES= NMR SPECTRUM
##VAR_NAME=  FREQUENCY,     SPECTRUM/REAL,   SPECTRUM/IMAG
##SYMBOL=    X,             R,               I
##VAR_TYPE=  INDEPENDENT,   DEPENDENT,       DEPENDENT
##VAR_FORM=  AFFN,          ASDF,            ASDF
##VAR_DIM=   131072,        131072,          131072
##UNITS=     HZ,            ARBITRARY UNITS, ARBITRARY UNITS
##FACTOR=    0.0627417313425164, 1,          1
##FIRST=     8223.62146879497, 1371,         -58404
##LAST=      0,             4654,            -58546
##MIN=       0,             -15394,          0
##MAX=       8223.62146879497, 345512189,    0
$$ Real data points
##PAGE= N=1
##DATA TABLE= (X++(R..R)), XYDATA
$$ [...]
63894D99912j2296j0208q771p673o983o866o901o232m524k345n10N72R90J140
$$ 499912 487616 477408 468637 460964 453981 447115 440214 433982 429458 427113 426603 427175 428165 429305
63880D29305J566K610M037N294O210P145Q375R656J0665J1458J2301J3329J4633
$$ 429305 430871 433481 437518 442812 449022 456167 464542 474198 484863 496321 508622 521951 536584
63867E36584J6416J8707K1133K3233K4920K6378K7763K9292L1298L3760L5973
$$ 536584 553000 571707 592840 616073 640993 667371 695134 724426 755724 789484 825457
63856H25457L7280L8025L9243M1245M3126M3802M3097M1515L9431L6937L4122
$$ 825457 862737 900762 940005 981250 1024376 1068178 1111275 1152790 1192221 1229158 1263280
63845A263280L1004K7331K2906J8053J3383R059M611m88o256j2298j8164k3525
$$ 1263280 1294284 1321615 1344521 1362574 1375957 1385016 1389627 1389139 1382883 1370585 1352421 1328896
63833A328896k8190l2087l5227l7645l9472m0965m2328m3405m3804m3353m2323
$$ 1328896 1300706 1268619 1233392 1195747 1156275 1115310 1072982 1029577 985773 942420 900097
63822I00097m1106l9821l8348l6602l4635l2494l0213k7942k5927k4351k3157
$$ 900097 858991 819170 780822 744220 709585 677091 646878 618936 593009 568658 545501
63811E45501k2065k0682j8739j6406j4359j3284j3139j3056j2195j0602r087q286
$$ 545501 523436 502754 484015 467609 453250 439966 426827 413771 401576 390974 381887 373601
63799C73601q079p920p509p003o677o589o516o155n460m726m292m135l939l546
$$ 373601 365522 357602 350093 343090 336413 329824 323308 317153 311693 306967 302675 298540 294601 291055
63785B91055l092k654k075j378j012j293j740j515n54J83j82j368k181j652K00
$$ 291055 287963 285309 283234 281856 280844 279551 277811 276296 275742 275925 275743 274375 272194 270542 270742
63770B70742K476M025M137K932J205k70j230j824k250k630l060l511l799l819
$$ 270742 273218 277243 281380 284312 285517 285247 284017 282193 279943 277313 274253 270742 266943 263124
63756B63124l742l779l833l634l171k750k522k244j622p54j19j10o26j025o26
$$ 263124 259382 255603 251770 248136 244965 242215 239693 237449 235827 235073 234954 234844 234218 233193 232567
63741B32567O01J827K166J626J065J114J585K057K572L269L774L624L138L084
$$ 232567 233168 234995 237161 238787 239852 240966 242551 244608 247180 250449 254223 257847 260985 264069
63727B64069L437L320K516K188L367N320O341N927N153M955N054M840M352L779
$$ 264069 267506 270826 273342 275530 278897 284217 290558 296485 301638 306593 311647 316487 320839 324618
63713C24618K825J305q2n31m03q52k272l774m426m269l960l850l773l424k678
$$ 324618 327443 328748 328666 328135 327732 326880 324608 320834 316408 312139 308179 304329 300556 297132 294454
63698B94454j767j185j185j320q72K58J362J742J353O29R6K17J083K067K334J922
$$ 294454 292687 291502 290317 288997 288125 288383 289745 291487 292840 293469 293565 293782 294865 296932 299266 301188
63682C01188J722K097K177J124m15r35R3J742K853L075K692K174K068K770M000
$$ 301188 302910 305007 307184 308308 307893 306958 307051 308793 311646 314721 317413 319587 321655 324425 328425
63667C28425M859M726L909L268L341L970M526M357L183J285o45j947k379k301
$$ 328425 333284 338010 341919 345187 348528 352498 357024 361381 364564 365849 365204 363257 360878 358577
63653C58577k515l609n247o274n871m475l212k568k069j118K88J777L027L808
$$ 358577 356062 352453 347206 340932 335061 330586 327374 324806 322737 321619 321907 323684 326711 330519
63639C30519M000L766L509L525L857M503N392O256O895P540Q484R402R686R499
$$ 330519 334519 338285 341794 345319 349176 353679 359071 365327 372222 379762 388246 397648 407334 416833
63625D16833R753J0669J1258J0822J0215J0759J2344J3704J4305J4975J6535J8790
$$ 416833 426586 437255 448513 459335 469550 480309 492653 506357 520662 535637 552172 570962
63613E70962K1180K3583K6004K8159K9940L1888L4519L7478L9836M1061M1189
$$ 570962 592142 615725 641729 669888 699828 731716 766235 803713 843549 884610 925799
63602I25799M0139L7478L2941K6825J9763J2396N367p34n598r283j1962j3774
$$ 925799 965938 1003416 1036357 1063182 1082945 1095341 1100708 1099974 1094376 1085093 1073131 1059357
63590A059357j4978j6003j7129j8328j9585k1204k3429k5887k7720k8407k8164
$$ 1059357 1044379 1028376 1011247 992919 973334 952130 928701 902814 875094 846687 818523
63579H18523k7458k6391k4733k2395j9603j6692j3931j1459r215o951m500k073
$$ 818523 791065 764674 739941 717546 697943 681251 667320 655861 646646 639695 635195 633122
63567F33122rJ716L472N385O990P827Q232R159J1050J3192J4503J4846J5191J6414
$$ 633122 633113 634829 638301 643686 650676 658503 666735 675894 686944 700136 714639 729485 744676 761090
63553G61090J8369K0459K2719K5716K9480L3275L6683M0258M4597M9250N3085
$$ 761090 779459 799918 822637 848353 877833 911108 947791 988049 1032646 1081896 1134981
63542A134981N5313N5305N1739M3105K9623J3951n25j1798j9525k4042k5834k5693
$$ 1134981 1190294 1245599 1297338 1340443 1370066 1384017 1383492 1371694 1352169 1328127 1302293 1276600
63530A276600k4557k3073k1532k0231j9601k0066k1936k5192k9145l2596l4803
$$ 1276600 1252043 1228970 1207438 1187207 1167606 1147540 1125604 1100412 1071267 1038671 1003868
63519A003868l6089l7100l7708l7236l5598l3504l1490k9401k6959k4303k1672
$$ 1003868 967779 930679 892971 855735 820137 786633 755143 725742 698783 674480 652808
63508F52808j9096j6648j4571j2850j1108r291p991p651p856p889p650p491p374
$$ 652808 633712 617064 602493 589643 578535 569244 561253 553602 545746 537857 530207 522716 515342
63495E15342o973o440o354o706o658n618m113l141k957k898k273j033L17J250
$$ 515342 508369 501929 495575 488869 482211 476593 472480 469339 466382 463484 461211 460178 460495 461745
63481D61745J588J547J497J648K040K741L825N033N722N398M241K906J840R68
$$ 461745 463333 464880 466377 468025 470065 472806 476631 481664 487386 492784 497025 499931 501771 502739
63467E02739N7q09j261j113p62r30j882k990l335k722j777j002k93M07O03Mo55
$$ 502739 502796 501987 500726 499613 498851 497921 496039 493049 489714 486992 485215 484213 483920 484327 484930 484934 484279
63450D84279l78O32J206J035J270K886N262P133Q337R770J1922J4383J6819J9540
$$ 484279 483901 484533 485739 486774 488044 490930 496192 503325 511662 521432 533354 547737 564556 584096
63436E84096K2931K6918L1316L6165M1394M6366M9967N0809M7563L9815K9051
$$ 584096 607027 633945 665261 701426 742820 789186 839153 889962 937525 977340 1006391
63425A006391J8210R685L945M00r60M56M597J0356J6615K2944K9109L4484L8424
$$ 1006391 1024601 1034286 1038231 1038631 1037671 1038127 1042724 1053080 1069695 1092639 1121748 1156232 1194656
63412A194656M0809M1695M0615L6802L0170K1732J2930M733k546q841j3980j7724
$$ 1194656 1235465 1277160 1317775 1354577 1384747 1406479 1419409 1424142 1421596 1412755 1398775 1381051
63400A381051k0006k1144k1877k3074k5247k8251l1516l4571l7283l9621m1342
$$ 1381051 1361045 1339901 1318024 1294950 1269703 1241452 1209936 1175365 1138082 1098461 1057119
63389A057119m2043m1418l9451l6476l3185l0284k7897k5391k2091j8209j4719
$$ 1057119 1015076 973658 934207 897731 864546 834262 806365 780974 758883 740674 725955
63378G25955j2273j0475q391n544k219R35L474N445P318R560J2110J4442J6208
$$ 725955 713682 703207 694816 689272 687053 687988 691462 696907 704225 713785 725895 740337 756545
63365G56545J7634J9150K0933K3045K5709K8993L2406L5312L7717M0186M2886
$$ 756545 774179 793329 814262 837307 863016 892009 924415 959727 997444 1037630 1080516
63354A080516M5249M6713M7334M7252M5992M2749L7270L0036K1720J2897M251
$$ 1080516 1125765 1172478 1219812 1267064 1313056 1355805 1393075 1423111 1444831 1457728 1461979
63343A461979l416r668j4596j8356k0782k1832k2197k3004k4826k7285k9699l1863
$$ 1461979 1458563 1448895 1434299 1415943 1395161 1373329 1351132 1328128 1303302 1276017 1246318 1214455
63331A214455l4047l6427l8719m0288m0511l9159l6643l3639l0366k6441k1617
$$ 1214455 1180408 1143981 1105262 1064974 1024463 985304 948661 915022 884656 858215 836598
63320H36598j6364j1337o633k247Q46Q50l212j0433j8702k5966l0776l2437l1329
$$ 836598 820234 808897 802264 800017 800863 801713 798501 788068 769366 743400 712624 680187 648858
63307F48858k8811k6184k3813k1477j9125j6864j4609j2376j0628r770r516r314
$$ 648858 620047 593863 570050 548573 529448 512584 497975 485599 474971 465201 455685 446371
63295D46371r169r297r300q530p206o168n524m577l285k696l371m356m528m142
$$ 446371 437202 427905 418605 410075 402869 396701 391177 386600 383315 380619 377248 372892 368364 364222
63281C64222m106m357m070l163k452k336k294j924j560j505j406q85l12l43r77
$$ 364222 360116 355759 351689 348526 346074 343738 341444 339520 337960 336455 335049 334164 333852 333509 332532
63266C32532j580j731j623j575j564j385j071q96r87j127j024o56k07K17O05Q13
$$ 332532 330952 329221 327598 326023 324459 323074 322003 321107 320120 318993 317969 317313 317106 317323 317928 318741
63250C18741O20P3m35n89m01j8M58Q18P95M47J50J2k79p17o56J30O73j5j298j540
$$ 318741 319361 319434 318999 318410 318009 317991 318449 319267 320062 320509 320659 320671 320392 319675 319019 319149 319822 319807 318509 316969
63230C16969m03O83O62K99P75J814K233J860J652K104K607K554K183J978J928
$$ 316969 316566 317249 317911 318210 318985 320799 323032 324892 326544 328648 331255 333809 335992 337970 339898
63215C39898J814J730J860K038J988J808J741J706J421R47P21R02J046N66n60
$$ 339898 341712 343442 345302 347340 349328 351136 352877 354583 356004 356951 357672 358574 359620 360186 359626
63200C59626j666j951j162K10J327J726J586J365J332J576K300L699N531P113
$$ 359626 357960 356009 354847 355057 356384 358110 359696 361061 362393 363969 366269 369968 375499 382612
63186C82612P965Q302Q737R563J0505J1077J0989J0340R582R277R634J0216J0244
$$ 382612 390577 398879 407616 417179 427684 438761 449750 460090 469672 478949 488583 498799 509043
63173E09043R327P790O308N329M852M572M116L234J958N51p64k029l415m954o494
$$ 509043 518370 526160 532468 537797 542649 547221 551337 554571 556529 557080 556316 554287 550872 545918 539424
63158E39424p960r493j1241j2984j4119j4210j3544j2925j2760j2573j1641j0031
$$ 539424 531464 521971 510730 497746 483627 469417 455873 442948 430188 417615 405974 395943
63146C95943q540p699p247o779o399o333o246n474l941k386j613j741k231k432
$$ 395943 387403 379704 372457 365678 359279 352946 346700 341226 337285 334899 333286 331545 329314 326882
63132C26882k017j167l93m1N6L18Q81J522K012K269K246J992J895K403L395M172
$$ 326882 324865 323698 323305 323264 323320 323638 324519 326041 328053 330322 332568 334560 336455 338858 342253 346425
63116C46425M266L935L678L612L620L757M146M627M921N034N226N685O450P518
$$ 346425 350691 354626 358304 361916 365536 369293 373439 378066 382987 388021 393247 398932 405382 412900
63102D12900Q754R820J0518J1035J1597J2092J2406J2826J3582J4198J3983J3135
$$ 412900 421654 431474 441992 453027 464624 476716 489122 501948 515530 529728 543711 556846
63090E56846J2540J2318J1368Q869N473K402j81l058o452r406j0867j0889j0557
$$ 556846 569386 581704 593072 601941 607414 609816 609635 606577 600125 590719 579852 568963 558406
63077E58406j0937j2135j3288j3506j2846j2106j1600j0698q960p126o230o113
$$ 558406 547469 535334 522046 508540 495694 483588 471988 461290 452330 445204 438974 432861
63065D32861n737m790l986l582k810j283N1J44n53o71K55J487K359L040L842M608
$$ 432861 427124 422334 418348 414766 411956 410673 410724 410868 410315 409644 409899 411386 413745 416785 420627 425235
63049D25235N020N099N051M932M700M437M343M620N328O258O992P265P205P119
$$ 425235 430255 435354 440405 445337 450037 454474 458817 463437 468765 475023 482015 489280 496485 503604
63035E03604P082P026O993P032O988O682O225N811N304M439L337K389J669Q71
$$ 503604 510686 517712 524705 531737 538725 545407 551632 557443 562747 567186 570523 572912 574581 575452
63021E75452j29j140k074k983l675l808l528l416l597l391k225l97J437L119M944
$$ 575452 575323 574183 572109 569126 565451 561643 558115 554699 551102 547711 545486 545089 546526 549645 554589
63006E54589P040R258J1360J3088J4249J5050J5952J6952J7439J7115J6538J6243
$$ 554589 561629 570887 582247 595335 609584 624634 640586 657538 674977 692092 708630 724873
62994G24873J5835J4690J3109J2017J1655J1493J1274J1246J1293J0752R382P720
$$ 724873 740708 755398 768507 780524 792179 803672 814946 826192 837485 848237 857619 865339
62982H65339O127M210J607j247l761o079q785j2027j5463j8780k1728k3824k4631
$$ 865339 871466 875676 877283 876036 872275 866196 857411 845384 829921 811141 789413 765589 740958
62969G40958k4346k3691k3168k2658k1739k0158j8011j5736j3844j2501j1448
$$ 740958 716612 692921 669753 647095 625356 605198 587187 571451 557607 545106 533658
62958E33658j0464r707r323r015q388p596p151p109o996o592o290o443o754o687
$$ 533658 523194 513487 504164 495149 486761 479165 472014 464905 457909 451317 445027 438584 431830 425143
62944D25143o202n775n685n652n179m228l436l595m705n626n070l017q69M3k73
$$ 425143 418941 413166 407481 401829 396650 392422 388986 385391 380686 375060 369990 366973 366104 366147 365874
62929C65874q97j263j466j547j217m69R3r4q00j241r63k83J35K7j83K10J378K732
$$ 365874 364977 363714 362248 360701 359484 359015 359108 359014 358214 356973 356010 355727 355862 355889 355706 355916 357294 360026
62911C60026L572L859L984L970L478K651K241K502K696K221J767K457M178N712
$$ 360026 363598 367457 371441 375411 378889 381540 383781 386283 388979 391200 392967 395424 399602 405314
62897D05314O437O952P875Q938R678J0150J0441J0110Q847P145N638M163K221
$$ 405314 411751 418703 426578 435516 445194 455344 465785 475895 484742 491887 497525 501688 503909
62884E03909P1j495k350l121m034m558m443m342m884n717o069n936o032o720p523
$$ 503909 503980 502485 500135 497014 492980 488422 483979 479637 474753 469036 462967 457031 450999 444279 436756
62869D36756p843p651p333p062o629n799m667l664l217l409l868m011l551k818
$$ 436756 428913 421262 413929 406867 400238 394439 389772 386108 382891 379482 375614 371603 368052 365234
62855C65234k448k598k655j963q02k04o65j455j586j085p51q59p83p3P73J020
$$ 365234 362786 360188 357533 355570 354768 354564 353899 352444 350858 349773 349022 348163 347380 347307 348080 349100
62839C49100P52O16P60O24l9n88k95O11J189J012N74M61O14P22Q48J176J434J220
$$ 349100 349852 350468 351228 351852 351813 351225 350930 351541 352730 353742 354316 354777 355391 356113 356961 358137 359571 360791
62821C60791P64O93R69Q05j08r33p62J89R68J115R08O37L21Rj90m09r04j563j970
$$ 360791 361555 362248 363217 364022 363914 362981 362219 362408 363376 364491 365399 366036 366357 366366 366176 365767 364863 363300 361330
62802C61330k003j922j799j254L7J796L245L754L371K792K630K693K273J279N83
$$ 361330 359327 357405 355606 354352 354389 356185 359430 363184 366555 369347 371977 374670 376943 378222 378805
62787C78805Q81J716K195K231K420K985L719M705O191P716Q379Q163Q129Q938
$$ 378805 379686 381402 383597 385828 388248 391233 394952 399657 405848 413564 421943 430106 438235 447173
62773D47173R977J0281R715Q778P844O976O098M964L457J958R39P1j513l845n813
$$ 447173 457150 467431 477146 485924 493768 500744 506842 511806 515263 517221 518160 518231 516718 512873 507060
62758E07060o568o484o246n881n345n251o125p431q168q082p603p099o831p192
$$ 507060 500492 494008 487762 481881 476536 471285 465160 457729 449561 441479 433876 426777 419946 412754
62744D12754q036q300p204n534m766n114n469n051m159l241k269j272n74k47k6
$$ 412754 404718 396418 389214 383680 378914 373800 368331 363280 359121 355880 353611 352339 351765 351518 351492
62729C51492Q8j63m74J7J540L198L974L744L038K383K192K705L562L968L656L344
$$ 351492 351580 351417 350943 350960 352500 355698 359672 363416 366454 368837 371029 373734 377296 381264 384920 388264
62713C88264L810M954O129P024P746Q320Q664R003R898J1697J4156J6582J8298
$$ 388264 392074 397028 403157 410181 417927 426247 434911 443914 453812 465509 479665 496247 514545
62700E14545J9090J9312J9551K0180K1321K2949K4872K6651K7916K8695K9118
$$ 514545 533635 552947 572498 592678 613999 636948 661820 688471 716387 745082 774200
62689G74200K8932K7701K5427K2523J9177J5231J0766O180J616l221q431j3631
$$ 774200 803132 830833 856260 878783 897960 913191 923957 930137 931753 928532 920101 906470
62677I06470j8405k2582k5799k7480k7706k7506k7757k8145k7813k6671k5418
$$ 906470 888065 865483 839684 812204 784498 756992 729235 701090 673277 646606 621188
62666F21188k4373k3078k1114j8790j6686j4924j3220j1505j0161r539r377q948
$$ 621188 596815 573737 552623 533833 517147 502223 489003 477498 467337 457798 448421 439473
62654D39473p837o414n373m922m672m319l992l877l869l782l723l910m249m314
$$ 439473 431636 425222 419849 414927 410255 405936 401944 398067 394198 390416 386693 382783 378534 374220
62640C74220l780k807j866j195m99N34J510J594O63k65k81K09J67n06r25o46k19
$$ 374220 370440 367633 365767 364572 364073 364607 366117 367711 368374 368109 367828 368037 368204 367698 366773 366127 365908
62623C65908k10m97p82j040j163r02n04o16j209j363o80o3m46j375j749j324o83
$$ 365908 365698 365201 364419 363379 362216 361314 360810 360194 358985 357622 356942 356879 356433 355058 353309 351985 351302
62606C51302r8N88J192J262Q44M70M19O41J218K141K734K245J078O26J554K964
$$ 351302 351204 351792 352984 354246 355090 355560 355979 356620 357838 359979 362713 364958 366036 366662 368216 371180
62590C71180L582L173K497K283K717L518M174M232L630K659J561L72q28j817k506
$$ 371180 374762 377935 380432 382715 385432 388950 393124 397356 400986 403645 405206 405578 404750 402933 400427
62575D00427l010l411l655l763l901m130m306m325m221m054l804l438k898k129
$$ 400427 397417 394006 390351 386588 382687 378557 374251 369926 365705 361651 357847 354409 351511 349382
62561C49382j323r89j428k260k747k579j991j277o15k72m59q76r37n11o5O2R3
$$ 349382 348059 347070 345642 343382 340635 338056 336065 334788 334173 333901 333442 332566 331629 331118 331053 331115 331208
62544C31208L17O48Q56R10Q92Q79J120J885K935L439K856J664Q42P68R79R66Q62
$$ 331208 331525 332173 333029 333939 334831 335710 336830 338715 341650 345089 347945 349609 350451 351219 352198 353164 354026
62527C54026J174K077L184M071M778N567O303O517O276O402P449Q937J0165J1374
$$ 354026 355200 357277 360461 364532 369310 374877 381180 387697 393973 400375 407824 416761 426926 438300
62513D38300J3231J5368J6536J6416J6211J7017J8384J9080J8577J7144J5026
$$ 438300 451531 466899 483435 499851 516062 533079 551463 570543 589120 606264 621290
62502F21290J2364R534O891M374J866l47k105l952o391q788r934r649q988q726
$$ 621290 633654 643188 650079 654453 656319 655972 653867 649915 643524 634736 624802 615153 606165 597439
62488E97439q479p617o253m829l361j666R6J689L331N377P623R453J0599J1250
$$ 597439 588960 581343 575090 570261 566900 565234 565330 567019 570350 575727 583350 592803 603402 614652
62474F14652J1382J0609Q851O683M676K681K48k518m984o849q526j0483j2648
$$ 614652 626034 636643 645494 652177 656853 659534 659782 657264 652280 645431 636905 626422 613774
62461F13774j4665j6405j7797j8469j8099j7105j6370j6149j5734j4485j2752
$$ 613774 599109 582704 564907 546438 528339 511234 494864 478715 462981 448496 435744
62450D35744j1360j0474r522q074o279m440k708j340q15j242j940j943r49M34
$$ 435744 424384 413910 404388 396314 390035 385595 382887 381547 380732 379490 377550 375607 374658 375092
62436C75092J365J436P50k91j137j304p79j46j7l24m61j91l8n32j387j793j478
$$ 375092 376457 377893 378643 378352 377215 375911 375132 374986 374969 374645 374184 373993 373955 373423 372036 370243 368765
62419C68765r28o13m09n8K45J24k79l62J57Q20R22L26l71m44K14J027J395J350
$$ 368765 367837 367224 366815 366757 367002 367126 366847 366485 366642 367462 368384 368710 368339 367895 368109 369136 370531 371881
62401C71881J387J762K197K364K362K492K766K932K875K754K742K911L324M021
$$ 371881 373268 375030 377227 379591 381953 384445 387211 390143 393018 395772 398514 401425 404749 408770
62387D08770M819N401N678N919O353O860P228P603Q347R475J0499J1067J1466
$$ 408770 413589 418990 424668 430587 436940 443800 451028 458631 466978 476453 486952 498019 509485
62374E09485J2180J3112J3731J4138J5357J8099K1469K3687K4066K3815K4676
$$ 509485 521665 534777 548508 562646 578003 596102 617571 641258 665324 689139 713815
62363G13815K7328L1319L6022M0985M5719M9869N3731N8070O3135O8135P1897
$$ 713815 741143 772462 808484 849469 895188 945057 998788 1056858 1119993 1188128 1260025
62352A260025P3870P4212P3031O9853O3990N5353M4703L3083K1154R199k386j3018
$$ 1260025 1333895 1408107 1481138 1550991 1614981 1670334 1715037 1748120 1769274 1778473 1776087 1763069
62340A763069k2406l0795l8468m5262n0836n5232n8775o1408o2481o1382n8292
$$ 1763069 1740663 1709868 1671400 1626138 1575302 1520070 1461295 1399887 1337406 1276024 1217732
62329A217732n4210n0238m6826m3658m0297l6864l3907l1569k9379k7012k4923
$$ 1217732 1163522 1113284 1066458 1022800 982503 945639 911732 880163 850784 823772 798849
62318G98849k3688k3078k2319k1211k0309j9859j9310j8144j6670j5492j4576
$$ 798849 775161 752083 729764 708553 688244 668385 649075 630931 614261 598769 584193
62307E84193j3446j2017j0692r663q675p511o268n034l719k485j880k215k991
$$ 584193 570747 558730 548038 538375 529700 522189 515921 510887 507168 504683 502803 500588 497597
62294D97597l311k751j567j17J467K978L885L748K847K102K314L508N037O214
$$ 497597 494286 491535 489968 489851 491318 494296 498181 501929 504776 506878 509192 512700 517737 523951
62280E23951O792O918O810O579O352O374O828P607Q450R262J0145J1142J2223
$$ 523951 530743 537661 544471 551050 557402 563776 570604 578211 586661 595923 606068 617210 629433
62267F29433J3603J5720J8637K1742K4448K6994L0179L4339L9095M4055M9218
$$ 629433 643036 658756 677393 699135 723583 750577 780756 815095 854190 898245 947463
62256I47463N4567N9766O4569O9052P3021P5548P5569P2777O7544O0129N0436
$$ 947463 1002030 1061796 1126365 1195417 1268438 1343986 1419555 1492332 1559876 1620005 1670441
62245A670441L8542K5087J1128k149j3781k3562l2180m0453m8383n5345o1036
$$ 1670441 1708983 1734070 1745198 1743049 1729268 1705706 1673526 1633073 1584690 1529345 1468309
62234A468309o5648o9020p0409o9462o6923o3830o0376n6144n1166m6126m1518
$$ 1468309 1402661 1333641 1263232 1193770 1126847 1063017 1002641 946497 895331 849205 807687
62223H07687l7209l2992k9089k5813k3047k0426j7924j5878j4474j3456j2475
$$ 807687 770478 737486 708397 682584 659537 639111 621187 605309 590835 577379 564904
62212E64904j1472j0552r635q533p401o721o636o599o002n009m298m030l555k382
$$ 564904 553432 542880 533245 524712 517311 510590 503954 497355 491353 486344 482046 478016 474461 472079
62198D72079r35OL37O86J615L107M804O350P543Q478R538J0905J2194J2864J2987
$$ 472079 471144 471150 471487 472173 473788 476895 481699 488049 495592 504070 513608 524513 536707 549571 562558
62183E62558J3189J3751J4237J4217J3895J3670J3459J2955J2332J2206J2869
$$ 562558 575747 589498 603735 617952 631847 645517 658976 671931 684263 696469 709338
62172G09338J4071J5619J7781K0856K4625K8516L2231L6030M0398M5450N0554
$$ 709338 723409 739028 756809 777665 802290 830806 863037 899067 939465 984915 1035469
62161A035469N4576N6606N6451N4326N0187M3737L5152K5371J5414N700l693j2411
$$ 1035469 1090045 1146651 1203102 1257428 1307615 1351352 1386504 1411875 1427289 1432989 1429296 1416885
62149A416885j9978k6447l2398l8149m3327m7321m9943n1403n1856n1210m9301
$$ 1416885 1396907 1370460 1338062 1299913 1256586 1209265 1159322 1107919 1056063 1004853 955552
62138I55552m6266m2693l9272l6132l2709k8582k4331k1042j8994j7363j5446
$$ 955552 909286 866593 827321 791189 758480 729898 705567 684525 665531 648168 632722
62127F32722j3484j1888j0303q137n682l786k540j078J131L624N816P780R685
$$ 632722 619238 607350 597047 588910 583228 579442 576902 575824 576955 580579 586395 594175 603860
62114F03860J1130J1646J1479J1080J0124P900M687J929P16P17R50R72P90N7j775
$$ 603860 614990 626636 638115 649195 659319 667219 671906 673835 674551 675268 676218 677190 677980 678037 676262
62099F76262m541p225q973r787r974r382p605m782j700R63L149N123O959Q600
$$ 676262 671721 664496 655523 645736 635762 626380 618775 613993 612293 613256 616405 621528 628487 637087
62085F37087J0234J2313J5059J8141K0983K3298K5211K6980K8740L0588L2634
$$ 637087 647321 659634 674693 692834 713817 737115 762326 789306 818046 848634 881268
62074H81268L4863L6991L8703L9968M1067M2299M3834M5712M7835M9863N1356
$$ 881268 916131 953122 991825 1031793 1072860 1115159 1158993 1204705 1252540 1302403 1353759
62063A353759N2196N2700N3201N3485N2775N0286M5760L9536L2182K4030J5130
$$ 1353759 1405955 1458655 1511856 1565341 1618116 1668402 1714162 1753698 1785880 1809910 1825040
62052A825040N647l811j2452j9923k6470l2509l8245m3744m9030n3913n7975o0858
$$ 1825040 1830687 1826876 1814424 1794501 1768031 1735522 1697277 1653533 1604503 1550590 1492615 1431757
62040A431757o2445o2630o1333n8926n6275n3918n1496m8371m4527m0423l6265
$$ 1431757 1369312 1306682 1245349 1186423 1130148 1076230 1024734 976363 931836 891413 855148
62029H55148l2124k8481k5862k3885k1491j8347j5348j3393j2399j1822j1560
$$ 855148 823024 794543 768681 744796 723305 704958 689610 676217 663818 651996 640436
62018F40436j1754j2190j2488j2549j2397j1842j0816r770r165q737p758n962
$$ 640436 628682 616492 604004 591455 579058 567216 556400 546630 537465 528728 520970 515008
62006E15008l822j988p72m8O99K032L913N547O232O183O106O202O041N267L879
$$ 515008 511186 509198 508426 508378 509077 511109 515022 520569 526801 532984 539090 545292 551333 556600 560479
61991E60479J957l14k353l572m129m813o048p396q239q469q409q307q133p714
$$ 560479 562436 562122 559769 556197 552068 547255 541207 533811 525572 517103 508694 500387 492254 484540
61977D84540p016o319n993n869n285m054k974k716k674j789l05M62P9m60m64n50
$$ 484540 477524 471205 465212 459343 454058 450004 447030 444314 441640 439851 439546 440008 440087 439627 439163 438613
61961D38613j258j763r58Q55K391L097L475L983M563N113N708O248O628P140Q201
$$ 438613 437355 435592 434634 435489 437880 440977 444452 448435 452998 458111 463819 470067 476695 483835 492036
61946D92036R668J1098J2548J4491J6890J9110K0866K2568K4513K6397K7899K9142
$$ 492036 501704 512802 525350 539841 556731 575841 596707 619275 643788 670185 698084 727226
61934G27226L0190L0636L0240K9541K9197K8923K7770K5428K2657K0232J7968
$$ 727226 757416 788052 818292 847833 877030 905953 933723 959151 981808 1002040 1020008
61923A020008J5147J1553P582L505q12n254r080j1575j2834j3399j3290j2007
$$ 1020008 1035155 1046708 1054290 1057795 1056983 1051729 1042649 1031074 1018240 1004841 991551 979544
61911I79544r459o224k656J582O623J1558J5244J7616J9448K0883K1038J9216
$$ 979544 970085 963861 961205 962787 969410 980968 996212 1013828 1033276 1054159 1075197 1094413
61899A094413J5842J1814P431K380l427r455j4922j9336k2689k5278k7303k8675
$$ 1094413 1110255 1122069 1129500 1131880 1128453 1118998 1104076 1084740 1062051 1036773 1009470 980795
61887I80795k9263k9231k8888k8304k7299k5889k4371k2898k1329j9655j8173
$$ 980795 951532 922301 893413 865109 837810 811921 787550 764652 743323 723668 705495
61876G05495j7062j5989j4549j2892j1577j0844j0299r261p330m657j853M16J952
$$ 705495 688433 672444 657895 645003 633426 622582 612283 603022 595692 591035 589182 589598 591550
61863E91550L160M583O401Q467J0675J3062J5685J8629K2038K5908K9887L3542
$$ 591550 594710 599293 605694 614161 624836 637898 653583 672212 694250 720158 750045 783587
61851G83587L6830L9989M3029M5687M7928N0033N1955N2979N2406N0330M7312
$$ 783587 820417 860406 903435 949122 997050 1047083 1099038 1152017 1204423 1254753 1302065
61840A302065M3464L8317L1622K3812J5527P150r50q066j3474j7016j9051j9862
$$ 1302065 1345529 1383846 1415468 1439280 1454807 1461957 1461007 1452941 1439467 1422451 1403400 1383538
61828A383538j9329j7113j3049p438j151M710R489J3263J6224J7948J7637J4980
$$ 1383538 1364209 1347096 1334047 1326609 1325458 1330168 1339657 1352920 1369144 1387092 1404729 1419709
61816A419709J0359M220l302j1957k1059k9805l7651m4241m9266n2671n4673n5335
$$ 1419709 1430068 1434288 1430986 1419029 1397970 1368165 1330514 1286273 1237007 1184336 1129663 1074328
61804A074328n4445n2047m8816m5475m2089l8279l4027k9869k6353k3601k1423
$$ 1074328 1019883 967836 919020 873545 831456 793177 759150 729281 702928 679327 657904
61793F57904j9510j7613j5679j3813j1989j0090q389p503p501p496o679n430m635
$$ 657904 638394 620781 605102 591289 579300 569210 560821 553318 545817 538321 531642 526212 521577
61780E21577m226l352j970j174j528k168k060j444j183j331j259q25n61o86p17
$$ 521577 517351 513999 512029 510855 509327 507159 505099 503655 502472 501141 499882 499057 498496 497810 497093
61765D97093k39N91J384K017K573L165L942M935N814O073N594M854M445M542M872
$$ 497093 496854 497445 498829 500846 503419 506584 510526 515461 521275 527348 532942 537796 542241 546783 551655
61750E51655N006M664L937L239K888K752K458J936J487J318J213P78j72j454k572
$$ 551655 556661 561325 565262 568501 571389 574141 576599 578535 580022 581340 582553 583331 583159 581705 579133
61735E79133k980k498j475l44P84J847K408K176J816K474M263N944O508O360O416
$$ 579133 576153 573655 572180 571836 572620 574467 576875 579051 580867 583341 587604 593548 600056 606416 612832
61720F12832O697O615O200O016O085N825N142M635M510M167L241K231J606R89
$$ 612832 619529 626144 632344 638360 644445 650270 655412 660047 664557 668724 671965 674196 675802 676791
61706F76791j26j433k244k555k915l543m213m869n632o307o536o429o381o303
$$ 676791 676665 675232 672988 670433 667518 663975 659762 654893 649261 642954 636418 629989 623608 617305
61692F17305n710m718m175m525n136n132m352l241k265j765j916k344k309j661
$$ 617305 611595 606877 602702 598177 593041 587909 583557 580316 578051 576286 574370 572026 569717 568056
61678E68056j204j575k256k304j685j145r79p72l00J05J84O5j86o85j210j235
$$ 568056 566852 565277 563021 560717 559032 557887 556908 556136 555836 555941 556125 556190 556004 555319 554109 552874
61662E52874p87o04r90j143k36J216J872J247K51n0M34J106J635K238L118L982
$$ 552874 552087 551483 550493 549350 549114 550330 552202 553449 553700 553650 554084 555190 556825 559063 562181 566163
61646E66163M242L705K972K960L970N408O519P182P634P712O954N457M071L403
$$ 566163 570405 574110 577082 580042 584012 589420 595939 603121 610755 618467 625421 630878 634949 638352
61632F38352L050K218P59q28k157l121l417k615r74M49Q72P02R10J828K949L704
$$ 638352 641402 643620 644379 643551 641394 638273 634856 632241 631267 631716 632588 633290 634200 636028 638977 642681
61616F42681L915L617L000K480K322K148J278l47k097l580m994o362p155p098
$$ 642681 646596 650213 653213 655693 658015 660163 661441 661094 658997 655417 650423 644061 636906 629808
61602F29808o848p195q034q707r077r514j0005j0026r364q432p639o939o153n302
$$ 629808 622960 615765 607731 599024 589947 580433 570428 560402 551038 542606 534967 528028 521875 516573
61588E16573m503l847l500l546l778l896l976m241m552m599m606n101n874n958
$$ 516573 512070 508223 504723 501177 497399 493503 489527 485286 480734 476135 471529 466428 460554 454596
61574D54596n003l922l634l775l427k670k436k960l305k724j725j339j744k123
$$ 454596 449593 445671 442037 438262 434835 432165 429729 426769 423464 420740 419015 417676 415932 413809
61560D13809j845j218r85j298j543j110j09P97J070O69j07q73j345j523j646j799
$$ 413809 411964 410746 409761 408463 406920 405810 405701 406498 407568 408237 408130 407257 405912 404389 402743 400944
61544D00944j680j039k23J36p1l92n42o04m63K95J601K685L008K916K856K527
$$ 400944 399264 398225 398002 398138 398067 397675 397133 396529 396066 396361 397962 400647 403655 406571 409427 411954
61528D11954J448k4j036j357j431j461j208q05r36j930l157l729l455k857k528
$$ 411954 413402 413378 412342 410985 409554 408093 406885 406080 405144 403214 400057 396328 392873 390016 387488
61513C87488k622k807k608j970j424j384j409p18N25J162N35o20j316j714k592
$$ 387488 384866 382059 379451 377481 376057 374673 373264 372546 373071 374233 374768 374148 372832 371118 368526
61498C68526l731l893k579r77n72j396k263k367j969j532j028l40J71J11k91m66
$$ 368526 364795 360902 358323 357346 356774 355378 353115 350748 348779 347247 346219 345879 346050 346161 345870 345404
61482C45404k80j15k00l81n39p49q93o67j07K41L7l92n04j66M66J237J796J517
$$ 345404 345124 345009 344809 344428 343889 343140 342247 341580 341473 341714 341751 341359 340855 340689 341155 342392 344188 345705
61464C45705K76j077j568j330j290j733j925j315l58J98L15M49P41Q87P31N08
$$ 345705 345981 344904 343336 342006 340716 338983 337058 335743 335385 335583 335898 336347 337088 337975 338706 339214
61448C39214M89O63Q67J030J191J339J356J205J154J581K489L375L805L971M355
$$ 339214 339703 340366 341233 342263 343454 344793 346149 347354 348508 350089 352578 355953 359758 363729 368084
61433C68084N007N480N427M888M062L164K557K530K812K768K217J684J641J916
$$ 368084 373091 378571 383998 388886 392948 396112 398669 401199 404011 406779 408996 410680 412321 414237
61419D14237K155K329K444K143J284O39J215K914M377M448L280J792M79q34k306
$$ 414237 416392 418721 421165 423308 424592 425231 426446 429360 433737 438185 441465 443257 443736 442902 440596
61404D40596l622m309m264l848l567l666l978m116l884l493l342l569l849l704
$$ 440596 436974 432665 428401 424553 420986 417320 413342 409226 405342 401849 398507 394938 391089 387385
61390C87385l015k185j761j841k014j796j147m50j15k33o18r83j056o42J78J017
$$ 387385 384370 382185 380424 378583 376569 374773 373626 373176 373061 372828 372210 371227 370171 369529 369707 370724
61374C70724J450J403J152R11N85J5o78j164j244r30l16M50J160J747K370L043
$$ 370724 372174 373577 374729 375640 376225 376240 375562 374398 373154 372224 371908 372358 373518 375265 377635 380678
61358C80678L322K852K111K075K969L985M459M746N465O471P187P602Q169Q970
$$ 380678 384000 386852 388963 391038 394007 397992 402451 407197 412662 419133 426320 433922 442091 451061
61344D51061R713J0400J1275J2138J2450J2234J2064J2075J1662J0479R010P815
$$ 451061 460774 471174 482449 494587 507037 519271 531335 543410 555072 565551 574561 582376
61332E82376O745N424L887K367Q42p07k065l215m582o291p664q005p536o894o121
$$ 582376 589121 594545 598432 600799 601641 600934 598869 595654 591072 584781 577117 569112 561576 554682 548561
61317E48561m963l855l602m142m535m333m030l928l461k215p89oK40N67J014J107
$$ 548561 543598 539743 536141 531999 527464 523131 519101 515173 511712 509497 508708 508702 508942 509509 510523 511630
61301E11630Q95J105K149L602M747N284N337N152M942M721M112K624K66k255m046
$$ 511630 512525 513630 515779 519381 524128 529412 534749 539901 544843 549564 553676 556300 556566 554311 550265
61286E50265m626m094l062k431k733l468l512k421j011k42J9N77J556K268K398
$$ 550265 545639 541545 538483 536052 533319 529851 526339 523918 522907 522665 522684 523261 524817 527085 529483
61271E29483K557L296M240M671M617M788N606O757P639P965P843P595P485P530
$$ 529483 532040 535336 539576 544247 548864 553652 559258 566015 573654 581619 589462 597057 604542 612072
61257F12072P615P886Q792J0463J2268J3418J3944J4573J5573J6229J5677J3886
$$ 612072 619687 627573 636365 646828 659096 672514 686458 701031 716604 732833 748510 762396
61245G62396J1497Q905N972K545j130m629p733j0366j2357j3499j3847j3760j3478
$$ 762396 773893 782798 788770 791315 790185 785556 777823 767457 755100 741601 727754 713994 700516
61232G00516j2864j1727j0295r087q286p519o383n021l981l603l690l733l277
$$ 700516 687652 675925 665630 656543 648257 640738 634355 629334 625353 621750 618060 614327 611050
61219F11050k171o65P03J417J306O73Q8J3M50J048J600K216K871L059K457J662
$$ 611050 608879 608214 608917 610334 611640 612313 612401 612414 612864 613912 615512 617728 620599 623658 626115 627777
61203F27777J680K589L471L760L911M416M964N184N445O305P669R205J1016J3196
$$ 627777 629457 632046 635517 639277 643188 647604 652568 657752 663197 669502 677171 686376 697392 710588
61189G10588J5269J6893J8622K0970K3226K4253K4200K4150K4360K4114K3209
$$ 710588 725857 742750 761372 782342 805568 829821 854021 878171 902531 926645 949854
61178I49854K2189K1020J9063J6607J5019J4724J4468J3192J1389R762P850N055
$$ 949854 972043 993063 1012126 1028733 1043752 1058476 1072944 1086136 1097525 1107287 1115137 1120192
61166A120192J933p25l246o306r509j1977j3823j5828j8082k0049k1653k3132
$$ 1120192 1122125 1121400 1118154 1111848 1102339 1090362 1076539 1060711 1042629 1022580 1000927 977795
61154I77795k4165k4217k3518k2690k1658k0036j8233j6945j5764j3699j1000
$$ 977795 953630 929413 905895 883205 861547 841511 823278 806333 790569 776870 765870
61143G65870r042q197p248n384l375k183j664j423j826l150m501m742l978l192
$$ 765870 756828 748631 741383 735999 732624 730441 728777 727354 725528 722378 717877 713135 709157 705965
61129G05965k714j985o54R80K604M201N692O913Q108R900J2515J5420J8051K0543
$$ 705965 703251 701266 700612 701592 704196 708397 714089 721002 729110 739010 751525 766945 784996 805539
61115H05539K3405K6588K9394L1375L2856L4296L5478L5944L5982L6426L7314
$$ 805539 828944 855532 884926 916301 949157 983453 1018931 1054875 1090857 1127283 1164597
61104A164597L7593L6572L4954L3678L2417L0118K6641K2842J9218J5516J1650
$$ 1164597 1202190 1238762 1273716 1307394 1339811 1369929 1396570 1419412 1438630 1454146 1465796
61093A465796Q018M661J027l127p449j1794j6428k1097k4836k7194k8844l0404
$$ 1465796 1473814 1478475 1479502 1476375 1468926 1457132 1440704 1419607 1394771 1367577 1338733 1308329
61081A308329l1440l1411l0796l0393l0003k8898k7253k5979k5215k3996k1710
$$ 1308329 1276889 1245478 1214682 1184289 1154286 1125388 1098135 1072156 1046941 1022945 1001235
61070A001235j8982j6708j4923j3144j1315r738q309o488m188k093p95M5J202
$$ 1001235 982253 965545 950622 937478 926163 916425 908116 901628 897440 895347 894552 894597 895799
61057H95799K757M027M703N488P189R617J1835J3264J4112J4847J5791J7143J8920
$$ 895799 898556 902583 907286 912774 919963 929580 941415 954679 968791 983638 999429 1016572 1035492
61044A035492K0895K2970K5447K8547L1817L4588L6949L9583M2730M5979M9133
$$ 1035492 1056387 1079357 1104804 1133351 1165168 1199756 1236705 1276288 1319018 1364997 1414130
61033A414130N2483N6069N9395O2258O5224O8849P2916P6805Q0229Q3262Q6009
$$ 1414130 1466613 1522682 1582077 1644335 1709559 1778408 1851324 1928129 2008358 2091620 2177629
61022B177629Q8493R0803R3232R6516J01717J09446J19364J31006J44704J60992
$$ 2177629 2266122 2356925 2450157 2546673 2648390 2757836 2877200 3008206 3152910 3313902
61012C313902J79515J99778K22854K51146K86552L30385L84968M53439N37630
$$ 3313902 3493417 3693195 3916049 4167195 4453747 4784132 5169100 5622539 6160169
61003F160169O38174P57278Q98853J065060J255900J473981J724877K005968K293328
$$ 6160169 6798343 7555621 8454474 9519534 10775434 12249415 13974292 15980260 18273588
60994A8273588K540938K690439K680159K457073K006371J389120P45648K37483
$$ 18273588 20814526 23504965 26185124 28642197 30648568 32037688 32783336 33020819
60986C3020819l7443q7003K775J22721J69831N2471k88712q37395j483154k067578
$$ 33020819 32983376 32896373 32899148 33021869 33191700 33244171 32955459 32118064 30634910 28567332
60976B8567332k467206k644276k632886k492412k275821k024113j768273j527461
$$ 28567332 26100126 23455850 20822964 18330552 16054731 14030618 12262345 10734884
60968A0734884j309210j115248r46303q01703o78521n73828m86427m15220l57600
$$ 10734884 9425674 8310426 7364123 6562420 5883899 5310071 4823644 4408424 4050824
60959D050824l10741k72940k42461k16523j92831j71138j52018j35047j19420
$$ 4050824 3740083 3467143 3224682 3008159 2815328 2644190 2492172 2357125 2237705
60950B237705j05415r3814q4335p6004o8702o3218n9867n7956n6518n4771n2133
$$ 2237705 2132290 2038476 1954141 1878137 1809435 1746217 1686350 1628394 1571876 1517105 1464972
60939A464972m8536m4723m1542l9049l6757l4491l2436l0590k8873k7526k6783
$$ 1464972 1416436 1371713 1330171 1291122 1254365 1219874 1187438 1156848 1127975 1100449 1073666
60928A073666k6228k5116k3254k1122j9217j7704j6611j5911j5525j5521j6082
$$ 1073666 1047438 1022322 999068 977946 958729 941025 924414 908503 892978 877457 861375
60917H61375j6931j7185j6299j4899j4077j4091j4273j4025j3262j2017j0368
$$ 861375 844444 827259 810960 796061 781984 767893 753620 739595 726333 714316 703948
60906G03948q747p699p243o882o352n855n526n157m587l976l563l462l739m329
$$ 703948 695201 687502 680259 673377 667025 661170 655644 650487 645900 641924 638361 634899 631160 626831
60892F26831m862n008m998n378o113o418n797m821m482n087o112o996p597p889
$$ 626831 621969 616961 611963 606585 600472 594054 588257 583436 578954 573867 567755 560759 553162 545273
60878E45273p687o930n975n273m830m308l618l080k834k521j836j003l61K29R64
$$ 545273 537586 530656 524681 519408 514578 510270 506652 503572 500738 498217 496381 495378 495017 495246 496210
60863D96210J487J414J357K415M518O243O671O473O584O704O037M936M574N193
$$ 496210 497697 499111 500468 502883 507401 513644 520315 526788 533372 540076 546113 551049 555623 560816
60849E60816N726N248L998K739J757P87m54j986l539m757n566o327p312q260q711
$$ 560816 566542 571790 575788 578527 580284 581071 580617 578631 575092 570335 564769 558442 551130 542870 534159
60834E34159q706q686q780q661q131p403o716o067n409m810m302l773l090k233
$$ 534159 525453 516767 507987 499326 491195 483792 477076 471009 465600 460790 456488 452715 449625 447392
60820D47392j355q46j051j674j764o82J082K558L485M315N186N673N535N100M679
$$ 447392 446037 445191 444140 442466 440702 440020 441102 443660 447145 451460 456646 462319 467854 472954 477633
60805D77633M250L891L986M674N533O109O370O364N908M986M101L775L828L531
$$ 477633 481883 485774 489760 494434 499967 506076 512446 518810 524718 529704 533805 537580 541408 544939
60791E44939K471J016m5j86M11J005R04%j257k397l258l880m395m992n798o638
$$ 544939 547410 548426 548381 548195 548606 549611 550515 550515 549258 546861 543603 539723 535328 530336 524538 517900
60775E17900p165p254p149p120p129o864o139n213m659m684m617l546j675n10
$$ 517900 510735 503481 496332 489212 482083 475219 469080 463867 459208 454524 449907 446361 444686 444176
60761D44176j170k916l974l574k431j479r65q22j025j278j097m95p5r8n1N57J516
$$ 444176 443006 440090 436116 432542 430111 428632 427667 426845 425820 424542 423445 422950 422875 422777 422726 423283 424799
60744D24799K364L056L759M366M676M725M710M690M598M287L565K565K014K548
$$ 424799 427163 430219 433978 438344 443020 447745 452455 457145 461743 466030 469595 472160 474174 476722
60730D76722L684M290M160M297N241O056N694M515L692L622L772L610K876J402
$$ 476722 480406 484696 488856 493153 498394 504450 510144 514659 518351 521973 525745 529355 532231 533633
60716E33633l85j254m96P79P51q20k471l186l469l987m363m059l546l724m574
$$ 533633 533248 531994 531498 532277 533028 532208 529737 526551 523082 519095 514732 510673 507127 503403 498829
60701D98829n262n337n207n405n877o147n871n143m386l992l992m046l799l245
$$ 498829 493567 488230 483023 477618 471741 465594 459723 454580 450194 446202 442210 438164 434365 431120
60687D31120k766k745l077l134k368r30M99J546K410L245L779L850L844M120M403
$$ 431120 428354 425609 422532 419398 417030 416100 416599 418145 420555 423800 427579 431429 435273 439393 443796
60672D43796M323M206M598N241N328M738M244M302M407L854K596J086k36j013
$$ 443796 448119 452325 456923 462164 467492 472230 476474 480776 485183 489037 491633 492719 492483 491470
60658D91470j077p96r08j786l112m366n167n134m098k695k081k633l445l531k964
$$ 491470 490393 489597 488689 486903 483791 479425 474258 469124 465026 462331 460250 457617 454172 450641 447677
60643D47677k391k059j872j958k344k496j950j170j010j437j602j178q06r80j238
$$ 447677 445286 443227 441355 439397 437053 434557 432607 431437 430427 428990 427388 426210 425404 424424 423186
60628D23186q75M1Q00R41O65N33R05J574J932J667J237J348J965K355K148J894
$$ 423186 422311 422352 423152 424093 424758 425291 426196 427770 429702 431369 432606 433954 435919 438274 440422 442316
60612D42316K229K956L394L364L311L548L829L791L495L355L642M209M672M852
$$ 442316 444545 447501 450895 454259 457570 461118 464947 468738 472233 475588 479230 483439 488111 492963
60598D92963M955N174N270M805L856L153L270L950M492M560M207L467K394J451
$$ 492963 497918 503092 508362 513167 517023 520176 523446 527396 531888 536448 540655 544122 546516 547967
60584E47967J137J221Q80j87j346j999k321k647k690j998q37R1O19J106J672K226
$$ 547967 549104 550325 551205 551018 549672 547673 545352 542705 540015 538017 537180 537271 537890 538996 540668 542894
60568E42894L094M729O629P541P135O642P261Q640R554R473Q585O938M458J657
$$ 542894 545988 550717 557346 564887 572022 578664 585925 594565 604119 613592 622177 629115 633573 635230
60554F35230o57k323l666m560m477l530k473j511%K382M926O822Q047Q927R535
$$ 635230 634573 632250 628584 624024 619547 616017 613544 612033 612033 614415 619341 626163 634210 643137 652672
60539F52672J0059J1069J2680J3828J3232J0809P682M989L192K207J599Q77J92
$$ 652672 662731 673800 686480 700308 713540 724349 732031 737020 740212 742419 744018 744895 745087
60526G45087M06J948L968N383O392P991J0175J1766J2207J2362J3136J4289J5241
$$ 745087 745493 747441 751409 756792 763184 771175 781350 793116 805323 817685 830821 845110 860351
60513H60351J6216J7729J9493K0688K1043K0921K0509J9663J8521J7594J7165
$$ 860351 876567 894296 913789 934477 955520 976441 996950 1016613 1035134 1052728 1069893
60502A069893J7063J7098J7282J7655J8278J9408K1276K3580K5652K7151K8142
$$ 1069893 1086956 1104054 1121336 1138991 1157269 1176677 1197953 1221533 1247185 1274336 1302478
60491A302478K8367K6965K3237J7240R356k47j1273k2698l3151m1916m9119n4941
$$ 1302478 1330845 1357810 1381047 1398287 1407643 1407396 1396123 1373425 1340274 1298358 1249239 1194298
60479A194298n8949o0309n8533n4129m8659m3895m0449l7397l3671k9615k6495
$$ 1194298 1135349 1075040 1016507 962378 913719 869824 829375 791978 758307 728692 702197
60468G02197k4589k2721j9967j6987j5007j4161j3616j2832j1830j0533q849p362
$$ 702197 677608 654887 634920 617933 602926 588765 575149 562317 550487 539954 531105 523743
60456E23743o922p366p486o553n124m021l280k658k360k618l044l202l354l931
$$ 523743 516821 509455 501969 495416 490292 486271 482991 480333 477973 475355 472311 469109 465755 461824
60442D61824m522m271l154k075j668j731j877k066k218k003j334o61m05n19q08
$$ 461824 457302 453031 449877 447802 446134 444403 442526 440460 438242 436239 434905 434244 433839 433320 432512
60427D32512j336k154k946l358l410l326l033k285j164j47L64M36M29N71P76Q79
$$ 432512 431176 429022 426076 422718 419308 415982 412949 410664 409500 409353 409717 410153 410582 411153 411929 412808
60411D12808R60J179J327Q91j23q08l21R06J551J063K97K37P55R88N29k65q39
$$ 412808 413768 414947 416274 417165 417042 416234 415913 416819 418370 419433 419730 419967 420722 421710 422239 421974 421135
60394D21135q99m46K32P50J026J270J491J447J258J474K129K298J338O0j86O93
$$ 421135 420236 419790 420022 420772 421798 423068 424559 426006 427264 428738 430867 433165 434503 434563 434377 435070
60378D35070J574J725J409Q88P8n47P9K109M075M550L833L199L067K905K582K640
$$ 435070 436644 438369 439778 440666 440744 440197 440276 442385 446460 451010 454843 458042 461109 464014 466596 469236
60362D69236L250L801L755L165K150O43j065k191k297j829j409j080o65m14o84
$$ 469236 472486 476287 480042 483207 485357 486000 484935 482744 480447 478618 477209 476129 475464 475050 474366
60347D74366j234j449j127n43J82J163K212K746K473J784J266J160J463K169L073
$$ 474366 473132 471683 470556 470013 470195 471358 473570 476316 478789 480573 481839 482999 484462 486631 489704
60332D89704L606L293K352J572J541K119K599K270J012n64j601j804j611j482
$$ 489704 493310 496603 498955 500527 502068 504187 506786 509056 510068 509504 507903 506099 504488 503006
60318E03006j312q13k03J2r1K50J575L577N606P488R547J1972J4582J7120J9620
$$ 503006 501694 500881 500678 500690 500599 500849 502424 506001 511607 519095 528642 540614 555196 572316 591936
60303E91936K2289K5179K7906K9685K9673K7434K3119J7268J0397K771n501j4017
$$ 591936 614225 639404 667310 696995 726668 754102 777221 794489 804886 807657 802156 788139
60291G88139k1725k7233k9734k9586k7789k5067k1766j8393j5562j3347j1196
$$ 788139 766414 739181 709447 679861 652072 627005 605239 586846 571284 557937 546741
60280E46741q814o589m905l533k204j259j145j538j691j465j370j586j657j283
$$ 546741 537927 531338 526433 522900 520696 519437 518292 516754 515063 513598 512228 510642 508985 507702
60266E07702p98n86n19k25M03J179J775J761R51j37o03k49J18k59j124j768k081
$$ 507702 506904 506318 505799 505574 505977 507156 508931 510692 511643 511506 510903 510654 510772 510513 509389 507621 505540
60249E05540k431k788k702k143j685j661j689j297n81L9L77M87L75N1k73l61k25
$$ 505540 503109 500321 497619 495476 493791 492130 490441 489144 488563 488602 488979 489466 489841 489892 489619 489258 489033
60232D89033K1M86J322K313K956L037K811K495J991J274P83R60J502J616J018
$$ 489033 489054 489540 490862 493175 496131 499168 501979 504474 506465 507739 508522 509482 510984 512600 513618
60217E13618L69M55J236J991K197J966J693J594J564J315O49k06o27k38N58J043
$$ 513618 513987 514442 515678 517669 519866 521832 523525 525119 526683 527998 528647 528441 527814 527576 528134 529177
60201E29177J125J449K379L329L399K470J313P60J014J700K284K413K073J528
$$ 529177 530302 531751 534130 537459 540858 543328 544641 545401 546415 548115 550399 552812 554885 556413
60187E56413J052P71O64O52N53J86l50o58m88n9K36K89K53K37K87M93Q11Q96M86
$$ 556413 557465 558236 558900 559552 560105 560291 559941 559283 558795 558736 558972 559261 559514 559751 560038 560531 561342 562238 562724
60168E62724j34m39m50p32j481k095j955j260p51p37q19n26N5M41L22n5j08M72
$$ 562724 562590 562151 561701 560969 559488 557393 555438 554178 553427 552690 551871 551345 551400 551841 552163 552108 552000 552472
60150E52472J356J915J952J916K296L055L828M553N527O844Q060Q666Q793R254
$$ 552472 553828 555743 557695 559611 561907 564962 568790 573343 578870 585714 593774 602440 611233 620487
60136F20487J0799J3277J5598J6535J5622J3256J0140O742L275j55l519o773r554
$$ 620487 631286 644563 660161 676696 692318 705574 715714 722456 725731 725576 722057 715284 705730
60123G05730j1194j1304j0355r328q731q220p281n993m857m058l259k143r33j51
$$ 705730 694536 683232 672877 663549 654818 646598 639317 633324 628467 624409 621150 619007 618074 617923
60109F17923qj49n2M56J069J377J315J185J316J650J777J387O53J04J03N60J175
$$ 617923 617915 617766 617714 618170 619239 620616 621931 623116 624432 626082 627859 629246 629899 630003 630106 630666 631841
60092F31841J847K675L655M672N836P551R915J2161J3126J2388J0738R225Q023
$$ 631841 633688 636363 640018 644690 650526 658077 667992 680153 693279 705667 716405 725630 733653
60079G33653O496M293J827m40k686n273p876r607j0015r568r012q707q693r013
$$ 733653 740149 744442 746269 745829 743143 737870 729994 720387 710372 700804 691792 683085 674392 665379
60065F65379r531r771r372q617q081p787p176o025m947m660n041n256m782l974
$$ 665379 655848 646077 636705 628088 620007 612220 605044 599019 594072 589412 584371 579115 574333 570359
60051E70359l559l819m376m676m491l934l122k128j144n02k91j82K12Q57J437
$$ 570359 566800 562981 558605 553929 549438 545504 542382 540254 539110 538608 538317 538135 538347 539204 540641
60036E40641J781J975K094K186K350K568K540K068J492J254J050R2j680l351m272
$$ 540641 542422 544397 546491 548677 551027 553595 556135 558203 559695 560949 561999 562091 560411 557060 552788
60021E52788m843n613o294o439o504p229q263q410p315n949n209m947m649m251
$$ 552788 547945 542332 536038 529599 523095 515866 507603 499193 491878 485929 480720 475773 471124 466873
60007D66873l776k872j403L5P84R63J026R08L26l85n88m10n88j202j361n46N53
$$ 466873 463097 460225 458822 458857 459641 460604 461630 462538 462864 462479 461891 461481 460893 459691 458330 457784 458337
59990D58337J026R94J152J500J336N39PN04J573K070J538N55j27l88m93m88k06
$$ 458337 459363 460357 461509 463009 464345 464884 464891 465395 466968 469038 470576 471131 471004 470616 470123 469635 469429
59973D69429K11K38l98j195j334o35J55K01m61j087j256j331j725k088j717o69
$$ 469429 469640 469878 469480 468285 466951 466316 466471 466672 466211 465124 463868 462537 460812 458724 457007 456338
59957D56338J47J37k01p8M54O97M27R9k9l09r34j339q91J53Q94Q30K86k31n60
$$ 456338 456485 456622 456421 456343 456797 457494 457921 458020 457991 457682 456748 455409 454518 454671 455565 456395 456681 456450 455890
59938D55890p65q07n86j88Q1m4n25j050j369j562j796j870j322j80P68Q08J81
$$ 455890 455125 454318 453732 453544 453625 453581 453056 452006 450637 449075 447279 445409 444087 443907 444675 445483 445664
59921D45664k48l0N73J244K004K803L270L114K519J864J315R41R70J570K489L181
$$ 445664 445416 445386 445959 447203 449207 452010 455280 458394 460913 462777 464092 465033 466003 467573 470062 473243
59905D73243L313K995K576K367K470K748K924K831K538K209J951J860K047K475
$$ 473243 476556 479551 482127 484494 486964 489712 492636 495467 498005 500214 502165 504025 506072 508547
59891E08547K854K915K681K413K326K499K884L312L575L673L865M297M703M736
$$ 508547 511401 514316 516997 519410 521736 524235 527119 530431 534006 537679 541544 545841 550544 555280
59877E55280M488M421M776N257N402M977L996K581J015l04j171j860k882m331
$$ 555280 559768 564189 568965 574222 579624 584601 588597 591178 592193 591889 590718 588858 585976 581645
59863E81645n560n709m656l328k825l154l125j747M61J951J941J351J688L375
$$ 581645 576085 570376 565720 562392 559567 556413 553288 551541 552002 553953 555894 557245 558933 562308
59849E62308N512P180Q503J0201J2428J4399J5133J4276J2114R077N559K110n56
$$ 562308 567820 575000 583503 593704 606132 620531 635664 649940 662054 671131 676690 678800 678244
59836F78244j922j977j097K20J471K095J569l33l278o342q476r258r224r171r162
$$ 678244 676322 674345 673248 673468 674939 677034 678603 678270 674992 668650 660174 650916 641692 632521 623359
59821F23359q681p748p279p901q923r152q464p821p744p689p065o128n349m587
$$ 623359 614678 606930 599651 591750 582827 573675 565211 557390 549646 541957 534892 528764 523415 518828
59807E18828l540k559k253k441k203j121K20J066J276J008J99j215k823m001m560
$$ 518828 515288 512729 510476 508035 505832 504711 504931 505997 507273 508281 508480 507265 504442 500441 495881
59792D95881m739m664m244l657l391l630l893l611k854k089j424o01K91O20J4
$$ 495881 491142 486478 482234 478577 475186 471556 467663 464052 461198 459109 457685 457084 457375 457995 458009
59777D58009j031j667j620j203o68k5N79P61M20o3k45n5L39P59R67P09J15k60
$$ 458009 456978 455311 453691 452488 451820 451795 452374 453135 453555 453492 453247 453192 453531 454290 455257 455966 456081 455821
59759D55821m6M76Q00Q95J064J335J449J353J254J184R72P53R51J605K167K250
$$ 455821 455775 456251 457051 457946 459010 460345 461794 463147 464401 465585 466557 467310 468261 469866 472033 474283
59743D74283K104K031J800J151M71L35N59M59Pl5O58J376J329O85J54n%P5K34
$$ 474283 476387 478418 480218 481369 481840 482175 482734 483193 483200 483165 483823 485199 486528 487213 487367 487362 487362 487437 487671
59724D87671K26j74n71l71K05K85l48q23l94M84Q88O42K21j56n99q95n53L97J272
$$ 487671 487897 487723 487152 486781 486986 487271 486923 486100 485706 486190 487078 487720 487941 487785 487186 486291 485738 486135 487407
59705D87407J547J345J018P20O12R44J571J802J126j21j152j604j582j095OJ477
$$ 487407 488954 490299 491317 492037 492649 493593 495164 496966 498092 497971 496819 495215 493633 492538 492544 494021
59689D94021K475K248Q63q98k226k720k339j236K64J652K499K671K246J332J60
$$ 494021 496496 498744 499607 498709 496483 493763 491424 490188 490452 492104 494603 497274 499520 500852 501012
59674E01012p43q71m32k69q57j660j921j727j754k114k171j635j120j299j944
$$ 501012 500269 499398 498966 498697 497840 496180 494259 492532 490778 488664 486493 484858 483738 482439 480495
59659D80495k197j524r4J492K575K804K405J978J904K111K453K849L022K633J896
$$ 480495 478298 476774 476680 478172 480747 483551 485956 487934 489838 491949 494402 497251 500273 502906 504802
59644E04802J490J489J056l01j737k117j542j063j146j338j287j155r78m86K75
$$ 504802 506292 507781 508837 508536 506799 504682 503140 502077 500931 499593 498306 497151 496173 495687 495962
59629D95962Q60J157J539K043K119J538R00Q51J343J941K416K576K051P63o71
$$ 495962 496822 497979 499518 501561 503680 505218 506118 506969 508312 510253 512669 515245 517296 518059 517388
59614E17388j494j625j596j820k187k245j616m46N63Q66Q12J249K283L093L117
$$ 517388 515894 514269 512673 510853 508666 506421 504805 504359 504922 505788 506600 507849 510132 513225 516342
59599E16342K767K602K411J739P58K4l49o32r21j100j119q60j48O34M50j106k882
$$ 516342 519109 521711 524122 525861 526619 526643 526294 525662 524741 523641 522522 521662 521514 522148 522598 521492 518610
59582E18610l388k655j986k048k271k178k195k780l574l927l656k905j766n11
$$ 518610 515222 512567 510581 508533 506262 504084 501889 499109 495535 491608 487952 485047 483281 482770
59568D82770K74K31l49r30j240j207p51P3R36J470J482R50R9n06l79L39J120J786
$$ 482770 483044 483275 482926 481996 480756 479549 478798 478871 479807 481277 482759 483709 483808 483302 482923 483262 484382 486168
59550D86168K478L002K959K581K620L165L500L433L776M978O314P244Q565J1108
$$ 486168 488646 491648 494607 497188 499808 502973 506473 509906 513682 518660 524974 532218 540783 551891
59536E51891J4020J5723J5976J5573J4223J0510M326k118o368p827p266n344k458
$$ 551891 565911 581634 597610 613183 627406 637916 642242 640124 633756 625929 618663 613319 610861
59523F10861P36L617O093Q136R260R160Q515Q424R158R943R825Q330N565K262
$$ 610861 611597 615214 621307 629443 638703 647863 656378 664802 673960 683903 693728 702058 707623 709885
59509G09885n10k253l529n108o852q118q878r666j0505j0871j0760j0831j1154
$$ 709885 709375 707122 703593 698485 691633 683515 674637 664971 654466 643595 632835 622004 610850
59496F10850j0832r447p959p375p264o474m914l503k621j773q81p04j480k076
$$ 610850 600018 590571 582612 575237 567973 561499 556585 553082 550461 548688 547807 547103 545623 543547
59482E43547j226R50L298M991N920O111N685N296N757O987P856P384N766M024
$$ 543547 542321 543271 546569 551560 557480 563591 569276 574572 580329 587316 595172 602556 608322 612346
59468F12346K949K582K447K060J314N87L46P21J540K732M343O214Q025R760J1688
$$ 612346 615295 617877 620324 622384 623698 624285 624631 625352 626892 629624 633967 640181 648206 657966 669654
59453F69654J3787J5615J7022J8524K0513K2513K3715K4026K3979K3573K1790
$$ 669654 683441 699056 716078 734602 755115 777628 801343 825369 849348 872921 894711
59442H94711J7417J0249J448o995j3350j7151j9313k1017k2483k3004k2091k0173
$$ 894711 912128 922377 923825 916830 903480 886329 867016 845999 823516 800512 778421 758248
59430G58248j8096j6390j5101j4043j2964j1620r877p694n028j932J372M685Q014
$$ 758248 740152 723762 708661 694618 681654 670034 660157 652463 647435 645503 646875 651560 659574
59417F59574J1288J4121J6356J8609K1613K5073K7862K9359K9648K8184K3515
$$ 659574 670862 684983 701339 719948 741561 766634 794496 823855 853503 881687 905202
59406I05202J5226N331l203q923j2072j3058j2064r876p657n706l774k802n028
$$ 905202 920428 925759 922556 913633 901561 888503 876439 866563 858906 853200 849426 846624 841596
59393H41596j1401j9793k6660k9992l0085k8170k5333k2376j9736j7353j5118
$$ 841596 830195 810402 783742 753750 723665 695495 670162 647786 628050 610697 595579
59382E95579j3281j1951j0604q766o924n962n861n780n312m744m014k550n27Q03
$$ 595579 582298 570347 559743 550977 544053 538091 532230 526450 521138 516394 512380 509830 509303 510106
59368E10106P50L18Q33K036K522J763O77K12K90M61P86J583K774L976N091O329
$$ 510106 510856 511174 512007 514043 516565 518328 519005 519217 519507 519968 520754 522337 525111 529087 534178 540507
59352E40507P735R026R961J0699J1677J3150J4865J6335J7411J8493J9979K1639
$$ 540507 548242 557268 567229 577928 589605 602755 617620 633955 651366 669859 689838 711477
59340G11477K2766K2950K2449K1718K0805J9377J7194J4323J0946P172L114r29
$$ 711477 734243 757193 779642 801360 822165 841542 858736 873059 884005 891177 894291 893362
59328H93362m587p800j0910j4155j7145j9205k0272k1011k1822k2201k1552k0217
$$ 893362 888775 880975 870065 855910 838765 819560 799288 778277 756455 734254 712702 692485
59316F92485j9017j7977j6374j4073j1947j0545r182o991m289k150r72k62L78
$$ 692485 673468 655491 639117 625044 613097 602552 593370 586379 582090 579940 578968 578706 579084
59303E79084R09J588L130N717Q473J0465J1820J3392J5516J7690J9290J9968J9171
$$ 579084 579993 581581 584711 590428 598901 609366 621186 634578 650094 667784 687074 707042 726213
59290G26213J5894R595J288o802j2881j6620j8514j8727j7132j4225j1178q743
$$ 726213 742107 751702 752990 746188 733307 716687 698173 679446 662314 648089 636911 628168
59278F28168o633m310j879K36K049L872N684P217Q599J0281J2351J4389J6074
$$ 628168 621535 617225 615346 615582 617631 621503 627187 634404 643003 653284 665635 680024 696098
59265F96098J7350J8037J7829J6831J5545J4090J2001R041N675K382r75m598p983
$$ 696098 713448 731485 749314 766145 781690 795780 807781 816822 822497 824879 823904 819306 811323
59252H11323j0332j1532j2185j2824j3517j4095j4288j3707j2185j0133q159o298
$$ 811323 800991 789459 777274 764450 750933 736838 722550 708843 696658 686525 678366 672068
59240F72068m109j582N41J611J966K607M141O239Q086R157R473R307Q899Q420
$$ 672068 667959 666377 666918 668529 670495 673102 677243 683482 691568 700725 710198 719505 728404 736824
59226G36824P975P412O269M265J743p24l104n815q844j1447j2974j3505j3400
$$ 736824 744799 752211 758480 762745 764488 763764 760660 754845 746001 734554 721580 708075 694675
59213F94675j2817j2028j1681j2090j2657j2542j1687j0627r680q885q374q079
$$ 694675 681858 669830 658149 646059 633402 620860 609173 598546 588866 579981 571607 563528
59201E63528p441o154m929m611m834m597l917l633l652k833j026L02J73m59l06
$$ 563528 556087 549933 545004 540393 535559 530962 527045 523412 519760 516927 515901 516203 516376 515917 515611
59186E15611L49M95K63N56J423K060K213K349K560K447K157K392L266M092M548
$$ 515611 515960 516455 516718 517274 518697 520757 522970 525319 527879 530326 532483 534875 538141 542233 546781
59171E46781N125O119P029P386P493P940Q876J0148J1673J3226J4332J4788J4946
$$ 546781 551906 558025 565054 572440 579933 587873 596749 606897 618570 631796 646128 660916 675862
59158F75862J5125J5037J4186J2588J0677Q718O625M302J798q14l436n812p670
$$ 675862 690987 706024 720210 732798 743475 752193 758818 763120 764918 764104 760668 754856 747186
59145G47186r011j0110j1131j1863j1967j1425j0622r939r383q781q176p711p212
$$ 747186 738175 728065 716934 705071 693104 681679 671057 661118 651735 642954 634778 627067 619855
59132F19855o272m895l598k701j955j132m47O1R75K727M729O034O580P011P539
$$ 619855 613583 608688 605090 602389 600434 599302 598855 598916 599891 602618 607347 613381 619961 626972 634511
59117F34511P857Q073Q759R905J0807J1209J1670J2475J2971J2535J1456J0352
$$ 634511 642368 650441 659200 669105 679912 691121 702791 715266 728237 740772 752228 762580
59105G62580R328Q321P652P566P540O838N489M167L225K447J637R04L37k61j129
$$ 762580 771908 780229 787881 795447 802987 809825 815314 819481 822706 825153 826790 827694 828031 827770 826641
59090H26641k204l052l156k455j546j161j452k119l115m670o579q144r018r516
$$ 826641 824437 821385 818229 815774 814228 813067 811615 809496 806381 801711 795132 786988 777970 768454
59076G68454r886j0007j0022j0480j1301j1502j0574r411r001q899q046o555n511
$$ 768454 758568 748561 738539 728059 716758 705256 694682 685271 676270 667371 659325 652770 647259
59063F47259n256n061m524m181m391m621m200l224k288j757j606j619j597j554
$$ 647259 642003 636942 632418 628237 623846 619225 615025 611801 609513 607756 606150 604531 602934 601380
59049F01380j742k263k833l188l485l879l987l365k291j436r55m99K1M02P40J296
$$ 601380 599638 597375 594542 591354 587869 583990 580003 576638 574347 572911 571956 571457 571478 571880 572620 573916
59033E73916J885K133K282K885L752M158M125M472N396O090O178O523P946R980
$$ 573916 575801 577934 580216 583101 586853 591011 595136 599608 605004 611094 617272 623795 631741 641721
59019F41721J1579J2403J2789J2960J2895J2592J1884J0403Q128N712L874K777
$$ 641721 653300 665703 678492 691452 704347 716939 728823 739226 747354 753066 756940 759717
59007G59717K187J770J112O9o07J48K190L999M665N093O506Q511R739R786R418
$$ 759717 761904 763674 764786 764855 764248 764396 766586 770585 775250 780343 786849 795360 805099 814885 824303
58992H24303R103Q477P280N942N049M768M812M572L402J215j444m187p149j0106
$$ 824303 833406 841883 849163 855105 860154 864922 869734 874306 877708 878923 877479 873292 866143 856037
58978H56037j1973j2088j1387j1210j1375j0592q593o467m867l254j172R88K928
$$ 856037 844064 831976 820589 809379 798004 787412 778819 772352 767485 764231 763059 764047 766975
58965G66975M957O973Q002P627O990P510R100J0497J0843J0232R002P359N462
$$ 766975 771932 778905 786907 794534 801524 809034 818134 828631 839474 849706 858708 866067 871529
58952H71529L312O30k707o254r401j1896j3596j4076j3150j1518j0276r717r193
$$ 871529 874841 875471 872764 866510 857109 845213 831617 817541 804391 792873 782597 772880 763687
58939G63687q125o707n567n114n346n993o770p625q635r586r950r555q972q709
$$ 763687 755562 748855 743288 738174 732828 726835 720065 712440 703805 694219 684269 674714 665742 657033
58925F57033q334p057n120l839l975m693m546l167j562r15j410k190k191j047
$$ 657033 648699 641642 636522 632683 628708 624015 619469 616302 614740 613825 612415 610225 608034 606987
58911F06987O84K153L051L724M582N662O859Q185R596J0860J1856J2863J4154
$$ 606987 607671 609824 612875 616599 621181 626843 633702 641887 651483 662343 674199 687062 701216
58898G01216J5406J5928J5537J4896J4774J5203J5518J5247J4760J5023J6746
$$ 701216 716622 732550 748087 762983 777757 792960 808478 823725 838485 853508 870254
58887H70254J9740K3092K5997K8342L0432L2239L3157L2581L0472K7212K3072
$$ 870254 889994 913086 939083 967425 997857 1030096 1063253 1095834 1126306 1153518 1176590
58876A176590J8104J2496O713J122m327r915j5617k0935k5265k8359l0351l1422
$$ 1176590 1194694 1207190 1213903 1215025 1210698 1200783 1185166 1164231 1138966 1110607 1080256 1048834
58864A048834l1551l0639k8766k6217k3352k0608j8555j7556j7287j6923j6041
$$ 1048834 1017283 986644 957878 931661 908309 887701 869146 851590 834303 817380 801339
58853H01339j5147j4967j5444j5787j5465j4602j3456j2056j0575r505r004q433
$$ 801339 786192 771225 755781 739994 724529 709927 696471 684415 673840 664335 655331 646898
58841F46898p140n545m844n510o567o641n444l913l054k980l100k967k701k658
$$ 646898 639758 634213 629369 623859 617292 610651 605207 601294 598240 595260 592160 589193 586492 583834
58827E83834k875l031k864k469k116j870j515q49J3P21J077J277J734K585L492
$$ 583834 580959 577928 575064 572595 570479 568609 567094 566245 566258 566979 568056 569333 571067 573652 577144
58812E77144L979L899L462K908K333J787J295O96k41j462k514k952k770k293j803
$$ 577144 581123 585022 588484 591392 593725 595512 596807 597503 597262 595800 593286 590334 587564 585271 583468
58797E83468j418j290j620k358k952k644j225N18J350Q05l12p37L9J529L000M105
$$ 583468 582050 580760 579140 576782 573830 571186 569961 570479 571829 572634 572322 571585 571624 573153 576153 580258
58781E80258M814N180N342N482N675N863N908N531M404K597Q36j63n08p92j039
$$ 580258 585072 590252 595594 601076 606751 612614 618522 624053 628457 631054 631890 631727 631219 630427 629388
58766F29388p41L4L90j77j002j243j033j064j366j238j87J500L046L714L403K955
$$ 629388 628647 628681 629071 628894 627892 626649 625616 624552 623186 621948 621761 623261 626307 630021 633424 636379
58750F36379L505N113O498O669O281O689P965Q829Q427P353O688O751P089P274
$$ 636379 639884 644997 651495 658164 664445 671134 679099 687928 696355 703708 710396 717147 724236 731510
58736G31510P377P753Q487R037Q715P685P080P669Q817R277Q781Q128P932P958
$$ 731510 738887 746640 755127 764164 772879 780564 787644 795313 804130 813407 822188 830316 838248 846206
58722H46206P708P004N992N082M806N256N791N805N598N836O454O884P179P838
$$ 846206 853914 860918 866910 871992 876798 882054 887845 893650 899248 905084 911538 918422 925601 933439
58708I33439Q577Q382P004N417M364L371J611j057m377q232j2256j5624j7813
$$ 933439 942016 950398 957402 962819 967183 970554 972165 971108 966731 958499 946243 930619 912806
58695I12806j9172k0256k1084k1458k1431k1011j9939j8254j6494j4936j3263
$$ 912806 893634 873378 852294 830836 809405 788394 768455 750201 733707 718771 705508
58684G05508j1532j0624j0947j1347j0406q444p168p392q131q027o858n339m076
$$ 705508 693976 683352 672405 661058 650652 642208 635040 627648 619517 611490 604632 599293 595217
58671E95217l159k383j488l03J100K468L587M415N072N809O801P875Q512Q295
$$ 595217 592058 589675 588187 587884 588984 591452 595039 599454 604526 610335 617136 625011 633523 641818
58657F41818P249N762M285L077K019P03r51k284k544j874j124p29m44k30m43r23
$$ 641818 649067 654829 659114 662191 664210 664913 663962 661678 659134 657260 656136 655407 654963 654733 654290 653367
58641F53367q83j35M83N22Q00K062L593M174L806L456L604M083M931O150O977
$$ 653367 652484 652349 652832 653354 654154 656216 659809 663983 667789 671245 674849 678932 683863 690013 696990
58626F96990O558N271M220L495K234M23p00m65K21L31J30M54J369K437L681N410
$$ 696990 703548 708819 713039 716534 718768 719191 718491 718026 718247 718578 718708 719162 720531 722968 726649 732059
58610G32059P287Q451Q527Q012P492O891N625L371N99j718k898l067k819k569
$$ 732059 739346 747797 756324 764336 771828 778719 784344 787715 788314 786596 783698 780631 777812 775243
58596G75243k361k081j646j116p40o54m13O24K142K818K117J444K492M920O865
$$ 775243 772882 770801 769155 768039 767299 766645 766232 766856 768998 771816 773933 775377 777869 782789 789654
58581G89654P515P769Q351Q789Q732Q798R287R209P709N584M253L851L552L252
$$ 789654 797169 804938 813289 822078 830810 839608 848895 858104 865813 871397 875650 879501 883053 886305
58567H86305L690N020O419P363Q317R841J1704J3239J4125J4462J4420J4019J3116
$$ 886305 889995 895015 901434 908797 917114 926955 938659 951898 966023 980485 994905 1008924 1022040
58554A022040J1537R409P333N772M313J988j525n350q285r909j0660j1151j1710
$$ 1022040 1033577 1042986 1050319 1056091 1060404 1062392 1060867 1055517 1047232 1037323 1026663 1015512 1003802
58541A003802j2391j3034j3326j3106j2627j2328j2293j2197j1842j1470j1283
$$ 1003802 991411 978377 965051 951945 939318 926990 914697 902500 890658 879188 867905
58530H67905j0885r624p459n135l350k092r38L02J546K727L796M558M874M952
$$ 867905 857020 847396 839937 834802 831452 829360 828422 828724 830270 832997 836793 841351 846225 851177
58516H51177N122N421N632N545M981L786K152P81K04J26j0n5N94J796K645K799
$$ 851177 856299 861720 867352 872897 877878 881664 883816 884597 884801 884927 884917 884862 885456 887252 889897 892696
58500H92696L017L898M869N062M625M430M766N086M944M504M021L354K258R09
$$ 892696 895713 899611 904480 909542 914167 918597 923363 928449 933393 937897 941918 945272 947530 948439
58486I48439j46n77p21j375k941m845o059o223n865n426m625l119j294J59J041
$$ 948439 948293 947716 946995 945620 942679 937834 931775 925552 919687 914261 909636 906517 905223 905382 906423
58471I06423J469J228K0j734l181m130n196o574p492p270o345n666n459n204m625
$$ 906423 907892 909120 909140 907406 904225 900095 894899 888325 880833 873563 867218 861552 856093 850889 846264
58456H46264m037l714l447k855j844n79P12J795K499K825K837K474J698Q50N10
$$ 846264 842227 838513 835066 832211 830367 829788 830500 832295 834794 837619 840456 842930 844628 845478 845988
58441H45988Q85J547J937J914J744J765K253L265M417N172N556O215P374Q213
$$ 845988 846873 848420 850357 852271 854015 855780 858033 861298 865715 870887 876443 882658 890032 898245
58427H98245P883O804O208O577P315P966Q822J0094J1287J1852J1798J1288J0160
$$ 898245 906128 912932 919140 925717 933032 940998 949820 959914 971201 983053 994851 1006139 1016299
58414A016299Q312O095L899J804oj049j242j252j572j823j619j580k548m085m775
$$ 1016299 1024611 1030706 1034605 1036409 1036403 1035354 1034112 1032860 1031288 1029465 1027846 1026266 1023718 1019633 1014858
58399A014858l942k304q85m5L72O71J240K303L529M310M456M207L607K437P99
$$ 1014858 1010916 1008612 1007727 1007682 1008054 1008725 1009965 1012268 1015797 1020107 1024563 1028770 1032377 1034814 1035613
58384A035613q41k280l709n102n982n986n262m170l028k128j612j172k76J201
$$ 1035613 1034772 1032492 1028783 1023681 1017699 1011713 1006451 1002281 999253 997125 995513 994341 994065 995266
58370I95266K925M596O098P145P380O940O526O743P635Q883J0087J0880J1231
$$ 995266 998191 1002787 1008885 1016030 1023410 1030350 1036876 1043619 1051254 1060137 1070224 1081104 1092335
58357A092335J1586J2318J3135J3445J3189J2722J2052J0893R401Q156P346O696
$$ 1092335 1103921 1116239 1129374 1142819 1156008 1168730 1180782 1191675 1201076 1209232 1216578 1223274
58345A223274O231O341O918P270P171P278Q138R460J0690J1728J2692J3517J4221
$$ 1223274 1229505 1235846 1242764 1250034 1257205 1264483 1272621 1282081 1292771 1304499 1317191 1330708 1344929
58332A344929J4987J5729J6031J5909J6029J6751J7454J7308J6369J5389J4784
$$ 1344929 1359916 1375645 1391676 1407585 1423614 1440365 1457819 1475127 1491496 1506885 1521669
58321A521669J4288J3524J2589J2001J2102J2539J2564J2036J1764J2396J3369
$$ 1521669 1535957 1549481 1562070 1574071 1586173 1598712 1611276 1623312 1635076 1647472 1660841
58310A660841J3678J3439J3826J5412J7509J9271K0550K1517K2196K2745K3422
$$ 1660841 1674519 1687958 1701784 1717196 1734705 1753976 1774526 1796043 1818239 1840984 1864406
58299A864406K3980K3833K3043K2437K2439K2570K2352K1897K1400K0949K1190
$$ 1864406 1888386 1912219 1935262 1957699 1980138 2002708 2025060 2046957 2068357 2089306 2110496
58288B110496K3119K6640L0151L2328L3547L4912L6643L8235L9635M1271M3200
$$ 2110496 2133615 2160255 2190406 2222734 2256281 2291193 2327836 2366071 2405706 2446977 2490177
58277B490177M4979M6349M7579M9113N1103N3171N4733N5777N7126N9349O1664
$$ 2490177 2535156 2581505 2629084 2678197 2729300 2782471 2837204 2892981 2950107 3009456 3071120
58266C071120O2824O3032O3850O6102O9009P1709P4439P7628Q0991Q4188Q7498
$$ 3071120 3133944 3196976 3260826 3326928 3395937 3467646 3542085 3619713 3700704 3784892 3872390
58255C872390R1053R4205R6426R8203J00361J03065J06082J09477J13535J18360
$$ 3872390 3963443 4057648 4154074 4252277 4352638 4455703 4561785 4671262 4784797 4903157
58245D903157J23937J30138J36661J43487J51281J60541J70507J80049J89501
$$ 4903157 5027094 5157232 5293893 5437380 5588661 5749202 5919709 6099758 6289259
58236F289259K00262K12566K25283K38072K52105K68178K85788L04728L25890
$$ 6289259 6489521 6702087 6927370 7165442 7417547 7685725 7971513 8276241 8602131
58227H602131L49624L74943M01261M29595M61134M96023N34303N76734O23742
$$ 8602131 8951755 9326698 9727959 10157554 10618688 11114711 11649014 12225748 12849490
58218A2849490O75036P31208P94406Q66554R48224J040063J144185J263408J400421
$$ 12849490 13524526 14255734 15050140 15916694 16864918 17904981 19049166 20312574 21712995
58209B1712995J558337J741099J953028K199422K487754K826985L225891L693634
$$ 21712995 23271332 25012431 26965459 29164881 31652635 34479620 37705511 41399145
58201D1399145M241771M884048N635146O512069P536275Q732344J0124755J1735524
$$ 41399145 45640916 50524964 56160110 62672179 70208454 78940798 89065553 100801077
58193A00801077J3579626J5657904J7953468K0422985K2955780K5301171K7022852
$$ 100801077 114380703 130038607 147992075 168415060 191370840 216672011 243694863
58186B43694863K7539913K6246167K2669482J6674407Q687357k22641q615690
$$ 243694863 271234776 297480943 320150425 336824832 345512189 345289548 336673858
58179C36673858j5246775j9534608k1597156k1947924k1213486k0025144j8925137
$$ 336673858 321427083 301892475 280295319 258347395 237133909 217108765 198183628
58172A98183628j8182039j7687411j7115161j6220169j4987529j3548158j2036285
$$ 198183628 180001589 162314178 145199017 128978848 113991319 100443161 88406876
58165H8406876j0543992r142480p883667o784268n834775n022998m337671l759441
$$ 88406876 77862884 68720404 60836737 54052469 48217694 43194696 38857025 35097584
58157C5097584l265578k842132k482315k176898j914949j690784j502239j344068
$$ 35097584 31832006 28989874 26507559 24330661 22415712 20724928 19222689 17878621
58149A7878621j209099j093519r95624r11486q36557p69379p09546o54203o00478
$$ 17878621 16669522 15576003 14580379 13668893 12832336 12062957 11353411 10699208 10098730
58140A0098730n49288n02949m61013m21729l85646l54349l27404l03747k84352
$$ 10098730 9549442 9046493 8585480 8163751 7778105 7423756 7096352 6792605 6508253
58131F508253k70433k60360k51129k41621k31990k21428k09116j96180j84203
$$ 6508253 6237820 5977460 5726331 5484710 5252720 5031292 4822176 4625996 4441793
58122D441793j72944j61533j50736j41852j34474j27284j20050j13142j06290
$$ 4441793 4268849 4107316 3956580 3814728 3680254 3552970 3432920 3319778 3213488
58113C213488r9458r3705q9487q5468q0662p6274p3663p1951o9520o6546o4104
$$ 3213488 3114030 3020325 2930838 2845370 2764708 2688434 2614771 2542820 2473300 2406754 2342650
58102B342650o1953n9215n6204n3711n1462m8992m7004m6091m5149m2923m0153
$$ 2342650 2280697 2221482 2165278 2111567 2060105 2011113 1964109 1918018 1872869 1829946 1789793
58091A789793l8287l7014l5007l2286k9956k8225k6519k5009k4161k3396k1900
$$ 1789793 1751506 1714492 1679485 1647199 1617243 1589018 1562499 1537490 1513329 1489933 1468033
58080A468033k0313j9921k0591k1213k1633k2438k3211k2856k1526k0587k0641
$$ 1468033 1447720 1427799 1407208 1385995 1364362 1341924 1318713 1295857 1274331 1253744 1233103
58069A233103k0987k0990k0672k0016j8953j7983j7650j7542j6756j5207j3531
$$ 1233103 1212116 1191126 1170454 1150438 1131485 1113502 1095852 1078310 1061554 1046347 1032816
58058A032816j2055j0878j0520j1326j2554j3163j3169j3248j3420j3214j2702
$$ 1032816 1020761 1009883 999363 988037 975483 962320 949151 935903 922483 909269 896567
58047H96567j2178j1294r692q082p411p389p142o851p338q317q661q242q030q371
$$ 896567 884389 873095 863403 855321 847910 840521 833379 826528 819190 810873 802212 793970 785940 777569
58033G77569q595q429q395q648q683q381q198q099p484o406n738n821n931n449
$$ 777569 768974 760545 752150 743502 734819 726438 718240 710141 702657 696251 690513 684692 678761 673312
58019F73312m670m143l983m095m330m300l730l089l047l366l137k183j355j310
$$ 673312 668642 664499 660516 656421 652091 647791 644061 640972 637925 634559 631422 629239 627884 626574
58005F26574j897k810l970n058n502n243m829m606m448m351m480m520l803k379
$$ 626574 624677 621867 617897 612839 607337 602094 597265 592659 588211 583860 579380 574860 571057 568678
57991E68678j131n65j33P98J960K571K421K101K269K854L083K358J126M64O69
$$ 568678 567547 566982 566849 567647 569607 572178 574599 576700 578969 581823 584906 587264 588390 588854 589523
57976E89523Q35J52j066k116k908l506l453k600j900k255l022k970k212j817j805
$$ 589523 590358 590510 589444 587328 584420 580914 577461 574861 572961 570706 567684 564714 562502 560685 558880
57961E58880j203l8M32k50j043j261j607k677l799m176m159m435m881n122n432
$$ 558880 557677 557639 558071 557821 556778 555517 553910 551233 547434 543258 539099 534664 529783 524661 519229
57946E19229o136o686o270m997l737k993k613k389k308k296k124j622q25Q3R12
$$ 519229 513093 506407 500137 495140 491403 488410 485797 483408 481100 478804 476680 475058 474233 474316 475228
57931D75228J692K597L408L357K028K69n79k84J53Ll87m55l07l70q15j632k725
$$ 475228 476920 479517 482925 486282 488310 488579 488000 487716 487869 487872 487485 487030 486723 486353 485538 483906 481181
57914D81181l729m269m531n033n736o032n674n083m580m130l920m290m901m884
$$ 481181 477452 473183 468652 463619 457883 451851 446177 441094 436514 432384 428464 424174 419273 414389
57900D14389m145l549l503l361k724k263k486k728k211j314q85q89o76j15M24
$$ 414389 410244 406695 403192 399831 397107 394844 392358 389630 387419 386105 385220 384331 383655 383540 383964
57885C83964Q47J238J355R92O08Q38J565K170K389K336J936J030j25j027j479
$$ 383964 384811 386049 387404 388396 389004 389842 391407 393577 395966 398302 400238 401268 401143 400116 398637
57870C98637j607j565j688k482l912n100n346n032m895m895m540l912l398k808
$$ 398637 397030 395465 393777 391295 387383 382283 376937 371905 367010 362115 357575 353663 350265 347457
57856C47457j749o34j71m2O96J899K317J662J314K293L692M074L539L307L772
$$ 347457 345708 345074 344903 344861 345557 347456 349773 351435 352749 355042 358734 362808 366347 369654 373426
57841C73426M169M021L812M044M444M391L591K052l3k105l380l556l187l011l152
$$ 373426 377595 381616 385428 389472 393916 398307 401898 403950 403917 401812 398432 394876 391689 388678 385526
57826C85526l327l579m173m851m797l629k038j005o86m41J23O49O88M47O34J594
$$ 385526 382199 378620 374447 369596 364799 361170 359132 358127 357441 357000 357123 357772 358460 358907 359541 361135
57810C61135K795L205K184Jk521m797o748q350r288r286q552p617o853o311n850
$$ 361135 363930 367135 369319 369320 366799 362002 355254 346904 337616 328330 319778 312161 305308 298997 293147
57795B93147n205m148k866j942j650j546j167p84r14j383j532j214q29m58K04
$$ 293147 287942 283794 280928 278986 277336 275790 274623 273839 272925 271542 270010 268796 267967 267509 267713
57780B67713R71J074L50l00J4J134K299L058L314L069K637K619L165L612L389
$$ 267713 268684 269758 270108 269808 269822 270956 273255 276313 279627 282696 285333 287952 291117 294729 298118
57765B98118K827K532K325J487j17j831l081l932m728n626o596p571q432q983
$$ 298118 300945 303477 305802 307289 307172 305341 302260 298328 293600 287974 281378 273807 265375 256392
57751B56392r030q509p607o695n973n204m080k814j947j604j480j523j949k388
$$ 256392 247362 238853 231246 224551 218578 213374 209294 206480 204533 202929 201449 199926 197977 195589
57737A95589j910l45J239J991K453L467M579M643L659K887L147L969M522M572
$$ 195589 193679 193334 194573 196564 199017 202484 207063 211706 215365 218252 221399 225368 229890 234462
57723B34462M301L921L665L580L198J979K35j090j641k037k758l387l366k863
$$ 234462 238763 242684 246349 249929 253127 255106 255341 254251 252610 250573 247815 244428 241062 238199
57709B38199k339j752q39J00M23J07j28K63R82J380J283J137J375J929K396K601
$$ 238199 235860 234108 233269 233369 233792 233899 233771 234034 235016 236396 237679 238816 240191 242120 244516 247117
57693B47117K765L061L189K662J504L72j27o5Q8K42Q37K097L476M253M660N948
$$ 247117 249882 252943 256132 258794 260298 260670 260543 260478 260566 260808 261645 263742 267218 271471 276131 282079
57677B82079R037J3413J7763K1574K5563L0564L6537M2872M9173N5276O0684O4140
$$ 282079 291116 304529 322292 343866 369429 399993 436530 479402 528575 583851 644535 708675
57665G08675O3559N6511M1581J9950m555k7454m5672n7873o3796o4087o0463n4964
$$ 708675 772234 828745 870326 890276 885721 858267 812595 754722 690926 626839 566376 511412
57653E11412m8831m2429l6089l0398k5661k1702j8305j5445j3010j0797q807p162
$$ 511412 462581 420152 384063 353665 328004 306302 287997 272552 259542 248745 239938 232776
57641B32776n727m232k770j665q97j99K65o1j164k158k281j749j312j325j519
$$ 232776 227049 222817 220047 218382 217485 217286 217551 217490 216326 214168 211887 210138 208826 207501 205982
57626B05982j478j038m73l50r11j637j834j664j982k977l732l434k341j178k60
$$ 205982 204504 203466 202993 202643 201732 200095 198261 196597 194615 191638 187906 184472 182131 180953 180693
57611A80693K39j77j620l052l208k134j009n38l28J29P15J122J384J559J461J008
$$ 180693 180932 180755 179135 176083 172875 170741 169732 169194 168866 168995 169710 170832 172216 173775 175236 176244
57595A76244M06k29r91j670j709r68j26J56J6q9j89n68j081j344j436j692j896
$$ 176244 176650 176421 175430 173760 172051 171083 170957 171113 171129 171040 170851 170283 169202 167858 166422 164730 162834
57578A62834j457m49K48R3m50p15p02p22p89q06j008j502j791j408p93p98j414
$$ 162834 161377 160928 161176 161269 160819 160104 159402 158680 157891 157085 156077 154575 152784 151376 150583 149785 148371
57561A48371j798j633j528j777j625l97J236J942J422O85O62J237J665J434N17
$$ 148371 146573 144940 143412 141635 140010 139613 140849 142791 144213 144898 145560 146797 148462 149896 150413
57546A50413p68j869k282j933j183l76L74R51J124R64R84J549K202J994N46j423
$$ 150413 149645 147776 145494 143561 142378 142002 142376 143327 144451 145415 146399 147948 150150 152144 152690 151267
57530A51267k708k614j358K64J464J854J583J171J113J494K000K266K211K003
$$ 151267 148559 145945 144587 144851 146315 148169 149752 150923 152036 153530 155530 157796 160007 162010
57516A62010J780J506J135Q12P73J024J160P11l18j376j954k123k334k781l225
$$ 162010 163790 165296 166431 167243 168016 169040 170200 170911 170593 169217 167263 165140 162806 160025 156800
57501A56800l402l276k918k468k270k581k930k346o33J057J496R31O58J281K229
$$ 156800 153398 150122 147204 144736 142466 139885 136955 134609 133976 135033 136529 137460 138118 139399 141628
57486A41628K967L760M887N917O312O180N915N532M894M240L919L767L309K461
$$ 141628 144595 148355 153242 159159 165471 171651 177566 183098 187992 192232 196151 199918 203227 205688
57472B05688J582R33M91K67L23N25O38O47O70N76J40m53o65l05J56J65k46n52
$$ 205688 207270 208203 208694 208961 209284 209809 210447 211094 211764 212340 212480 212027 211362 211057 211213 211378 211132 210580
57454B10580l37L64J178J715J753J280M35m86j056r42k35N59R98J075J020R06
$$ 210580 210243 210607 211785 213500 215253 216533 216968 216482 215426 214484 214249 214808 215806 216881 217901 218807
57438B18807N76Kn26n89m8P12J059P10O5k42n9K43L27K44K06L28O10Q37N78k85
$$ 218807 219383 219385 218859 218270 218222 218934 219993 220703 220768 220526 220467 220710 221037 221281 221487 221815 222425 223262 223840 223555
57418B23555j039p89K73R49O41J50M02J105J316Q29K08j97m39m51n4M96P34O77
$$ 223555 222516 221727 222000 222949 223590 223740 224142 225247 226563 227392 227600 227403 226964 226513 226459 226955 227689 228366
57400B28366P39R75J044Q42O10M28J94Q7M07R04Q97K26m24l69L43J160J621J585
$$ 228366 229105 230080 231124 231966 232576 233004 233198 233285 233692 234596 235493 235719 235295 234926 235269 236429 238050 239635
57382B39635J245R59Q28N60O4j29L93J012P19l93j164r12p5P70J600K285K213
$$ 239635 240880 241839 242667 243227 243291 243162 243555 244567 245286 244893 243729 242817 242742 243512 245112 247397 249610
57365B49610J233K15jL27M49L28N36J250K063K592K748K587K340K468L182M014
$$ 249610 250843 251058 251057 251384 251833 252161 252697 253947 256010 258602 261350 263937 266277 268745 271927 275941
57349B75941M243L684K745J894J383J348J713K074J978J376N84k7j61L70J356
$$ 275941 280184 283868 286613 288507 289890 291238 292951 295025 297003 298379 298963 298936 298775 299145 300501
57334C00501K129K147J633J336J732K652L573L943L410K144R65P35J450K198K158
$$ 300501 302630 304777 306410 307746 309478 312130 315703 319646 323056 325200 326165 326900 328350 330548 332706
57319C32706J468R56J095J590J891J895J869J873J710J492J739K604L393L371
$$ 332706 334174 335130 336225 337815 339706 341601 343470 345343 347053 348545 350284 352888 356281 359652
57305C59652K768K436K627K819K753K889L619M604N230N296M922M251L550L265
$$ 359652 362420 364856 367483 370302 373055 375944 379563 384167 389397 394693 399615 403866 407416 410681
57291D10681L611M270M734M771M413L838L412L426L635L466K890K606L072L812
$$ 410681 414292 418562 423296 428067 432480 436318 439730 443156 446791 450257 453147 455753 458825 462637
57277D62637M106L916L726L748L787L720L660L729L982M413M877N170N299N449
$$ 462637 466743 470659 474385 478133 481920 485640 489300 493029 497011 501424 506301 511471 516770 522219
57263E22219N648N781N983O451O849O554N777N617O593P863Q398Q285Q157Q097
$$ 522219 527867 533648 539631 546082 552931 559485 565262 570879 577472 585335 593733 602018 610175 618272
57249F18272P923P948Q455Q851Q412P601P584Q584R692J0293J0660J1022J1095
$$ 618272 626195 634143 642598 651449 659861 667462 675046 683630 693322 703615 714275 725297 736392
57236G36392J0855J0887J1533J2357J2775J2782J2718J2820J3231J3976J4732
$$ 736392 747247 758134 769667 782024 794799 807581 820299 833119 846350 860326 875058
57225H75058J5055J4996J5073J5530J6132J6788J7748J8927J9636J9437J8859
$$ 875058 890113 905109 920182 935712 951844 968632 986380 1005307 1024943 1044380 1063239
57214A063239J8805J9481K0253K0452K0059J9664J9792K0292K0499K0114J9645
$$ 1063239 1082044 1101525 1121778 1142230 1162289 1181953 1201745 1222037 1242536 1262650 1282295
57203A282295J9633J9800J9537J8981J8824J9155J9349J9160J9088J9368J9425
$$ 1282295 1301928 1321728 1341265 1360246 1379070 1398225 1417574 1436734 1455822 1475190 1494615
57192A494615J8762J7718J6859J6234J5717J5577J6080J6882J7357J7330J7086
$$ 1494615 1513377 1531095 1547954 1564188 1579905 1595482 1611562 1628444 1645801 1663131 1680217
57181A680217J6935J7100J7741J8757J9774K0644K1595K2667K3409K3523K3471
$$ 1680217 1697152 1714252 1731993 1750750 1770524 1791168 1812763 1835430 1858839 1882362 1905833
57170A905833K3888K4711K5206K4834K3766K2799K2854K4164K5711K5989K4706
$$ 1905833 1929721 1954432 1979638 2004472 2028238 2051037 2073891 2098055 2123766 2149755 2174461
57159B174461K3170K2590K2625K2257K1484K1180K1603K2088K2196K2270K2672
$$ 2174461 2197631 2220221 2242846 2265103 2286587 2307767 2329370 2351458 2373654 2395924 2418596
57148B418596K3234K3681K4029K4307K4359K4100K3597K2746K1329J9532J8029
$$ 2418596 2441830 2465511 2489540 2513847 2538206 2562306 2585903 2608649 2629978 2649510 2667539
57137B667539J7362J7429J7687J7568J6827J5829J5408J6021J7074J7617J7645
$$ 2667539 2684901 2702330 2720017 2737585 2754412 2770241 2785649 2801670 2818744 2836361 2854006
57126B854006J8086J9482K1450K3692K6683L0881L5797M0465M4491M8113N1614
$$ 2854006 2872092 2891574 2913024 2936716 2963399 2994280 3030077 3070542 3115033 3163146 3214760
57115C214760N5254N9527O4822P0949P7482Q4605R3186J04007J17353J33432J52802
$$ 3214760 3270014 3329541 3394363 3465312 3542794 3627399 3720585 3824592 3941945 4075377 4228179
57104D228179J76241K04398K37723K76656L21906L74589M35944N06723N87083
$$ 4228179 4404420 4608818 4846541 5123197 5445103 5819692 6255636 6762359 7349442
57095G349442O77302P78412Q91543J016498J150990J291037J431567J566511J688696
$$ 7349442 8026744 8805156 9696699 10713197 11864187 13155224 14586791 16153302 17841998
57086A7841998J789905J861201J893477J878185J807852J676128J478618J215617
$$ 17841998 19631903 21493104 23386581 25264766 27072618 28748746 30227364 31442981
57078C1442981Q95587N36081J60435k07776n49169q50543j105059j311384j471907
$$ 31442981 32338568 32874649 33035084 32827308 32278139 31427596 30322537 29011153 27539246
57069B7539246j590528j670870j715513j726193j704717j654017j578451j483305
$$ 27539246 25948718 24277848 22562335 20836142 19131425 17477408 15898957 14415652
57061A4415652j374223j257133j138031j022063r12703q11975p21202o41056n71106
$$ 14415652 13041429 11784296 10646265 9624202 8711499 7899524 7178322 6537266 5966160
57052E966160n10107m56929m10829l70750l35066l02447k72573k45593k21286
$$ 5966160 5456053 4999124 4588295 4217545 3882479 3580032 3307459 3061866 2840580
57043B840580j99138j78964j60835j44519j29518j15674j03253r2306q2283p2555
$$ 2840580 2641442 2462478 2301643 2157124 2027606 1911932 1808679 1716373 1634090 1561535
57033A561535o3041n4191m6300l8958l1059k1634j0814K58J1007K2717L7394N5217
$$ 1561535 1498494 1444303 1398003 1359045 1327986 1306352 1295538 1295796 1306803 1329520 1366914 1422131
57021A422131P3830R0281J02212J05917R4801O3150J3223m2787q9874j19789j33603
$$ 1422131 1495961 1586242 1688454 1794371 1889172 1952322 1965545 1922758 1832884 1713095 1579492
57010A579492j36460j32173j22719j10193r6977q4459p2918o2559n3657m5979
$$ 1579492 1443032 1310859 1188140 1077947 980970 896511 823593 761034 707377 661398
57000F61398l8958l2579k7275k3032j9444j6645j5236j5035j4783j3566j1796
$$ 661398 622440 589861 562586 539554 520110 503465 488229 473194 458411 444845 433049
56989D33049j0245q839p053m920k892j067O50J790J536k12k633m950p096r215
$$ 433049 422804 413965 406912 401992 399100 398033 398683 400473 402009 401797 399164 394214 387118 377903
56975C77903j1003j1852j1556j0643r918r669r336q142o066l850k025l58J445
$$ 377903 366900 355048 343492 332849 322931 313262 303926 295784 289718 285868 283843 283485 284930
56962B84930L052M057M886O402Q725J0974J2121J1661R544O101K040j995n921
$$ 284930 287982 292039 296925 303327 312052 323026 335147 346808 356352 362453 364493 362498 356577
56949C56577r794j2988j4508j4175j2850j1292r453p176m862k914j098R55L034
$$ 356577 346783 333795 319287 305112 292262 280970 271517 264341 259479 256565 255467 256422 259456
56936B59456M704O154Q046J0615J3287J5204J5777J4848J2522Q895L880k361q774
$$ 259456 264160 270314 278360 288975 302262 317466 333243 348091 360613 369508 373388 371027 362253
56923C62253j3774j6649j8159j9275j9779j8849j6645j4361j2700j1230r507p974
$$ 362253 348479 331830 313671 294396 274617 255768 239123 224762 212062 200832 191325 183351
56911A83351p242p092o783o035n149m385l730l132k571j956j335j021j172j275
$$ 183351 176109 169017 162234 156199 151050 146665 142935 139803 137232 135276 133941 132920 131748 130473
56897A30473n53J067K794L897M479N144O337Q095J0214J2319J4054J5359J6383
$$ 130473 129920 130987 133781 137678 142157 147301 153638 161733 171947 184266 198320 213679 230062
56884B30062J6973J6559J4798J2009Q722N164J676q71j812j688j624j705q43J489
$$ 230062 247035 263594 278392 290401 299123 304287 305963 305092 303280 301592 299968 298263 297420 298909
56870B98909M314O519Q390J1018J4673J8586K2129K5389K8568L1528L3958L5472
$$ 298909 303223 309742 318132 329150 343823 362409 384538 409927 438495 470023 503981 539453
56858E39453L5368L2768K7215J8977Q963j426j0573j7384k1740k3899k3674k0869
$$ 539453 574821 607589 634804 653781 662744 661318 650745 633361 611621 587722 564048 543179
56846E43179j6291j1465p127k702K504Q350J4396K0676K7350L4109M0500M6416
$$ 543179 526888 515423 508296 505594 508098 516448 530844 551520 578870 612979 653479 699895
56834F99895N1694N5406N6024N2178M3124K9015J1337p209k3945l7368m6958n2313
$$ 699895 751589 806995 863019 915197 958321 987336 998673 991464 967519 930151 883193 830880
56822H30880n3241n0508m5709m0083l3886k7016j9791j2856o525m67O004J3307
$$ 830880 777639 727131 681422 641339 607453 580437 560646 547790 541265 540798 546802 560109
56810E60109K1037K8086L3393L6546L7404L5461K9888K0340P505o967k0805l1785
$$ 560109 581146 609232 642625 679171 716575 752036 781924 802264 809769 802802 781997 750212
56798G50212l8767m2277m3597m3248m0795l6185l0522k5139k0367j5747j1077
$$ 750212 711445 669168 625571 582323 541528 505343 474821 449682 429315 413568 402491
56787D02491o591k325K012O439J0487J3753J6198J7647J7336J4430Q952J928n424
$$ 402491 395900 393575 395587 402026 412513 426266 442464 460111 477447 491877 500829 502757 497333
56774D97333j2348j8487k3460k6860k8578k8934k8366k7042k4873k1861j8425
$$ 497333 484985 466498 443038 416178 387600 358666 330300 303258 278385 256524 238099
56763B38099j5274j2922j1325j0066q856p710o697n789n030m633m654m758m594
$$ 238099 222825 209903 198578 188512 179656 171946 165249 159460 154430 149797 145143 140385 135791
56750A35791m272m140m128l762k879j950j536j628j812j759j410q87m47l57n85
$$ 135791 131519 127379 123251 119489 116610 114660 113124 111496 109684 107925 106515 105628 105181 104824 104239
56735A04239p39n50k51k70o96j245j569j402n68O98J630J545O68p9j46J63L58
$$ 104239 103500 102950 102699 102429 101733 100488 98919 97517 96949 97647 99277 100822 101490 101411 101265 101428 101786
56718A01786M45O94J029J097P78L24Kj29j29r7k17o19j100j225q50l68k47m48
$$ 101786 102231 102925 103954 105051 105829 106153 106155 106026 105897 105800 105583 104964 103864 102639 101789 101421 101174 100726
56700A00726n57m25l65o23j042j403j764k123k039j105K59J065R26M78M58Q39
$$ 100726 100169 99744 99379 98756 97714 96311 94547 92424 90385 89280 89539 90604 91530 92008 92466 93305
56684I3305J218J571K139K816L242L336L329L288L149L112L453M001M318M437
$$ 93305 94523 96094 98233 101049 104291 107627 110956 114244 117393 120505 123958 127959 132277 136714
56670A36714M741N000M395K796J279P02N43j13r92j138o74q06j995l258l704l708
$$ 136714 141455 146455 150850 153646 154925 155627 156170 156057 155065 153927 153253 152447 150452 147194 143490 139782
56654A39782l915m050l548k752k393k360k030j532j535j838j406j42N85k19j628
$$ 139782 135867 131817 128269 125517 123124 120764 118734 117202 115667 113829 112423 112281 112866 112647 111019
56639A11019k004j063J46R09J502K261K964L334L554L888M240M359M240M082M008
$$ 111019 109015 107952 108098 109007 110509 112770 115734 119068 122622 126510 130750 135109 139349 143431 147439
56624A47439L995L971L898L777L564L097K257J256N73M18M38J63m23j000j400
$$ 147439 151434 155405 159303 163080 166644 169741 171998 173254 173827 174245 174683 174846 174423 173423 172023
56609A72023j665j759j591j273j036r31q40p76p94p56m59k6J47j17n69p99n78
$$ 172023 170358 168599 167008 165735 164699 163768 162928 162152 161358 160602 160143 160117 160264 160147 159578 158779 158201
56592A58201l7L32J05m77o42j21L94K93PK46O79L71o05j067l88P20J390J714K161
$$ 158201 158164 158496 158601 158124 157482 157361 157755 158048 158055 158301 158980 159351 158746 157679 157291 158011 159401 161115 163276
56573A63276K615K633K170J600J293J485K166K858K981K668K703L406M195M574
$$ 163276 165891 168524 170694 172294 173587 175072 177238 180096 183077 185745 188448 191854 196049 200623
56559B00623M867N443N897N611M706L824L306L148L361L705L492K348R44L59Q17
$$ 200623 205490 210933 216830 222441 227147 230971 234277 237425 240786 244491 247983 250331 251275 251634 252451
56544B52451J572J839J325Q8j470k642k977k804k723k798k744k605k644k741k595
$$ 252451 254023 255862 257187 257275 255805 253163 250186 247382 244659 241861 239117 236512 233868 231127 228532
56529B28532k457k903l842m469m354l932l742l686l378k782k217j978k160k585
$$ 228532 226075 223172 219330 214861 210507 206575 202833 199147 195769 192987 190770 188792 186632 184047
56515A84047k823k524j810j100o02k53j34m56j016j176o56qN7l87o22k79J90J48
$$ 184047 181224 178700 176890 175790 175188 174935 174801 174345 173329 172153 171497 171489 171546 171159 170537 170258 170448 170596
56497A70596l61p23n89k99k80m14k36L42R36J214J129P50K55N4L85P46L76o45
$$ 170596 170235 169512 168923 168624 168344 167930 167694 168036 168972 170186 171315 172065 172320 172374 172759 173505 173881 173236
56479A73236j355j172m90J82Q57J445J355M09m68l28N55J201J294J248J329J500
$$ 173236 171881 170709 170219 170401 171258 172703 174058 174467 173999 173671 174226 175427 176721 177969 179298 180798
56463A80798J830K276K270J323j10j060j140n88M27J765K777K726J754O80kl39
$$ 180798 182628 184904 187174 188497 188387 187327 186187 185599 186026 187791 190568 193294 195048 195728 195726 195387
56447A95387l81j77j30m79o70r7P49Q52K57k8L68P19M65k08j043j909k217j356
$$ 195387 195006 194829 194699 194220 193550 193453 194202 195054 195311 195283 195651 196370 196835 196627 195584 193675 191458 190102
56429A90102O0O96N12R25K428L489K719Q45n52j209j836k445k376j603q09k92
$$ 190102 190162 190858 191370 192295 194723 198212 200931 201776 201224 200015 198179 195734 193358 191755 190946 190654
56413A90654R5J83m28j482k113j912j296q11o25o67p49m42O16K241L841N000N623
$$ 190654 190749 190932 190504 189022 186909 184997 183701 182890 182265 181598 180849 180407 181023 183264 187105 192105 197728
56396A97728N613M902L848L177L341M090M713M667L985L165K643K395K112J646
$$ 197728 203341 208243 212091 215268 218609 222699 227412 232079 236064 239229 241872 244267 246379 248025
56382B48025J072M63m4q2M91J009N14r92k461l212l743m733n909o408n902m753
$$ 248025 249097 249560 249516 249434 249925 250934 251448 250456 247995 244783 241040 236307 230398 223990 218088 213335
56366B13335l394k049q64J27J052J830K034J401K81o89j122q98o1R59J497J396
$$ 213335 209941 207892 207028 207155 208207 210037 212071 213472 213753 213064 211942 211044 210983 211942 213439 214835
56350B14835J276J641K095J893J021J72q2K90R87J597J809J787K063K732L086
$$ 214835 216111 217752 219847 221740 222761 222933 222851 223141 224128 225725 227534 229321 231384 234116 237202
56335B37202K491J392Q52J236J884K020J602J217J472K404L403L774L546L342
$$ 237202 239693 241085 241937 243173 245057 247077 248679 249896 251368 253772 257175 260949 264495 267837
56321B67837L352K949J726L94n4K80L80k47j074j517j659j774j655q90M24J588
$$ 267837 271189 274138 275864 276258 276204 276484 276864 276617 275543 274026 272367 270593 268938 268048 268472 270060
56305B70060J960J579J074J018J413J877K192K448K687K732K451J916J280P80
$$ 270060 272020 273599 274673 275691 277104 278981 281173 283621 286308 289040 291491 293407 294687 295467
56291B95467Q01J471K191K167J508J225J840K712L032K894K772K652K302K038
$$ 295467 296268 297739 299930 302097 303605 304830 306670 309382 312414 315308 318080 320732 323034 325072
56277C25072K369L108L548L417L093K947K945K980L142L626M551N814O959P436
$$ 325072 327441 330549 334097 337514 340607 343554 346499 349479 352621 356247 360798 366612 373571 381007
56263C81007P204O771O439N946N171M711N177O306P352Q081Q839R776J0634J1207
$$ 381007 388211 394982 401421 407367 412538 417249 422426 428732 436084 444165 453004 462780 473414 484621
56249D84621J1567J1876J2376J3434J5180J7107J8419J8742J8328J7767J7676
$$ 484621 496188 508064 520440 533874 549054 566161 584580 603322 621650 639417 657093
56238F57093J8318J9207J9372J8318J6460J4337J1912Q956N659K298j264n161
$$ 657093 675411 694618 713990 732308 748768 763105 775017 783973 789632 791930 790666 785505
56226G85505q931j1956j4202j5923j6999j7213j6919j6751j6779j6573j5909j4876
$$ 785505 776574 764618 750416 734493 717494 700281 683362 666611 649832 633259 617350 602474
56214F02474j3567j2197j1288j0995j0597r382p776o753o315n584m350l408l176
$$ 602474 588907 576710 565422 554427 543830 534448 526672 519919 513604 508020 503670 500262 497086
56201D97086k951k014o76L72J056J638J929J491N14j63m6M38O15N81J117K500
$$ 497086 494135 492121 491445 491817 492873 494511 496440 497931 498445 498282 498236 498674 499289 499870 500987 503487
56185E03487L823L992L099K280K141K114J572Q29O10J045J736K371K770K773K504
$$ 503487 507310 511302 514401 516681 518822 520936 522508 523337 523947 524992 526728 529099 531869 534642 537146
56170E37146K402K587K626K389K436L106L824M019M074M605N401N968O560P637
$$ 537146 539548 542135 544761 547150 549586 552692 556516 560535 564609 569214 574615 580583 587143 594780
56156E94780Q796R249R119R177R623J0142J0895J2244J3700J4328J4209J4337
$$ 594780 603576 612825 621944 631121 640744 650886 661781 674025 687725 702053 716262 730599
56144G30599J5119J6141J7457J9756K2920K5807K8018L0782L5342M1316M7454
$$ 730599 745718 761859 779316 799072 821992 847799 875817 906599 941941 983257 1030711
56133A030711N3359N9656O6799P4362Q1280Q6394Q8913Q8604Q5562P9834P1666
$$ 1030711 1084070 1143726 1210525 1284887 1366167 1452561 1541474 1630078 1715640 1795474 1867140
56122A867140O2082N2816M5422M0519L7495L4625K9903K2526J3550M690l266j0257
$$ 1867140 1929222 1982038 2027460 2067979 2105474 2140099 2170002 2192528 2206078 2210768 2207502 2197245
56110B197245j5932k0001k3445k8058l4596m2302n0418n8906o7243p3629p6309
$$ 2197245 2181313 2161312 2137867 2109809 2075213 2032911 1982493 1923587 1856344 1782715 1706406
56099A706406p5191p1532o6433o0213n3006m5344l8053l1687k6164k1070j6392
$$ 1706406 1631215 1559683 1493250 1433037 1380031 1334687 1296634 1264947 1238783 1217713 1201321
56088A201321j2618r880p451m631j737M06J722K908M356N807O979P912Q622R041
$$ 1201321 1188703 1178823 1171372 1166741 1165004 1165410 1167132 1170040 1174396 1180203 1187182 1195094 1203716 1212757
56074A212757R265R481R803J0534J2145J4451J6331J6990J7007J7407J8216J8923
$$ 1212757 1222022 1231503 1241306 1251840 1263985 1278436 1294767 1311757 1328764 1346171 1364387 1383310
56062A383310J9723K1103K2560K3111K2885K3009K3870K4769K5237K5551K5765
$$ 1383310 1403033 1424136 1446696 1469807 1492692 1515701 1539571 1564340 1589577 1615128 1640893
56051A640893K5418K4467K3619K3471K4082K5402K7395K9591L1305L2285L2716
$$ 1640893 1666311 1690778 1714397 1737868 1761950 1787352 1814747 1844338 1875643 1907928 1940644
56040A940644L2854L3184L4344L6226L7807L8674L9826M1926M3927M4809M5575
$$ 1940644 1973498 2006682 2041026 2077252 2115059 2153733 2193559 2235485 2279412 2324221 2369796
56029B369796M7716N0541N2217N2760N3753N5468N6667N7209N8502O1150O4244
$$ 2369796 2417512 2468053 2520270 2573030 2626783 2682251 2738918 2796127 2854629 2915779 2980023
56018B980023O7278P0788P4803P8601Q2219Q6427R0893R4420R7145J00613J05388
$$ 2980023 3047301 3118089 3192892 3271493 3353712 3440139 3531032 3625452 3722597 3823210 3928598
56007C928598J10531J15617J21237J27315J32996J38531J45327J53752J62796
$$ 3928598 4039129 4154746 4275983 4403298 4536294 4674825 4820152 4973904 5136700
55998E136700J71933J81483J91236K00889K11565K24559K38914K52786K66825
$$ 5136700 5308633 5490116 5681352 5882241 6093806 6318365 6557279 6810065 7076890
55989G076890K83330L02424L22379L43460L67763L95234M23738M53494M87568
$$ 7076890 7360220 7662644 7985023 8328483 8696246 9091480 9515218 9968712 10456280
55980A0456280N27322N71329O19418O73739P34970Q01818Q75354R59682J057342
$$ 10456280 10983602 11554931 12174349 12848088 13583058 14384876 15260230 16219912 17277254
55971A7277254J168301J294427J440482J609993J805175K031916K299617K615447
$$ 17277254 18445555 19739982 21180464 22790457 24595632 26627548 28927165 31542612
55963C1542612K984729L417776L929723M532968N237795O062012P031722Q170860
$$ 31542612 34527341 37945117 41874840 46407808 51645603 57707615 64739337 72910197
55955G2910197R498322J1034432J2795907J4780165J6964752J9313007K1736125
$$ 72910197 82408519 93442951 106238858 121019023 137983775 157296782 179032907
55948A79032907K4008231K5712974K6285012K5120996K1724093J5906497Q026235
$$ 179032907 203041138 228754112 255039124 280160120 301884213 317790710 325816945
55941C25816945r27598r593226j6750703k1738024k4506025k5391197k4865550
$$ 325816945 324889347 315296121 298545418 276807394 252301369 226910172 202044622
55934B02044622k3400311k1405237j9190373j6958844j4834291j2888395j1150442
$$ 202044622 178644311 157239074 138048701 121089857 106255566 93367171 82216729
55927H2216729r618512q280935p127542o143384n305480m592338l989488l482552
$$ 82216729 72598217 64317282 57189740 51046356 45740876 41148538 37159050 33676498
55919C3676498l052931k684581k368822k099060j866260j662723j485098j330590
$$ 33676498 30623567 27938986 25570164 23471104 21604844 19942121 18457023 17126433
55911A7126433j194448j073371r67147q74689p92400p18185o53048n96995n47147
$$ 17126433 15931985 14858614 13891467 13016778 12224378 11506193 10853145 10256150 9709003
55902I709003n01696m61816m27953l97778l69561l44080l21535k99911k78196
$$ 9709003 9207307 8745491 8317538 7919760 7550199 7206119 6884584 6584673 6306477
55893F306477k57975k40095k22804k04872j87534j71476j54879j36345j17167
$$ 6306477 6048502 5808407 5585603 5380731 5193197 5021721 4866842 4730497 4613330
55884D613330r8784q0422o1126m1794k3381n380J1882K5227L0733K6409J1749
$$ 4613330 4514546 4434124 4372998 4331204 4307823 4302443 4314325 4339552 4370285 4396694 4408443
55873D408443j3060m5628q0802j13460j40920j61850j74919j80075j79374j74840
$$ 4408443 4395383 4349755 4268953 4155493 4014573 3852723 3677804 3497729 3318355 3143515
55863C143515j66772j55388j42510j30127j18644j07854r8230q9886q1654p2781
$$ 3143515 2976743 2821355 2678845 2548718 2430074 2322220 2223990 2134104 2052450 1979669
55853A979669o4485n8336n4108n0449m6796m3422m0464l8013l6282l4905l2941
$$ 1979669 1915184 1856848 1802740 1752291 1705495 1662073 1621609 1583596 1547314 1512409 1479468
55842A479468l0377k8481k7858k7402k6122k4690k4034k3636k2548k1091k0225
$$ 1479468 1449091 1420610 1392752 1365350 1339228 1314538 1290504 1266868 1244320 1223229 1203004
55831A203004k0040j9995j9897j9654j8848j7525j6636j6712j6960j6573j6031
$$ 1203004 1182964 1162969 1143072 1123418 1104570 1087045 1070409 1053697 1036737 1020164 1004133
55820A004133j6074j6288j5933j5311j5162j5324j5084j4392j3645j2809j1635
$$ 1004133 988059 971771 955838 940527 925365 910041 894957 880565 866920 854111 842476
55809H42476j0303q982p365n435m063l937m446m500l875k962j894p95k49n04p58
$$ 842476 832173 823191 815826 810391 806328 802391 797945 793445 789570 786608 784714 783919 783670 783166 782408
55794G82408k41N96Q81P89J116J846K155J607M47j023k582l901m997o603r370
$$ 782408 782167 782763 783644 784433 785549 787395 789550 791157 791604 790581 787999 784098 779101 772498 763128
55779G63128j3023j6813k0227k2630k3001k1099j8333j6354j5223j3905j2103
$$ 763128 750105 733292 713065 690435 667434 646335 628002 611648 596425 582520 570417
55768E70417j0449r173p903o641n765n122m233l376l264l627l305k073j147j422
$$ 570417 559968 550795 542892 536251 530486 525364 521131 517755 514491 510864 507559 505486 504339 502917
55754E02917k250k625k718l360m659n922o727p336q037q652q835q457p621o430
$$ 502917 500667 498042 495324 491964 487305 481383 474656 467320 459283 450631 441796 433339 425718 419288
55740D19288m947l394k217j771j905k063j884j580j589k024k682l364l929m136
$$ 419288 414341 410947 408730 406959 405054 402991 401107 399527 397938 395914 393232 389868 385939 381803
55726C81803l771l021k484k703l629m580m831m260l489l200l487l935m143l898
$$ 381803 378032 375011 372527 369824 366195 361615 356784 352524 349035 345835 342348 338413 334270 330372
55712C30372l079j820o51l9J96N77J071J068K88p83j496j693j677j950k958m530
$$ 330372 327293 325473 324822 324783 324979 325556 326627 327695 327983 327200 325704 324011 322334 320384 317426 312896
55696C12896n617n289m099l627m443n370n129l948k969k662k585k221j443m07
$$ 312896 307279 301990 297891 294264 289821 284451 279322 275374 272405 269743 267158 264937 263494 263087
55682B63087M77P88O41O45J038J287R16J99m56j190k169k860k654j909j554j909
$$ 263087 263564 264352 264993 265638 266676 267963 268879 269078 268622 267432 265263 262403 259749 257840 256286 254377
55666B54377k512k986l330l420k935k041j506j853k661k915j995j79J626K588
$$ 254377 251865 248879 245549 242129 239194 237153 235647 233794 231133 228218 226223 226044 227670 230258
55652B30258K510J782R29L57L35R08J730K308K527K710L084L481L538K983J756
$$ 230258 232768 234550 235479 235836 236171 237079 238809 241117 243644 246354 249438 252919 256457 259440 261196
55637B61196J53j246k173l080m457n883o418n825m736l632k576j849j932k582
$$ 261196 261349 260103 257930 254850 250393 244510 238092 232267 227531 223899 221323 219474 217542 214960
55623B14960k915k644k296j956r92N39J391Q38k45p95j028j542k000j884j797
$$ 214960 212045 209401 207105 205149 204157 204696 206087 206925 206680 205885 204857 203315 201315 199431 197634
55608A97634k595l821m253l674k930k512k292k313k656k712j732j70P18O12L94
$$ 197634 195039 191218 186965 183291 180361 177849 175557 173244 170588 167876 166144 165974 166692 167304 167698
55593A67698N85P10M33L35R46J790J933J070k07r69o35M94J390J290M76j93k66
$$ 167698 168283 168993 169426 169761 170707 172497 174430 175500 175293 174324 173689 174183 175573 176863 177339 177146 176880
55576A76880K13J198K541L701M324M841N743O537O336N296M430M043L443K322
$$ 176880 177093 178291 180832 184533 188857 193698 199441 205978 212314 217610 222040 226083 229526 231848
55562B31848J267N15o35k613m573n424n234m948n095n375n290m684l775k990k682
$$ 231848 233115 233630 232995 230382 225809 220385 215151 210203 205108 199733 194443 189759 185984 182994 180312
55547A80312k783k887k751k536k440k335j981j398r55j049j654k104j675m88M43
$$ 180312 177529 174642 171891 169355 166915 164580 162599 161201 160246 159197 157543 155439 153764 153276 153719
55532A53719M21j08l35k26k48l18N1P17Q97K91n31j021j288j659k188k770l269
$$ 153719 154140 154032 153697 153471 153223 152905 152956 153673 154570 154861 154330 153309 152021 150362 148174 145404 142135
55515A42135l486l431l588m297m996m831l997l601m077m549m089k870j661q90
$$ 142135 138649 135218 131630 127333 122337 117506 113509 109908 105831 101282 97193 94323 92662 91772
55501I1772n45m92m40r0M23P31R91J794L030L623K912J624J036J573K740L889
$$ 91772 91227 90735 90295 90205 90628 91359 92350 94144 97174 100797 103709 105333 106369 107942 110682 114571
55485A14571M476M094K912J802J432J406Q66k24r46o30L33R16M83o85j713j932
$$ 114571 119047 123141 126053 127855 129287 130693 131559 131335 130389 129759 130092 131008 131491 130806 129093 127161
55469A27161j436q80q39j395k187k588k081q12L64P63O54P11R75R38N15J29j29
$$ 127161 125725 124845 124006 122611 120424 117836 115755 114943 115307 116070 116724 117435 118410 119348 119863 119992 119863
55452A19863n80j115j149o25j93j67j44N1J9k37k2P95J159L23r48j471j225q60
$$ 119863 119283 118168 117019 116394 116201 116034 115890 115941 115960 115723 115701 116496 117655 117978 117030 115559 114334 113474
55434A13474l87N36J514J813J514J247R54J36q97j124l08O03Q30N73K68o7l56
$$ 113474 113087 113623 115137 116950 118464 119711 120665 120801 119904 118780 118472 119075 119905 120478 120746 120679 120323
55417A20323j83N92J413J665J307O21j64p77q89n28j33k2j27m28j032j662j606
$$ 120323 120140 120732 122145 123810 125117 125738 125574 124797 123908 123380 123247 123225 123098 122670 121638 119976 118370
55400A18370o33M73P76K64l27n18m14k72j85j77k16j65k2j39q54j920k589k287
$$ 118370 117737 118210 118986 119250 118923 118405 117991 117719 117534 117357 117141 116976 116954 116815 115961 114041 111452 109165
55382A09165j043O68K207K934K513J274J4p18j030j260j450j440j289j193j090
$$ 109165 108122 108790 110997 113931 116444 117718 117732 117014 115984 114724 113274 111834 110545 109352 108262
55367A08262o61J23Q22J012P17J93m21j019j281r32j62M33M73J01k88m16k68n0
$$ 108262 107601 107724 108546 109558 110275 110468 110047 109028 107747 106815 106653 107086 107559 107660 107372 106956 106688 106638
55349A06638J2j8K44R39J543J392N90k8M1M41O57P31R41J156R55L06l44o12n70
$$ 106638 106650 106632 106876 107815 109358 110750 111340 111312 111353 111794 112451 113182 114123 115279 116234 116540 116196 115584 115014
55330A15014n73q69j304j372o84M33J087P54o6m51j35L12L41N0o4K77R17J467
$$ 115014 114441 113572 112268 110896 110212 110645 111732 112486 112420 111969 111834 112146 112487 112537 112473 112750 113667 115134
55312A15134J579J132L37l43m49R2Q48J186Q61K49j10j16q8k21l58l91n19r16
$$ 115134 116713 117845 118182 117839 117390 117482 118330 119516 120377 120626 120516 120400 120312 120091 119733 119342 118823 117907
55294A17907j340j349q47j99K24M37P53J252J484R58k4m33K46J140J001j00q44
$$ 117907 116567 115218 114371 114172 114396 114833 115586 116838 118322 119280 119256 118823 119069 120209 121210 121110 120266
55277A20266m98J70J44m16o66l80p2j01l39o07q16p56k99J46m5q70j572j450n69
$$ 120266 119768 119938 120082 119666 119000 118620 118548 118447 118108 117501 116685 115929 115630 115776 115731 114861 113289 111839 111270
55258A11270M34R84R81P61O84O48J65r29k053k452k015j164k31O75J316J390R56
$$ 111270 111704 112688 113669 114430 115114 115762 115927 114998 112945 110493 108478 107314 107083 107758 109074 110464 111420
55241A11420L98jj23K07R69J543J182J2r44r47k60M41Q57R67P03J04m56o05l65
$$ 111420 111818 111817 111694 111901 112870 114413 115595 115607 114663 113716 113456 113897 114754 115721 116424 116528 116072 115467 115102
55222A15102L1M56P82P46K85k65n60o51o74m77K4L95J49m77p76n15p8L54J033
$$ 115102 115133 115589 116371 117117 117402 117137 116577 115926 115252 114775 114799 115194 115343 114866 114090 113575 113497 113851 114884
55203A14884J817J898R03k34k40Q34J653J283J60p11r19o69j90L12M72O8n64q52
$$ 114884 116701 118599 119502 119268 119028 119862 121515 122798 122958 122247 121328 120659 120469 120781 121253 121321 120757 119905
55185A19905o86l91r1L93R80J187P53L9m69p07q41q71o98m43k78j91j31j79k59
$$ 119905 119219 118828 118737 119130 120110 121297 122050 122089 121620 120913 120072 119201 118503 118060 117782 117591 117460 117281 117022
55166A17022J17J265K617L113K453J468R89Q58M12k68l54N24J540J526L45j025
$$ 117022 117139 118404 121021 124134 126587 128055 129044 129902 130314 130046 129692 130216 131756 133282 133627 132602
55150A32602j693j735j677j606j162l44K86K96q2l10k15k0Q4J54L11N54P10N52
$$ 132602 130909 129174 127497 125891 124729 124385 124671 124967 124885 124575 124360 124340 124424 124578 124889 125443 126153 126705
55132A26705M7m78n94k58J27K33J13o4l04n20l62K84Q83P94J18m71o76q29j112
$$ 126705 126752 126274 125680 125422 125549 125782 125895 125831 125527 125007 124645 124929 125812 126606 126724 126253 125577 124748 123636
55113A23636j113m70M84J102J193J036P80L29k86q31j261j710j970j425N5J434
$$ 123636 122523 122053 122537 123639 124832 125868 126648 126977 126691 125860 124599 122889 120919 119494 119549 120983
55097A20983J467K82o22k09P99R75K9j000j211p24j00L57N29L11p7j42K68P22
$$ 120983 122450 122732 122110 121901 122700 123675 123704 122704 121493 120769 120669 121026 121555 121866 121789 121647 121915 122637
55079A22637R01J022J189R27k5r28q60m7L91J0n28o52o27p76p19k5Q83J232J011
$$ 122637 123538 124560 125749 126676 126651 125723 124863 124816 125207 125217 124689 124037 123410 122634 121915 121890 122773 124005 125016
55060A25016R12J174J136K17j139j856j425k82Q34J517J597R79q6p96m71N69J258
$$ 125016 125928 127102 128238 128455 127316 125460 124035 123753 124587 126104 127701 128680 128594 127798 127327 127896 129154
55043A29154J058N16L82O40P52M91M3m68r90j229q90k33J08p6l69m43m64o50q07
$$ 129154 130212 130728 131110 131750 132502 132993 133036 132568 131578 130349 129459 129226 129334 129258 128889 128446 127982 127332 126525
55024A26525o86m11k18J6N79J302J580J107L17m0L25J030J485J364O79l73j419
$$ 126525 125839 125428 125210 125226 125805 127107 128687 129794 130111 130071 130396 131426 132911 134275 134954 134581 133162
55007A33162j978j775j000j73K83K36k22p30o72L15J740K584K382J658J104Q04
$$ 133162 131184 129409 128409 128236 128519 128755 128533 127803 127131 127446 129186 131770 134152 135810 136914 137718
54991A37718N46M13N88Q20O99K87L0N1K2l07p36q85n69N7N58N67K60J99M82M85
$$ 137718 138264 138677 139265 140085 140784 141071 141101 141152 141174 140867 140131 139246 138677 138734 139292 139859 140119 140318 140800 141285
54971A41285j35o61k88N04M84m23r02j62Q76Q79n2o64k79M81O74K45j7N61J659
$$ 141285 141150 140489 140201 140705 141189 140766 139864 139702 140578 141457 141405 140741 140462 140943 141617 141862 141845 142406 144065
54952A44065K227J648M92j41N6M04L02j8q4P4P5k20o72j133j423j211l31P74J283
$$ 144065 146292 147940 148432 148291 148347 148751 149053 149035 148951 149025 149100 148880 148208 147075 145652 144441 144110 144884 146167
54933A46167P83k73r21n69M57J278J481J571K186L074L460L206L071L655M689
$$ 146167 146950 146677 145756 145187 145644 146922 148403 149974 152160 155234 158694 161900 164971 168626 173315
54918A73315N647O464P257P793P708P020O044N007L992L056K067O80j215l251
$$ 173315 178962 185426 192683 200476 208184 215204 221248 226255 230247 233303 235370 236050 234835 231584
54904B31584n026o495p655q203p941p215o515n797m711l353k260j736j571j477
$$ 231584 226558 220063 212408 204205 196264 189049 182534 176737 172026 168673 166413 164677 163106 161629
54890A61629j322r89l70L35P02O33O01J127K146K986L019K330J750K070L205M273
$$ 161629 160307 159318 158948 159283 159985 160618 161219 162346 164492 167478 170497 172827 174577 176647 179852 184125
54874A84125M603M453M585N400O602P495P366N935L771J921Q24j73j774l652m999
$$ 184125 188728 193181 197766 203166 209768 217263 224629 230564 234335 236256 237080 236907 235133 231481 226482
54859B26482n814o757p794p982o860n227m056l395k942k995l962n190n301l846
$$ 226482 220668 213911 206117 198135 191275 186048 181992 178597 175655 172660 168698 163508 158207 154361
54845A54361j884o75l26j16K64L77k25j308k122k087j268l93l11j186k184k203
$$ 154361 152477 151802 151476 151360 151624 152001 151776 150468 148346 146259 144991 144598 144287 143101 140917 138714
54829A38714j016M95J386J658J947K401K361J315k47j263j235o33j94j15r9N2
$$ 138714 137698 138193 139579 141237 143184 145585 147946 149261 149014 147751 146516 145883 145689 145574 145475 145527
54813A45527J70N9j27r0J48K23p4m50m66o6M18O57N57J12n85j203j250n22N47
$$ 145527 145697 145756 145629 145539 145687 145910 145836 145386 144920 144854 145272 145929 146486 146598 146013 144810 143560 143038 143585
54794A43585J194J007L23j02R9M92M49N6N6P27J339J152N17L78Q43J077N68j64
$$ 143585 144779 145786 146109 146007 146106 146598 147047 147103 147159 147886 149225 150377 150894 151272 152115 153192 153760 153596
54776A53596l95k9O80J704K963L958M176L747L274L209L615M343N111N636N867
$$ 153596 153201 153172 153852 155556 158519 162477 166653 170400 173674 176883 180498 184841 189952 195588 201455
54761B01455O055O347O623O768O742O217M641K094m25k049l066m303n875p195
$$ 201455 207510 213857 220480 227248 233990 240207 244848 246942 246517 244468 241402 237099 231224 224029
54747B24029p898q066p603o272m419k953k297j977j419o72p7K33K18k78j216k110
$$ 224029 216131 208065 200462 194190 189771 186818 184521 182544 181125 180453 180376 180609 180827 180549 179333 177223
54731A77223k406j957r72J74R80J102Q96J253K510L844M251L826L588M170N287
$$ 177223 174817 172860 171888 172062 173042 174144 175040 176293 178803 182647 186898 190724 194312 198482 203769
54716B03769O390P186P373O587M941L126J511m05l092n889p501p612p192p069
$$ 203769 210159 217345 224718 231305 236246 239372 240883 240478 237386 231497 223996 216384 209192 202123
54702B02123o956o265n234m524m147l524k483j459p35j92O8l88j503k375k181
$$ 202123 195167 188902 183668 179144 174997 171473 168990 167531 166796 166604 166672 166284 164781 162406 160225
54687A60225j083O9N81K38p18j565j515o43nl51j107j197n66j21l59q16r44p95
$$ 160225 159142 159211 159792 160030 159312 157747 156232 155589 155584 155233 154126 152929 152363 152242 151883 151067 150123 149328
54669A49328o23m09n0L58O75Q45P51K86l16n90m20j91k28m32o45r04j105p57L93
$$ 149328 148705 148296 148246 148604 149279 150124 150875 151161 150845 150255 149835 149644 149416 148984 148339 147435 146330 145573 145966
54650A45966J734K205J417O2q59j003q00p21o39n9J066K015K014J114R4m24m30
$$ 145966 147700 149905 151322 151384 150525 149522 148722 148001 147362 147303 148369 150384 152398 153512 153606 153182 152752
54633A52752j97P3J80j01o76j090j057q25p56p66n30q2J87J47J59N08Q73O55j84
$$ 152752 152555 152628 152808 152707 152031 150941 149884 149059 148303 147537 147007 146925 147112 147259 147418 147926 148799 149454 149270
54614A49270r37r09k34L16L05J50M69J203J656J426Q86O32P24P32M46K08M02Q41
$$ 149270 148333 147424 147190 147506 147811 147961 148430 149633 151289 152715 153601 154233 154957 155689 156135 156343 156745 157586
54596A57586R06L45l51n80m46n57j032j208n52M49Q33M32R1M95J229J330N71k44
$$ 157586 158492 158837 158486 157906 157460 156903 155871 154663 154111 154560 155393 155825 155916 156411 157640 158970 159541 159297
54578A59297l10J89M35J51o7K97R04J082Q12O05O07M93K02Q6K00J68j3J36N48
$$ 159297 158987 159176 159611 159762 159695 159992 160896 161978 162790 163395 164002 164495 164697 164783 164983 165151 165138 165274 165822
54559A65822L73o14j224m59Q50J081J42n99m46p8j5K10Q40J069K59q61j146n91
$$ 165822 166195 165581 164357 163898 164748 165829 165971 165372 164926 164848 164833 165043 165883 166952 167211 166350 165204 164613
54541A64613j36k39m29j11Q15K035L036L301K673J576O14L3j99l0N53J196J344
$$ 164613 164477 164238 163809 163698 164513 166548 169584 172885 175558 177134 177748 177781 177582 177552 178105 179301 180645
54524A80645Q31Q9k99j38K38K70k73j014j299q25J11R55J282R31J14o40r37r38
$$ 180645 181476 181565 181266 181128 181366 181636 181363 180349 179050 178225 178336 179291 180573 181504 181618 180978 180041 179103
54506A79103r73q74k39O56R32L82r9K24Q44Q11O6o71r46p44M0J426K669K692J376
$$ 179103 178130 177256 177017 177673 178605 178987 178888 179112 179956 180767 180833 180162 179216 178472 178512 179938 182607 185299 186675
54487A86675j54q60q11o55o40o02n55o54p23l55L77Q06N37J51N76J780K618K205
$$ 186675 186521 185661 184850 184195 183555 182953 182398 181744 181021 180666 181043 181849 182386 182537 183113 184893 187511 189716
54469A89716J090N36R44J563J747J735J907J924J237N5p70p62k31K83N51N59L69
$$ 189716 190806 191342 192286 193849 195596 197331 199238 201162 202399 202454 201684 200922 200691 200974 201525 202084 202453
54452B02453K02L93J015J663J767J119O9q16j273j417j453j411j371j567j992
$$ 202453 202655 203048 204063 205726 207493 208612 208681 207865 206592 205175 203722 202311 200940 199373 197381
54437A97381k066j266j5O41L32k44m76o30j100j520j324p08l21k28P0O89J165
$$ 197381 195315 194049 194034 194675 195007 194763 194287 193657 192557 191037 189713 189005 188684 188456 188526 189215 190380
54420A90380J165Q08K91k83o17l66L37R43J132R70M76l67j167j341r81q43j230
$$ 190380 191545 192353 192644 192361 191744 191378 191715 192658 193790 194760 195236 194869 193702 192361 191380 190537 189307
54403A89307j501j099l64J25M84J073J569J424J021J429K740L591K785Q44o86
$$ 189307 187806 186707 186343 186468 186952 188025 189594 191018 192039 193468 196208 199799 202584 203428 202742
54388B02742j094r78j017j047o20J30O51P25N99M74K94M7j58l34n87p50m68J21
$$ 202742 201648 200670 199653 198606 197986 198116 198767 199492 200091 200565 200859 200906 200748 200414 199827 199077 198609 198730
54370A98730L08k51q88o82K95J104J150P19L08K6j33l8K35K49j40l54J21P87O32
$$ 198730 199038 198787 197899 197217 197512 198616 199766 200485 200793 200819 200686 200648 200883 201132 200992 200638 200759 201546 202178
54351B02178m87j603j960j853j854j854j451q93q45j329j679j528j184q29j75
$$ 202178 201691 200088 198128 196275 194421 192567 191116 190223 189378 188049 186370 184842 183658 182829 182654
54336A82654P51J170M75q22j699j806j490r87l42J35P9k66k83Q5K94P9k18k80
$$ 182654 183405 184575 185050 184228 182529 180723 179233 178246 177904 178039 178118 177852 177569 177654 177948 178027 177809 177529
54318A77529j03L25R06J016O6j301j562k82J174J460R20P53J217J596J480J148
$$ 177529 177426 177751 178657 179673 179739 178438 176876 176594 177768 179228 180148 180901 182118 183714 185194 186342
54302A86342Q64N71J82l60j093j706j516l57Q55J110N06j27m95q68j196j070n88
$$ 186342 187206 187777 187959 187599 186506 184800 183284 182927 183782 184892 185398 185271 184776 183908 182712 181642 181054
54285A81054l43n04o00l45RJ98K57J50k67q38j115r38n07K0M91M52l78j316j278
$$ 181054 180711 180207 179607 179262 179271 179469 179726 179876 179609 178771 177656 176718 176211 176231 176722 177174 176796 175480 174202
54266A74202k62M99K21m27m26J81O05N37L48L53N01O76Q66R83Q61M94R1j21j67
$$ 174202 173940 174439 174660 174233 173807 173988 174593 175130 175478 175831 176332 177008 177874 178857 179718 180212 180303 180182 180015
54247A80015l09p73j374j604j186l82L65Q32Q45K08p89j203m99N07N62l12q91
$$ 180015 179706 178933 177559 175955 174769 174387 174752 175584 176429 176637 175848 174645 174146 174653 175215 174903 174012
54230A74012m93K70N95M86L06J24q4j31M4J63M3k01n08r01j079n97L52R59Q60
$$ 174012 173519 173789 174384 174870 175176 175300 175216 175085 175129 175292 175335 175134 174626 173725 172646 172049 172401 173360 174220
54211A74220N25L66K41P7K37P37R18M25j87k98r2L0Q4M1n55j708k396j797n59
$$ 174220 174745 175111 175352 175429 175666 176403 177321 177746 177559 177261 177169 177199 177283 177324 176769 175061 172665 170868 170309
54192A70309O3q4j66J89N59O77P54Q58P67M64J37k86q82j176n90N43J163P61j61
$$ 170309 170372 170288 170122 170311 170870 171547 172301 173159 173926 174390 174527 174241 173359 172183 171593 172136 173299 174060 173899
54173A73899r50j418j522j144m24J74L94L79K49q6n15n97o9P51J165O40p26k058
$$ 173899 172949 171531 170009 168865 168441 168615 169009 169388 169637 169551 169036 168439 168370 169121 170286 170926 170200 168142
54155A68142k261j115L14Q41N14L15O64R38N16l55r61r28m23J11K88N9k50l85
$$ 168142 165881 164766 165080 165921 166435 166750 167414 168352 168868 168513 167552 166624 166201 166312 166600 166659 166409 166024
54137A66024m64o25n91q8N66Q46Q05Q50Q92M70l04o60k76K95M78L77L55M74O19
$$ 166024 165560 164935 164344 164256 164822 165668 166473 167323 168215 168685 168381 167721 167445 167740 168218 168595 168950 169424 170043
54118A70043P80Q43N70%m56m70n3O60J521K170K261J905J533J260R32P36R66J206
$$ 170043 170823 171666 172236 172236 171780 171310 171257 171917 173438 175608 177869 179774 181307 182567 183499 184235 185201 186407
54100A86407O31o49j428j054l76m61j155j632j669j572j286n48K92N44J71j40
$$ 186407 187038 186389 184961 183907 183531 183070 181915 180283 178614 177042 175756 175208 175500 176044 176215 176075
54084A76075oK72L74M77Q45J287J351Q77K09j38NL22M59N24Q09J171J144P42N27
$$ 176075 176069 176341 176715 177192 178037 179324 180675 181552 181761 181623 181628 181950 182409 182933 183742 184913 186057 186799 187326
54065A87326O86O46L1o18o42k39n4k11l86n40p80q07k60M80O46K43K2K85M79K06
$$ 187326 188012 188658 188689 188071 187429 187190 187136 186925 186539 185999 185219 184412 184152 184632 185278 185521 185543 185828 186307 186513
54045A86513r6R9O23R85J092J187J362J522J656J824K032K296K713L236L584L517
$$ 186513 186417 186516 187139 188124 189216 190403 191765 193287 194943 196767 198799 201095 203808 207044 210628 214145
54029B14145L111K580K020J463J059R98J280J667J848J673J311J150J357J560
$$ 214145 217256 219836 221856 223319 224378 225376 226656 228323 230171 231844 233155 234305 235662 237222
54015B37222J164L5j257j931j646p06J97M49j12j159k200k879k989k473j611r71
$$ 237222 238386 238421 237164 235233 233587 232881 233078 233527 233415 232256 230056 227177 224188 221715 220104 219133
53999B19133q57r72r65j049j584k265k355j738j120j052j329j584j797j960j842
$$ 219133 218276 217304 216339 215290 213706 211441 209086 207348 206228 205176 203847 202263 200466 198506 196664
53984A96664j458j248j342j207n25P6n7m68k31N42P94J33o46q68p95p58l48P51
$$ 196664 195206 193958 192616 191409 190884 190960 190903 190435 190204 190746 191540 191673 191027 190159 189364 188606 188258 189009
53966A89009J783J687O11k29j56L27N87P87J313J899J966J556J327J553J743J354
$$ 189009 190792 192479 193090 192861 192705 193032 193619 194406 195719 197618 199584 201140 202467 204020 205763 207117
53950B07117N74Qj39j63k27l1P11J736K434K514K211J957J986K258K529K508K165
$$ 207117 207691 207699 207560 207397 207170 207139 207850 209586 212020 214534 216745 218702 220688 222946 225475 227983 230148
53933B30148J896K153K861L444L540L365L218K958K348J626J236J121Q07K83J45
$$ 230148 232044 234197 237058 240502 244042 247407 250625 253583 255931 257557 258793 259914 260721 261004 261149
53918B61149O72J233J091M68K74R90K178L130L533L502L351L411L738L912L422
$$ 261149 261821 263054 264145 264613 264887 265877 268055 271185 274718 278220 281571 284982 288720 292632 296054
53903B96054K322J167K41p02j752k348j997j096n44o70j094j550k191k973l430
$$ 296054 298376 299543 299784 299082 297330 294982 292985 291889 291345 290675 289581 288031 285840 282867 279437
53888B79437l424l485l946m153l366k082j646k433l288l107k226j675j670j663
$$ 279437 276013 272528 268582 264429 261063 258981 257335 254902 251614 248507 246281 244606 242936 241273
53874B41273j497j551j780j522o36m5n87j817k547k344j908k026k623k932k401
$$ 241273 239776 238225 236445 234923 234287 234242 233655 231838 229291 226947 225039 223013 220390 217458 215057
53859B15057j259l78l97j025j348r31k32J81M13Q55J413J655J492J172Q04M51
$$ 215057 213798 213420 213023 211998 210650 209719 209487 209668 210081 210936 212349 214004 215496 216668 217472 217923
53843B17923M36R18J278P51l80j048r85j064j743k168j445l1R17J049Q76P16M27
$$ 217923 218359 219277 220555 221306 220926 219878 218893 217829 216086 213918 212473 212442 213359 214408 215284 216000 216427
53826B16427M5r5O3K19K25K01K13K37L58N18K65o60j588j476k29J106J632J451
$$ 216427 216472 216377 216440 216659 216884 217085 217298 217535 217893 218411 218676 218016 216428 214952 214723 215829 217461 218912
53808B18912J113Q62P31Q56J267J702J943K128K452K854L189L423L493L276K910
$$ 218912 220025 220887 221618 222474 223741 225443 227386 229514 231966 234820 238009 241432 244925 248201 251111
53793B51111K818L149L519L474L018K449K024J976K437L085L234K676K013J832
$$ 251111 253929 257078 260597 264071 267089 269538 271562 273538 275975 279060 282294 284970 286983 288815
53779B88815J935J901J946K543L483M104M386M961N991O868P347Q177J0092J2672
$$ 288815 290750 292651 294597 297140 300623 304727 309113 314074 320065 326933 334280 342457 352549 365221
53765C65221J4793J5870J6018J5235J3072R224L974k021q024j3224j6829j8483
$$ 365221 380014 395884 411902 427137 440209 449433 453407 451386 443362 430138 413309 394826
53753C94826j8515j7563j6079j4261j2332j0581r120p812o526n352m427l705l050
$$ 394826 376311 358748 342669 328408 316076 305495 296375 288563 282037 276685 272258 268553 265503
53740B65503k545k393k472k220j236J42J103J216Q16M77L96L66K30P1P4K76N38
$$ 265503 262958 260565 258093 255873 254637 254779 255882 257098 257914 258391 258787 259153 259383 259454 259528 259804 260342
53723B60342O35M70J81J1Ro4l69o62m71K99J173J593J535J474J738K092K050J566
$$ 260342 260977 261447 261628 261639 261648 261584 261215 260553 260082 260381 261554 263147 264682 266156 267894 269986 272036 273602
53705B73602J174J369J985K380K167J575J090R40J081J430J913K353K591K680
$$ 273602 274776 276145 278130 280510 282677 284252 285342 286282 287363 288793 290706 293059 295650 298330
53691B98330K742K641K060R77j61q85j140j147j006o82k19K98Q46J303J297O01
$$ 298330 301072 303713 305773 306750 306589 305704 304564 303417 302411 301729 301510 301808 302654 303957 305254 305855
53675C05855l96r83r90q88r43p73j04N69O26L38M79J008R62j05j284j442p29l09
$$ 305855 305459 304476 303486 302598 301655 300882 300778 301347 301973 302311 302790 303798 304760 304655 303371 301929 301200 300891
53657C00891q17j750k291k230j853j390q92m00K0L54O08P61Q30Q44P36M39Q1l4
$$ 300891 300074 298324 296033 293803 291950 290560 289668 289268 289288 289642 290250 291011 291841 292685 293421 293860 293941 293907
53639B93907K00O39J225K075L061L582L188K256J638J678J926J818J259N81K61
$$ 293907 294107 294746 295971 298046 301107 304689 307877 310133 311771 313449 315375 317193 318452 319033 319294
53624C19294P22J932L091L251K521K157L027M406M896M232L415L221L352L212
$$ 319294 320016 321948 325039 328290 330811 332968 335995 340401 345297 349529 352944 356165 359517 362729
53610C62729K802K485K434K691L331M105M287L412J969R69Q53J230J536J558J326
$$ 362729 365531 368016 370450 373141 376472 380577 384864 388276 390245 391214 392067 393297 394833 396391 397717
53595C97717R04M16kk61k64J16P09R37L48p91j747k118k023j714j353j121j045
$$ 397717 398621 399037 399035 398774 398510 398626 399335 400272 400620 399829 398082 395964 393941 392227 390874 389753 388708
53578C88708q23l30j38q76k077k471j667o33j65J98J082J942J901J387J757L336
$$ 388708 387885 387555 387417 386541 384464 381993 380326 379693 379528 379726 380808 382750 384651 386038 387795 391131
53562C91131M997N781O051O617P560Q403Q931R285R617J0044J0695J1384J1484
$$ 391131 396128 401909 407960 414577 422137 430540 439471 448756 458373 468417 479112 490496 501980
53549E01980J0385Q034M844J375j763l998n125n457n413n101m427l372j978k80
$$ 501980 512365 520399 525243 526618 524855 520857 515732 510275 504862 499761 495334 491962 489984 489704
53535D89704J558L240M686O122P631Q928R826J0634J1694J2776J3430J3734J4199
$$ 489704 491262 494502 499188 505310 512941 521869 531695 542329 554023 566799 580229 593963 608162
53522F08162J4965J5618J5924J6355J7615J9794K2206K3989K4853K5260K5846
$$ 608162 623127 638745 654669 671024 688639 708433 730639 754628 779481 804741 830587
53511H30587K6733K7591K8243K8824K9207K8888K7832K6904K6784K6915K6268
$$ 830587 857320 884911 913154 941978 971185 1000073 1027905 1054809 1081593 1108508 1134776
53500A134776K4966K4156K4293K4573K4316K3975K4185K4599K4438K3756K3314
$$ 1134776 1159742 1183898 1208191 1232764 1257080 1281055 1305240 1329839 1354277 1378033 1401347
53489A401347K3389K3381K2635K1174J9523J8083J6821J5393J3617J1789J0322
$$ 1401347 1424736 1448117 1470752 1491926 1511449 1529532 1546353 1561746 1575363 1587152 1597474
53478A597474R134P706N862M034K543J077p95l034n459q183j1238j4130j6334
$$ 1597474 1606608 1614314 1620176 1624210 1626753 1627830 1627035 1624001 1618542 1610359 1599121 1584991 1568657
53465A568657j7933j9228k0136k0607k1283k2875k5076k6886k7895k8454k8621
$$ 1568657 1550724 1531496 1511360 1490753 1469470 1446595 1421519 1394633 1366738 1338284 1309663
53454A309663k8015k6766k5668k5098k4565k3688k2780k2077k1225k0020j8850
$$ 1309663 1281648 1254882 1229214 1204116 1179551 1155863 1133083 1111006 1089781 1069761 1050911
53443A050911j7889j6555j4494j2434j1223j0541r385p464n317l343j487L39K294
$$ 1050911 1033022 1016467 1001973 989539 978316 967775 958390 950926 945609 942266 940779 941118 943412
53430I43412M828Q075J1188J3160J4190J5421J7344J9343K0924K2473K4442K6608
$$ 943412 948240 956315 967503 980663 994853 1010274 1027618 1046961 1067885 1090358 1114800 1141408
53418A141408K8545L0266L1935L3481L4871L6305L7844L9253M0584M2420M5117
$$ 1141408 1169953 1200219 1232154 1265635 1300506 1336811 1374655 1413908 1454492 1496912 1542029
53407A542029M8171N0765N2680N4253N5756N7305N9098O1352O3953O6491O8525
$$ 1542029 1590200 1640965 1693645 1747898 1803654 1860959 1920057 1981409 2045362 2111853 2180378
53396B180378O9699O9827O9139O8245O7531O6791O5617O3970O2022N9772N7133
$$ 2180378 2250077 2319904 2389043 2457288 2524819 2591610 2657227 2721197 2783219 2842991 2900124
53385B900124N4190N0998M7266M2691L7528L2397K7560K2676J7285J1299N046
$$ 2900124 2954314 3005312 3052578 3095269 3132797 3165194 3192754 3215430 3232715 3244014 3249060
53374C249060q89n974j0244j4448j9388k5156l1231l7212m3072m8769n4115n9076
$$ 3249060 3248171 3242197 3231953 3217505 3198117 3172961 3141730 3104518 3061446 3012677 2958562 2899486
53362B899486o3841o8426p2520p5826p8174p9278p8829p7068p4944p3287p1993
$$ 2899486 2835645 2767219 2694699 2618873 2540699 2461421 2382592 2305524 2230580 2157293 2085300
53351B085300p0340o7994o5361o2988o0945n8933n6812n4746n2901n1153m9271
$$ 2085300 2014960 1946966 1881605 1818617 1757672 1698739 1641927 1587181 1534280 1483127 1433856
53340A433856m7176m4915m2413l9596l6717l4231l2146k9873k6935k3598k0494
$$ 1433856 1386680 1341765 1299352 1259756 1223039 1188808 1156662 1126789 1099854 1076256 1055762
53329A055762j7868j5587j3616j2001j0479q622o401m175k079L5K060L575M561
$$ 1055762 1037894 1022307 1008691 996690 986211 977589 971188 967013 964934 964969 967029 970604 975165
53316I75165N583O919Q046Q446Q586R536J1705J4483J7066J9232K1145K2826K4033
$$ 975165 980748 987667 995713 1004159 1012745 1022281 1033986 1048469 1065535 1084767 1105912 1128738 1152771
53303A152771K4671K5156K6209K8170L0617L2795L4365L5479L6238L6491L6299
$$ 1152771 1177442 1202598 1228807 1256977 1287594 1320389 1354754 1390233 1426471 1462962 1499261
53292A499261L6056L5886L5329L3982L2052K9913K7468K4457K1160J8160J5483
$$ 1499261 1535317 1571203 1606532 1640514 1672566 1702479 1729947 1754404 1775564 1793724 1809207
53281A809207J2587R210N692K396p09l759o754r755j2915j6004j8384j9827k1075
$$ 1809207 1821794 1831004 1836696 1839092 1838383 1834624 1827870 1818115 1805200 1789196 1770812 1750985 1729910
53268A729910k3180k6298k9535l1943l3426l4609l6070l7848l9615m1121m2291
$$ 1729910 1706730 1680432 1650897 1618954 1585528 1550919 1514849 1477001 1437386 1396265 1353974
53257A353974m3068m3388m3441m3635m4059m4144m3209m1298l9132l7226l5465
$$ 1353974 1310906 1267518 1224077 1180442 1136383 1092239 1049030 1007732 968600 931374 895909
53246H95909l3615l1873l0579k9703k8932k8124k7328k6415k5071k3265k1491
$$ 895909 862294 830421 799842 770139 741207 713083 685755 659340 634269 611004 589513
53235E89513k0294j9597j8706j7078j4974j3239j2341j1894j1143r893q686q130
$$ 589513 569219 549622 530916 513838 498864 485625 473284 461390 450247 440354 431668 423538
53223D23538q190q222p634o486n411m964n031n031m669m221m005l924l736l516
$$ 423538 415348 407126 399492 393006 387595 382631 377600 372569 367900 363679 359674 355750 352014 348498
53209C48498l429l369l160k923k801k535j883j290j441k194k699k676k755l304
$$ 348498 345069 341700 338540 335617 332816 330281 328398 327108 325667 323473 320774 318098 315343 312039
53195C12039l753l537k991k650k301j533p63q26j714k590k956l068l095k712j834
$$ 312039 308286 304749 301758 299108 296807 295274 294511 293685 291971 289381 286425 283357 280262 277550 275716
53180B75716j139j305k057k407j810q07l91q65j504j457q14m23o52q77m97J01
$$ 275716 274577 273272 271215 268808 266998 266191 265800 264935 263431 261974 261160 260737 260085 259208 258711 258812
53164B58812J49k67l40K49Q78Q75L38r2K5N25P40J50q86j294o60N4k62j186j277
$$ 258812 258961 258694 258354 258603 259481 260356 260694 260602 260627 261152 261892 262042 261156 259862 259202 259256 258994 257808 256531
53145B56531j03J240J733J533J130M63n43j391j606j339q46KJ088J661J313P37
$$ 256531 256428 257668 259401 260934 262064 262527 261984 260593 258987 257648 256802 256804 257892 259553 260866 261603
53129B61603P54J057R05N11O57J202J194M53o0K44P99R60R79J321J680J428O20
$$ 261603 262357 263414 264319 264830 265487 266689 267883 268336 268276 268520 269319 270279 271258 272579 274259 275687 276307
53112B76307k9j7M67Q82Q39L81o9j38O3J47Q5K01M64K96n88j563j749j101m43
$$ 276307 276278 276261 276728 277610 278449 278830 278761 278623 278686 278833 278918 279119 279583 279879 279291 277728 275979 274878 274435
53093B74435n21j319k197k456j846p89q8j91p47j053q03k89R4K78L76L62L2o23
$$ 274435 273914 272595 270398 267942 266096 265307 265219 265028 264281 263228 262425 262136 262230 262508 262884 263246 263278 262655
53075B62655j170j060l13K81j4r88j726j770j604j839k318k420j921j217p33n19
$$ 262655 261485 260425 260112 260393 260379 259391 257665 255895 254291 252452 250134 247714 245793 244576 243843 243324
53059B43324m73o47j221k181l105l356k630j391n20m41p25o77j10O64J291J601
$$ 243324 242851 242204 240983 238802 235697 232341 229711 228320 227800 227359 226634 225957 225847 226511 227802 229403
53043B29403J461Q34j2o18p47n95n43p71j152j417j400j098n36K59J010J092J62
$$ 229403 230864 231698 231686 231068 230321 229726 229183 228412 227260 225843 224443 223345 222809 223068 224078 225170 225332
53026B25332j164j701j003Q6N05J65k02q8L98R20J190R88L93n6J39P69J107P68
$$ 225332 224168 222467 221464 221550 222055 222220 222018 221930 222328 223248 224438 225426 225819 225763 225902 226671 227778 228546
53008B28546N9m58m17J76R06J224J135J267J802J815N12j216j652o68P7m01j098
$$ 228546 228605 228147 227730 227906 228812 230036 231171 232438 234240 236055 236567 235351 233699 233031 233108 232707 231609
52991B31609q45j37q9n54o33k98j69j18M64J151P99n16j287o75M13Q68Q08P83
$$ 231609 230764 230627 230538 229984 229351 229053 228884 228766 229230 230381 231180 230664 229377 228702 229115 229983 230791 231574
52973B31574O21J1n72n09p8N7mL31R75J201P82K59O2P8J78M58P90P35J48n73j051
$$ 231574 232195 232206 231634 231125 231047 231104 231100 231431 232406 233607 234389 234648 234710 234788 234966 235424 236214 236949 237097 236524 235473
52952B35473j380j729j879j475o01J84M02Q7l24n71q77j479k012j793q55r5j25
$$ 235473 234093 232364 230485 229010 228409 228593 228995 229082 228758 228187 227310 225831 223819 222026 221171 221076 220951
52935B20951m68m57l08n16p34k52O19P69Lo29m60p8j06j58K56P00N76K05K36M88
$$ 220951 220483 220026 219718 219202 218468 218216 218835 219604 219607 218978 218518 218440 218334 218176 218432 219132 219708 219913 220149 220637
52915B20637L81J44N02J314J646J188O49N44N35K70N0J24N6o36j568j867j229
$$ 220637 221018 221162 221664 222978 224624 225812 226461 227005 227540 227810 227860 227984 228040 227404 225836 223969 222740
52898B22740j48P35J117R76M86J4j37k0M1o2rN79J579K269J947O62p48j433j330
$$ 222740 222592 223327 224444 225420 225906 225920 225783 225763 225804 225742 225733 226312 227891 230160 232107 232769 232021 230588 229258
52879B29258j041j047j272j366j211j009r54r39o26P1O92O20r3o39m52Nj42r59
$$ 229258 228217 227170 225898 224532 223321 222312 221358 220419 219793 219864 220556 221176 221083 220444 219992 219997 219855 218896
52861B18896j607j362l20R55J895K048J288J63m41k01L67P11Q40R12P90M04J48
$$ 218896 217289 215927 215607 216562 218457 220505 221793 221956 221515 221314 221681 222392 223232 224144 224934 225338 225486
52844B25486L66Q10J030J061J130R76J43j115j964k122k219k695l012k417j092
$$ 225486 225852 226662 227692 228753 229883 230859 231002 229887 227923 225801 223582 220887 217875 215458 214366
52829B14366R3P32J256K105L027L404K910J710K43r66j464j136k92O45J527K350
$$ 214366 214459 215191 216447 218552 221579 224983 227893 229603 229846 228880 227416 226280 225988 226633 228160 230510
52813B30510K908K890K353J868J996K737L654M349M706M755M516L937K788P26
$$ 230510 233418 236308 238661 240529 242525 245262 248916 253265 257971 262726 267242 271179 273967 274693
52799B74693k279n530p832q377p394n835m423l183j942j033j061j899k488k048
$$ 274693 272414 266884 259052 250675 243281 237446 233023 229840 227898 226865 225804 223905 221417 219369
52785B19369j147r17j429j623r74k25j16k21J21N13O3j012j467o60O66J436J322
$$ 219369 218222 217305 215876 214253 213279 213054 212938 212717 212838 213351 213414 212402 210935 210275 210941 212377 213699
52768B13699P42L13M18Q10P04j98r77n07Q90J791J617J180J097Q74Q7o56p22m85
$$ 213699 214441 214754 215172 215982 216686 216488 215511 215004 215894 217685 219302 220482 221579 222453 222540 221884 221162 220677
52750B20677n59o99l35M12J106J766K442K583J838R58Q74J271J145M49RJ7j05
$$ 220677 220118 219419 219084 219496 220602 222368 224810 227393 229231 230189 231063 232334 233479 233928 233937 233954 233849
52733B33849m39l98L4J44j82j55M46P31J21o88r19q69j044j072m62J54j75j065
$$ 233849 233410 233012 233046 233190 233008 232853 233299 234030 234151 233463 232544 231675 230631 229559 229097 229251 229076 228011
52715B28011j194k64N25K02p02j097q16n76q38j308j462j132n51m5J88J91K26
$$ 228011 226817 226553 227078 227280 226578 225481 224665 224089 223251 221943 220481 219349 218798 218753 218941 219132 219358
52698B19358M98P80N18n22j746k208j664q56n34n84l84K45Q79J149J060P32K69
$$ 219358 219856 220636 221154 220632 218886 216678 215014 214158 213624 213040 212656 212901 213780 214929 215989 216721 216990
52681B16990n7N2N07R11J056J059R24M95j26m83l01K39Q83J539K063K202J973
$$ 216990 216933 216985 217492 218403 219459 220518 221442 221937 221811 221328 221027 221266 222149 223688 225751 227953 229926
52664B29926J678J375P89n6n77l70K26N72M37k5n66p72k19Q87J621J425Q67P68
$$ 229926 231604 232979 233768 233712 233135 232765 232991 233563 234000 233975 233409 232637 232418 233305 234926 236351 237218 237986
52646B37986R67O82j74r01j133j232j415j320p63k26r8%N97J417J649J118O04
$$ 237986 238953 239635 239461 238560 237427 236195 234780 233460 232697 232471 232373 232373 232970 234387 236036 237154 237758
52629B37758R11J979L114L803M016L834L167J959M73q87j919k672l178l426l491
$$ 237758 238669 240648 243762 247565 251581 255415 258582 260541 261014 260127 258208 255536 252358 248932 245441
52614B45441l415l023k167j174o15n36l83J33N56M27K9j45k46o94j192r20J90
$$ 245441 242026 239003 236836 235662 235047 234511 234128 234261 234817 235244 235273 235128 234882 234188 232996 232076 232266
52597B32266J116J051M31K47O84J000O33p4l79n1N04Q61J035J243J429J287P40
$$ 232266 233382 234433 234864 235111 235795 236795 237428 237354 236975 236924 237428 238289 239324 240567 241996 243283 244023
52580B44023R6l11l96k14J76N42N28P0m38o72p41q40q06m78j33m9O4O12J189R26
$$ 244023 244119 243808 243412 243198 243374 243916 244444 244514 244076 243404 242663 241823 241017 240539 240406 240357 240421 241033 242222 243148
52560B43148k01j136j104n30k31l21l45j34J06K98N56Q79J151J365J517J453J137
$$ 243148 242947 241811 240707 240177 239946 239625 239280 239146 239252 239550 240106 240985 242136 243501 245018 246471 247608
52543B47608Q96J005J178R12K86q1R1M04M56L86M98O50M53j67q73j365j557j431
$$ 247608 248504 249509 250687 251599 251885 251804 251895 252299 252755 253141 253639 254289 254742 254575 253702 252337 250780 249349
52525B49349j021n89n31r11j277j094l14O12J257J545J613J488J134P05N54Q63
$$ 249349 248328 247739 247208 246297 245020 243926 243612 244224 245481 247026 248639 250127 251261 251966 252520 253383
52509B53383J361J618J611J795K430L005K635J093p65j740j359k00O93N93m89
$$ 253383 254744 256362 257973 259768 262198 265203 267838 268931 268166 266426 265067 264867 265560 266153 265664
52494B65664j863k692k647k044j310n01M25J158J242P47K59J72L21M59O22Q55
$$ 265664 263801 261109 258462 256418 255108 254607 255032 256190 257432 258179 258438 258610 258931 259390 260012 260867
52478B60867R91R95J193J730K084J628N46k69k76J53L29N8k51j27M84J193J510
$$ 260867 261858 262853 264046 265776 267860 269488 270034 269765 269489 269642 269971 270029 269778 269651 270135 271328 272838
52461B72838J324R61P31N85L27K1j10o3m5j74m59j022j943k895l282k893k168
$$ 272838 274162 275123 275854 276439 276766 276787 276677 276614 276569 276395 275936 274914 272971 270076 266794 263901 261733
52444B61733j659j505j492j414j209r34p05n77m04n7K61J98j62l15m4K52K37J79
$$ 261733 260074 258569 257077 255663 254454 253520 252815 252238 251834 251777 252038 252236 252074 251759 251715 251967 252204 252383
52426B52383M34P15M62j74l64K38R21Q09ro39m41L75J159J520J592J852K642L761
$$ 252383 252817 253532 253994 253820 253456 253694 254615 255424 255415 254776 254335 254710 255869 257389 258981 260833 263475 267236
52408B67236M495M313L557L226L929N224O159O245N712M878L686J893m47k830
$$ 267236 271731 276044 279601 282827 286756 291980 298139 304384 310096 314974 318660 320553 320106 317276
52394C17276m553n145m704l884l337l172k970k393j536p36k46j62l85n86m36M
$$ 317276 312723 307578 302874 298990 295653 292481 289511 287118 285582 284846 284600 284438 284053 283467 283031 283035
52378B83035L12K83K30N28J122J647J920K032K104K087J811J127J99l82r5P90
$$ 283035 283347 283630 283860 284388 285510 287157 289077 291109 293213 295300 297111 298238 298437 298055 297960 298750
52362B98750J330R48n0j104k040k705k601j488%J005J468J845K114J826J013K53
$$ 298750 300080 301028 300978 299874 297834 295129 292528 291040 291040 292045 293513 295358 297472 299298 300311 300564
52346C00564j94n42p68m82L09J019J304J418J577J623J609J959K709L229L152
$$ 300564 300370 299828 299060 298578 298887 299906 301210 302628 304205 305828 307437 309396 312105 315334 318486
52331C18486K999L392M200M933N483N966O280O403O638P078P206O650N885N510
$$ 318486 321485 324877 329077 334010 339493 345459 351739 358142 364780 371858 379064 385714 391599 397109
52317C97109N294M704L991L801L876L233J785Q00J265K554L255K918K337K303
$$ 397109 402403 407107 411098 414899 418775 422008 423793 424593 425858 428412 431667 434585 436922 439225
52303D39225K642K669K263K055K477K989K739J881J548K307L307L424K646J691
$$ 439225 441867 444536 446799 448854 451331 454320 457059 458940 460488 462795 466102 469526 472172 473863
52289D73863P63l74j426j697j221p85p01m06L92J048R20K92j24j05K16Q81J917
$$ 473863 474626 474252 472826 471129 469908 469123 468422 468016 468408 469456 470376 470668 470544 470439 470655 471536 473453
52272D73453K909L380L359L177K874K371K034K506L835N170N514M677L407K728
$$ 473453 476362 479742 483101 486278 489152 491523 493557 496063 499898 505068 510582 515259 518666 521394
52258E21394L078L995M673M743M499M353M421M628M857M913M672M414M567M908
$$ 521394 524472 528467 533140 537883 542382 546735 551156 555784 560641 565554 570226 574640 579207 584115
52244E84115M529L051J392Q12J446K418L148L796M420M565L963L113K721K912
$$ 584115 588644 591695 593087 593899 595345 597763 600911 604707 609127 613692 617655 620768 623489 626401
52230F26401L249L376L302L269L524M079M581M566M025L502L471L809M056M086
$$ 626401 629650 633026 636328 639597 643121 647200 651781 656347 660372 663874 667345 671154 675210 679296
52216F79296M202M627N099N122M544L811L588M084M818N163N025M765M534M115
$$ 679296 683498 688125 693224 698346 702890 706701 710289 714373 719191 724354 729379 734144 738678 742793
52202G42793L454K961K964L144K910K197J533J352J566J860K123K431K834L220
$$ 742793 746247 749208 752172 755316 758226 760423 761956 763308 764874 766734 768857 771288 774122 777342
52188G77342L261K513Q52j077k161j787n04M24J33j175k538l117k902k625k954
$$ 777342 780603 783116 783968 782891 780730 778943 778439 778863 778996 777821 775283 772166 769264 766639 763685
52173G63685l770m328m143l493l017l014l317l572l403k518j004N05J270J166
$$ 763685 759915 755587 751444 747951 744934 741920 738603 735031 731628 729110 728106 728611 729881 731047
52159G31047P67P01J018J291J130N61l0k55j26p0m86j295k038k363k254j853j316
$$ 731047 731814 732515 733533 734824 735954 736515 736485 736230 736104 736034 735548 734253 732215 729852 727598 725745 724429
52142G24429q67p22q61j032j033q79o91o40r75j775k635k949k631k121j590o43
$$ 724429 723562 722840 721979 720947 719914 719035 718344 717704 716729 714954 712319 709370 706739 704618 703028 702385
52126G02385Q42K165K731L153M543O806Q532Q823Q402Q452R011R284R073Q956
$$ 702385 703227 705392 708123 711276 715819 722625 731157 739980 748382 756834 765845 775129 784202 793158
52112G93158R136Q908P637N700M054L226L091L348L748M020M049M168M859O003
$$ 793158 802294 811202 818839 824539 828593 831819 834910 838258 842006 846026 850075 854243 859102 865105
52098H65105O843O892O610O816P634Q407Q606Q465Q477Q589Q048O136K967m06
$$ 865105 871948 878840 885450 892266 899900 908307 916913 925378 933855 942444 950492 956628 959595 959189
52084I59189k720l494l349l246l448l330k212j86J928L220L272K292R19j86o95
$$ 959189 956469 952975 949626 946380 942932 939602 937390 937204 939132 942352 945624 947916 948835 948649 947954
52069I47954o51k49K95P26Q28O25K69k33r88j802k187k015j893k489l613m416
$$ 947954 947303 947054 947349 948075 948903 949528 949797 949564 948576 946774 944587 942572 940679 938190 934577 930161
52053I30161m444m097l921l849l434k654k102k326l190l973m098l595k887k264
$$ 930161 925717 921620 917699 913850 910416 907762 905660 903334 900144 896171 892073 888478 885591 883327
52039H83327j704j102m56K82J332K839M530N823O352O330O282O436O454N878M810
$$ 883327 881623 880521 880065 880347 881679 884518 889048 894871 901223 907553 913835 920271 926725 932603 937413
$$ [...]
##END NTUPLES=NMR SPECTRUM
##END=
