
##TITLE=AC1368_2392_7221419_SvWENlBDkv
##JCAMPDX= 6.0         $$ Bruker NMR JCAMP-DX V2.0
##DATA TYPE= NMR SPECTRUM
##DATA CLASS= NTUPLES
##ORIGIN= BRUKER
##OWNER= Administrator
$$ 1.72 TOPSPIN		Version 2.1
$$ 2012-12-13 21:09:25.837 -0500  Administrator@X
$$ Compression mode = diff/dup
##.OBSERVE FREQUENCY= 400.02188249412
##.OBSERVE NUCLEUS= ^1H
##.ACQUISITION MODE= SIMULTANEOUS (DQD)
##.ACQUISITION SCHEME= undefined
##.AVERAGES= 8
##.DIGITISER RES= 22
##SPECTROMETER/DATA SYSTEM= spect
##.PULSE SEQUENCE= zg30
##.SOLVENT NAME= COFFEE_meoh
##.SHIFT REFERENCE= INTERNAL, COFFEE_meoh, 1, 14.98509
##AUDIT TRAIL= $$ (NUMBER, WHEN, WHO, WHERE, PROCESS, VERSION, WHAT)
$$ ##TITLE= Audit trail, TOPSPIN		Version 2.1
$$ ##JCAMPDX= 5.01
$$ ##ORIGIN= Bruker BioSpin GmbH
$$ ##OWNER= Administrator
$$ $$ E:\/data/COFFEE/nmr/AC1368_2392_7221419_SvWENlBDkv/10/pdata/1/auditp.txt
$$ ##AUDIT TRAIL=  $$ (NUMBER, WHEN, WHO, WHERE, PROCESS, VERSION, WHAT)
(   1,<2012-12-13 21:09:17.603 -0500>,<Administrator>,<X>,<go>,<TOPSPIN 2.1>,
      <created by zg
	started at 2012-12-13 21:08:10.822 -0500,
	POWCHK enabled, PULCHK disabled,
       configuration hash MD5:
       86 BA 57 50 F2 9D 5C 9B 26 00 A9 28 5F 66 2E 89
       data hash MD5: 64K
       3F DC 71 B4 21 8B 4C 89 D2 2F 35 0B E3 61 14 18>)
(   2,<2012-12-13 21:09:20.697 -0500>,<Administrator>,<X>,<proc1d>,<TOPSPIN 2.1>,
      <Start of raw data processing
       efp LB = 0 FT_mod = 6 PKNL = 1 PHC0 = 0 PHC1 = 0 SI = 32K 
       data hash MD5: 32K
       88 FA 78 39 22 99 7D 43 5B 1F 63 C2 89 E9 25 74>)
(   3,<2012-12-13 21:09:21.181 -0500>,<Administrator>,<X>,<proc1d>,<TOPSPIN 2.1>,
      <pk PHC0 = 101.7719 PHC1 = 0 
       data hash MD5: 32K
       8C B4 5D 57 0E E0 41 25 97 9C 8D 88 E8 A9 AC E5>)
(   4,<2012-12-13 21:09:21.415 -0500>,<Administrator>,<X>,<proc1d>,<TOPSPIN 2.1>,
      <abs ABSG = 1 
       data hash MD5: 32K
       A9 41 DA FF DF B4 BA 05 CA E6 9D C2 FE 17 5F 66>)
(   5,<2012-12-13 21:09:21.540 -0500>,<Administrator>,<X>,<proc1d>,<TOPSPIN 2.1>,
      <abs ABSG = 2 
       data hash MD5: 32K
       84 D3 72 90 F0 1A 93 C7 79 FC 80 6E 01 61 02 EF>)
(   6,<2012-12-13 21:09:21.697 -0500>,<Administrator>,<X>,<proc1d>,<TOPSPIN 2.1>,
      <abs ABSG = 3 
       data hash MD5: 32K
       AB 60 8B A2 6F E3 06 D4 2F 3E CD 5C F3 44 26 A9>)
(   7,<2012-12-13 21:09:21.837 -0500>,<Administrator>,<X>,<proc1d>,<TOPSPIN 2.1>,
      <abs ABSG = 4 
       data hash MD5: 32K
       FE C1 3B 97 7E 0A BA 4B 10 F2 C3 30 2A 5E A3 89>)
(   8,<2012-12-13 21:09:21.978 -0500>,<Administrator>,<X>,<proc1d>,<TOPSPIN 2.1>,
      <abs ABSG = 5 
       data hash MD5: 32K
       18 A1 F7 C4 A2 32 37 63 62 D0 83 80 7E 84 F0 E7>)
$$ ##END=
$$ 
$$ $$ hash MD5
$$ $$ 71 61 A2 9A 66 CC 65 6A 09 2B 9C 5F E3 52 FF 17
##$RELAX= 
##$RELAX= 
##$RELAX= 
##$RELAX= 
##$RELAX= 
##$RELAX= 
##$RELAX= 
##$RELAX= 
$$ Bruker specific parameters
$$ --------------------------
##$DU= <E:\>
##$EXPNO= 10
##$NAME= <AC1368_2392_7221419_SvWENlBDkv>
$$ [...]
150 150 150 150 150 150 150 150
##$TP07= 0
##$TPNAME0= <>
##$TPNAME1= <>
##$TPNAME2= <>
##$TPNAME3= <>
##$TPNAME4= <>
##$TPNAME5= <>
##$TPNAME6= <>
##$TPNAME7= <>
##$TPOAL= (0..7)
0.5 0.5 0.5 0.5 0.5 0.5 0.5 0.5
##$TPOFFS= (0..7)
0 0 0 0 0 0 0 0
##$TUNHIN= 0
##$TUNHOUT= 0
##$TUNXOUT= 0
##$USERA1= <user>
##$USERA2= <user>
##$USERA3= <user>
##$USERA4= <user>
##$USERA5= <user>
##$V9= 5
##$VALIST= <valist>
##$VCLIST= <CCCCCCCCCCCCCCC>
##$VD= 0
##$VDLIST= <DDDDDDDDDDDDDDD>
##$VPLIST= <PPPPPPPPPPPPPPP>
##$VTLIST= <TTTTTTTTTTTTTTT>
##$WBST= 1024
##$WBSW= 4
##$XGAIN= (0..3)
0 0 0 0
##$XL= 0
##$YL= 0
##$YMAX_a= 669197
##$YMIN_a= -572639
##$ZGOPTNS= <>
##$ZL1= 120
##$ZL2= 120
##$ZL3= 120
##$ZL4= 120
##$ABSF1= 14.98509
##$ABSF2= -5.573092
##$ABSG= 5
##$ABSL= 3
##$ALPHA= 0
##$AQORDER= 0
##$ASSFAC= 0
##$ASSFACI= 0
##$ASSFACX= 0
##$ASSWID= 0
##$AUNMP= <proc_prof1d_extract_pilot.lims>
##$AXLEFT= 0
##$AXNAME= <>
##$AXNUC= <1H>
##$AXRIGHT= 0
##$AXTYPE= 0
##$AXUNIT= <>
##$AZFE= 0.1
##$AZFW= 0.1
##$BCFW= 0
##$BC_mod= 0
##$BYTORDP= 0
##$COROFFS= 0
##$CY= 15
##$DATMOD= 1
##$DC= 0
##$DFILT= <>
##$DTYPP= 0
##$F1P= 0
##$F2P= 0
##$FCOR= 0.5
##$FTSIZE= 32768
##$FT_mod= 6
##$GAMMA= 0
##$GB= 0
##$INTBC= 1
##$INTSCL= 1
##$ISEN= 128
##$LB= 0
##$LEV0= 0
##$LPBIN= 0
##$MAXI= 10000
##$MC2= 0
##$MEAN= 0
##$ME_mod= 0
##$MI= 0
##$NCOEF= 0
##$NC_proc= -8
##$NLEV= 6
##$NOISF1= 0
##$NOISF2= 0
##$NSP= 0
##$NTH_PI= 0
##$NZP= 0
##$OFFSET= 14.98509
##$PC= 1
##$PHC0= 101.7719
##$PHC1= 0
##$PH_mod= 1
##$PKNL= yes
##$PPARMOD= 0
##$PPDIAG= 0
##$PPIPTYP= 0
##$PPMPNUM= 2147483647
##$PPRESOL= 1
##$PSCAL= 4
##$PSIGN= 0
##$PYNMP= <proc.py>
##$REVERSE= no
##$SF= 400.02
##$SI= 32768
##$SIGF1= 0
##$SIGF2= 0
##$SINO= 400
##$SIOLD= 32768
##$SPECTYP= <>
##$SREGLST= <1H.CDCl3>
##$SSB= 0
##$STSI= 32768
##$STSR= 0
##$SW_p= 8223.68421052631
##$SYMM= 0
##$S_DEV= 0
##$TDeff= 65536
##$TDoff= 0
##$TI= <>
##$TILT= no
##$TM1= 0
##$TM2= 0
##$TOPLEV= 0
##$USERP1= <user>
##$USERP2= <user>
##$USERP3= <user>
##$USERP4= <user>
##$USERP5= <user>
##$WDW= 1
##$XDIM= 32768
##$YMAX_p= 466724597
##$YMIN_p= -705362
##$CURPLOT= <Network HP LaserJet P1505>
##$CURPRIN= <$Network HP LaserJet P1505>
##$DFORMAT= <normdp>
##$LAYOUT= <+/1D_H.xwp>
##$LFORMAT= <normlp>
##$PFORMAT= <normpl>
##$SURQMSG= 1
$$ End of Bruker specific parameters
$$ ---------------------------------
##NTUPLES= NMR SPECTRUM
##VAR_NAME=  FREQUENCY,     SPECTRUM/REAL,   SPECTRUM/IMAG
##SYMBOL=    X,             R,               I
##VAR_TYPE=  INDEPENDENT,   DEPENDENT,       DEPENDENT
##VAR_FORM=  AFFN,          ASDF,            ASDF
##VAR_DIM=   32768,         32768,           32768
##UNITS=     HZ,            ARBITRARY UNITS, ARBITRARY UNITS
##FACTOR=    0.250966925370066, 1,           1
##FIRST=     8223.43324360094, 56142,        127407
##LAST=      0,             61257,           -101451
##MIN=       0,             -705362,         0
##MAX=       8223.43324360094, 466724597,    0
$$ Real data points
##PAGE= N=1
##DATA TABLE= (X++(R..R)), XYDATA
$$ [...]
19535b24873e0284C11886H4843g2703A0229c7219k77263h3751A31820K28048n3755
$$ -224873 -50284 311886 84843 -72703 10229 -37219 -314482 -83751 131820 359868 306113
19524C06113L3344d43519f7933j05798P5200l11718e2701m8056j09826k75544
$$ 306113 339457 -443519 -67933 -173731 -98531 -410249 -52701 -100757 -210583 -486127
19514d86127b20000m6219e9398j63463a11091k49301f6172p9305C6202a13693
$$ -486127 -220000 -266219 -59398 -222861 -111091 -360392 -66172 -145477 36202 -113693
19503D1085A1131K77786b7893p070k14458R7239B69944d6695l33n2120A9609J7410
$$ 41085 11131 288917 -27893 -34963 -249421 -152182 269944 -46695 -47028 -99148 19609 37019
19491C7019P5922l5072Q1592b53125e1777k35437a18268C8085d21883E0426c5934
$$ 37019 112941 77869 159461 -253125 -51777 -287214 -118268 38085 -421883 50426 -35934
19479d9045k02207o1337J13302F0858e2307l1023B77769e7326m36607b7695I3776
$$ -49045 -251252 -312589 -199287 60858 -52307 -83330 277769 -57326 -493933 -27695 93776
19467g762j25473j7671N8601F3570J78109d56867K13274E4845a21375l28852B56921
$$ -7762 -133235 -150906 -92305 63570 241679 -456867 -243593 54845 -121375 -450227 256921
19455a63721K5362N7611j70631A06471j0380b22665l39001h5895A20050a33394
$$ -163721 -138359 -80748 -251379 106471 96091 -222665 -561666 -85895 120050 -133394
19444b36293J08631C849R5085P411a90425O5320M2336C24113a5451G1198f8947
$$ -236293 -127662 3849 98934 106345 -190425 -125105 -82769 324113 -15451 71198 -68947
19432F1142c9187j53716A9886b39899h1243E6859A8587M5340K45873A0947b43078
$$ 61142 -39187 -192903 19886 -239899 -81243 56859 18587 63927 309800 10947 -243078
19420a55791A05441i3209K2544L1069j014l24500a1917B6865d6610m5407J3785
$$ -155791 105441 -93209 -70665 -39596 -40610 -365110 -11917 26865 -46610 -92017 -78232
19409g8232q8898f3193A3329c21835F6487b35654A14254b60000Q7309p1945a08887
$$ -78232 -167130 -63193 13329 -321835 66487 -235654 114254 -260000 -172691 -244636 -108887
19397f4814D5004b41018A21054a3519A55529F2724b12038g0032l350C0238b85937
$$ -64814 45004 -241018 121054 -13519 155529 62724 -212038 -70032 -73382 30238 -285937
19385C525a67515k5598M2976l7470k3801P3917j7817R5p3279j7989d9697p3156
$$ 3525 -167515 -193113 -150137 -187607 -211408 -137491 -155308 -155213 -228492 -246481 -49697 -122853
19373a22853C97994n0246b25695H6748R0557H1037e7374B07985C4308a12229E5368
$$ -122853 397994 347748 -225695 86748 177305 81037 -57374 207985 34308 -112229 55368
19361a28778D1706f5440k53315k5509A70490b2007k10962C2816J21102F4002d5046
$$ -128778 41706 -65440 -318755 -344264 170490 -22007 -232969 32816 153918 64002 -45046
19349B14534a33302j87398A03272J09753J45329f2113A36764J23379a39487A98256
$$ 214534 -133302 -320700 103272 213025 358354 -62113 136764 260143 -139487 198256
19338g6422B30531c43261B48489c59923A01915k0277b1797j8377j00756j44150
$$ -76422 230531 -343261 248489 -359923 101915 81638 -21797 -40174 -140930 -285080
19328b85080H5766L20332A58387J44206a25272l8786i033C03282F1731i8294m381
$$ -285080 85766 406098 158387 302593 -125272 -164058 -9033 303282 61731 -98294 -102675
19317a02675d7602A03655c43339A77777A4905h4597B1870a30010B35962a19344
$$ -102675 -47602 103655 -343339 177777 14905 -84597 21870 -130010 235962 -119344
19306a82481B41475q0421b52086e6821A20672c35388A21822B2021e2318k10484
$$ -182481 241475 161054 -252086 -56821 120672 -335388 121822 22021 -52318 -262802
19296b62802a00424C0204J07393e6034I5796b01483B21356q5591a76763B8981
$$ -262802 -100424 30204 137597 -56034 95796 -201483 221356 135765 -176763 28981
19285D22019i0546A02259c92656J14310C0196a46242j30103A81786a63008A21687
$$ 422019 -90546 102259 -392656 -278346 30196 -146242 -276345 181786 -163008 121687
19274I542J5711J32904b97157A65989a45367b7265m8261C27670a83057A37231
$$ 9542 25253 158157 -297157 165989 -145367 -27265 -75526 327670 -183057 137231
19263b69215B33806A06617g7321j66032N1653f3518j09070f6115l3205A27075
$$ -269215 233806 106617 -77321 -243353 -191700 -63518 -172588 -66115 -99320 127075
19252d9570D3503b09141P3728j21374B22533d6675j80213J11150j15279l0852
$$ -49570 43503 -209141 -135413 -256787 222533 -46675 -226888 -115738 -231017 -261869
19242b61869B30236a76554e6577B17979B4035a03255k64948e0482D7826K7574
$$ -261869 230236 -176554 -56577 217979 24035 -103255 -368203 -50482 47826 75400
19232G5400c6541A36972b3339j0394B7805L2888f4290q3161e4099r6290j4697
$$ 75400 -36541 136972 -23339 -33733 27805 60693 -64290 -147451 -54099 -150389 -165086
19221a65086g1465p294G5036j0703K6368c69676J68035A83593a00571r9674j93219
$$ -165086 -71465 -78759 75036 64333 90701 -369676 -201641 183593 -100571 -200245 -393464
19210c93464A02164b31917H0280c48616G5888r029J98152a85386j41058c5195
$$ -393464 102164 -231917 80280 -348616 75888 66859 265011 -185386 -326444 -35195
19199f3758j77476L5770c5975l0526q0780k5094Q4611I6208b01506p6320d442
$$ -63758 -241234 -205464 -35975 -66501 -147281 -172375 -87764 96208 -201506 -277826 -4442
19187c2697m0831H0278J053a60236C8069a82388e33j07120A444a33086k1392C04821
$$ -32697 -73528 80278 81331 -160236 38069 -182388 -533 -107653 1444 -133086 -154478 304821
19174a25087k70379J40832d1957F2609k372h3768l44558i6068A6857d06970G3046
$$ -125087 -395466 -254634 -41957 62609 60237 -83768 -428326 -96068 16857 -406970 73046
19162c07333O3882O8676D7489a43291k27739A2767Q3931h9430A44613i60m7583
$$ -307333 -243451 -174775 47489 -143291 -371030 12767 96698 -89430 144613 -960 -48543
19151d8543r1365j45803a18522d3374G1675a37219k61534B54771H3949l6057d6359
$$ -48543 -139908 -285711 -118522 -43374 71675 -137219 -398753 254771 83949 47892 -46359
19139b13008I7294J22626N6358b92636f8758A29538a16637c4712R536C36121A03610
$$ -213008 97294 219920 276278 -292636 -68758 129538 -116637 -34712 -25176 336121 103610
19127I571K65928b25915D3857a32034f4410A96268q3205h4457n8381j68042h0282
$$ 9571 275499 -225915 43857 -132034 -64410 196268 113063 -84457 -142838 -310880 -80282
19115E6309k0928a28371K3427r3181P2948k66005A27376a971A91953f2603O82
$$ 56309 35381 -128371 -104944 -198125 -125177 -391182 127376 -1971 191953 -62603 -61921
19104f1921K0768a5402E2611f8380R19m1637e644D8549j1842Q126e92548C83619
$$ -61921 -41153 -15402 52611 -68380 -67461 -109098 -5644 48549 36707 44833 -592548 383619
19091f4492B29295g4354l7051E5750d18459B0686f133p5645j9279I4492c2719
$$ -64492 229295 -74354 -111405 55750 -418459 20686 -6133 -81778 -101057 94492 -32719
19079D4598b52912a8439j6449A06525a5788k70536H3994Q2933J0616c3454m55684
$$ 44598 -252912 -18439 -34888 106525 -15788 -286324 83994 166927 177543 -33454 -489138
19068d89138I6240J00580a22042d2167n060D19678e22748A35094a36296f0412
$$ -489138 96240 196820 -122042 -42167 -47227 419678 -522748 135094 -136296 -60412
19057a73278A899L7567f3778m25172a38678L6951A37798b54280b84k63558G4256
$$ -173278 1899 39466 -63778 -488950 -138678 -101727 137798 -254280 -284 -263842 74256
19045G0631k8911L0540M28591c14387A214a7841j924j26758B4151i2182k5053
$$ 70631 41720 72260 500851 -314387 1214 -17841 -19765 -146523 24151 -92182 -117235
19034a17235I2041J01789l8267O0050q2189R593j9225b23673A52327f1571A67265
$$ -117235 92041 193830 155563 215613 133424 143017 123792 -223673 152327 -61571 167265
19022A23744l3798g6428B83108I9022a77290A35570a29837l2768B80396d2547
$$ 123744 89946 -76428 283108 99022 -177290 135570 -129837 -162605 280396 -42547
19011A75100b25544c6097i560j71786f2256B83889a76938k04374A13864m6369
$$ 175100 -225544 -36097 -9560 -181346 -62256 283889 -176938 -381312 113864 67495
19001F7495J45581b36157a04331j71847a03132j11679i455B2820J33216b49352
$$ 67495 213076 -236157 -104331 -276178 -103132 -214811 -9455 22820 156036 -249352
18990e864p5600q2669A30093F2752a76652D551K4434c21689A60037a85312A83505
$$ -5864 -81464 -164133 130093 62752 -176652 4551 28985 -321689 160037 -185312 183505
18978b40718C05417b32341B45327E1426a83011P0806c9793E7026K84633p3467
$$ -240718 305417 -232341 245327 51426 -183011 -112205 -39793 57026 341659 268192
18968B68192A09136h2512l5739K782F1344c1141A07654K14041h5177B30105i4621
$$ 268192 109136 -82512 -118251 -115469 61344 -31141 107654 321695 -85177 230105 -94621
18956C01860j04665j2730m9354g8374j8372l76568A94938B6569d30176J65664
$$ 301860 197195 184465 135111 -78374 -96746 -473314 194938 26569 -430176 -264512
18946b64512j76789a49192A36701c4046k73134e3216j27278b0986l1482a4555
$$ -264512 -441301 -149192 136701 -34046 -307180 -53216 -180494 -20986 -52468 -14555
18935C2643a36914p6681E9947a69688J3389o1808B37820c4252A18995C9173b95214
$$ 32643 -136914 -213595 59947 -169688 -156299 -218107 237820 -34252 118995 39173 -295214
18923b01344B8939a93319a4567j36776j26606A02879c1057k67273A01202c15102
$$ -201344 28939 -193319 -14567 -151343 -277949 102879 -31057 -298330 101202 -315102
18912c84339i5928k17878J5462p1002R7024i2367n6456A6770J05251M6651J30292
$$ -384339 -95928 -313806 -298344 -369346 -272322 -92367 -148823 16770 122021 168672 298964
18901B98964H9883b68449E7793O7987a89059D0104a101j40055f0948l9129B62827
$$ 298964 89883 -268449 57793 125780 -189059 40104 -1101 -141156 -60948 -100077 262827
18889i1783H0646a96488j15127B8699J96137e4904j77713g8010B7560a00766J9559
$$ -91783 80646 -196488 -311615 28699 224836 -54904 -232617 -78010 27560 -100766 -81207
18878h1207C541J70527f8374k24877f6836o1557D1657j1971K2362c14104O8690
$$ -81207 3541 174068 -68374 -293251 -66836 -128393 41657 29686 52048 -314104 -245414
18867b45414O0355D76774E8450a22296A19074B6513a25548a4043j26187B05417
$$ -245414 -185059 476774 58450 -122296 119074 26513 -125548 -14043 -140230 205417
18856i7581C49677j5676a03057a4473G6735b75805H4228L3713b1933m28823b20299
$$ -97581 349677 334001 -103057 -14473 76735 -275805 84228 117941 -21933 -450756 -220299
18844a36939e7197r8460H4065N6847e1847G3266N5806h9956k46065B7101N5287
$$ -136939 -57197 -155657 84065 140912 -51847 73266 129072 -89956 -336021 27101 82388
18833H2388a89923o3330c5818A93025H4433K35886b39423B7364e2483j80809h5968
$$ 82388 -189923 -253253 -35818 193025 84433 320319 -239423 27364 -52483 -233292 -85968
18821D3656J38194C9565c035A0666b29516B01039Q9173h4158A8809L7827J52030
$$ 43656 181850 39565 -3035 10666 -229516 201039 290212 -84158 18809 56636 208666
18810B08666J20500r0323E8227a42315k10056N6102a9318l7010n6433A63789L8235
$$ 208666 329166 238843 58227 -142315 -352371 -296269 -19318 -56328 -112761 163789 202024
18799B02024G4339b47451L1794J05833k31270B22989D1300J949g556A733M6646
$$ 202024 74339 -247451 -215657 -109824 -341094 222989 41300 43249 -7556 1733 48379
18788D8379i2722j25325g6234j24724A08060b60080a6517k4780k20102a30613
$$ 48379 -92722 -218047 -76234 -200958 108060 -260080 -16517 -41297 -261399 -130613
18777H4348q028c28029D7834d4365j94792j46547a55622A3221a01232j59042B2818
$$ 84348 76320 -328029 47834 -44365 -239157 -385704 -155622 13221 -101232 -260274 22818
18765B32198B1481g5358A47726l413B9747b70274j178A19557g619k88614l688
$$ 232198 21481 -75358 147726 144313 29747 -270274 -271452 119557 -7619 -296233 -299921
18754b99921a9141k42057K6294h7287J1636A25998R9355r2169C5473M2403M9934
$$ -299921 -19141 -261198 -234904 -87287 -75651 125998 225353 133184 35473 77876 127810
18743A27810C9453c98458g9274j07340e9244p3650q7349O6011A97691d76227I2437
$$ 127810 39453 -398458 -79274 -186614 -59244 -132894 -220243 -154232 197691 -476227 92437
18731a59686g5223p7533H1068K3857a49858M3839c359j09054k587p2329A79850
$$ -159686 -75223 -152756 81068 104925 -149858 -106019 -3359 -112413 -115000 -187329 179850
18719E3225P3447a11468j01126F4115f1424A87087b88591A37525j675g3326j5181
$$ 53225 126672 -111468 -212594 64115 -61424 187087 -288591 137525 135850 -73326 -88507
18708h8507j10682f8229n9559A35697E7304a55067k19787a64094j12497p3302
$$ -88507 -199189 -68229 -127788 135697 57304 -155067 -374854 -164094 -276591 -349893
18698c49893Q5882N0809f146F4509d16168g4762O901G6365b52075b9585I6720
$$ -349893 -264011 -213202 -6146 64509 -416168 -74762 -67861 76365 -252075 -29585 96720
18686C7861c1303k8634q7090G6113a30143b5286k11556j29689D7916R541e97509
$$ 37861 -31303 -59937 -147027 76113 -130143 -25286 -236842 -366531 47916 57457 -597509
18674A96389d1576A4565b40307H2968b21109j8449M9067k7027f8260k16350a21512
$$ 196389 -41576 14565 -240307 82968 -221109 -239558 -190491 -217518 -68260 -284610 -121512
18662a95820B8104a15825C19709a51125p2109C9157b35293L0946A12454C1302
$$ -195820 28104 -115825 319709 -151125 -223234 39157 -235293 -204347 112454 31302
18651a72866F4792A3808h1072o8390K4460p5939B04915b72399J32642k11660b1129
$$ -172866 64792 13808 -81072 -149462 -125002 -200941 204915 -272399 -139757 -351417 -21129
18639E9325i6249d7407l8456A53035a55088g6810F0489L6433m506J32729b01094
$$ 59325 -96249 -47407 -85863 153035 -155088 -76810 60489 96922 92416 225145 -201094
18627a32667G9265J5086b08530F0752k20a40892N014l04590J71631o846e5366
$$ -132667 79265 94351 -208530 60752 60532 -140892 -135878 -440468 -268837 -275683 -55366
18615d791j67815a6551k26618i9315k2866K5677I8205e3103G2496A0430b81507
$$ -4791 -172606 -16551 -243169 -99315 -122181 -96504 98205 -53103 72496 10430 -281507
18603B2426a7154B03917a76067B26820a47040l1945Q6860l0281C66f6054L2260
$$ 22426 -17154 203917 -176067 226820 -147040 -178985 -92125 -122406 366 -66054 -33794
18592c3794j76289o3492h1108C1807a75987b5506B89169B4363J47644b70082B93679
$$ -33794 -210083 -273575 -81108 31807 -175987 -25506 289169 24363 172007 -270082 293679
18580B01103c00181A2293J94566c18901R5516K8692I3362K53113A45872b46075
$$ 201103 -300181 12293 206859 -318901 -223385 -194693 93362 346475 145872 -246075
18569a7462D7300a13288r7431j11811A7943f846A4255c55810b1741l94395E9398
$$ -17462 47300 -113288 -210719 -322530 17943 -6846 14255 -355810 -21741 -416136 59398
18557C9421c3874A58714c884A06699a95042Q4526l16669d529l00652B56609a20576
$$ 39421 -33874 158714 -3884 106699 -195042 -110516 -427185 -4529 -305181 256609 -120576
18545b399D60397A61540J35568a39296b9892j68557j51337h7869e081j83506I4353
$$ -2399 460397 161540 297108 -139296 -29892 -198449 -349786 -87869 -5081 -188587 94353
18533b01920R4620A61417b16783B28674A1077c39575N3753D2634a41708J6304
$$ -201920 -107300 161417 -216783 228674 11077 -339575 -285822 42634 -141708 -125404
18523a25404I2469O6088b49690d153B97642a11776A10467a54545B71660I9198
$$ -125404 92469 158557 -249690 -4153 297642 -111776 110467 -154545 271660 99198
18512c1673j59726I2086A2347K0480O4059c9936o5013A53193a62116c9925l13517
$$ -31673 -191399 92086 12347 32827 96886 -39936 -104949 153193 -162116 -39925 -353442
18501c53442B59818a33798C64237b35601A76721D741K59543j20597c48117J37807
$$ -353442 259818 -133798 364237 -235601 176721 4741 264284 143687 -348117 -210310
18491b10310J1000F6606a97410a5873m3542k41638b4570I0394B7453J34719b63164
$$ -210310 -199310 66606 -197410 -15873 -59415 -301053 -24570 90394 27453 162172 -263164
18479C23012j60974b9447C2490a75495A38703a36092f7182C28045a93830D7767
$$ 323012 162038 -29447 32490 -175495 138703 -136092 -67182 328045 -193830 47767
18468d38762e5337B4477J4167b01941K8936L2299a7683j2032C1810b13626g2883
$$ -438762 -55337 24477 38644 -201941 -173005 -140706 -17683 -29715 31810 -213626 -72883
18456E7846a15872j0485C19794a15591j90420I9278j7111b11381I1437B1409i232
$$ 57846 -115872 -126357 319794 -115591 -306011 99278 82167 -211381 91437 21409 -9232
18444e6245j87989B07250d3319A1056a04158k06683m1370J57369F1109j1792h7046
$$ -56245 -244234 207250 -43319 11056 -104158 -310841 -352211 -194842 61109 49317 -87046
18432b2884k4336F474c15677B66213d3429D9552a81793L8754j69604b2767q8847
$$ -22884 -47220 6474 -315677 266213 -43429 49552 -181793 -143039 -312643 -22767 -111614
18421a11614J3169a0215B9243A497b59123C47078H6608M2436f2502G9089B0192
$$ -111614 -98445 -10215 29243 1497 -259123 347078 86608 129044 -62502 79089 20192
18409c56498J72374A3990L08918c35627I5085c07216b4481p2270M252m6957l0690
$$ -356498 -184124 13990 322908 -335627 95085 -307216 -24481 -96751 -92499 -139456 -170146
18398a70146j03459g3569A18359b9708C9607J09846n2423M8962g5085m5137A55647
$$ -170146 -273605 -73569 118359 -29708 39607 149453 97030 145992 -75085 -120222 155647
18386e1756H7227P710r192k554k1844j0545J18605G2291b9496d416j61707p4405
$$ -51756 87227 94937 85745 83191 61347 50802 169407 72291 -29496 -4416 -166123 -240528
18374b40528b7005j66440D59395a15097C4146a66059H5133J32140b03749G7915
$$ -240528 -27005 -193445 459395 -115097 34146 -166059 85133 217273 -203749 77915
18363B33324b2453k46169J15523k5476A73828B9487c6173o1301j20762E0128e7467
$$ 233324 -22453 -268622 -153099 -178575 173828 29487 -36173 -97474 -218236 50128 -57467
18351b2714C6089a0117F8519C0013b5280G2985Q0504c80692C48682a93208i5494
$$ -22714 36089 -10117 68519 30013 -25280 72985 153489 -380692 348682 -193208 -95494
18339b28064A39822K4251a52853N6152b0502j91844d2533B8784a41390j34732
$$ -228064 139822 164073 -152853 -96701 -20502 -212346 -42533 28784 -141390 -276122
18329b76122G1883J35080b28490M2140N8088k5124C5246R9092J9862b70550J31344
$$ -276122 71883 206963 -228490 -186350 -128262 -153386 35246 134338 154200 -270550 -139206
18318a39206a9653C39599d81376J77342H5586P0666a31187B38810Q2717a15195
$$ -139206 -19653 339599 -481376 -304034 85586 156252 -131187 238810 321527 -115195
18307H7304d2077A83338q5735b50591o711j00326a25583m9194L6434E5346c21732
$$ 87304 -42077 183338 97603 -250591 -257302 -357628 -125583 -174777 -138343 55346 -321732
18295a77976A81545f828H0173i9466C3169a22919d6106A8811b12041j2259Q0003
$$ -177976 181545 -6828 80173 -99466 33169 -122919 -46106 18811 -212041 -224300 -144297
18284a44297j57307c6045k88479A62780b44825c2873A25533D0313f8401c3053
$$ -144297 -301604 -36045 -324524 162780 -244825 -32873 125533 40313 -68401 -33053
18273a15823A42038F8033a73156E1125h4830j20547R9435I3382c10969J44796
$$ -115823 142038 68033 -173156 51125 -84830 -205377 -105942 93382 -310969 -166173
18263a66173a5242A07884a40278e7332j45873O5582j04666D106M5265c45630B09797
$$ -166173 -15242 107884 -140278 -57332 -203205 -137623 -242289 4106 49371 -345630 209797
18251e1455I5949d27724A05953c26367B0278d03366j517A5229b52597h5341c9224
$$ -51455 95949 -427724 105953 -326367 20278 -403366 -404883 15229 -252597 -85341 -39224
18239C7931K8230b4845j21251F9119B4073f8292A40646k3239P0443i7966p7150
$$ 37931 66161 -24845 -146096 69119 24073 -68292 140646 117407 187850 -97966 -175116
18228a75116F0772a5945j65688B43570G5311C7044J66426k5521G5055a81429C3619
$$ -175116 60772 -15945 -181633 243570 75311 37044 203470 177949 75055 -181429 33619
18216B1055P9797J5702J32053b9140j11927N5043n6048O4407C1641N2439b70558
$$ 21055 100852 116554 248607 -29140 -141067 -86024 -142072 -77665 31641 84080 -270558
18204G7181K1159c5514I0116j2174C6016b21477C804a31121G4355b62083G6347
$$ 77181 98340 -35514 90116 77942 36016 -221477 3804 -131121 74355 -262083 76347
18192a59375A92323G3170g5996k42237a02706E9044e9134l45323F583d3465A22890
$$ -159375 192323 73170 -75996 -318233 -102706 59044 -59134 -404457 6583 -43465 122890
18180b86818a5623A10644a64126A49032J07108p6181a65963c9587j0369l9966
$$ -286818 -15623 110644 -164126 149032 256140 179959 -165963 -39587 -49956 -89922
18170h9922A22699n2175N5057f4053A24335l5456b13588O3061I1233K04186j29876
$$ -89922 122699 70524 125581 -64053 124335 88879 -213588 -150527 91233 295419 165543
18159A65543d01098d3455k54693C3534J0564K10903a1523k2713D7755a40078L3670
$$ 165543 -401098 -43455 -298148 33534 44098 255001 -11523 -34236 47755 -140078 -106408
18148a06408A19425h8500k04644J15362E9802A1170a62989K3465b3224n677k81530
$$ -106408 119425 -88500 -293144 -177782 59802 11170 -162989 -139524 -23224 -28901 -310431
18137c10431d825k77902i8398j67122I8273f921A07749c14213C72803D9760Q0494
$$ -310431 -4825 -282727 -98398 -265520 98273 -6921 107749 -314213 372803 49760 130254
18126A30254g1638k82879C88171a51873D22607H5116K9935Q3678K1778K71302
$$ 130254 -71638 -354517 388171 -151873 422607 85116 115051 198729 220507 491809
18116D91809e8142j14707C9901c8736j1742E4577n758a9637D54354g1941H4386
$$ 491809 -58142 -172849 39901 -38736 -50478 54577 48819 -19637 454354 -71941 84386
18104h3535B8580K26083F8184K21793q6892E5626f9826C44204F149K25249f152
$$ -83535 28580 254663 68184 289977 203085 55626 -69826 344204 6149 231398 -6152
18092a48676A58044a77474B01318I5883g0327H4839Q376P1960c33203a32838A93934
$$ -148676 158044 -177474 201318 95883 -70327 84839 93215 165175 -333203 -132838 193934
18080A63808p3659a10782c5485o8642H9464c10948p1105C04760a18889A87951
$$ 163808 90149 -110782 -35485 -104127 89464 -310948 -382053 304760 -118889 187951
18069h561A12152Q8451r3436f7358B68701b02180l5300e2509A23925c7065A53128
$$ -8561 112152 200603 107167 -67358 268701 -202180 -237480 -52509 123925 -37065 153128
18057G5737H109J5745c12021F761c05516f4007F5339f5260B6049a38583o2045
$$ 75737 8109 23854 -312021 6761 -305516 -64007 65339 -65260 26049 -138583 -200628
18046b00628q0972C88037A50423h3946o9947L5630b0893A90018p8900G138a7044
$$ -200628 -281600 388037 150423 -83946 -153893 -118263 -20893 190018 111118 7138 -17044
18034G9535b12984A51438q978F2372g6042p4597n0409P2790d5756f309A52301
$$ 79535 -212984 151438 142460 62372 -76042 -150639 -201048 -128258 -45756 -6309 152301
18022i0713l37690c6548r2437k6479G1539k9114J44069D684K3523J35060b44008
$$ -90713 -428403 -36548 -128985 -155464 71539 42425 186494 4684 28207 163267 -244008
18010f1498B32136p7736G278b26560A50463a37147C3757a76178k90756B21513
$$ -61498 232136 154400 7278 -226560 150463 -137147 33757 -176178 -466934 221513
17999i9790b2782B24346o2671p2323a38854l1961c9841m1091q8982C1476J52720
$$ -99790 -22782 224346 161675 89352 -138854 -170815 -39841 -80932 -169914 31476 184196
17988A84196b21360a821j45395N4946o2852f7761j88580J20977A35010h4203I7271
$$ 184196 -221360 -1821 -147216 -92270 -155122 -67761 -256341 -135364 135010 -84203 97271
17976a69658l767j9100B5551J17028a43572B18104a0745q2491C0157L25348C6936
$$ -169658 -173425 -192525 25551 142579 -143572 218104 -10745 -93236 30157 355505 36936
17964a28067B4833i9574A32095a19580o2624o0975B16848c5665j51145Q9132j58888
$$ -128067 24833 -99574 132095 -119580 -182204 -243179 216848 -35665 -186810 -97678 -256566
17953b56566A06894c3369j92031h384k75745p3791C6858a35894G5728K51043f2532
$$ -256566 106894 -33369 -225400 -8384 -284129 -357920 36858 -135894 75728 326771 -62532
17941B62910h9761k1753j36958d8963n4814n1428B06379a14129J7980Q635E0111
$$ 262910 -89761 -111514 -248472 -48963 -103777 -155205 206379 -114129 -96149 -87514 50111
17929A99809a68389a5321j87771j74140A74944i367k65927A12504d1661j32193
$$ 199809 -168389 -15321 -203092 -377232 174944 -9367 -275294 112504 -41661 -173854
17919a73854D871R144c94007e2297G5936A7034R3798B1991g9337A7489a19281
$$ -173854 4871 14015 -394007 -52297 75936 17034 110832 21991 -79337 17489 -119281
17907A40474A8616h1917b2616A16383e9796B34486a58963N578B48210b5367j51172
$$ 140474 18616 -81917 -22616 116383 -59796 234486 -158963 -153385 248210 -25367 -176539
17896a76539A23541N3838H0965a87953k3299i1633c8248l79300A430M2279a27209
$$ -176539 123541 177379 80965 -187953 -211252 -91633 -38248 -417548 1430 43709 -127209
17884a61271I536h2714p4198A1265a94471B5517K34151A4499a6490j58456A4783
$$ -161271 9536 -82714 -156912 11265 -194471 25517 259668 14499 -16490 -174946 14783
17872B77023p8748k7689a40308A01200a4571j7027a2096n07376c6081a1471c326
$$ 277023 198275 170586 -140308 101200 -14571 -31598 -12096 -519472 -36081 -11471 -3326
17860a49127C0039c06832B28383a72281C20017d8527l2200r411D7167R2018b18097
$$ -149127 30039 -306832 228383 -172281 320017 -48527 -80727 -90138 47167 139185 -218097
17848b15360B7653E041Q2892j5582a68490A72154E1990j2175b1015k71926B450
$$ -215360 27653 5041 87933 72351 -168490 172154 51990 39815 -21015 -292941 2450
17836a90799A31948C8119g619B34212n5669a19805C9397a38437A02351K6717a18800
$$ -190799 131948 38119 -7619 234212 178543 -119805 39397 -138437 102351 129068 -118800
17824B80891p9752l4964a4982j3639j01188I5675i9161b1342A3061J09182J68216
$$ 280891 201139 166175 -14982 -28621 -129809 95675 -99161 -21342 13061 122243 290459
17813B90459h3327j76506C6440K11978A7828b71532O8335d2482B22914p1886a47583
$$ 290459 -83327 -259833 36440 248418 17828 -271532 -203197 -42482 222914 151028 -147583
17801b38983A46436d8560A54828H392a36873l3159q339N7478a3702j29928A63929
$$ -238983 146436 -48560 154828 8392 -136873 -170032 -178371 -120893 -13702 -143630 163929
17789B66356O8519c59688G8284J62185b64141q9306A08146L0949a39107b244G4476
$$ 266356 334875 -359688 78284 240469 -264141 -353447 108146 139095 -139107 -2244 74476
17777D83992c5482A82565o4259a05894k8609D920i7495B31907c1337B34299B2060
$$ 483992 -35482 182565 118306 -105894 -134503 4920 -97495 231907 -31337 234299 22060
17765E8779a77266k70724B30257N1998j31415b329j29174C8944a11441B25370
$$ 58779 -177266 -447990 230257 282255 150840 -2329 -131503 38944 -111441 225370
17754a95460H7783J41815a25585A6963J82648c59056A64971K5605K1925c03105
$$ -195460 87783 229598 -125585 16963 199611 -359056 164971 190576 212501 -303105
17743A8151P8046O2783c59316A59531R6283D8565b481B17486N3305a7278B42649
$$ 18151 96197 158980 -359316 159531 255814 48565 -2481 217486 270791 -17278 242649
17731a43756C3561J00281Q0781D7852f368l62322J64851L8108C8071K3511e1429
$$ -143756 33561 133842 214623 47852 -6368 -368690 -203839 -165731 38071 61582 -51429
17719C0335a08551O839J2498A27201e9566A7132R3604h2646A26759E4167A3625
$$ 30335 -108551 -101712 -89214 127201 -59566 17132 110736 -82646 126759 54167 13625
17707A813K4204d55121F1921N2392b5591j66775B03975F2853k4825c11666f1788
$$ 1813 26017 -455121 61921 114313 -25591 -192366 203975 62853 38028 -311666 -61788
17695a2315o9101o7330H2577o804n028c61859A85628H4027k1479J1445Q6237b0078
$$ -12315 -81416 -148746 82577 75773 70745 -361859 185628 84027 62548 73993 160230 -20078
17682A28023i3702B45511E1230J28239J78914A33634a50466H0175a73026B41294
$$ 128023 -93702 245511 51230 179469 358383 133634 -150466 80175 -173026 241294
17671H0645a63367C70264b5536A55666P6776C4144L8039c7163p5750A17489e1771
$$ 80645 -163367 370264 -25536 155666 232442 34144 72183 -37163 -112913 117489 -51771
17659C14914b15388A01573K3513c6876D40453b18688F4591g075A26073c18355
$$ 314914 -215388 101573 125086 -36876 440453 -218688 64591 -7075 126073 -318355
17648b29152B94498A07914L1134a54604B0413g2018k18803A67421f4402D8131
$$ -229152 294498 107914 139048 -154604 20413 -72018 -290821 167421 -64402 48131
17637a7963B36525a07215m769j98855R4301C7204d6570A87144b00932J9774A81922
$$ -17963 236525 -107215 -111984 -310839 -216538 37204 -46570 187144 -200932 -181158 181922
17625c15761a12210j5475c4795F1156J26401P2849A0700R5593K36241A46394p1449
$$ -315761 -112210 -127685 -34795 61156 187557 260406 10700 106293 342534 146394 74945
17614G4945L63300j4620f4393m433a2374j32278R35B42220a55929B48992a07113
$$ 74945 438245 423625 -64393 -68826 -12374 -144652 -143717 242220 -155929 248992 -107113
17602b35827A94180E6044L10473j20997a927j85283B00358B6765J22822a87376
$$ -235827 194180 56044 366517 245520 -1927 -187210 200358 26765 149587 -187376
17591a19173j7967k2968C9168M9787A620N3681h2307E0282a4365A00508g5719
$$ -119173 -137140 -160108 39168 88955 1620 55301 -82307 50282 -14365 100508 -75719
17579B56723c9723A12605k8830a2517j74282Q609A05217Q4807J63456a25618P273
$$ 256723 -39723 112605 83775 -12517 -186799 -178190 105217 190024 353480 -125618 -118345
17568a18345n7717A28465b81524g908j73078C61505D595K10398c7795j41589D87512
$$ -118345 -176062 128465 -281524 -7908 -180986 361505 4595 214993 -37795 -179384 487512
17556A42820k9767c04555a36084A30755F0708a21784A47915b30771D4794j3473
$$ 142820 113053 -304555 -136084 130755 60708 -121784 147915 -230771 44794 31321
17546C1321d9077C3797K78159m1305K34095k29412A28136h0688D9000J31748a20189
$$ 31321 -49077 33797 311956 270651 504746 275334 128136 -80688 49000 180748 -120189
17534b1506l76329I6028a04539j77906B01238i9053A02723j8699a47056I2111
$$ -21506 -397835 96028 -104539 -282445 201238 -99053 102723 84024 -147056 92111
17523D4112K67959a97457C56291A05046l9842d1323A77645a5120B43140p9991
$$ 44112 312071 -197457 356291 105046 65204 -41323 177645 -15120 243140 163149
17513A63149n8760J18679m8511o4508n1011b15041B98139n8667R7593C2817J52483
$$ 163149 104389 223068 174557 110049 59038 -215041 298139 239472 337065 32817 185300
17502A85300k2853L28994a492B78934b34404n2555A32944a37293B0836R5364J44094
$$ 185300 162447 491441 -1492 278934 -234404 -286959 132944 -137293 20836 116200 260294
17491B60294P9907I4467a59528e7207m7205L7288C42145n9639m1341J23998A49509
$$ 260294 340201 94467 -159528 -57207 -104412 -67124 342145 282506 241165 365163 149509
17479g9427C9077J9554J9508J22827o1064K8596L1294r6814h322j03443C05074
$$ -79427 39077 58631 78139 200966 139902 168498 199792 102978 -8322 -111765 305074
17467B91399e300r7004l30728g2973B59018n3560r7168J21135f5161A13128h2937
$$ 291399 -5300 -102304 -433032 -72973 259018 205458 108290 229425 -65161 113128 -82937
17455A36395J40655K5116J25073j86066J54477j25622F5886L78059J3782A85832
$$ 136395 277050 302166 427239 241173 395650 270028 65886 443945 457727 185832
17444B98141G4791J42325a50437C52961E0534b13301A91897m5355Q3658O1626
$$ 298141 74791 217116 -150437 352961 50534 -213301 191897 146542 230200 291826
17434B91826d7425E116c3785D46395J9177A71250J60966j33705L02650p212j33199
$$ 291826 -47425 5116 -33785 446395 465572 171250 332216 198511 501161 493949 360750
17423C60750I3696J40961i522B87866q8892J81245j08364f1132B10032K7843a73930
$$ 360750 93696 234657 -9522 287866 198974 380219 271855 -61132 210032 237875 -173930
17411D20237L8874A20233b01982B24275m8010b5774m286F06783C02011A44387
$$ 420237 459111 120233 -201982 224275 176265 -25774 -30060 606783 302011 144387
17400A46739J32392B5062q925g7664A85593J31598A36629g6431A63385K50066
$$ 146739 279131 25062 16137 -77664 185593 317191 136629 -76431 163385 413451
17390D13451c78557A70415j1593b36527N7031A80589F8803i7298C11936p2256
$$ 413451 -378557 170415 158822 -236527 -179496 180589 68803 -97298 311936 239680
17380B39680j08630K0234K03590I0372J19525b39019B45763k9207P5402e8460
$$ 239680 131050 151284 354874 90372 209897 -239019 245763 216556 291958 -58460
17369D6419d9660B85188B5374c539A61741n4522b39275D09659A53273K94342C5505
$$ 46419 -49660 285188 25374 -3539 161741 107219 -239275 409659 153273 447615 35505
17357B32445F3485M8154L1604J19849q5246B9988j2456d3797C21491J74182d4801
$$ 232445 63485 111639 143243 263092 177846 29988 17532 -43797 321491 495673 -44801
17345b36442C64803c8445k5322M636H8862K69793j52757e5071B22270k9703K4481
$$ -236442 364803 -38445 -63767 -59131 88862 358655 205898 -55071 222270 192567 217048
17334B17048f6208C3213J22346b9487A09214a86971B21467J2442c82958A13664
$$ 217048 -66208 33213 155559 -29487 109214 -186971 221467 233909 -382958 113664
17323E68232C2615J51077r125M6979H8242b06052B31547l3461h9854A40355J78217
$$ 568232 32615 183692 174567 221546 88242 -206052 231547 198086 -89854 140355 318572
17312C18572c9869A71982R3267E8343K9683K34801A21512L4476M3831J10925j09284
$$ 318572 -39869 171982 265249 58343 88026 322827 121512 155988 199819 310744 201460
17301B01460b76592B22872k6769J34459A32519F0944a49310C69219j57819M2881
$$ 201460 -276592 222872 196103 330562 132519 60944 -149310 369219 211400 254281
17291B54281N9854n2318A26415a5023D1836d5933A65548l4083M37457b06215B67076
$$ 254281 314135 261817 126415 -15023 41836 -45933 165548 131465 568922 -206215 267076
17279C04530d8632A39770P2338I9104a30091L4392F40329k72876J10273A33701
$$ 304530 -48632 139770 212108 99104 -130091 -95699 640329 367453 477726 133701
17268I4262O7292F3653J50690q1445M281J06325R2989r3411G7151Q7680E9490
$$ 94262 161554 63653 214343 132898 137179 243504 336493 243082 77151 164831 59490
17256B41770G2781P8938J4042K3746q4496M2341J38144A00501O668K94110k143
$$ 241770 72781 151719 165761 189507 105011 147352 285496 100501 107169 401279 399136
17245C99136K29838p9890a83548D02164q7982p3740J75667A52013K81754B03559
$$ 399136 628974 549084 -183548 402164 314182 240442 416109 152013 433767 203559
17234A47775d2838E02030B00641e4947o0598M373A89145K02819j16148r5439D5348
$$ 147775 -42838 502030 200641 -54947 -115545 -111172 189145 391964 275816 180377 45348
17222D6313k0384Q8506L0174J21100I1936g1974B42525O7648L9675F387N3238
$$ 46313 25929 114435 144609 265709 91936 -71974 242525 310173 349848 6387 59625
17211E9625N4392B9776M56817a11346A11115M25940j37423f4296a6927C73495
$$ 59625 114017 29776 486593 -111346 111115 537055 399632 -64296 -16927 373495
17200A59016J82465j05975g6788A26978K34740L9849m1516c41352C24323A54477
$$ 159016 341481 235506 -76788 126978 361718 401567 360051 -341352 324323 154477
17189B56633J07881r6148M4116H4975K99355A55461J09893L99851c9383C24034
$$ 256633 364514 268366 312482 84975 384330 155461 265354 665205 -39383 324034
17178C4863r771L43694o3819J31600n4469O6046c2325C80729j33214o0096J5334
$$ 34863 25092 368786 304967 436567 382098 448144 -32325 380729 247515 187419 202753
17167B02753K30699E0802K12943M3300M15769C48449L4712O9383a36826C24263
$$ 202753 433452 50802 263745 307045 722814 348449 383161 452544 -136826 324263
17156C01018q0906n7428C1922J75500A00557m7841N3817Q2091K34723A34784L310
$$ 301018 220112 162684 31922 207422 100557 52716 106533 188624 423347 134784 138094
17145A38094J28810P9627h3070B15115K11954r1069a19186B95487J56171o9457
$$ 138094 266904 346531 -83070 215115 427069 336000 -119186 295487 451658 382201
17135C82201N1925J06320M8657A27812K6249D8469j1232J22755A64N38958k41726
$$ 382201 434126 540446 589103 127812 154061 48469 37237 159992 164 539122 297396
17124B97396r4691K44754B00318m3066n5733Q7342D9808L64654J65744g7244D05887
$$ 297396 202705 447459 200318 157252 101519 188861 49808 414462 580206 -77244 405887
17112B85803j06510J13218A29442O6937L0262K0143K00144k17754K66495j41661
$$ 285803 179293 292511 129442 196379 226641 246784 446928 229174 495669 354008
17102C54008P4147R6192k36438P9518j64736J04791C7425N05755A84075L25133
$$ 354008 428155 524347 287909 367427 202691 307482 37425 543180 184075 509208
17092E09208j77389K463j40575N2028N0112J59205B05635M18320o5966A48975
$$ 509208 331819 334282 193707 245735 295847 455052 205635 623955 557989 148975
17081C81166k1792J15656A59303K86653o1584J15874k46129M7820J04986A10596
$$ 381166 359374 475030 159303 445956 384372 500246 254117 301937 406923 110596
17070E05611j06705j26477P1883Q0041l1661j35741Q0245L45861k72739K95469
$$ 505611 398906 272429 344312 424353 392692 256951 337196 683057 410318 705787
17060G05787A22044P81842D05222J16031Q8668j41538q2298L8973J21865J3462
$$ 705787 122044 903886 405222 521253 609921 468383 386085 425058 546923 560385
17050E60385k16826O2658J76060P563k69327K0693k5464J79201j5087J15809J14754
$$ 560385 343559 406217 582277 589840 320513 341206 315742 494943 479856 595665 710419
17039G10419m4102j95648j31127J61959j65767O5890J6160j29738R9850K36800
$$ 710419 666317 470669 339542 501501 335734 401624 417784 288046 387896 624696
17029F24696J4282j94270M58140k46688J99020k38045C07468K77104j17664K37171
$$ 624696 638978 444708 902848 656160 855180 617135 307468 584572 466908 704079
17019G04079j4325k03953K3468K5698J1564J6253J21320j28782k0333K45590M1686
$$ 704079 689754 485801 509269 534967 546531 562784 684104 555322 534989 780579 822265
17008H22265j0055k28531J15802R3953j24172R6959l0988j12557J29911j5138
$$ 822265 812210 583679 699481 793434 669262 766221 735233 622676 752587 737449
16998G37449j32469j45128L68838l51589K65945j56335m9078L93094l17139N19989
$$ 737449 604980 459852 828690 477101 743046 586711 537633 930727 613588 1133577
16988A133577m93133m6714L03497j09123k15480Q7123J62199K555j26461k01640
$$ 1133577 640444 593730 897227 788104 572624 659747 821946 824501 698040 496400
16978D96400M71791l77903N07010l57522J5146j4547N0156J68877K1802K9521
$$ 496400 968191 590288 1097298 739776 754922 740375 790531 959408 981210 1010731
16968A010731O414Q4063k33216J33869m78351M52316J7358j89174K88101m41056
$$ 1010731 1017145 1101208 867992 1001861 523510 975826 993184 804010 1092111 651055
16958F51055K82548K79224l84128J20902L85461o21417M54828J09058k68433L9590
$$ 651055 933603 1212827 828699 949601 1335062 713645 1168473 1277531 1009098 1048688
16948A048688K26565k70657L49729m18342q3459K35092j6389j78399K3499M94841
$$ 1048688 1275253 1004596 1354325 935983 852524 1087616 1071227 892828 916327 1411168
16938A411168l76857p5880J43461N7082l25340L34839J06209l66296M88862k04111
$$ 1411168 1034311 958431 1101892 1158974 833634 1168473 1274682 908386 1397248 1193137
16928A193137L6388k2300L58323j31633k69144k23791L97208l5109J18932J6637
$$ 1193137 1229525 1207225 1565548 1433915 1164771 940980 1338188 1303079 1422011 1438648
16918A438648k79101L78607m39617K09629Q0875n416J26461J0396M56542o67415
$$ 1438648 1159547 1538154 1098537 1308166 1389041 1383625 1510086 1520482 1977024 1309609
16908A309609J78642k49615K51751l32356O22819j87877L109J02599n4515j20787
$$ 1309609 1488251 1238636 1490387 1158031 1780850 1592973 1596082 1698681 1644166 1523379
16898A523379K00108N3036k24625J24745n6400j09224J78823M23816J08737m97011
$$ 1523379 1723487 1776523 1551898 1676643 1620243 1511019 1689842 2113658 2222395 1725384
16888A725384j12835N09711q5082k39943J51132K5276L33791n73039J62238K13224
$$ 1725384 1612549 2122260 2037178 1797235 1948367 1973643 2307434 1734395 1896633 2109857
16878B109857K14019p99763Q28974j18626j26398n4147J06552M16131J26516l92875
$$ 2109857 2323876 1524113 2353087 2234461 2108063 2053916 2160468 2576599 2703115 2310240
16868B310240L54932m76107J94235J28646q9476L30826k21336M6557J64881L24070
$$ 2310240 2665172 2189065 2383300 2511946 2422470 2753296 2531960 2578517 2743398 3067468
16858C067468k31197Q4339k53386L23864l14531O2283M15114j5485J42981l32999
$$ 3067468 2836271 2920610 2667224 2991088 2676557 2738840 3153954 3138469 3281450 2948451
16848B948451K02531Q3927P2471j75434J28188J33717j38391L02633N80663m58360
$$ 2948451 3150982 3234909 3307380 3131946 3260134 3393851 3255460 3558093 4138756 3680396
16838C680396j0928K37423k4803L37677k74199J44606J93434l14589O21868j97507
$$ 3680396 3669468 3906891 3882088 4219765 3945566 4090172 4283606 3969017 4590885 4393378
16828D393378J42211j5500j49789K58916L42031j66815L92460k39864K32476M32579
$$ 4393378 4535589 4520089 4370300 4629216 4971247 4804432 5196892 4957028 5189504 5622083
16818E622083k19488l3031L83207L3817l7729j25188R8392K84384L80445j71550
$$ 5622083 5402595 5369564 5752771 5786588 5748859 5623671 5722063 6006447 6386892 6215342
16808F215342L00585M26167P4612Q4776M12992j16219m09191R26037k16336L83289
$$ 6215342 6515927 6942094 7016706 7101482 7514474 7398255 6989064 7915101 7698765 8082054
16798H082054L41223j76743O05380O2858L68747p1315K24706J11268O45542L9123
$$ 8082054 8423277 8246534 8851914 8914772 9283519 9212204 9436910 9548178 10193720 10232843
16788A0232843k223M71288K72783M01791O09954j42190O39201M58866L46227K88728
$$ 10232843 10230620 10701908 10974691 11376482 11986436 11844246 12483447 12942313 13288540 13577268
16778A3577268J77371M97774O38894M94888L67148M89402O99929M18799J018974
$$ 13577268 13754639 14252413 14891307 15386195 15753343 16242745 16942674 17361473 18380447
16769A8380447K61926J227983O47409K49806J226877M99553J002338R99077J028071
$$ 18380447 18642373 19870356 20517765 20767571 21994448 22494001 23496339 24495416 25523487
16760B5523487J028514J222996J005459J469342R65206J406485J791551J422959
$$ 25523487 26552001 27774997 28780456 30249798 31215004 32621489 34413040 35835999
16752C5835999J693549J551960J880110K251652K188918K583230K311523K789093
$$ 35835999 37529548 39081508 40961618 43213270 45402188 47985418 50296941 53086034
16744E3086034K683965L524138L529057L126290M018828L821060M239180M854634
$$ 53086034 55769999 59294137 62823194 65949484 69968312 73789372 78028552 82883186
16736H2883186M882660N388363N862122N865379O417815O636616O906993P194443
$$ 82883186 87765846 93154209 99016331 104881710 111299525 117936141 124843134 132037577
16728A32037577Q000471P251023P810807P740484P183161O793286O193557N515893
$$ 132037577 140038048 147289071 155099878 162840362 170023523 176816809 183010366 188526259
16720A88526259M556294L250877K296018R92497k72588k203184k678778m089773
$$ 188526259 193082553 196333430 198629448 199621945 199349357 197146173 194467395 190377622
16712A90377622n336696o220556o457097p134972q017155p603613p620674p350033
$$ 190377622 185040926 178820370 172363273 165228301 157211146 149607533 141986859 134636826
16704A34636826p913295p333912o871934o548818o144176n596687o085255m806909
$$ 134636826 126723531 119389619 112517685 105968867 99824691 94228004 88142749 83335840
16696H3335840n113923m070390m267167m174731l568094l515043k902945k941641
$$ 83335840 78221917 74151527 69884360 65709629 62141535 58626492 55723547 52781906
16688E2781906l058231k425750k507465k475514j738687k243304j432230j571798
$$ 52781906 49723675 47297925 44790460 42314946 40576259 38332955 36900725 35328927
16680C5328927j649352j531306j578395j303378j063809j194412j306599r04317
$$ 35328927 33679575 32148269 30569874 29266496 28202687 27008275 25701676 24797359
16672B4797359q60060j240745p94626p54322m97544r30198p93028n57757m21159
$$ 24797359 23937299 22696554 21901928 21147606 20650062 19719864 18926836 18369079 17947920
16663A7947920m32508j070592n92480k90640o81571j43896p60915j50292n35950
$$ 17947920 17515412 16444820 15852340 15561700 14880129 14736233 13975318 13825026 13289076
16654A3289076n09062k00655j83670r27832l62449l10104J41738m93000l90140
$$ 13289076 12780014 12579359 12395689 11467857 11105408 10795304 10937042 10444042 10053902
16645A0053902m06555l29087K33064o10446P0108l44516j07313o68764k37175
$$ 10053902 9647347 9318260 9551324 8940878 9010986 8666470 8559157 7890393 7653218
16636G653218K70612l14353m09537N9621L0651p50010O34430o71298l96428L09269
$$ 7653218 7923830 7609477 7199940 7259561 7290212 6540202 7174632 6503334 6106906 6416175
16626F416175k01870J03871l54825j38997L03168m49272o21730J56384q7154M21
$$ 6416175 6214305 6318176 5963351 5824354 6127522 5678250 5056520 5212904 5125750 5126171
16616E126171n57512K70839l58725J70361O2471j3422k11637N0927l61973j20651
$$ 5126171 4568659 4839498 4480773 4651134 4713605 4700183 4488546 4539473 4177500 4056849
16606D056849l7473Q3613k25353Q1505j19377j26274Q0472k17964l83489M2968
$$ 4056849 4019376 4102989 3877636 3959141 3839764 3713490 3793962 3575998 3192509 3235477
16596C235477L89074m08580K6500K37803k56078k21624q3755L02072k81519j08525
$$ 3235477 3624551 3215971 3242471 3480274 3224196 3002572 2918817 3220889 2939370 2830845
16586B830845l670k23090J15262k10509L60977k04336O4028j59288J16578R104
$$ 2830845 2827175 2604085 2719347 2508838 2869815 2665479 2729507 2570219 2686797 2695901
16576B695901l06042p6084J95685l30608K30698k6780J44805k57470R946K68808
$$ 2695901 2389859 2313775 2509460 2178852 2409550 2382770 2527575 2270105 2280051 2548859
16566B548859k02812j91290k28308N57356j53403j4392k88201j6671Q7774k13420
$$ 2548859 2346047 2154757 1926449 2483805 2330402 2316010 2027809 2011138 2098912 1885492
16556A885492j52142K94882k54270J11385k96419J32360N6822j31992J23784m6665
$$ 1885492 1733350 2028232 1773962 1885347 1588928 1721288 1778110 1646118 1769902 1723237
16546A723237J91750k38393j59101K29360j09218L9859J01078k26369L3529N7884
$$ 1723237 1914987 1676594 1517493 1746853 1637635 1677494 1778572 1552203 1585732 1643616
16536A643616r2570L0584j30121k15018M47634m32920L65120j12904N6098o13239
$$ 1643616 1551046 1581630 1451509 1236491 1684125 1251205 1616325 1503421 1559519 946280
16526I46280O7353N64477l80305K7991j47631J05785J546k70004M65249l60700
$$ 946280 1013633 1578110 1197805 1225796 1078165 1183950 1185496 915492 1380741 1020041
16516A020041k35651M65069j3754K35123l50457J62821k25761J84134k43684J38572
$$ 1020041 784390 1249459 1235705 1470828 1120371 1283192 1057431 1241565 997881 1136453
16506A136453l14591K9119M08227o0360m82836K65891r2653J2028K68431j56583
$$ 1136453 821862 850981 1259208 1198848 716012 981903 889250 901278 1169709 1013126
16496A013126J32622m57108L38675j98845K47755n6892J17950k42939o0337K62575
$$ 1013126 1145748 688640 1027315 828470 1076225 1019333 1137283 894344 834007 1096582
16486A096582n00236L06437j54340k47270L25679o938K37559k07983L32941J7100
$$ 1096582 596346 902783 748443 501173 826852 819914 1057473 849490 1182431 1199531
16476A199531j87652k48819R581N8935K80681l44122J34668j75569q1660J16697
$$ 1199531 1011879 763060 772641 831576 1112257 768135 902803 727234 645574 762271
16466G62271Q8821j86416j02949n8480j68478N44607m6899j94975k2830k14992
$$ 762271 851092 664676 561727 503247 334769 879376 832477 637502 614672 399680
16456C99680M80373l71382K70291l19211K58312K14913D37189L19521k14677L18042
$$ 399680 880053 508671 778962 459751 718063 932976 437189 756710 542033 860075
16446H60075j04120K2972P1199l33355J17692K10971j57158j08810k60013L34952
$$ 860075 755955 778927 850126 516771 634463 845434 688276 579466 319453 654405
16436F54405B75202K93198J54140k40052Q0570M0010J70521A40146L85430r7067
$$ 654405 275202 568400 722540 482488 563058 603068 773589 140146 525576 428509
16426D28509q6537L81246J11810m2314j45884q0226K85926B98382M90500P6890
$$ 428509 341972 723218 835028 792714 646830 566604 852530 298382 788882 865772
16416H65772j20603j04901k18903L34158C19729L32513J26186B26018K70395M37285
$$ 865772 745169 640268 421365 755523 319729 652242 778428 226018 496413 933698
16406I33698D11162M6874K95273j72786k74355J05027J64489J09222J267j68546
$$ 933698 411162 458036 753309 580523 306168 411195 575684 684906 686173 517627
16396E17627A51521M41003l0451j36740N0098K0041A59559R2255J20263J36989
$$ 517627 151521 592524 562073 425333 475431 495472 159559 251814 372077 509066
16386E09066j31177J86403J9909k59554L83744j69769B51013L02880J6046F8261
$$ 509066 377889 564292 584201 324647 708391 538622 251013 553893 569939 68261
16375B25921q0941K3560L24638K12846j60211K05266J291C60343A65381P7894
$$ 225921 144980 168540 493178 706024 545813 751079 752370 360343 165381 243275
16365B43275R8250c9064E51673B55208Q0616q6268J42113j59105M4000o3852K14017
$$ 243275 341525 -39064 551673 255208 335824 249556 391669 232564 276564 212712 426729
16354D26729B1396M67986j50644k229L35448B6774R4504K28108K06093B50598
$$ 426729 21396 489382 338738 336509 671957 26774 121278 349386 555479 250598
16343F98045b16975C31815A05324M32135k47445p5766a89867B14986K22138q200
$$ 698045 -216975 331815 105324 537459 290014 214248 -189867 214986 437124 428924
16333D28924B09749K9399J54835L3943k02473F9249a2950C84145J1152G4566L65663
$$ 428924 209749 239148 393983 427926 225453 69249 -12950 384145 395297 74566 440229
16322D40229A58170O63446I9931J51612a1103B78140n2802J55728j55888R5052
$$ 440229 158170 821616 99931 251543 -11103 278140 225338 381066 225178 320230
16312C20230A51254J89110A24127K99444d1298B0524K55056J1047j26719m0815
$$ 320230 151254 340364 124127 423571 -41298 20524 275580 286627 159908 119093
16302A19093P6998k8549J41374a90406A76203J33355N6867A06281K02453Q0846
$$ 119093 196091 167542 308916 -190406 176203 309558 366425 106281 308734 389580
16292C89580K06228A812L42445J13941E1086a70649B90111L4365P0515A77436
$$ 389580 595808 1812 344257 458198 51086 -170649 290111 324476 394991 177436
16281g4039r9356C04651o6479g3621C08080F2454a0998D10741j90904b4474B55257
$$ -74039 -173395 304651 238172 -73621 308080 62454 -10998 410741 219837 -24474 255257
16269D99737b6190A18004L41414C6656K14687D8283P5627K78951N0483J2663g926
$$ 499737 -26190 118004 459418 36656 251343 48283 123910 402861 453344 466007 -7926
16257A55109J80522i7340c1037j32275D5201M21419j19455R5401k0880k06234
$$ 155109 335631 -97340 -31037 -163312 45201 466620 347165 442566 421686 215452
16247B15452h792D1904N04118A19851m8163b8871A55088J88429f912I7538J32656
$$ 215452 -8792 41904 546022 119851 71688 -28871 155088 343517 -6912 97538 230194
16236B30194f8448A97737r6813K60516B0107a76641A11409N7882K9682K34876
$$ 230194 -68448 197737 100924 361440 20107 -176641 111409 169291 198973 433849
16226D33849k00099R4618J04537a50114E3764d9804A60904n4310K13182L5583
$$ 433849 233750 328368 432905 -150114 53764 -49804 160904 106594 319776 355359
16216C55359e8907B63400P5768a70199A17075J02729k202c418A72370j3884C9304
$$ 355359 -58907 263400 339168 -170199 117075 219804 217602 -3418 172370 158486 39304
16204A0348M7774K31333r1296J2149n9777L3433k0464a01177E9418J70345K05905
$$ 10348 58122 289455 198159 210308 150531 183964 163500 -101177 59418 229763 435668
16193D35668A31970J59200b075D3244J39202g1030C88013J38675D713a01189B39225
$$ 435668 131970 291170 -2075 43244 182446 -71030 388013 526688 4713 -101189 239225
16181A36983a88672j37787A2130d0302a4215C6366K92091k7450A04073J44903
$$ 136983 -188672 -326459 12130 -40302 -14215 36366 328457 301007 104073 248976
16171B48976d162r7208A75799K83978a0727k6068j21563B27514J13958c07288
$$ 248976 -4162 -101370 175799 459777 -10727 -36795 -158358 227514 341472 -307288
16160B99124j32772Q1966H9469g3020D80815A43719b77005B72878h3360E9770
$$ 299124 166352 248318 89469 -73020 480815 143719 -277005 272878 -83360 59770
16149G3327E017J80434A2552h3365k6588k00103h4671k7062A99921J53195a09400
$$ 73327 5017 185451 12552 -83365 -109953 -310056 -84671 -111733 199921 353116 -109400
16137A9232R5623E3515I60K19738M3086C0863J32503B9606f7646j4728k3229C06634
$$ 19232 114855 53515 960 220698 263784 30863 163366 29606 -67646 -82374 -105603 306634
16124B20838B7106b32407D15M43635j13230A39943A886a67001f337J957n456A61606
$$ 220838 27106 -232407 415 444050 330820 139943 1886 -167001 -6337 -4380 -9836 161606
16111a10873k3820A75516a94964A07231B2505K12754E8210O4699b06366j4967
$$ -110873 -134693 175516 -194964 107231 22505 235259 58210 122909 -206366 -221333
16101b21333B77108b73071A54970a20984j11911B8920b34120C5178d32030D8384
$$ -221333 277108 -273071 154970 -120984 -232895 28920 -234120 35178 -432030 48384
16090a41136A68200f0997A2204a01910A031a30787q0746E6460a80458M8436f5182
$$ -141136 168200 -60997 12204 -101910 1031 -130787 -211533 56460 -180458 -132022 -65182
16078g3569j01684A30385a44654e8539A79657G1512M7098b78169K0319e1138j28465
$$ -73569 -175253 130385 -144654 -58539 179657 71512 118610 -278169 -257850 -51138 -179603
16067a79603d5943j32172j9556E911b1379A39438e4532n5715M7298A80280a50170
$$ -179603 -45943 -178115 -197671 5911 -21379 139438 -54532 -110247 -62949 180280 -150170
16055I0812O6120J67502m7758a68940N3598A6033M0339A9574b83995B39286h9094
$$ 90812 156932 324434 276676 -168940 -115342 16033 56372 19574 -283995 239286 -89094
16043g7662E6038k1420K4913c2014A42485c8737J6187D3671Q3289A503a40556
$$ -77662 56038 34618 59531 -32014 142485 -38737 -22550 43671 126960 1503 -140556
16031a20489e8112A07711E2759L49476a95419A04858B4693J36465b67088P0873
$$ -120489 -58112 107711 52759 402235 -195419 104858 24693 161158 -267088 -196215
16021a96215Q9864A3658h3827B00554c6993p1689C2360M7610J30959h5268B96890
$$ -196215 -106351 13658 -83827 200554 -36993 -108682 32360 79970 210929 -85268 296890
16009A4294O5771b90277a02689A46611b10207R0641R831l596M7771m65883I0955
$$ 14294 80065 -290277 -102689 146611 -210207 -119566 -109735 -113331 -65560 -531443 90955
15997d2121A46371I798a26102d3728A26377m3093R9304c68847A77991P5354H6226
$$ -42121 146371 9798 -126102 -43728 126377 83284 182588 -368847 177991 253345 86226
15985G8814b97451j7891B065K55226M15109e0564F2417c9827B9537i5081j41139
$$ 78814 -297451 -315342 2065 257291 672400 -50564 62417 -39827 29537 -95081 -236220
15974b36220O1175h7051a3872m7826H4058e285j41597D16512b98670C5826b32563
$$ -236220 -175045 -87051 -13872 -61698 84058 -5285 -146882 416512 -298670 35826 -232563
15962A15660J4591J72410F7121b0220D34398F9017O4636d7958n7183I2261J50755
$$ 115660 130251 302661 67121 -20220 434398 69017 133653 -47958 -105141 92261 243016
15951B43016G0804N094C3047b18682e4931D0022b14033O5063e3532q8191k06307
$$ 243016 70804 75898 33047 -218682 -54931 40022 -214033 -148970 -53532 -141723 -348030
15940c48030J51348A34544M46a08870n8385A7681M8061j2758a11372j37647Q2961
$$ -348030 -196682 134544 134990 -108870 -167255 17681 65742 52984 -111372 -249019 -166058
15929a66058f9348b6338B05169j597c94610I3297b62025A36384a3777B8322H495
$$ -166058 -69348 -26338 205169 203572 -394610 93297 -262025 136384 -13777 28322 8495
15917C41909b87519R4269i2374k1527J081B84508f822k55131A49105b18028O5746
$$ 341909 -287519 -193250 -92374 -113901 -112820 284508 -6822 -261953 149105 -218028 -152282
15906a52282H0510l499c1900m934B6950a28263j60946I0183b53304N434A38587
$$ -152282 80510 77011 -31900 -36834 26950 -128263 -289209 90183 -253304 -247870 138587
15894d9513m05456J49494B37838l3746H6873J21815a34505A65848J754B1406a05398
$$ -49513 -454969 -305475 237838 204092 86873 208688 -134505 165848 167602 21406 -105398
15882A18907a18067e7362B46861d15396G7714j7880a32086k36689g9277Q710k53086
$$ 118907 -118067 -57362 246861 -415396 77714 59834 -132086 -368775 -79277 -70567 -323653
15871c23653J44754q5211C42784h944I2629a21413B8042N613L269g5966L0318
$$ -323653 -178899 -264110 342784 -8944 92629 -121413 28042 33655 36924 -75966 -45648
15860d5648q7070j1754A39835g6381L1F2901a19387b8005C3690c5150G5025q330
$$ -45648 -132718 -144472 139835 -76381 -76350 62901 -119387 -28005 33690 -35150 75025 66695
15848F6695A4847m412a9147D3943Q0520i8100J3685j79004D2957b44839a14197
$$ 66695 14847 10435 -19147 43943 124463 -98100 -84415 -263419 42957 -244839 -114197
15836h9158l91007i3218A71434b35191j40604A48155d9346D1446e2126B73013
$$ -89158 -480165 -93218 171434 -235191 -375795 148155 -49346 41446 -52126 273013
15825d97169A0881R6260b329A735J00771K83361A21740B2066K92903H0520M04561
$$ -497169 10881 107141 -2329 1735 102506 385867 121740 22066 314969 80520 485081
15814D85081a12718c2677q2129j25588c1964l35764a14924G8324h2748m3683A55867
$$ 485081 -112718 -32677 -114806 -240394 -31964 -367728 -114924 78324 -82748 -126431 155867
15802A4523J60423b9242q939k37486H5943a07452A63163g9031B09253a34632e7536
$$ 14523 174946 -29242 -38181 -275667 85943 -107452 163163 -79031 209253 -134632 -57536
15790A62169D0988a02152A05422l7009a81522F82a32452C0187e9929j02705f7316
$$ 162169 40988 -102152 105422 68413 -181522 682 -132452 30187 -59929 -162634 -67316
15778a20425A1810K13903d29553a74321I6168J82091d4674A96080n1709b47259
$$ -120425 11810 225713 -429553 -174321 96168 278259 -44674 196080 144371 -247259
15767b45173B1682K98596F9758M6104a7402l92648A82545K6180b06947j97706
$$ -245173 21682 320278 69758 115862 -17402 -410050 182545 208725 -206947 -404653
15757d04653G2865g3630A25593c3794G282J49674c16037E185L0423Q8936K5406
$$ -404653 72865 -73630 125593 -33794 7282 156956 -316037 5185 35608 124544 149950
15746A49950o199P063a06832j2210A00595J6021c9297A0658J72090a71132l4784
$$ 149950 143751 150814 -106832 -119042 100595 116616 -39297 10658 182748 -171132 -205916
15735b05916b4217D11079D399a99459E1368a31970k4004C9645d213k2124E7756
$$ -205916 -24217 411079 4399 -199459 51368 -131970 -155974 39645 -4213 -26337 57756
15723c71825c1058L93B30122e40324A33225a55370a9698A49305j7050J03418a06092
$$ -371825 -31058 -30665 230122 -540324 133225 -155370 -19698 149305 132255 235673 -106092
15711G0729d67334G6316a27994k14504P7390a20822F4466e920l13202i5624B4822
$$ 70729 -467334 76316 -127994 -342498 -265108 -120822 64466 -5920 -319122 -95624 24822
15699h4554L294n337A42059a07062B23728F0154J58081D61c0635B94183H7739
$$ -84554 -81260 -86597 142059 -107062 223728 60154 218235 461 -30635 294183 87739
15687A97412H0a0324j27711O1276I2777f159H0756d6088C60358H5914b80347h1748
$$ 197412 80 -10324 -138035 -76759 92777 -6159 80756 -46088 360358 85914 -280347 -81748
15674e1537k03709A55323J0659a45570A34546J43712A6115b04346c6677q5286
$$ -51537 -255246 155323 165982 -145570 134546 278258 16115 -204346 -36677 -121963
15664a21963C80916a89722B5836e22554a64055p1290e5090j09544c1106B27170
$$ -121963 380916 -189722 25836 -522554 -164055 -235345 -55090 -164634 -31106 227170
15653B37146I4798h194F8025a30432L3578K7517l243A92282m8347c3163j71263
$$ 237146 94798 -8194 68025 -130432 -96854 -69337 -72580 192282 143935 -33163 -204426
15642b04426O1638k03128I5362a50898B0588O4781K12180g3257J5285O673A05854
$$ -204426 -142788 -345916 95362 -150898 20588 85369 297549 -73257 -57972 -51299 105854
15630A35040a08785L8911D3682K5669a39676A042a69729b0187A76590e7236F2074
$$ 135040 -108785 -69874 43682 69351 -139676 1042 -169729 -20187 176590 -57236 62074
15618c06138B54012A17661f1415B09989b31249l1858D6204c65911a82598A44257
$$ -306138 254012 117661 -61415 209989 -231249 -263107 46204 -365911 -182598 144257
15607B5332c97209J8732A84420c46194A65808F6745M1197a63925j48896i0962
$$ 25332 -397209 -378477 184420 -346194 165808 66745 107942 -163925 -312821 -90962
15596a96848e8453j52080q4684L7167A56554L6438D2900K50369C301O0815i9848
$$ -196848 -58453 -210533 -295217 -258050 156554 192992 42900 293269 3301 64116 -99848
15584A72636B0231J0448L4535e6231B53498a71653A3901c7944k35788J9464c8253
$$ 172636 20231 30679 65214 -56231 253498 -171653 13901 -37944 -273732 -254268 -38253
15572A2393F175b89447J43216c5598B15402c42723a0276o0200E8815A0717a63960
$$ 12393 6175 -289447 -146231 -35598 215402 -342723 -10276 -70476 58815 10717 -163960
15560e2815j9074A08002b59182r852B99648r0511l4867n0892i5181M3027o8226
$$ -52815 -71889 108002 -259182 -269034 299648 209137 174270 123378 -95181 -52154 -120380
15549a20380K7795o444A29472a26829j88628R8845K3014R0169j48182D35023k14276
$$ -120380 -92585 -99029 129472 -126829 -315457 -216612 -193598 -103429 -251611 435023 220747
15538B20747I9944f252k8088k01631J9527m6463C7816b65146g262C1219b01120
$$ 220747 99944 -6252 -34340 -235971 -216444 -262907 37816 -265146 -7262 31219 -201120
15526b5534k51135E6022b97734B24049a34108K064B71087E3032c1868C5662J51096
$$ -25534 -276669 56022 -297734 224049 -134108 -132044 271087 53032 -31868 35662 186758
15515A86758C744J67150A8402a2424A15515a50352q4451a7134k592o2725I4600
$$ 186758 3744 170894 18402 -12424 115515 -150352 -234803 -17134 -19726 -82451 94600
15503A6340O8393K29130E6030g04A40971J43966e5456B34192b17583A0219K17230
$$ 16340 84733 313863 56030 -704 140971 284937 -55456 234192 -217583 10219 227449
15492B27449C9910P6505c1913k86584A99883p8271b17148L1289C2488J6692J16843
$$ 227449 39910 116415 -31913 -318497 199883 121612 -217148 -185859 32488 49180 166023
15481A66023k8236b05768A87875d1288l8118K275C2207K23654k512P0677C4196
$$ 166023 137787 -205768 187875 -41288 -79406 -77131 32207 255861 253349 324026 34196
15469F5635o195R2559e9857o5230q042A87576C6006i1703B16441f6813A18592
$$ 65635 59440 151999 -59857 -125087 -133129 187576 36006 -91703 216441 -66813 118592
15457B58819H449b32776h525f79k0531d546D1645b06041A6984p198M0876a12041
$$ 258819 8449 -232776 -8525 -679 -21210 -4546 41645 -206041 16984 9786 50662 -112041
15444E8700J59290b2256A00410B0086J90416g6178l38628A88789J33426a49403
$$ 58700 217990 -22256 100410 20086 210502 -76178 -414806 188789 322215 -149403
15433b02676B3696g033E0843O5853J78269A42070a45157j00228G9245K2299D8960
$$ -202676 23696 -7033 50843 116696 294965 142070 -145157 -245385 79245 101544 48960
15421b43896A131J00352b12029k9137A48447m0167c3612B2208J5065a36780Q559
$$ -243896 1131 101483 -212029 -241166 148447 108280 -33612 22208 37273 -136780 -128221
15410a28221C2059a80277j50754a11974A54913J93507A6150J91768f7568A07260
$$ -128221 32059 -180277 -331031 -111974 154913 348420 16150 207918 -67568 107260
15399A5817h3625K3479k61159a49257c1361B4115K0200a41325k70219C98659a82209
$$ 15817 -83625 -60146 -321305 -149257 -31361 24115 44315 -141325 -411544 398659 -182209
15387a05470c5231o3491A44891a2137k76974B93219r9027b29844m4196C52059
$$ -105470 -35231 -98722 144891 -12137 -289111 293219 194192 -229844 -274040 352059
15376c99593f70l43113a11403A34233f9197p5208J0348r4237D31249A63785m7914
$$ -399593 -670 -343783 -111403 134233 -69197 -144405 -134057 -228294 431249 163785 115871
15365A15871h1277j4399B33375D7617f3639q7853j38758B73220a45191B00502
$$ 115871 -81277 -95676 233375 47617 -63639 -151492 -290250 273220 -145191 200502
15354A88931a74260B9555b2724B4698K55484G9848Q8366g226B26820A4562L53292
$$ 188931 -174260 29555 -22724 24698 280182 79848 168214 -7226 226820 14562 367854
15343C67854a05504k3721D98109b04068A54057f4279m1712A7967L8861k2549b21511
$$ 367854 -105504 -129225 498109 -204068 154057 -64279 -105991 17967 56828 34279 -221511
15331H0894C1109J26028a44296B66488a23190C70416a17305A82437e9832j8090
$$ 80894 31109 157137 -144296 266488 -123190 370416 -117305 182437 -59832 -77922
15321g7922k7327r6172A08781a76300D02144A66170F3225A4104c89526c7678D7788
$$ -77922 -105249 -201421 108781 -176300 402144 166170 63225 14104 -389526 -37678 47788
15309g9360B03631c07027a49128B15822G5492a7322j11575L4617n18104C67961
$$ -79360 203631 -307027 -149128 215822 75492 -17322 -128897 -94280 -612384 367961
15298A71145G2935d3361m4222d225j0797A627J2442a2136A33792b37928f7212
$$ 171145 72935 -43361 -87583 -4225 -15022 1627 14069 -12136 133792 -237928 -67212
15286b97535A87334I2418K6145d26010f3121A01074L2167a8619A75688o6252C8333
$$ -297535 187334 92418 118563 -426010 -63121 101074 133241 -18619 175688 109436 38333
15274a39058f5655j3120b9069j45262d5068B43444l6651a80596B33570I1546J23838
$$ -139058 -65655 -78775 -29069 -174331 -45068 243444 206793 -180596 233570 91546 215384
15263B15384A02092P4409a13214c3044D35873k03081p6896a6078A34081J87530
$$ 215384 102092 176501 -113214 -33044 435873 232792 155896 -16078 134081 321611
15253C21611j25553L18620k23671A7148e601j45070J5403D00347a43723b0195
$$ 321611 196058 514678 291007 17148 -5601 -150671 -135268 400347 -143723 -20195
15242a78678A47635F6614J57083r2228n0185L9813a92039G1887B8758K98883G7131
$$ -178678 147635 66614 223697 131469 81284 121097 -192039 71887 28758 327641 77131
15230C82599j02357h4641j54560B35675G8300c06032a01553j7127D1899L3426
$$ 382599 280242 -84641 -239201 235675 78300 -306032 -101553 -118680 41899 75325
15220G5325a83213B26814i8721j84982A54295D1390O9490h5067H0364f686o6818
$$ 75325 -183213 226814 -98721 -283703 154295 41390 110880 -85067 80364 -6686 -73504
15209g3504p0015A88338L7846a99988A4059R7892h9663j12625A47048K1832N2932
$$ -73504 -143519 188338 226184 -199988 14059 111951 -89663 -202288 147048 168880 221812
15198B21812a32196D07725E6235i732A77525l8496K4597J28215H36L8809K4959
$$ 221812 -132196 407725 56235 -9732 177525 139029 163626 291841 836 39645 64604
15187F4604a29704C04528n0368f8960A6445M88526B2805a40578m3395B18773a87991
$$ 64604 -129704 304528 254160 -68960 16445 504971 22805 -140578 -183973 218773 -187991
15175d1653k5030a8135B68471b26639Q6759C27877A07209J96948a0995A34520
$$ -41653 -66683 -18135 268471 -226639 -139880 327877 107209 304157 -10995 134520
15164a73659N4681A51264m3267b09501o0181C94297C6499a7373B39152J24472
$$ -173659 -118978 151264 107997 -209501 -269682 394297 36499 -17373 239152 363624
15154C63624C0481J12402l5654c33080A74142J5274m8590F4155l968a27873b9845
$$ 363624 30481 142883 107229 -333080 174142 189416 140826 64155 60187 -127873 -29845
15142I5828K44549j52356k0495K85718E1768K29524E1529b2185m2297p2316F275
$$ 95828 340377 188021 167526 453244 51768 281292 51529 -22185 -64482 -136798 6275
15130B79281A7472a70456A62410c74230E25262E1411K91515o0752J04605m6697
$$ 279281 17472 -170456 162410 -374230 525262 51411 342926 282174 386779 340082
15120C40082J1714A41136J1501Q2549E720L31701E6702j5265A2132J18041c36349
$$ 340082 351796 141136 152637 235186 5720 337421 56702 41437 12132 130173 -336349
15108B41809K7320a02419D4609L016a02771A37645b04096I7027J30859b35787
$$ 241809 269129 -102419 44609 47625 -102771 137645 -204096 97027 227886 -235787
15097A11960P9374b29882r3073a34096F4983b6050H1667a22159A26284M645N8793
$$ 111960 191334 -229882 -322955 -134096 64983 -26050 81667 -122159 126284 130929 189722
15086A89722Q1827D9758a81452A98799G6229J64108j4961l7283J62960A18892
$$ 189722 271549 49758 -181452 198799 76229 240337 225376 188093 351053 118892
15075C6233c8031B56390j15244B4741J09680J89488A30461J64489n7733a23837
$$ 36233 -38031 256390 141146 24741 134421 323909 130461 294950 237217 -123837
15064A03226N4871K0073p5729a65223B43341J40704A20333b42551A61478m2579
$$ 103226 158097 178170 102441 -165223 243341 384045 120333 -242551 161478 118899
15054A18899k1395B6736B32J62487j8748D3486c40903A40514f7486A87467k3984
$$ 118899 97504 26736 232 162719 143971 43486 -340903 140514 -67486 187467 163483
15043A63483L69398A98443l5871J35182b5169B61259J34917K6255C2543L85196
$$ 163483 532881 198443 162572 297754 -25169 261259 396176 422431 32543 417739
15033D17739j84026p7782k8289K80140j81961D1160J36467J20987B7581O9322
$$ 417739 233713 155931 127642 407782 225821 41160 177627 298614 27581 96903
15023I6903M70716A24047P9206K03013j37646h4850C40318a36775a9487B96667
$$ 96903 567619 124047 203253 406266 268620 -84850 340318 -136775 -19487 296667
15012D07999A33479J66954n919O486A30124J66536O0406B363L88979J30558H7357
$$ 407999 133479 300433 294514 301000 130124 296660 357066 2363 391342 521900 87357
15000A07199J02227M75227A40026K27794j60151a6904B32182P4439A41119K09235
$$ 107199 209426 684653 140026 367820 207669 -16904 232182 306621 141119 350354
14990C50354H5799K25103a14092A00379J22389m2619a16044C9355K22753I9845
$$ 350354 85799 310902 -114092 100379 222768 180149 -116044 39355 262108 99845
14979B12464c15035d1314B45525m9689J89887F1227L55959F0403J05773a83848
$$ 212464 -315035 -41314 245525 195836 385723 61227 417186 60403 166176 -183848
14968A42927J8795K22369C7751N3641L41797A41104J48079Q9325n0959J42688
$$ 142927 161722 384091 37751 91392 433189 141104 289183 378508 327549 470237
14958D70237B05271E2192L13778N7900j12546p8356o3191O7190D0319K62839A35183
$$ 470237 205271 52192 365970 423870 311324 232968 169777 236967 40319 303158 135183
14946B25453G5516J21395o8823J91448J14452j68602K68140r7649A58727K24712
$$ 225453 75516 196911 128088 319536 433988 265386 533526 435877 158727 383439
14936C83439p7149b63500B25540b31533B34308F1255J57770P2057K34011j30051
$$ 383439 306290 -263500 225540 -231533 234308 61255 219025 291082 525093 395042
14926C95042J37048l3692G8971J36009D0797Q1983M0858K6872J31546A32898M18687
$$ 395042 532090 498398 78971 214980 40797 122780 163638 190510 322056 132898 551585
14915E51585q8171B23490j10525K90400j78740J40734K7239I5395O7568K55091
$$ 551585 463414 223490 112965 403365 224625 365359 392598 95395 162963 418054
14905D18054K06863j49769N7067k3331B26652j09538L36936o8280A49826L65118
$$ 418054 624917 475148 532215 508884 226652 117114 454050 385770 149826 514944
14895E14944B12153L85765A98784L81578A89882P7268O1772A338N47563k27456
$$ 514944 212153 597918 198784 580362 189882 267150 328922 1338 548901 321445
14885C21445K37211A94584J47343j19435M6659q3850K44262K15874j11948O5893
$$ 321445 558656 194584 341927 222492 269151 185301 429563 645437 533489 599382
14875E99382k01806j92671N0175J03260N514J45911K9708p0058l037H2198L84685
$$ 599382 397576 204905 255080 358340 363854 509765 539473 469415 466378 82198 466883
14864D66883F5776N21931o0661A52434P7998J96690k9252J75756B65851j7693
$$ 466883 65776 587707 527046 152434 230432 427122 397870 573626 265851 248158
14854B48158L61191b1267D19271A73175K17741j46712K13595A89590m856L78961
$$ 248158 609349 -21267 419271 173175 390916 244204 457799 189590 184734 563695
14844E63695O2084j36848K04302B14115J11224K77582J63546j18729D6880K41558
$$ 563695 625779 488931 693233 214115 325339 602921 766467 647738 46880 288438
14834B88438l9727K94475M8402Q8394a1718C57331K15103j46710K63736l26037
$$ 288438 248711 543186 591588 679982 -11718 357331 572434 425724 689460 363423
14824C63423M79183k48937M1448j33443K8353m6699J21939k67217K44458j08172
$$ 363423 842606 593669 635117 501674 530027 483328 605267 338050 582508 474336
14814D74336k3002j84888O0063O4884Q1103o9092P4215k26798J58242L61975l83656
$$ 474336 451334 266446 326509 391393 472496 403404 477619 250821 409063 771038 387382
14803C87382J76160B15610M46312B71582J57942j2299L82458l12409A88361K21435
$$ 387382 563542 215610 661922 271582 429524 417225 799683 487274 188361 409796
14793D09796K9685K4760J33380j24334K11682l23340L84919k0247k18450B41605
$$ 409796 439481 464241 597621 473287 684969 361629 746548 726301 507851 241605
14782G06950M0268o3340j03008J31844O9106k26997j05860j86159J24285A40698
$$ 706950 747218 683878 580870 712714 781820 554823 448963 262804 387089 140698
14771E08545K02651K8979J14100J29620k20721j82716J48299o0978j06837j58292
$$ 508545 711196 740175 854275 983895 763174 580458 728757 667779 560942 402650
14761D02650J92545j588k72154M11618J28404j83606N38k51235N51966j42323
$$ 402650 595195 593607 321453 733071 861475 677869 678407 427172 979138 836815
14751H36815j56534J0699m3972j54160J85070J72232r7588B96563N19062k35455
$$ 836815 680281 690980 647008 492848 677918 850150 752562 296563 815625 580170
14741E80170l4193Q8597L2443j00852L57949j77481J17862J42746k73531M0982
$$ 580170 545977 634574 667017 566165 924114 746633 864495 1007241 733710 774692
14731G74692J56568l62208K31768r7003J260N3001J37657L0244L8040k41119L8886
$$ 774692 931260 569052 800820 703817 705077 758078 895735 925979 964019 722900 761786
14720G61786L8581K87806k52921p2351j501k14004k09293K99642m128J60387J7633
$$ 761786 800367 1088173 835252 762901 761400 547396 338103 637745 633617 794004 811637
14709H11637k18594L84099j68456l29513K78163L12220k42986M32134F11096L22080
$$ 811637 593043 977142 808686 479173 757336 1069556 826570 1258704 611096 933176
14699I33176J81889k90845P1565J72508j87655k49629K85096N87520o50518M0465
$$ 933176 1115065 824220 895785 1068293 880638 631009 916105 1503625 853107 893572
14689H93572J04990K12322k54423J15221m0394r3148m30232Q72027l46790K23815
$$ 893572 998562 1210884 956461 1071682 1031288 938140 507908 1379935 1033145 1256960
14679A256960m34260L5041L30978k35812M18667o44933Q1682J82763M33555m85203
$$ 1256960 822700 857741 1188719 952907 1371574 726641 808323 991086 1424641 939438
14669I39438L22282k22005J70672l13517K71389l57616L82551j3944n02671O21006
$$ 939438 1261720 1039715 1210387 896870 1168259 810643 1193194 1179250 676579 1297585
14659A297585k44246j53184K3979J81314Q9987J0414N0996Q5426k45392j11009
$$ 1297585 1053339 900155 924134 1105448 1195435 1205849 1256845 1342271 1096879 985870
14649I85870o4534N96421n01251M3268L88340m2121j24869k41915L07701j16878
$$ 985870 921336 1517757 1016506 1059774 1448114 1405993 1281124 1039209 1346910 1230032
14639A230032k76525M36205j18424J63453m69259N19957M7930m07036J13738O8929
$$ 1230032 953507 1389712 1271288 1434741 965482 1485439 1533369 1126333 1240071 1309000
14629A309000j57395K55006n3079j29739N19650l78803J17174n0874R1544l8909
$$ 1309000 1151605 1406611 1353532 1223793 1743443 1364640 1481814 1430940 1522484 1483575
14619A483575K18253k70622m5050L15101j54848o7397P3952O4974M5492l10687
$$ 1483575 1701828 1431206 1386156 1701257 1546409 1479012 1552964 1617938 1663430 1352743
14609A352743N6887l555Q4721j49591P60505k14645k88071o8213J54371J28454
$$ 1352743 1409630 1406075 1490796 1341205 2101710 1887065 1598994 1530781 1685152 1813606
14599A813606J90473l30524p321O056q665j6041K43836J11576k41247j09589L46206
$$ 1813606 2004079 1673555 1666234 1672290 1663625 1647584 1891420 2002996 1761749 1652160 1998366
14588A998366l66349k4130N67459k86777k11034K20945j06144L17971j41252J50415
$$ 1998366 1632017 1607887 2175346 1888569 1677535 1898480 1792336 2110307 1969055 2119470
14578B119470k3931n9235q4809L8045J55335j17954O369O3804O4066j26278L80640
$$ 2119470 2095539 2036304 1951495 1989540 2144875 2026921 2033290 2097094 2161160 2034882 2415522
14567B415522J31551J95045l55665J18364J42385j48757M2750L51339J5974N1331
$$ 2415522 2547073 2742118 2386453 2504817 2647202 2498445 2541195 2892534 2908508 2959839
14557B959839K29322k36418O43219K59171P4441J86378M65395J536777J986094
$$ 2959839 3189161 2952743 3595962 3855133 3929574 4115952 4581347 6118124 8104218
14548H104218L924916Q020887J5595217N526289j8594249A0040781m524233j758399
$$ 8104218 12029134 20050021 35645238 41171527 22577278 10040781 5516548 3758149
14540C758149o43238o62350K42602k03742l51089j59218p653L02450o2527N2136
$$ 3758149 3114911 2452561 2695163 2491421 2140332 1981114 1973461 2275911 2213384 2265520
14530B265520J3458r9028L12821K19647q9061M1031l99559L06759k34787M69238
$$ 2265520 2278978 2179950 2492771 2712418 2623357 2664388 2264829 2571588 2336801 2806039
14520B806039l01259L43841q3675n4566j30589q148L82918j85083N1649L75822
$$ 2806039 2504780 2848621 2764946 2710380 2579791 2571643 2954561 2769478 2821127 3196949
14510C196949n37171N14641j71090P6033j02192L10386k07039j16267M16357r6975
$$ 3196949 2659778 3174419 3003329 3079362 2977170 3287556 3080517 2964250 3380607 3283632
14500C283632K87954j92057k94625L80266k69419N5724L65885l96121J66110K20564
$$ 3283632 3571586 3379529 3084904 3465170 3195751 3251475 3617360 3221239 3387349 3607913
14490C607913K32261l79343K84358n4363P2265N6329R7826K3267k53723M1168
$$ 3607913 3840174 3460831 3745189 3690826 3763091 3819420 3917246 3940513 3686790 3727958
14480C727958M28279n5058k6766m7975J7889L21629n1929O1403j77306J46788
$$ 3727958 4156237 4101179 4074413 4026438 4044327 4365956 4314027 4375430 4198124 4344912
14470D344912L4188K71043k14480L11431j18983K29062o7090j76761M83839m30957
$$ 4344912 4379100 4650143 4435663 4747094 4628111 4857173 4790083 4613322 5097161 4666204
14460D666204M96686k9513O7234Q460O194j07643R8338q515L42610j49264p4684
$$ 4666204 5162890 5133377 5200611 5209071 5215265 5107622 5205960 5197445 5540055 5390791 5316107
14449E316107K00567Q7721Q551J39765N19560k60528K35544q694n6092K72836
$$ 5316107 5516674 5604395 5612946 5752711 6272271 6011743 6247287 6238593 6182501 6455337
14439F455337l5563j97192K85925J74935j05466O2612k12004L34705O6402K24848
$$ 6455337 6419774 6222582 6508507 6683442 6577976 6640588 6428584 6763289 6829691 7054539
14429G054539j2522N74736r5120p3181J59469k26482J57083N6837j17274M80895
$$ 7054539 7042017 7616753 7521633 7448452 7607921 7381439 7538522 7595359 7478085 7958980
14419G958980L57064K08295j09343L03091p9216J30237K80493K84876P0782J52544
$$ 7958980 8316044 8524339 8414996 8718087 8638871 8769108 9049601 9334477 9405259 9557803
14409I557803k44443L16400K57164L3317N54148j29640P9515j4360K67567L15709
$$ 9557803 9313360 9629760 9886924 9920241 10474389 10344749 10424264 10409904 10677471 10993180
14399A0993180l3218O21473n9157J67655N2805L23811l39739P29521j12839J81831
$$ 10993180 10959962 11581435 11522278 11689933 11742738 12066549 11726810 12456331 12343492 12525323
14389A2525323K84950O26509N3443O9979M27204J90175L51574J5055L60121R4304
$$ 12525323 12810273 13436782 13490225 13560204 13987408 14177583 14529157 14544212 14904333 14998637
14379A4998637M70302M22653J81074P04815j42815J93930O26358J03709O47301
$$ 14998637 15468939 15891592 16072666 16777481 16634666 16828596 17454954 17558663 18205964
14370A8205964K32700J37638L63323N39077R09710k10340L01096P32416L08092
$$ 18205964 18438664 18576302 18939625 19478702 20388412 20178072 20479168 21211584 21519676
14361B1519676N89640M94789K23416P79982L71154N40270N88032L87992R62077
$$ 21519676 22109316 22604105 22827521 23607503 23978657 24518927 25106959 25494951 26457028
14352B6457028M22339O80016L43602R61555O57279O56048Q15217J175633L60140
$$ 26457028 26879367 27559383 27902985 28864540 29521819 30177867 30993084 32168717 32528857
14343C2528857R60024R68915Q95934Q73538J058747Q33924J530039Q96546J023289
$$ 32528857 33488881 34457796 35353730 36227268 37286015 38119939 39649978 40546524 41569813
14334D1569813J368243J116968J333494J148891J424398J443532J381681K136289
$$ 41569813 42938056 44055024 45388518 46537409 47961807 49405339 50787020 52923309
14326E2923309J304452J874296K047263J788177K028514K050793K541726K181400
$$ 52923309 54227761 56102057 58149320 59937497 61966011 64016804 66558530 68739930
14318F8739930K396671K913702K615545L103220L048796K891708L757032L066548
$$ 68739930 71136601 74050303 76665848 79769068 82817864 85709572 89466604 92533152
14310I2533152M129593L765320M153698M799686M567389M911477N208042N778365
$$ 92533152 96662745 100428065 104581763 109381449 113948838 118860315 124068357 129846722
14302A29846722N848668N837778O947696O992367P187882P885076Q157582Q764981
$$ 129846722 135695390 141533168 148480864 155473231 162661113 170546189 178703771 187468752
14294A87468752R451620R610235J0570388J0726104J1638553J1770740J2233510
$$ 187468752 196920372 206530607 217100995 227827099 239465652 251236392 263469902
14287B63469902J3021106J3914490J3790480J4482731J4251371J4870893J5006233
$$ 263469902 276491008 290405498 304195978 318678709 332930080 347800973 362807206
14280C62807206J4958970J4478240J4314678J3626339J2438373J1255459R436147
$$ 362807206 377766176 392244416 406559094 420185433 432623806 443879265 453315412
14273D53315412O716362L363530J428078R61031R40184k130778l145549n021242
$$ 453315412 460031774 463395304 464823382 465784413 466724597 464593819 461448270 456427028
14265D56427028p023852r038590j1057161j2168770j3510821j4187740j4860644
$$ 456427028 449403176 440364586 429307425 417138655 403627834 389440094 374579450
14258C74579450j5246794j5165897j5871082j4672566j5093226j3912256j3759891
$$ 374579450 359332656 344166759 328295677 313623111 298529885 284617629 270857738
14251B70857738j3310918j2464490j1955602j1414992j0754367j0396399r329722
$$ 270857738 257546820 245082330 233126728 221711736 210957369 200560970 191231248
14244A91231248r048070q305781q218435p604671p167934o910323o111716o074616
$$ 191231248 182183178 173877397 165658962 158054291 150886357 143976034 137864318 131789702
14236A31789702n660714n577441n006628m643548m611005l681477m107000m314688
$$ 131789702 126128988 120551547 115544919 110901371 106290366 102608889 98501889 94187201
14228I4187201l341513l592188l733126k695398k967911k766087k856771k486292
$$ 94187201 90845688 87253500 83520374 80824976 77857065 75090978 72234207 69747915
14220F9747915k191182k117525k467729j845819k282729j744788j398067j836333
$$ 69747915 67556733 65439208 62971479 61125660 58842931 57098143 55700076 53863743
14212E3863743j440768j897752j849890j266739q09730j215827r70687k126607
$$ 53863743 52422975 50525223 48675333 47408594 46598864 45383037 44412350 42285743
14204D2285743r53583j621246n32335r41212p65804j149991j305984n63695p34829
$$ 42285743 41332160 39710914 39178579 38237367 37471563 36321572 35015588 34451893 33717064
14195C3717064j372597n36226n95948j039925n85216q28477q34193k96218r58126
$$ 33717064 32344467 31808241 31212293 30172368 29587152 28758675 27924482 27628264 26670138
14186B6670138p67770k19969p15460p52673l83736o73067k81509o52770l23718
$$ 26670138 25902368 25682399 24966939 24214266 23830530 23157463 22875954 22223184 21899466
14177B1899466p60651l84085j24559o10551m55725o4097o43971k87747l18712
$$ 21899466 21138815 20754730 20630171 20019620 19563895 19499798 18855827 18568080 18249368
14168A8249368l01918n91754p9043p72563L18255o72229j99063n47771j7678j16921
$$ 18249368 17947450 17355696 17276653 16504090 16822345 16150116 15951053 15403282 15385604 15268683
14158A5268683j75947n29867j69784n32036J66728o15510j10000L1218k16115
$$ 15268683 15092736 14562869 14393085 13861049 14027777 13412267 13302267 13333485 13117370
14149A3117370q37279K79351R0916k76552n68944j08879p4644j54690m57675l82123
$$ 13117370 12280091 12559442 12650358 12373806 11804862 11695983 11621339 11466649 11008974 10626851
14139A0626851K53504k37681m0635k67261k90329N9539K05578k70663n54767K56734
$$ 10626851 10880355 10642674 10602039 10334778 10044449 10103988 10309566 10038903 9484136 9740870
14129I740870J24064o10603k27109K94039l61247k38159j33702k5676M0515k44233
$$ 9740870 9864934 9254331 9027222 9321261 8960014 8721855 8588153 8562477 8602992 8358759
14119H358759k94405R3934J74318k68463j16691k69437K15522k74525j79609k11135
$$ 8358759 8064354 8158288 8332606 8064143 7947452 7678015 7893537 7619012 7439403 7228268
14109G228268J26666n9482n94237M75049l16161J4215k40540L26932o53764J77006
$$ 7228268 7354934 7295452 6701215 7176264 6860103 6874318 6633778 6960710 6306946 6483952
14099F483952O4254l69474j11114O1656J45570k14085L8704O1588j55063m6675
$$ 6483952 6548206 6178732 6067618 6129274 6274844 6060759 6099463 6161051 6005988 5959313
14089E959313k10373n89204L11183J03488k59859J08237o8650J7252m80037L06831
$$ 5959313 5748940 5159736 5470919 5574407 5314548 5422785 5354135 5371387 4891350 5198181
14079E198181p4143O6292k75374R7773p9499J6651L1645j63360Q5030l45670L14914
$$ 5198181 5124038 5190330 4914956 5012729 4933230 4949881 4981526 4818166 4903196 4557526 4872440
14068D872440k40435n64969J59596K51682L71341n81243p4392M03215m29116j49826
$$ 4872440 4632005 4067036 4226632 4478314 4849655 4268412 4194020 4597235 4168119 4018293
14058D018293N9927L73594l76012l5292l32460J70321M5038J9065J20538m40495
$$ 4018293 4078220 4451814 4075802 4040510 3708050 3878371 3923409 3942474 4063012 3622517
14048C622517l5790L36594n42441O0682N35504m80328j4606J724k1630m2361K74673
$$ 3622517 3586727 3923321 3380880 3441562 3977066 3496738 3482132 3483856 3462226 3419865 3694538
14037C694538m94583P7284l63829L17002K5333J14234l74470M18623m69776L71796
$$ 3694538 3199955 3277239 2913410 3230412 3255745 3369979 2995509 3414132 2944356 3316152
14027C316152l62410j23049J45905K17996j73926l44834K30693k16783L27936
$$ 3316152 2953742 2830693 2976598 3194594 3020668 2675834 2906527 2689744 3017680
14018C017680m94603j69156M01705n7114n1060L26152l04106j91979o451J4200
$$ 3017680 2523077 2353921 2755626 2698512 2647452 2973604 2669498 2477519 2471068 2485268
14008B485268L541o6737p5749l50100N15080k8678k86886k28567R44482p63370
$$ 2485268 2488809 2422072 2346323 1996223 2511303 2482625 2195739 1967172 2911654 2148284
13998B148284K63599p8648J41761m77485J97565j34087J51803P00314q6810J758912
$$ 2148284 2411883 2333235 2474996 1997511 2195076 2060989 2212792 2913106 2826296 4585208
13988D585208K739374P080188J5255432J3176764j4411410j2903617n996208k185867
$$ 4585208 7324582 14404770 29660202 42836966 28425556 15521939 9525731 7339864
13980G339864j962058o84969p42977j12048k65214n10624J23515M7956k43859
$$ 7339864 5377806 4692837 3949860 3837812 3572598 3061974 3185489 3233445 2989586
13971B989586j41775J6258k02850j21772k68467M72014n12043k06168K07467K14784
$$ 2989586 2847811 2864069 2661219 2539447 2270980 2742994 2230951 2024783 2232250 2447034
13961B447034k75571M02162n65982J24168R7313P796J66662m27824L44937k98281
$$ 2447034 2171463 2573625 2007643 2131811 2229124 2236920 2403582 1975758 2320695 2022414
13951B022414R7261k1296l6233j19608K85297j03168l06442K56441J0010k12172
$$ 2022414 2119675 2098379 2062146 1942538 2227835 2124667 1818225 2074666 2084676 1872504
13941A872504n9581L4277j48338j21556r4288M62736L07540k62568m7968J74848
$$ 1872504 1812923 1847200 1698862 1577306 1483018 1945754 2253294 1990726 1942758 2117606
13931B117606j55657r7562k64823k57768M21804q7038J23695m4136k06755j64586
$$ 2117606 1961949 1864387 1599564 1341796 1763600 1676562 1800257 1756121 1549366 1384780
13921A384780L80341k15239q6616K36657J59780o37510O08015k19322k64174K42983
$$ 1384780 1765121 1549882 1463266 1699923 1859703 1222193 1830208 1610886 1346712 1589695
13911A589695P3251m56629M8242L89838M22107l79173l85297J69840J34222m0582
$$ 1589695 1662946 1206317 1254559 1644397 2066504 1687331 1302034 1471874 1606096 1565514
13901A565514j37971O4889j04783m7262O3567j58783M23146j28908k7295j34305
$$ 1565514 1427543 1492432 1387649 1340387 1403954 1245171 1668317 1539409 1512114 1377809
13891A377809J05074J9271k32513J93594j01138j03461q004j12973N07242m36276
$$ 1377809 1482883 1502154 1269641 1463235 1362097 1258636 1250632 1137659 1644901 1208625
13881A208625K72250k0471m4458l84505M37159l39093j58122N7711N82126k00578
$$ 1208625 1480875 1460404 1415946 1031441 1468600 1129507 971385 1029096 1611222 1410644
13871A410644k4681k77636K39579J31952L6815l82130n7653J5870M20086F68736
$$ 1410644 1385963 1108327 1347906 1479858 1516673 1134543 1076890 1092760 1512846 668736
13860A134449K26402l33349J41206k79402M01692j48481J36404l54319J28504
$$ 1134449 1360851 1027502 1168708 889306 1290998 1142517 1278921 924602 1053106
13851A053106j11663L37993k11401J45762k80148J10027K11562k29388j47491
$$ 1053106 941443 1279436 1068035 1213797 933649 1043676 1255238 1025850 878359
13842H78359J43457O8827P3653m04965j3221J57380M9077J97607p4154K58674
$$ 878359 1021816 1090643 1164296 759331 746110 903490 952567 1150174 1076020 1334694
13832A334694l13401o2668j33416K91715k84709J81200j39629J85688o2231L79773
$$ 1334694 1021293 958625 825209 1116924 832215 1013415 873786 1059474 997243 1377016
13822A377016m93960K42662k21667R8058J21022D68756L91987O1034J79813j73361
$$ 1377016 883056 1125718 904051 1002109 1123131 468756 860743 921777 1101590 928229
13812I28229q3063K94722k71004L06504E53799R9812L54102N558k05625j66986
$$ 928229 845166 1139888 868884 1175388 553799 653611 1007713 1013271 807646 640660
13802F40660L66385l25830K14787k29839J9155K81408m8620r4141K88573l48733
$$ 640660 1007045 681215 896002 666163 685318 966726 918106 823965 1112538 763805
13792G63805J12478j64327Q2636j90774J23123Q2325k42K16567k21337N7322M1307
$$ 763805 876283 711956 794592 603818 726941 809266 809024 1025591 804254 861576 902883
13781I02883n8049j94714K61118j66894j69457L18595k69392L02836k08559L5534
$$ 902883 844834 650120 911238 744344 574887 893482 624090 926926 718367 753901
13771G53901K39921D15766R8453l4246M775Q3646r6503J92054o1124K11615L3832
$$ 753901 993822 415766 514219 479973 484748 568394 471891 663945 602821 814436 848268
13760H48268j53368J78467p1135j40897j02335M41830C77180L29240k38500J16475
$$ 848268 694900 873367 802232 661335 559000 1000830 377180 706420 467920 584395
13750E84395K55466m0031q0695k19532J6953L67780m36280K62763k04850L37889
$$ 584395 839861 799830 719135 499603 516556 884336 448056 710819 505969 843858
13740H43858j43959r3457n4558J62085Q6059j12730k40360J59953M5366K68046
$$ 843858 699899 606442 551884 713969 800028 687298 446938 606891 652257 920303
13730I20303l90043K59072J11464q8583C81280L31492m6493o4284j4741o0984
$$ 920303 530260 789332 900796 812213 381280 712772 666279 601995 587254 526270
13720E26270K59199k28460B75238N2632K38819B82109M35044N8924k20948j69091
$$ 526270 785469 557009 275238 327870 566689 282109 717153 776077 555129 386038
13710C86038L37102k02651B19461L33331j67281A80425L23744j13204J10912K6337
$$ 386038 723140 520489 219461 552792 385511 180425 504169 390965 501877 528214
13700E28214K93599j64949k39081J32746B40407L76095N066n394j51582L06893
$$ 528214 821813 656864 417783 550529 240407 616502 621568 616174 464592 771485
13690G71485n5008l50438q775q5112K36092J57201k61659O4605r5756J77836k09415
$$ 771485 716477 366039 357264 272152 508244 665445 403786 468391 372635 550471 341056
13679C41056J21218J77389O6566J32778h5157F18388J65367A58513K31231J30954
$$ 341056 462274 639663 706229 839007 -85157 618388 783755 158513 389744 520698
13669E20698r7851l6350o2665N25702l39576j78902O4266o8912k4598O5860K12191
$$ 520698 422847 386497 323832 849534 509958 331056 395322 326410 301812 367672 579863
13658E79863q2008J78181F7852M0927L90800J67306P0741C02865J34658r5338
$$ 579863 497855 676036 67852 108779 499579 666885 737626 302865 437523 342185
13648C42185L05492k95522l79J07909j9943L99127B77485K41431q0353k1814j8488
$$ 342185 647677 352155 351776 459685 439742 838869 277485 518916 438563 416749 398261
13637C98261J65545O8770j89205q2640K16970j40442j84331K66028k19624L8682
$$ 398261 563806 632576 443371 360731 577701 437259 252928 518956 299332 338014
13627C38014K89754B65013J85878N7653j8457n4368P2704j43279M21795n073l20452
$$ 338014 627768 265013 450891 508544 490087 435719 508423 365144 786939 781866 461414
13616D61414J09036A82000N79367B92919r8940P4666j21441K31472N1422q1363
$$ 461414 570450 182000 761367 292919 193979 268645 147204 378676 430098 348735
13606C48735A44513J01336J04868J5634P0411K44323D4812K18641k6590L79462
$$ 348735 144513 245849 350717 366351 436762 681085 44812 263453 236863 616325
13596F16325j61672j57459O3242K58365I2459P54672l99078O2042k42079P5808
$$ 616325 454653 297194 360436 618801 92459 847131 448053 510095 268016 343824
13586C43824J12175j57078N30598C75251j29832n0927K35978j37860Q2236j1270
$$ 343824 455999 298921 829519 375251 245419 194492 430470 292610 374846 363576
13576C63576J10062J21506B10411P0803A05138P07305A91225K71146Q5371A93764
$$ 363576 473638 595144 210411 281214 105138 812443 191225 462371 547742 193764
13565C61689K06328j89514l5604K62663k08981O5285j79878K63178K0097k36794
$$ 361689 568017 378503 342899 605562 396581 461866 281988 545166 565263 328469
13555C28469J17257R465j42185O8249d5244E07694j54498P3060j39383J24447
$$ 328469 445726 455191 313006 381255 -45244 507694 353196 426256 286873 411320
13545D11320j86744J946j9376E548N48507k64203J80460O4892k35023J82045j56619
$$ 411320 224576 226522 207146 5548 554055 289852 470312 535204 300181 482226 325607
13534C25607O26I1477M15519j91589J00424A30469M61378A72345J35757h1745
$$ 325607 326233 91477 506996 315407 415831 130469 591847 172345 308102 -81745
13523D07119M200A27830k9372J37515R8267p4488j00557O6357K07232O7512A61951
$$ 407119 411319 127830 98458 235973 334240 259752 159195 225552 432784 500296 161951
13511a14106A57562L2419K5161L78812j62110p6256K79612B64262O4388k6458
$$ -114106 157562 189981 215142 593954 431844 355588 635200 264262 328650 302192
13501C02192K407j03622j1752C1528L94266j56761K03817b602A88030J09303k9434
$$ 302192 304599 200977 189225 31528 425794 269033 472850 -2602 188030 297333 267899
13490B67899K07326A66075O6506H0619L21677j71522F1894O25502k45370A09041
$$ 267899 475225 166075 232581 80619 402296 230774 61894 687396 442026 109041
13479D50400j49131N8917j70389a9233A88436J2095J08001j03615k1480o9063
$$ 450400 301269 360186 189797 -19233 188436 200531 308532 204917 183437 114374
13469A14374M24539A61634K29275m3525n3479d036D04176J64060J1622A72674
$$ 114374 538913 161634 390909 347384 293905 -4036 404176 568236 579858 172674
13458E304O08148C04216n7182J83332a31813A57282d1907a8226F7734K03219j12579
$$ 5304 613452 304216 247034 430366 -131813 157282 -41907 -18226 67734 270953 158374
13447A58374J11213A29995M27020A99722n1950n0168J99072J91798i892k15224
$$ 158374 269587 129995 557015 199722 147772 97604 296676 488474 -9892 -225116
13437b25116B83504Q3002j15695I5510K41466o8645M19533A68486a20771C01955
$$ -225116 283504 366506 250811 95510 336976 268331 687864 168486 -120771 301955
13426A25152L5531A07R3005O0549j9335L79266B16806C1862M63133k15412a41254
$$ 125152 160683 107 93112 153661 134326 513592 216806 31862 494995 279583 -141254
13414A34774f0052F9545K14703j39277M0276A063J84374J69943m3636J90804a64515
$$ 134774 -60052 69545 284248 144971 185247 1063 185437 355380 311744 502548 -164515
13402E26284j35644j65831K9073m7800R5653g3290B65124O0290A49029B5840K3125
$$ 526284 390640 224809 253882 206082 301735 -73290 265124 325414 149029 25840 48965
13391D8965K16831A23881K93522j67905J95211j82775c3371C1233L01426A7207
$$ 48965 265796 123881 417403 249498 444709 261934 -33371 31233 332659 17207
13380C0733O5409a9332C70915h1218B04542j902N1555d5366C51763j72068J0731
$$ 30733 96142 -19332 370915 -81218 204542 202640 254195 -45366 351763 179695 190426
13369A90426N5720j4352L01485j91759K19759F3792L07734A25931I73K60589j1036
$$ 190426 246146 231794 533279 341520 561279 63792 371526 125931 973 261562 250526
13358B50526M6017Q6998I1564L409c0445C78108A01564J29781L51915r8161K12678
$$ 250526 296543 383541 91564 94973 -30445 378108 101564 231345 583260 485099 697777
13347F97777A02828K6516K22321A38636K72737j93635H5020K66512k188o4376
$$ 697777 102828 129344 351665 138636 411373 217738 85020 351532 349344 284968
13337B84968P878q0738j01366K85059n2521J90150k54943A29784O6005M01728
$$ 284968 292846 212108 110742 395801 343280 533430 278487 129784 195789 597517
13327E97517B09212Q6338p5231J37500K6844A33771K38779K09145A27258J9224
$$ 597517 209212 295550 220319 357819 384663 133771 372550 581695 127258 146482
13317A46482k1319E9200K58099N0859m3332K75532j99481A86490B0545e5259C04244
$$ 146482 125163 59200 317299 368158 324826 600358 400877 186490 20545 -55259 304244
13305I93c848B66890j26265L0275K23969A35807J02163j6357L1120j7626i4237
$$ 993 -3848 266890 140625 170900 394869 135807 237970 221613 252733 235107 -94237
13293a06983c5531A15792K22038A37150J15939J01108A34937n0734P103J60630
$$ -106983 -35531 115792 337830 137150 253089 354197 134937 84203 91306 251936
13283B51936J07488a85557D75868k09711a12900A39773b6141B46545l3298a64859
$$ 251936 359424 -185557 475868 266157 -112900 139773 -26141 246545 213247 -164859
13272C5662L31512H2053K08178a8857B37661o7308l3216m2086d5258B54286a07956
$$ 35662 367174 82053 290231 -18857 237661 170353 137137 95051 -45258 254286 -107956
13260A46192P7384A10846J72992n6823J3030O770A22698Q7782b19081A13474N8601
$$ 146192 223576 110846 283838 227015 240045 246815 122698 210480 -219081 113474 172075
13249A72075L117a36635A56610K07249j10752G2030L8056R6358l4739m4189E8947
$$ 172075 175192 -136635 156610 363859 253107 72030 110086 206444 171705 127516 58947
13237A76867a69350B847f8935A70300K87314j39096j05001G0572j319a24729D47996
$$ 176867 -169350 2847 -68935 170300 457614 318518 213517 70572 69253 -124729 447996
13225D82916a50057D40785k02937J57591D47J63979N5678M7332c4808a5860f25
$$ 482916 -150057 440785 237848 395439 447 164426 220104 267436 -34808 -15860 -625
13213A88870m6710E0715L37394A88497D2669L1723L9755k5597a29459n2104B07526
$$ 188870 142160 50715 388109 188497 42669 74392 114147 88550 -129459 -181563 207526
13201b4373G804J1556b2599D93230e7186k9145C44710a27832B00579q8491N1232
$$ -24373 7804 19360 -22599 493230 -57186 -86331 344710 -127832 200579 112088 163320
13190A63320J7338p815L0865N3211b35913A70917D8501L16933a87889A13202n4786
$$ 163320 180658 172843 203708 256919 -235913 170917 48501 365434 -187889 113202 58416
13179E8416L88562F050I16J10450a16059a9048E65387A33937D531J63200n3034
$$ 58416 446978 6050 916 111366 -116059 -19048 565387 133937 4531 167731 114697
13168A14697L43284a54366f321B18469l8798c49370J16593C7966J37487a9378
$$ 114697 457981 -154366 -6321 218469 179671 -349370 -232777 37966 175453 -19378
13157A66428b3101B86378e3691q6693A49296m9454J6860J29544K0565J14713j79489
$$ 166428 -23101 286378 -53691 -140384 149296 99842 116702 246246 266811 381524 202035
13146B02035a0256A6901J52534m1086R0702k0692G9006J39753I4395K6714b07750
$$ 202035 -10256 16901 169435 128349 219051 198359 79006 218759 94395 121109 -207750
13134g4134A21994A3731K9856J18561b09435E9293J12156b11435A77347C4830
$$ -74134 121994 13731 43587 162148 -209435 59293 171449 -211435 177347 34830
13123a14268A42038a38896A38773N544g2588B98233A06893a60929A7408e8162
$$ -114268 142038 -138896 138773 144317 -72588 298233 106893 -160929 17408 -58162
13112B24064h272I3413J11407G0092G198a79868M5570C0801L4732e4711G4655
$$ 224064 -8272 93413 204820 70092 7198 -179868 -134298 30801 65533 -54711 74655
13100C93543I7818K47759a10237J6918B75169h6174C8669J20544c5005C62011
$$ 393543 97818 345577 -110237 -93319 275169 -86174 38669 159213 -35005 362011
13089I092h304D3279L55376a2101p3837C35589H1708f5854k09022G5682i808k66643
$$ 9092 -8304 43279 398655 -12101 -85938 335589 81708 -65854 -274876 75682 -9808 -276451
13077b76451A1113K40805c9442C78900A16303K31316r2575A06977J14050F9620
$$ -276451 11113 251918 -39442 378900 116303 347619 255044 106977 221027 69620
13066C01915J37r0874b41617c3006A37217B315J1782K85192A43268p1111c2787
$$ 301915 302052 211178 -241617 -33006 137217 2315 14097 299289 143268 72157 -32787
13054C33387J42440I3934b6869C59964f0815A02045c4485D24723a09850E44192
$$ 333387 475827 93934 -26869 359964 -60815 102045 -34485 424723 -109850 544192
13043b5328H7536a92236A7098Q3506e5927A2463P9934m2337j4234J33692C3396
$$ -25328 87536 -192236 17098 100604 -55927 12463 92397 50060 35826 169518 33396
13031A23816N6573G9209i9131E0919L5804K03309K02981H5650a8550K296B57974
$$ 123816 180389 79209 -99131 50919 86723 290032 493013 85650 -18550 -16254 257974
13019a2585j61093e9654A01550a11818g743F98h5168m0440r726j08975A18783
$$ -12585 -173678 -59654 101550 -111818 -7743 698 -85168 -125608 -135334 -244309 118783
13007A11684N1263L74896C6805L4921K74901B6949a53102c6201A02500M6303a60698
$$ 111684 162947 537843 36805 71726 346627 26949 -153102 -36201 102500 148803 -160698
12995C58078a78956f3210A92177a74002k08595A51899E6634K34483e1172D0804
$$ 358078 -178956 -63210 192177 -174002 -382597 151899 56634 291117 -51172 40804
12984E9611a75000F07062e9742D4708a539A33009F822J69631H8139C5578i0433
$$ 59611 -175000 607062 -59742 44708 -1539 133009 6822 176453 88139 35578 -90433
12972A617R1458a09156m2714I9138a63475a1209A38682i4797L6020A0320L40561
$$ 1617 93075 -109156 -151870 99138 -163475 -11209 138682 -94797 -58777 10320 350881
12961C50881R7832f6189n7385A06689c6658j12826A84709C2785a13942A69431
$$ 350881 448713 -66189 -123574 106689 -36658 -149484 184709 32785 -113942 169431
12950a55529B81255g239A56514a70425E8474a15631G0526e3835H9170Q4078C8188
$$ -155529 281255 -7239 156514 -170425 58474 -115631 70526 -53835 89170 173248 38188
12938A25252P752L07101a66402r3082A45849a2453A39631a51429B57625a20824
$$ 125252 133004 440105 -166402 -259484 145849 -12453 139631 -151429 257625 -120824
12927b56872A20063Q1258a85760F8192M4787b28535F7882K49060G14b48992b0733
$$ -256872 120063 201321 -185760 68192 112979 -228535 67882 316942 714 -248992 -20733
12915a31411B05799J35288J238j31597q0659D3190P7647c1467A33985K38055A07444
$$ -131411 205799 341087 342325 210728 130069 43190 120837 -31467 133985 372040 107444
12903a74846A99130c5301E4824a12969E5902J77905c836A74375E4080a35858E9407
$$ -174846 199130 -35301 54824 -112969 55902 233807 -3836 174375 54080 -135858 59407
12891E7069J70071d5056D908c539B67972M6021j17156a84939C03199j26393b67430
$$ 57069 227140 -45056 4908 -3539 267972 313993 196837 -184939 303199 176806 -267430
12879a59263k1024d0990A51536O3258b80299R1794k09099h7970E6973J28313C8810
$$ -159263 -180287 -40990 151536 214794 -280299 -188505 -397604 -87970 56973 185286 38810
12867G4057m375a24174a4165j63291c6835F1187i1933j50156a00126k774m0535
$$ 74057 69682 -124174 -14165 -177456 -36835 61187 -91933 -242089 -100126 -102900 -143435
12856a43435e9211P836m1880b1409j52741H5444j9417c3606A73377E2409b53897
$$ -143435 -59211 -51375 -93255 -21409 -174150 85444 66027 -33606 173377 52409 -253897
12844b3405B56912I9388C0422J42153b34501C852c623q760p9929I956e45663E0928
$$ -23405 256912 99388 30422 172575 -234501 3852 -3623 -12383 -92312 9956 -545663 50928
12831A49054a53322C8076L38174j45659I251b07641G1791d09A05896J23513r8310
$$ 149054 -153322 38076 376250 230591 9251 -207641 71791 -409 105896 229409 131099
12820A31099E8344J08199D5342b83778J09121h2928c6864r887n129j60238C9486
$$ 131099 58344 166543 45342 -283778 -174657 -82928 -36864 -46751 -51880 -212118 39486
12808a54309e7371B28815h1426m6863j028B46945l682a26221E7179k2404P3700
$$ -154309 -57371 228815 -81426 -128289 -129317 246945 243263 -126221 57179 34775 108475
12797A08475c1923A91232b20683I5933L14324A9979J02083K41575j22984G8924
$$ 108475 -31923 191232 -220683 95933 410257 19979 122062 363637 240653 78924
12786I6655g5380a0764H5711e4370A03101i4958L3255p6288B25503b63938o9288
$$ 96655 -75380 -10764 85711 -54370 103101 -94958 -61703 -137991 225503 -263938 -333226
12775c33226J03850b1812F666f7768q0420a92I6112L928a9990C40974a0252o4276
$$ -333226 -229376 -21812 6666 -67768 -148188 -192 96112 100040 -19990 340974 -10252 -74528
12763g4528j93281C44977j50500q6477J26552g8521I0300M17360a37846G915L19828
$$ -74528 -267809 344977 194477 108000 234552 -78521 90300 507660 -137846 7915 327743
12752C27743m1776B8351Q6747R2083g0370J1156J4171D2039Q1564j7014P4920
$$ 327743 285967 28351 115098 207181 -70370 -59214 -45043 42039 123603 106589 181509
12741A81509a73233B25068i5387M4656A44471J65069A20554a34586F8587L00042
$$ 181509 -173233 225068 -95387 -50731 144471 309540 120554 -134586 68587 368629
12731C68629b3042p3058B54201j26917n2743J23295e4435j69431a3534B07867
$$ 368629 -23042 -96100 254201 127284 74541 197836 -54435 -223866 -13534 207867
12720a04382B73839M5448g0466o8020G4037J19572F7915l427b5340m7708C0818
$$ -104382 273839 319287 -70466 -138486 74037 193609 67915 64488 -25340 -73048 30818
12708A55104e7660B69133B888K77470j37982L00289A02363M1961L5356H1644J71249
$$ 155104 -57660 269133 2888 280358 142376 442665 102363 144324 179680 81644 252893
12697B52893A09551f6698A37520J73813E7198J80711A04742J36158b3950j08371
$$ 252893 109551 -66698 137520 311333 57198 237909 104742 240900 -23950 -132321
12687a32321B64093A01751C9179J69474n0467B4540Q1898J95368a57568D2846
$$ -132321 264093 101751 39179 208653 158186 24540 106438 301806 -157568 42846
12676b57089B96646j17738g3667D4080P3587b35885A03529N3300i5807A59731
$$ -257089 296646 178908 -73667 44080 117667 -235885 103529 156829 -95807 159731
12665C14761C2229L94618k12351n6052n2589L77598A99709c5991B17719a16245
$$ 314761 32229 426847 214496 158444 105855 483453 199709 -35991 217719 -116245
12654f4002A08160J5269k2736B4902L3123L78610a05581H7549a87980A28848M5654
$$ -64002 108160 123429 100693 24902 58025 436635 -105581 87549 -187980 128848 174502
12643A74502c2393N101M043D7743J49674c3713C25569a22717A97057b3208B0649
$$ 174502 -32393 -27292 -23249 47743 197417 -33713 325569 -122717 197057 -23208 20649
12631D0940K01398M1080a37090f2519B64341K8613j6875h5619K8159F3796L25385
$$ 40940 242338 283418 -137090 -62519 264341 292954 276079 -85619 -57460 63796 389181
12620C89181L5960C0719J61180e5538J0025A38759a63830l2613f2135B08543a73704
$$ 389181 425141 30719 191899 -55538 -45513 138759 -163830 -196443 -62135 208543 -173704
12608B7155d1138D8713k769b29308B58722m0686b6551j46664H4451d3487C13012
$$ 27155 -41138 48713 45944 -229308 258722 218036 -26551 -173215 84451 -43487 313012
12596E6586E372a83276A02456L5497f1837l2823K7764a7456o676k26869a7825
$$ 56586 5372 -183276 102456 137953 -61837 -94660 -66896 -17456 -24132 -251001 -17825
12584d4320N106k95203A39936a46469l3175A90476G4730a1091q548C97021C6997
$$ -44320 -39214 -334417 139936 -146469 -179644 190476 74730 -11091 -19639 397021 36997
12572D877M9904N9453K0115h2741j44298i2696E31267e8454q8510n8051D12974
$$ 4877 54781 114234 134349 -82741 -227039 -92696 531267 -58454 -146964 -205015 412974
12560h7353p7398j8492A12172B3235K08153J65812b08632D42724i5469M6183A49650
$$ -87353 -164751 -183243 112172 23235 231388 397200 -208632 442724 -95469 -49286 149650
12548c32392C59427b39188A04801O091c7206F5053a6077A90727p4974c22913B08343
$$ -332392 359427 -239188 104801 110892 -37206 65053 -16077 190727 115753 -322913 208343
12536c7478j75038l2164R5604A37098b27534i4213j87690E1254J5236J01323b29742
$$ -37478 -212516 -244680 -149076 137098 -227534 -94213 -281903 51254 66490 167813 -229742
12524B71669q1073q5454K46516J08644j12695n5974j31127a63548b7346A33799
$$ 271669 190596 105142 351658 460302 347607 291633 160506 -163548 -27346 133799
12513b37297b2906M909F1450K43635f2886F1786b02450J00752A71979F5137j6438
$$ -237297 -22906 -17997 61450 305085 -62886 61786 -202450 -101698 171979 65137 48699
12502D8699J21011d5703B0021G965N02993k35630C808M54804E1811L5854L36235
$$ 48699 169710 -45703 20021 7965 510958 275328 3808 458612 51811 87665 423900
12491D23900j82564d17153A51670n7768K3805P521q016a78355A51151b02321q6814
$$ 423900 241336 -417153 151670 93902 117707 125228 117212 -178355 151151 -202321 -289135
12480b89135i545A41448i7615B63471a38535E943e2638A7709Q4014b43724A11440
$$ -289135 -9545 141448 -97615 263471 -138535 5943 -52638 17709 101723 -243724 111440
12468B28453I4625d31340a26184A08291a51237O0722F117L6780a31681j2196B26324
$$ 228453 94625 -431340 -126184 108291 -151237 -90515 6117 42897 -131681 -143877 226324
12456C9789a07279k734k41801g9951a3480j75082m4169A1118b13721c6608F3058
$$ 39789 -107279 -110013 -351814 -79951 -13480 -188562 -232731 11118 -213721 -36608 63058
12444a05032B61083n9627a7489B26774a61144p8798A68164N4058F6515i9176K1777
$$ -105032 261083 201456 -17489 226774 -161144 -239942 168164 222222 66515 -99176 -77399
12433g7399m0049C08629j14951h1302B46643a89547A95599a21446A84856e4644
$$ -77399 -117448 308629 193678 -81302 246643 -189547 195599 -121446 184856 -54644
12422a30429j65526G4734a1920j14697J95A09476A4420N7092a50197E4817a16833
$$ -130429 -295955 74734 -11920 -126617 -126422 109476 14420 71512 -150197 54817 -116833
12410G1656c03605D8068a50031r78M9752k39994A17868k1597a14555B60678b906
$$ 71656 -303605 48068 -150031 -151009 -101257 -341251 117868 96271 -114555 260678 -2906
12398h5713p6656A20365a84338d393j74357C8324a20214A12792R5616A2283O8985
$$ -85713 -162369 120365 -184338 -4393 -178750 38324 -120214 112792 208408 12283 81268
12387H1268j8483b4936A91152b25795M7759j4633O6561A98269b77938a8892H3141
$$ 81268 62785 -24936 191152 -225795 -178036 -192669 -126108 198269 -277938 -18892 83141
12375A4842K66180c7997k79027C60924a5159p9000B23184J2948a24633B00476
$$ 14842 281022 -37997 -317024 360924 -15159 -94159 223184 236132 -124633 200476
12364B82507F2913c1231j9035m5951J9128c607D54272b75205C1223b3164G7174
$$ 282507 62913 -31231 -50266 -96217 -77089 -3607 454272 -275205 31223 -23164 77174
12352B63553a24288l709k03816J09031A23170b09585M0127D2916j6804K38349
$$ 263553 -124288 -127997 -331813 -222782 123170 -209585 -169458 42916 26112 264461
12342B64461b31079D8168L1392B5395J294L74535A49553g7075B61442H2736i2306
$$ 264461 -231079 48168 79560 25395 26689 401224 149553 -77075 261442 82736 -92306
12330D85598a27911A53949a68983j59333h2731B42154I7869A5991a76926g0799
$$ 485598 -127911 153949 -168983 -328316 -82731 242154 97869 15991 -176926 -70799
12319A31300b13083A85652n5454J2844g5501n2013a952j9403j75067p3297a6325
$$ 131300 -213083 185652 130198 143042 -75501 -127514 -1952 -21355 -196422 -269719 -16325
12307i8109B3653b13734b5103I4993b17358B00650b9794B42759b86695A52533
$$ -98109 23653 -213734 -25103 94993 -217358 200650 -29794 242759 -286695 152533
12296a08738F6993R1694a38031L3727d6536k32790a0234B47665J05363c42588
$$ -108738 66993 158687 -138031 -104304 -46536 -279326 -10234 247665 353028 -342588
12285c7670I1405b7030H1848h7700C6538L2408a76680E3343e5744E4304M079B0661
$$ -37670 91405 -27030 81848 -87700 36538 68946 -176680 53343 -55744 54304 58383 20661
12272E8279L48990I2446O9497L3649K8844f1996A19474l9324Q1401O5404L0216
$$ 58279 407269 92446 161943 195592 224436 -61996 119474 80150 161551 226955 257171
12261B57171I3542i9116A01385c4296K794C19095a94011E3513a52061d0135j01050
$$ 257171 93542 -99116 101385 -34296 -31502 319095 -194011 53513 -152061 -40135 -141185
12250a41185G1944A1207Q9619R5025a78430C29746I0051Q551g8929N988B23407
$$ -141185 71944 11207 100826 195851 -178430 329746 90051 98602 -78929 -72941 223407
12238g7404k8273A55475i5054C8895M6352P7106J77839A43415B7456K71278F1458
$$ -77404 -105677 155475 -95054 38895 85247 162353 340192 143415 27456 298734 61458
12226B20894n6455c5900B09501J0962K56093r9698m7812j32644K47767b04361
$$ 220894 164439 -35900 209501 220463 476556 376858 329046 196402 444169 -204361
12215B12599h3259p9217D45114A69501N2568L2293Q3959a14353C6881L38084q9786
$$ 212599 -83259 -162476 445114 169501 222069 254362 338321 -114353 36881 374965 285179
12204B85179a70846B21806h3143q3325C31736a23935D03992E6308K53507J38731
$$ 285179 -170846 221806 -83143 -166468 331736 -123935 403992 56308 309815 448546
12194D48546A12223E0025O5397a34028D60727B14944h0029A86547N0977j5530
$$ 448546 112223 50025 115422 -134028 460727 214944 -80029 186547 237524 221994
12184B21994C4065M88889k54052H7716Q005a93702F14737E2431J51387L5600m0099
$$ 221994 34065 522954 268902 87716 95721 -193702 614737 52431 203818 239418 199319
12173A99319H3120J9175h6700l7087a2538n1698q086A01257a68232a4547M670
$$ 199319 83120 102295 -86700 -123787 -12538 -64236 -72322 101257 -168232 -14547 -9877
12162i877I7068a65314A31181i9751B8319K84803A32185l9700J60634a17272B8639
$$ -9877 97068 -165314 131181 -99751 28319 313122 132185 92485 253119 -117272 28639
12150B20101j8656a5664j19012B32546p7905Q5349C5770L63196A90455g2444e955
$$ 220101 201445 -15664 -134676 232546 154641 239990 35770 398966 190455 -72444 -5955
12138B44306J55059B4178Q9452D036a12671A7785J68051b60443J10677A3140K83053
$$ 244306 399365 24178 113630 4036 -112671 17785 185836 -260443 -149766 13140 296193
12127B96193m2295E3332b08382A51892K32460B8392O7264a62465a1435A33250
$$ 296193 253898 53332 -208382 151892 384352 28392 95656 -162465 -11435 133250
12116a54718j11428A03473k1141d0948j61079A49185N9754b89408a37030e8035
$$ -154718 -266146 103473 82332 -40948 -202027 149185 208939 -289408 -137030 -58035
12105C40173j04132E1836a75241C8831b62298E3404H750J93114c1715q6246m5671
$$ 340173 236041 51836 -175241 38831 -262298 53404 8750 201864 -31715 -117961 -163632
12094a63632A90629R2508B6061h0861C4705R0118J4223K14142I7442h8620K1159
$$ -163632 190629 283137 26061 -80861 34705 124823 139046 353188 97442 -88620 -67461
12083f7461A39100J11172I623g0753B46675c16965B2534f1673D5720Q9560c83523
$$ -67461 139100 250272 9623 -70753 246675 -316965 22534 -61673 45720 135280 -383523
12071b9115A24505n2518L61277j12326A2672J51636p3422O14964P23965F12477
$$ -29115 124505 71987 433264 320938 12672 164308 90886 705850 1429815 612477
12060C47356d6607H2143a46793l01956B03065a3940G3324J58984j7491c4604E0127
$$ 347356 -46607 82143 -146793 -448749 203065 -13940 73324 232308 214817 -34604 50127
12048a28308D7472a14028k48357a56526j63281A18136B9963a07972C7917J69955
$$ -128308 47472 -114028 -362385 -156526 -319807 118136 29963 -107972 37917 207872
12038B07872G9941a27076F4392b99997A16996c70244j810c9131B04633f064A77660
$$ 207872 79941 -127076 64392 -299997 116996 -370244 -372054 -39131 204633 -6064 177660
12026A47876a35955j18292I124a63922g6056H7267a27570A18362b09121j49563
$$ 147876 -135955 -254247 9124 -163922 -76056 87267 -127570 118362 -209121 -358684
12016c58684B09532h3294F6026L0931P0495F6570k3373b14472A71954B1332a88812
$$ -358684 209532 -83294 66026 96957 167452 66570 43197 -214472 171954 21332 -188812
12004F7015K15151A6763a02707k56644N2816I0635g1711l3504k13292L6854B34760
$$ 67015 282166 16763 -102707 -359351 -306535 90635 -71711 -105215 -318507 -281653 234760
11992I6424a418C16885A24689a52654M0375k9965A33074J79107g848l6172A17219
$$ 96424 -1418 316885 124689 -152654 -112279 -142244 133074 312181 -7848 -44020 117219
11980B6794J22001E3146a41023M3807G4072k071a25677F9698a82736I16d081A8847
$$ 26794 148795 53146 -141023 -97216 74072 72001 -125677 69698 -182736 916 -4081 18847
11967b53153b7860l74538a33303I0964a49061A70613e01932a96481A73877I960
$$ -253153 -27860 -402398 -133303 90964 -149061 170613 -501932 -196481 173877 9960
11956b5974k97633c77I7498A1283c5886n4972E1309h9768A04104K13636c64488
$$ -25974 -323607 -377 97498 11283 -35886 -90858 51309 -89768 104104 317740 -364488
11944E1266e2763A93130n0072c57813A12750B1021h7338C07283I2267b56002h9894
$$ 51266 -52763 193130 143058 -357813 112750 21021 -87338 307283 92267 -256002 -89894
11932a30881A41982h1307G9174c8114B72315n3568A04796B9156N02620c75377
$$ -130881 141982 -81307 79174 -38114 272315 218747 104796 29156 531776 -375377
11921a74389B31699C8O7199b71460J15812K2325A52159d98975a41549B07932j8919
$$ -174389 231699 38 67237 -271460 -155648 -133323 152159 -498975 -141549 207932 189013
11910A89013c01326A86937a66921d6715m35691b1351k5494q0801p2019A23284
$$ 189013 -301326 186937 -166921 -46715 -482406 -21351 -46845 -127646 -199665 123284
11899a64275j28594K7849L0247A82320D7647a2897k42859K2842j20741e3486n49516
$$ -164275 -292869 -265020 -234773 182320 47647 -12897 -255756 -232914 -353655 -53486 -603002
11888f03002H2466a12581A53126p4212K85788g8423C5342b27280c9163A23279
$$ -603002 82466 -112581 153126 78914 364702 -78423 35342 -227280 -39163 123279
11877B07223a37022A59798C0060a29939N8690I2645L43a41958B65788B0025a69589
$$ 207223 -137022 159798 30060 -129939 -71249 92645 92988 -141958 265788 20025 -169589
11865b68263g2899J0627j26879L3063A7285L9725b94540A92K00328b858B56800
$$ -268263 -72899 -62272 -189151 -156088 17285 57010 -294540 192 200520 -2858 256800
11853a34440F6601O0513d21653A66764b88021p0734A69432a16656d646B77042
$$ -134440 66601 127114 -421653 166764 -288021 -358755 169432 -116656 -4646 277042
11842b29019b2315B6222h3627k0669j37746a02400r2691k52387g8428j28819I9775
$$ -229019 -22315 26222 -83627 -104296 -242042 -102400 -195091 -447478 -78428 -207247 99775
11830e2223k09155B30753D6128b83430g2411j2571m174B60724a16418D042P7873
$$ -52223 -261378 230753 46128 -283430 -72411 -84982 -89156 260724 -116418 4042 81915
11819H1915h7054A84476o9617D7809J43886j8287a23234A66855A2729g8819D7679
$$ 81915 -87054 184476 114859 47809 191695 173408 -123234 166855 12729 -78819 47679
11807A61095J69355i9671E1371b9597D6492b58496B02224E8157e6160p6731a8830
$$ 161095 330450 -99671 51371 -29597 46492 -258496 202224 58157 -56160 -132891 -18830
11795A87276d7443j47522l7466G6678J74530e6804B37911b28262L2184I315m32
$$ 187276 -47443 -194965 -232431 76678 251208 -56804 237911 -228262 -196078 9315 8883
11784H883L0311K72100a33566A99711a19178A4671L73409B0388K71676q8167a9694
$$ 8883 39194 311294 -133566 199711 -119178 14671 388080 20388 292064 203897 -19694
11772a93369j22567B7148b92639A1795b00767m8222A46637j7057b39045b9775
$$ -193369 -315936 27148 -292639 11795 -200767 -248989 146637 129580 -239045 -29775
11761c220F5814a56617B1978b33219A72875m90a74026A0087J41755a31981B32306
$$ -3220 65814 -156617 21978 -233219 172875 172385 -174026 10087 151842 -131981 232306
11749c12616e3600J0091I1456P4659g4304A3051Q128c40092J43259A91712p1421
$$ -312616 -53600 -43509 91456 166115 -74304 13051 21179 -340092 -196833 191712 120291
11738A20291j7520i7699j52203E6075b08030J01496o8586k8999A66978a09079
$$ 120291 102771 -97699 -249902 56075 -208030 -106534 -175120 -204119 166978 -109079
11727f8742A61789M1876c9966D24458a83245E1133a33690I7396J23612g5855C13556
$$ -68742 161789 203665 -39966 424458 -183245 51133 -133690 97396 221008 -75855 313556
11715A13342K13925b7754A01261a55363B70530I3603a19124j1995O0686A49394
$$ 113342 327267 -27754 101261 -155363 270530 93603 -119124 -131119 -70433 149394
11704C73015j34294c0505H4847g6259j55089B21868h9587d489D978J79995e4178
$$ 373015 238721 -30505 84847 -76259 -231348 221868 -89587 -4489 4978 184973 -54178
11692a75410B82700c07661a53136j9807E2199a23234F4808K59928A5252a75331
$$ -175410 282700 -307661 -153136 -172943 52199 -123234 64808 324736 15252 -175331
11681A11028c107F3583d4359k55395A18686r5P2755b7767B4612K54155a84283
$$ 111028 -3107 63583 -44359 -299754 118686 118591 191346 -27767 24612 278767 -184283
11669b63071M3827a5685j36919D6196J0067K55128e0530k22114D50123B16034
$$ -263071 -219244 -15685 -152604 46196 56263 311391 -50530 -272644 450123 216034
11658H8032K0868b15574A3398h1782B81418b50801A55711m794A5486e4344C1882
$$ 88032 108900 -215574 13398 -81782 281418 -250801 155711 150917 15486 -54344 31882
11646b00886i6508B10746g3923A61513h3502E7703K0421a53536j74210i0276B94315
$$ -200886 -96508 210746 -73923 161513 -83502 57703 78124 -153536 -327746 -90276 294315
11634c36466a37242C09245M8230b9077m03820A04401C5520L9675J42394a84442
$$ -336466 -137242 309245 357475 -29077 -432897 104401 35520 75195 217589 -184442
11623f751A87781d11987O6609J20161d0463i992l55527e952A18776e4920j56604
$$ -6751 187781 -411987 -345378 -225217 -40463 -9992 -365519 -5952 118776 -54920 -211524
11612b11524A47276N4876a63050g00G0357e6299b5945j63971B89205g777C43622
$$ -211524 147276 202152 -163050 -700 70357 -56299 -25945 -189916 289205 -7777 343622
11600C8504L7110Q6818b6980A52633o1180f1284j26887O6067l1732b470B32229
$$ 38504 75614 162432 -26980 152633 91453 -61284 -188171 -122104 -153836 -2470 232229
11588h8405A21297C8098G368J70419B1956N6323Q9817J3541a67517L0100J8379
$$ -88405 121297 38098 7368 177787 21956 78279 168096 181637 -167517 -137417 -119038
11577a19038B2884K11338q5576O4918j5214p9642c59173B7852a16904j83891a0162
$$ -119038 22884 234222 148646 213564 198350 118708 -359173 27852 -116904 -300795 -10162
11565D32033j85757h3020C06331d7667n1833F415a72599F4832K40281a8905B67950
$$ 432033 246276 -83020 306331 -47667 -99500 6415 -172599 64832 305113 -18905 267950
11553B66270j29956i9168A63326h9200j87662a7625A48047n0891r207b06240D10568
$$ 266270 136314 -99168 163326 -89200 -276862 -17625 148047 97156 87949 -206240 410568
11541A38934R9441F544K98287o8201A09797a28481B80730o2082q6087J42361j04581
$$ 138934 238375 6544 304831 236630 109797 -128481 280730 218648 132561 274922 170341
11530A70341J6352R3868q8923j1516G3953J05441h0676j53027I2776h5853B6290
$$ 170341 186693 280561 191638 180122 73953 179394 -80676 -233703 92776 -85853 26290
11518A93287R4393k1574H3885a63865B69168M5822A16484K25661i2330B1488a00700
$$ 193287 287680 266106 83885 -163865 269168 314990 116484 342145 -92330 21488 -100700
11506B87722n5553j02351k1802j7059L45131l8922A02526K71202j03416k6336
$$ 287722 232169 129818 108016 90957 436088 397166 102526 373728 270312 243976
11496B43976o3647J33892q4420b10936A74698o5993J25511c07102C8517K20913
$$ 243976 180329 314221 229801 -210936 174698 108705 234216 -307102 38517 259430
11486B59430k542B811e9381B43979p4474c123C28498a24144C45026j52968j2544
$$ 259430 256888 2811 -59381 243979 169505 -3123 328498 -124144 345026 192058 179514
11475A79514B2894Q6700J56402G8978K05349p8608K3364O733A16942k2447a04717
$$ 179514 22894 109594 265996 78978 284327 205719 229083 235816 116942 94495 -104717
11463A708J20642g919A36724J48124A36957M6786n4447b72820A72024q1514D437
$$ 1708 122350 -7919 136724 284848 136957 183743 129296 -272820 172024 90510 4437
11451a44201B27676F6341J28663O039q1570a2794A78197L593H4787g6189B97537
$$ -144201 227676 66341 195004 201043 119473 -12794 178197 181790 84787 -76189 297537
11439a31598A82637F2836a61844A55645J37918e7529H6909f084F7850h7911k83635
$$ -131598 182637 62836 -161844 155645 293563 -57529 86909 -6084 67850 -87911 -371546
11428c71546M6504K9411C1285a86408F0276B423P1367a29068B05554n0607J02762
$$ -371546 -325042 -295631 31285 -186408 60276 2423 73790 -129068 205554 154947 257709
11417B57709a87805A36301J09522d4613A08349R5765g7632H8002J37347a70361
$$ 257709 -187805 136301 245823 -44613 108349 204114 -77632 88002 225349 -170361
11406a75419B77493A29545K2026e0143b3298k5196a6165n6661A34877d7598B22359
$$ -175419 277493 129545 151571 -50143 -23298 -48494 -16165 -72826 134877 -47598 222359
11394a99091C18540j40493a13729j29824A67257c30014A25960d0138D5433g7809
$$ -199091 318540 178047 -113729 -243553 167257 -330014 125960 -40138 45433 -77809
11383h6230A8159a31957A76665g104A03544I774b05789A94753G307h3692B2610
$$ -86230 18159 -131957 176665 -7104 103544 9774 -205789 194753 7307 -83692 22610
11371A27049N4022h8371c0705j68549n9484C30638A50589b09722A60702D3376
$$ 127049 181071 -88371 -30705 -199254 -258738 330638 150589 -209722 160702 43376
11360F6112a44665h864p6677l4807A06812M9101c50711D373M1375Q0202d4166
$$ 66112 -144665 -8864 -85541 -120348 106812 155913 -350711 4373 45748 125950 -44166
11348c6749a3695B36593j12622P1010c16572b4090f088H842a24446A04219f0326
$$ -36749 -13695 236593 123971 194981 -316572 -24090 -6088 8842 -124446 104219 -60326
11336b02360N9371q8909f7793r1215B9429b54399a1849H3738O3143b11892N2790
$$ -202360 -142989 -231898 -67793 -159008 29429 -254399 -11849 83738 146881 -211892 -159102
11325a59102k4232E1275B4694L0868L845k5702J48722a64845L6912A44129b3517
$$ -159102 -183334 51275 24694 55562 59407 33705 182427 -164845 -127933 144129 -23517
11313B66540c89315J51796e5550A45144D5059J54582f5289I8939R2419F6243R5749
$$ 266540 -389315 -237519 -55550 145144 45059 199641 -65289 98939 191358 66243 161992
11302A61992M8047a07946a4520A63228a81814a4323j52900M0470j46170e4733
$$ 161992 210039 -107946 -14520 163228 -181814 -14323 -167223 -126753 -272923 -54733
11291a21340o7435B04149a83541c465j31875l1518M4326A46988g9311A79917e7846
$$ -121340 -188775 204149 -183541 -3465 -135340 -166858 -122532 146988 -79311 179917 -57846
11279A12967c8199C571J37232h9388B2154L06764F5066e63701i075k0488A89536
$$ 112967 -38199 3571 140803 -89388 22154 328918 65066 -563701 -9075 -29563 189536
11267b237l81825P4028h3980j92236r8868a67550A54790i6874k07949d3509C0803
$$ -2237 -384062 -310034 -83980 -276216 -375084 -167550 154790 -96874 -304823 -43509 30803
11255E0432a54132g0782B59571b36946j11643e2302A45960a02327j90694H8569
$$ 50432 -154132 -70782 259571 -236946 -348589 -52302 145960 -102327 -293021 88569
11244a1783A72507a01547n3194j44466C964a28256B04225J82912b25972H6638
$$ -11783 172507 -101547 -154741 -299207 3964 -128256 204225 387137 -225972 86638
11233h4449B88801a25949k70623M6659C83643A64108n0556c7792r4697A34941
$$ -84449 288801 -125949 -396572 -349913 383643 164108 113552 -37792 -132489 134941
11222g5898b7416k53621A08041j7918a99263C2956J9282O6246P2834A0578K51796
$$ -75898 -27416 -281037 108041 90123 -199263 32956 52238 118484 191318 10578 262374
11211B62374a89865c5703A53946b73779H3966a29972B81313a91299R1107j22405
$$ 262374 -189865 -35703 153946 -273779 83966 -129972 281313 -191299 -100192 -222597
11201b22597B1004g530c437C37154i518n6553A96979a64397j04664f9953k1717
$$ -222597 21004 -7530 -3437 337154 -9518 -66071 196979 -164397 -269061 -69953 -91670
11190i1670c9738n531k60668a49795j8859p8164H9257a72556A46604B2024c6119
$$ -91670 -39738 -45269 -305937 -149795 -168654 -246818 89257 -172556 146604 22024 -36119
11178i4588b2777L496A6434b90025Q9538P4624L0560b0690D8751b71190J33995
$$ -94588 -22777 -19281 16434 -290025 -200487 -125863 -95303 -20690 48751 -271190 -137195
11167a37195D45165k07707l7706R1399d7448D6159c80067a34301E9161a85840
$$ -137195 445165 237458 199752 291151 -47448 46159 -380067 -134301 59161 -185840
11156I679R5919F333i2727C4168e9918g516m4538C22695A09378K03891g1589C4723
$$ 9679 105598 6333 -92727 34168 -59918 -7516 -52054 322695 109378 313269 -71589 34723
11143a06115d8755a4459A32972C6378b75884e4803j74083A7678L01851F2042L55049
$$ -106115 -48755 -14459 132972 36378 -275884 -54803 -228886 17678 319529 62042 417091
11132D17091a41019A58435K1323o7700b30454C46319a38560E6430n876g2485B19633
$$ 417091 -141019 158435 179758 112058 -230454 346319 -138560 56430 50554 -72485 219633
11120B74732R66I8322b23272d4622B30606h7196j23633A28141J27567N0130a15398
$$ 274732 275698 98322 -223272 -44622 230606 -87196 -210829 128141 255708 305838 -115398
11108A89895a54973B22884r4315J69306I1163a82813D49479A66650P6488A12012
$$ 189895 -154973 222884 128569 297875 91163 -182813 449479 166650 243138 112012
11097D73037A70280K79711A53060J37492F1628L5975O5624o7266N8418K3243I769
$$ 473037 170280 449991 153060 290552 61628 97603 163227 95961 154379 177622 9769
11085F6351K53157J37548A98055O4053K06497P6414A95510L66669j03694A00674
$$ 66351 319508 457056 198055 262108 468605 545019 195510 562179 458485 100674
11074B86937P532Q5298l7455j22124K02214b6365C62046k7728J3397J07230K27704
$$ 286937 294469 379767 342312 220188 422402 -26365 362046 334318 347715 454945 682649
11063F82649J31739l86993L08050l20822M68154k24246j16613L89915k72032K80369
$$ 682649 814388 427395 735445 414623 882777 658531 541918 931833 659801 940170
11053I40170k34083n4290K76041j52274o3371L03751j33835j95093k50970L19199
$$ 940170 706087 651797 927838 775564 712193 1015944 882109 687016 436046 755245
11043G55245L04383P8603m21297k0587L4456k1525j70055M36305k39414j5707
$$ 755245 1059628 1138231 716934 696347 730803 709278 539223 975528 736114 720407
11033G20407k8084J32138j6834N8563M27484l56701D55533L20820j55424L30818
$$ 720407 692323 824461 807627 866190 1293674 936973 455533 776353 620929 951747
11023I51747j75517n8153C30362N37198k09913J65004l33762J83110j26092n1944
$$ 951747 776230 718077 330362 867560 657647 822651 488889 671999 545907 493963
11013D93963l130Q5088J4995L56254j1501m63819M6753L78184l9133k76974J35869
$$ 493963 490833 575921 590916 947170 935669 471850 518603 896787 857654 580680 716549
11002G16549J42860m02748K08165L94662E21972J62591k15058K96416j32726K97378
$$ 716549 859409 456661 664826 1059488 521972 684563 469505 765921 633195 930573
10992I30573J60644q5035J93263l75009K73277r3698j54768J57897M9664J36616
$$ 930573 1091217 1006182 1199445 824436 1097713 1004015 849247 1007144 1056808 1193424
10982A193424N9975J82300j05077P04505m48503P36358L2797K64487N31111J27558
$$ 1193424 1253399 1435699 1330622 2035127 1586624 2322982 2355779 2620266 3151377 3278935
10972C278935k61974K10868j33626k49690k73072o14062L0351j0302k17417j16606
$$ 3278935 3016961 3227829 3094203 2844513 2571441 1957379 1987730 1977428 1760011 1643405
10962A643405J30423j97512p1763k07453M61456l37721k6271l42425N0999m131
$$ 1643405 1773828 1576316 1504553 1297100 1758556 1420835 1394564 1052139 1103138 1099007
10952A099007n6179l69343Q0919j78063A78998J94100j43423F6023M34991j09950
$$ 1099007 1042828 673485 754404 576341 178998 373098 229675 66023 501014 391064
10942C91064j61096j09029a13035B7797k487n738a28758a7127r9286B41538q4585
$$ 391064 229968 120939 -113035 27797 25310 19572 -128758 -17127 -116413 241538 156953
10931A56953F2976m902d3021C60106A70482p8495b83875A24328d9691B53227q4131
$$ 156953 62976 58074 -43021 360106 170482 91987 -283875 124328 -49691 253227 169096
10920A69096i4226M6044I4777i5443k7003r2319a9964j00072N3700G9529b13736
$$ 169096 -94226 -48182 94777 -95443 -122446 -214765 -19964 -120036 -66336 79529 -213736
10908D1488a31903a4447B0453c29957C1374j5294J90675a88094A10131K77062
$$ 41488 -131903 -14447 20453 -329957 31374 16080 206755 -188094 110131 387193
10898C87193D7940b1440k22419A39558J37518b01356H9422a65533B2165J19913
$$ 387193 47940 -21440 -243859 139558 277076 -201356 89422 -165533 22165 142078
10888A42078a15374k52070B58606a32352N2805j40814H2071a89378A42789J99811
$$ 142078 -115374 -367444 258606 -132352 -79547 -220361 82071 -189378 142789 342600
10878C42600j39820a01595o015I5788h4726A88360a30996l4733g0366o3762d1121
$$ 342600 202780 -101595 -107610 95788 -84726 188360 -130996 -165729 -70366 -134128 -41121
10866H1429C5269h4952J806B3620M8125p837P1729F6841i9208k56105A21496M3002
$$ 81429 35269 -84952 -83146 23620 71745 63908 135637 66841 -99208 -355313 121496 164498
10854A64498b15445A37110C1701a95645K2682A41712c20141B28259a94151j87711
$$ 164498 -215445 137110 31701 -195645 -172963 141712 -320141 228259 -194151 -381862
10844c81862c2609B47575q279a77625N324A31530O6732p4841A9675c2131C74520
$$ -381862 -32609 247575 239296 -177625 -172301 131530 198262 123421 19675 -32131 374520
10832B64931E8240n240J5586a83889A0388L3537J2836d4500J1881j86366B41799
$$ 264931 58240 53000 68586 -183889 10388 43925 56761 -44500 -32619 -218985 241799
10820D3752G056a53662F713K37513i9055k8979C55750a96988B61163b41928H5282
$$ 43752 7056 -153662 6713 244226 -99055 -128034 355750 -196988 261163 -241928 85282
10808G363d77958a22424A0731f2604b5170B79462H3220a52790B38358D9469K46438
$$ 7363 -477958 -122424 10731 -62604 -25170 279462 83220 -152790 238358 49469 295907
10797B95907b13629m0488F1259e4711K657j5777B67395f6274F314J60054b18239
$$ 295907 -213629 -254117 61259 -54711 -52054 -67831 267395 -66274 6314 166368 -218239
10785D8304a02123N288j92485b6957A33874a78806l0330B9419b46110j09876d281
$$ 48304 -102123 -96835 -289320 -26957 133874 -178806 -209136 29419 -246110 -355986 -4281
10773d15672h787o4203B94507D8409L5946h7916B19900a34053k990A59597d412
$$ -415672 -8787 -72990 294507 48409 84355 -87916 219900 -134053 -137043 159597 -4412
10761g20q374n60878K81829G4817h1843j23812Q7810E2179A5265a61377r7737
$$ -720 -9094 -569972 -288143 74817 -81843 -205655 -117845 52179 15265 -161377 -259114
10750b59114j06082D1207e0477f655m53407B53853i7096k9869B10693b95352O9384
$$ -259114 -365196 41207 -50477 -6655 -460062 253853 -97096 -126965 210693 -295352 -225968
10739b25968J03110L3550a9986B51482L4277a24557j24557i5434C07921e7266
$$ -225968 -122858 -89308 -19986 251482 285759 -124557 -249114 -95434 307921 -57266
10728G6368G181e3359r6652A5435g9508B52138H4346g5212j27155k4661A2140
$$ 76368 7181 -53359 -150011 15435 -79508 252138 84346 -75212 -202367 -227028 12140
10716F662N0695J0562K5465R8755j6977b3626o5143j2012m16103A53024k3228
$$ 6662 57357 67919 93384 192139 175162 -23626 -88769 -100781 -516884 153024 129796
10705A29796J67906q4169n0430P1602a87788Q0202j96241a22422C57021j31226
$$ 129796 297702 213533 163103 234705 -187788 -107586 -303827 -122422 357021 225795
10695B25795a25699j17461l69827a07426b4608l88149F853d7376J9141I4999c3837
$$ 225795 -125699 -243160 -612987 -107426 -24608 -412757 6853 -47376 -28235 94999 -33837
10683B19639I3264D5589J12670b24266I0393c46246C0507a82635j14667A13328
$$ 219639 93264 45589 158259 -224266 90393 -346246 30507 -182635 -297302 113328
10672a77890C82088f1914G3293a24031C2673a36573p5460h7647l9944F3026K83181
$$ -177890 382088 -61914 73293 -124031 32673 -136573 -212033 -87647 -127591 63026 346207
10661C46207c30785a48603C9723L3567K04044j01728o7818O5493o3633A4886i5140
$$ 346207 -330785 -148603 39723 73290 277334 175606 107788 173281 109648 14886 -95140
10649b84488A31227m7794b40712M9592h1757n259j24085A09631a44942j3419B0646
$$ -284488 131227 83433 -240712 -191120 -81757 -87016 -211101 109631 -144942 -158361 20646
10637A16706c9842A02150M4739a09692B46212a66404F1113a12426p2135j76021
$$ 116706 -39842 102150 146889 -109692 246212 -166404 61113 -112426 -184561 -360582
10627c60582f6241D0389K95915A54991c01335e5520l84552J20960B64229J04437
$$ -360582 -66241 40389 336304 154991 -301335 -55520 -440072 -319112 264229 368666
10617C68666a10804m0108j22669d7029b258A13115h8200A90870p7678Q552J1826
$$ 368666 -110804 -150912 -273581 -47029 -2258 113115 -88200 190870 113192 121744 133570
10606A33570d29189e9514l04506b1570k29868m53007e8693k4001a1709A98090
$$ 133570 -429189 -59514 -364020 -21570 -251438 -704445 -58693 -82694 -11709 198090
10595A50939f4674n1687F7716b41922G3459a15047F114i4541a9412A01276b13429
$$ 150939 -64674 -116361 67716 -241922 73459 -115047 6114 -94541 -19412 101276 -213429
10583c06836Q7435j8929A0616h885k9854F9549O9515f8202A34763e98617A51262
$$ -306836 -219401 -238330 10616 -8885 -38739 69549 139064 -68202 134763 -598617 151262
10571b8364r6014C7266a28224m33207b59820d2618j45807B5634P2644D0590K55068
$$ -28364 -124378 37266 -128224 -561431 -259820 -42618 -188425 25634 98278 40590 295658
10560B95658D2518f0610I1882J10865c1170A47218b91472R2739e1715b0831B18284
$$ 295658 42518 -60610 91882 202747 -31170 147218 -291472 -198733 -51715 -20831 218284
10548B24720c1323G528a08605M6683H3913O7707a37079A85083a01577L8201P362
$$ 224720 -31323 7528 -108605 -61922 83913 151620 -137079 185083 -101577 -63376 -56014
10537e6014A11199c2668r3904A22810a35741c1385D3289J57680a6926o8050C035
$$ -56014 111199 -32668 -126572 122810 -135741 -31385 43289 200969 -16926 -84976 3035
10525b19050e1003a6356o5162E10489b17711c4974J1986B26020a49715k35541
$$ -219050 -51003 -16356 -81518 510489 -217711 -34974 -22988 226020 -149715 -385256
10515c85256B35779B3564i1370B3008h9056b1412j30286A15811a68848j9654I9769
$$ -385256 235779 23564 -91370 23008 -89056 -21412 -151698 115811 -168848 -188502 99769
10503a02438j73449R0892e8241j5231j62735d0720j65656m2742e7219j01760A56506
$$ -102438 -275887 -184995 -58241 -73472 -236207 -40720 -206376 -249118 -57219 -158979 156506
10491D1676K69351b10745P1128f88l4546C46565L70050I0871M17146k22092j3685
$$ 41676 311027 -210745 -139617 -688 -35234 346565 716615 90871 508017 285925 272240
10480B72240L4819B4943c7299A52912O001Q9393q1490a45462N9533b7708C0937
$$ 272240 307059 24943 -37299 152912 158913 248306 166816 -145462 -85929 -27708 30937
10468A85003g0615c0566j20952B97532a42015j10263A1900c31995a56049c1948
$$ 185003 -70615 -30566 -151518 297532 -142015 -252278 11900 -331995 -156049 -31948
10457b11052f8204j21469K1956B60357e0644k12766A78180g9943A5792a75244
$$ -211052 -68204 -189673 -167717 260357 -50644 -263410 178180 -79943 15792 -175244
10446E9218a90710c0807k26612P1466L4476j43255A58663R5117a14655a521D0940
$$ 59218 -190710 -30807 -257419 -185953 -151477 -294732 158663 253780 -114655 -1521 40940
10434a27993n1305C59071g6158n6750e3021r0387M752m8913B52359r1825B5992
$$ -127993 -179298 359071 -76158 -132908 -53021 -143408 -138656 -187569 252359 160534 25992
10422G8218j960d93029a59229d1867A17530a72487n7364r9525J6906a1332j25741
$$ 78218 76258 -493029 -159229 -41867 117530 -172487 -229851 -329376 -312470 -11332 -137073
10411a37073C07856b74672J35031A96911P8540j22399d08701J96464r6994A42878
$$ -137073 307856 -274672 -139641 196911 275451 153052 -408701 -212237 -309231 142878
10400h9904j92108a2644H0090J74682A23617J37976i1131B50687J26433Q0714
$$ -89904 -282012 -12644 80090 254772 123617 261593 -91131 250687 377120 457834
10390D57834k24886I0162J62894g9750C08179A29328M6460a26810A97071E9987
$$ 457834 232948 90162 253056 -79750 308179 129328 175788 -126810 197071 59987
10379B60733j19330l4634L58503A15863K390K86279P800Q5336A41505k2513J56408
$$ 260733 141403 106769 465272 115863 118253 404532 412332 497668 141505 118992 275400
10368B75400J52521L40703j45575B38609C9109L67766A07916Q9904K90733A12522
$$ 275400 427921 768624 623049 238609 39109 406875 107916 197820 488553 112522
10357E82109A84110K5139R9138k9792J13099N5283J68410L8308k25966I8103K93509
$$ 582109 184110 209249 308387 278595 391694 446977 615387 653695 427729 98103 391612
10346C91612h1768C55793N9030j86515k7485F780K29460j03415R3399k8772J80064
$$ 391612 -81768 355793 414823 228308 200823 6780 236240 132825 226224 197452 377516
10335C77516e0928H2322k0776b09984D34000C3382Q8553K77178G994e2845B33124
$$ 377516 -50928 82322 61546 -209984 434000 33382 121935 399113 7994 -52845 233124
10323a16663E1923K88989f2144A16911n2401e9729o5934F410K0983E078K23036
$$ -116663 51923 340912 -62144 116911 64510 -59729 -125663 6410 27393 5078 228114
10312B28114m5562a77084B9984L8675B6479J53187c76203a20767k95668F1896
$$ 228114 182552 -177084 29984 68659 26479 179666 -376203 -120767 -416435 61896
10301d7831j12383L2758A12878b18115b047F1075d1585a2342m7934J3480C0874
$$ -47831 -160214 -127456 112878 -218115 -2047 61075 -41585 -12342 -60276 -46796 30874
10289d7719m94809e0963A9616N7902N9799R2177a22637B46315e4406j68420A91619
$$ -47719 -542528 -50963 19616 77518 137317 229494 -122637 246315 -54406 -222826 191619
10277B57446c62659A66563N2591a61679B02132a63611q0378F7490J67403E5963
$$ 257446 -362659 166563 219154 -161679 202132 -163611 -243989 67490 234893 55963
10266A63378b06A32293J50956R8963J40392r1136j66653C0093M32995b29367A17437
$$ 163378 -206 132293 283249 382212 522604 431468 264815 30093 463088 -229367 117437
10254B55397a68643A86519c2609B64559D6477L5901b06871B32525h8915b242l3439
$$ 255397 -168643 186519 -32609 264559 46477 82378 -206871 232525 -88915 -2242 -35681
10243c5681r7849j34290l8363g410j27379j81755i9705G0359l1219L6760i2434
$$ -35681 -133530 -267820 -306183 -7410 -134789 -316544 -99705 70359 39140 75900 -92434
10231c0392j9832m41965A40665c14375B36033a89686h3555p8232M3272B82805
$$ -30392 -50224 -492189 140665 -314375 236033 -189686 -83555 -161787 -118515 282805
10220C06421g4148F0173B2415L16044B6326L24025b95522B8838a95757H5090D249
$$ 306421 -74148 60173 22415 338459 26326 350351 -295522 28838 -195757 85090 4249
10208a73425I2530C7188e6122k62604I2198g0160D5370c18166I2007b47135Q2546
$$ -173425 92530 37188 -56122 -318726 92198 -70160 45370 -318166 92007 -247135 -164589
10197a64589I0985d5455h42I5473b54793G1579c6050D39835c81945B5178a36482
$$ -164589 90985 -45455 -842 95473 -254793 71579 -36050 439835 -381945 25178 -136482
10185A66598K3252c32603J21437o4099J36032B892b39693A29339c92999a3043
$$ 166598 189850 -332603 -211166 -275265 -139233 2892 -239693 129339 -392999 -13043
10174a52356r080l473c172k46417B72214a51418L1838j81810f3697j26653e303
$$ -152356 -161436 -164909 -3172 -249589 272214 -151418 -119580 -301390 -63697 -190350 -5303
10162A72800J7053k4315d776E405a20930M0370B43550H9949I639a44972K459O8781
$$ 172800 189853 165538 -4776 5405 -120930 -80560 243550 89949 9639 -144972 -142513 -73732
10150g3732C0327d74423B7035b18644A05152J3798l8001b79725B6228a17936q474
$$ -73732 30327 -474423 27035 -218644 105152 118950 80949 -279725 26228 -117936 -126410
10139a26410d6832j7593l3725n6905f4386G6441b48854B77861r0945c23681B69971
$$ -126410 -46832 -64425 -98150 -155055 -64386 76441 -248854 277861 186916 -323681 269971
10127c02304a07000k0131B01738f5506j0559l56974B27532F1599i9155Q61D2826
$$ -302304 -107000 -127131 201738 -65506 -76065 -433039 227532 61599 -99155 -98294 42826
10115d70404a71082D4399e0157n70632I8725b09386d1789k07988a2194k50263
$$ -470404 -171082 44399 -50157 -620789 98725 -209386 -41789 -249777 -12194 -262457
10105b62457A68897P786a35876n8866K1072K9834B68553e7834B4144i8635B8997
$$ -262457 168897 176683 -135876 -194742 -173670 -143836 268553 -57834 24144 -98635 28997
10093c27796B33947b32950B1322b81306B16119c8171G4208d60748B86263d6178
$$ -327796 233947 -232950 21322 -281306 216119 -38171 74208 -460748 286263 -46178
10082e7499k9966j07224j64484f040B7701A0622Q7486b71525A0358Q9987g3027
$$ -57499 -87465 -194689 -359173 -6040 27701 10622 98108 -271525 10358 100345 -73027
10070a75573J9635I6656B807L0015a14571A17695B194J5513O9866a76753M8905
$$ -175573 -155938 96656 2807 32822 -114571 117695 2194 17707 87573 -176753 -127848
10059a27848A95913a28150B4167c12597g4046k05257a06342M379l25170B55923
$$ -127848 195913 -128150 24167 -312597 -74046 -279303 -106342 -101963 -427133 255923
10048c2317H7291a37886c8947o1031r0528a5139B92989a15346p8627j78540J80288
$$ -32317 87291 -137886 -38947 -99978 -190506 -15139 292989 -115346 -193973 -372513 -192225
10037a92225D186O5246d9785A33181a57185A01533a00232l07636a16528m62263
$$ -192225 4186 69432 -49785 133181 -157185 101533 -100232 -407868 -116528 -578791
10027e78791a8380m44263J36243B47671b84888d2157E3158B260a03802l52875
$$ -578791 -18380 -462643 -326400 247671 -284888 -42157 53158 2260 -103802 -456677
10017d56677B09838c37153g2464j28473a0528k77406A69955a1505l08443K3996
$$ -456677 209838 -337153 -72464 -200937 -10528 -287934 169955 -11505 -319948 -295952
10007b95952A26149Q9616a71704p1061b1008j17711p250A10927c7811a7140A48618
$$ -295952 126149 215765 -171704 -242765 -21008 -138719 -145969 110927 -37811 -17140 148618
9995a35483f0025A0788e05029b0767j22792a2779E2843b28106A55125c37299m6685
$$ -135483 -60025 10788 -505029 -20767 -143559 -12779 52843 -228106 155125 -337299 -383984
9984c83984C0842a79045j2802F2871a21176A33740d94647H7995K2089J37960a74156
$$ -383984 30842 -179045 -191847 62871 -121176 133740 -494647 87995 110084 248044 -174156
9972b3841a686E976c01700A83694M5063a7927B23779g3381l11789a63078q3400
$$ -23841 -1686 5976 -301700 183694 228757 -17927 223779 -73381 -385170 -163078 -246478
9961b46478o6011C1197d67223i1192G1368a90241A44396b35172O8834N5244e2905
$$ -246478 -312489 31197 -467223 -91192 71368 -190241 144396 -235172 -166338 -111094 -52905
9949b0904j76551D0026J12456m5034c287n1809F1015a96000g2843J162B52137
$$ -20904 -197455 40026 152482 107448 -3287 -55096 61015 -196000 -72843 -71681 252137
9937a14697e2714k93872O2192J36155E3829c6627k30757A20593n7929J33727c14279
$$ -114697 -52714 -346586 -284394 -148239 53829 -36627 -267384 120593 62664 196391 -314279
9925C996a91639C19969a82460j04932A18543d9962i842k04779j9772F5332b3266
$$ 3996 -191639 319969 -182460 -287392 118543 -49962 -9842 -214621 -234393 65332 -23266
9913G4904b49664A10289b31506h2972B28495D7825A2575N3455O3636P3055a42326
$$ 74904 -249664 110289 -231506 -82972 228495 47825 12575 66030 129666 202721 -142326
9901c25446J41204O4515D1418a497A05698C113a96242e1168p6833E5203G822J8775
$$ -325446 -184242 -119727 41418 -1497 105698 3113 -196242 -51168 -128001 55203 7822 26597
9889B6597h2882F43a90854j30936c3966I7672e355l09994c1171k17846a6803j98760
$$ 26597 -82882 643 -190854 -321790 -33966 97672 -5355 -315349 -31171 -249017 -16803 -215563
9877b15563B01832e2796C22960b1576B05701f7966j38575C90850j46186j17804
$$ -215563 201832 -52796 322960 -21576 205701 -67966 -206541 390850 244664 126860
9867A26860o0169N2294c02052a23297B49618h0495k7693k06713a26644A87349
$$ 126860 66691 118985 -302052 -123297 249618 -80495 -108188 -314901 -126644 187349
9856H71a84114l2189O5529k37799J72822D0725R9103g8119l40315a31150h553
$$ 871 -184114 -216303 -150774 -388573 -215751 40725 139828 -78119 -418434 -131150 -8553
9844b99164a25171J8061A12913h8987h048j27232k51321a9534H4579n733d512
$$ -299164 -125171 -107110 112913 -88987 -8048 -135280 -386601 -19534 84579 78846 -4512
9832b71887B33632E3677K8948a47861k87995J74976J14417b8936I5023b44002
$$ -271887 233632 53677 82625 -147861 -435856 -260880 -146463 -28936 95023 -244002
9821e8481j53786h8541l1081B24605J22069n2280a93683A99454b11534f4464A62566
$$ -58481 -212267 -88541 -119622 224605 346674 294394 -193683 199454 -211534 -64464 162566
9809G0566b14927h9502A81198G0966a32180d3916b0249l9313G079a24623H4619
$$ 70566 -214927 -89502 181198 70966 -132180 -43916 -20249 -59562 7079 -124623 84619
9797b57898A30593b65773B04309n487l7332b60842A1808K5065c22237l0511H0644
$$ -257898 130593 -265773 204309 198822 161490 -260842 11808 36873 -322237 -352748 80644
9785e2988j67397Q9932k64899L9258J8659O8016A06244A8306n805c15599k7613
$$ -52988 -220385 -130453 -395352 -356094 -337435 -269419 106244 18306 12501 -315599 -343212
9774c43212i2949k9346I2065l5735o553e793K057j33014q9163I2501a26881O0942
$$ -343212 -92949 -122295 92065 56330 49777 -5793 -3736 -136750 -225913 92501 -126881 -65939
9762f5939k16763h3658Q841l24735i7293I2897c19171H8532a09741B4628b6879
$$ -65939 -282702 -83658 -74817 -399552 -97293 92897 -319171 88532 -109741 24628 -26879
9750h8964C40374I6537m3336K2847P3941a95613i1773A1309g802E3701L1151K879
$$ -88964 340374 96537 53201 76048 149989 -195613 -91773 11309 -7802 53701 84852 87731
9738H7731k6076K492K4965a0375n4023A58402C3189b64810K8894a03429A36622
$$ 87731 61655 64147 89112 -10375 -64398 158402 33189 -264810 -235916 -103429 136622
9726c71790a16413j39223D23341j23711b8225j98576o6839j49707A43163b78703
$$ -371790 -116413 -255636 423341 299630 -28225 -226801 -293640 -443347 143163 -278703
9715e9150E3828J03037b3805k52955k08995b9049I9034A9857J6366K7512a38310
$$ -59150 53828 156865 -23805 -276760 -485755 -29049 99034 19857 36223 63735 -138310
9703b59606A91103a72633l32498B8555g7119A12365K72700a65124c9100C40115
$$ -259606 191103 -172633 -505131 28555 -77119 112365 385065 -165124 -39100 340115
9692B65864b75852E338J05338c07395b234H6358c6332j49659q6396a28425b9027
$$ 265864 -275852 5338 110676 -307395 -2234 86358 -36332 -185991 -272387 -128425 -29027
9680b97678a1147r1731A87171a21486M5984k90758A3615J38739J49688A32986
$$ -297678 -11147 -102878 187171 -121486 -75502 -366260 13615 152354 302042 132986
9669d506I6804K12872a22810j59737H0105B3202a34886H7477c12057a47723P0917
$$ -4506 96804 309676 -122810 -282547 80105 23202 -134886 87477 -312057 -147723 -76806
9658g6806F884L5240K31024C9927b25002G3673b4712I2594b6789k2247A52917
$$ -76806 6884 42124 273148 39927 -225002 73673 -24712 92594 -26789 -49036 152917
9646b04305n7236o4901a12282c6213A70638a98768O6110K0318G6695A3896e5179
$$ -204305 -261541 -326442 -112282 -36213 170638 -198768 -132658 -112340 76695 13896 -55179
9634A701b05752O7419d8193p3660E6869L19992c20605A57515g648E7604e5186
$$ 1701 -205752 -138333 -48193 -121853 56869 376861 -320605 157515 -7648 57604 -55186
9622b9194A59563n7951b81939k85292K50180M9841B1989a32677D9537R9242a12982
$$ -29194 159563 101612 -281939 -567231 -317051 -267210 21989 -132677 49537 148779 -112982
9610b07609p071a03356l4760f4843l56886b06865H9940B796b31607K1672e5514
$$ -207609 -214680 -103356 -138116 -64843 -421729 -206865 89940 2796 -231607 -209935 -55514
9598a77657e7872n9948l885G5351K9095i630k03509E0552J04159k2369b28143
$$ -177657 -57872 -117820 -121705 75351 104446 -9630 -213139 50552 154711 132342 -228143
9586b72735k05578b21188P4602P2282R128l66095J11606a45550K6874n287I1913
$$ -272735 -478313 -221188 -146586 -74304 -65176 -431271 -319665 -145550 -118676 -123963 91913
9574b29571j10160A37942a32730A88959a22140B2883c3925F564a6650E7826a65622
$$ -229571 -339731 137942 -132730 188959 -122140 22883 -33925 6564 -16650 57826 -165622
9562c32658a189C19220G735c0413r6223R280D836J51711D2657c10561A10987a52504
$$ -332658 -1189 319220 7735 -30413 -126636 -117356 4836 156547 42657 -310561 110987 -152504
9549C0460c60941a2303k57302g5077A16296J60309M9571g584D90489a81843A29953
$$ 30460 -360941 -12303 -269605 -75077 116296 276605 326176 -7584 490489 -181843 129953
9537b4005j21806m8118k90489B67806g6487A08029J196c9765j38571d2017G0942
$$ -24005 -145811 -193929 -484418 267806 -76487 108029 109225 -39765 -178336 -42017 70942
9525b84650J24657P8463o9313Q355m2047d4429J1498B49672a07176j76996q9417
$$ -284650 -159993 -81530 -150843 -142488 -184535 -44429 -32931 249672 -107176 -284172 -373589
9514c73589P5350B38902a03817B9388f8017A93410a34599A2396c7264j0302k60928
$$ -373589 -298239 238902 -103817 29388 -68017 193410 -134599 12396 -37264 -47566 -308494
9503c08494A39021l9697c03436a0655A16133c1788j47753H0115c64033b4833j45134
$$ -308494 139021 99324 -303436 -10655 116133 -31788 -179541 80115 -364033 -24833 -169967
9492a69967C22838i7065r8780Q5764B06939c8491I6995K6707K834g7704A5712
$$ -169967 322838 -97065 -195845 -110081 206939 -38491 96995 123702 126536 -77704 15712
9480c19701R8233A72700p6706l9832j3706d38208B48559d55340D6287k2229e58285
$$ -319701 -221468 172700 95994 56162 42456 -438208 248559 -455340 46287 24058 -558285
9468G5248d54852h83k47135E2252c8617A01966a89212l031k4577D9297d0214f61
$$ 75248 -454852 -883 -248018 52252 -38617 101966 -189212 -192243 -216820 49297 -40214 -661
9455f3195q4402d30A48804J72844I5355a6302j23633A34201L658a47769K4346
$$ -63195 -147597 -430 148804 321648 95355 -16302 -139935 134201 137859 -147769 -123423
9444a23423h453j94158C17957d7326o5662N5026q9576h977A27409a72237I1984
$$ -123423 -8453 -202611 317957 -47326 -112988 -57962 -147538 -8977 127409 -172237 91984
9432g584k27397A97436j6774a82638Q7113j23739O8667L2522B1173M078N9051
$$ -7584 -234981 197436 180662 -182638 -95525 -219264 -150597 -118075 21173 25251 84302
9421H4302a78844j12691J10369p7051i462k24805l9541h6264j13120B0574J64277
$$ 84302 -178844 -291535 -181166 -258217 -9462 -234267 -273808 -86264 -199384 20574 184851
9410A84851f2475A36473b06532R6539k12592a60011K4065A11300b90974B28316
$$ 184851 -62475 136473 -206532 -109993 -322585 -160011 -135946 111300 -290974 228316
9399B66358a24827k64233F3592b92787j30478a76465N4121j13325a0025q9361
$$ 266358 -124827 -389060 63592 -292787 -423265 -176465 -122344 -235669 -10025 -99386
9389i9386l76909C2099g5717l51426a92261F9794B0872a57394A9886J42334h4693
$$ -99386 -476295 32099 -75717 -427143 -192261 69794 20872 -157394 19886 162220 -84693
9377b8338C3581b22872e00q520l05935J09124A0506M6122a25066p0442O3753c7764
$$ -28338 33581 -222872 -500 -9020 -314955 -205831 10506 56628 -125066 -195508 -131755 -37764
9364h9712l1973k34275J37776D2563K60651A33534a76384J4328G0617c26999B03835
$$ -89712 -121685 -355960 -218184 42563 303214 133534 -176384 -162056 70617 -326999 203835
9352C79252j30862a95060j37540A88910J05893o9757e06516B39500a07820e1324
$$ 379252 248390 -195060 -332600 188910 294803 225046 -506516 239500 -107820 -51324
9341A48788m0534l1684Q4554a21507J890J416b3672k82386r256J31925A02771
$$ 148788 108254 76570 161124 -121507 -119617 -118201 -23672 -306058 -315314 -183389 102771
9329B94246e7534A44719a13975k0115a09p5219m1179N0962H7261a80268A2599
$$ 294246 -57534 144719 -113975 -134090 -109 -75328 -116507 -65545 87261 -180268 12599
9317a66747P6201r9k96585H0652C524a5134j42469M3555n8715B0102K61516c80393
$$ -166747 -90546 -90645 -387230 80652 3524 -15134 -157603 -114048 -172763 20102 281618 -380393
9304a64591A35593f4414p7427B12089b63918Q2232e2666q7486D01273a69063A91246
$$ -164591 135593 -64414 -141841 212089 -263918 -181686 -52666 -140152 401273 -169063 191246
9292b49388F7833b25745E6191n9k700L3476d9356k3174m6515n5874B02801b8763
$$ -249388 67833 -225745 56191 56132 53432 86908 -49356 -72530 -119045 -174919 202801 -28763
9279G7599a4227q636m0612A34069A3447b7552G2599J37586h1188j28673k69058
$$ 77599 -14227 -22863 -63475 134069 13447 -27552 72599 210185 -81188 -209861 -478919
9268d78919Q3136I8506h1861l28249E11085d0281l4279C0589N9495M020k4721
$$ -478919 -395783 98506 -81861 -410110 511085 -40281 -74560 30589 90084 94104 69383
9257F9383P6428n4669C9452a23506f0087j80003Q5450j36217A5952i4955A30439
$$ 69383 145811 91142 39452 -123506 -60087 -240090 -154640 -290857 15952 -94955 130439
9245A08236i1880j53246F7860a38832K5007C33963e44880E8738i6336r2966D1055
$$ 108236 -91880 -245126 67860 -138832 -113825 333963 -544880 58738 -96336 -189302 41055
9233a40465A52318a53135E1507a37450G0048R367a86085B2480g9087A50659D3029
$$ -140465 152318 -153135 51507 -137450 70048 79415 -186085 22480 -79087 150659 43029
9221H4718a74734d5205E7439a63930P8347A13125O4039b28067d6497k47088J18308
$$ 84718 -174734 -45205 57439 -163930 -85583 113125 177164 -228067 -46497 -293585 -175277
9210a75277A95360a2054r1692B56673b51433i993a586r1619j78875A76875b32823
$$ -175277 195360 -12054 -103746 256673 -251433 -9993 -1586 -93205 -272080 176875 -232823
9198a19788A65312G1577a97531K3111L9711Q883J1004B03249a21192k14667a14207
$$ -119788 165312 71577 -197531 -174420 -134709 -125826 -114822 203249 -121192 -335859 -114207
9186F7514a37080j11877j8942b3271B47691G3814b23388f3484K5821B47394b64823
$$ 67514 -137080 -248957 -267899 -23271 247691 73814 -223388 -63484 -37663 247394 -264823
9174f5149k8623B71801I8692a43118n6136K8195A26249a61503A90344q7349f9488
$$ -65149 -93772 271801 98692 -143118 -199254 -171059 126249 -161503 190344 102995 -69488
9162h833A89204A6784b51326A40818c6966G0523a24298D5744a23163C56123d2038
$$ -8833 189204 16784 -251326 140818 -36966 70523 -124298 45744 -123163 356123 -42038
9150E0387a22818j77603J20476g8742k11758H6994b21591D9825J05304m6121A3842
$$ 50387 -122818 -300421 -179945 -78742 -290500 86994 -221591 49825 155129 109008 13842
9138A65781N1325q2830b22885H4874O7539b10481A1434a37049C5269Q1544c66907
$$ 165781 217106 134276 -222885 84874 152413 -210481 11434 -137049 35269 116813 -366907
9126b88866C3086b01819j1456a4015C2118b5636I9345b35593j33234i5146G3350
$$ -288866 33086 -201819 -213275 -14015 32118 -25636 99345 -235593 -368827 -95146 73350
9114A26306c9804j25449A84399C7050K1569f9338k20341A45579J3479i4674j21852
$$ 126306 -39804 -165253 184399 37050 58619 -69338 -289679 145579 159058 -94674 -216526
9103b16526L6827j13419J23359f2000A56329b15686A84962Q0928b9971j59926
$$ -216526 -179699 -293118 -169759 -62000 156329 -215686 184962 265890 -29971 -189897
9093a89897l04543c9362k01388B80493e8583o4802A990g4810c2455a1404p4632
$$ -189897 -494440 -39362 -240750 280493 -58583 -123385 1990 -74810 -32455 -11404 -86036
9082h6036k2528j57809F1550c64483B16100d9045A49429a75716C86b88768C7972
$$ -86036 -108564 -266373 61550 -364483 216100 -49045 149429 -175716 386 -288768 37972
9070A88711B0236N6283g8810L0720C62490d52897A46746E3273O7024B8737c23667
$$ 188711 20236 76519 -78810 -48090 362490 -452897 146746 53273 120297 28737 -323667
9058B58983g6386A50474g169j55151C21048a71625A10311d7093k17652B3440L6681
$$ 258983 -76386 150474 -7169 -162320 321048 -171625 110311 -47093 -264745 23440 60121
9047F0121K27861a71004c7717C8996J39220J7024i4722n1944G1178a80400O5007
$$ 60121 287982 -171004 -37717 38996 178216 195240 -94722 -146666 71178 -180400 -115393
9036a15393r4438m5372A8150a16633H9859j691a43287A62671f4645a5588j5877
$$ -115393 -209831 -255203 18150 -116633 89859 88168 -143287 162671 -64645 -15588 -31465
9025c1465j69300A01904b8123n0341K6340l28604B7458a69256a4810m3771k30782
$$ -31465 -200765 101904 -28123 -78464 -52124 -380728 27458 -169256 -14810 -58581 -289363
9014b89363A96051d18993h9006c3185n5608l5673A79170c29100a40531j01945
$$ -289363 196051 -418993 -89006 -33185 -88793 -124466 179170 -329100 -140531 -242476
9004b42476k69762I8484J283i365A49935P0838a52187m3544C30994h0525j31260
$$ -242476 -512238 98484 99767 -9365 149935 220773 -152187 -195731 330994 -80525 -211785
8993b11785H0510g5684A57149P5246h4519A04484l4830D217e8674A22708N8370
$$ -211785 80510 -75684 157149 232395 -84519 104484 69654 4217 -58674 122708 181078
8982A81078c5949q5393m30k22047R0286J08917G9658c09605e5985q3880l71563
$$ 181078 -35949 -121342 -121772 -343819 -253533 -144616 79658 -309605 -55985 -139865 -511428
8971e11428K40993J25768j8003k92503a07666C815J54651b06032b0069B70867
$$ -511428 -270435 -144667 -162670 -455173 -107666 3815 158466 -206032 -20069 270867
8960B54584d7221j5181G3422a57707N5531L6048d060l94709B23200b11690h4579
$$ 254584 -47221 -62402 73422 -157707 -102176 -66128 -4060 -398769 223200 -211690 -84579
8948c16348a56377A20366J25113g1374r5525Q2437I0584R6243h5490b6325B7516
$$ -316348 -156377 120366 245479 -71374 -166899 -84462 90584 186827 -85490 -26325 27516
8936C3651J55603o4164a92537A43013a52030H5031h6299l761j97812A0398b00568
$$ 33651 189254 125090 -192537 143013 -152030 85031 -86299 -90060 -287872 10398 -200568
8924E55337K68379K790493M792806C058462G27133C17495N193A09803B0353b08909
$$ 555337 823716 3614209 8407015 3058462 727133 317495 322688 109803 20353 -208909
8913b81793f220j38692A36543a51597H7761l5032c15197b4561C286b19801A73414
$$ -281793 -6220 -144912 136543 -151597 87761 52729 -315197 -24561 3286 -219801 173414
8901a31376n2779B04409c5631A31637M3864d82347A37730L3102d78349c1292l101
$$ -131376 -184155 204409 -35631 131637 175501 -482347 137730 170832 -478349 -31292 -34393
8890c4393k03425M0954l6741q1939B12093h9218A659c35995O8734N2364C7040
$$ -34393 -237818 -196864 -233605 -315544 212093 -89218 1659 -335995 -267261 -214897 37040
8878d9716G7362a03337j89594J21543M2050D08203B5556J29800a21763O833A89431
$$ -49716 77362 -103337 -292931 -171388 -129338 408203 25556 155356 -121763 -114930 189431
8866G5296a16180k07625J30753M5824r5722a09854E9015Q0599e7901m04546A56002
$$ 75296 -116180 -323805 -193052 -147228 -242950 -109854 59015 139614 -57901 -462447 156002
8854e8681A75413F2825a35901r0031p0424J43580a1743A0637a44361A4123d0544
$$ -58681 175413 62825 -135901 -225932 -296356 -152776 -11743 10637 -144361 14123 -40544
8842A2397b02358A7834a8329k41915H8760a77364F5297a27243f3102H363a6325
$$ 12397 -202358 17834 -18329 -260244 88760 -177364 65297 -127243 -63102 8363 -16325
$$ [...]
##END NTUPLES=NMR SPECTRUM
##END=
