
##TITLE=AC1368_2392_7221419_SvWENlBDkv
##JCAMPDX= 6.0         $$ Bruker NMR JCAMP-DX V2.0
##DATA TYPE= NMR SPECTRUM
##DATA CLASS= NTUPLES
##ORIGIN= BRUKER
##OWNER= Administrator
$$ 1.72 TOPSPIN		Version 2.1
$$ 2012-12-13 21:22:28.136 -0500  Administrator@X
$$ Compression mode = diff/dup
##.OBSERVE FREQUENCY= 400.02188249412
##.OBSERVE NUCLEUS= ^1H
##.ACQUISITION MODE= SIMULTANEOUS (DQD)
##.ACQUISITION SCHEME= undefined
##.AVERAGES= 64
##.DIGITISER RES= 22
##SPECTROMETER/DATA SYSTEM= spect
##.PULSE SEQUENCE= noesygpps1d.comp
##.SOLVENT NAME= COFFEE_meoh
##.SHIFT REFERENCE= INTERNAL, COFFEE_meoh, 1, 14.96045
##AUDIT TRAIL= $$ (NUMBER, WHEN, WHO, WHERE, PROCESS, VERSION, WHAT)
$$ ##TITLE= Audit trail, TOPSPIN		Version 2.1
$$ ##JCAMPDX= 5.01
$$ ##ORIGIN= Bruker BioSpin GmbH
$$ ##OWNER= Administrator
$$ $$ E:\/data/COFFEE/nmr/AC1368_2392_7221419_SvWENlBDkv/12/pdata/1/auditp.txt
$$ ##AUDIT TRAIL=  $$ (NUMBER, WHEN, WHO, WHERE, PROCESS, VERSION, WHAT)
(   1,<2012-12-13 21:22:22.323 -0500>,<Administrator>,<X>,<go>,<TOPSPIN 2.1>,
      <created by zg
	started at 2012-12-13 21:10:52.322 -0500,
	POWCHK enabled, PULCHK disabled,
       configuration hash MD5:
       86 BA 57 50 F2 9D 5C 9B 26 00 A9 28 5F 66 2E 89
       data hash MD5: 64K
       F7 9B A9 FA 71 10 09 C4 BE 34 5A 97 E1 CE 81 AC>)
(   2,<2012-12-13 21:22:25.370 -0500>,<Administrator>,<X>,<proc1d>,<TOPSPIN 2.1>,
      <Start of raw data processing
       efp LB = 0.3 FT_mod = 6 PKNL = 1 PHC0 = 0 PHC1 = 0 SI = 128K 
       data hash MD5: 128K
       BE D2 B3 9D C0 D5 60 C2 B6 FA F2 71 B2 7E 0C F2>)
(   3,<2012-12-13 21:22:26.448 -0500>,<Administrator>,<X>,<proc1d>,<TOPSPIN 2.1>,
      <pk PHC0 = -75.99792 PHC1 = 0 
       data hash MD5: 128K
       BD E8 F6 75 C1 35 B5 92 46 A8 EA CC AF A0 27 55>)
(   4,<2012-12-13 21:22:27.152 -0500>,<Administrator>,<X>,<proc1d>,<TOPSPIN 2.1>,
      <abs ABSG = 1 
       data hash MD5: 128K
       1F ED AE C9 96 5A 5E 16 E1 B9 DB C4 E8 42 F8 E5>)
(   5,<2012-12-13 21:22:27.308 -0500>,<Administrator>,<X>,<proc1d>,<TOPSPIN 2.1>,
      <abs ABSG = 2 
       data hash MD5: 128K
       6F 48 6C 51 AB 35 34 2E 24 7C EB 69 2E 58 BB 6F>)
(   6,<2012-12-13 21:22:27.464 -0500>,<Administrator>,<X>,<proc1d>,<TOPSPIN 2.1>,
      <abs ABSG = 3 
       data hash MD5: 128K
       EF E2 4E AB 62 DB 11 8C 0A 8B E3 73 03 0E 5D 4D>)
(   7,<2012-12-13 21:22:27.620 -0500>,<Administrator>,<X>,<proc1d>,<TOPSPIN 2.1>,
      <abs ABSG = 4 
       data hash MD5: 128K
       D6 F9 94 87 48 05 07 A7 A8 12 6A 00 4C DF E1 A2>)
(   8,<2012-12-13 21:22:27.792 -0500>,<Administrator>,<X>,<proc1d>,<TOPSPIN 2.1>,
      <abs ABSG = 5 
       data hash MD5: 128K
       D0 1C ED 44 59 F2 3F 1D 17 76 FC 78 04 93 74 4E>)
$$ ##END=
$$ 
$$ $$ hash MD5
$$ $$ C4 14 F8 FF D4 A8 91 4D 01 A2 A8 DB 1E 8E B7 B2
##$RELAX= 
##$RELAX= 
##$RELAX= 
##$RELAX= 
##$RELAX= 
##$RELAX= 
##$RELAX= 
##$RELAX= 
##$RELAX= 
$$ Bruker specific parameters
$$ --------------------------
##$DU= <E:\>
##$EXPNO= 12
$$ [...]
150 150 150 150 150 150 150 150
##$TP07= 0
##$TPNAME0= <>
##$TPNAME1= <>
##$TPNAME2= <>
##$TPNAME3= <>
##$TPNAME4= <>
##$TPNAME5= <>
##$TPNAME6= <>
##$TPNAME7= <>
##$TPOAL= (0..7)
0.5 0.5 0.5 0.5 0.5 0.5 0.5 0.5
##$TPOFFS= (0..7)
0 0 0 0 0 0 0 0
##$TUNHIN= 0
##$TUNHOUT= 0
##$TUNXOUT= 0
##$USERA1= <user>
##$USERA2= <user>
##$USERA3= <user>
##$USERA4= <user>
##$USERA5= <user>
##$V9= 5
##$VALIST= <valist>
##$VCLIST= <CCCCCCCCCCCCCCC>
##$VD= 0
##$VDLIST= <DDDDDDDDDDDDDDD>
##$VPLIST= <PPPPPPPPPPPPPPP>
##$VTLIST= <TTTTTTTTTTTTTTT>
##$WBST= 1024
##$WBSW= 4
##$XGAIN= (0..3)
0 0 0 0
##$XL= 0
##$YL= 0
##$YMAX_a= 6363862
##$YMIN_a= -12376009
##$ZGOPTNS= <>
##$ZL1= 120
##$ZL2= 120
##$ZL3= 120
##$ZL4= 120
##$ABSF1= 14.96045
##$ABSF2= -5.597732
##$ABSG= 5
##$ABSL= 3
##$ALPHA= 0
##$AQORDER= 0
##$ASSFAC= 0
##$ASSFACI= 0
##$ASSFACX= 0
##$ASSWID= 0
##$AUNMP= <proc_prof1d_extract.lims>
##$AXLEFT= 0
##$AXNAME= <>
##$AXNUC= <1H>
##$AXRIGHT= 0
##$AXTYPE= 0
##$AXUNIT= <>
##$AZFE= 0.1
##$AZFW= 0.1
##$BCFW= 0
##$BC_mod= 0
##$BYTORDP= 0
##$COROFFS= 0
##$CY= 15
##$DATMOD= 1
##$DC= 0
##$DFILT= <>
##$DTYPP= 0
##$F1P= 0
##$F2P= 0
##$FCOR= 0.5
##$FTSIZE= 131072
##$FT_mod= 6
##$GAMMA= 0
##$GB= 0
##$INTBC= 1
##$INTSCL= 1
##$ISEN= 128
##$LB= 0.3
##$LEV0= 0
##$LPBIN= 0
##$MAXI= 10000
##$MC2= 0
##$MEAN= 0
##$ME_mod= 0
##$MI= 0
##$NCOEF= 0
##$NC_proc= -2
##$NLEV= 6
##$NOISF1= 0
##$NOISF2= 0
##$NSP= 0
##$NTH_PI= 0
##$NZP= 0
##$OFFSET= 14.96045
##$PC= 1
##$PHC0= -75.99792
##$PHC1= 0
##$PH_mod= 1
##$PKNL= yes
##$PPARMOD= 0
##$PPDIAG= 0
##$PPIPTYP= 0
##$PPMPNUM= 2147483647
##$PPRESOL= 1
##$PSCAL= 4
##$PSIGN= 0
##$PYNMP= <proc.py>
##$REVERSE= no
##$SF= 400.02000985486
##$SI= 131072
##$SIGF1= 0
##$SIGF2= 0
##$SINO= 400
##$SIOLD= 131072
##$SPECTYP= <>
##$SREGLST= <1H.CDCl3>
##$SSB= 0
##$STSI= 131072
##$STSR= 0
##$SW_p= 8223.68421052631
##$SYMM= 0
##$S_DEV= 0
##$TDeff= 65536
##$TDoff= 0
##$TI= <>
##$TILT= no
##$TM1= 0
##$TM2= 0
##$TOPLEV= 0
##$USERP1= <user>
##$USERP2= <user>
##$USERP3= <user>
##$USERP4= <user>
##$USERP5= <user>
##$WDW= 1
##$XDIM= 131072
##$YMAX_p= 403024531
##$YMIN_p= -12770
##$CURPLOT= <Network HP LaserJet P1505>
##$CURPRIN= <$Network HP LaserJet P1505>
##$DFORMAT= <normdp>
##$LAYOUT= <+/1D_H.xwp>
##$LFORMAT= <normlp>
##$PFORMAT= <normpl>
##$SURQMSG= 1
$$ End of Bruker specific parameters
$$ ---------------------------------
##NTUPLES= NMR SPECTRUM
##VAR_NAME=  FREQUENCY,     SPECTRUM/REAL,   SPECTRUM/IMAG
##SYMBOL=    X,             R,               I
##VAR_TYPE=  INDEPENDENT,   DEPENDENT,       DEPENDENT
##VAR_FORM=  AFFN,          ASDF,            ASDF
##VAR_DIM=   131072,        131072,          131072
##UNITS=     HZ,            ARBITRARY UNITS, ARBITRARY UNITS
##FACTOR=    0.0627417313425164, 1,          1
##FIRST=     8223.62146879497, 1189,         -56657
##LAST=      0,             2532,            -57096
##MIN=       0,             -12770,          0
##MAX=       8223.62146879497, 403024531,    0
$$ Real data points
##PAGE= N=1
##DATA TABLE= (X++(R..R)), XYDATA
$$ [...]
$$ plain form
63948 907415 989232 1084073 1192331 1313936 1449065 1597583 1758338 1929568 2109686 2297148
63938 2297148 2489888 2685402 2881014 3073346 3257630 3428191 3579768 3708228 3810522
63929 3810522 3884778 3930489 3947945 3937182 3897734 3829459 3733296 3611366 3466908 3304227 3128264
63918 3128264 2943808 2755072 2565716 2378858 2197069 2022649 1857798 1704179 1562524
63909 1562524 1433119 1316479 1212916 1121620 1040950 969763 907707 854106 807415 766232 730218
63898 730218 699484 673507 651182 631629 614459 599487 586509 575184 564876 554932 545424 537324
63886 537324 531607 528424 527385 528251 530978 535458 541759 550424 561981 576226 592418 610164 629790
63873 629790 651841 676487 703293 731306 759437 786985 813705 839272 863013 884466 903888
$$ packed form
63948I07415Q1817R4841J08258J21605J35129J48518J60755J71230J80118J87462
63938B297148J92740J95514J95612J92332J84284J70561J51577J28460J02294
63929C810522P4256M5711J7456j0763l9448o8275r6163j21930j44458j62681j75963
63918C128264j84456j88736j89356j86858j81789j74420j64851j53619j41655
63909A562524j29405j16640j03563r1296q0670p1187o2056n3601m6691m1183l6014
63898G30218l0734k5977k2325j9553j7170j4972j2978j1325j0308r944r508q100
63886E37324n717l183j039Q66K727M480O301Q665J1557J4245J6192J7746J9626
63873F29790K2051K4646K6806K8013K8131K7548K6720K5567K3741K1453J9422
$$ plain form
63862 903888 921746 937943 951957 963470 972300 977898 979629 977540 972216 963774 951680 935820 917151
63849 917151 896810 874926 850760 823766 794156 762587 729788 696507 663436 630964 599151
63838 599151 568076 538172 510061 484032 459862 437275 416432 397661 380769 365048 350166
63827 350166 336611 324885 314547 304573 294513 284771 275819 267671 260226 253562 247692 242421 237655
63814 237655 233551 230190 227403 225037 223033 221146 219018 216700 214593 212639 210126 206804 203674 201959
63800 201959 201547 201168 200013 198465 197215 196361 195607 194749 193638 192101 190258 188550 187193 185914 184559
63785 184559 183531 183174 183008 182193 180628 179043 177958 177098 175982 174618 173350 172412 171950 172201 173214 174514
63769 174514 175441 175834 176096 176572 177155 177565 177760 177909 178133 178402 178630 178732 178676 178526 178402 178345 178283 178159 177988 177824
$$ packed form
63862I03888J7858J6197J4014J1513Q830N598J731k089n324q442j2094j5860j8669
63849I17151k0341k1884k4166k6994k9610l1569l2799l3281l3071l2472l1813
63838E99151l1075k9904k8111k6029k4170k2587k0843j8771j6892j5721j4882
63827C50166j3555j1726j0338r974j0060r742q952q148p445o664n870n271m766
63814B37655m104l361k787k366k004j887k128k318k107j954k513l322l130j715
63800B01959m12l79j155j548j250q54p54q58j111j537j843j708j357j279j355
63785A84559j028l57j66q15j565j585j085q60j116j364j268r38m62K51J013J300
63769A74514R27L93K62M76N83M10J95J49K24K69K28J02n6j50j24n7o2j24j71j64
$$ plain form
63749 177824 177760 177964 178503 179090 179290 179177 179535 181087 183640 186313 188567 190646 192987 195600 198277 201117
63733 201117 204519 208700 213448 218255 222593 226194 229350 232881 237499 243141 249051 254536 259442 263954
63719 263954 268266 272540 276911 281243 285000 287584 288723 288447 286810 283849 279704 274591 268755 262644
63705 262644 256967 252311 248743 246055 244203 243107 242132 240455 238213 236709 237043 238868 240973 242769 244608
63690 244608 246809 249093 251108 252936 254814 256769 258853 261456 265057 269776 275336 281286 287055 292005
63676 292005 295773 298567 300947 303347 305896 308578 311372 314262 317252 320296 323158 325474 327100 328232
63662 328232 328956 328888 327588 325219 322368 319156 314932 309095 301942 294419 287194 280267 273383 266551 260134
63647 260134 254684 250746 248580 247868 247779 247542 247006 246578 246665 247288 248299 249763 251932 254873 258322 262016
$$ packed form
63749A77824o4K04N39N87K00j13L58J552K553K673K254K079K341K613K677K840
63733B01117L402M181M748M807M338L601L156L531M618N642N910N485M906M512
63719B63954M312M274M371M332L757K584J139k76j637k961m145n113n836o111
63705B62644n677m656l568k688j852j096r75j677k242j504L34J825K105J796J839
63690B44608K201K284K015J828J878J955K084K603L601M719N560N950N769M950
63676B92005L768K794K380K400K549K682K794K890K990L044K862K316J626J132
63662C28232P24o8j300k369k851l212m224n837p153p523p225o927o884o832o417
63647B60134n450l938k166p12q9k37n36m28Q7O23J011J464K169K941L449L694
$$ plain form
63631 262016 265991 270464 275486 280910 286653 292840 299666 307243 315636 324888 334955 345731 357173
63618 357173 369355 382363 396371 411845 429391 449154 470604 493293 517646 544502 573845
63607 573845 604484 635077 664906 693253 718562 738905 753241 761747 765124 764187 760128 754459 748315
63594 748315 742097 735918 729870 723600 716091 706338 694051 679407 662418 642981 621326 598050 573874
63581 573874 549745 526908 506362 488289 472459 459025 448385 440306 433914 428705 425020 423272
63569 423272 423228 424412 426728 430202 434503 439347 445295 453485 464403 477255 490811 504637 519301
63556 519301 535504 553290 572207 592042 613183 636246 661672 689930 721967 758937 801085
63545 801085 846692 892011 932288 963313 982745 990509 988175 978119 963176 946446 930573 916911
$$ packed form
63631B62016L975M473N022N424N743O187O826P577Q393R252J0067J0776J1442
63618C57173J2182J3008J4008J5474J7546J9763K1450K2689K4353K6856K9343
63607E73845L0639L0593K9829K8347K5309K0343J4336Q506L377r37m059n669o144
63594G48315o218o179o048o270p509r753j2287j4644j6989j9437k1655k3276k4176
63581E73874k4129k2837k0546j8073j5830j3434j0640q079o392n209l685j748
63569D23272m4J184K316L474M301M844N948Q190J0918J2852J3556J3826J4664
63556E19301J6203J7786J8917J9835K1141K3063K5426K8258L2037L6970M2148
63545H01085M5607M5319M0277L1025J9432P764k334j0056j4943j6730j5873j3662
$$ plain form
63533 916911 905665 896820 890476 886161 882382 877238 869206 857194 840397 818613 792492 762990 730780
63520 730780 696570 661741 627970 596168 566253 538034 511850 488085 466509 446524 427958
63509 427958 411293 397075 385314 375565 367427 360758 355367 350774 346483 342351 338425 334544 330518
63496 330518 326641 323495 321103 318798 316292 314347 313885 314819 316327 318005 320008 322212 324085 325592 327579
63481 327579 330905 335603 341146 347135 353363 359538 365321 370553 375198 379128 382102 383805 383876 382076 378559
63466 378559 373740 367847 360867 353042 345035 337373 330045 322992 316627 311461 307438 304182 301814 300917
63452 300917 301549 302872 304123 305631 308371 312679 317915 323457 329618 337271 346907 358506 372223 388648
63438 388648 408243 431064 457447 488498 525004 565653 606811 644244 674801 696604 708781
$$ packed form
63533I16911j1246q845o344m315l779n144q032j2012j6797k1784k6121k9502l2210
63520G30780l4210l4829l3771l1802k9915k8219k6184k3765k1576j9985j8566
63509D27958j6665j4218j1761r749q138o669n391m593m291m132l926l881m026
63496C30518l877l146k392k305k506j945m62R34J508J678K003K204J873J507J987
63481C27579L326M698N543N989O228O175N783N232M645L930K974J703P1j800l517
63466C78559m819n893o980p825q007p662p328p053o365n166m023l256k368q97
63452C00917O32J323J251J508K740M308N236N542O161P653R636J1599J3717J6425
63438C88648J9595K2821K6383L1051L6506M0649M1158L7433L0557K1803J2177
$$ plain form
63427 708781 712012 709054 703753 699168 696914 698088 703944 715267 731687 752327 776940 805840 838676
63414 838676 873643 908010 939124 964949 984093 995840 1000281 998397 991905 982805 972721 962546
63402 962546 952713 943510 934670 924719 911411 893288 870569 844281 814984 782930 749122 715323
63390 715323 682868 652082 623026 596172 571967 550252 530643 513208 498278 485798 475331
63379 475331 466663 460012 455712 453966 454747 457580 461525 465827 470649 476841 484991 495020 506707 520178
63365 520178 535731 553432 573070 594366 617174 641689 668425 697777 729562 763213 798285
63354 798285 834282 869938 903168 931962 955099 971892 981829 984915 982106 974991 965143 953966
63342 953966 942784 932494 923059 913629 903104 890411 874498 854614 830714 803368 773364 741668
$$ packed form
63427G08781L231k958n301m585k254J174N856J1323J6420K0640K4613K8900L2836
63414H38676L4967L4367L1114K5825J9144J1747M441j884o492r100j0084j0175
63402I62546r833r203q840r951j3308j8123k2719k6288k9297l2054l3808l3799
63390G15323l2455l0786k9056k6854k4205k1715j9609j7435j4930j2480j0467
63379D75331q668o651m300j746P81K833L945M302M822O192Q150J0029J1687J3471
63365E20178J5553J7701J9638K1296K2808K4515K6736K9352L1785L3651L5072
63354G98285L5997L5656L3230K8794K3137J6793R937L086k809p115r848j1177
63342I53966j1182j0290r435r430j0525j2693j5913j9884k3900k7346l0004l1696
$$ plain form
63330 741668 709675 678945 650586 625171 603202 585082 570559 558964 550509 546735 548718 554756
63318 554756 560435 561225 554793 541177 521765 498710 474702 452177 432344 415139 400119 387093
63306 387093 375924 366261 357769 350407 344201 338838 333795 328867 324348 320600 317533 314571 311110 306941
63292 306941 302318 297657 293284 289428 286321 284085 282534 281235 279871 278462 277182 276078 275045 273980
63278 273980 272886 271896 271260 271196 271630 272164 272444 272509 272681 273151 273801 274398 274823 275133 275468 276001 276900 278296 280205
63259 280205 282485 284993 287855 291459 295959 300906 305661 310164 314925 320268 326032 332200 339257 347519
63245 347519 356554 365865 375842 387381 400673 415134 430554 447568 466623 487094 507939 528931
63233 528931 550687 573612 597216 620531 642920 664358 685103 705299 725052 744919 766066
$$ packed form
63330G41668l1993l0730k8359k5415k1969j8120j4523j1595q455l774J983O038
63318E54756N679P90o432j3616j9412k3055k4008k2525j9833j7205j5020j3026
63306C87093j1169r663q492p362o206n363n043m928m519l748l067k962l461m169
63292C06941m623m661m373l856l107k236j551j299j364j409j280j104j033j065
63278B73980j094r90o36o4M34N34K80O5J72M70O50N97M25L10L35N33Q99J396J909
63259B80205K280K508K862L604M500M947M755M503M761N343N764O168P057Q262
63245C47519R035R311R977J1539J3292J4461J5420J7014J9055K0471K0845K0992
63233E28931K1756K2925K3604K3315K2389K1438K0745K0196J9753J9867K1147
$$ plain form
63222 766066 789494 814986 841041 866026 889218 910661 930286 947452 961108 970031 972897 968586
63210 968586 956778 938285 914638 887239 856874 824017 789511 754794 721494 690872 663685
63199 663685 640296 620680 604466 591225 580784 573172 568435 566687 568233 573303 581708 593006 606849
63186 606849 622872 640316 658314 676600 695529 715244 735317 755430 775917 797164 818810
63175 818810 840024 860406 880193 899554 918008 934476 947628 956242 959635 957865 951318 939985
63163 939985 923391 901349 874623 844635 812517 778623 743062 706528 670366 635843 603630
63152 603630 574082 547622 524427 503963 485333 468089 452361 438287 425821 415029 405884 397654
63140 397654 389218 380455 372637 366941 363025 359717 356645 354364 353135 352454 351907 351694 352076 352844 353633 354305
$$ packed form
63222G66066K3428K5492K6055K4985K3192K1443J9625J7166J3656Q923K866m311
63210I68586j1808j8493k3647k7399l0365l2857l4506l4717l3300l0622k7187
63199F63685k3389j9616j6214j3241j0441p612m737j748J546N070Q405J1298J3843
63186F06849J6023J7444J7998J8286J8929J9715K0073K0113K0487K1247K1646
63175H18810K1214K0382J9787J9361J8454J6468J3152Q614L393j770o547j1333
63163I39985j6594k2042k6726k9988l2118l3894l5561l6534l6162l4523l2213
63152F03630k9548k6460k3195k0464j8630j7244j5728j4074j2466j0792r145q230
63140C97654q436q763p818n696l916l308l072k281j229o81n47k13L82P68P89O72
$$ plain form
63124 354305 354767 354792 354396 354169 354956 357251 360885 365034 368523 370527 371296 371986 373635 376471 380230 384623
63108 384623 389163 392990 395525 397236 399236 402000 404902 407149 408745 410228 411802 413200 414316 415461
63094 415461 416816 418006 418573 418692 419051 420068 421498 422905 424166 425406 426767 428434 430655 433438 436409
63079 436409 439311 442523 446714 452052 458092 464502 471463 479228 487706 496789 506837 518489 532062
63066 532062 547406 564230 582331 601604 622261 645087 671117 700769 733512 768587 805885
63055 805885 845789 888249 932464 977689 1024093 1072498 1123235 1175514 1228013 1279977 1331606
63044 1331606 1383403 1435366 1486998 1538039 1588950 1640558 1693382 1747442 1802360 1857180 1910015
63033 1910015 1958344 1999881 2032953 2055991 2067262 2065594 2051136 2024911 1987837 1940680 1884821
$$ packed form
63124C54305M62K5l96k27P87K295L634M149L489K004P69O90J649K836L759M393
63108C84623M540L827K535J711K000K764K902K247J596J483J574J398J116J145
63094D15461J355J190N67J19L59J017J430J407J261J240J361J667K221K783K971
63079D36409K902L212M191N338O040O410O961P765Q478R083J0048J1652J3573
63066E32062J5344J6824J8101J9273K0657K2826K6030K9652L2743L5075L7298
63055H05885L9904M2460M4215M5225M6404M8405N0737N2279N2499N1964N1629
63044A331606N1797N1963N1632N1041N0911N1608N2824N4060N4918N4820N2835
63033A910015M8329M1537L3072K3038J1271j668j4458k6225l7074m7157n5859
$$ plain form
63022 1884821 1822390 1755498 1685867 1615430 1546726 1482215 1423389 1370832 1324882 1285868 1253882
63011 1253882 1228755 1210382 1198864 1194221 1196038 1203514 1215937 1233131 1255256 1282032 1312361 1344958
62999 1344958 1379194 1414932 1451699 1488639 1525352 1562210 1599555 1636991 1673704 1709008 1742175
62988 1742175 1772073 1797361 1816838 1829351 1833706 1829006 1814828 1790826 1756517 1711949 1658354 1597738
62976 1597738 1532043 1462926 1391973 1320566 1249771 1180818 1115404 1054931 999635 949023 902935
62965 902935 861509 824315 790399 759320 731351 706513 684161 663879 646077 631140 618451
62954 618451 606774 595326 584045 573017 562163 551409 540789 530306 519900 509566 499433
62943 499433 489768 480864 472717 464790 456396 447505 438923 431456 425065 419029 412799 406470 400519 395309
$$ packed form
63022A884821o2431o6892o9631p0437o8704o4511n8826n2557m5950l9014l1986
63011A253882k5127j8373j1518m643J817P476J2423J7194K2125K6776L0329L2597
62999A344958L4236L5738L6767L6940L6713L6858L7345L7436L6713L5304L3167
62988A742175K9898K5288J9477J2513M355m700j4178k4002l4309m4568n3595o0616
62976A597738o5695o9117p0953p1407p0795o8953o5414o0473n5296n0612m6088
62965I02935m1426l7194l3916l1079k7969k4838k2352k0282j7802j4937j2689
62954F18451j1677j1448j1281j1028j0854j0754j0620j0483j0406j0334j0133
62943D99433r665q904q147p927q394q891q582p467o391o036o230o329n951n210
$$ plain form
62929 395309 390865 386947 383291 379806 376513 373313 369966 366412 363071 360655 359548 359342 359054 357962 356231
62914 356231 354570 353274 351924 350168 348443 347493 347357 347270 346495 344888 342724 340469 338772 338200 338704 339639
62898 339639 340414 340863 340961 340663 340233 340322 341329 342899 344337 345365 346230 347232 348440 349765 351074 352275
62882 352275 353435 354724 356063 356976 357066 356641 356537 357240 358321 358965 358978 359050 359909 361418 362710 363168 362922 362390
62864 362390 361758 361183 361085 361815 363208 364839 366564 368401 370114 371465 372789 374681 377030 378932 379718 379647
62848 379647 379438 379586 380278 381525 383142 384920 386945 389326 391539 392638 392424 391909 392209 393396 394815 396105
62832 396105 397402 398780 399982 400671 400729 400434 400498 401604 403692 405984 407928 409711 411628 413491 415102 416807
62816 416807 419018 421497 423772 425983 428722 432243 436409 441206 446592 452003 456833 461446 467030 474266
$$ packed form
62929C95309m444l918l656l485l293l200l347l554l341k416j107k06k88j092j731
62914C56231j661j296j350j756j725r50j36q7p75j607k164k255j697n72N04R35
62898C39639P75M49R8k98m30Q9J007J570J438J028Q65J002J208J325J309J201
62882C52275J160J289J339R13R0m25j04P03J081O44J3P2Q59J509J292M58k46n32
62864C62390o32n75r8P30J393J631J725J837J713J351J324J892K349J902P86p1
62848C79647k09J48O92J247J617J778K025K381K213J099k14n15L00J187J419J290
62832C96105J297J378J202O89N8k95O4J106K088K292J944J783J917J863J611J705
62816D16807K211K479K275K211K739L521M166M797N386N411M830M613N584P236
$$ plain form
62802 474266 482755 491944 501969 513319 526215 540648 556601 573903 592305 612114 634364 659941
62790 659941 688770 720304 754666 792856 835962 884537 938757 998725 1064451 1135778 1212454
62779 1212454 1294136 1380134 1469221 1559769 1649993 1737934 1821222 1897047 1962544 2015317 2053597
62768 2053597 2076047 2081678 2070176 2042301 1999812 1944886 1879587 1805788 1725476 1640976 1554828
62757 1554828 1469364 1386305 1306600 1230532 1158060 1089290 1024819 965532 911901 863531 819464
62746 819464 778850 741234 706492 674881 647019 623293 603122 585179 568505 553151 539637
62735 539637 528158 518478 510222 503008 496589 491117 487012 484369 482839 482261 482952 484990 487714 490518
62721 490518 493782 498322 504126 510405 516971 524842 535254 548519 564154 581786 601667 624467 650761
$$ packed form
62802D74266Q489R189J0025J1350J2896J4433J5953J7302J8402J9809K2250K5577
62790F59941K8829L1534L4362L8190M3106M8575N4220N9968O5726P1327P6676
62779A212454Q1682Q5998Q9087R0548R0224Q7941Q3288P5825O5497N2773L8280
62768B053597K2450N631j1502k7875m2489n4926o5299p3799q0312q4500q6148
62757A554828q5464q3059p9705p6068p2472o8770o4471n9287n3631m8370m4067
62746H19464m0614l7616l4742l1611k7862k3726k0171j7943j6674j5354j3514
62735E39637j1479r680q256p214o419n472m105k643j530n78O91K038K724K804
62721D90518L264M540N804O279O566P871J0412J3265J5635J7632J9881K2800K6294
$$ plain form
62708 650761 680717 714226 751357 792478 837816 887262 940952 999702 1064268 1134262 1208370
62697 1208370 1285497 1364968 1445516 1524880 1600772 1671548 1735478 1789941 1832083 1860061 1873177
62686 1873177 1871173 1854177 1823289 1780438 1727314 1664857 1594095 1517110 1436797 1355793 1275967
62675 1275967 1198763 1125463 1056797 992621 932452 876303 824674 777748 735041 696143 661439
62664 661439 631632 606593 585041 565402 546751 528973 512435 497658 484996 474324 465046 456576
62652 456576 448786 441846 435636 429495 422724 415385 408386 402568 397835 393518 389494 386413 384647 383620
62638 383620 382635 381903 382122 383339 384918 386490 388120 389508 389884 389038 387840 387267 387337 387468 387479 387710 388317
62621 388317 389008 389587 390454 392399 395918 400763 406180 411694 417594 424485 432457 441056 450045 459803 470834
$$ packed form
62708F50761K9956L3509L7131M1121M5338M9446N3690N8750O4566O9994P4108
62697A208370P7127P9471Q0548P9364P5892P0776O3930N4463M2142K7978J3116
62686A873177k004j6996l0888m2851n3124o2457p0762p6985q0313q1004p9826
62675A275967p7204p3300o8666o4176o0169n6149n1629m6926m2707l8898l4704
62664F61439k9807k5039k1552j9639j8651j7778j6538j4777j2662j0672r278q470
62652D56576p790o940o210o141o771p339o999n818m733m317m024l081j766j027
62638C83620r85p32K19J217J579J572J630J388L76q46j198n73P0J31J1K31O07
62621C88317O91N79Q67J945L519M845N417N514N900O891P972Q599Q989R758J1031
$$ plain form
62606 470834 483257 496986 512118 528927 547782 569275 594118 622618 654437 689119 726538
62595 726538 766577 808618 851742 895211 938310 979826 1018093 1051606 1079305 1100273 1113488
62584 1113488 1118045 1113568 1100447 1079731 1052699 1020427 983891 944440 903715 862822 821939 781176
62572 781176 741517 704318 670082 638388 609024 582470 559003 538030 518726 500875 484557
62561 484557 469432 455017 441560 429973 420789 413605 407645 402410 397612 392942 388328 384152 380815
62548 380815 378176 375790 373600 372050 371458 371621 372165 373018 374370 376332 378759 381334 383763 386063 388702
62533 388702 392274 396932 402320 408109 414333 421134 428562 436928 447101 460015 475946 494560 515589
62520 515589 539200 565773 595551 628459 664095 702045 742406 785685 831723 878829 924438
$$ packed form
62606D70834J2423J3729J5132J6809J8855K1493K4843K8500L1819L4682L7419
62595G26538M0039M2041M3124M3469M3099M1516L8267L3513K7699K0968J3215
62584A113488M557m477j3121k0716k7032l2272l6536l9451m0725m0893m0883m0763
62572G81176l9659l7199l4236l1694k9364k6554k3467k0973j9304j7851j6318
62561D84557j5125j4415j3457j1587r184p184n960n235m798m670m614m176l337
62548C80815k639k386k190j550n92J63N44Q53J352J962K427K575K429K300K639
62533C88702L572M658N388N789O224O801P428Q366J0173J2914J5931J8614K1029
62520E15589K3611K6573K9778L2908L5636L7950M0361M3279M6038M7106M5609
$$ plain form
62509 924438 966633 1004662 1038064 1065842 1086616 1099221 1103005 1097970 1084810 1064688 1038878 1008778
62497 1008778 976043 942182 908003 873855 840458 808992 780369 754947 733034 714999 700644
62486 700644 689215 680558 675750 675960 680962 689299 699684 711785 725828 742032 760398 780602 801873
62473 801873 823116 843104 860592 874527 884417 890294 892161 889668 882525 870842 854853 834632
62461 834632 810460 783159 753728 722928 691545 660621 630871 602095 573806 546351 520949
62450 520949 498651 479673 463630 450010 438456 428909 421394 415431 410014 404587 399720 396239 394042
62437 394042 392450 391433 391530 392664 393970 394916 395642 395954 394975 392331 388862 385511 382099 377948 373241 368982
62421 368982 365783 363341 361042 358566 355901 353165 350501 347958 345508 343304 341682 340663 339738 338450
$$ packed form
62509I24438M2195L8029L3402K7778K0774J2605L784n035j3160k0122k5810l0100
62497A008778l2735l3861l4179l4148l3397l1466k8623k5422k1913j8035j4355
62486G00644j1429q657m808K10N002Q337J0385J2101J4043J6204J8366K0204K1271
62473H01873K1243J9988J7488J3935R890N877J867k493p143j1683j5989k0221
62461H34632k4172k7301k9431l0800l1383l0924k9750k8776k8289k7455k5402
62450E20949k2298j8978j6043j3620j1554r547p515n963n417n427m867l481k197
62437C94042j592j017R7J134J306R46P26L12r79k644l469l351l412m151m707m259
62421C68982l199k442k299k476k665k736k664k543k450k204j622j019r25j288
$$ plain form
62407 338450 336935 335467 333760 331270 328136 325288 323489 322677 322381 322394 322815 323680 324854 326222 327809 329654
62391 329654 331602 333227 334057 334026 333673 333815 334995 337288 340523 344494 348967 353662 358414 363351 368875
62376 368875 375364 382833 390931 399438 408725 419481 431869 445211 458748 472536 487337 503771
62364 503771 521937 541882 564031 588981 617093 648540 683697 723248 767770 817210 870715
62353 870715 926921 984385 1041653 1096968 1148099 1192692 1228893 1255703 1272953 1281183 1281463 1274899
62341 1274899 1261997 1242522 1216189 1183521 1145929 1105002 1061881 1017362 972370 928056 885471
62330 885471 845337 808172 774415 744267 717609 694229 673962 656337 640280 624585 608829
62319 608829 593516 579136 565374 551432 536903 522031 507281 492976 479341 466578 454745
$$ packed form
62407C38450j515j468j707k490l134k848j799q12k96J3M21Q65J174J368J587J845
62391C29654J948J625Q30l1l53J42J180K293L235L971M473M695M752M937N524
62376C68875O489P469Q098Q507R287J0756J2388J3342J3537J3788J4801J6434
62364E03771J8166J9945K2149K4950K8112L1447L5157L9551M4522M9440N3505
62353H70715N6206N7464N7268N5315N1131M4593L6201K6810J7250Q230K80o564
62341A274899j2902j9475k6333l2668l7592m0927m3121m4519m4992m4314m2585
62330H85471m0134l7165l3757l0148k6658k3380k0267j7625j6057j5695j5756
62319F08829j5313j4380j3762j3942j4529j4872j4750j4305j3635j2763j1833
$$ plain form
62308 454745 443731 433417 423803 414982 407088 400251 394476 389585 385392 381864 378940 376245 373277 369939
62294 369939 366677 363962 361852 360231 359260 359296 360395 362159 364178 366466 369413 373367 378317 383878 389531
62279 389531 394900 399928 404783 409629 414491 419323 424187 429350 435272 442466 451284 461713 473380 485819
62265 485819 498848 512844 528731 547645 570427 597294 628088 662842 702050 746237 795383
62254 795383 848893 906045 966114 1027855 1088995 1146441 1197110 1238703 1270068 1291172 1302702
62243 1302702 1305426 1299830 1286415 1266092 1239820 1207796 1169460 1124695 1074827 1022112 968407 914684
62231 914684 861663 810364 761891 717070 676468 640344 608380 579796 554103 531500 512230
62220 512230 495820 481376 468457 457106 447115 437879 429108 421120 414192 408041 402211 396584 391179
$$ packed form
62308D54745j1014j0314r614q821p894o837n775m891m193l528k924k695k968l338
62294C69939l262k715k110j621r71L6J099J764K019K288K947L954M950N561N653
62279C89531N369N028M855M846M862M832M864N163N922P194Q818J0429J1667J2439
62265D85819J3029J3996J5887J8914K2782K6867L0794L4754L9208M4187M9146
62254G95383N3510N7152O0069O1741O1140N7446N0669M1593L1365K1104J1530
62243A302702K724n596j3415k0323k6272l2024l8336m4765m9868n2715n3705n3723
62231I14684n3021n1299m8473m4821m0602l6124l1964k8584k5693k2603j9270
62220E12230j6410j4444j2919j1351r991r236q771p988o928o151n830n627n405
$$ plain form
62207 391179 385871 380759 376465 373531 371642 369990 368384 367460 367776 369227 371534 374816 379348 385037 391463
62192 391463 398312 405562 413371 422005 431824 443126 455929 469862 484277 498561 512498 526259
62180 526259 539900 552938 564639 574582 582682 588824 593011 595964 599067 603493 609807 618626 631096
62167 631096 648197 669911 695660 725437 759957 799585 843447 889632 935868 979912 1019693
62156 1019693 1053492 1080231 1099647 1112301 1119316 1121872 1120671 1115617 1105837 1090162 1068031 1040150
62144 1040150 1008152 973549 937250 900060 863161 827752 794574 764073 736653 712326 690445
62133 690445 670396 652420 637241 624929 614679 605689 597739 590870 585052 580364 577020 574978 573840
62120 573840 573267 573216 573650 574367 575205 576065 576615 576407 575475 574424 573671 572956 571803 570059 567729 564684 561004
$$ packed form
62207C91179n308n112m294k934j889j652j606r24L16J451K307L282M532N689O426
62192C91463O849P250P809Q634R819J1302J2803J3933J4415J4284J3937J3761
62180E26259J3641J3038J1701R943Q100O142M187K953L103M426O314Q819J2470
62167F31096J7101K1714K5749K9777L4520L9628M3862M6185M6236M4044L9781
62156A019693L3799K6739J9416J2654P015K556j201n054r780j5675k2131k7881
62144A040150l1998l4603l6299l7190l6899l5409l3178l0501k7420k4327k1881
62133F90445k0049j7976j5179j2312j0250q990p950o869n818m688l344k042j138
62120E73840n73n1M34P17Q38Q60N50k08r32j051p53p15j153j744k330l045l680
$$ plain form
62103 561004 557338 554471 552697 551898 552029 553091 554852 557110 560187 564657 570551 577268 584401 592224 601125
62088 601125 610869 620790 630597 640702 651667 663559 675985 688763 702389 717691 735071 754258
62076 754258 774785 796507 819534 843878 869390 895880 922992 950013 976075 1000647 1023736
62065 1023736 1045625 1066683 1087495 1108916 1131640 1155570 1179647 1202369 1222499 1239325 1252319
62054 1252319 1260804 1264133 1262234 1255720 1245314 1231199 1213019 1190415 1163404 1132295 1097449 1059318
62042 1059318 1018699 976804 934917 893886 854003 815382 778334 743344 710864 681397 655648
62031 655648 634215 616999 603100 591441 581311 572376 564501 557713 551991 546877 541529 535439 528840
62018 528840 522086 514898 506687 497576 488592 480717 474068 468145 462543 457289 452838 450068 450044 453331 459389
$$ packed form
62103E61004l666k867j774p99J31J062J761K258L077M470N894O717P133P823Q901
62088F01125R744R921R807J0105J0965J1892J2426J2778J3626J5302J7380J9187
62076G54258K0527K1722K3027K4344K5512K6490K7112K7021K6062K4572K3089
62065A023736K1889K1058K0812K1421K2724K3930K4077K2722K0130J6826J2994
62054A252319Q485L329j899o514j0406j4115j8180k2604k7011l1109l4846l8131
62042A059318m0619m1895m1887m1031l9883l8621l7048l4990l2480k9467k5749
62031F55648k1433j7216j3899j1659j0130q935p875o788n722n114n348o090o599
62018E28840o754p188q211r111q984p875o649n923n602n254m451k770k4L287O058
$$ plain form
62003 459389 466853 474585 482490 491294 501578 513048 524717 535650 545350 553445 559316 562365 562599
61990 562599 560637 557091 552191 546065 539040 531439 523283 514451 504973 494976 484533 473859 463476
61977 463476 453706 444146 434260 424641 417060 412718 410802 409222 406601 403104 399585 396587 394183 392141
61963 392141 390027 387628 385459 384389 384533 384999 385086 385278 386591 389322 392972 397098 401663 406756 412646
61948 412646 420058 429743 441657 455121 469958 486974 507052 530141 555391 582084 610239 640544
61936 640544 673737 709762 747423 785097 821800 857273 891159 922733 951648 978332 1003182
61925 1003182 1025604 1044152 1057416 1064649 1065874 1061739 1053122 1040701 1025152 1007776 990468 974853
61913 974853 961856 952328 947489 948314 954940 967143 984974 1008324 1036158 1066747 1098377 1129313
$$ packed form
62003D59389P464P732P905Q804J0284J1470J1669J0933R700Q095N871L049K34
61990E62599j962l546m900o126p025p601q156q832r478r997j0443j0674j0383
61977D63476r770r560r886r619p581m342j916j580k621l497l519k998k404k042
61963C92141k114k399k169j070J44M66Q7J92J313K731L650M126M565N093N890
61948D12646P412R685J1914J3464J4837J7016K0078K3089K5250K6693K8155L0305
61936F40544L3193L6025L7661L7674L6703L5473L3886L1574K8915K6684K4850
61925A003182K2422J8548J3264P233J225m135q617j2421j5549j7376j7308j5615
61913I74853j2997r528m839Q25O626J2203J7831K3350K7834L0589L1630L0936
$$ plain form
61901 1129313 1157438 1180707 1197911 1208411 1211348 1205932 1192510 1172639 1147964 1119578 1088392 1055355
61889 1055355 1021047 985735 950083 915220 881852 849900 819360 790922 765259 742149 720762
61878 720762 700519 681273 662935 645380 628576 612569 597547 584108 573051 564546 557839 552145
61866 552145 547582 544894 544627 547041 552504 561286 573069 587243 603751 623176 646003 672222 701765
61853 701765 734927 772272 814345 861432 913193 968488 1025940 1084725 1144415 1204054 1261860
61842 1261860 1315994 1365099 1407782 1442090 1466051 1478701 1480257 1471541 1453703 1428571 1398892 1367931
61830 1367931 1338724 1313523 1293726 1280293 1274240 1276589 1287692 1306659 1331526 1359863 1389162 1416859
61818 1416859 1440304 1456800 1463787 1459394 1443132 1415936 1379266 1334328 1282370 1225323 1165433 1104284
$$ packed form
61901A129313K8125K3269J7204J0500K937n416j3422j9871k4675k8386l1186l3037
61889A055355l4308l5312l5652l4863l3368l1952l0540k8438k5663k3110k1387
61878G20762k0243j9246j8338j7555j6804j6007j5022j3439j1057q505o707n694
61866E52145m563k688k67K414N463Q782J1783J4174J6508J9425K2827K6219K9543
61853G01765L3162L7345M2073M7087N1761N5295N7452N8785N9690N9639N7806
61842A261860N4134M9105M2683L4308K3961J2650J556q716j7838k5132k9679l0961
61830A367931k9207k5201j9797j3433o053K349J1103J8967K4867K8337K9299K7697
61818A416859K3445J6496O987m393j6262k7196l6670m4938n1958n7047n9890o1149
$$ plain form
61806 1104284 1042713 981779 923227 868739 819133 774471 734397 698128 664716 633959 606691
61795 606691 583621 564186 547084 531685 518185 506530 495991 485970 476510 467797 459700 452048
61783 452048 444890 438214 431900 426231 421880 418962 416506 413380 409468 405556 402410 400411 399704 400035 400614
61768 400614 400806 401001 402207 404697 407559 409686 410773 411196 411420 411828 412757 414281 416069 417750 419321 421046
61752 421046 423044 425168 427225 429100 430651 431595 431595 430490 428412 425665 422487 419091 415930 413691 412761
61737 412761 412799 413102 413387 413979 415242 417070 419075 421051 423107 425436 428111 431102 434397 438071 442180
61722 442180 446590 451003 455219 459296 463425 467789 472577 477940 483754 489600 495104 500128 504409 507307
61708 507307 508308 507666 506144 504130 501342 497410 492458 487076 481928 477292 472783 467685 461975 456816
$$ packed form
61806A104284o1571o0934n8552n4488m9606m4662m0074l6269l3412l0757k7268
61795F06691k3070j9435j7102j5399j3500j1655j0539j0021r460q713q097p652
61783D52048p158o676o314n669m351k918k456l126l912l912l146j999p07L31N79
61768D00614J92J95J206K490K862K127J087M23K24M08R29J524J788J681J571J725
61752D21046J998K124K057J875J551R44%j105k078k747l178l396l161k239r30
61737D12761L8L03K85N92J263J828K005J976K056K329K675K991L295L674M109
61722D42180M410M413M216M077M129M364M788N363N814N846N504N024M281K898
61708E07307J001o42j522k014k788l932m952n382n148m636m509n098n710n159
$$ plain form
61694 456816 453501 451927 450679 448679 446070 443322 440278 436658 433003 430332 428912 427896 426225 423571
61680 423571 420426 417575 415481 413980 412457 410416 407853 405106 402512 400285 398526 397174 396051 395071
61666 395071 394273 393616 392946 392232 391637 391232 390923 390723 390807 391162 391525 391817 392286 393039 393892 394987 397009 400268
61648 400268 403990 407231 410298 414549 420755 428334 436222 443865 451168 458109 464786 471418 477826 483116
61634 483116 486243 486877 485540 482956 479407 474585 467970 459484 449941 440843 433586 428761 425995 424269
61620 424269 422486 420168 417845 416639 417312 419712 423090 426671 429802 431847 432341 431322 429293 426694 423395
61605 423395 418762 412369 404649 396762 389617 383076 376285 368830 361322 354730 349278 344222 338747 332969
61591 332969 327939 324636 322974 321868 320255 317944 315451 313262 311443 309857 308448 307263 306322 305498 304479
$$ packed form
61694D56816l315j574j248k000k609k748l044l620l655k671j420j016j671k654
61680D23571l145k851k094j501j523k041k563k747k594k227j759j352j123r80
61666C95071p98o57o70p14n95m05l09k00Q4L55L63K92M69P53Q53J095K022L259
61648D00268L722L241L067M251O206P579P888P643P303O941O677O632O408N290
61634D83116L127O34j337k584l549m822o615q486r543r098p257m825k766j726
61620D24269j783k318k323j206O73K400L378L581L131K045M94j019k029k599l299
61605D23395m633o393p720p887p145o541o791p455p508o592n452n056n475n778
61591C32969n030l303j662j106j613k311k493k189j819j586j409j185r41q24j019
$$ plain form
61576 304479 302908 300694 298077 295284 292290 289121 286198 283921 282003 279709 276870 274207 272404 271217
61562 271217 269820 267814 265603 263923 263257 263614 264646 265953 267358 268729 269602 269428 268393 267515 267456 267579
61546 267579 266819 265298 264297 264525 265129 264776 263231 261467 260590 261078 262771 265087 267330 269200 271023 273194
61530 273194 275488 277229 278102 278455 278821 279433 280186 280656 280136 278069 274669 270819 267190 263703 259991 256077
61514 256077 252351 249151 246665 244983 243925 242977 241723 240226 238750 237397 236330 236038 236813 238061 238728
61499 238728 238428 237688 237016 236333 235429 234363 233127 231507 229664 228377 228201 228758 229349 229935 230869 231911 232285
61482 232285 231805 231334 231906 233770 236418 239154 241446 243041 244073 244965 246034 247202 248066 248170 247321 245843
61466 245843 244465 243654 243113 242250 241119 240479 240775 241490 241754 241328 240715 240499 240845 241543 242293 242947 243518 243967
$$ packed form
61576C04479j571k214k617k793k994l169k923k277j918k294k839k663j803j187
61562B71217j397k006k211j680o66L57J032J307J405J371Q73j74j035q78n9J23
61546B67579p60j521j001K28O04l53j545j764q77M88J693K316K243J870J823K171
61530B73194K294J741Q73L53L66O12P53M70n20k067l400l850l629l487l712l914
61514B56077l726l200k486j682j058r48j254j497j476j353j067k92P75J248O67
61499B38728l00p40o72o83r04j066j236j620j843j287j76N57N91N86R34J042L74
61482B32285m80m71N72J864K648K736K292J595J032Q92J069J168Q64J04q49j478
61466B45843j378q11n41q63j131o40K96P15K64m26o13k16L46O98P50O54N71M49
$$ plain form
61448 243967 244062 243698 243328 243679 244841 246080 246827 247598 249484 252928 257415 262252 267163 272098 276929 281541
61432 281541 285988 290302 294302 297726 300448 302538 304161 305498 306644 307599 308469 309662 311637 314361 317179
61417 317179 319428 321157 323159 326232 330381 334690 337944 339487 339525 338700 337476 335868 333555 330134 325541
61402 325541 320440 315927 312477 309360 305570 301236 297567 295318 293908 292273 290026 287425 284807 282601
61388 282601 281453 281551 282013 281606 280098 278351 277161 276647 276772 277632 278914 279774 279797 279654 280336 282028 284143
61371 284143 286176 288069 289961 292098 294868 298494 302675 306836 310665 314191 317510 320711 323923 327089
61357 327089 329921 332447 335407 339601 344997 351011 357552 365206 374351 384656 395549 406592 417293
61344 417293 427149 436136 444616 452533 459270 464674 469679 475439 482208 489485 496843 504074 510847 516754
$$ packed form
61448B43967R5l64l70L51J162J239P47P71J886L444M487M837M911M935M831M612
61432B81541M447M314M000L424K722K090J623J337J146R55Q70J193J975K724K818
61417C17179K249J729K002L073M149M309L254J543L8q25j224j608k313l421m593
61402C25541n101m513l450l117l790m334l669k249j410j635k247k601k618k206
61388B82601j148R8M62m07j508j747j190n14J25Q60J282Q60K3j43O82J692K115
61371B84143K033J893J892K137K770L626M181M161L829L526L319L201L212L166
61357C27089K832K526K960M194N396O014O541P654R145J0305J0893J1043J0701
61344D17293R856Q987Q480P917O737N404N005N760O769P277P358P231O773N907
$$ plain form
61330 516754 521481 524563 525343 523707 520541 516797 512405 506818 500398 494289 488878 483397 477335 471385
61316 471385 466445 462370 458454 454668 451684 449856 448889 448504 448816 449906 451533 453587 456508 460945 467053
61301 467053 474257 481608 488102 492703 494454 492992 489026 484012 479053 474131 468595 462308 456040 450704
61287 450704 446461 442796 439228 435731 432550 429880 427820 426466 425924 426226 427307 429086 431610 435053 439535
61272 439535 444940 450963 457368 464182 471555 479377 487051 493838 499611 505159 511490 518835 526664 534790
61258 534790 544023 555403 569028 583962 599063 613468 626485 637704 647391 656308 664903 672879
61246 672879 679649 684821 688174 689535 688999 686937 683539 678557 671739 663275 653549 642751 631047 618938
61232 618938 606931 594978 582716 570416 559318 550717 544756 540294 535955 531229 526579 522624 519438
$$ packed form
61330E16754M727L082P80j636l166l744m392n587o420o109n411n481o062n950
61316D71385m940m075l916l786k984j828r67l85L12J090J627K054K921M437O108
61301D67053P204P351O494M601J751j462l966n014m959m922n536o287o268n336
61287D50704m243l665l568l497l181k670k060j354n42L02J081J779K524L443M482
61272D39535N405O023O405O814P373P822P674O787N773N548O331P345P829Q126
61258E34790R233J1380J3625J4934J5101J4405J3017J1219R687Q917Q595P976
61246F72879O770N172L353J361n36k062l398m982o818q464r726j0798j1704j2109
61232F18938j2007j1953j2262j2300j1098q601n961m462m339m726m650l955l186
$$ plain form
61219 519438 516709 514316 512349 510620 508641 506340 504494 504104 505428 507830 510383 512307 513077 512605 511442
61204 511442 510459 510178 510532 511275 512397 514134 516912 521383 528233 537648 549137 562047 576203 591787
61190 591787 608641 625869 642163 656402 668013 677021 684038 690123 696312 703025 709876 716099 721128
61177 721128 724861 727626 730068 732807 735851 738408 739643 739583 738895 737797 735766 732606 729136 726265 723695
61162 723695 720208 715096 708652 701245 692615 682365 670674 658160 645356 632658 620538 609511
61150 609511 599954 592122 586181 582055 579335 577443 575594 572554 566936 558188 547101 534944 522276
61137 522276 508975 495235 481886 469688 458806 449188 441015 434479 429440 425617 422943 421529 421432
61124 421432 422615 424961 428233 432335 437778 445460 455576 467122 479041 491627 506148 523114 541636
$$ packed form
61219E19438k729k393j967j729j979k301j846l90J324K402K553J924P70m72j163
61204E11442r83k81L54P43J122J737K778M471O850R415J1489J2910J4156J5584
61190E91787J6854J7228J6294J4239J1611R008P017O085O189O713O851O223N029
61177G21128L733K765K442K739L044K557J235o0o88j098k031l160l470k871k570
61162G23695l487n112o444p407q630j0250j1691j2514j2804j2698j2120j1027
61150F09511r557p832n941m126k720j892j849l040n618q748j1087j2157j2668
61137E22276j3301j3740j3349j2198j0882r618q173o536n039l823k674j414r7
61124D21432J183K346L272M102N443P682J0116J1546J1919J2586J4521J6966J8522
$$ plain form
61111 541636 560637 580000 600176 621241 642813 664567 686307 707743 728585 748670 767593
61100 767593 784416 798146 808385 815167 818432 818189 815057 809947 803150 794294 783294 770805 757455
61087 757455 743147 727446 710357 692369 674012 655616 637263 618749 599812 580640 561931
61076 561931 544236 527543 511700 496914 483461 471198 459789 449200 439607 430921 422880 415532
61064 415532 409209 403977 399424 395046 390619 386318 382697 380462 379897 380548 381748 383348 385545 388144 390560
61049 390560 392716 395433 399682 405723 413180 421663 431065 441453 452943 465607 479341 493865 508854
61036 508854 524047 539346 555047 571840 590212 609848 629966 650318 671521 694370 719203
61025 719203 746061 775136 807060 843213 885818 937186 998700 1071295 1157243 1260793 1386743
$$ packed form
61111E41636J9001J9363K0176K1065K1572K1754K1740K1436K0842K0085J8923
61100G67593J6823J3730J0239O782L265k43l132n110o797q856j1000j2489j3350
61087G57455j4308j5701j7089j7988j8357j8396j8353j8514j8937j9172j8709
61076E61931j7695j6693j5843j4786j3453j2263j1409j0589r593q686q041p348
61064D15532o323n232m553m378m427m301l621k235n65O51J200J600K197K599K416
61049C90560K156K717M249O041P457Q483R402J0388J1490J2664J3734J4524J4989
61036E08854J5193J5299J5701J6793J8372J9636K0118K0352K1203K2849K4833
61025G19203K6858K9075L1924L6153M2605N1368O1514P2595Q5948J03550J25950
$$ plain form
61014 1386743 1539584 1724657 1947420 2206484 2484220 2745666 2951184 3075046 3116059 3094277
61004 3094277 3040052 2984690 2954842 2966334 3016013 3078053 3112230 3082198 2971712 2788118 2553941
60993 2553941 2295823 2037597 1797148 1584679 1402778 1249265 1120922 1015060 928830 858742
60983 858742 801472 754689 716691 685635 659515 636844 617076 600247 586191 574053 562634
60972 562634 551189 539746 528538 517426 506196 495227 485342 476791 468795 460330 451147 441812 432926
60959 432926 424676 417075 410286 404501 399661 395425 391440 387614 384175 381493 379772 378883 378526 378580 379196
60944 379196 380451 382111 383923 386058 388907 392372 395684 398124 399646 400514 400635 399697 397773 395211 391965
60929 391965 387662 382453 377191 372452 367938 363259 358724 354816 351300 347644 344052 341299 339559 338130
$$ packed form
61014A386743J52841J85073K22763K59064K77736K61446K05518J23862M1013k1782
61004C094277n4225n5362k9848J1492M9679O2040L4177l0032j10486j83594k34177
60993B553941k58118k58226k40449k12469j81901j53513j28343j05862q6230p0088
60983H58742n7270m6783l7998l1056k6120k2671j9768j6829j4056j2138j1419
60972E62634j1445j1443j1208j1112j1230j0969r885q551p996q465r183r335q886
60959D32926q250p601o789n785m840m236l985l826l439k682j721q89l57N4O16
60944C79196J255J660J812K135K849L465L312K440J522Q68J21r38j924k562l246
60929C91965m303n209n262m739m514m679m535l908l516l656l592k753j740j429
$$ plain form
60915 338130 336439 334728 333525 332988 333051 333796 335384 337896 341351 345554 349892 353773 357374 361442 366206
60900 366206 371090 375722 380479 385597 390468 394534 398272 402378 406303 408554 408345 406162 402781 398666
60886 398666 394337 390314 386302 381264 374869 368235 362671 358140 353565 348297 342668 337323 332698 329123
60872 329123 326895 325958 325798 325786 325566 325208 325141 325817 327238 328877 330310 331838 334235 337937 342673 347841
60856 347841 352983 357954 362913 368185 373896 379713 385206 390456 395947 401761 407301 412076 416439 421110
60842 421110 426081 430457 433510 435496 437192 438791 439592 438773 436260 432760 429092 425672 422543 419625 416695
60827 416695 413266 408795 403167 396834 390367 384002 377800 372026 367009 362658 358534 354522 351072 348486
60813 348486 346295 343764 340821 338056 335913 334344 333290 333010 333750 335412 337698 340309 342943 345442 348119
$$ packed form
60915C38130j691j711j203n37O3P45J588K512L455M203M338L881L601M068M764
60900C66206M884M632M757N118M871M066L738M106L925K251k09k183l381m115
60886C98666m329m023m012n038o395o634n564m531m575n268n629n345m625l575
60872C29123k228r37j60j2k20l58o7O76J421J639J433J528K397L702M736N168
60856C47841N142M971M959N272N711N817N493N250N491N814N540M775M363M671
60842D21110M971M376L053J986J696J599Q01q19k513l500l668l420l129k918k930
60827D16695l429m471n628o333o467o365o202n774n017m351m124m012l450k586
60813C48486k191k531k943k765k143j569j054k80P40J662K286K611K634K499K677
$$ plain form
60798 348119 351580 356068 361295 367032 373358 380129 386808 393342 400750 410118 421235 432905 444463
60785 444463 456355 469267 483480 499221 516971 537003 558969 582253 606521 631768 658130
60774 658130 685869 715313 746612 779640 814081 849360 884499 918418 950440 980200 1007043
60763 1007043 1029854 1047491 1058958 1063155 1059150 1047095 1028505 1005260 978558 948931 916876 883083
60751 883083 848345 813595 779837 747768 717612 689465 663516 639732 617648 596732 576727
60740 576727 557519 539038 521519 505388 490563 476264 461926 447934 435016 423286 412383
60729 412383 402223 393041 384900 377746 371714 366869 362805 359141 356252 354846 354885 355582 356464 357728 359405
60714 359405 360944 361991 363023 364789 367395 370261 372686 374206 374636 374073 372732 370660 367755 364063 359798
$$ packed form
60798C48119L461M488N227N737O326O771O679O534P408R368J1117J1670J1558
60785D44463J1892J2912J4213J5741J7750K0032K1966K3284K4268K5247K6362
60774F58130K7739K9444L1299L3028L4441L5279L5139L3919L2022K9760K6843
60763A007043K2811J7637J1467M197m005j2055j8590k3245k6702k9627l2055l3793
60751H83083l4738l4750l3758l2069l0156k8147k5949k3784k2084k0916k0005
60740E76727j9208j8481j7519j6131j4825j4299j4338j3992j2918j1730j0903
60729D12383j0160r182q141p154o032m845m064l664k889j406L9O97Q82J264J677
60714C59405J539J047J032J766K606K866K425J520M30n63j341k072k905l692m265
$$ plain form
60699 359798 354949 349181 342335 334871 327664 321448 316381 311962 307471 302803 298781 296238 294837 293332
60685 293332 291064 288593 286643 285068 283275 281159 279074 277191 275455 274019 273176 272912 272937 273128 273533 273931
60669 273931 273791 272846 271442 270228 269626 269693 270316 271426 273034 275051 277118 278815 280157 281703 283994 287037
60653 287037 290522 294303 298352 302408 306164 309821 314047 319261 325245 331626 338306 345151 351555 356782
60639 356782 360680 363695 366156 367883 368642 368712 368687 368792 368644 367760 366129 364136 361952 359184 355307 350432
60623 350432 345420 341087 337413 333773 329879 326141 322978 320133 317013 313470 309903 306682 303926 301841
60609 301841 300774 300675 300791 300204 298556 296146 293569 291430 290159 289785 289960 290316 290651 290706 290135 288994 287941
60592 287941 287561 287636 287491 286915 286280 285869 285611 285476 285610 285935 286129 286255 286962 288762 291454 294661 298617 303920
$$ packed form
60699C59798m849n768o846p464p207o216n067m419m491m668m022k543j401j505
60685B93332k268k471j950j575j793k116k085j883j736j436q43k64K5J91M05L98
60669B73931j40r45j404j214o02O7O23J110J608K017K067J697J342J546K291L043
60653B87037L485L781M049M056L756L657M226N214N984O381O680O845O404N227
60639C56782L898L015K461J727P59P0k5J05j48q84j631j993k184k768l877m875
60623C50432n012m333l674l640l894l738l163k845l120l543l567l221k756k085
60609C01841j067r9J16n87j648k410k577k139j271l74J75L56L35N5n71j141j053
60592B87941l80P5j45n76o35m11k58j35J34L25J94J26P07J800K692L207L956N303
$$ plain form
60574 303920 310672 318337 326488 335115 344033 352388 359259 364610 369193 373399 376550 377572 376136 372900
60560 372900 368791 364425 360199 356459 353349 350767 348759 347814 348616 351653 357148 365036 374765 385332
60546 385332 395907 406280 416473 426057 434187 440177 443695 444518 442544 438187 432466 426612 421579 417767
60532 417767 414930 412488 410170 408235 406825 405434 403485 401184 399264 398025 397272 397149 398191 400333 402591
60517 402591 404149 405264 406702 408780 411551 415534 421599 430083 440492 452197 465233 480324 498220
60504 498220 519013 542147 567147 594219 623829 655619 687998 718778 745912 767629 782344
60493 782344 788799 786156 773973 752549 723459 689336 652719 615367 578763 544730 514904 489687
60481 489687 468175 449096 431646 415671 401445 389323 379279 370732 362908 355389 348270 341954
$$ packed form
60574C03920O752P665Q151Q627Q918Q355O871N351M583M206L151J022j436l236
60560C72900m109m366m226l740l110k582k008r45Q02L037N495P888R729J0567
60546C85332J0575J0373J0193R584Q130N990L518Q23j974m357n721n854n033l812
60532D17767k837k442k318j935j410j391j949k301j920j239p53j23J042K142K258
60517D02591J558J115J438K078K771L983O065Q484J0409J1705J3036J5091J7896
60504D98220K0793K3134K5000K7072K9610L1790L2379L0780K7134K1717J4715
60493G82344O455k643j2183k1424k9090l4123l6617l7352l6604l4033k9826k5217
60481D89687k1512j9079j7450j5975j4226j2122j0044q547p824p519p119o316
$$ plain form
60469 341954 336854 333060 330119 327317 324293 321183 318112 314936 311712 309012 307330 306383 305437 304170 302863
60454 302863 301819 301013 300312 299696 299170 298685 298212 297753 297266 296672 295936 295044 293969 292763 291537 290269 288784
60437 288784 287096 285623 284820 284640 284531 283977 282985 282069 281748 281967 282042 281383 280255 279590 280021 281400 283255
60420 283255 285271 287160 288525 289276 289911 291015 292529 293758 294004 293164 291913 291395 292359 294422 296443 297704
60404 297704 298381 298824 299003 299015 299467 300765 302410 303652 304561 305872 307932 310334 312504 314120 315079 315567
60388 315567 316152 317416 319499 322191 325237 328245 330636 332201 333456 334965 336546 337682 338456 339400 340584
60373 340584 341575 342254 342963 343801 344456 344873 345479 346507 347619 348357 348589 348409 348089 348163 349058 350523 351881 352968
60355 352968 354311 356312 358826 361679 364941 368404 371398 373523 375066 376261 376621 375531 373250 370812
$$ packed form
60469C41954n100l794k941k802l024l110l071l176l224k700j682r47r46j267j307
60454C02863j044q06p01o16n26m85m73m59m87n94p36q92j075j206j226j268j485
60437B88784j688j473q03j80j09n54r92r16l21K19P5o59j128o65M31J379J855
60420B83255K016J889J365P51O35J104J514J229K46q40j251n18R64K063K021J261
60404B97704O77M43J79J2M52J298J645J242R09J311K060K402K170J616R59M88
60388C15567N85J264K083K692L046L008K391J565J255J509J581J136P74R44J184
60373C40584R91O79P09Q38O55M17O06J028J112P38K32j80l20P4Q95J465J358J087
60355C52968J343K001K514K853L262L463K994K125J543J195L60j090k281k438
$$ plain form
60341 370812 369002 367808 366765 365538 364168 362963 362128 361477 360613 359401 358099 357033 356413 356459 357280 358497
60325 358497 359332 359330 358761 358159 357708 357305 356994 357096 358023 360040 363067 366673 370511 374819 380261 387217 395562
60308 395562 405227 416537 429622 443701 457287 469093 478566 485573 489725 490152 486110 477878 466875
60295 466875 454694 442217 429786 417889 407149 397851 390015 383808 379286 375886 372876 370343 368954
60282 368954 368661 368490 367863 367288 367239 367194 366429 365224 364438 364218 363858 362821 361292 359713 358210 356535 354372
60265 354372 351737 349145 347174 345849 344793 344041 344049 344654 344691 343181 340452 337600 335285 333557 332344 331455
60249 331455 330535 329706 329870 331573 333913 335432 335865 336126 336710 337199 337378 337764 338654 339540 339958 340214 340774 341548
60231 341548 342347 343474 345202 347008 348079 348490 349269 351230 354163 357270 360015 362375 364491 366332 367733
$$ packed form
60341C70812j810j194j043j227j370j205q35o51q64j212j302j066o20M6Q21J217
60325C58497Q35kn69o02m51m03l11J02R27K017L027L606L838M308N442O956Q345
60308C95562R665J1310J3085J4079J3586J1806R473P007M152M27m042q232j1003
60295D66875j2181j2477j2431j1897j0740r298p836o207m522l400l010k533j389
60282C68954k93j71o27n75m9m5p65j205p86k20l60j037j529j579j503j675k163
60265C54372k635k592j971j325j056p52QO05L7j510k729k852k315j728j213q89
60249C31455r20q29J64J703K340J519M33K61N84M89J79L86Q90Q86M18K56N60P74
60231C41548P99J127J728J806J071M11P79J961K933L107K745K360K116J841J401
$$ plain form
60216 367733 368689 369591 371092 373651 377118 380772 383852 386195 388364 391030 394244 397505 400562 403796 407591
60201 407591 411652 415429 419008 423061 427859 432828 437217 440810 443798 446378 448747 451199 453837 456313
60187 456313 458128 459158 459677 459932 459892 459406 458373 456774 454712 452485 450459 448727 446949 444671 441796
60172 441796 438694 435821 433389 431453 430126 429424 428922 427912 426101 423930 422063 420744 419849 419294 419066
60157 419066 418960 418721 418506 418832 419883 421125 421820 421847 421846 422621 424425 426761 428781 429962 430551 431407 433412
60140 433412 436967 441885 447584 453366 458663 463188 466941 470113 472952 475621 478084 480157 481728 482856
60126 482856 483630 484027 484029 483815 483664 483664 483530 482770 481046 478522 475942 474188 473593 473718 473913 474038 474500 475592
60108 475592 477027 478147 478512 478218 477666 477118 476559 476007 475784 476262 477327 478326 478630 478138 477211 476339 475958 476298
$$ packed form
60216C67733R56R02J501K559L467L654L080K343K169K666L214L261L057L234L795
60201D07591M061L777L579M053M798M969M389L593K988K580K369K452K638K476
60187D56313J815J030N19K55m0m86j033j599k062k227k026j732j778k278k875
60172D41796l102k873k432j936j327p02n02j010j811k171j867j319q95n55k28
60157D19066j06k39k15L26J051J242O95K7jP75J804K336K020J181N89Q56K005
60140D33412L555M918N699N782N297M525L753L172K839K669K463K073J571J128
60126D82856P74L97Kk14j51%j34p60j724k524k580j754n95J25J95J25M62J092
60108D75592J435J120L65k94n52n48n59n52k23M78J065R99L04m92r27q72l81L40
$$ plain form
60090 476298 477200 478209 479079 480020 481309 482791 483989 484637 484885 485100 485634 486680 488158 489778 491345 492870
60074 492870 494318 495440 496058 496230 495928 494794 492552 489390 485538 480721 474568 467416 460188 453455 447193
60059 447193 441465 436650 432748 429067 425048 420994 417555 414794 412223 409566 406976 404599 402424 400627
60045 400627 399668 399839 400894 402277 403594 404802 406202 408374 411902 416812 422237 426881 430013 431958 433528
60030 433528 435094 436366 437014 437140 436941 436131 434042 430321 425309 419650 413712 407552 401237 394954 388824
60015 388824 382842 377167 372230 368318 365088 361734 357753 353397 349324 345987 343470 341633 340202 338912
60001 338912 337893 337745 338854 340717 342329 343185 343535 343710 343766 343883 344516 345843 347445 348843 350044 351325
59985 351325 352900 355034 358020 361652 365140 368015 370746 373961 377376 380108 381806 382889 383799 384650 385550
$$ packed form
60090D76298R02J009Q70R41J289J482J198O48K48K15N34J046J478J620J567J525
60074D92870J448J122O18J72l02j134k242l162l852m817o153p152p228o733o262
60059D47193n728m815l902l681m019m054l439k761k571k657k590k377k175j797
60045D00627r59J71J055J383J317J208J400K172L528M910N425M644L132J945J570
60030D33528J566J272O48J26j99q10k089l721n012n659n938o160o315o283o130
60015C88824n982n675m937l912l230l354l981m356m073l337k517j837j431j290
60001C38912j019j48J109J863J612Q56L50J75N6J17O33J327J602J398J201J281
59985C51325J575K134K986L632L488K875K731L215L415K732J698J083R10Q51R00
$$ plain form
59970 385550 386670 387924 388994 389724 390116 390105 389745 389463 389576 389707 389323 388754 388952 390197 391812 393246 394598
59953 394598 395860 396457 396092 395326 394823 394626 394683 395417 396942 398234 397997 396263 394284 392925 391907 390725
59937 390725 389471 388429 387475 386313 384906 383282 381248 378741 376295 374652 373899 373351 372366 370993 369770
59922 369770 369165 369418 370607 372521 374618 376518 378532 381303 384864 388474 391556 394378 397464 400752 403833
59907 403833 406763 410030 413785 417642 421269 424661 427753 430346 432605 435101 438018 440729 442494 443227
59893 443227 443204 442354 440368 437403 434186 431379 429228 427817 427235 427369 427877 428742 430587 434057 438873 443883
59877 443883 448189 451879 455403 458656 461215 463290 465545 467799 468727 467499 465102 463258 462388 461527 460004
59862 460004 458166 456373 454358 452041 450037 448710 447366 445162 442389 440083 438571 437140 435102 432524
$$ packed form
59970C85550J120J254J070P30L92j1l60k82J13J31l84n69J98J245J615J434J352
59953C94598J262N97l65p66n03j97N7P34J525J292k37j734j979j359j018j182
59937C90725j254j042r54j162j407j624k034k507k446j643p53n48r85j373j223
59922C69770o05K53J189J914K097J900K014K771L561L610L082K822L086L288L081
59907D03833K930L267L755L857L627L392L092K593K259K496K917K711J765P33
59893D43227k3q50j986k965l217k807k151j411n82J34N08Q65J845L470M816N010
59877D43883M306L690L524L253K559K075K255K254R28j228k397j844q70q61j523
59862D60004j838j793k015k317k004j327j344k204k773k306j512j431k038k578
$$ plain form
59848 432524 429777 426917 423794 420464 417241 414395 411890 409356 406360 402821 399144 395864 393236 391267
59834 391267 390030 389777 390733 392853 395745 398848 401765 404435 406857 408706 409532 409377 408849 408431 408017 407328
59818 407328 406435 405522 404385 402608 400191 397739 396015 395433 395841 396550 396789 396404 396011 396211 396785 397028 396792
59801 396792 396681 397119 397564 396997 395041 392400 390193 388954 388291 387376 385664 383158 380159 376985 373908 371147
59785 371147 368812 366932 365576 364776 364303 363735 362862 361916 361297 361208 361568 362127 362608 362962 363557 364887 366892
59768 366892 368791 369734 369572 368940 368837 370154 373171 377213 381034 383885 386094 388365 390799 392957 394776
59753 394776 396900 399986 403944 408050 411729 415172 419172 424266 430022 435291 439261 442162 444869 447988
59739 447988 451423 454648 457227 459108 460570 461877 463019 463877 464498 464986 465273 465408 465954 467449 469392 470377
$$ packed form
59848D32524k747k860l123l330l223k846k505k534k996l539l677l280k628j969
59834C91267j237k53R56K120K892L103K917K670K422J849Q26j55n28m18m14o89
59818D07328q93r13j137j777k417k452j724n82M08P09K39l85l93K00N74K43k36
59801C96792j11M38M45n67j956k641k207j239o63r15j712k506k999l174l077k761
59785C71147k335j880j356q00m73n68q73r46o19q9L60N59M81L54N95J330K005
59768C66892J899R43j62o32j03J317L017M042L821K851K209K271K434K158J819
59753C94776K124L086L958M106L679L443M000N094N756N269L970K901K707L119
59739D47988L435L225K579J881J462J307J142Q58O21M88K87J35N46J495J943R85
$$ plain form
59723 470377 469536 467358 464789 462196 459697 457866 457274 457585 457850 457599 457103 456714 456531 456644 457107 457646 457898
59706 457898 457946 458218 458912 459980 461554 463865 466754 469772 472764 475832 478762 481079 482731 484217 485923
59691 485923 487820 489866 492101 494158 495263 495057 494077 493149 492623 492320 491809 490611 488588 486350 484855 484327
59675 484327 483939 482779 480700 478066 475154 472156 469271 466350 462807 458394 453779 449924 447120 445036
59661 445036 443468 442500 442015 441608 441025 440359 439787 439494 439872 441426 444335 448261 452649 457059 461193 464790
59645 464790 467592 469362 469932 469267 467453 464622 461080 457534 454825 453143 451757 449894 447689 445880 444603
59630 444603 443080 440626 437530 434591 432129 429853 427583 425552 423887 422169 419869 416988 413953 410892
59616 410892 407464 403519 399549 396179 393477 391176 389395 388620 388895 389505 389689 389387 389106 389276 389946 390893
$$ packed form
59723D70377q41k178k569k593k499j831n92L11K65k51m96l89j83J13M63N39K52
59706D57898M8K72O94J068J574K311K889L018K992L068K930K317J652J486J706
59691D85923J897K046K235K057J105k06r80r28n26l03n11j198k023k238j495n28
59675D84327l88j160k079k634k912k998k885k921l543m413m615l855k804k084
59661D45036j568r68m85m07n83o66n72k93L78J554K909L926M388M410M134L597
59645D64790K802J770N70o65j814k831l542l546k709j682j386j863k205j809j277
59630D44603j523k454l096k939k462k276k270k031j665j718k300k881l035l061
59616D10892l428l945l970l370k702k301j781p75K75O10J84l02k81J70O70R47
$$ plain form
59600 390893 391820 392553 393204 394027 395065 396100 396992 397834 398714 399560 400290 400809 400801 399970 398686 397840 397713 397446
59582 397446 396132 393992 391839 389786 387332 384558 382228 380520 378580 375717 372362 369291 366504 363536
59568 363536 360455 357864 356052 354792 353917 353565 353772 354267 354766 355160 355334 355176 354874 354872 355424 356440 357836
59551 357836 359710 361994 364359 366730 369704 374058 379975 387066 395068 404143 414498 426258 440009
59538 440009 457045 478240 502223 524858 541103 547877 545469 536535 524162 510812 498405 488386
59526 488386 481360 477026 474874 474830 477050 481193 486231 491016 494901 497825 499934 501168 501190 499694 496753
59511 496753 492709 487700 481526 474124 465927 457520 449131 440817 432996 426358 421155 416869 412670 408024
59497 408024 402944 397959 393929 391454 390279 389476 388391 387202 386455 386344 386655 387228 388133 389500 391350 393571
$$ packed form
59600C90893R27P33O51Q23J038J035Q92Q42Q80Q46P30N19qq31j284q46j27k67
59582C97446j314k140k153k053k454k774k330j708j940k863l355l071k787k968
59568C63536l081k591j812j260q75l52K07M95M99L94J74j58l02kN52J016J396
59551C57836J874K284K365K371K974M354N917P091Q002R075J0355J1760J3751
59538D40009J7036K1195K3983K2635J6245O774k408q934j2373j3350j2407j0019
59526D88386p026m334k152m4K220M143N038M785L885K924K109J234K2j496k941
59511D96753m044n009o174p402q197q407q389q314p821o638n203m286m199m646
59497D08024n080m985m030k475j175q03j085j189p47j11L11N73R05J367J850K221
$$ plain form
59481 393571 395914 398117 400160 402289 404703 407331 410101 413224 416980 421245 425405 428738 430845 431803
59467 431803 432002 431780 431152 430010 428662 427934 428528 430373 432828 435510 438676 442801 447989 453972 460624
59452 460624 468229 477082 486852 496621 505678 514098 522301 530209 537132 542380 545545 546199 543849 538501
59438 538501 531005 522651 514561 507441 501495 496298 491122 485668 480271 475246 470420 465678 461622 459177
59424 459177 458648 459617 461750 465337 470929 478756 488688 500683 515074 532276 552328 575046 600592
59411 600592 629105 658903 685386 702939 708533 703184 690147 672769 654202 637610 625363 618502
59399 618502 617585 622952 632841 642032 644192 635991 618362 594311 566928 539154 513467 490840 470919
59386 470919 453662 439851 429636 421745 414911 409126 404785 401552 398990 397538 397699 398724 399228 398861
$$ packed form
59481C93571K343K203K043K129K414K628K770L123L756M265M160L333K107R58
59467D31803J99k22o28j142j348p28N94J845K455K682L166M125N188N983O652
59452D60624P605Q853R770R769R057Q420Q203P908O923N248L165O54k350n348
59438E38501p496q354q090p120n946n197n176n454n397n025m826m742m056k445
59424D59177n29R69K133L587N592P827R932J1995J4391J7202K0052K2718K5546
59411F00592K8513K9798K6483J7553N594n349j3037j7378j8567j6592j2247o861
59399F18502r17N367R889R191K160q201j7629k4051k7383k7774k5687k2627j9921
59386D70919j7257j3811j0215p891o834n785m341l233k562j452J61J025N04l67
$$ plain form
59372 398861 398365 398115 397694 397067 397136 398612 400972 403082 404509 405822 407841 410901 414742 418779 422470 425634
59356 425634 428523 431591 435186 439407 444215 449723 456360 464670 474852 486592 499435 513196 527852
59343 527852 543061 558033 572051 585084 597729 610386 622518 632890 640627 645889 649405 651502
59331 651502 651847 650061 646277 640997 634587 627079 618414 608789 598716 588743 579228 570569 563493 558625
59317 558625 555582 552903 549243 544415 539040 533589 528206 523103 518485 514176 509864 505629 501779 498264
59303 498264 494783 491382 488332 485527 482661 479965 478072 477031 476167 475066 474000 473106 471902 469949 467502
59288 467502 465101 463075 461768 461626 462572 463823 464800 465848 467543 469732 471850 473887 476439 479955 484424
59273 484424 489744 495973 503251 511761 521691 532981 545214 557871 570494 582532 593426 603085 611768
$$ packed form
59372C98861m96k50m21o27O9J476K360K110J427J313K019L060L841M037L691L164
59356D25634K889L068L595M221M808N508O637Q310J0182J1740J2843J3761J4656
59343E27852J5209J4972J4018J3033J2645J2657J2132J0372P737N262L516K097
59331F51502L45j786l784n280o410p508q665r625j0073r973r515q659p076m868
59317E58625l043k679l660m828n375n451n383n103m618m309m312m235l850l515
59303D98264l481l401l050k805k866k696j893j041q64j101j066q94j204j953k447
59288D67502k401k026j307j42R46J251R77J048J695K189K118K037K552L516M469
59273D84424N320O229P278Q510R930J1290J2233J2657J2623J2038J0894R659Q683
$$ plain form
59260 611768 619188 624206 625975 624997 622436 618651 613149 605889 597824 589931 582248 574219 565614 556761
59246 556761 548110 539953 532576 526364 521546 517955 515214 513217 512230 512446 513683 515642 518147 520913 523385
59231 523385 525225 526680 527992 528718 528291 526961 525376 523337 519914 514916 509216 503383 496991 489790 482553
59216 482553 476002 469668 462757 455576 449169 443840 438854 433489 427694 421861 416581 412506 409942 408639
59202 408639 408274 408890 410469 412429 414087 415382 416665 418052 419467 421034 422931 425056 427324 429966 433042
59187 433042 435973 438139 439688 441207 442878 444603 446675 449606 453376 457460 461497 465427 469131 472513
59173 472513 475843 479503 483571 488054 493276 499481 506344 513429 520771 528504 536361 544219 552587 561602
59159 561602 570068 576593 581376 585592 589238 591042 590629 589227 587705 585270 580932 575217 569505 564319
$$ packed form
59260F11768P420N018J769r78k561l785n502p260q065p893p683q029q605q853
59246E56761q651q157p377o212m818l591k741j997r87K16J237J959K505K766K472
59231E23385J840J455J312P26m27j330j585k039l423m998n700n833o392p201p237
59216D82553o551o334o911p181o407n329m986n365n795n833n280m075k564j303
59202D08639l65O16J579J960J658J295J283J387J415J567J897K125K268K642L076
59187D33042K931K166J549J519J671J725K072K931L770M084M037L930L704L382
59173D72513L330L660M068M483N222O205O863P085P342P733P857P858Q368R015
59159E61602Q466O525M783M216L646J804m13j402j522k435m338n715n712n186
$$ plain form
59145 564319 559110 553288 546727 539616 532435 525825 519991 514456 508761 503129 498123 493955 490479 487581
59131 487581 485194 483135 481275 479795 479127 479739 481935 485570 489940 494293 498536 503126 508396 514408 521400
59116 521400 529718 539266 549647 560968 573796 588024 602525 616324 629593 643028 656790 670513
59104 670513 683861 696520 708002 718067 727164 735949 744511 752374 759101 764462 768136 769643 768699
59091 768699 765567 761129 756596 752868 749982 747332 744423 741159 737484 733193 728239 722748 716515 708897
59077 708897 699494 688674 677144 665280 653056 640409 627512 614831 602871 591585 580255 568580
59065 568580 557739 549477 543921 539219 533802 528161 523666 520404 517171 513212 508948 505012 501410 497830
59051 497830 494179 490621 487490 485226 484049 483545 482895 481607 479890 478409 477867 478670 480651 483071 485176
$$ packed form
59145E64319n209n822o561p111p181o610n834n535n695n632n006m168l476k898
59131D87581k387k059j860j480o68O12K196L635M370M353M243M590N270O012O992
59116E21400Q318R548J0381J1321J2828J4228J4501J3799J3269J3435J3762J3723
59104F70513J3348J2659J1482J0065R097Q785Q562P863O727N361L674J507r44
59091G68699l132m438m533l728k886k650k909l264l675m291m954n491o233p618
59077G08897r403j0820j1530j1864j2224j2647j2897j2681j1960j1286j1330j1675
59065E68580j0841q262n556m702n417n641m495l262l233l959m264l936l602l580
59051D97830l651l558l131k264j177n04o50j288j717j481n42Q03J981K420K105
$$ plain form
59036 485176 486804 488317 490067 492128 494479 497107 499903 502717 505634 509107 513725 519866 527530 536429
59022 536429 546233 556771 568043 580144 593254 607595 623132 639380 655626 671284 685816 698430
59010 698430 708229 714716 717915 718029 715322 710371 704060 697239 690595 684851 680713 678527 678261 679760 682657
58995 682657 686121 689234 691757 694035 696080 697228 696859 694954 691754 687369 681914 675550 668217 659798
58981 659798 650700 641634 632648 623134 613180 604177 597443 592856 589553 587470 587307 589193 592261 595592
58967 595592 598994 602715 606861 611287 615884 620864 626746 633845 641722 649419 656296 662300 667306 670784
58953 670784 672385 672322 670767 667372 661893 654872 647148 639024 630372 621238 611848 602476 593811 586941 582211
58938 582211 578468 574261 569517 565186 561419 557085 551254 544280 537190 530682 525097 520724 517642 515535
$$ packed form
59036D85176J628J513J750K061K351K628K796K814K917L473M618O141P664Q899
59022E36429R804J0538J1272J2101J3110J4341J5537J6248J6246J5658J4532J2614
59010F98430R799O487L199J14k707m951o311o821o644n744m138k186k66J499K897
58995F82657L464L113K523K278K045J148l69j905l200m385n455o364p333q419
58981F59798r098r066q986r514r954r003o734m587l303k083j63J886L068L331
58967E95592L402L721M146M426M597M980N882P099P877P697O877O004N006L478
58953F70784J601o3j555l395n479p021p724q124q652r134r390r372q665o870m730
58938E82211l743m207m744m331l767m334n831o974p090o508n585m373l082k107
$$ plain form
58924 515535 513979 512782 511922 511322 510795 510103 509139 508192 507820 508191 508718 508711 508203 507749 507572 507565 508018 509696 512951
58905 512951 517284 522060 527345 533785 541826 551141 560652 569141 576111 582084 587829 593386 598210 602213
58891 602213 606238 611404 618407 627575 639180 653313 669571 687093 704898 722208 738636 754131
58879 754131 768628 781723 792804 801422 807378 810497 810564 807449 801100 791522 779041 764606 749492
58866 749492 734627 720401 707073 694942 683992 673751 663848 654500 646135 638630 631311 623778 616365
58853 616365 609461 602646 594952 586106 576990 568721 561699 555875 551379 548115 545093 541158 536473 532387
58839 532387 529570 527175 524222 520961 518146 515610 512422 508108 503027 497836 493263 490053 488364 487306
58825 487306 485778 483703 481768 480131 478164 475598 473129 471583 470943 470514 469774 468916 468752 470082 472853
$$ packed form
58924E15535j556j197q60o00n27o92r64r47l72L71N27pn08m54j77pM53J678L255
58905E12951M333M776N285O440Q041R315R511Q489O970N973N745N557M824M003
58891F02213M025N166P003R168J1605J4133J6258J7522J7805J7310J6428J5495
58879G54131J4497J3095J1081Q618N956L119O7l115o349r578j2481j4435j5114
58866G49492j4865j4226j3328j2131j0950j0241r903r348q365p505p319p533p413
58853F16365o904o815p694q846r116q269p022n824m496l264l022l935m685m086
58839E32387k817k395k953l261k815k536l188m314n081n191m573l210j689j058
58825D87306j528k075j935j637j967k566k469j546o40m29p40q58j64J330K771
$$ plain form
58810 472853 476065 478799 481185 483890 486861 489232 490527 491254 492107 493121 493929 494420 494742 494898 494670 493855
58794 493855 492412 490535 488626 487037 485755 484545 483467 482994 483515 484889 486686 488737 491285 494603 498578
58779 498578 502800 507050 511579 516693 522129 527162 531325 534636 537021 537982 537139 534706 531062 526238 520347
58764 520347 514200 508894 504830 501590 498700 496053 493654 491445 489463 487803 486380 485029 483921 483633
58750 483633 484758 487475 491335 495321 498453 500631 502658 505153 507801 510095 512415 515670 520036 524770
58736 524770 529302 533897 539072 544878 551003 557219 563554 570211 577415 585177 593170 600988 608388 615132
58722 615132 620778 624937 627578 628863 628901 627934 626487 624978 623440 622033 621520 622690 625528 629455 634136
58707 634136 639455 644931 649848 653951 657349 659723 660241 658372 654308 648434 640856 631569 620704 608439
$$ packed form
58810D72853L212K734K386K705K971K371J295P27Q53J014Q08M91L22J56k28q15
58794D93855j443j877j909j589j282j210j078m73N21J374J797K051K548L318L975
58779D98578M222M250M529N114N436N033M163L311K385R61q43k433l644m824n891
58764E20347o147n306m064l240k890k647k399k209j982j660j423j351j108k88
58750D83633J125K717L860L986L132K178K027K495K648K294K320L255M366M734
58736E24770M532M595N175N806O125O216O335O657P204P762P993P818P400O744
58722F15132N646M159K641J285L8r67j447j509j538j407n13J170K838L927M681
58707F34136N319N476M917M103L398K374N18j869m064n874p578r287j0865j2265
$$ plain form
58693 608439 594889 580222 564814 549357 534791 521792 510215 499471 489627 481486 475259 469932
58681 469932 464607 459720 456065 453244 450198 446792 443748 441301 439194 437875 438286 440304 442591 444361
58667 444361 446269 449228 453314 458301 464288 471246 478562 485581 492068 497837 502462 505666 507487 507867
58653 507867 506637 504116 501119 498158 495196 492278 489796 487948 486527 485351 484252 482687 480212 477472
58639 477472 475811 475609 475823 475455 474612 473879 473579 474069 475795 478465 480917 482406 483302 484043 484250 483524 482404
58622 482404 481766 481826 482411 483664 485752 488349 491110 494295 498317 503097 508453 514694 522131 530318 538395
58607 538395 545886 552563 557869 561202 562659 562953 562697 562234 561913 561841 561376 559503 555954 551651 547848 545017
58591 545017 542659 540078 537188 534487 532363 530808 530043 530978 534485 540327 547345 554735 562634 571458 581210
$$ packed form
58693F08439j3550j4667j5408j5457j4566j2999j1577j0744r844q141o227n327
58681D69932n325m887l655k821l046l406l044k447k107j319M11K018K287J770
58667D44361J908K959M086M987N987O958P316P019O487N769M625L204J821L80
58653E07867j230k521k997k961k962k918k482j848j421j176j099j565k475k740
58639D77472j661k02K14l68q43p33l00M90J726K670K452J489Q96P41K07p26j120
58622D82404o38O0N85J253K088K597K761L185M022M780N356O241P437Q187Q077
58607E38395P491O677N306L333J457K94k56m63l21p2m65j873l549m303l803k831
58591E45017k358k581k890k701k124j555p65R35L507N842P018P390P899Q824R752
$$ plain form
58576 581210 591442 601403 610195 617377 623430 629087 634293 638524 642000 645712 650234 655494 661884 670467
58562 670467 681587 694299 707823 722772 740199 760038 781210 802801 824358 845262 864441
58551 864441 880774 893591 902882 909087 912497 913022 910892 907262 903287 898729 892357 883749 873809 863384
58537 863384 852355 840235 826729 811471 794325 776290 759049 743188 727895 712852 699255
58526 699255 688258 679474 671827 665057 659579 655542 652746 650882 649377 647725 646364 646331 647595 648792
58512 648792 649196 649821 651815 654894 658333 662395 667574 673198 677956 681335 683576 684745 684699 683445 680766
58497 680766 676191 670075 663980 659077 654902 650558 646392 643380 641555 640189 639136 638901 639652 641019 642688
58482 642688 644544 646617 649333 653350 658747 665093 672607 682206 693866 706148 718064 730093 742355
$$ packed form
58576E81210J0232R961Q792P182O053N657N206M231L476L712M522N260O390Q583
58562F70467J1120J2712J3524J4949J7427J9839K1172K1591K1557K0904J9179
58551H64441J6333J2817R291O205L410N25k130l630l975m558o372q608r940j0425
58537H63384j1029j2120j3506j5258j7146j8035j7241j5861j5293j5043j3597
58526F99255j0997q784p647o770n478m037k796j864j505j652j361l3J264J197
58512F48792M04O25J994L079L439M062N179N624M758L379K241J169m6j254k679
58497F80766m575o116o095m903m175m344m166l012j825j366j053k35P51J367J669
58482F42688J856K073K716M017N397O346P514R599J1660J2282J1916J2029J2262
$$ plain form
58469 742355 753155 760665 764922 766848 766355 763016 757734 752075 746559 740953 735653 731342 727957 725324
58455 725324 724142 724931 726801 728758 731465 736055 741886 747235 751604 755520 758530 759337 757733 754670 750597
58440 750597 745405 739755 734748 730421 726231 722751 721074 720724 720127 719177 719390 721411 724328 727763 732724
58425 732724 739771 748022 756610 765688 775443 785448 795593 806407 817953 829371 839830 848856 855657
58412 855657 859369 860254 859466 857477 853930 849111 844176 839666 835180 830783 827359 825130 823134 820693 818281
58397 818281 816613 815930 816503 818720 822318 826530 831189 836668 842684 848334 853436 858585 863736 867974 870910
58382 870910 873098 874889 876067 876702 877140 877008 875559 873115 870910 869414 868209 867551 868454 870949 873814
58367 873814 876408 879382 883299 888036 893876 901658 911299 921552 931718 942359 953965 966240 979030
$$ packed form
58469G42355J0800P510M257J926m93l339n282n659n516n606n300m311l385k633
58455G25324j182P89J870J957K707M590N831N349M369L916L010Q07j604l063m073
58440G50597n192n650n007m327m190l480j677l50n97r50K13K021K917L435M961
58425G32724P047Q251Q588R078R755J0005J0145J0814J1546J1418J0459R026O801
58412H55657L712Q85p88j989l547m819m935m510m486m397l424k229j996k441k412
58397H18281j668o83N73K217L598M212M659N479O016N650N102N149N151M238K936
58382H70910K188J791J178O35M38j32j449k444k205j496j205o58R03K495K865
58367H73814K594K974L917M737N840P782R641J0253J0166J0641J1606J2275J2790
$$ plain form
58354 979030 992502 1006051 1018440 1029429 1039848 1049691 1057727 1063466 1068054 1072626 1077129 1081335 1085660
58341 1085660 1090453 1095741 1102126 1110627 1121224 1132829 1144972 1158156 1172397 1186984 1201994 1218362
58329 1218362 1236070 1253844 1270970 1287728 1303749 1317818 1329814 1341001 1351838 1361365 1369336 1377009
58317 1377009 1385122 1392975 1400345 1408357 1417532 1426773 1435352 1444246 1454653 1466758 1480733 1497154 1515534
58304 1515534 1534183 1552491 1571691 1592597 1614418 1636621 1660041 1685058 1710492 1735299 1759646
58293 1759646 1783404 1805520 1825925 1846164 1867106 1887899 1908259 1929753 1953618 1979247 2006050
58282 2006050 2034864 2066235 2099266 2133455 2169788 2208629 2248434 2287992 2328147 2369971 2412997
58271 2412997 2456670 2501783 2549102 2598155 2648617 2701340 2756968 2815220 2876304 2941119 3009311
$$ packed form
58354I79030J3472J3549J2389J0989J0419R843Q036N739M588M572M503M206M325
58341A085660M793N288O385Q501J0597J1605J2143J3184J4241J4587J5010J6368
58329A218362J7708J7774J7126J6758J6021J4069J1996J1187J0837R527P971P673
58317A377009Q113P853P370Q012R175R241Q579Q894J0407J2105J3975J6421J8380
58304A515534J8649J8308J9200K0906K1821K2203K3420K5017K5434K4807K4347
58293A759646K3758K2116K0405K0239K0942K0793K0360K1494K3865K5629K6803
58282B006050K8814L1371L3031L4189L6333L8841L9805L9558M0155M1824M3026
58271B412997M3673M5113M7319M9053N0462N2723N5628N8252O1084O4815O8192
$$ plain form
58260 3009311 3079281 3150900 3225906 3304885 3386478 3470310 3557820 3649127 3742058 3835466 3930432
58249 3930432 4027093 4123723 4220550 4321112 4428087 4541037 4659844 4786691 4922668 5066075
58239 5066075 5216264 5375686 5546136 5726721 5917634 6121833 6340630 6571812 6814761
58230 6814761 7073218 7350361 7645683 7959577 8296223 8658671 9045994 9458805 9902605
58221 9902605 10381986 10896900 11448916 12046004 12696902 13406399 14180895 15032995 15975909
58212 15975909 17019443 18176623 19468013 20914814 22535919 24358452 26423966 28779352
58204 28779352 31473186 34569209 38148500 42280965 47002588 52340932 58368869 65234995
58196 65234995 73161009 82430087 93371032 106334918 121686948 139824652 161180694
$$ packed form
58260C009311O9970P1619P5006P8979Q1593Q3832Q7510R1307R2931R3408R4966
58249C930432R6661R6630R6827J00562J06975J12950J18807J26847J35977J43407
58239E066075J50189J59422J70450J80585J90913K04199K18797K31182K42949
58230F814761K58457K77143K95322L13894L36646L62448L87323M12811M43800
58221I902605M79381N14914N52016N97088O50898P09497P74496Q52100R42914
58212A5975909J043534J157180J291390J446801J621105J822533K065514K355386
58204B8779352K693834L096023L579291M132465M721623N338344O027937O866126
58196F5234995P926014R269078J0940945J2963886J5352030J8137704K1356042
$$ plain form
58189 161180694 186170326 215086961 247904563 283873399 320965789 355617290 383295909
58182 383295909 399871133 403024531 392860386 371528194 342319710 308774682 274026616
58175 274026616 240420509 209411847 181703739 157480925 136608685 118773247 103592007
58168 103592007 90688417 79717556 70368280 62372955 55515367 49618789 44529627 40117437
58160 40117437 36279850 32934030 30004877 27426622 25148700 23130631 21333932 19724701
58152 19724701 18279035 16978600 15803779 14736415 13765144 12881902 12076048 11336950 10658916
58143 10658916 10038152 9467554 8939340 8450172 7998992 7582132 7194920 6835670 6503779
58134 6503779 6195895 5907916 5638759 5388440 5154496 4934029 4727290 4535548 4357070
$$ packed form
58189A61180694K4989632K8916635L2817602L5968836L7092390L4651501K7678619
58182C83295909J6575224L153398j0164145k1332192k9208484l3545028l4748066
58175B74026616l3606107l1008662k7708108k4222814k0872240j7835438j5181240
58168A03592007j2903590j0970861r349276p995325o857588n896578n089162m412190
58160D0117437l837587l345820k929153k578255k277922k018069j796699j609231
58152A9724701j445666j300435j174821j067364r71271q83242q05854p39098o78034
58143A0658916o20764n70598n28214m89168m51180m16860l87212l59250l31891
58134F503779l07884k87979k69157k50319k33944k20467k06739j91742j78478
$$ plain form
58125 4357070 4188671 4029578 3880451 3740116 3606518 3479457 3359354 3244767 3134126
58116 3134126 3028562 2930043 2837898 2749849 2665275 2584846 2508176 2434423 2364024 2297450 2233445
58105 2233445 2170856 2110799 2054661 2001318 1948853 1897674 1849304 1803290 1758040 1713811 1672198
58094 1672198 1633380 1596256 1560650 1527064 1494932 1463366 1433090 1405580 1380843 1358004 1337302
58083 1337302 1319334 1302883 1285620 1266642 1246532 1225493 1203344 1180921 1159513 1139103 1118742
58072 1118742 1098287 1078232 1058277 1037689 1016779 996567 977357 958949 941744 926287 912239
58061 912239 899058 887048 876469 866399 855832 845016 834265 822484 808688 794144 780983
58050 780983 769266 757411 745126 733860 724400 715955 707769 699998 692685 685196 677033 668276 659231
$$ packed form
58125D357070j68399j59093j49127j40335j33598j27061j20103j14587j10641
58116C134126j05564r8519r2145q8049q4574q0429p6670p3753p0399o6574o4005
58105B233445o2589o0057n6138n3343n2465n1179m8370m6014m5250m4229m1613
58094A672198l8818l7124l5606l3586l2132l1566l0276k7510k4737k2839k0702
58083A337302j7968j6451j7263j8978k0110k1039k2149k2423k1408k0410k0361
58072A118742k0455k0055j9955k0588k0910k0212j9210j8408j7205j5457j4048
58061I12239j3181j2010j0579j0070j0567j0816j0751j1781j3796j4544j3161
58050G80983j1717j1855j2285j1266r460q445q186p771p313p489q163q757r045
$$ plain form
58037 659231 650439 642707 636210 629947 623062 616162 610230 604783 598460 590993 583245 575578 567491 558690
58023 558690 549387 539720 529907 520675 512559 505202 498242 492229 487593 483462 478840 474246 470638 467360
58009 467360 462886 457279 452104 448005 444089 439836 436016 433328 431397 429518 427425 425183 423168 422094
57995 422094 422157 422286 421191 418942 416513 414179 411589 409128 407753 407472 407301 406759 406236 405871 405309 404585 404022
57978 404022 403224 401436 399003 397138 396002 394357 391509 388363 386007 384329 382631 380761 379025 377669
57964 377669 376953 377199 378398 380159 382229 384622 387195 389646 391944 394164 395936 396674 396366 395546 394547 393422
57948 393422 392416 391772 391162 390116 389013 388932 390448 393215 396643 400364 404172 408193 413019 419027 425788
57933 425788 432825 440583 449692 459504 468303 474840 478776 479847 477763 472959 466426 458642 449440 438895
$$ packed form
58037F59231q792p732o497o263o885o900n932n447o323p467p748p667q087q801
58023E58690r303r667r813r232q116p357o960o013m636m131m622m594l608l278
58009D67360m474n607n175m099l916m253l820k688j931j879k093k242k015j074
57995D22094O3J29j095k249k429k334k590k461j375k81j71n42n23l65n62p24n63
57978D04022p98j788k433j865j136j645k848l146k356j678j698j870j736j356
57964C77669p16K46J199J761K070K393K573K451K298K220J772P38l08q20r99j125
57948C93422j006o44o10j046j103q1J516K767L428L721L808M021M826O008O761
57933D25788P037P758R109R812Q799O537L936J071k084m804o533p784r202j0545
$$ plain form
57919 438895 427544 415873 404432 394202 385781 378363 370738 363172 357112 353048 349997 347162 344682
57906 344682 342542 340204 337874 336783 337466 338792 339340 338826 337611 335808 333646 331882 331042 330757 330377 329724
57890 329724 328892 327957 327274 327318 327852 327983 327424 326851 326496 325389 322742 319344 316578 314563 312169 308563 303921
57873 303921 298788 293482 288203 283182 278547 274238 270060 265833 261630 257898 255113 253339 252446 252642 254264
57858 254264 257061 260303 263740 267834 272881 278451 283921 289001 293461 296890 299070 300238 300752 300852 300723
57843 300723 300255 298704 295329 290608 286093 282696 279791 276386 272521 268941 265967 263405 261358 260501 261547
57828 261547 264674 269353 274583 279515 283993 288320 292445 295752 297741 298585 298869 299114 299618 300304 300504 299228
57812 299228 295938 290955 285111 279188 273513 267760 261300 254122 247177 241247 235812 229855 223596 218408
$$ packed form
57919D38895j1351j1671j1441j0230q421p418p625p566o060m064l051k835k480
57906C44682k140k338k330j091O83J326N48n14j215j803k162j764q40k85l80o53
57890C29724q32r35o83M4N34J31n59n73l55j107k647l398k766k015k394l606m642
57873C03921n133n306n279n021m635m309m178m227m203l732k785j774q93J96J622
57858B54264K797L242L437M094N047N570N470N080M460L429K180J168N14J00j29
57843C00723m68j551l375m721m515l397k905l405l865l580k974k562k047q57J046
57828B61547L127M679N230M932M478M327M125L307J989Q44K84K45N04O86K00j276
57812B99228l290m983n844n923n675n753o460p178o945n930n435n957o259n188
$$ plain form
57798 218408 214902 212125 209020 205691 202697 199940 197074 194550 193462 194452 197193 200820 204539 207969
57784 207969 211168 214354 217639 221214 225562 231082 237543 244362 251372 258787 266464 273716 279921 284836
57770 284836 288349 290457 291451 291579 290588 288133 284402 279688 273609 265752 256887 248494 241076 234093 227591
57755 227591 222512 218975 215545 210921 205393 200033 195377 191569 188890 187315 186176 184961 183869 183147
57741 183147 182512 181773 181264 181169 181148 181202 182048 183978 186087 187348 187748 187697 187073 185701 184096 182830 181724 180516
57723 180516 179755 180081 181041 181606 181536 181424 181653 182167 183077 184695 186956 189348 191300 192297 191993 190655 189094
57706 189094 187726 186245 184670 184012 185187 187830 190989 194472 198628 203284 207862 212172 216100 218746
57692 218746 218875 216253 211830 206643 201231 195951 191126 186916 183584 181727 181629 182690 184176 186347 190194
$$ packed form
57798B18408l506k777l105l329k994k757k866k524j088R90K741L627L719L430
57784B07969L199L186L285L575M348N520O461O819P010P415P677P252O205M915
57770B84836L513K108R94J28r91k455l731m714o079p857q865q393p418o983o502
57755B27591n079l537l430m624n528n360m656l808k679j575j139j215j092p22
57741A83147o35p39n09r5k1N4Q46J930K109J261M00n1o24j372j605j266j106j208
57723A80516p61L26R60N65p0j12K29N14R10J618K261K392J952R97l04j338j561
57706A89094j368j481j575o58J175K643L159L483M156M656M578M310L928K646
57692B18746J29k622m423n187n412n280m825m210l332j857r8J061J486K171L847
$$ plain form
57677 190194 196251 204380 214565 227262 243164 263268 288902 320972 359373 403895 455222 513632
57665 513632 576000 634565 679205 701477 697789 670307 625397 570651 512561 456005 404424 359479
57653 359479 321006 288225 260885 238802 220970 206117 193757 183808 175577 168204 161866 157311
57641 157311 154233 151224 147556 144029 141810 141214 141768 142707 143204 142799 141864 141170 141005 141174 141604 142228 142459
57624 142459 141661 140079 138473 136948 135023 132688 130380 128012 125214 122556 121256 121391 121597 120979 120168
57609 120168 120032 120452 121000 121750 122653 123009 122398 121458 120923 120567 119881 119232 119463 120687 122275 123733 124931
57592 124931 125701 125884 125687 125457 125171 124540 123521 122391 121442 120830 120530 120240 119667 119091 119255 120352 121533
57575 121533 121807 121158 120340 119851 119562 119206 118728 118196 117726 117538 117801 118292 118353 117367 115422 113483 112695 113341
$$ packed form
57677A90194O057Q129J0185J2697J5902K0104K5634L2070L8401M4522N1327N8410
57665E13632O2368N8565M4640K2272l688k7482m4910n4746n8090n6556n1581m4945
57653C59479l8473l2781k7340k2083j7832j4853j2360r949q231p373o338m555
57641A57311l078l009l668l527k219n96N54R39M97m05r35o94j65J69M30O24K31
57624A42459p98j582j606j525j925k335k308k368k798k658j300J35K06o18q11
57609A20168j36M20N48P50R03L56o11r40n35l56o86o49K31J224J588J458J198
57592A24931P70J83j97k30k86o31j019j130r49o12l00k90n73n76J64J097J181
57575A21533K74o49q18m89k89l56m78n32m70j88K63M91O1r86j945j939p88O46
$$ plain form
57557 113341 114644 115755 116574 117347 117915 118060 118207 118955 120009 120437 120060 119713 119973 120459 120653 120574 120307 119724
57539 119724 119147 119527 121333 123883 126292 128450 130438 131625 131194 129244 126607 123912 121511 120054 120143
57524 120143 121363 122349 122115 120958 119925 119713 120198 120789 121107 121374 122165 123770 125945 128233 130357 132232
57508 132232 133918 135611 137392 138892 139614 139676 139871 140786 142263 143873 145395 146573 146881 146029 144397 142623
57492 142623 140996 139520 138234 137105 135916 134622 133636 133435 134077 135298 136791 138159 138945 139071 139009 139196
57476 139196 139467 139273 138258 136457 134195 131972 130162 128695 127327 126203 125668 125451 124749 123364 122056
57461 122056 121399 121056 120700 120854 122046 123700 124763 125086 125326 125755 126062 126236 126775 127910 129218 130121 130305
57444 130305 129716 128656 127860 128013 129096 130572 132053 133403 134378 134739 134705 134727 134849 134717 134242 133749 133467 133359
$$ packed form
57557A13341J303J111Q19P73N68J45J47P48J054M28l77l47K60M86J94p9k67n83
57539A19724n77L80J806K550K409K158J988J187m31j950k637k695k401j457Q9
57524A20143J220R86k34j157j033k12M85N91L18K67P91J605K175K288K124J875
57508A32232J686J693J781J500P22O2J95R15J477J610J522J178L08q52j632j774
57492A42623j627j476j286j129j189j294r86k01O42J221J493J368P86J26o2J87
57476A39196K71j94j015j801k262k223j810j467j368j124n35k17p02j385j308
57461A22056o57l43l56J54J192J654J063L23K40M29L07J74N39J135J308R03J84
57444A30305n89j060p96J53J083J476J481J350R75L61l4K2J22j32m75m93k82j08
$$ plain form
57426 133359 133495 134198 135677 137807 140239 142441 143746 143810 143069 142358 142055 141903 141594 141125 140611 140163 140011
57409 140011 140385 141156 141881 142208 142097 141769 141750 142740 144912 147407 149016 149442 149510 150092 151251 152533 153626
57392 153626 154505 155280 156184 157530 159430 161565 163371 164542 165433 166978 169904 173861 177561 180021 181470
57377 181470 182769 184252 185561 186357 186634 186394 185577 184434 183517 183128 183074 183093 183278 183908 184981 186026 186429
57360 186429 186116 185878 186696 188587 190545 191863 193014 194725 196745 198290 199422 201022 203422 205997 208270
57345 208270 210537 213019 215191 216585 217704 219414 221613 223296 223989 224572 226291 229200 232031 233632 234168
57330 234168 234617 235435 236313 237215 238775 241265 243811 245382 246183 247327 249314 251608 253697 255833 258496
57315 258496 261646 264813 267603 269974 272252 274847 277739 280352 282312 284110 286555 289729 293077 296398
$$ packed form
57426A33359J36P03J479K130K432K202J305O4p41p11l03j52l09m69n14m48j52
57409A40011L74P71P25L27j11l28j9R90K172K495J609M26O8N82J159J282J093
57392A53626Q79P75R04J346J900K135J806J171Q91J545K926L957L700K460J449
57377A81470J299J483J309P96K77k40q17j143r17l89n4J9J85O30J073J045M03
57360A86429l13k38Q18J891J958J318J151J711K020J545J132J600K400K575K273
57345B08270K267K482K172J394J119J710K199J683O93N83J719K909K831J601N36
57330B34168M49Q18Q78R02J560K490K546J571Q01J144J987K294K089K136K663
57315B58496L150L167K790K371K278K595K892K613J960J798K445L174L348L321
$$ plain form
57301 296398 300002 303850 307271 309840 311959 314293 317077 320211 323614 327215 330934 334841 339021 343236
57287 343236 347121 350784 354759 359273 364080 369086 374503 380198 385496 389970 393910 397655 401022 403798
57273 403798 406315 409018 411847 414504 417070 419943 423356 427292 431696 436465 441478 446856 452895 459458
57259 459458 465807 471411 476660 482410 489047 496355 503981 511652 519106 526186 532960 539474 545585 551264
57245 551264 556856 562766 569171 576248 584346 593531 603271 613003 622813 633093 643740 654284 664705
57232 664705 675559 687135 698978 710461 721557 732827 744778 757407 770319 783224 796216
57221 796216 809517 823104 836884 851174 866510 882771 898941 914215 929031 944529 961211
57210 961211 978648 996344 1014237 1032286 1050190 1067825 1085581 1103945 1122929 1142111 1160979
$$ packed form
57301B96398L604L848L421K569K119K334K784L134L403L601L719L907M180M215
57287C43236L885L663L975M514M807N006N417N695N298M474L940L745L367K776
57273D03798K517K703K829K657K566K873L413L936M404M769N013N378O039O563
57259D59458O349N604N249N750O637P308P626P671P454P080O774O514O111N679
57245E51264N592N910O405P077Q098R185R740R732R810J0280J0647J0544J0421
57232F64705J0854J1576J1843J1483J1096J1270J1951J2629J2912J2905J2992
57221G96216J3301J3587J3780J4290J5336J6261J6170J5274J4816J5498J6682
57210I61211J7437J7696J7893J8049J7904J7635J7756J8364J8984J9182J8868
$$ plain form
57199 1160979 1179031 1195796 1211190 1225910 1241175 1257862 1275928 1294678 1313511 1332343 1351419
57188 1351419 1370994 1391220 1412144 1433656 1455520 1477624 1500073 1522863 1545562 1567567 1588650
57177 1588650 1609013 1628875 1648302 1667423 1686455 1705436 1724209 1742799 1761537 1780683 1800095
57166 1800095 1819338 1837893 1855288 1871375 1886547 1901369 1915964 1930143 1944186 1958901 1974674
57155 1974674 1991054 2007653 2024858 2042995 2061173 2077784 2092143 2105040 2117586 2130093 2142204
57144 2142204 2153647 2164607 2175711 2187842 2201649 2216932 2232638 2247697 2261793 2275181 2287892
57133 2287892 2299410 2309213 2317417 2324755 2332002 2339521 2347285 2355089 2362718 2370211 2378207 2387878 2400236
57120 2400236 2415500 2433248 2453041 2474711 2498258 2523822 2551754 2582400 2615949 2652836 2694191
$$ packed form
57199A160979J8052J6765J5394J4720J5265J6687J8066J8750J8833J8832J9076
57188A351419J9575K0226K0924K1512K1864K2104K2449K2790K2699K2005K1083
57177A588650K0363J9862J9427J9121J9032J8981J8773J8590J8738J9146J9412
57166A800095J9243J8555J7395J6087J5172J4822J4595J4179J4043J4715J5773
57155A974674J6380J6599J7205J8137J8178J6611J4359J2897J2546J2507J2111
57144B142204J1443J0960J1104J2131J3807J5283J5706J5059J4096J3388J2711
57133B287892J1518R803Q204P338P247P519P764P804P629P493P996R671J2358
57120B400236J5264J7748J9793K1670K3547K5564K7932L0646L3549L6887M1355
$$ plain form
57109 2694191 2741435 2795467 2856852 2926970 3008606 3105326 3220766 3358789 3523986 3721879
57099 3721879 3959051 4243130 4582119 4983436 5453814 5999751 6626733 7336999 8128143
57090 8128143 8993773 9924445 10907273 11925379 12958634 13984562 14977755 15909139 16747490
57081 16747490 17463048 18031406 18437291 18678023 18763602 18710282 18530360 18225995 17791806 17223089
57071 17223089 16523105 15705873 14794813 13818862 12808004 11790196 10790205 9828887 8921690
57062 8921690 8077472 7299461 6587985 5942606 5362249 4844283 4384327 3977210 3617954
57053 3617954 3301776 3023550 2777939 2560360 2367577 2197059 2045978 1911136 1789663
57044 1789663 1679294 1578041 1484133 1396381 1314191 1236960 1163672 1093253 1025145 959422 896558
$$ packed form
57109B694191M7244N4032O1385P0118Q1636R6720J15440J38023J65197J97893
57099C721879K37172K84079L38989M01317M70378N45937O26982P10266P91144
57090H128143Q65630R30672R82828J018106J033255J025928R93193R31384Q38351
57081A6747490P15558N68358M05885K40732Q5579n3320j79922l04365m34189n68717
57071A7223089o99984q17232r11060r75951j010858j017808r99991r61318r07197
57062H921690q44218p78011p11476o45379n80357n17966m59956m07117l59256
57053C617954l16178k78226k45611k17579j92783j70518j51081j34842j21473
57044A789663j10369j01253r3908q7752q2190p7231p3288p0419o8108o5723o2864
$$ plain form
57033 896558 837186 781845 730689 683484 639946 599975 563562 530524 500377 472379 445780
57022 445780 420263 396156 374012 353910 335331 317741 301050 285412 270801 256953 243631
57011 243631 230756 218341 206492 195511 185868 177888 171380 165637 159980 154353 149360 145665 143377
56998 143377 141996 140800 139327 137628 136168 135328 135002 134793 134643 135069 136775 140249 145751 153340 162749
56983 162749 173435 184903 196661 207707 216406 221239 221697 218431 212821 206417 200294 194639 189167
56970 189167 184085 180179 177843 176585 175927 176210 178024 181289 185599 191059 198096 206701 216661 228358
56956 228358 242399 258216 273603 285850 293044 294515 290701 282787 272001 259125 244934 230861
56944 230861 218529 208572 200503 193864 188997 186627 187249 191080 198087 207868 219988 234600 252331
$$ packed form
57033H96558n9372n5341n1156m7205m3538l9971l6413l3038l0147k7998k6599
57022D45780k5517k4107k2144k0102j8579j7590j6691j5638j4611j3848j3322
57011B43631j2875j2415j1849j0981r643p980o508n743n657n627m993l695k288
56998A43377j381j196j473j699j460q40l26k09j50M26J706L474N502P589R409
56983A62749J0686J1468J1758J1046Q699M833M58l266n610o404o123n655n472
56970A89167n082l906k336j258o58K83J814L265M310N460P037Q605R960J1697
56956B28358J4041J5817J5387J2247P194J471l814p914j0786j2876j4191j4073
56944B30861j2332r957q069o639m867k370O22L831P007R781J2120J4612J7731
$$ plain form
56931 252331 273320 296585 320235 341832 358639 368361 370109 364433 352450 335434 315232 294133
56919 294133 273844 254986 237844 223014 210969 201502 194071 188310 183809 179883 176092 172766 170544
56906 170544 169578 169534 170112 171188 172628 174330 176403 179072 182488 186744 191792 197260 202741 208504 215473
56891 215473 224211 234285 245034 256556 269419 283665 298615 313386 326895 337382 342700 341593
56879 341593 334439 322625 307471 290062 271861 254928 241164 231424 225525 223094 224109 228633 236514
56866 236514 247750 262893 282613 306969 335641 368830 407249 450885 497911 544687 586347
56855 586347 617597 634204 634824 621524 598297 569139 537367 505880 477168 453016 434464 422002
56843 422002 415722 415588 421810 434811 454755 481549 515492 557528 608477 668253 735762 808627
$$ packed form
56931B52331K0989K3265K3650K1597J6807R722J748n676j1983j7016k0202k1099
56919B94133k0289j8858j7142j4830j2045r467p431n761m501l926l791l326k222
56906A70544r66m4N78J076J440J702K073K669L416M256N048N468N481N763O969
56891B15473Q738J0074J0749J1522J2863J4246J4950J4771J3509J0487N318j107
56879C41593p154j1814j5154j7409j8201j6933j3764r740n899k431J015M524P881
56866B36514J1236J5143J9720K4356K8672L3189L8419M3636M7026M6776M1660
56855E86347L1250J6607O20j3300k3227k9158l1772l1487k8712k4152j8552j2462
56843D22002o280j34O222J3001J9944K6794L3943M2036N0949N9776O7509P2865
$$ plain form
56831 808627 882073 948390 998624 1025675 1026464 1002206 957557 899333 834797 769977 708813 653368
56819 653368 604568 563033 529651 505381 490468 484120 485265 493433 508686 530996 560179 596274
56807 596274 639330 688321 740021 788745 827371 849485 851620 834063 799865 753396 699617 643639
56795 643639 589818 540919 498206 462027 432009 407225 387005 371712 362284 359022 361237 368065
56783 368065 379252 395033 415520 440055 466676 492017 512062 523335 523751 512996 492617 465514
56771 465514 434644 402038 369171 337856 309898 285746 264220 244021 225200 208830 195564
56760 195564 184956 176026 168123 161146 155184 150087 145395 140670 135876 131391 127638 124716 122294 119839
56746 119839 117071 114286 112147 111011 110494 109799 108432 106535 104616 103120 102119 101307 100313 99111 98014
$$ packed form
56831H08627P3446O6317N0234K7051P89k4258m4649n8224o4536o4820o1164n5445
56819F53368m8800m1535l3382k4270j4913o348J145Q168J5253K2310K9183L6095
56807E96274M3056M8991N1700M8724L8626K2114K135j7557l4198m6469n3779n5978
56795F43639n3821m8899m2713l6179l0018k4784k0220j5293r428l262K215O828
56783C68065J1187J5781K0487K4535K6621K5341K0045J1273M16j0755k0379k7103
56771D65514l0870l2606l2867l1315k7958k4152k1526k0199j8821j6370j3266
56760A95564j0608q930p903o977n962n097m692m725m794m485l753k922k422k455
56746A19839k768k785k139j136n17o95j367j897j919j496j001q12r94j202j097
$$ plain form
56731 98014 97267 96802 96476 96321 96443 96876 97683 98933 100345 101248 101247 100837 101019 102355 104537 106793 108478 109436
56713 109436 110027 110750 111641 112166 111855 110901 109946 109444 109497 110060 110984 111920 112539 112789 112738 112319 111515 110681 110296
56694 110296 110362 110341 109772 108782 108014 108081 108958 109793 109542 108051 106341 105589 106019 106988 107847 108311 108256 107733 107158
56675 107158 107013 107290 107558 107580 107480 107300 106867 106214 105779 105923 106505 107091 107451 107679 107973 108414 108963 109628 110615
56656 110615 112156 114113 115920 117156 118100 119504 121826 124874 128143 131299 134353 137544 141093 144974
56642 144974 148870 152410 155412 157942 160224 162492 164734 166541 167422 167325 166670 165874 165122 164616 164611 165034 165423
56625 165423 165454 165216 164846 164229 163295 162204 160988 159389 157297 154958 152551 150033 147716 146353 146156 146201
56609 146201 145410 143789 142177 141141 140633 140343 139763 138273 135864 133489 132050 131300 130428 129377 128741 128549
$$ packed form
56731I8014p47m65l26j55J22M33Q07J250J412R03jm10J82J336K182K256J685R58
56713A09436N91P23Q91N25l11r54r55n02N3N63R24R36O19K50n1m19q04q34l85
56694A10296O6k1n69r90p68O7Q77Q35k51j491j710p52M30R69Q59M64n5n23n75
56675A07158j45K77K68K2j00j80m33o53m35J44N82N86L60K28K94M41N49O65R87
56656A10615J541J957J807J236R44J404K322L048L269L156L054L191L549L881
56642A44974L896L540L002K530K282K268K242J807Q81r7o55p96p52n06nM23L89
56625A65423L1k38l70o17r34j091j216j599k092k339k407k518k317j363j97M5
56609A46201p91j621j612j036n08k90n80j490k409k375j439p50q72j051o36j92
$$ plain form
56593 128549 128155 127424 127148 127983 129534 130788 131079 130557 130072 130602 132435 134905 137125 138739 139690 139798 139227
56576 139227 138983 140079 142334 144686 146496 147848 148836 149474 150184 151460 153126 154825 157108 160972 166340
56561 166340 172194 178412 186166 196009 206657 216294 224133 230038 233613 234744 234505 234486 235294 236284 236590
56546 236590 235920 234496 232699 230779 228725 226492 224323 222554 221094 219498 217576 215412 212796 209323
56532 209323 205236 201522 198814 196755 194703 192524 190381 188344 186582 185459 185028 184853 184582 184277 183979
56517 183979 183526 183053 182984 183166 182671 181039 179148 178284 178757 179945 181231 182239 182499 181666 180111 178780 178358
56500 178358 178675 178908 178372 177328 176984 178287 180698 182638 183189 182784 182223 181776 181502 181562 181757 181443 180436
56483 180436 179424 179012 178936 178702 178390 178254 178107 177745 177414 177273 176909 176114 175662 176501 178487 180584 182076 182950
$$ packed form
56593A28549l94p31k76Q35J551J254K91n22m85N30J833K470K220J614R51J08n71
56576A39227k44J096K255K352J810J352R88O38P10J276J666J699K283L864N368
56561A66340N854O218P754R843J0648R637P839N905L575J131k39j9Q08R90L06
56546B36590o70j424j797j920k054k233k169j769j460j596j922k164k616l473
56532B09323m087l714k708k059k052k179k143k037j762j123m31j75k71l05k98
56517A83979m53m73o9J82m95j632j891q64M73J188J286J008K60q33j555j331m22
56500A78358L17K33n36j044l44J303K411J940N51m05n61m47k74O0J95l14j007
56483A80436j012m12p6k34l12j36j47l62l31j41l64p95m52Q39J986K097J492Q74
$$ plain form
56465 182950 183454 183996 185177 187142 189036 189780 189329 188515 187845 187130 186326 186013 186820 188696 190883 192407 192730
56448 192730 192168 191543 191256 190915 190064 188867 187795 187112 187021 187809 189273 190445 190537 189919 189568 189864 190526 191390
56430 191390 192492 193491 193792 193350 192881 193195 194622 196924 199347 200948 201373 201285 201654 202737 204075 205246
56414 205246 206167 206890 207557 208427 209556 210562 211060 211081 210766 210036 209035 208477 208931 209981 210673 210572 209907 208982
56396 208982 208079 207711 208251 209472 211007 213061 215931 219004 221038 221520 221152 220967 221509 222777 224309 225282
56380 225282 225206 224650 224798 226142 228134 230105 231926 233594 234763 235082 234755 234476 234841 235848 236924 237603
56364 237603 238211 239511 241443 242749 242431 241168 240581 241309 242567 243571 244565 246215 248612 251208 253368
56349 253368 254702 255091 254624 253549 252322 251645 252085 253440 254814 255610 256143 257016 258350 260052 262363 265498
$$ packed form
56465A82950N04N42J181J965J894P44m51q14o70p15q04l13Q07J876K187J524L23
56448A92730n62o25k87l41q51j197j072o83r1P88J464J172R2o18l51K96O62Q64
56430A91390J102R99L01m42m69L14J427K302K423J601M25q8L69J083J338J171
56414B05246R21P23O67Q70J129J006M98K1l15p30j001n58M54J050O92j01o65r25
56396B08982r03l68N40J221J535K054K870L073K034M82l68j85N42J268J532R73
56380B25282p6n56J48J344J992J971J821J668J169L19l27k79L65J007J076O79
56364B37603O08J300J932J306l18j263n87P28J258J004R94J650K397K596K160
56349B53368J334L89m67j075j227o77M40J355J374P96N33Q73J334J702K311L135
$$ plain form
56333 265498 269066 272420 275304 277626 279034 279406 279441 279972 280951 281881 283011 285128 288232 291243 293116 293512
56317 293512 292471 290328 288076 286871 286840 287009 286643 285984 285490 285045 284414 283933 284315 285992 288909 292662 296686
56300 296686 300533 304093 307348 310065 312059 313661 315427 317428 319271 320786 322218 323732 325289 327024
56286 327024 329255 331962 334740 337359 339999 342863 345973 349390 353204 357158 360669 363434 365831 368647
56272 368647 372552 377747 383906 390435 396952 403518 410387 417753 425699 434052 442283 450113 458321 468277
56258 468277 480428 494018 508597 524853 543348 563518 584943 608729 636452 668233 703068
56247 703068 740626 781462 825691 872636 921732 972734 1025081 1077968 1130894 1183191 1233257
56236 1233257 1279239 1320256 1355894 1384776 1404878 1415302 1416690 1409967 1395699 1374522 1347045 1313499
$$ packed form
56333B65498L568L354K884K322J408L72L5N31R79R30J130K117L104L011J873L96
56317B93512j041k143k252j205l1J69l66o59m94m45o31m81L82J677K917L753M024
56300B96686L847L560L255K717J994J602J766K001J843J515J432J514J557J735
56286C27024K231K707K778K619K640K864L110L417L814L954L511K765K397K816
56272C68647L905N195O159O529O517O566O869P366P946Q353Q231P830Q208R956
56258D68277J2151J3590J4579J6256J8495K0170K1425K3786K7723L1781L4835
56247G03068L7558M0836M4229M6945M9096N1002N2347N2887N2926N2297N0066
56236A233257M5982M1017L5638K8882K0102J0424J388o723j4268k1177k7477l3546
$$ plain form
56224 1313499 1274663 1232923 1190944 1149302 1106818 1063232 1020008 978363 938267 899892 864423
56213 864423 832538 803390 775935 750226 726641 704821 684165 664680 646712 630451 616062
56202 616062 603578 592415 581887 572417 565179 560242 556219 552085 548155 544765 541333 537443 533730
56189 533730 530817 528388 526102 524522 524293 525222 526925 529557 533099 536699 539563 541852 544046 546120 548043
56174 548043 550396 553716 557821 562402 567688 573918 580791 587929 595242 602386 608658 614057 619686 626503
56160 626503 634442 643266 653354 664943 677501 690744 705474 722501 741415 761418 782857 807027
56148 807027 834907 866961 903877 946770 996857 1055444 1123868 1202893 1292400 1391828 1500110
56137 1500110 1614483 1729837 1840029 1939907 2026415 2098966 2159681 2212765 2262721 2312623 2363281
$$ packed form
56224A313499l8836m1740m1979m1642m2484m3586m3224m1645m0096l8375l5469
56213H64423l1885k9148k7455k5709k3585k1820k0656j9485j7968j6261j4389
56202F16062j2484j1163j0528r470p238m937m023m134l930l390l432l890l713
56189E33730k913k429k286j580k29R29J703K632L542L600K864K289K194K074J923
56174E48043K353L320M105M581N286O230O873P138P313P144O272N399N629O817
56160F26503P939Q824J0088J1589J2558J3243J4730J7027J8914K0003K1439K4170
56148H07027K7880L2054L6916M2893N0087N8587O8424P9025Q9507R9428J08282
56137A500110J14373J15354J10192R9878Q6508P2551O0715N3084M9956M9902N0658
$$ plain form
56126 2363281 2412678 2455912 2486943 2501707 2499829 2483822 2457578 2425222 2389415 2349467 2301720
56115 2301720 2242327 2169260 2082070 1981784 1872115 1759418 1650042 1548068 1455793 1374855
56105 1374855 1305801 1247580 1198732 1158532 1126271 1100397 1079384 1062766 1050481 1041902 1036271 1033291
56093 1033291 1032498 1032912 1034111 1036827 1041580 1047526 1053554 1059794 1067135 1075840 1085414 1095285 1104923 1113899
56079 1113899 1122431 1131312 1140872 1150631 1160142 1169277 1177625 1184928 1192373 1201932 1213943 1226833 1239755
56066 1239755 1253800 1269846 1287007 1304234 1321822 1340190 1358816 1377578 1397643 1419680 1442641
56055 1442641 1465484 1488657 1512655 1536761 1560592 1585211 1611158 1637026 1661670 1686295 1712495
56044 1712495 1739694 1766467 1793169 1821258 1851095 1882217 1914774 1948940 1983875 2018972 2055147
$$ packed form
56126B363281M9397M3234L1031J4764j878j6007k6244l2356l5807l9948m7747
56115B301720n9393p3067q7190j00286j09669j12697j09376j01974r2275q0938
56105A374855o9054n8221m8848m0200l2261k5874k1013j6618j2285q579n631k980
56093A033291p93M14J199K716M753N946O028O240P341Q705R574R871R638Q976
56079A113899Q532Q881R560R759R511R135Q348P303P445R559J2011J2890J2922
56066A239755J4045J6046J7161J7227J7588J8368J8626J8762K0065K2037K2961
56055A442641K2843K3173K3998K4106K3831K4619K5947K5868K4644K4625K6200
56044A712495K7199K6773K6702K8089K9837L1122L2557L4166L4935L5097L6175
$$ plain form
56033 2055147 2093382 2133081 2173433 2215096 2258899 2304174 2350114 2397516 2447364 2498940 2551196
56022 2551196 2604766 2660803 2719054 2778858 2840792 2905544 2972554 3041539 3113939 3190986 3271884
56011 3271884 3355770 3443724 3536812 3633926 3733800 3837456 3946353 4059929 4177438 4300490
56001 4300490 4431178 4569323 4714064 4866497 5028134 5198533 5377051 5565245 5765055
55992 5765055 5976509 6199763 6437242 6691147 6961227 7247757 7554044 7883046 8234475
55983 8234475 8608654 9010179 9444036 9911325 10412966 10954552 11543188 12182812 12877390
55974 12877390 13635703 14468362 15383554 16390830 17505701 18745682 20126393 21667677
55966 21667677 23399662 25357633 27577350 30103856 33001049 36347099 40229455 44756025
$$ packed form
56033B055147L8235L9699M0352M1663M3803M5275M5940M7402M9848N1576N2256
56022B551196N3570N6037N8251N9804O1934O4752O7010O8985P2400P7047Q0898
56011C271884Q3886Q7954R3088R7114R9874J03656J08897J13576J17509J23052
56001D300490J30688J38145J44741J52433J61637J70399J78518J88194J99810
55992E765055K11454K23254K37479K53905K70080K86530L06287L29002L51429
55983H234475L74179M01525M33857M67289N01641N41586N88636O39624O94578
55974A2877390P58313Q32659R15192J007276J114871J239981J380711J541284
55966B1667677J731985J957971K219717K526506K897193L346050L882356M526570
$$ plain form
55958 44756025 50067061 56328288 63721752 72456030 82777937 94963563 109311992 126165833
55950 126165833 145921946 168985746 195676992 226068471 259642126 294754614 328282847
55943 328282847 356004351 373816801 379153169 371728686 353312101 326902114 295852211
55936 295852211 263212518 231328888 201706127 175109163 151779807 131632913 114394527
55929 114394527 99709822 87221623 76601558 67552374 59815377 53180090 47475723
55922 47475723 42554367 38288986 34579523 31346402 28517563 26028336 23828999 21881772
55914 21881772 20151167 18604188 17216931 15972376 14852483 13838858 12919153 12085720
55906 12085720 11328812 10636936 10002553 9421448 8887405 8392955 7934361 7510525 7117638
$$ packed form
55958D4756025N311036O261227P393464Q734278J0321907J2185626J4348429J6853841
55950A26165833J9756113K3063800K6691246L0391479L3573655L5112488L3528233
55943C28282847K7721504J7812450N336368p424483j8416585k6409987l1049903
55936B95852211l2639693l1883630k9622761k6596964k3329356k0146894j7238386
55929A14394527j4684705j2488199j0620065r049184p736997o635287n704367
55922D7475723m921356m265381l709463l233121k828839k489227k199337j947227
55914B1881772j730605j546979j387257j244555j119893j013625r19705q33433
55906A2085720p56908o91876o34383n81105n34043m94450m58594m23836l92887
$$ plain form
55897 7117638 6749844 6404546 6082380 5782454 5501951 5239881 4996893 4771594 4560854
55888 4560854 4363435 4179860 4009181 3849210 3699327 3559767 3428823 3303981 3185153
55879 3185153 3073611 2968594 2868175 2772593 2683205 2598752 2516113 2434394 2355016 2278214 2202869
55868 2202869 2129642 2060881 1997131 1936677 1878707 1824093 1772846 1723555 1675758 1630319 1587107
55857 1587107 1544655 1502641 1462543 1425402 1390838 1358529 1328771 1301224 1274780 1248897 1223596
55846 1223596 1198258 1172011 1145260 1119215 1094059 1069172 1044869 1022139 1000810 979740 958723
55835 958723 938530 919168 899873 880839 863258 847604 833364 820435 809208 799229 789328 779178
55823 779178 769349 759811 749692 738548 726569 713653 699589 685110 671471 658951 646875 634952
$$ packed form
55897G117638l67794l45298l22166k99926k80503k62070k42988k25299k10740
55888D560854j97419j83575j70679j59971j49883j39560j30944j24842j18828
55879C185153j11542j05017j00419r5582q9388q4453q2639q1719p9378p6802p5345
55868B202869p3227o8761o3750o0454n7970n4614n1247m9291m7797m5439m3212
55857A587107m2452m2014m0098l7141l4564l2309k9758k7547k6444k5883k5301
55846A223596k5338k6247k6751k6045k5156k4887k4303k2730k1329k1070k1017
55835I58723k0193j9362j9295j9034j7581j5654j4240j2929j1227r979r901j0150
55823G79178r829r538j0119j1144j1979j2916j4064j4479j3639j2520j2076j1923
$$ plain form
55811 634952 623496 612544 601913 591875 582747 574219 566210 559734 555630 553031 550607 548713 548653 550260
55797 550260 551994 553162 554212 555024 554783 553669 552958 553223 553967 555257 558177 563207 569223 574285 576400
55782 576400 573745 565614 553379 539373 524776 509648 494775 481948 472282 465509 461062 458571 457110
55769 457110 455064 451047 444265 434328 421821 408714 396909 386553 376924 368514 362592 358960 355944
55756 355944 352702 349884 347820 345693 342908 339714 336019 330982 324389 317291 310866 305636 301931 299845
55742 299845 298458 296449 293793 291656 290303 288497 285414 281789 278589 275733 272797 269902 267235 264637
55728 264637 262191 260326 258780 256364 252266 246893 241093 235413 230401 226653 224040 221784 219670 218402
55714 218402 218406 219206 220366 222088 224399 226594 228028 228755 229034 228944 228833 229356 230615 231968 232914 233393 232925
$$ packed form
55811F34952j1456j0952j0631j0038r128q528q009o476m104k599k424j894o0J607
55797E50260J734J168J050Q12k41j114p11K65P44J290K920N030O016N062K115
55782E76400k655q131j2235j4006j4597j5128j4873j2827r666o773m447k491j461
55769D57110k046m017o782r937j2507j3107j1805j0356r629q410n922l632l016
55756C55944l242k818k064k127k785l194l695n037o593p098o425n230l705k086
55742B99845j387k009k656k137j353j806l083l625l200k856k936k895k667k598
55728B64637k446j865j546k416m098n373n800n680n012l748k613k256k114j268
55714B18402MQ00J160J722K311K195J434P27K79r0j11N23J259J353R46M79m68
$$ plain form
55697 232925 230461 225654 219535 213455 207959 203045 198746 195003 191614 188704 186656 185266 183626 181247
55683 181247 178721 176993 176542 177469 179726 182905 186334 189520 192076 193386 193103 191944 190985 190174 188550
55668 188550 185979 183487 181617 179693 177223 174923 173688 173451 173691 174292 175263 176287 177081 177631 177781 177328
55652 177328 176829 177358 178988 180431 180737 180456 180451 180494 179899 178873 178259 178308 178489 178330 177802 177001 175852 174127
55634 174127 171618 168453 165169 162079 158814 155018 151224 148184 145617 142751 139982 138613 138830 139360 139509
55619 139509 139962 140926 141098 139560 137365 135951 135024 133324 130680 127957 125558 123344 121596 120748 120326 119320
55603 119320 117576 115886 114708 113685 112434 111071 109823 108732 107798 107083 106652 106658 107263 108216 108884 109031 109153
55586 109153 109705 110520 111474 113111 115935 119509 123002 126374 130371 135528 141765 148822 156599 165162 174751
$$ packed form
55697B32925k464m807o119o080n496m914m299l743l389k910k048j390j640k379
55683A81247k526j728m51R27K257L179L429L186K556J310k83j159r59q11j624
55668A88550k571k492j870j924k470k300j235k37K40O01R71J024P94N50J50m53
55652A77328m99N29J630J443L06k81nM3n95j026o14M9J81j59n28q01j149j725
55634A74127k509l165l284l090l265l796l794l040k567k866k769j369K17N30J49
55619A39509M53R64J72j538k195j414r27j700k644k723k399k214j748q48m22j006
55603A19320j744j690j178j023j251j363j248j091r34p15m31OO05R53O68J47J22
55586A09153N52Q15R54J637K824L574L493L372L997N157O237P057P777Q563R589
$$ plain form
55571 174751 185478 196594 206313 212760 214978 212877 206841 197907 187797 178002 168890 160072 151302
55558 151302 142609 133947 125379 117459 110913 105986 102346 99392 96442 93017 89319 86145 84050 82932
55544 82932 82573 83011 83999 84764 84799 84420 83992 83168 81534 79626 78578 78972 80507 82488 84182 85069 85261
55527 85261 85412 85867 86279 86379 86488 86741 86550 85580 84683 84859 85663 85655 84267 82373 81000 80301 79905 79641 79669
55508 79669 80168 80956 81341 80710 79515 79143 80310 82014 82641 81772 80320 79331 79287 80142 81246 81463 80194
55491 80194 78169 76590 75722 75021 74372 74315 75070 76161 77021 77327 76741 75051 72696 70551 69137 68522 68898
55474 68898 70491 72794 74575 74953 74118 72849 71711 70837 70066 69135 67971 66833 65924 64976 63563 61835
55458 61835 60524 60190 60711 61566 62387 63206 64247 65427 66130 65799 64750 63911 63632 63364 62797 62558 63254 64449
$$ packed form
55571A74751J0727J1116R719O447K218k101o036q934j0110r795r112q818q770
55558A51302q693q662q568p920o546m927l640k954k950l425l698l174k095j118
55544H2932l59M38R88P65L5l79m28q24j634j908j048L94J535J981J694Q87J92
55527H5261J51M55M12J00J09K53j91r70q97J76Q04qj388j894j373o99l96k64K8
55508G9669M99P88L85o31j195l72J167J704O27q69j452r89m4Q55J104K17j269
55491H0194k025j579q68p01o49n7P55J091Q60L06n86j690k355k145j414o15L76
55474F8898J593K303J781L78q35j269j138q74p71r31j164j138r09r48j413j728
55458F1835j311l34N21Q55Q21Q19J041J180P03l31j049q39k79k68n67k39O96J195
$$ plain form
55440 64449 65284 65547 65416 64733 63459 62451 62742 64146 65418 65718 65223 64489 64038 64394 65590 66752 67009
55423 67009 66759 67084 67954 68126 67082 65978 66160 67469 68619 68762 68171 67712 68024 69052 70136 70654 70498
55406 70498 69754 68263 65993 63596 61924 61046 60407 59843 59727 60091 60454 60639 61042 61812 62502 62852 63340 64573
55388 64573 66515 68565 70043 70504 70080 69623 69970 70873 71206 70414 69211 68534 68343 67839 66539 64737 63124
55371 63124 62207 61955 61933 61833 61780 61852 61604 60607 59316 58724 59126 59823 60155 60137 59985 59669 59238 59024 59214 59671
55351 59671 60350 61429 62811 63991 64619 64784 64662 64443 64662 65822 67374 67870 66648 64808 63929 64304 65012
55334 65012 65350 65511 65968 66772 67502 67638 67002 65996 65338 65378 65786 65879 65106 63287 60841 58791 58095 58734
55316 58734 59808 60600 61104 61466 61521 61160 60688 60436 60375 60391 60540 60765 60696 60040 58923 57687 56731 56590 57636
$$ packed form
55440F4449Q35K63j31o83j274j008K91J404J272L00m95p34m51L56J196J162K57
55423F7009k50L25Q70J72j044j104J82J309J150J43n91m59L12J028J084N18j56
55406G0498p44j491k270k397j672q78o39n64j16L64L63J85M03P70O90L50M88J233
55388F4573J942K050J478M61m24m57L47R03L33p92j203o77j91n04j300j802j613
55371F3124r17k52k2j00n3P2k48r97j291n92M02O97L32j8j52l16m31k14J90M57
55351E9671O79J079J382J180O28J65j22k19K19J160J552M96j222j840q79L75P08
55334F5012L38J61M57Q04P30J36o36j006o58M0M08R3p73j819k446k050o96O39
55316E8734J074P92N04L62N5l61m72k52o1J6J49K25o9o56j117j236r56j41J046
$$ plain form
55297 57636 59462 61100 62144 63125 64480 65733 66127 65531 64283 62736 61488 61426 62742 64387 65318 65927
55281 65927 67324 69426 70816 70670 69886 69870 70870 72017 72598 72792 73268 74385 75773 76556 76060 74403 72341
55264 72341 70546 69169 68101 67387 67124 67092 66787 66000 65130 64655 64413 63816 62895 62588 63586 65339 66774 67670
55246 67670 68524 69259 69163 68325 68032 69075 70453 70650 69657 68788 68783 69083 68986 68623 68467 68620 68923 69316 69614 69270
55226 69270 67874 65828 64128 63400 63307 63065 62375 61707 61638 62140 62666 62838 62868 63295 64486 66349 68332 69701
55208 69701 70083 69813 69499 69252 68650 67570 66680 66772 67820 68976 69492 69378 69194 69346 69684 69794 69596 69531 70023
55189 70023 70922 71714 72129 72228 72019 71412 70628 70162 70175 70216 69745 68677 67352 66295 66116 67218 69315 71492
55171 71492 72990 73760 74167 74420 74449 74074 73184 71979 71076 71019 71638 72304 72883 73828 75142 75949 75579 74534
$$ packed form
55297E7636J826J638J044R81J355J253L94n96j248j547j248o2J316J645R31O09
55281F5927J397K102J390j46p84j6J000J147N81J94M76J117J388P83m96j657k062
55264G2341j795j377j068p14k63l2l05p87q70m75k42n97r21l07R98J753J435Q96
55246F7670Q54P35r6q38k93J043J378J97r93q69nL00r7l63j56J53L03L93K98l44
55226F9270j396k046j700p28r3k42o90o68o9N02N26J72L0M27J191J863J983J369
55208F9701L82k70l14k47o02j080q90R2J048J156N16j14j84J52L38J10j98o5M92
55189G0023Q99P92M15R9k09o07p84m66J3M1m71j068j325j057j79J102K097K177
55171G1492J498P70M07K53K9l75q90j205r03n7O19O66N79R45J314Q07l70j045
$$ plain form
55153 74534 73799 73601 73486 73322 73468 73983 74281 73817 72780 71944 71891 72362 72329 70939 68528 66433 65629 65860
55135 65860 66302 66618 66931 67188 67227 67323 68053 69500 71004 71825 71807 71369 71107 71373 71998 72448 72353 71844 71230 70582
55115 70582 69849 69167 68746 68606 68649 68844 69122 69312 69416 69697 70237 70731 71082 71844 73486 75473 76717 76891
55097 76891 76726 76943 77415 77512 76882 75765 74835 74776 75661 76688 76877 76076 75029 74437 74361 74588 75163 76299 78003
55078 78003 79972 81713 82696 82602 81512 79829 77981 76349 75377 75426 76395 77675 78636 79037 78961 78560 78024 77687
55060 77687 77968 78998 80285 80889 80186 78470 76602 75098 73864 72808 72204 72181 72295 72038 71523 71318 71829
55043 71829 73144 75124 77166 78242 77841 76771 76447 77429 79085 80587 81543 81737 81002 79643 78444 77969
55027 77969 78240 79156 80642 82110 82438 81048 78724 76849 75997 75668 75257 74792 74656 74928 75238 75168 74737 74430
$$ packed form
55153G4534p35j98j15j64J46N15K98m64j037q36n3M71l3j390k411k095q04K31
55135F5860M42L16L13K57L9R6P30J447J504Q21j8m38k62K66O25M50r5n09o14o48
55115G0582p33o82m21j40M3J95K78J90J04K81N40M94L51P62J642J987J244J74
55097G6891j65K17M72R7o30j117r30n9Q85J027J89q01j047n92p6K27N75J136J704
55078G8003J969J741R83r4j090j683j848j632r72M9R69J280R61M01p6m01n36l37
55060G7687K81J030J287O04p03j716j868j504j234j056o04k3J14k57n15k05N11
55043G1829J315J980K042J076m01j070l24R82J656J502R56J94p35j359j199m75
55027G7969K71R16J486J468L28j390k324j875q52l29m11m65j36K72L10p0m31l07
$$ plain form
55009 74430 74716 75496 76108 75940 74947 73540 72136 70952 70157 70017 70733 72148 73725 74964 75868 76869 78253
54992 78253 79806 81099 81909 82183 81859 80987 79955 79252 79016 79029 79138 79429 79988 80721 81462 82120 82718 83506
54974 83506 84956 87406 90584 93662 95863 96966 97300 97382 97580 97902 98086 97875 97231 96294 95342 94841 95232
54957 95232 96421 97673 98278 98176 97722 97100 96372 95862 95915 96242 96018 94854 93338 92415 92443 93013 93506 93622
54939 93622 93437 93103 92634 92070 91738 92066 93035 94170 95182 96218 97223 97609 97070 96330 96363 97148 97975 98788
54921 98788 100262 102474 104534 105977 107623 110407 114012 117478 120801 125039 130877 137738 144442 150176
54907 150176 154554 157152 157465 155366 151431 146668 141932 137550 133391 129146 124561 119658 114867 110771
54893 110771 107560 104875 102443 100628 99979 100382 101144 101895 102901 104309 105548 105829 105036 103902 103394 104020
$$ packed form
55009G4430K86P80O12j68r93j407j404j184p95j40P16J415J577J239R04J001J384
54992G8253J553J293Q10K74l24q72j032p03k36J3J09K91N59P33P41O58N98P88
54974H3506J450K450L178L078K201J103L34Q2J98L22J84k11o44r37r52n01L91
54957I5232J189J252O05j02m54o22p28n10N3L27k24j164j516r23K8N70M93J16
54939I3622j85l34m69n64l32L28R69J135J012J036J005L86n39p40L3P85Q27Q13
54921I8788J474K212K060J443J646K784L605L466L323M238N838O861O704N734
54907A50176M378K598L13k099l935m763m736m382m159m245m585m903m791m096
54893A10771l211k685k432j815o49M03P62P51J006J408J239K81p93j134n08O26
$$ plain form
54877 104020 105553 107326 108948 110743 113355 116981 121285 126006 131239 136991 142847 148287 153072 157072
54863 157072 159918 161109 160359 157762 153749 148971 144057 139327 134795 130350 125798 120827 115369 110046
54849 110046 105831 103049 100997 98820 96467 94513 93236 92219 90934 89483 88595 88755 89401 89323 88074
54834 88074 86683 86492 87531 88613 88977 89098 89683 90634 91431 91890 91969 91264 89490 87350 86202 86736 88375
54817 88375 90084 91405 92556 93818 95106 96083 96490 96320 95745 94948 93993 92814 91333 89756 88715 88818
54801 88818 89865 90861 91091 90890 90917 91029 90547 89491 88716 88743 89154 89380 89377 89188 88564 87499 86643 86644 87387 88284
54781 88284 88962 89335 89448 89657 90548 92216 94028 95556 97248 99647 102435 105007 107568 110774 114426 117457
54765 117457 119269 120405 121814 124119 127663 132498 138022 143201 147539 151459 155479 159396 162521 164318
$$ packed form
54877A04020J533J773J622J795K612L626M304M721N233N752N856N440M785M000
54863A57072K846J191p50k597m013m778m914m730m532m445m552m971n458n323
54849A10046m215k782k052k177k353j954j277j017j285j451q88J60O46p8j249
54834H8074j391j91J039J082L64J21N85R51P97M59P9p05j774k140j148N34J639
54817H8375J709J321J151J262J288R77M07j70n75p97r55j179j481j577j041J03
54801H8818J047R96K30k01K7J12m82j056p75K7M11K26lj89o24j065q56JP43Q97
54781H8284O78L73J13K09Q91J668J812J528J692K399K788K572K561L206L652L031
54765A17457J812J136J409K305L544M835N524N179M338L920M020L917L125J797
$$ plain form
54751 164318 164506 162877 159384 154332 148280 141814 135509 129899 125308 121733 118920 116470 114017 111625
54737 111625 109955 109665 110486 111246 110955 109684 108204 107113 106527 106388 106677 107346 108277 109373 110664 112296
54721 112296 114418 116936 119425 121517 123440 125978 129738 134615 140069 145649 150997 155507 158455 159617
54707 159617 159450 158434 156340 152478 146678 139840 133359 128110 124064 120711 117614 114586 111667 109080
54693 109080 107055 105603 104502 103564 102771 102089 101362 100493 99617 98944 98575 98563 99004 99839 100705 101125 100837 99865
54675 99865 98467 97096 96192 95762 95364 94761 94459 95191 96941 98774 99684 99343 98094 96582 95559 95607 96641
54658 96641 97750 97903 96947 95767 95348 95789 96397 96653 96741 96982 97106 96536 95325 94303 94134 94541 94751 94415
54640 94415 93820 93402 93395 93904 94970 96458 97977 98983 99084 98391 97616 97535 98212 98946 99119 98889 98836 99204 99719
$$ packed form
54751A64318J88j629l493n052o052o466o305n610m591l575k813k450k453k392
54737A11625j670k90Q21P60k91j271j480j091n86j39K89O69R31J096J291J632
54721A12296K122K518K489K092J923K538L760M877N454N580N348M510K948J162
54707A59617j67j016k094l862n800o838o481n249m046l353l097l028k919k587
54693A09080k025j452j101r38p93o82p27q69q76o73l69j2M41Q35Q66M20k88r72
54675I9865j398j371r04m30l98o03l02P32J750J833R10l41j249j512j023M8J034
54658I6641J109J53r56j180m19M41O08K56Q8K41J24n70j211j022j69M07K10l36
54640I4415n95m18pN09J066J488J519J006J01o93p75q1O77P34J73k30n3L68N15
$$ plain form
54621 99719 100018 99944 99515 98862 98162 97511 96938 96573 96599 96886 97004 96822 96837 97592 98978 100408 101463 102045 102134
54602 102134 101821 101475 101482 101849 102295 102616 102661 102169 101059 99810 99114 99202 99815 100688 101632 102280 102247 101617 100855 100210
54582 100210 99563 98889 98435 98358 98543 98867 99345 99981 100718 101506 102158 102295 101821 101371 101773 103032 104317 105028
54564 105028 105383 105895 106728 107728 108662 109221 109153 108585 107994 107772 108014 108648 109451 110063 110410 110978 112133 113311
54546 113311 113583 113031 112763 113430 114515 115321 115849 116365 116926 117811 119593 122160 124364 125401 125965 127216 129024
54529 129024 130085 129465 127312 124375 121665 120360 121063 123042 124847 125703 125811 125462 124676 123716 123067 122724
54513 122724 122160 121277 120739 121007 121620 121770 121194 120138 118892 117711 116901 116482 115976 114899 113427 112310 112143
54496 112143 112884 114086 115436 116995 118899 120914 122487 123382 124001 124838 125788 126360 126432 126292 126038 125493 124858
$$ packed form
54621I9719K99p4m29o53p00o51n73l65K6K87J18j82J5P55J386J430J055N82Q9
54602A02134l13l46PL67M46L21M5m92j110j249o96Q8O13Q73R44O48l3o30p62o45
54582A00210o47o74m54p7J85L24M78O36P37P88O52J37m74m50M02J259J285P11
54564A05028L55N12Q33J000R34N59o8n68n91k22K42O34Q03O12L47N68J155J178
54546A13311K72n52k68O67J085Q06N28N16N61Q85J782K567K204J037N64J251J808
54529A29024J061o20k153k937k710j305P03J979J805Q56J08l49p86r60o49l43
54513A22724n64q83n38K68O13J50n76j056j246j181q10m19n06j077j472j117j67
54496A12143P41J202J350J559J904K015J573Q95O19Q37R50N72P2j40k54n45o35
$$ plain form
54479 124858 124862 125968 127816 129743 131506 133199 134773 136060 137122 138200 139331 140238 140609 140425 140050 140009
54463 140009 140516 141272 141966 142859 144386 146142 146926 146176 144790 144030 144031 144001 143532 142928 142360 141516 140298 139211
54445 139211 138737 138758 138879 138926 138810 138275 137132 135598 134065 132721 131636 131006 130955 131156 131012 130230 129006 127704
54427 127704 126593 125953 126040 126784 127695 128341 128834 129618 130823 132067 133000 133724 134429 134879 134690 134119 134050 134924
54409 134924 136053 136451 136101 135905 136419 137195 137530 137392 137384 138038 139424 141214 142908 144122 144861 145394 145803 145870
54391 145870 145506 144947 144320 143338 141753 139893 138418 137698 137707 138242 138815 138627 137276 135557 134956 136181 138471
54374 138471 140419 141158 140726 139757 138995 138757 138689 138279 137602 137239 137430 137827 138152 138538 138945 138892 138205 137566 137696
54355 137696 138303 138471 137977 137562 137855 138537 138789 138241 137238 136360 135838 135464 134993 134554 134418 134403 133854 132467
$$ packed form
54479A24858MJ106J848J927J763J693J574J287J062J078J131R07L71j84l75m1
54463A40009N07P56O94Q93J527J756P84p50j386p60Jl0m69o04n68q44j218j087
54445A39211m74K1J21M7j16n35j143j534j533j344j085o30n1K01j44p82j224j302
54427A27704j111o40Q7P44R11O46M93P84J205J244R33P24P05M50j89n71o9Q74
54409A34924J129L98l50j96N14P76L35j38qO54J386J790J694J214P39N33M09O7
54391A45870l64n59o27r82j585j860j475p20RN35N73j88j351j719o01J225K290
54374A38471J948P39m32r69p62k38o8m10o77l63J91L97L25L86M07n3o87o39J30
54355A37696O07J68m94m15K93O82K52n48j003q78n22l74m71m39j36j5n49j387
$$ plain form
54337 132467 130819 129800 129748 130465 131803 133705 135746 137211 137806 138079 138934 140823 143300 145291 145921 145334
54321 145334 144536 144291 144406 144277 143721 142821 141364 139187 136948 135737 135795 136222 136136 135529 134763 133886 132869 132040
54303 132040 131772 131951 132109 131931 131457 131000 131046 131933 133356 134404 134303 132964 130810 128450 126671 126197 126948
54286 126948 127819 127678 126490 125133 124311 124028 123943 123781 123337 122448 121131 119642 118390 117829 118238 119417 120740
54269 120740 121684 122192 122438 122539 122711 123416 124934 126963 128987 130869 132688 134225 135142 135618 136203 136969 137364
54252 137364 137099 136639 136437 136105 134837 132487 129824 127771 126726 126543 126786 126970 126876 126822 127373 128565 129601
54235 129601 129579 128445 126962 125819 125133 124868 125257 126368 127533 127771 126846 125515 124563 123945 123133 122001 121020
54218 121020 120650 120870 121341 121811 122234 122591 122767 122672 122442 122379 122591 122830 122863 122814 122864 122741 122061 121191 121189 122527 124371
$$ packed form
54337A32467j648j019n2P17J338J902K041J465N95K73Q55J889K477J991O30n87
54321A45334p98k45J15j29n56r00j457k177k239j211N8M27q6o07p66q77j017q29
54303A32040k68J79J58j78m74m57M6Q87J423J048j01j339k154k360j779m74P51
54286A26948Q71j41j188j357q22k83q5j62m44q89j317j489j252n61M09J179J323
54269A20740R44N08K46J01J72P05J518K029K024J882J819J537R17M76N85P66L95
54252A37364k65m60k02l32j268k350k663k053j045j83K43J84r4n4N51J192J036
54235A29601k2j134j483j143o86k65L89J111J165K38r25j331r52o18q12j132r81
54218A21020l70K20M71M70M23L57J76r5k30o3K12K39L3m9N0j23o80q70kJ338J844
$$ plain form
54197 124371 125595 126118 126631 127267 127415 126914 126645 127453 128933 129834 129460 128218 126872 125736 124690 123593
54181 123593 122442 121294 120239 119368 118629 117813 116898 116301 116487 117312 117991 117869 116983 115776 114560 113520 112955
54164 112955 113075 113691 114437 115248 116192 116970 117129 116846 116904 117697 118715 119308 119458 119429 119131 118445 117901 118344 119891
54145 119891 121653 122630 122583 121998 121507 121413 121578 121677 121641 121789 122441 123481 124537 125445 126281 126999 127335 127149 126642
54126 126642 126243 126316 126898 127566 127711 127207 126747 127224 128840 130978 132860 134019 134262 133669 132775 132327 132585 133001
54108 133001 132856 132062 131158 130601 130323 129963 129300 128304 127072 125963 125642 126526 128040 128932 128640 127936 127674 127348
54090 127348 125791 123153 121088 120673 121142 121316 121318 121938 122941 123254 122648 122149 122639 123903 125253 126347 127095
54073 127095 127370 127177 126752 126282 125797 125407 125210 124967 124333 123486 122996 122985 123003 122855 122939 123487 124085 124320 124414 124763
$$ packed form
54197A24371J224N23N13O36J48n01k69Q08J480R01l74j242j346j136j046j097
54181A23593j151j148j055q71p39q16r15n97J86Q25O79j22q86j207j216j040n65
54164A12955J20O16P46Q11R44P78J59k83N8P93J018N93J50k9k98o86n44M43J547
54145A19891J762R77m7n85m91r4J65R9l6J48O52J040J056R08Q36P18L36j86n07
54126A26642l99P3N82O68J45n04m60M77J616K138J882J159K43n93q94m48K58M16
54108A33001j45p94r04n57k78l60o63r96j232j109l21Q84J514Q92k92p04k62l26
54090A27348j557k638k065m15M69J74KO20J003L13o06m99M90J264J350J094P48
54073A27095K75j93m25m70m85l90j97k43o34q47m90j1J8j48Q4N48N98K35R4L49
$$ plain form
54053 124763 125359 126083 127138 128664 130203 131120 131403 131606 132164 133165 134617 136471 138375 139814 140550 140738
54037 140738 140735 141010 142019 143835 145959 147850 149559 151513 153745 155696 156868 157365 157669 158045 158287 157988
54021 157988 157032 155888 155328 155829 157282 159325 161752 164509 167535 170883 174829 179658 185389 191803 198458
54006 198458 204392 208171 208737 206244 201757 196250 190251 184264 178842 174008 169148 163881 158764 154746
53992 154746 152110 150343 148890 147633 146641 145858 145212 144688 144068 142873 140970 139094 138243 138492 138846 138508
53976 138508 137814 137542 137683 137590 137145 136991 137461 137996 138054 138026 138635 139764 140521 140446 140095 140226 140786 140943 140068 138500
53956 138500 137354 137595 139335 141996 144955 147806 150179 151798 152829 153797 154954 156051 156951 158030 159634
53941 159634 161477 163016 164191 165445 167290 170227 174735 180690 186964 192191 195933 198584 200367 201173
$$ packed form
54053A24763N96P24J055J526J539R17K83K03N58J001J452J854J904J439P36J88
54037A40738lK75J009J816K124J891J709J954K232J951J172M97L04L76K42k99
54021A57988r56j144n60N01J453K043K427K757L026L348L946M829N731O414O655
54006A98458N934L779N66k493m487n507n999n987n422m834m860n267n117m018
53992A54746k636j767j453j257r92p83o46n24o20j195j903j876q51K49L54l38
53976A38508o94k72J41r3m45j54M70N35N8k8O09J129P57p5l51J31N60J57q75j568
53956A38500j146K41J740K661K959K851K373J619J031R68J157J097R00J079J604
53941A59634J843J539J175J254J845K937M508N955O274N227L742K651J783Q06
$$ plain form
53927 201173 201303 201451 201634 200970 198960 196318 194027 192105 189992 187685 185764 184456 183376 182157 180761
53912 180761 179195 177438 175732 174463 173598 172662 171383 170042 169010 168283 167627 166880 165925 164634 163105 161727
53896 161727 160784 160141 159471 158629 157567 156166 154487 153065 152528 152886 153515 153882 153981 154003 153954 153827 153863 154314 155072
53877 155072 155828 156515 157331 158323 159233 159827 160173 160484 160842 161152 161271 161099 160712 160536 161278 163481 167062 171316
53859 171316 175492 179460 183968 190219 199044 210368 223430 237376 251357 264012 273290 277299 275525
53846 275525 269129 260063 250051 240287 231659 224830 220042 217026 215229 214090 213145 212063 210694 209026
53832 209026 206965 204215 200555 196235 191866 187832 184034 180325 176977 174399 172534 170882 169135 167517
53818 167517 166383 165801 165611 165667 165791 165666 165043 164047 163193 163071 163975 165672 167518 168970 170039 171047 171947
$$ packed form
53927B01173J30J48J83o64k010k642k291j922k113k307j921j308j080j219j396
53912A80761j566j757j706j269q65r36j279j341j032p27o56p47r55j291j529j378
53896A61727r43o43o70q42j062j401j679j422n37L58O29L67R9K2m9j27L6M51P58
53877A55072P56O87Q16R92R10N94L46L11L58L10J19j72l87j76P42K203L581M254
53859A71316M176L968M508O251Q825J1324J3062J3946J3981J2655R278M009j774
53846B75525o396r066j0012r764q628o829m788l016j797j139r45j082j369j668
53832B09026k061k750l660m320m369m034l798l709l348k578j865j652j747j618
53818A67517j134n82j90N6J24j25o23r96q54j22R04J697J846J452J069J008R00
$$ plain form
53801 171947 172252 171808 171290 171519 172444 173217 173221 172729 172468 172840 173654 174431 174815 174758 174435 174059 173807 173846 174225 174669
53781 174669 174698 174084 173062 171985 170999 170170 169629 169299 168773 167820 166797 166164 165831 165496 165387 165972 166963 167373
53763 167373 166812 166047 165908 166221 166233 165599 164383 162585 160347 158457 157854 158612 159935 161147 162146 162874 163021
53746 163021 162618 162406 163179 164941 166989 168645 169641 169998 169930 169856 170242 171323 172997 174903 176527 177390 177403
53729 177403 177021 176908 177431 178552 180147 182294 185196 188852 192784 196167 198462 200003 201720 204072 206479
53714 206479 208073 208809 209448 210592 212265 214432 217312 220860 224406 227264 229457 231503 233712 236064 238572
53699 238572 241268 243953 246485 249277 252967 257446 261695 264843 267008 268782 270287 271141 271129 270458 269381
53684 269381 267981 266426 265100 264316 264029 263985 264048 264224 264348 263957 262640 260560 258418 256757 255473 254174
$$ packed form
53801A71947L05m44n18K29R25P73Mm92k61L72Q14P77L84n7l23l76k52L9L79M44
53781A74669K9o14j022j077r86q29n41l30n26r53j023o33l33l35j09N85R91M10
53763A67373n61p65j39L13J2o34j216j798k238j890o03P58J323J212R99P28J47
53746A63021m03k12P73J762K048J656R96L57o8p4L86J081J674J906J624Q63J3
53729A77403l82j13N23J121J595K147K902L656L932L383K295J541J717K352K407
53714B06479J594P36O39J144J673K167K880L548L546K858K193K046K209K352K508
53699B38572K696K685K532K792L690M479M249L148K165J774J505Q54j2o71j077
53684B69381j400j555j326p84k87m4O3J76J24l91j317k080k142j661j284j299
$$ plain form
53668 254174 252876 251953 251490 251152 250817 250855 251480 252232 252522 252403 252359 252546 252800 253262 254334 255890 257091 257327
53650 257327 257006 257014 257613 258218 258198 257609 257033 256871 256929 256738 256213 255861 256245 257384 258846 260286 261663 263003
53632 263003 264282 265608 267187 268957 270589 272061 273977 276979 280918 284870 288030 290428 292765 295633
53618 295633 298952 302156 304928 307717 311333 316029 321193 326049 330381 334357 337935 340857 343182 345447
53604 345447 348157 351316 354536 357408 359707 361506 363218 365369 368067 370745 372587 373212 372855 371956 370708
53589 370708 369096 367208 365375 363909 362794 361768 360721 359855 359381 359178 358982 358834 359039 359589 359894 359317
53573 359317 357883 356326 355498 355913 357726 360874 365085 369844 374450 378164 380413 381047 380401 379030 377384
53558 377384 375733 374200 372660 370773 368449 366256 364935 364437 363812 362343 360536 359759 361092 364641 369642
$$ packed form
53668B54174j298r23m63l38l35L8O25P52K90j19m4J87K54M62J072J556J201K36
53650B57327l21QN99O05k0n89n76j62N8j91n25l52L84J139J462J440J377J340
53632B63003J279J326J579J770J632J472J916L002L939L952L160K398K337K868
53618B95633L319L204K772K789L616M696N164M856M332L976L578K922K325K265
53604C45447K710L159L220K872K299J799J712K151K698K678J842O25l57q99j248
53589C70708j612j888j833j466j115j026j047q66m74k03j96j48K05N50L05n77
53573C59317j434j557q28M15J813L148M211M759M606L714K249O34o46j371j646
53558C77384j651j533j540j887k324k193j321m98o25j469j807p77J333L549N001
$$ plain form
53543 369642 374883 379326 382877 386562 391628 398487 406651 415481 424541 433473 442175 451162 461174 472284
53529 472284 483900 495770 508381 522047 536213 550168 564005 578422 593926 610830 629662
53518 629662 650781 673640 697126 720755 745017 770405 796682 823338 850277 877672 905405
53507 905405 933065 960410 987550 1014718 1042005 1069333 1096570 1123691 1150807 1177959 1204917
53496 1204917 1231288 1256812 1281398 1304880 1326956 1347461 1366583 1384830 1402897 1421466 1440855
53485 1440855 1460795 1480807 1500833 1521226 1542037 1562500 1581303 1597188 1609363 1617881 1623786 1628411
53473 1628411 1632067 1633624 1631678 1625870 1616754 1604779 1590128 1573465 1556021 1538596 1520898 1502123
53461 1502123 1481800 1459847 1436245 1411156 1385165 1358917 1332585 1306076 1279704 1254153 1229737
$$ packed form
53543C69642N241M443L551L685N066O859Q164Q830R060Q932Q702Q987J0012J1110
53529D72284J1616J1870J2611J3666J4166J3955J3837J4417J5504J6904J8832
53518F29662K1119K2859K3486K3629K4262K5388K6277K6656K6939K7395K7733
53507I05405K7660K7345K7140K7168K7287K7328K7237K7121K7116K7152K6958
53496A204917K6371K5524K4586K3482K2076K0505J9122J8247J8067J8569J9389
53485A440855J9940K0012K0026K0393K0811K0463J8803J5885J2175Q518N905M625
53473A628411L656J557j946n808r116j1975j4651j6663j7444j7425j7698j8775
53461A502123k0323k1953k3602k5089k5991k6248k6332k6509k6372k5551k4416
$$ plain form
53450 1229737 1206065 1182639 1159432 1136725 1114755 1093891 1074897 1058501 1044726 1032900 1022407
53439 1022407 1013187 1005522 999584 995322 992634 991584 992462 995509 1000451 1006471 1012959 1020211 1029055 1039879
53425 1039879 1052453 1066724 1083156 1101963 1122440 1143521 1164844 1186918 1210372 1235409 1261950
53414 1261950 1290041 1320073 1352620 1387961 1425679 1464994 1505697 1548504 1594317 1643407 1695624
53403 1695624 1751019 1809683 1871060 1933905 1997055 2059965 2122637 2185386 2248737 2313163 2378736
53392 2378736 2445024 2511184 2576025 2638339 2697553 2753869 2807428 2857683 2904163 2947534 2989022
53381 2989022 3028714 3065284 3097615 3125937 3151036 3172915 3190700 3203275 3209447 3207815 3197063 3176354
53369 3176354 3145373 3104434 3054932 2999261 2939730 2877655 2813707 2748650 2683211 2617549 2551582
$$ packed form
53450A229737k3672k3426k3207k2707k1970k0864j8994j6396j3775j1826j0493
53439A022407r220p665n938m262k688j050Q78L047M942O020O488P252Q844J0824
53425A039879J2574J4271J6432J8807K0477K1081K1323K2074K3454K5037K6541
53414A261950K8091L0032L2547L5341L7718L9315M0703M2807M5813M9090N2217
53403A695624N5395N8664O1377O2845O3150O2910O2672O2749O3351O4426O5573
53392B378736O6288O6160O4841O2314N9214N6316N3559N0255M6480M3371M1488
53381B989022L9692L6570L2331K8322K5099K1879J7785J2575O172j632j0752k0709
53369C176354l0981m0939m9502n5671n9531o2075o3948o5057o5439o5662o5967
$$ plain form
53358 2551582 2485805 2421282 2358764 2298236 2239348 2181801 2125210 2068952 2012404 1955333 1898070
53347 1898070 1841483 1786687 1734499 1685107 1638266 1593697 1551250 1511030 1473634 1439915 1410055
53336 1410055 1383089 1357866 1334344 1313331 1294926 1277909 1260927 1243788 1227205 1211683 1197143
53325 1197143 1183428 1170645 1158878 1147899 1137421 1127566 1118972 1112356 1107988 1105583 1104706 1105161 1106949
53312 1106949 1109976 1113962 1118634 1123975 1130388 1138648 1149461 1162884 1178366 1195623 1215197 1237701
53300 1237701 1262641 1288622 1314846 1341894 1370745 1401489 1433364 1465644 1497919 1529688 1560300
53289 1560300 1589410 1617068 1643255 1667685 1690209 1711064 1730487 1748275 1763923 1776969 1786944
53278 1786944 1793214 1795296 1793312 1787870 1779463 1768218 1754168 1737402 1717812 1695023 1668776 1639312
$$ packed form
53358B551582o5777o4523o2518o0528n8888n7547n6591n6258n6548n7071n7263
53347A898070n6587n4796n2188m9392m6841m4569m2447m0220l7396l3719k9860
53336A410055k6966k5223k3522k1013j8405j7017j6982j7139j6583j5522j4540
53325A197143j3715j2783j1767j0979j0478r855q594o616m368k405q77M55J788
53312A106949L027L986M672N341O413Q260J0813J3423J5482J7257J9574K2504
53300A237701K4940K5981K6224K7048K8851L0744L1875L2280L2275L1769L0612
53289A560300K9110K7658K6187K4430K2524K0855J9423J7788J5648J3046R975
53278A786944O270K082j984n442q407j1245j4050j6766j9590k2789k6247k9464
$$ plain form
53266 1639312 1607298 1573557 1538897 1503793 1468046 1431115 1393085 1355068 1318304 1283114 1249098
53255 1249098 1216047 1184122 1153239 1122908 1092746 1062686 1032617 1002313 971813 941432 911252
53244 911252 881044 850838 821184 792740 766025 741654 720218 701684 685390 670847 658018
53233 658018 646591 635723 625020 615065 606340 598113 589158 579142 568531 557456 545598 533066
53221 533066 520462 508000 495318 482318 469573 457745 447134 437840 429747 422231 414599 407016
53209 407016 400342 394765 389176 382331 374159 365567 357439 350134 343533 337158 330567 323959 317976 312585
53195 312585 306737 299725 292440 286583 282833 280440 278397 276222 273617 270265 266369 262824 260360 258782
53181 258782 257338 255599 253661 251724 249826 247950 246110 244340 242794 241833 241767 242493 243529 244422 244959 245047
$$ packed form
53266A639312l2014l3741l4660l5104l5747l6931l8030l8017l6764l5190l4016
53255A249098l3051l1925l0883l0331l0162l0060l0069l0304l0500l0381l0180
53244I11252l0208l0206k9654k8444k6715k4371k1436j8534j6294j4543j2829
53233F58018j1427j0868j0703r955q725q227q955j0016j0611j1075j1858j2532
53221E33066j2604j2462j2682j3000j2745j1828j0611r294q093p516p632p583
53209D07016o674n577n589o845q172q592q128p305o601o375o591o608n983n391
53195C12585n848p012p285n857l750k393k043k175k605l352l896l545k464j578
53181B58782j444j739j938j937j898j876j840j770j546r61o6P26J036Q93N37Q8
$$ plain form
53165 245047 244636 243865 242985 241999 240551 238436 236019 233885 232197 230735 229494 228805 228828 229310 229930 230515 230811
53148 230811 230525 229843 229469 229780 230292 230356 230036 229768 229485 228734 227561 226607 226304 226477 226781 226987 226824 226107 225163
53129 225163 224612 224560 224528 224300 224223 224392 224224 223354 222450 222436 223235 223900 223896 223589 223470 223499 223450 223470 223937 224898 225866 226190
53107 226190 225575 224284 222879 221748 220820 219748 218323 216721 215354 214432 213686 212646 211306 210282 210081
53092 210081 210324 210002 208511 206173 203806 202090 201299 201201 201166 200738 200197 200234 201054 202248 203499 204843 206048
53075 206048 206490 206027 205426 205421 205785 205876 205638 205456 205379 205143 204816 204716 204814 204789 204664 204830 205442 206239 206943 207398 207439
53054 207439 207181 207346 208686 210987 213202 214645 215498 216050 216127 215530 214464 213135 211354 208957 206300 203988
53038 203988 202348 201353 200733 199973 198652 197108 196362 196933 198075 198662 198530 198370 198529 198570 198083 197305 196751 196708
$$ packed form
53165B45047m11p71q80r86j448k115k417k134j688j462j241o89K3M82O20N85K96
53148B30811k86o82l74L11N12O4l20k68k83p51j173r54l03J73L04K06j63p17r44
53129B25163n51n2l2k28p7J69j68q70r04j4P99O65ml07j19K9m9K0M67R61R68L24
53107B26190o15j291j405j131r28j072j425j602j367r22p46j040j340j024k01
53092B10081K43l22j491k338k367j716p91r8l5m28n41L7Q20J194J251J344J205
53075B06048M42m63o01nL64R1k38j82p7k36l27j00R8k5j25J66O12P97P04M55M1
53054B07439k58J65J340K301K215J443Q53N52P7n97j066j329j781k397k657k312
53038B03988j640r95o20p60j321j544p46N71J142N87j32j60J59M1m87p78n54m3
$$ plain form
53020 196708 197273 198492 200066 201210 201178 199967 198346 197235 197112 197864 198960 199745 199793 199141 198233 197634 197733
53003 197733 198567 199823 200993 201664 201723 201375 200974 200883 201392 202563 204006 204913 204614 203277 201877 201286 201441
52986 201441 201585 201253 200696 200352 200251 200206 200314 200864 201858 202979 204097 205426 207106 208884 210415 211628 212620
52969 212620 213435 214238 215467 217342 219271 220212 219798 218800 218317 218783 219884 221083 221943 222242 222143 222073 222055 221344
52951 221344 219198 215948 212815 210579 208895 207037 204870 202827 201258 200231 199821 200231 201517 203253 204509
52936 204509 204378 202770 200627 198993 197868 196431 194433 192799 192549 193598 194989 195899 195976 195171 193912 193217
52920 193217 193870 195491 196923 197511 197461 197035 196160 195041 194399 194635 195149 195010 194088 193132 192853 193228 193640 193442
52902 193442 192432 190970 189727 189252 189709 190887 192284 193325 193778 193990 194479 195311 196134 196784 197450 198154 198488
$$ packed form
53020A96708N65J219J574J144l2j211j621j111j23P52J096P85M8o52r08n99R9
53003A97733Q34J256J170O71N9l48m01r1N09J171J443R07k99j337j400n91J55
52986B01441J44l32n57l44j01m5J08N50R94J121J118J329J680J778J531J213R92
52969B12620Q15Q03J229J875J929R41m14r98m83M66J101J199Q60K99r9p0j8p11
52951B21344k146l250l133k236j684j858k167k043j569j027m10M10J286J736J256
52936B04509j31j608k143j634j125j437j998j634k50J049J391R10P7q05j259o95
52920A93217O53J621J432N88n0m26q75j119o42K36N14j39r22r56k79L75M12j98
52902A93442j010j462j243m75M57J178J397J041M53K12M89Q32Q23O50O66P04L34
$$ plain form
52885 198488 198091 197104 195955 194947 194302 194274 194904 195801 196406 196369 195618 194359 193205 192960 193879 195259 196097 196057
52867 196057 195638 195608 196513 198433 200814 202703 203570 203789 203908 203654 202237 199638 196961 195304 194736 194658 194625
52850 194625 194447 193803 192320 190079 187707 185842 184601 183653 182778 182300 182772 184113 185234 184953 183263 181320
52834 181320 180099 179513 179098 178987 179593 180600 180992 180198 178716 177372 176342 175162 173441 171274 169081 167331
52818 167331 166411 166478 167337 168543 169692 170651 171528 172539 173891 175706 177944 180397 182815 185086 187224 189124
52802 189124 190395 190630 189903 188841 188066 187613 186995 185793 184067 182236 180731 179755 179261 179067 179015 178992 178815
52785 178815 178259 177323 176359 175752 175515 175396 175306 175421 175891 176649 177501 178153 178220 177587 176755 176446 176728 176854 176160
52766 176160 174761 173260 172183 171921 172721 174226 175389 175421 174656 174049 174035 174366 174828 175416 175874 175771 175213 174905
$$ packed form
52885A98488l97r87j149j008o45k8O30Q97O05l7p51j259j154k45R19J380Q38m0
52867A96057m19l0R05J920K381J889Q67K19J19k54j417k599k677j657n68p8l3
52850A94625j78o44j483k241k372j865j241r48q75m78M72J341J121k81j690j943
52834A81320j221n86m15j11O06J007L92p94j482j344j030j180j721k167k193j750
52818A67331r20O7Q59J206J149R59Q77J011J352J815K238K453K418K271K138J900
52802A89124J271K35p27j062p75m53o18j202j726j831j505r76m94j94n2k3j77
52785A78815n56r36r64o07k37j19r0J15M70P58Q52O52O7o33q32l09K82J26o94
52766A76160j399j501j077k62Q00J505J163L2p65o07j4L31M62N88M58j03n58l08
$$ plain form
52748 174905 175315 176265 177540 179333 181762 184376 186518 187925 188753 189342 190171 191669 193764 195913 197790
52733 197790 199605 201524 203222 204391 205271 206174 206811 206604 205460 203756 201792 199796 198301 197801 197921 197514
52717 197514 195817 193220 190735 189023 188065 187505 187034 186523 186009 185614 185554 186074 187155 188225 188530 187989 187333
52700 187333 187136 187075 186575 185860 185772 186723 188432 190597 193174 195883 198115 199563 200530 201381 202056 202347 202283 201979
52682 201979 201412 200597 199752 199041 198334 197425 196370 195452 194914 194833 195130 195617 196075 196350 196396 196305 196347 196736 197230 197256
52662 197256 196753 196572 197571 199539 201599 203500 205819 208859 212018 214416 215626 215637 214589 212766 210451
52647 210451 207726 204863 202756 202228 202817 203090 202426 201647 201544 201682 201259 200362 199642 199363 199537 200443 202133
52630 202133 203819 204618 204665 204775 205238 205741 206223 206937 207746 208211 208392 208831 209647 210364 210685 210760 210584 209837 208537
$$ packed form
52748A74905M10R50J275J793K429K614K142J407Q28N89Q29J498K095K149J877
52733A97790J815J919J698J169Q80R03O37k07j144j704j964j996j495n00J20m07
52717A97514j697k597k485j712r58n60m71n11n14l95o0N20J081J070L05n41o56
52700A87333j97o1n00p15q8R51J709K165K577K709K232J448R67Q51O75K91o4l04
52682B01979n67q15q45p11p07r09j055r18n38q1K97M87M58K75M6r1M2L89M94K6
52662A97256n03j81R99J968K060J901K319L040L159K398J210J1j048j823k315
52647B10451k725k863k107n28N89K73o64p79j03J38m23q97p20k79J74R06J690
52630B02133J686P99M7J10M63N03M82P14Q09M65J81M39Q16P17L21P5j76p47j300
$$ plain form
52611 208537 207268 206498 206166 206109 206406 207112 208106 209376 211012 212785 214185 215074 215823 216715 217620 218428 219296
52594 219296 220272 221107 221676 222157 222614 222823 222717 222534 222386 222145 221926 222056 222299 221807 220255 218448 217261 216565
52576 216565 215859 215364 215625 216292 216287 215209 213782 212774 212165 211646 211358 211679 212555 213418 213710 213348 212686 212091
52558 212091 211532 210728 209716 209021 208997 209265 209209 208899 209038 210010 211466 212906 214166 215122 215367 214655 213434 212587
52540 212587 212629 213341 214060 214213 213673 212868 212462 212697 213033 212643 211315 209703 208599 208124 207789 207194 206440 205795
52522 205795 205264 204726 204334 204450 205126 205886 206197 206062 206090 207054 209340 212573 215692 217678 218449 218918 220039
52505 220039 221963 224241 226509 228639 230470 231813 232631 232846 232096 230145 227470 224954 222949 221131 219333
52490 219333 217964 217358 217219 217044 216662 216080 215246 214381 214113 214757 215843 216894 218263 220408 222591 223352 222449
$$ packed form
52611B08537j269p70l32n7K97P06R94J270J636J773J400Q89P49Q92R05Q08Q68
52594B19296R76Q35N69M81M57K09j06j83j48k41k19J30K43m92j552j807j187o96
52576B16565p06m95K61O67nj078j427j008o09n19k88L21Q76Q63K92l62o62n95
52558B12091n59q04j012o95k4K68n6l10J39R72J456J440J260R56K45p12j221q47
52540B12587M2P12P19J53n40q05m06K35L36l90j328j612j104m75l35n95p54o45
52522B05795n31n38l92J16O76P60L11j35K8R64K286L233L119J986P71M69J121
52505B20039J924K278K268K130J831J343Q18K15p50j951k675k516k005j818j798
52490B19333j369o06j39j75l82n82q34q65k68O44J086J051J369K145K183P61r03
$$ plain form
52473 222449 221424 221848 223690 225882 227799 229488 230868 231594 231691 231715 232193 233244 234804 236834 239265 241963
52457 241963 244738 247167 248554 248464 247257 245742 244350 242948 241392 239753 237946 235699 233079 230664 228935
52442 228935 227836 227088 226529 225912 224839 223372 222324 222422 223334 224022 223950 223528 223413 223816 224575 225497 226501 227652
52424 227652 229084 230750 232278 233340 234079 234870 235861 237166 239455 243705 250141 257922 266210 275069 284895
52409 284895 295199 304448 311020 314025 313374 309559 303419 295826 287447 278942 271230 265156 260850 257756
52395 257756 255443 254092 253949 254594 255136 255066 254641 254460 254923 256118 257947 260164 262483 264814 267319 270157
52379 270157 273247 276362 279315 281951 284148 286076 288310 291356 295112 299069 303048 307353 312194 317335
52365 317335 322453 327424 332012 335722 338387 340598 343066 345712 347937 349752 352111 355982 361451 367910
$$ packed form
52473B22449j025M24J842K192J917J689J380P26R7K4M78J051J560K030K431K698
52457B41963K775K429J387r0j207j515j392j402j556j639j807k247k620k415j729
52442B28935j099p48n59o17j073j467j048R8R12O88p2m22j15M03P59R22J004J151
52424B27652J432J666J528J062P39P91R91J305K289M250O436P781Q288Q859R826
52409B84895J0304R249O572L005o51l815o140p593q379q505p712o074m306l094
52395B57756k313j351j43O45N42p0m25j81M63J195J829K217K319K331K505K838
52379B70157L090L115K953K636K197J928K234L046L756L957L979M305M841N141
52365C17335N118M971M588L710K665K211K468K646K225J815K359L871N469O459
$$ plain form
52351 367910 374798 382011 389872 398905 409443 421251 433694 446350 459345 473000 487455 502837
52339 502837 519510 537741 557188 577024 596725 616489 636741 657359 677673 697254 716382
52328 716382 735465 754212 771869 788337 804485 821039 837556 852864 866203 877416 886347 892787
52316 892787 896966 899349 899859 897986 893903 888768 883535 878006 871533 864118 856296 848345 840305 832537
52302 832537 825609 819730 814864 811331 809662 809798 811053 813128 816663 822403 830087 838577 846975 855330
52288 855330 864236 874076 884832 896480 909230 923175 937868 952583 966990 981294 995516 1008956
52276 1008956 1020670 1030337 1038429 1045558 1051849 1056853 1059894 1060532 1058805 1054988 1049185 1041398 1032011 1021748
52262 1021748 1010952 999332 986774 973943 961593 949629 937571 925685 914838 905255 896264 887514
$$ packed form
52351C67910O888P213P861R033J0538J1808J2443J2656J2995J3655J4455J5382
52339E02837J6673J8231J9447J9836J9701J9764K0252K0618K0314J9581J9128
52328G16382J9083J8747J7657J6468J6148J6554J6517J5308J3339J1213Q931O440
52316H92787M179K383N10j873m083n135n233n529o473p415p822p951q040p768
52302H32537o928n879m866l533j669J36J255K075L535N740P684Q490Q398Q355
52288H55330Q906R840J0756J1648J2750J3945J4693J4715J4407J4304J4222J3440
52276A008956J1714R667Q092P129O291N004L041O38j727l817n803p787r387j0263
52262A021748j0796j1620j2558j2831j2350j1964j2058j1886j0847r583q991q750
$$ plain form
52250 887514 879682 873599 869220 865941 863476 861879 860957 860130 858864 857007 854879 853226 852773 853552 854918
52235 854918 856474 858582 861622 865190 868618 872053 876231 881198 885977 889689 892463 894982 897703 900906
52221 900906 905061 910565 917232 924494 932019 939869 948107 956542 964788 972313 978531 983228 986855 990057
52207 990057 992947 995231 997080 999268 1002183 1005173 1007330 1008565 1009413 1010001 1009887 1008949 1007803 1007055 1006512 1005413
52191 1005413 1003239 1000136 996813 994201 992962 993067 993891 994762 995247 994920 993327 990541 987434 985059 983759
52176 983759 983041 982027 979837 975948 970762 965700 962249 960766 960465 960459 960421 960391 960533 961307 963470 967524 973263
52159 973263 979973 986994 994080 1001369 1009040 1016864 1024220 1030801 1037206 1044402 1052619 1061154 1069381 1077547
52145 1077547 1086420 1096549 1108109 1121058 1135020 1149212 1162907 1175978 1188802 1201709 1214746
$$ packed form
52250H87514p832o083m379l279k465j597r22q27j266j857k128j653m53P79J366
52235H54918J556K108L040L568L428L435M178M967M779L712K774K519K721L203
52221I00906M155N504O667P262P525P850Q238Q435Q246P525O218M697L627L202
52207I90057K890K284J849K188K915K990K157J235Q48N88j14r38j146p48n43j099
52191A005413k174l103l323k612j239J05Q24Q71M85l27j593k786l107k375j300
52176I83759p18j014k190l889n186n062l451j483l01ol8l0J42P74K163M054N739
52159I73263O710P021P086P289P671P824P356O581O405P196Q217Q535Q227Q166
52145A077547Q873J0129J1560J2949J3962J4192J3695J3071J2824J2907J3037
$$ plain form
52134 1214746 1227873 1241105 1254378 1267487 1280240 1292661 1304994 1317524 1330323 1343139 1355513
52123 1355513 1367033 1377547 1387206 1396310 1404901 1412426 1418009 1421193 1422297 1421914 1420334 1417621 1413847 1408805
52109 1408805 1401871 1392777 1382340 1371776 1361392 1350717 1339879 1329984 1321935 1315732 1311318 1309265 1310106
52096 1310106 1313635 1319441 1327507 1337681 1349187 1361461 1374897 1389940 1405809 1421031 1434982 1448043
52084 1448043 1460484 1472191 1483480 1495170 1507649 1520618 1533838 1547254 1560171 1571237 1579728
52073 1579728 1586202 1591415 1595141 1596541 1595172 1591133 1584568 1575534 1564123 1550311 1533926 1515079 1494417
52060 1494417 1472598 1449717 1425524 1400049 1373788 1347486 1321876 1297388 1273956 1251423 1230203
52049 1230203 1211012 1193738 1177186 1160456 1144082 1129182 1115905 1103458 1091462 1080406 1070738
$$ packed form
52134A214746J3127J3232J3273J3109J2753J2421J2333J2530J2799J2816J2374
52123A355513J1520J0514R659R104Q591P525N583L184J104l83j580k713l774n042
52109A408805o934r094j0437j0564j0384j0675j0838r895q049o203m414k053Q41
52096A310106L529N806Q066J0174J1506J2274J3436J5043J5869J5222J3951J3061
52084A448043J2441J1707J1289J1690J2479J2969J3220J3416J2917J1066Q491
52073A579728O474N213L726J400j369m039o565r034j1411j3812j6385j8847k0662
52060A494417k1819k2881k4193k5475k6261k6302k5610k4488k3432k2533k1220
52049A230203j9191j7274j6552j6730j6374j4900j3277j2447j1996j1056r668
$$ plain form
52038 1070738 1062328 1055094 1049521 1046076 1044453 1043790 1043483 1043537 1044242 1045731 1047766 1049778 1051101 1051287 1050148
52023 1050148 1047511 1043002 1036185 1026935 1015711 1003477 991286 979784 968975 958316 946958 934001
52011 934001 918866 901658 883104 864001 844777 825562 806540 788074 770572 754249 738864
$$ packed form
52038A070738q410p234n573l445j623o63l07N4P05J489K035K012J323J86j139
52023A050148k637m509o817r250j1224j2234j2191j1502j0809j0659j1358j2957
52011I34001j5135j7208j8554j9103j9224j9215j9022j8466j7502j6323j5385
$$ [...]
##END NTUPLES=NMR SPECTRUM
##END=
