
##TITLE=AC1368_2392_7221419_SvWENlBDkv
##JCAMPDX= 6.0         $$ Bruker NMR JCAMP-DX V2.0
##DATA TYPE= NMR SPECTRUM
##DATA CLASS= NTUPLES
##ORIGIN= BRUKER
##OWNER= Administrator
$$ 1.72 TOPSPIN		Version 2.1
$$ 2012-12-14 01:22:32.599 -0500  Administrator@X
$$ Compression mode = diff/dup
##.OBSERVE FREQUENCY= 400.02188249412
##.OBSERVE NUCLEUS= ^1H
##.ACQUISITION MODE= SIMULTANEOUS (DQD)
##.ACQUISITION SCHEME= undefined
##.AVERAGES= 8
##.DIGITISER RES= 22
##SPECTROMETER/DATA SYSTEM= spect
##.PULSE SEQUENCE= zg30
##.SOLVENT NAME= COFFEE_meoh
##.SHIFT REFERENCE= INTERNAL, COFFEE_meoh, 1, 14.98509
##AUDIT TRAIL= $$ (NUMBER, WHEN, WHO, WHERE, PROCESS, VERSION, WHAT)
$$ ##TITLE= Audit trail, TOPSPIN		Version 2.1
$$ ##JCAMPDX= 5.01
$$ ##ORIGIN= Bruker BioSpin GmbH
$$ ##OWNER= Administrator
$$ $$ E:\/data/COFFEE/nmr/AC1368_2392_7221419_SvWENlBDkv/20/pdata/1/auditp.txt
$$ ##AUDIT TRAIL=  $$ (NUMBER, WHEN, WHO, WHERE, PROCESS, VERSION, WHAT)
(   1,<2012-12-14 01:22:24.678 -0500>,<Administrator>,<X>,<go>,<TOPSPIN 2.1>,
      <created by zg
	started at 2012-12-14 01:21:18.521 -0500,
	POWCHK enabled, PULCHK disabled,
       configuration hash MD5:
       86 BA 57 50 F2 9D 5C 9B 26 00 A9 28 5F 66 2E 89
       data hash MD5: 64K
       47 65 FD 06 C9 D9 62 34 1A A3 6D CC F9 64 43 AD>)
(   2,<2012-12-14 01:22:27.662 -0500>,<Administrator>,<X>,<proc1d>,<TOPSPIN 2.1>,
      <Start of raw data processing
       efp LB = 0 FT_mod = 6 PKNL = 1 PHC0 = 0 PHC1 = 0 SI = 32K 
       data hash MD5: 32K
       0C 43 5C 09 B6 7A BE 57 4F B8 41 9D 5C C5 47 22>)
(   3,<2012-12-14 01:22:28.115 -0500>,<Administrator>,<X>,<proc1d>,<TOPSPIN 2.1>,
      <pk PHC0 = 101.9916 PHC1 = 0 
       data hash MD5: 32K
       BA A6 6C 9E 3F F1 D4 FD DB 18 26 08 F1 85 A5 7E>)
(   4,<2012-12-14 01:22:28.349 -0500>,<Administrator>,<X>,<proc1d>,<TOPSPIN 2.1>,
      <abs ABSG = 1 
       data hash MD5: 32K
       82 E4 1F 03 4C 5A 32 65 7F AF 4C FF 37 38 D5 CA>)
(   5,<2012-12-14 01:22:28.490 -0500>,<Administrator>,<X>,<proc1d>,<TOPSPIN 2.1>,
      <abs ABSG = 2 
       data hash MD5: 32K
       AB B4 7E 52 64 FB 73 E7 AE 35 AF 03 14 F1 0D EA>)
(   6,<2012-12-14 01:22:28.631 -0500>,<Administrator>,<X>,<proc1d>,<TOPSPIN 2.1>,
      <abs ABSG = 3 
       data hash MD5: 32K
       D6 10 AE 1B 17 12 6E D4 F2 15 A9 53 DB E8 09 1F>)
(   7,<2012-12-14 01:22:28.771 -0500>,<Administrator>,<X>,<proc1d>,<TOPSPIN 2.1>,
      <abs ABSG = 4 
       data hash MD5: 32K
       14 08 11 55 5C 2C 4E BB E2 A2 57 FA 4A B8 DF 34>)
(   8,<2012-12-14 01:22:28.912 -0500>,<Administrator>,<X>,<proc1d>,<TOPSPIN 2.1>,
      <abs ABSG = 5 
       data hash MD5: 32K
       B6 40 0C 7A BF B8 D9 98 57 E9 E2 2D 27 5E 30 BD>)
$$ ##END=
$$ 
$$ $$ hash MD5
$$ $$ 79 27 40 F0 64 55 9F C1 53 D2 94 F6 D6 A2 F0 BF
##$RELAX= 
##$RELAX= 
##$RELAX= 
##$RELAX= 
##$RELAX= 
##$RELAX= 
##$RELAX= 
##$RELAX= 
$$ Bruker specific parameters
$$ --------------------------
##$DU= <E:\>
##$EXPNO= 20
##$NAME= <AC1368_2392_7221419_SvWENlBDkv>
$$ [...]
150 150 150 150 150 150 150 150
##$TP07= 0
##$TPNAME0= <>
##$TPNAME1= <>
##$TPNAME2= <>
##$TPNAME3= <>
##$TPNAME4= <>
##$TPNAME5= <>
##$TPNAME6= <>
##$TPNAME7= <>
##$TPOAL= (0..7)
0.5 0.5 0.5 0.5 0.5 0.5 0.5 0.5
##$TPOFFS= (0..7)
0 0 0 0 0 0 0 0
##$TUNHIN= 0
##$TUNHOUT= 0
##$TUNXOUT= 0
##$USERA1= <user>
##$USERA2= <user>
##$USERA3= <user>
##$USERA4= <user>
##$USERA5= <user>
##$V9= 5
##$VALIST= <valist>
##$VCLIST= <CCCCCCCCCCCCCCC>
##$VD= 0
##$VDLIST= <DDDDDDDDDDDDDDD>
##$VPLIST= <PPPPPPPPPPPPPPP>
##$VTLIST= <TTTTTTTTTTTTTTT>
##$WBST= 1024
##$WBSW= 4
##$XGAIN= (0..3)
0 0 0 0
##$XL= 0
##$YL= 0
##$YMAX_a= 617267
##$YMIN_a= -528710
##$ZGOPTNS= <>
##$ZL1= 120
##$ZL2= 120
##$ZL3= 120
##$ZL4= 120
##$ABSF1= 14.98509
##$ABSF2= -5.573092
##$ABSG= 5
##$ABSL= 3
##$ALPHA= 0
##$AQORDER= 0
##$ASSFAC= 0
##$ASSFACI= 0
##$ASSFACX= 0
##$ASSWID= 0
##$AUNMP= <proc_prof1d_extract_pilot.lims>
##$AXLEFT= 0
##$AXNAME= <>
##$AXNUC= <1H>
##$AXRIGHT= 0
##$AXTYPE= 0
##$AXUNIT= <>
##$AZFE= 0.1
##$AZFW= 0.1
##$BCFW= 0
##$BC_mod= 0
##$BYTORDP= 0
##$COROFFS= 0
##$CY= 15
##$DATMOD= 1
##$DC= 0
##$DFILT= <>
##$DTYPP= 0
##$F1P= 0
##$F2P= 0
##$FCOR= 0.5
##$FTSIZE= 32768
##$FT_mod= 6
##$GAMMA= 0
##$GB= 0
##$INTBC= 1
##$INTSCL= 1
##$ISEN= 128
##$LB= 0
##$LEV0= 0
##$LPBIN= 0
##$MAXI= 10000
##$MC2= 0
##$MEAN= 0
##$ME_mod= 0
##$MI= 0
##$NCOEF= 0
##$NC_proc= -8
##$NLEV= 6
##$NOISF1= 0
##$NOISF2= 0
##$NSP= 0
##$NTH_PI= 0
##$NZP= 0
##$OFFSET= 14.98509
##$PC= 1
##$PHC0= 101.9916
##$PHC1= 0
##$PH_mod= 1
##$PKNL= yes
##$PPARMOD= 0
##$PPDIAG= 0
##$PPIPTYP= 0
##$PPMPNUM= 2147483647
##$PPRESOL= 1
##$PSCAL= 4
##$PSIGN= 0
##$PYNMP= <proc.py>
##$REVERSE= no
##$SF= 400.02
##$SI= 32768
##$SIGF1= 0
##$SIGF2= 0
##$SINO= 400
##$SIOLD= 32768
##$SPECTYP= <>
##$SREGLST= <1H.CDCl3>
##$SSB= 0
##$STSI= 32768
##$STSR= 0
##$SW_p= 8223.68421052631
##$SYMM= 0
##$S_DEV= 0
##$TDeff= 65536
##$TDoff= 0
##$TI= <>
##$TILT= no
##$TM1= 0
##$TM2= 0
##$TOPLEV= 0
##$USERP1= <user>
##$USERP2= <user>
##$USERP3= <user>
##$USERP4= <user>
##$USERP5= <user>
##$WDW= 1
##$XDIM= 32768
##$YMAX_p= 469028270
##$YMIN_p= -729719
##$CURPLOT= <Network HP LaserJet P1505>
##$CURPRIN= <$Network HP LaserJet P1505>
##$DFORMAT= <normdp>
##$LAYOUT= <+/1D_H.xwp>
##$LFORMAT= <normlp>
##$PFORMAT= <normpl>
##$SURQMSG= 1
$$ End of Bruker specific parameters
$$ ---------------------------------
##NTUPLES= NMR SPECTRUM
##VAR_NAME=  FREQUENCY,     SPECTRUM/REAL,   SPECTRUM/IMAG
##SYMBOL=    X,             R,               I
##VAR_TYPE=  INDEPENDENT,   DEPENDENT,       DEPENDENT
##VAR_FORM=  AFFN,          ASDF,            ASDF
##VAR_DIM=   32768,         32768,           32768
##UNITS=     HZ,            ARBITRARY UNITS, ARBITRARY UNITS
##FACTOR=    0.250966925370066, 1,           1
##FIRST=     8223.43324360094, -33329,       -294816
##LAST=      0,             -31363,          -228523
##MIN=       0,             -729719,         0
##MAX=       8223.43324360094, 469028270,    0
$$ Real data points
##PAGE= N=1
##DATA TABLE= (X++(R..R)), XYDATA
$$ [...]
19564B34841I1376l5308b20430P9719I1502b71593J7295J16769q941A28202Q8764
19553B16966j9021g5631A61793a54408H122a002j27160r1759F6080f7569i055
19541B7934a34551j06510h1953A13824c61860H1162b8652A43706d35978a08338
19530B5223J60734a86579j52440c2207q1535p9636n2108j14125A03847a16843
19519A6404a34319C6852c23391a52009j29504a15444A6168b06342g549A86433
19508b10231P3657D1329K03669A13770b27738R0277M2260A0040f2592j94681A32859
19496A30117b37534d0714j39168Q6109j02319r3390O9417B9249J01685P0385i1928
19484c3732C3001b2810H7687b8845k84207p5334a33197f0110B32243h5227D16968
$$ y = [234841, 91376, 56068, -220430, -140711, 91502, -271593, -254298, -137529, -146470, 128202, 216966, 197945, -75631, 161793, -154408, 8122, -1002, -128162, -219921, 66080, -67569, -9055, 27934, -134551, -241061, -81953, 113824, -361860, 81162, -28652, 143706, -435978, -108338, 25223, 185957, -186579, -339019, -32207, -113742, -193378, -245486, -359611, 103847, -116843, 16404, -134319, 36852, -323391, -152009, -281513, -115444, 16168, -206342, -7549, 186433, -210231, -136574, 41329, 244998, 113770, -227738, -137461, -95201, 10040, -62592, -257273, 132859, 130117, -237534, -40714, -179882, -93773, -196092, -289482, -220065, 29249, 130934, 201319, -91928, -33732, 33001, -22810, 87687, -28845, -313052, -388386, -133197, -60110, 232243, -85227, 416968]
19472a60116j03118B8376b39989M4176g3132L3328q4058o059B8364a36181A2709
19460i1833H9906d580I16a61546H1365J65325D2491K48944B6085K74042e2485
19448B6141a19387N835j26096B91383d0182m3445A67385b56539A81975b30958
19437h2962r9757H091a96931F7178h8128F5450b25967I7481k4656J23694h8083
19425a69022R39b7014H0239e0607j43693d0879l79945h7276E1875b47886b3099
19413b14567O6677c4931j95299N3631h5883e553A88773d17058g5584b1751k874
19402b4625F0044D500a60540j93693G9507b6434B38348A2834a92952j32078A49708
19390B29767q9000a57216i169p1821j82150L5691f8744A04631d4292r5506B19002
$$ y = [-160116, -263234, 28376, -239989, -195813, -73132, -39804, -123862, -129921, 28364, -136181, 12709, -91833, 89906, -4580, 916, -161546, 81365, 246690, 42491, 291435, 26085, 300127, -52485, 26141, -119387, -113552, -239648, 291383, -40182, -83627, 167385, -256539, 181975, -230958, -82962, -182719, 8091, -196931, 67178, -88128, 65450, -225967, 97481, 72825, 196519, -88083, -169022, -168083, -27014, 80239, -50607, -194300, -40879, -420824, -87276, 51875, -247886, -23099, -214567, -147890, -34931, -230230, -176599, -85883, -5553, 188773, -417058, -75584, -21751, -24625, 60044, 4500, -160540, -354233, 79507, -26434, 238348, 12834, -192952, -325030, 149708, 229767, 140767, -157216, -9169, -80990, -263140, -227449, -68744, 104631, -44292, -139798, 219002]
19378a72265A95846b13287A7495b43367F1345c26647N6560r8427A33467N7390
19368A90857a13151A17315a27224b2105l22712F6939i3669m7052A05482a98508
19357g3041B66811b30211A68216Q8487B7220M7944a22749j29236d4490A02292
19346A72586a70217L5732k7537A77824a36784q6200f4376j20537n6737l1929O8229
19335b05350k65189a73146J3390E9803g2331j12942A08794g4548C3761a30142
19324e0699j6871A37699k1498c0105E6793c94590a09548J7347A1873d8692F5906
19312b55863B87020a79171A43367n4768a5045p9626K6191A76772J76168d2084
19301a82188D7238J12990g3656A35786b58660j9276M8082A08892d8580m72800
$$ y = [-172265, 195846, -213287, 17495, -243367, 61345, -326647, -270087, -368514, 133467, 190857, -113151, 117315, -127224, -22105, -344817, 66939, -93669, -140721, 105482, -198508, -73041, 266811, -230211, 168216, 256703, 27220, 75164, -122749, -251985, -44490, 102292, 172586, -170217, -134485, -162022, 177824, -136784, -222984, -64376, -184913, -241650, -273579, -205350, -470539, -173146, -159756, 59803, -72331, -185273, 108794, -74548, 33761, -130142, -50699, -67570, 137699, 116201, -30105, 56793, -394590, -109548, -92201, 11873, -48692, 65906, -255863, 287020, -179171, 143367, 88599, -15045, -94671, -68480, 176772, 352940, -42084, -182188, 47238, 160228, -73656, 135786, -258660, -277936, -229854, 108892, -48580, -521380]
19291e21380A61950a23022p3037A55027J08994i7514A70941A7789a16247q938
19281a25185A60167m2285J26310C6549c57660A651a84744C1469K12400J05099
19271C48968a63665B4650m22c5289J0803r9652j26684i8369C7435N3507h0402
19259b42126o0863J19214E1234j0292d12511D745c78001R4940h0918r7373G482
19247a71279I8058j5679f29446B89532B4719b81694a8394l25636C1449b15385
19236a69225j79381D738e0308p9984b3677k37493d2122j8861o6701H9385k6203
19225F3182a88246A03895a98155K1401A08007c77131b8038k0504q2394G1529K0986
19214I2515d73500f1417o0785E5978J57216h1626I4098b35947j52394D4268a99477
$$ y = [-521380, 161950, -123022, -196059, 155027, 264021, -97514, 170941, 17789, -116247, -125185, 160167, 117882, 244192, 36549, -357660, 1651, -184744, 31469, 243869, 348968, -163665, 24650, 24228, -35289, -24486, -124138, -250822, -98369, 37435, 90942, -80402, -242126, -302989, -183775, 51234, 40942, -412511, 4745, -378001, -283061, -80918, -178291, 7482, -171279, 98058, 82379, -629446, 289532, 24719, -281694, -18394, -344030, 31449, -215385, -169225, -348606, 4738, -50308, -130292, -23677, -261170, -42122, -60983, -127684, 89385, 63182, -188246, 103895, -198155, -176754, 108007, -377131, -28038, -48542, -130936, 71529, 92515, -473500, -61417, -122202, 55978, 213194, -81626, 94098, -235947, -388341, 44268, -199477]
19202b2795A76570A1397g0107A7663a65111k27226Q5391J9003I0009C6058a55062
19190C39901p8475B4580c6867j65881k03747H3868L12128A4497J47497A1104N6757
19179F7861j7900b01059G43J45001a86018A02675a03653a724A14835c64866D1829
19167d9785B03497a09346A50808D3403J11126o7225a34133O6836F3580a78780
19156a47090n3900c5885o2676r5736O8766j38647A88793a13928F9473a15894E2903
19144a09739B59228B2947J7158c5233B61772g6872E3707a00708A54392b91095
19133e02930B03191c6921p083k64010m3484B64811A6578J42693i3914k60432J33661
19122b20685A4846J38251J0074m1037a22963A55545k4622a21803p3774F4325K34867
$$ y = [-22795, 176570, 11397, -70107, 17663, -165111, -392337, -306946, -287943, 90009, 36058, -155062, 339901, 261426, 24580, -36867, -202748, -406495, 83868, 395996, 14497, 161994, 11104, 67861, 49961, -201059, 743, 145744, -186018, 102675, -103653, -1724, 114835, -364866, 41829, -49785, 203497, -109346, 150808, 43403, 154529, 87304, -134133, -67297, 63580, -178780, -147090, -200990, -35885, -98561, -194297, -125531, -264178, 188793, -113928, 69473, -115894, 52903, -109739, 259228, 22947, 40105, -35233, 261772, -76872, 53707, -100708, 154392, -291095, -502930, 203191, -36921, -44004, -308014, -351498, 264811, 16578, 159271, -93914, -354346, -220685, 14846, 153097, 163171, 122134, -122963, 155545, 130923, -121803, -195577, 64325, 299192]
19111B99192h2114n0226c2623j56300k76311A8612Q7753a29337M8754A50696o4473
19100H6223b25010d0447l57384J23135A43523a80503H3379a78701A43481b1317
19089F2135a87730d5942j92782a05766C3242a62527k318a1312j40209A42358b45553
19077A09124J15699d81954b07447j68099A19034c60605q7133c4167B23413e6727
19066b4844l06980E8348L08471c8341A33029g8740J7747G9585e7181j14084L0057
19055a41208A22746n3539N0181B8771j643N2649b96007J41458r2606B9837b5720
19043A16507a98416c4065j59863E8112a18862a6258m1416K1917A7067L81930A33362
19031a21764A20944h2172I3198B4239K43775O9931e9621A723c5125F9019g6602
$$ y = [299192, -82114, -132340, -32623, -188923, -465234, 18612, 106365, -129337, -80583, 150696, 86223, -225010, -40447, -397831, -274696, 143523, -180503, 83379, -178701, 143481, -21317, 62135, -187730, -45942, -238724, -105766, 33242, -162527, -164845, -11312, -151521, 142358, -245553, 109124, 224823, -481954, -207447, -375546, 119034, -360605, -447738, -34167, 223413, -56727, -24844, -331824, 58348, 366819, -38341, 133029, -78740, -60993, 79585, -57181, -171265, -141208, 122746, 69207, 119388, 28771, 27128, 79777, -296007, -154549, -247155, 29837, -25720, 116507, -198416, -34065, -193928, 58112, -118862, -16258, -57674, -35757, 17067, 398997, 133362, -121764, 120944, -82172, 93198, 24239, 268014, 337945, -59621, 1723, -35125, 69019, -76602]
19019a44650c2218l39327J40807J08772J8023j21474B89367a33653j1334A47089
19008a61732e1243A25042l9715J3013k525I096b20682i3951d2681A17690N0092
18997A67782m3720a61971B75717g6049l6178a4988A58036b9558k03110J11532
18987a21136H3759a87167j06260m9566a8316q3515a4599m9627k93835a19742N728
18976a14014I0517J00966c98381J25460J28600I4876a03245j50716K833A2568
18965b6420k0951m40487B52480b10183g7730l3437A01986c2433k23457P088d3739
18953b04195m7537A28462b26533g3026E9469b49811J2850N1146m0546d9007B71861
18941b07282g847j37147A36762a35998I1597b9748k4557p1989K0158p4352g9072
$$ y = [-144650, -32218, -371545, -230738, -121966, -103943, -225417, 289367, -133653, -144987, 147089, -161732, -51243, 125042, 85327, 98340, 95815, 9096, -220682, -93951, -42681, 117690, 167782, 124062, -161971, 275717, -76049, -112227, -14988, 158036, -29558, -232668, -121136, 83759, -187167, -293427, -342993, -18316, -101831, -14599, -64226, -358061, -119742, -114014, 90517, 191483, -398381, -272921, -144321, 94876, -103245, -253961, -251128, 12568, -26420, -47371, -487858, 252480, -210183, -77730, -111167, 101986, -32433, -255890, -248802, -43739, -204195, -251732, 128462, -226533, -73026, 59469, -249811, -236961, -185815, -226361, -49007, 271861, -207282, -7847, -144994, 136762, -135998, 91597, -29748, -54305, -126294, -106136, -180488, -79072]
18929B00817I9565f4728j6736A78825q2752c27245A52260L9325b14522l871k4165
18918b42558l1351B13534k82j3457a78922N3549A56789M5h3430b292j93553m4437
18906b40282L4409r900O8952E8324a22823N6406j14820L6683O0531b263k531B60075
18893f2502I608J59344a69244B21720a79202B07295c74338a5059l74993J91705
18883a98347J6092b4930j47868j11685B04894b22740A61195f7025m7899B17436
18872c63730J0447a81k44428O6333O5314a4087E2474a64678A99817e1684A05282
18860h6234g936k59870A48788i7347o2304A00190a37304j74166J0215a0726A57240
18848A43903E8300L549a28659c4317k45559j75783b02672B54196a79671J8975
$$ y = [200817, 99565, -64728, -81464, 178825, 96073, -327245, 152260, 191585, -214522, -218393, -242558, -273909, 213534, 213252, 199795, -178922, -125373, 156789, 156834, -83430, -2292, -195845, -240282, -205873, -215773, -146821, 58324, -122823, -66417, -181237, -144554, -84023, -2263, -4794, 260075, -62502, 9608, 168952, -169244, 221720, -179202, 207295, -374338, -15059, -390052, -198347, -182255, -24930, -172798, -284483, 204894, -222740, 161195, -67025, -114924, 217436, -363730, -353283, -181, -244609, -178276, -112962, -14087, 52474, -164678, 199817, -51684, 105282, -86234, -7936, -267806, 148788, -97347, -159651, 100190, -137304, -311470, -301255, -10726, 157240, 143903, 58300, 61849, -128659, -34317, -279876, -455659, -202672, 254196, -179671, -160696]
18838a60696D20302b8708B6388a56418B03532D8710b11472o9196d6619j32322
18828a78941A56142F0008Q0433a74409G1633a85317A1836K92078c6996H8916L8349
18817A27265b31788a9835E5451Q7701J71615F6356R0862a24129A67604C739J34015
18806A37754M5336L4989c8600E8053h9282A78207E6841a31545j0329d9029o5443
18795a14472C12880j07190h9845J0523E637a7822h65j35916M1070b0572k17483
18784b38055F8890h9110k4880j15125D67893b08283A2307a59790j40320E4639
18773c13824b0141o15242b90416h5301A43833j0615g506j3016n7991B07198l6460
18762A70738E6990a62892K1505A09989a40950k28963C1247a25815B13830i2196
$$ y = [-160696, 420302, -28708, 26388, -156418, 203532, 48710, -211472, -280668, -46619, -178941, 156142, 60008, 140441, -174409, 71633, -185317, 11836, 303914, -36996, 88916, 127265, -231788, -19835, 55451, 143152, 314767, 66356, 157218, -124129, 167604, 3739, 137754, 183090, 218079, -38600, 58053, -89282, 178207, 56841, -131545, -141874, -49029, -114472, 312880, 205690, -89845, -79322, 5637, -17822, -865, -136781, -95711, -20572, -238055, 68890, -89110, -113990, -229115, 467893, -208283, 12307, -159790, -300110, 54639, -313824, -20141, -635383, -290416, -85301, 143833, 133218, -7506, -20522, -78513, 207198, 170738, 56990, -162892, -141387, 109989, -140950, -369913, 31247, -125815, 213830, -92196]
18751B6470a57049J7978F0351L78925c52491B32459a56870g7075j99185A24336
18740C91Q3502J62191e5480o1012l44390g4237B11588c43003A59799a56414F4932
18728c38538f2718o7397B03432a53695l7805c7444j00291G905b5597k50603C55242
18716e4146j06875L4963A61166G1331d35139J65084L4903E14104D6803A474h7038
18704c16424A4018e84726f140D5124L1466a38423L3540j32361J12052A03678h9420
18692f6835E0522L0610A7988b1084j85498A72537d8154E3935a32946J6491l3417
18681a49872K611H1277J82133h6283f083j92622L1607G4402k2760b35176D9102
18669a09515B4490e7545k18928g6490A0797a03169D584a06116A37034a35732j10484
$$ y = [26470, -157049, -139071, 60351, 439276, -352491, 232459, -156870, -77075, -276260, 124336, 391, 83893, 246084, -55480, -116492, -460882, -74237, 211588, -343003, 159799, -156414, 64932, -338538, -62718, -130115, 203432, -153695, -191500, -37444, -137735, 7905, -25597, -276200, 355242, -54146, -161021, -126058, 161166, 71331, -435139, -270055, -235152, 514104, 46803, 1474, -87038, -316424, 14018, -584726, -6140, 45124, 76590, -138423, -104883, -237244, -125192, 103678, -89420, -66835, 50522, 81132, 17988, -21084, -206582, 172537, -48154, 53935, -132946, -116455, -149872, -147261, 81277, 263410, -86283, -6083, -198705, -167098, 74402, 51642, -235176, 49102, -109515, 24490, -57545, -276473, -76490, 10797, -103169, 4584, -106116, 137034, -135732, -246216]
18658b46216D6345e117B37383h4330A96999b95408g913C49972n9464j09439i2619
18646c26498a0143m893j93367G5636h4866k6299m9451F0732O7723K734K52366
18635C83555G6500K45218a25850N0854B84537b61355g2196B01530d2761I7463
18624B43472n3080H2619J23J15174G645a18115k6287k4726F8860d8835k60631
18613c09466A45354a01506d5693l774J3300j1409o1073o6715A8892P6958K17342
18602C13192a82952k1297N7116k15316O5505B84268a19727A15400a43619e5096
18591A471K37883A1787P0727b53102b6534k91450B13017g8769m7179O0419j72229
18580b37758a07840l0063k3459N0378C52433A18126c16228d0167p4442I5934j5946
$$ y = [-246216, 46345, -5117, 237383, -84330, 196999, -295408, -7913, 349972, 290508, 181069, -92619, -326498, -10143, -15036, -208403, 75636, -84866, -111165, -160616, 60732, 128455, 131189, 383555, 76500, 321718, -125850, -74996, 284537, -261355, -72196, 201530, -42761, 97463, 243472, 190392, 82619, 82742, 197916, 7645, -118115, -144402, -169128, 68860, -48835, -309466, 145354, -101506, -45693, -49467, -36167, -47576, -108649, -175364, 18892, 95850, 313192, -182952, -204249, -147133, -362449, -296944, 284268, -119727, 115400, -143619, -55096, 1471, 239354, 11787, 82514, -253102, -26534, -317984, 213017, -78769, -125948, -65529, -237758, -107840, -137903, -161362, -110984, 352433, 118126, -316228, -40167, -114609, 95934, 79988]
18569G9988G653b42056c754j1600B7741a32556k12953F8915b3248n2440B3601
18557b57526d4572k96036b9484i360A45352b77292A00726a68821P2400k61992
18547c58413B17777a84203O110H9705c6471k74431G9738b30166A2212b33721g5225
18535c03288d9478B57438a26219F3796J11168i7141D6164J27507a10074F6474
18524A98288a88004f2363j22458c1716B10329a54484j03050a19770E5286M18560
18514D73846A26044a82609E4551P4458a51358j09312P0227Q7467G6604a72885
18503b21032Q7025k2403G7027o72K05591B0537C68J93765h512I9594h7734C9601
18490E2970c58312B11818H3063c24749c1104A60409b63340e724l08585a4460j7033
$$ y = [79988, 7653, -242056, -3754, -15354, 27741, -132556, -345509, 68915, -23248, -75688, 23601, -257526, -44572, -340608, -29484, -9360, 145352, -277292, 100726, -168821, -96421, -358413, 217777, -184203, -178093, 89705, -36471, -310902, 79738, -230166, 12212, -233721, -75225, -303288, -49478, 257438, -126219, 63796, 174964, -97141, 46164, 173671, -110074, 66474, 198288, -188004, -62363, -184821, -31716, 210329, -154484, -257534, -119770, 55286, 473846, 126044, -182609, 54551, 129009, -151358, -260670, -190443, -102976, 76604, -172885, -221032, -134007, -156410, 77027, 76355, 281946, 20537, 368, 194133, -8512, 99594, -87734, 39601, 52970, -358312, 211818, 83063, -324749, -31104, 160409, -263340, -5724, -314309, -14460, -31493]
18479c1493A92551a55918b9452A6435b68661b8674E2178L8697C2407M0108b58991
18467A12860b72336b6692A22542B4765i3898C06804c21357H9665h9419j64223
18457b53642J25310A48705J07229f5808B6922a6678n2852G3161J5683J59385R2007
18446C40236c7694o0534j18206G212J91102b8108f081j7958j31439B4955J49504
18435A74459i4037k7170c4074k98910a04389a2579A51a51313G6935b05120k39759
18424d44879h1780I1624a24969j20763j4971d3180o3012M0163n8365j18739J13015
18413a30118q4780e7170k2780B18084a20579R298G9943d1062A89712d0693D9984
18401c60049A6369J32360l0663k4255h9127a0959A89969M4905r9429K33737I3730
$$ y = [-31493, 192551, -155918, -29452, 16435, -268661, -28674, 52178, 90875, 32407, 72515, -258991, 112860, -272336, -26692, 122542, 24765, -93898, 306804, -321357, 89665, -89419, -253642, -128332, 148705, 255934, -65808, 26922, -16678, -69530, 73161, 88844, 248229, 340236, -37694, -98228, -216434, 7212, 198314, -28108, -6081, -24039, -155478, 24955, 174459, -94037, -121207, -34074, -332984, -104389, -12579, 151, -151313, 76935, -205120, -444879, -81780, 91624, -124969, -245732, -260703, -43180, -106192, -66029, -124394, -243133, -130118, -214898, -57170, -79950, 218084, -120579, -111281, 79943, -41062, 189712, -40693, 49984, -360049, 16369, 148729, 118066, 93811, -89127, -10959, 189969, 234874, 135445, 369182, 93730]
18389a26914M6944r0486Q496B97429b18110N3901F139K56800i4800A18072e2377
18377a86665h8593n0813A15130n2109a87788A91794a91910A41071d3247A29025
18366d6984j22072f4505b4192r4125k18278J42691j31941G6205a27781A01179
18355a67034A48676r784o2193b10362K9822A32365E0458b3063C4645a6135B02936
18343B18070g362l1432j86437B7505a02779M6549A67576a80592H1647B0946a20530
18331i8066J4244k52715c8638A5574L41350F7437c12011d5744n5358B9030e6923
18319H0639Q1389b38095Q7420c2450A53334o2581d5843j63564l0583A57251h9042
18307a24275b2470B4568J16580P263a30652D6437b65993C0735N897a15980B51999
$$ y = [-126914, -79970, -170456, -161960, 297429, -218110, -164209, 6139, 262939, -94800, 118072, -52377, -186665, -88593, -139406, 115130, 63021, -187788, 191794, -191910, 141071, -43247, 129025, -46984, -169056, -64505, -24192, -118317, -336595, -193904, -325845, 76205, -127781, 101179, -167034, 148676, 138892, 76699, -210362, -180540, 132365, 50458, -23063, 34645, -16135, 202936, 218070, -7362, -38794, -225231, 27505, -102779, -56230, 167576, -180592, 81647, 20946, -120530, -98066, -83822, -336537, -38638, 15574, 356924, 67437, -312011, -45744, -101102, 29030, -56923, 80639, 162028, -238095, -150675, -32450, 153334, 90753, -45843, -209407, -239990, 157251, -89042, -124275, -22470, 24568, 141148, 148411, -130652, 46437, -265993, 30735, 36632, -115980, 251999]
18295a94542J5669d8932q2901j51768K1661O1925J0408B04391K79250B39082b77451
18283e5707J4864B4182c43221A65387J3077h9970j28301q3026H7151L09469a9241
18271a6891j19843A99100h3784H9172g7374A67657g0501j29280K2616E6420b51463
18259B67772b1781k15214B353K7657a57280A12307c80137J51408D9735M7300a40409
18247a39133j2366n8172n6029D5033b09021a9192m28m6711E4927b0135j16536
18236a36671k23968H1869a08137N391A49190b76901B46558L2001a34641j16170
18226b50811A49735a47248j3283j29865A9875a30522K64D6166P1366g7080k15357
18215b92437E5860K03a56443H2176h0627C32107B5160N7983i3930C24852d9085
$$ y = [-194542, -178873, -48932, -131833, -283601, -261940, -200015, -189607, 204391, 483641, 239082, -277451, -55707, -40843, 24182, -343221, 165387, 178464, -89970, -218271, -301297, 87151, 396620, -19241, -16891, -136734, 199100, -83784, 89172, -77374, 167657, -70501, -199781, -177165, 56420, -251463, 267772, -21781, -236995, 2353, 30010, -157280, 112307, -380137, -228729, 49735, 97035, -140409, -139133, -151499, -209671, -265700, 45033, -209021, -19192, -19620, -66331, 54927, -20135, -136671, -360639, 81869, -108137, -102746, 149190, -276901, 246558, 278559, -134641, -250811, 149735, -147248, -160531, -290396, 19875, -130522, -130258, 46166, 117532, -77080, -292437, 55860, 56063, -156443, 82176, -80627, 332107, 25160, 83143, -93930, 324852, -49085]
18203b61538i7664q8501A2712h8874q2328F6552K12022j32984F5434J77301c39968
18191c4875j64714R7077l8868A80344L16223d6881K1664I6712a42543n5648d8572
18179a3249m6721k90890A63314E2178N7503R344b96714A73909a26136M6213C24423
18167E1753g2327o8894j1282j72697q7059J50388J02540Q277j76385B8368J67695
18156A96063o9705E9092c16188L573B7790d0595A36619a990E7757i6174E7914
18144A09158b67397E4510k6645a55476P565N3217F7624l132C0831a33330E9074
18132i0423C99599j23109h1397A54109a02086A80569j7945J3237b4744j5117A3002
18120B02804Q6938c23348K1435i5919M2068n8520A56089B798a42128B07721q9663
$$ y = [-261538, -97664, -186165, 12712, -88874, -171202, 66552, 278574, 145590, 65434, 242735, -339968, -34875, -199589, -102512, -141380, 180344, 496567, -46881, -25217, 96712, -142543, -198191, -48572, -13249, -59970, -350860, 163314, 52178, 109681, 119025, -296714, 173909, -126136, -79923, 324423, 51753, -72327, -141221, -152503, -325200, -412259, -261871, -159331, -151054, -327439, 28368, 196063, 126358, 59092, -316188, -312615, 27790, -40595, 136619, -1990, 57757, -96174, 57914, 109158, -267397, 54510, 27865, -155476, -147911, -94694, 67624, 64492, 30831, -133330, 59074, -90423, 399599, 276490, -81397, 154109, -102086, 180569, 162624, 175861, -24744, -39861, 13002, 202804, 289742, -323348, -301913, -95919, -53851, -112371, 156089, 2798, -142128, 207721, 118058]
18109A18058E3400f3380j38657o2803f6446e322b252A99241q0759f5046B577a71227
18096a6510k65874R93A27895B969b11494d0906m22358J38218Q3569C2946L1674
18085F4620J62038A11257N2016a15370a3766B34903c64494I693c2074C3623a52281
18073B5068L2458d1302c954j78844a1571q2748B5281J83572J7560k6582r9101
18062A00730C0779b15559j6457C5900M351b83212A3781a32814H5522J78443b9956
18050b16022p8085A471K5587g4036B2691e6894p3479o1771k02258J79721F0639
18038a48665A62671C259J58358b04599i2429k40709e8354l1755L5681j1432j31842
18027a97702b1097f237p9747C49415b2222o2493A49949d0331F9653J039a17148
$$ y = [118058, 53400, -63380, -202037, -264840, -66446, -5322, -2252, 199241, 118482, -65046, 2577, -171227, -16510, -282384, -281391, 127895, 2969, -211494, -40906, -463264, -325046, -241477, 32946, 64620, 226658, 111257, 163273, -115370, -13766, 234903, -364494, 9693, -32074, 33623, -152281, 25068, 57526, -41302, -3954, -182798, -11571, -94319, 25281, 208853, 226413, 199831, 100730, 30779, -215559, -232016, 35900, 40251, -283212, 13781, -132814, 85522, 263965, -29956, -216022, -294107, 1471, 27058, -74036, 22691, -56894, -130373, -192144, -394402, -214681, 60639, -148665, 162671, 3259, 161617, -204599, -92429, -333138, -58354, -90109, -54428, -65860, -197702, -21097, -6237, -85984, 349415, -22222, -84715, 149949, -40331, 69653, 70692, -117148]
18015c31695j1353a64914K8402A29251b72321O7185B0933b05589g2802B37840
18004C24109A41184a0941A70909d00147a30216A2451J10520C7109O0056H996e6728
17992b07112j06350h8668j5070j5321j50073R7551k072A76027a28257I6988J6266
17981A13254a6922j2093H5233l0024l747J85585L0881j05185b23508A28459a64306
17969a88743A28582C4838b77579H116a49133O9387o6479f103A29572R4252D6440
17957a42789B8141e7083k55193C3739b11548d7323r1926j79115G9714a78791b9619
17945D200b40013p4988i2570q7521g0657q2289f1766K1960I9733m1143A4771a40443
17932a38125A2251O5694a26109j3288N2468c6517A9402a96458m4574h2980j28294
$$ y = [-331695, -343048, -164914, -136512, 129251, -272321, -205136, 20933, -205589, -72802, 237840, 324109, 141184, -10941, 170909, -400147, -130216, 12451, 122971, 37109, 97165, 8996, -56728, -207112, -313462, -88668, -103738, -119059, -269132, -171581, -173653, 176027, -128257, 96988, 113254, -16922, -29015, 85233, 55209, 51462, 237047, 267928, 162743, -223508, 128459, -164306, -188743, 128582, 34838, -277579, 8116, -149133, -79746, -146225, -6103, 129572, 223824, 46440, -142789, 28141, -57083, -312276, 33739, -211548, -47323, -139249, -318364, 79714, -178791, -29619, 4200, -240013, -315001, -92570, -180091, -70657, -152946, -61766, -39806, 99733, 58590, 14771, -140443, -138125, 12251, 77945, -126109, -139397, -86929, -36517, 19402, -196458, -241032, -82980, -211274]
17921b11274J05345j6409C09368A46043b48866k7195E0953e0762A52916b13111
17910A08535b33786D7J31593D7686b5634p5943D3101N5112g5480j48858E3877
17898I7211d0170J345F29J25575l7292J59657M7076q3539c15562I4730J32731
17887B27461n5697Q5818a92464l921f2019n967q9448j11803d4667j82027A16403
17875b31541G3114g9353q63A60320a03665l3393C2624a40333K1040l6678c2617
17863D993f2049C7448j3582J62875F3983Q1812b32642H5830a03680j72134a15432
17851E4064a52404D8863g903p7237A39491b19735e6986G1828f053j0708D7141
17839B5259a88474M1270C57255J59989h990p4407k13950a08218B6947J53652a19051
$$ y = [-211274, -105929, -122338, 309368, 146043, -248866, -276061, 50953, -50762, 152916, -213111, 108535, -233786, 47, 131640, 47686, -25634, -101577, 43101, 98213, -75480, -224338, 53877, 97211, -40170, -38825, 629, 126204, 88912, 248569, 295645, 212106, -315562, 94730, 227461, 171764, 257582, -192464, -196385, -62019, -67986, -157434, -269237, -44667, -226694, 116403, -231541, 73114, -79353, -80216, 160320, -103665, -137058, 32624, -140333, -119293, -155971, -32617, 4993, -62049, 37448, 23866, 186741, 63983, 145795, -232642, 85830, -103680, -275814, -115432, 54064, -152404, 48863, -7903, -85140, 139491, -219735, -56986, 71828, -6053, -16761, 47141, 25259, -188474, -147204, 357255, 517244, -8990, -83397, -297347, -108218, 26947, 180599, -119051]
17827B12159h9171E3673P3697i7951C0710a36223O7134D9791a81180A05095P2304
17816A77399b35738b7275I4612a03314H2321L16926c23560J56285O7676B42882
17805c0381j1592r2777j42713i394j63829D5394J08936a39701j48318p4029J35688
17794b26360k72426C37797b46159A23008a79600k20553J95793d1116r2602j586
17784a35304H9325J82865g2485A83578P8915k9925o8082P8112i1673j0391l7302
17773a39366A77269h2528E1335a38666A78512l8280a39906B415J51259N9788H642
17761a77687d7184r9601A33012P5470b3677I5498a63373A00124K72612h8400L0416
17750e7984A13189l8329k2124j4863a41694B36309D4104g8518j25618c1355a0540
$$ y = [212159, -89171, 53673, 127370, -97951, 30710, -136223, -69089, 49791, -181180, 105095, 177399, -235738, -27275, 94612, -103314, 82321, 399247, -323560, -167275, -99599, 242882, -30381, -41973, -134750, -277463, -9394, -173223, 45394, 154330, -139701, -288019, -362048, -226360, -498786, 337797, -246159, 123008, -179600, -400153, -204360, -41116, -133718, -135304, 89325, 272190, -72485, 183578, 262493, 232568, 164486, 242598, -91673, -102064, -139366, 177269, -82528, 51335, -138666, 178512, 140232, -139906, 2415, 153674, 213462, 8642, -177687, -47184, -146785, 133012, 208482, -23677, 95498, -163373, 100124, 372736, -88400, -57984, 113189, 74860, 52736, 37873, -141694, 236309, 44104, -78518, -204136, -31355, -10540]
17738I6750h5919A22203D8553a54529B44595F2930a53053L7518M2033p0923A40455
17726a36023A83441e6521k08166A97601G7506j4173L98170a19553b2008H6905
17715b99944b0239j42350k40672a60929A0193d3593J804k2296H3017a28228j97891
17704c26119i6258F9118K7178e11616D9701K0623L8794L75852a44772B24515g7882
17692A4845a62406A54653D930J0332a19632A97413a04403F450a58167K8281r6670
17681b26556J350f3076p6317F8580a07319A0291c0634J978a3249k63195a28006
17669F9207a00764B05153g7936K6459A56000b7171D7188O3954B6614j0479J70278
17658A86413i169A94071a20110A22852c49147j12489A89127d0686o4415A98267
$$ y = [96750, -85919, 122203, 48553, -154529, 244595, 62930, -153053, -115535, -73502, -144425, 140455, -136023, 183441, -56521, -264687, 197601, 77506, 63333, 461503, -119553, -22008, 86905, -299944, -20239, -162589, -403261, -160929, 10193, -43593, -41789, -64085, 83017, -128228, -326119, -96258, 69118, 96296, -511616, 49701, 70324, 109118, 484970, -144772, 224515, -77882, 14845, -162406, 154653, 4930, 15262, -119632, 197413, -104403, 6450, -158167, -129886, -226556, -225206, -63076, -139393, 68580, -107319, 10291, -30634, -28656, -13249, -276444, -128006, 69207, -100764, 205153, -77936, -51477, 156000, -27171, 47188, 111142, 26614, 16135, 186413, -9169, 194071, -120110, 122852, -349147, -461636, 189127, -40686, -105101, 198267]
17647d1071m361B97233K9168I0608B7548M8403e4653j2460q8764A83246E8214
17635a61322B43143n880b80069g2592c625A78277m2217M4727d4572b1978I1637
17623b54824A41846J9837d3342J2367j9056C45091A57904g7424j2445A45462h1187
17611d1385n3023A79610K27098a9236A99891i6470k3710K719N6925K4926j09060
17600a44670d2613C02229d97941i5718A61105C1655e9823A508a3814B28255d3528
17588a03158I6052R1862h080k57497A17631d8994B39330A5095J13285J14327j17578
17577A25129J29037n8805r3085g0422I0281l2950e7564j55320A2136J44489n9480
17566I7145K60712F3295J62273q5657e3766o0457E1811A7233a49842E3851b26561
$$ y = [-41071, -45432, 297233, 326401, 90608, 27548, 75951, -54653, -67113, -155877, 183246, 58214, -161322, 243143, 237263, -280069, -72592, -3625, 178277, 136060, 180787, -44572, -21978, 91637, -254824, 141846, 161683, -43342, -30975, -50031, 345091, 157904, -77424, -89869, 145462, -81187, -41385, -94408, 179610, 406708, -19236, 199891, -96470, -120180, -117461, -60536, -35610, -144670, -42613, 302229, -497941, -95718, 161105, 31655, -59823, 1508, -13814, 228255, -43528, -103158, 96052, 187914, -8080, -265577, 117631, -48994, 239330, 15095, 128380, 242707, 125129, 254166, 195361, 102276, -70422, 90281, 57331, -57564, -212884, 12136, 156625, 97145, 357857, 63295, 225568, 139911, -53766, -114223, 51811, 17233, -149842, 53851, -226561]
17554A90661D1091J06636n4724c8694F2824b6797r8999c7083G4437M12792A22291
17542C61744f5855A89491o8954J01582b27399A78194b05144B06654B9041c6111
17531B98021d6028l37889a67221A20522A3749C240J84127J0015h591B9753a10378
17519E253j129J12961K00775d29563a62556A9370e2475A90011o3453K7395A4053
17507C03791A6311a91939i0540r5908C8312b55691R0601o5916e8A69107J61052
17496C30159G1164a20244B03309k6409D2234b14845a8871E8583e6471K2006o2779
17485i7244q151B30897L3514n9922J42060d3300H5394B9298K12841r93G4897a36258
17472A66765K36J81674a26900G3828D144K95692j32605b42902H1371J44906a1391
$$ y = [190661, 41091, 147727, 93003, -38694, 62824, -26797, -125796, -37083, 74437, 487229, 122291, 361744, -65855, 189491, 120537, 222119, -227399, 178194, -205144, 206654, 29041, -36111, 298021, -46028, -383917, -167221, 120522, 13749, 3240, 187367, 197382, -8591, 29753, -110378, 5253, 4124, 117085, 317860, -429563, -162556, 19370, -52475, 190011, 126558, 153953, 14053, 303791, 16311, -191939, -90540, -186448, 38312, -255691, -165090, -231006, -58, 169107, 330159, 71164, -120244, 203309, 176900, 42234, -214845, -18871, 58583, -56471, -34465, -97244, -105395, 230897, 264411, 204489, 346549, -43300, 85394, 29298, 242139, 241146, 74897, -136258, 166765, 167001, 348675, -126900, 73828, 4144, 299836, 167231, -242902, 81371, 226277, -11391]
17460a121A8563Q0752J23103K44710A22203J62895m2987K6389Q4463n2184j19494
17449A81285p6962n0033L17394m0393A48504L66617A28234n2261J9956J02128
17439A98057l7189M4991n1171B9685Q7288D2760K44389A13791J14812G2278m00
17428G1878i2273C538L34380i8165D23607N136A11008b640j65466B12706G4065
17416C54950a22539A03618J21305j06961J25767p7253M6113K09571j49746I102
17405a67735A53283K95624f9971o6816D51395j43352b09120B85922e8172g264
17394I9101L9076a15440H6268h2807H9018K31647J18842A61401F2919a60184C81602
17382A82562A6971K87972F4552O2103K33976a52697j1016A33817L30205a44202
$$ y = [-1121, 18563, 99315, 222418, 467128, 122203, 285098, 242111, 268500, 352963, 300779, 181285, 104323, 54290, 371684, 331291, 148504, 515121, 128234, 75973, 95929, 198057, 160868, 205859, 154688, 29685, 116973, 42760, 287149, 113791, 228603, 72278, 71878, -92273, 3538, 337918, -98165, 423607, 428743, 111008, -2640, -168106, 212706, 74065, 354950, -122539, 103618, 224923, 117962, 243729, 166476, 212589, 422160, 272414, 9102, -167735, 153283, 448907, -69971, -136787, 451395, 308043, -209120, 285922, -58172, -7264, 99101, 138177, -115440, 86268, -82807, 89018, 320665, 439507, 161401, 62919, -160184, 381602, 182562, 16971, 304943, 64552, 126655, 360631, -152697, -163713, 133817, 464022, -144202]
17371D7083a55253A92342F9283a04031A84843P3277g4556b4064D01733p805j34832
17360B59096e753A97176m0708J00172B041R3518J24936q7378b9639C90884n5753
17349C35131j37502F4748P86872B65197A08172E0762J18962p4297a49565B36179
17338A97008Q9861C0595a01048B34145A11320A0908J34592R5212j05846c8725
17327G8049a99973e77H8606D0678Q2303k7969A6708K44591j7105e988D13836A59424
17314A35991L11047a96933a5769A54497N1211N8504A23714N7048m3084a41165
17303C5669a22456B06582b7930F1094J14763M7305a3503m5946A59768J43832I1544
17291C68162B0664J91973D1090K00597J44200q857A48642K94191g94G1265Q5517
$$ y = [47083, -155253, 192342, 69283, -104031, 184843, 258120, -74556, -24064, 401733, 393928, 259096, -5753, 197176, 156468, 256640, 2041, 95559, 220495, 133117, -29639, 390884, 335131, 197629, 64748, 851620, 265197, 108172, 50762, 169724, 95427, -149565, 236179, 197008, 286869, 30595, -101048, 234145, 111320, 10908, 145500, 240712, 134866, -38725, 78049, -199973, -577, 88606, 40678, 122981, 95012, 16708, 261299, 244194, -5988, 413836, 159424, 135991, 447038, -196933, -15769, 154497, 205708, 264212, 123714, 180762, 137678, -141165, 35669, -122456, 206582, -27930, 61094, 175857, 223162, -13503, -59449, 159768, 303600, 91544, 368162, 20664, 212637, 41090, 241687, 385887, 377030, 148642, 442833, -794, 71265, 156782]
17280A56782J12018j07176J86951a7932A55220j8136J15130O7038A27327a52444
17269B17991M0461j09583a82259F9498O5192K97707e5145C10018G7238a52017
17258C71282k844m509j17803a04949A9219L35399L7795B9046J85911j07020h1948
17246D49284c156A10495M709b9803B92409H6312J87338J7302A26685j1646B975
17234A39893A5480K05856j5342K145a17467B19280F1914J21814L3666m7030f1374
17222B53565k0899I5153J31122a1075G9092c9640B43095l30d2457j85773B11094
17210C4412M25087F4467O53955i3454n6992C8072K13936n4963a56390B12546J92062
17199D04608A53613J60387I7260J36255I2791e8611A07385d3223B40476J19234
$$ y = [156782, 268800, 161624, 348575, -17932, 155220, 137084, 252214, 319252, 127327, -152444, 217991, 258452, 148869, -182259, 69498, 134690, 432397, -55145, 310018, 77238, -152017, 371282, 368438, 363929, 246126, -104949, 19219, 354618, 392413, 29046, 214957, 107937, -81948, 449284, -3156, 110495, 115204, -29803, 292409, 86312, 273650, 290952, 126685, 115039, 2975, 139893, 15480, 221336, 205994, 208139, -117467, 219280, 61914, 183728, 217394, 170364, -61374, 253565, 232666, 95153, 226275, -11075, 79092, -39640, 243095, 242765, -42457, -228230, 211094, 34412, 459499, 64467, 718422, -93454, -150446, 38072, 252008, 197045, -156390, 212546, 404608, 153613, 314000, 97260, 233515, 92791, -58611, 107385, -43223, 240476, 359710]
17189C59710A39719K15799K3698L7584H6641M62429j33461A59348L364L4021L12505
17178E09238G5836A5016K63575q5668J4176J16663B8151K99700F168J30482n7805
17167G8845K93452A42778N9622I5003P2583f014I0748R3541q2961J40866M4899
17156B87093A101L94248K7072A62927c3398D02458j81829c9816B39842J22577
17146C62419O8151j28408D0884O912L05422I6140J69840R8054j15233D9711J60324
17135B10035J41593j16415E1609B5546K33679b354A15024L09012i6034b7981B85058
17123C71837K9709N2499B5783P3252L87420j06006A53765L41483A75269F2531
17112C70772N6840P7154a23836A38876K40335m3674j2914J39771j88251J07619
$$ y = [359710, 139719, 355518, 379216, 416800, 86641, 549070, 415609, 159348, 162712, 196733, 509238, 75836, 15016, 278591, 192923, 207099, 323762, 28151, 327851, 6168, 136650, 78845, 372297, 142778, 202400, 95003, 167586, -6014, 90748, 184289, 101328, 242194, 287093, 1101, 395349, 422421, 162927, -33398, 402458, 220629, -39816, 239842, 362419, 430570, 302162, 40884, 47796, 353218, 96140, 265980, 364034, 248801, 49711, 210035, 351628, 235213, 51609, 25546, 259225, -2354, 115024, 424036, -96034, -27981, 285058, 371837, 401546, 454045, 25783, 99035, 486455, 380449, 153765, 495248, 175269, 62531, 370772, 427612, 504766, -123836, 138876, 379211, 335537, 322623, 462394, 274143, 381762]
17102C81762j31522B4768L37988j20479J07255q5575q240M2147K87255m031Q132
17091E89220A15435M24625n7934j30326j05316O6760r3381N4698L90355A70225
17080B40425Q0152J15150j13066l8752J58383B12878L43332B76041J14619m1057
17070C49603K20928A66753J15203J8360K69633A86182J76772j28542J18013j06680
17060B45745o2902K22279J55157k5197n1712k06468N1976R8716J3203J50844R5299
17049F86940j79364A54165Q9125n9730J43744o631M4543p2853L33903k96152L308
17038C33422K98041J3067C19931L3642k4728L27169m2600j35441J752K879m4067
17027D38537k15289K98712J30864A99707M89456A23549O41285j91804J12637k79931
$$ y = [381762, 250240, 24768, 362756, 242277, 349532, 263957, 255717, 297864, 585119, 581088, 589220, 115435, 540060, 482126, 351800, 246484, 313244, 219863, 274561, 664916, 170225, 240425, 320577, 435727, 322661, 283909, 442292, 212878, 556210, 276041, 390660, 349603, 570531, 166753, 281956, 300316, 569949, 186182, 362954, 234412, 352425, 245745, 182843, 405122, 560279, 535082, 483370, 276902, 328878, 427594, 440797, 591641, 686940, 507576, 154165, 243290, 183560, 327304, 320673, 365216, 292363, 626266, 330114, 333422, 631463, 644530, 319931, 353573, 328845, 656014, 613414, 477973, 479725, 482604, 438537, 223248, 521960, 652824, 199707, 689163, 123549, 764834, 573030, 685667, 405736]
17017D05736j29971M56909k15847J83627k6966k53895P2481J15371l00641N05339
17007H12143j02252j42729o0691j45861L68929j34552O7845L48918m17682J40076
16997G34144j37473K13993l16955K20980j31691J14434J3656B19507N23382B78279
16986E85303j24924L45695n0565k40798L65133p4486K75308D71902J58307J08978
16976G39187K57612l88090K0018R983J51490k0390j15005M46074n21432O7031
16966F46478N30022k28059C37135N08380P9908j72700K46345m10022Q2986J79691
16956H51723L0432k24838K73890j37472j70858L21233j48978P9631J52563k31182
16946G96144q9567L97406R6102m29693o4042M89907p6098l54088J82876j35523
$$ y = [405736, 275765, 732674, 516827, 700454, 673488, 419593, 492074, 607445, 306804, 812143, 709891, 567162, 506471, 360610, 729539, 594987, 662832, 1011750, 594068, 734144, 596671, 810664, 493709, 714689, 582998, 697432, 711088, 219507, 742889, 278279, 585303, 460379, 806074, 755509, 514711, 879844, 805358, 1080666, 471902, 630209, 739187, 996799, 608709, 628727, 638710, 790200, 769810, 654805, 1100879, 579447, 646478, 1176500, 948441, 337135, 845515, 925423, 752723, 999068, 589046, 672032, 851723, 882155, 657317, 931207, 793735, 622877, 944110, 795132, 874763, 1027326, 796144, 706577, 1103983, 1200085, 770392, 706350, 1196257, 1120159, 766071, 948947, 813424]
16936H13424J30052n9406j16199L14152l6604j01984L5946R6733J63171P0180
16926A309465J01630m96372o937L85763R7071K6695j59810j01423K81061l17959
16916A119184L54769r2815O6739k64486J9299J55967j08716j33542K70727j69701
16906A217425O7545P18332n57511l53222R31847p03026L03097p5857J18163n1678
16896A615115j02815J89811n7999l5198J7221J89966k45966J36209j38225L66398
16886A934517k28193j62341J63122J42619l69376K77784K05523L9438P4713p8131
16876A999675m00993L61785j20469L58680l56357M12654L12233m97872J98477
16867B267813O9456j05873M8824k30309L64221J51367r9870p7607J44171r3752
$$ y = [813424, 943476, 884070, 767871, 1082023, 1045419, 943435, 979381, 1076114, 1239285, 1309465, 1411095, 914723, 907786, 1293549, 1390620, 1417315, 1257505, 1156082, 1437143, 1119184, 1473953, 1381138, 1447877, 1183391, 1202690, 1358657, 1249941, 1116399, 1387126, 1217425, 1284970, 2003302, 1445791, 1092569, 2024416, 1321390, 1624487, 1548630, 1666793, 1615115, 1512300, 1702111, 1644112, 1608914, 1626135, 1816101, 1570135, 1706344, 1568119, 1934517, 1706324, 1543983, 1707105, 1849724, 1480348, 1758132, 1963655, 2003093, 2077806, 1999675, 1598682, 1960467, 1839998, 2198678, 1842321, 2254975, 2567208, 2069336, 2267813, 2337269, 2231396, 2280220, 2049911, 2414132, 2565499, 2465629, 2388022, 2532193, 2438441]
16857B438441o4694J49139R9515L07203k95983K16176J2074J46201m46029O17025
16847C179068l03799J61826J74270J84579o9762q53272O69644J26358N4421R6923
16837C420256L9089K25199J3384l53936Q70045l51028J06527k00013J74182K20442
16827D164147J4772L58900J16902k04255n0020K1886J29032K54057k9777K63420
16817E039064K77055k69570L0011N05057p0717p9319J81754K67782k74903M15121
16807F021335j13295K09028k5944K64693J52871M01541K14714r7431L08329L71626
16797G707467J9361O6769L16367N30292j6658J01788K14910L11408m5420M42844
16787I649128L62160N85603k53039K6863O67493R6000P08502K58562K36747O69387
$$ y = [2438441, 2373747, 2522886, 2622401, 2929604, 2633621, 2849797, 2861871, 3008072, 2562043, 3179068, 2875269, 3037095, 3211365, 3395944, 3326182, 2472910, 3142554, 3268912, 3323333, 3420256, 3459345, 3684544, 3697928, 3343992, 4214037, 3863009, 3969536, 3769523, 3943705, 4164147, 4178919, 4537819, 4654721, 4450466, 4400446, 4422332, 4551364, 4805421, 4775644, 5039064, 5316119, 5046549, 5076560, 5581617, 5510900, 5431581, 5613335, 5881117, 5606214, 6021335, 5908040, 6117068, 6091124, 6355817, 6508688, 6910229, 7124943, 7027512, 7335841, 7707467, 7726828, 7793597, 8109964, 8640256, 8623598, 8725386, 8940296, 9251704, 9206284, 9649128, 10011288, 10596891, 10343852, 10370715, 11038208, 11134208, 11842710, 12101272, 12338019, 13007406]
16777A3007406J0495J117999J83146L93626N67953M06729M37874P39392O0926
16768A6925546J392116L21202O67921M31679J102350Q70903J038617N52967R09835
16759B4213136J303314O98241J193754J059928J421893J677508J567471J341440
16751C4476685K028234K042754J573415J960594J842000L035142K429859K513201
16743E1901884K986925K876545L303947L928476L466566M634756M325600M598780
16735H2023479N561258N170230N695076O094972O475769O902280P252599O888930
16727A32064593P282842P187405P487189P143126O357286N576552N260684L848912
16719A82208589K906048K270097K51366j181136j988498l721208m581361n465882
$$ y = [13007406, 13017901, 14135900, 14319046, 14712672, 15280625, 15687354, 16125228, 16864620, 16925546, 18317662, 18638864, 19306785, 19738464, 20840814, 21711717, 22750334, 23303301, 24213136, 25516450, 26214691, 27408445, 28468373, 29890266, 31567774, 33135245, 34476685, 36504919, 38547673, 40121088, 42081682, 43923682, 46958824, 49388683, 51901884, 54888809, 57765354, 61069301, 64997777, 68464343, 73099099, 77424699, 82023479, 87584737, 92754967, 98450043, 104545015, 111020784, 117923064, 125175663, 132064593, 139347435, 146534840, 154022029, 161165155, 167522441, 173098993, 178359677, 182208589, 185114637, 187384734, 187636100, 186454964, 184466466, 180745258, 176163897, 170698015]
16711A70698015n993866o960844o924255p571308o969575p441307p417718o845943
16703A14573199o849850o245441n760806o249567n044468m567806n165424m109122
16695G0580715m229747l686049l384671l491739k648102l366089k658208k125404
16687D4990706k246520k323735j780686j945321j581180j831636j453632j775077
16679C0052919j126637j255571j109406j063241j174350j003143q27033q73595
16671B1619943m84609j071929j006936n69994m09282p02151q87308m66570n88846
16662A5432318l97544m02980q46303l88567m44734l50212l01930k32484m37129
16653A1630435m92140m69384l47678Q8191n08116K8517o03760n41334k859k59414
$$ y = [170698015, 164704149, 157743305, 150819050, 143247742, 136278167, 128836860, 121419142, 114573199, 107723349, 101477908, 95717102, 89467535, 84423067, 79855261, 74689837, 70580715, 66350968, 62664919, 59280248, 55788509, 53140407, 49774318, 47116110, 44990706, 42744186, 40420451, 38639765, 36694444, 35113264, 33281628, 31827996, 30052919, 28926282, 27670711, 26561305, 25498064, 24323714, 23320571, 22493538, 21619943, 21135334, 20063405, 19056469, 18486475, 18077193, 17375042, 16487734, 16021164, 15432318, 15034774, 14631794, 13785491, 13396924, 12952190, 12601978, 12300048, 12067564, 11630435, 11138295, 10668911, 10321233, 10409424, 9901308, 9929825, 9326065, 8784731, 8781872, 8522458]
16643H522458k5789l19160j48022k40180k63024K81858n46392m42525J37650k79715
16633F677159o4705k82448N9809p74240N54304j05232l68331m79363J93852j22437
16623E288368J43463O9355m02258l40027l5846l73634J38257K04046m16345M31579
16613D706958j36713n15416k10540K43874k91059n8708n9475J7652N92469n17221
16603C771821k69060Q185l67634r2154K14388k38233K83729J1463m07693L7013
16593B951825j26393K84607l19340L71923k10391m09250j4558P4779j07280k77410
16583B218512L86213P9595m31701J87974j61930P0481j14201J70411k95819O6115
16573B175650l00855M99691O4677l12070M0961k32607K32771n9645l28992K94458
$$ y = [8522458, 8496669, 8177509, 8029487, 7789307, 7526283, 7808141, 7261749, 6819224, 6956874, 6677159, 6612454, 6330006, 6389815, 5615575, 6169879, 6064647, 5696316, 5216953, 5410805, 5288368, 5431831, 5501186, 5098928, 4758901, 4723055, 4349421, 4487678, 4691724, 4275379, 4706958, 4570245, 4054829, 3844289, 4088163, 3797104, 3738396, 3678921, 3696573, 4289042, 3771821, 3502761, 3510946, 3143312, 3051158, 3265546, 3027313, 3311042, 3322505, 2914812, 2951825, 2825432, 3110039, 2790699, 3162622, 2952231, 2542981, 2528423, 2603202, 2495922, 2218512, 2604725, 2684320, 2252619, 2440593, 2278663, 2349144, 2234943, 2405354, 2109535, 2175650, 1874795, 2374486, 2439163, 2127093, 2168054, 1935447, 2168218, 2108573, 1779581, 2074039]
16563B074039m53449J78111j44199J13805M4381Q7035m8200o9884o1762R2142
16553A812019Q2943p3150k24612M10937n03505L12029n29467J32L41885n3374
16543A575837j30324k2705j07211M86414l47239p0572R1943R7177j62994Q2741
16533A493067j54538K46860n49413R5001L24854j78594l9467L63606k90309N7084
16523A368151M0303m3762l24656L19475m7594p2361k40749N46930k29629l14607
16513A001501L28074l20770k70815N30671E71664M45906k52415K22942R6806j14636
16503I70267j04538K7195l7064M6083N0101J5820M8737p6708k28170K83259k94599
16492G00383K47061j2898K20148o5616m17140K49223O3899K3760j87325j15455
$$ y = [2074039, 1620590, 1798701, 1654502, 1768307, 1812688, 1899723, 1851523, 1781639, 1719877, 1812019, 1894962, 1821812, 1597200, 2008137, 1504632, 1816661, 1287194, 1287326, 1629211, 1575837, 1445513, 1422808, 1315597, 1802011, 1454772, 1384200, 1476143, 1573320, 1410326, 1493067, 1338529, 1585389, 1035976, 1130977, 1455831, 1277237, 1237770, 1601376, 1311067, 1368151, 1408454, 1364692, 1040036, 1359511, 1311917, 1239556, 998807, 1545737, 1316108, 1001501, 1329575, 1008805, 737990, 1268661, 571664, 1017570, 765155, 988097, 1084903, 970267, 865729, 892924, 855860, 901943, 952044, 967864, 1016601, 939893, 711723, 994982, 700383, 947444, 934546, 1154694, 1089078, 671938, 921161, 985060, 1008820, 821495, 706040]
16482G06040p9397K32987L6336k4996o5398J29883m05957r5660K64801k033J13250
16471H09856J12811k53508K34965r6778J75688l5954l08572K51249C18304L45909
16461F64213L14672l13643j28284L93207j188j37347K3950j15344C00346J22795
16451D23141K14092k56769L07604K9559P4125N0857j44587M777J483Q1340j03250
16440F82372j50243j42846A78683J038284l55122l79967M3186o3174B2071L81898
16430D03969J76083n4706k7709r8831j67780L40785B54447L34361o8458j452L38915
16419H57813j97704j5667l8009N4783p4923J09254l25183K08619q9225q6659J37753
16408E40852j31280q1200J10739k2333D1169K09636M35275q7066m4076A29872
$$ y = [706040, 626643, 859630, 895966, 870970, 805572, 935455, 529498, 433838, 698639, 696606, 809856, 922667, 669159, 904124, 807346, 983034, 947080, 638508, 889757, 318304, 664213, 978885, 665242, 536958, 930165, 928977, 791630, 815580, 700236, 300346, 423141, 637233, 380464, 688068, 717627, 791752, 842609, 698022, 702799, 704282, 785622, 682372, 532129, 389283, 178683, 1216967, 861845, 481878, 525064, 461890, 22071, 403969, 580052, 525346, 497637, 398806, 231026, 571811, 254447, 588808, 520350, 518898, 857813, 660109, 644442, 606433, 661216, 586293, 695547, 370364, 578983, 489758, 403099, 540852, 409572, 328372, 439111, 416778, 41169, 250805, 686080, 599014, 554938, 129872]
16397E89559k04283L40364l48930L17461l11520j11611P3490M81612B54711J6430
16387B71141R9586E7989P0153A1746O13501k72088B0337L52408l715K19280B33762
16375C68752l1021m2169j43121M30071B52020l9048J19108J60358j93908J56010
16365D54540k22501L96459k80465j23703M93728A22674J10833e0906C50306R1347
16355D41653D9030J97819J11146K13094A3313K23621q873K32291A32849R2667
16345B25516J1455L11066j44348p6230o458J951J67178M2119I4014N65600j38755
16334E20859G6936J76543l7619N77526j62403k63781L02881I7211K25669p5777
16324B47103J59734F9962J44879K85610k43891K69036n5308e152A33679L56373
$$ y = [589559, 385276, 725640, 376710, 694171, 382651, 271040, 344530, 826142, 254711, 271141, 370727, 57989, 128142, 11746, 625247, 353159, 20337, 372745, 369030, 588310, 233762, 368752, 337731, 295562, 152441, 582512, 252020, 212972, 332080, 492438, 298530, 454540, 232039, 628498, 348033, 224330, 718058, 122674, 233507, -50906, 350306, 441653, 49030, 246849, 357995, 571089, 13313, 236934, 228061, 460352, 132849, 225516, 236971, 548037, 403689, 327459, 321001, 322952, 490130, 532249, 94014, 659614, 520859, 76936, 253479, 215860, 793386, 630983, 367202, 670083, 97211, 322880, 247103, 406837, 69962, 214841, 500451, 256560, 525596, 470288, -5152, 133679, 490052]
16314D90052k8266J02515B22500Q4846J21391r2285L6267j55768D6401J50794
16304A97195L22791A64975K78777j48117j3658F2739J64346P7713j33159E1763
16293B10390E6772d931G4789M46748A65993M303m525L14210A91893P1146J81727
16282D44766G9042K08809J2282L0673A45693N6972A9685e4773q8076E4925J5805
16271G0730P364N17521G4945L29827j06707a4267A33613N0230B9861K25359j18058
16260A37162A1992Q6542Q305J8586M10047k00115a9423C06290q2289H9772g5662
16248A22843R1432H7128a34328F2964L82243j15874D9411c51974I0978N7693K5076
16237A73747R7278C9115K14145p1710R2013a06148A04477D4938c1845I5420i902
$$ y = [490052, 461786, 564301, 222500, 307346, 428737, 336452, 372719, 216951, 46401, 197195, 519986, 164975, 443752, 295635, 281977, 62739, 227085, 304798, 171639, 51763, 210390, 56772, -4931, 74789, 521537, 165993, 170296, 165771, 479981, 191893, 263039, 444766, 79042, 287851, 300133, 330806, 145693, 202665, 19685, -54773, -142849, 54925, 70730, 78094, 595615, 74945, 404772, 298065, -14267, 133613, 183843, 29861, 255220, 137162, 11992, 98534, 106839, 125425, 535472, 335357, -19423, 306290, 224001, 89772, -75662, 122843, 214275, 87128, -134328, 62964, 445207, 329333, 49411, -351974, 90978, 148671, 173747, 271025, 39115, 253260, 181550, 273563, -106148, 104477, 44938, -31845, 95420, -9902]
16225C00241H5553a32310j50576c820k5044j0008A48932o5890K77603A6962O3379
16214H0341d3093B16943m7344l6378P914j2155J7502c1346e242j18121B24221
16202H997L32436A22352J53818k1976j00142m3731J02977c29046E06015A32384
16191B45382K511I2930K38565C8998d2271C94706O6099a06058C76715r2906j15716
16180A68093J94572j29884M3166n0725G4407O2112H854J15756b97430A85800P4402
16169B60202G9264c54616A00461J46010h0192A63950Q4206F8082R4395Q7956H4791
16157C0276h1157D2090K34833G5086b46586A40948h0290B94838a91577A7925N9817
16146G7742a8565F1784e36l94k85484A09187Q5740a03949I0699a69965C09339
$$ y = [300241, 85553, -132310, -282886, -3820, -28864, -38872, 148932, 83042, 360645, 16962, 80341, -43093, 216943, 169599, 133221, 141135, 128980, 146482, -31346, -5242, -123363, 224221, 8997, 341433, 122352, 276170, 254194, 154052, 110321, 213298, -329046, 506015, 132384, 245382, 247893, 92930, 331495, 38998, -42271, 394706, 460805, -106058, 376715, 283809, 168093, 362665, 232781, 275947, 225222, 74407, 136519, 8854, 124610, -297430, 185800, 260202, 79264, -354616, 100461, 246471, -80192, 163950, 248156, 68082, 162477, 250433, 84791, 30276, -81157, 42090, 276923, 75086, -246586, 140948, -80290, 294838, -191577, 17925, 77742, -18565, 61784, -536, -930, -286414, 109187, 194927, -103949, 90699, -169965, 309339]
16134a20436e9995C64469j81403n1932D6906K23583B3344J26079n9410J41969
16124B31982b3827A85934N4537b65357N13A37335b04149h7312c3008j87469D89865
16112B2507J9448a7289k26755a4953B49581f6887g588r6008c8941A42049a99753
16100a07837C38410A58475K8483c7683C45761j35593a25742n9301N6482A79040
16089B88290b0256D912b29010E4889a18427E1191I760J50908b6716j5483C18890
16077e4787r3060R440A98904b24216E1141M9060N3879b62618j5036H2781g5328
16065a31375b3017j06671A07108J04270h2832B04468r4169a90938B99212L7777
16055C36989j48861i1890G4221O7039d15169d0559l35962I326a60248j01984a11189
$$ y = [-120436, -59995, 364469, 183066, 131134, 46906, 270489, 23344, 149423, 90013, 231982, -23827, 185934, 240471, -265357, -264844, 137335, -204149, -87312, -33008, -220477, 489865, 22507, 41955, -17289, -244044, -14953, 249581, -66887, -7588, -103596, -38941, 142049, -199753, -107837, 338410, 158475, 186958, -37683, 345761, 210168, -125742, -185043, -128561, 179040, 288290, -20256, 4912, -229010, 54889, -118427, 51191, 9760, 160668, -26716, -42199, 318890, -54787, -147847, -138407, 198904, -224216, 51141, 100201, 154080, -262618, -277654, 82781, -75328, -131375, -23017, -129688, 107108, 211378, -82832, 204468, 110299, -190938, 299212, 336989, 188128, -91890, 74221, 141260, -415169, -40559, -376521, 9326, -160248, -262232, -111189]
16043A6632J74124k7573a51950J8806L6212j83318g5554c7440a3020k2280G1200
16031A34020h0234k36383e266m64317a40654H2322a49945A37977g7368K4484A00095
16019g5114D00437E8548A4984e6105G8233L50831a98955h0096B05095a44779r407
16008a54186d6215Q26B12330c0541k08323A91806b43989B04772J03034H3919B1727
15996B11527m0593c64131I8965a13166D8795K23764I2438c5905A04026a90043
15985a203I2998k4908M4914K54887a88624D36652F0000b20690D9348c00525J27296
15974a73229N779B36834l9292L3004G2005b24291A1906K97083E4325b45776A62250
15962A71095E0629c01356I0711k3471b321A48764J28340F6231B0418K9304J01725
$$ y = [16632, 190756, 163183, -151950, -133144, -96932, -280250, -75554, -37440, -13020, -35300, 71200, 134020, -80234, -316617, -5266, -469583, -140654, 82322, -149945, 137977, -77368, -52884, 100095, -75114, 400437, 58548, 14984, -56105, 78233, 429064, -198955, -80096, 205095, -144779, -154186, -46215, -45389, 212330, -30541, -238864, 191806, -243989, 204772, 307806, 83919, 21727, 211527, 170934, -364131, 98965, -113166, 48795, 272559, 92438, -35905, 104026, -190043, -1203, 92998, 68090, 113004, 367891, -188624, 436652, 60000, -220690, 49348, -300525, -173229, -167450, 236834, 197542, 230546, 72005, -224291, 11906, 308989, 54325, -245776, 162250, 171095, 50629, -301356, 90711, 67240, -2321, 148764, 277104, 66231, 20418, 49722, 151447]
15951A51447a09014M8106A34838D5495a97511a0407j28986j40885B30348c13534
15940D322J73647b15487j32274a31314k90404B84593o0530I2647g0549A00450
15929i7915C5948a28171r2887A310b51050o042K2342G2754b71113O0003Q2366
15918a28744I8730a78352K4017r4992a5737m3009j10851l8875k71106h8384C2830
15906f3600H0419J15094k5732J56327a60335A84561a80138R863g1710B00837a8274
15894A22289M1779b38728k08981A96294m6844a04052B66809C9295J33395k2574
15884A50116f647A00968f1418B28654a19365A84833I0302d51922G1632f5325K1878
15873d3447j85086B60832b30891k7186G6070k871a91050e3474b741A92490H6704
$$ y = [151447, -109014, -60908, 134838, 45495, -197511, -10407, -139393, -280278, 230348, -313534, 4322, 177969, -215487, -347761, -131314, -421718, 284593, 224063, 92647, -70549, 100450, -97915, 35948, -128171, -221058, 1310, -251050, -257092, -234750, 72754, -271113, -211110, -128744, 98730, -178352, -154335, -249327, -15737, -58746, -169597, -208472, -479578, -88384, 32830, -63600, 80419, 195513, 169781, 326108, -160335, 184561, -180138, -170275, -71710, 200837, -18274, 122289, 164068, -238728, -447709, 196294, 149450, -104052, 266809, 39295, 172690, 150116, -6647, 100968, -61418, 228654, -119365, 184833, 90302, -451922, 71632, -65325, -43447, -228533, 260832, -230891, -258077, 76070, 73199, -191050, -53474, -2741, 192490, 86704]
15861i0930M2434p3837i106C0852J2621a43008l3824k48475a6458A11804a24064
15849g486l52234C72767E1620L8188h4997A1707i4181A91620q6807a54895C9009
15837E7501L4429D4918b63051N3386B17902A819a94294R4924d2565A46048F0378
15825G7878N7717L3992b73312A40162b92650l4423P8263C05210o1156e9001k09600
15814b68601O3701B64157b24103Q3802C4266b26787F8929g09r8403r9924f5442
15802G5260c2894q8617H5540a53451B37517P0530a26311j48516D9573O2773D7083
15790D6440a70942o1308k94289K58799B14174a95853B5700e89519b12291A57080
15779G2749d06594A25377a71986C9344J44184a08792D05J77364o8204M08697a25831
$$ y = [-90930, -48496, -122333, -9106, 30852, 43473, -143008, -176832, -425307, -16458, 111804, -124064, -7486, -359720, 372767, 51620, 89808, -84997, 11707, -94181, 191620, 104813, -154895, 39009, 57501, 91930, 44918, -263051, -209665, 217902, 1819, -194294, -99370, -42565, 146048, 60378, 77878, 135595, 169587, -273312, 140162, -292650, -327073, -248810, 305210, 244054, -59001, -268601, -204900, 264157, -224103, -140301, 34266, -226787, 68929, -709, -99112, -199036, -65442, 75260, -32894, -121511, 85540, -153451, 237517, 308047, -126311, -274827, 49573, 112346, 47083, 46440, -170942, -232250, -526539, -267740, 214174, -195853, 25700, -589519, -212291, 157080, 72749, -406594, 125377, -171986, 39344, 183528, -108792, 405, 177769, 109565, 518262, -125831]
15767e0671l01228k6740b0189b169k9413B95487c4247o70933b56178i7243k896
15756a00139C0102i9645d4170I8361m3403b43331k5199R7792C0479J68694b76240
15744b82442e3021B64563q5101f2982j66368A35355d06955a20322k0965j54509
15734b95796B06513a65187B08766a25190o4538F0596a08357q0860L6191c1176
15723f9798m80140e4827a1016q412k32436B00241D6333J53203d44555f6316o9983
15712a36299e4356J3102A22281l1670C8740K45296e2583N942k22937J20406g2826
15700h1039l34528A05869h8203j1367b8338k46747A58106b41114B66951a52385
15689D0165e83938B19900a88365E1249a22919d4135B6839J09633a11734B23883
$$ y = [-50671, -351899, -378639, -20189, -2169, -31582, 295487, -34247, -705180, -256178, -97243, -100139, 30102, -99645, -44170, 98361, 54958, -243331, -268530, -170738, 30479, 199173, -276240, -282442, -53021, 264563, 179462, -62982, -229350, 135355, -406955, -120322, -141287, -295796, 206513, -165187, 208766, -125190, -189728, 60596, -108357, -189217, -153026, -31176, -69798, -549938, -54827, -11016, -19428, -251864, 200241, 46333, 199536, -444555, -66316, -136299, -54356, -41254, 122281, 90611, 38740, 284036, -52583, -46641, -269578, -149172, -72826, -81039, -415567, 105869, -88203, -99570, -28338, -275085, 158106, -241114, 266951, -152385, 40165, -583938, 219900, -188365, 51249, -122919, -44135, 26839, 136472, -111734, 223883]
15678a0622j99475i2657j21811m3283E9684a02018B6998f2341l5664F9325h9735
15666G5136N3294a81939k1327a4605B59845a59580B50297a89270A13014K89648
15656D02662c43560D10080A35183b41131A2524c49569a39311A027M80711H573
15645A61966b04319d5166B77628A23151c67568G4488b96256h7227K8059B52923
15634A34883D9190b35507i4069A51279B1640J37755l1017L3742c5884A31178d39029
15622c6094m7938j04442a8400k52173A24773A6585L53870A42994m5480a46900
15611A78753Q777m7275b70988g7286A15014i0426A1176K10916F1472b9373K054
15600b7319k64978a42859B25240k4391j5759b06482K2528o318r4142a3992A54961
$$ y = [-10622, -210097, -92657, -214468, -257751, 59684, -102018, 26998, -62341, -98005, 69325, -89735, 75136, 128430, -181939, -203266, -14605, 259845, -159580, 250297, -189270, 113014, 402662, -343560, 410080, 135183, -241131, 12524, -349569, -139311, 1027, 481738, 8573, 161966, -204319, -45166, 277628, 123151, -367568, 74488, -296256, -87227, -59168, 252923, 134883, 49190, -235507, -94069, 151279, 21640, 159395, 128378, 162120, -35884, 131178, -439029, -36094, -84032, -188474, -18400, -270573, 124773, 16585, 370455, 142994, 97514, -146900, 178753, 187530, 140255, -270988, -77286, 115014, -90426, 11176, 222092, 61472, -29373, -27319, -292297, -142859, 225240, 200849, 185090, -206482, -183954, -190272, -284414, -13992, 154961]
15588a47682A70741n6248K28793c17518D7457b30225a02134B76774c0281j1596
15578d1877A07087a72686h1494j75155e3982F6267M7612a18860e8586E01118e591
15566C26522A56925e8772p6679e9333A91946b33112h3447B9648J71253b16176
15555B98295C3361c13856J03745j46421a36949A47863L2208a86616E9020i2728
15544a20324k53740F4674P0277a98334b9573q3139A77031a15068A97170I8202
15533A22673J55601K4026C2274a46242o2313P2986H9352e2591D0499a6939C49727
15521g7307j21393B45767A14341b87328A3375a00762c714A40789R7380a77609
15510C03532j44323a48477A06175d70524I4404a26288k32619D17595a42205A62544
$$ y = [-147682, 170741, 114493, 343286, -317518, 47457, -230225, -102134, 276774, -30281, -41877, 107087, -172686, -81494, -256649, -53982, 66267, 113879, -118860, -58586, 501118, -5591, 326522, 156925, -58772, -135451, -59333, 191946, -233112, -83447, 29648, 200901, -216176, 298295, 33361, -313856, -210111, -356532, -136949, 147863, 180071, -186616, 59020, -92728, -120324, -374064, 64674, 134951, -198334, -29573, -112712, 177031, -115068, 197170, 98202, 122673, 278274, 302300, 32274, -146242, -208555, -135569, 89352, -52591, 40499, -16939, 349727, -77307, -198700, 245767, 114341, -287328, 13375, -100762, -3714, 140789, 238169, -177609, 303532, 159209, -148477, 106175, -470524, 94404, -126288, -358907, 417595, -142205, 162544]
15499e3696H7856k6343a53510b2512k09650j3793f8417A21190g0898r0495r7740
15488b59133N0528j4556r7692e7860k8271m2231A73245m4041L1571k631O517N3296
15476B17957i1097j15907D34059G8304a76678a9268j19803b1073k92046B43986
15465I5680i3237B28648a38927B07368l7324b19478C66073F4169K519g9440E2618
15453b42350A28725b39285Q6610A7215b26169j39295a38277f4770C06d1298D1557
15441b71820A81240j930H1361d6532B7285b86611A00429Q020D625b55448d533
15429A25539L8377b64152g7410p8260D8266k0538a17729G2287b81955a38236f4829
15417a32059C8602a16684b0484A230b4506l70670b1848C46680A44750b42869G6749
$$ y = [-53696, 87856, 61513, -153510, -22512, -232162, -245955, -68417, 121190, -70898, -161393, -259133, -208605, -223161, -320853, -57860, -86131, -128362, 173245, 129204, 160775, 158144, 164661, 217957, -91097, -207004, 434059, 78304, -176678, -19268, -139071, -21073, -313119, 243986, 95680, -93237, 228648, -138927, 207368, 170044, -219478, 366073, 64169, 66688, -79440, 52618, -242350, 128725, -239285, -152675, 17215, -226169, -365464, -138277, -64770, 306, -41298, 41557, -271820, 181240, 179310, 81361, -46532, 27285, -286611, 100429, 108449, 4625, -255448, -4533, 125539, 163916, -264152, -77410, -155670, 48266, 27728, -117729, 72287, -281955, -138236, -64829, -132059, 38602, -116684, -20484, 1230, -24506, -395176, -21848, 346680, 144750, -242869, 76749]
15405c2121A88318c0173l39062G6401J42305o4249i920r6551a6371j77948c1124
15393d11450A21867J75306b27526P1460E3208M6016a61608A34950a82978B3548
15382a41848J1802B65116a46928C53437j57876f8396C81333A07599A7254c44576
15371B1646b68890B8411N314J77633o9342d9451H4234a29355A98962D1610d35279
15359g2734A78940q2619m2784d2444H9792a08103B14487I4565c93A71461b05176
15347h6320C9817j473f3974b0649C56359d15973a91553h4028F1917c7575A50531
15335c01428f4630B12g3236r6704D04747c64863a44207B55997a13599C6650P8470
15324A15120B9169J25904J17186n8179e1020j45700l6442C49476j62774d205n8351
$$ y = [-32121, 188318, -30173, -369235, 76401, 218706, 154457, -9920, -106471, -16371, -194319, -31124, -411450, 121867, 297173, -227526, -156066, 53208, 99224, -161608, 134950, -182978, 23548, -141848, -130046, 265116, -146928, 353437, 195561, -68396, 381333, 107599, 17254, -344576, 21646, -268890, 28411, 33725, 211358, 142016, -49451, 84234, -129355, 198962, 41610, -435279, -72734, 178940, 96321, 53537, -42444, 89792, -108103, 214487, 94565, -393, 171461, -205176, -86320, 39817, 38344, -63974, -20649, 356359, -415973, -191553, -84028, 61917, -37575, 150531, -301428, -64630, 212, -73236, -169940, 404747, -364863, -144207, 255997, -113599, 36650, 115120, 29169, 155073, 272259, 214080, -51020, -196720, -233162, 349476, 186702, -4205, -62556]
15313f2556j6477m2359C5214a97931H1477b82411B255L9900O1563L9221a08538
15301a47530k44804b5611n3300A7K99790I9345a44333a1450A10980a03483C7400
15289c7473a3518B70698b05039e3927B8287A4003h4080E9804c380A01087A590
15277E2333J9219j6085d48828A26842c23036B94469a59248A07066i9469b8728
15266A9904P0134J45921a47198A78937R39K6574a67186q6398i0658q5381p743
15255a83782A98431b3494A47211b2276C65734A62754K26599A34866c83895C89536
15244A53158b222D29035g471q1650H1592c91719b30j79397C0986f9339o0040F2782
15231B86938i7858A11976L9736R2485b18471j1939d631I5639J3180m6793b32192
$$ y = [-62556, -79033, -121392, 35214, -197931, 81477, -282411, 2255, 42155, 103718, 142939, -108538, -147530, -392334, -25611, -78911, 17, 299807, 99345, -144333, -11450, 110980, -103483, 37400, -37473, -13518, 270698, -205039, -53927, 28287, 14003, -84080, 59804, -3380, 101087, 1590, 52333, 71552, 55467, -448828, 126842, -323036, 294469, -159248, 107066, -99469, -28728, 19904, 90038, 235959, -147198, 178937, 179876, 206450, -167186, -253584, -90658, -176039, -183782, 198431, -23494, 147211, -22276, 365734, 162754, 389353, 134866, -383895, 389536, 153158, -2222, 429035, -7471, -89121, 81592, -391719, -230, -179627, 30986, -69339, -129379, 62782, 286938, -97858, 111976, 151712, 244197, -218471, -230410, -4631, 95639, 108819, 62026, -232192]
15219B62085R9416b79854D05592o4071A25774Q2360a17285l6837B00104K5457
15209B25561a6087j8708A4307L67019j1985a38454l99137B21243k548d5971G9447
15197F0389J8156C8610R8297k9724J7197N6145P7458a82826L2231O0184p4500
15186a64911F9517b67503f9345o8103C37629b8164B04421b4912j76812A50298
15175f4662B47573K0801J8400F8917J57372J3949f0684b3099k8771J6956k1211
15164e6125k38996C06422H5424Q5480e4662A74925L0807O9872p4038o2094N7698
15153A97170N1634a64354A66650k8739O1421K03157j36289m4729a47991C13877
15142B72464j05254b75813g2076b0212A3937f9220g262C22501d6590D7328K1677
$$ y = [262085, 361501, -279854, 405592, 341521, 125774, 208134, -117285, -154122, 200104, 225561, -16087, -34795, 14307, 381326, 369341, -138454, -537591, 221243, 218695, -45971, 79447, 60389, 78545, 38610, 136907, 107183, 124380, 180525, 257983, -182826, -150595, -90411, -164911, 69517, -267503, -69345, -137448, 337629, -28164, 204421, -24912, -201724, 150298, -64662, 247573, 268374, 286774, 68917, 226289, 240238, -60684, -23099, -51870, -34914, -56125, -295121, 306422, 85424, 170904, -54662, 174925, 205732, 275604, 201566, 139472, 197170, 248804, -164354, 166650, 137911, 199332, 402489, 266200, 221471, -147991, 313877, 272464, 167210, -275813, -72076, -20212, 13937, -69220, -7262, 322501, -46590, 47328, 69005]
15131F9005a14740J8404F3817f9926o087F9700J26951J90667j16081a36384B93175
15119h476l2134B63535a58269K2071E5478a08264A87905L1533H8878K51064E3053
15107a74175A01928K7860R1145a28940C26334a23571A01804K8043J82963a1399
15096D0992J21081k2353J1458k5493m3709K75607J5612f0676A76961J54313a15648
15084a4297j4745B5212K05892i7122A82467E9981J13552J24915b58069f4613B41244
15072F7771a0487j33701B82130P3562C9733i3724B08687G1274L13699c1674G475
15060B28961l4194G8737P9175G8879K00375K26019j34953c67866A08231J04949
15050B13180j03187d7384I7983O1130Q5827D838J73695J15788G4925O4492J65766
$$ y = [69005, -114740, -96336, 63817, -69926, -76013, 69700, 196651, 387318, 271237, -136384, 293175, -8476, -40610, 263535, -158269, -136198, 55478, -108264, 187905, 219438, 88878, 339942, 53053, -174175, 101928, 129788, 220933, -128940, 326334, -123571, 101804, 129847, 312810, -11399, 40992, 162073, 139720, 151178, 125685, 81976, 357583, 373195, -60676, 176961, 331274, -115648, -14297, -29042, 25212, 231104, -97122, 182467, 59981, 173533, 298448, -258069, -64613, 241244, 67771, -10487, -144188, 282130, 355692, 39733, -93724, 208687, 71274, 384973, -31674, 7475, 228961, 194767, 78737, 157912, 78879, 279254, 505273, 370320, -367866, 108231, 213180, 109993, -47384, 97983, 159113, 244940, 4838, 178533, 294321, 74925, 139417, 305183]
15039C05183a58622A69527P755L35918A92752a08575B46621a01428j09433B70578
15028B37403N1648A10849J02555r4333b4593C76437m8121d962A01464B6765J64822
15017A91587J90961I184M69204A74980M9544b63966D06081j97875k9647G0502
15006B25882g9488N848B62851D6434j8745L08436m0166C6582L86102j42750I9478
14994B2967K83740o3318j03639n1579J3247O6178G1408K49945G2450K0509J93060
14983B86019l4097O6826A8113L5505J13944J00160k6491q4391a01194m0674B97526
14971A59289M1685p7820R5969n5100b01485A98358b227D22902A54415N6769C2148
14959D11861j47495J6722A19990K7758L86112a62183C08310J63329B03110a06565
$$ y = [305183, -158622, 169527, 177282, 513200, 192752, -108575, 246621, -101428, -210861, 270578, 237403, 289051, 110849, 213404, 119071, -24593, 376437, 328316, -4962, 101464, 26765, 191587, 382548, 9184, 478388, 174980, 224524, -263966, 406081, 208206, 178559, 70502, 225882, -79488, -73640, 262851, 46434, 27689, 336125, 295959, 36582, 422684, 279934, 99478, 22967, 306707, 243389, 139750, 88171, 101418, 167596, 71408, 321353, 72450, 92959, 286019, 251922, 318748, 18113, 53618, 167562, 267722, 241231, 156840, -101194, -141868, 297526, 159289, 200974, 123154, 219123, 164023, -201485, 198358, -2227, 422902, 154415, 211184, 32148, 411861, 264366, 281088, 119990, 147748, 533860, -162183, 308310, 471639, 203110, -106565]
14948A61099K30562A69969d309I8064K63761A30278J66300Q0348A60183J61603
14938C21786O8993j79586J4345r1209K48873j82571n0363O5221J42343A51015
14927B74112q8583J79154K6796j89193K14594K0668j31506n4163J83001J07632
14917E42512o0196k34382A09803m6348L9128O3155J037k6930k3112N04402A88502
14905C97487n0528P8949j31314K5242q7776j9G6630L53202A3538J15921j3463
14894A15996l9237N16517D285L96330h5004D72196H3798O0244J30818L79031k63649
14883C90242j38259M6448L4847j40900J92924J73286k52436K29821B31587l1941
14873A99646j927L57713O5010j88384j12065o3629A23348M50422p8078B40535
$$ y = [161099, 391661, 169969, -4309, 98064, 361825, 130278, 296578, 376926, 160183, 321786, 390779, 211193, 225538, 134329, 383202, 200631, 150268, 215489, 357832, 151015, 274112, 185529, 364683, 391479, 202286, 416880, 437548, 306042, 251879, 434880, 542512, 482316, 247934, 109803, 63455, 102583, 165738, 166775, 139845, 116733, 621135, 188502, 397487, 346959, 425908, 294594, 319836, 232060, 232041, 76630, 429832, 13538, 129459, 115996, 76759, 593276, 4285, 400615, -85004, 472196, 83798, 144042, 274860, 653891, 390242, 251983, 298431, 333278, 192378, 385302, 558588, 306152, 535973, 231587, 199646, 197719, 555432, 620442, 432058, 319993, 256364, 123348, 573770, 495692, 240535]
14862B21355K7095J400J72414M6234r1523o0128M1125l8540M50612B72196p7806
14851A94390L34510Q9674k88785K50551A49107M1021J99996P2644n321k19348
14841B38099O85061C41066J34108q1892j7585J99083H0548K19731j32238K36768
14831D04809A82123M21525k11729o6194J78742K9038j86539J18699Q532A54354
14820C85806k8233Q918j49948K81373B23755L96476k75659J96111o7364l0717
14810D42602A42570L00960o6100j23816O9438J47859j17669K66261J56987E0340
14799G03486B78386R0281K70274A55865N38390C01294L72117k55240K84131l02250
14789D00052p4766M32553k49384K93483k86192Q705k3889N652A09722m0988J76625
$$ y = [221355, 248450, 249850, 422264, 468498, 376975, 316847, 357972, 319432, 770044, 272196, 194390, 528900, 618574, 329789, 580340, 149107, 190128, 390124, 462768, 457447, 238099, 923160, 341066, 475174, 393282, 375697, 574780, 80548, 300279, 168041, 404809, 182123, 603648, 391919, 325725, 504467, 533505, 346966, 465665, 474197, 154354, 385806, 357573, 366491, 216543, 497916, 223755, 620231, 344572, 540683, 473319, 442602, 142570, 443530, 377430, 253614, 323052, 470911, 353242, 619503, 776490, 50340, 703486, 278386, 368667, 638941, 155865, 694255, 301294, 673411, 418171, 702302, 400052, 325286, 757839, 508455, 801938, 515746, 524451, 500562, 506214, 109722, 68734, 245359]
14778B45359r318M86060l59189K09067K10142k31559J81023k35153J27790K18396
14768H42618l16375O2990A25077P21374B96076K97680O9181j60255J01553j86666
14758D17569J90200R9312k95781J3215L53619N1733C03120J77340L4039R0025
14748F04524O6897J1378J26979k28971J09753J69451B72085L36110J25658P8038
14738H11891j86619j90271L89382B65762N4905L20053J01111N0972B91512L20495
14728F12007J97402l1847j69113j22343O3973O1406j02578J17735P4866j58658
14718E42850J09041C18999O10078k28617N2440j34545J17570j40824K34087q1348
14708G47840k5095J14278L94040m74816j25715J78336k75430L79938m00221K25725
$$ y = [245359, 236041, 722101, 362912, 571979, 782121, 550562, 731585, 496432, 624222, 842618, 526243, 589233, 125077, 846451, 296076, 593756, 662937, 502682, 604235, 417569, 607769, 707081, 411300, 424515, 778134, 829867, 303120, 480460, 514499, 604524, 671421, 682799, 809778, 580807, 690560, 860011, 272085, 608195, 733853, 811891, 625272, 435001, 824383, 265762, 320667, 640720, 741831, 792803, 291512, 612007, 809409, 777562, 608449, 486106, 550079, 611485, 508907, 626642, 701508, 542850, 651891, 318999, 929077, 700460, 752900, 618355, 735925, 595101, 829188, 747840, 722745, 837023, 1231063, 756247, 630532, 808868, 533438, 913376, 513155, 738880]
14698G38880l00533m9379Q13267l08166k56374j53809J56324j9352L40856j73177
14688G88537M01836E62650R9565J7351n1285L12957M10987m53762j23284L15238
14678A090417o5904j20419r6036l22294M61620l66118K36552k62948R8541K72323
14668I25734K03796j89529L3646N5246N8849q2296l04183K26830J87708k78181
14658H37620K44970j87685L534J99204j74395N2931j6705L9360j72087N9090J400
14647H87237j33090J70836q3696p8768L75815l8171k48894J73542J19542l1140
14637A113213J00107r053o5323R1032K46353o71000N01266k52960Q308J86126
14627A248069J14515j61462k33383K33204L1724O4351j11391J19717l31304P88880
$$ y = [738880, 438347, 388968, 1202235, 894069, 637695, 483886, 640210, 620858, 961714, 788537, 1190373, 562650, 662215, 679566, 628281, 941238, 1352225, 898463, 775179, 1090417, 1024513, 904094, 808058, 485764, 947384, 581266, 817818, 554870, 653411, 925734, 1129530, 940001, 973647, 1028893, 1087742, 1005446, 701263, 928093, 1115801, 837620, 1082590, 894905, 898439, 1097643, 923248, 976179, 959474, 998834, 826747, 885837, 887237, 754147, 924983, 841287, 762519, 1138334, 1100163, 851269, 1024811, 1144353, 1113213, 1213320, 1204267, 1138944, 1229976, 1476329, 805329, 1306595, 1053635, 1061943, 1248069, 1362584, 1201122, 967739, 1200943, 1232667, 1297018, 1185627, 1305344, 974040, 1762920]
14617A762920j60625l59133J22866j7526N709L02888l15858j25889J25143k83359
14607A057136L65759J34984j17398j7302N9528p5135n9210J4334q4970K24733
14597A502459j12062n1180R379J81181j48842J95773p1789j01658j40710R7957
14587A360508K78673K4182J49946L4520k59176J86123J14041k42481J61071m2768
14577A764639J56028M9211k19327L27068k31425k12825L10872j92874K99786p4600
14567A976553O9208j55076J2228J39746l54290M63830j64668K87829J89289K76056
14557B740705p3212p7207K10943J05452L40907M14305Q06084Q12645J737654L453093
14547A0471369O932263J6329533R576706A9633797G974136l596223j248249o82784
$$ y = [1762920, 1602295, 1243162, 1366028, 1348502, 1354211, 1657099, 1341241, 1215352, 1340495, 1057136, 1422895, 1557879, 1440481, 1423179, 1482707, 1407572, 1348362, 1362696, 1277726, 1502459, 1390397, 1339217, 1348596, 1529777, 1380935, 1576708, 1504919, 1403261, 1262551, 1360508, 1639181, 1663363, 1813309, 1847829, 1588653, 1774776, 1888817, 1646336, 1807407, 1764639, 1920667, 1969878, 1750551, 2077619, 1846194, 1633369, 1944241, 1751367, 2051153, 1976553, 2045761, 1890685, 1902913, 2042659, 1688369, 2152199, 1987531, 2275360, 2464649, 2740705, 2667493, 2590286, 2801229, 2906681, 3247588, 3661893, 4467977, 5280622, 7018276, 10471369, 17403632, 33733165, 43309871, 19633797, 7974136, 4377913, 3129664, 2446880]
14539B446880n07286j26480K55013l37831O2034J45298j86052L19527l94454J41898
14529A818547n9036L64729k26193K58605j42986q5429o789q9300K74494L8867
14519B145509K29967j60061K5573Q7306m7562N46004m88243k50339K92947Q3719
14509B464820J31276j89910O9050J15707k37699R5390J60439J49912k55833K86389
14499B789541j29039k36990M32178l1818K74006l03884K91478j68961k6045P9398
14489B969864r0828J4425N7555J46595K34422L3461l8897k35076J35217J07849
14479C334587J38446k88089L01803K8077j18725J57057L5059J12669K81158l66347
14469C615695L41216K19311k63040l34701M81080O4105k26170J34938Q7214J0919
$$ y = [2446880, 1939594, 1813114, 2068127, 1730296, 1792330, 1937628, 1751576, 2071103, 1676649, 1818547, 1759511, 2124240, 1898047, 2156652, 2013666, 1928237, 1921448, 1832148, 2106642, 2145509, 2375476, 2215415, 2240988, 2328294, 2280732, 2826736, 2338493, 2088154, 2381101, 2464820, 2596096, 2406186, 2475236, 2590943, 2353244, 2448634, 2609073, 2758985, 2503152, 2789541, 2660502, 2423512, 2855690, 2823872, 3097878, 2793994, 3085472, 2916511, 2890466, 2969864, 2879036, 2893461, 2951016, 3097611, 3332033, 3365494, 3326597, 3091521, 3226738, 3334587, 3473033, 3184944, 3486747, 3514824, 3396099, 3553156, 3588215, 3700884, 3982042, 3615695, 3956911, 4176222, 3913182, 3578481, 4059561, 4123666, 3897496, 4032434, 4119648, 4130567]
14459D130567M09555l28634n713J74403J73372k24679J50232N82K51807m7915
14449D683577J95741m3523j6007J04556J31199K71077l78232L06330k80176M49007
14439E423549J76135j53097K33094j12764J22690j90310J21543M73611o5164J10755
14429F140042J78758j24190M2880O8620L22135J7516N9838N3838j27078R2176
14419F724535K73879K2983K84796J97602p774L79204n35945O06115j59178L02271
14409H088488j1786K28698J11061l1488K64191K25781R9257M9560J16689R5572
14399I236023J42688M13154o5270K27135M28307l68000L22770L66760q7865K07253
14389A0822955M00006J73458K66648j29808O67201r4572L62230K71529K10763
$$ y = [4130567, 4540122, 4211488, 4205775, 4380178, 4553550, 4328871, 4479103, 4479685, 4731492, 4683577, 4879318, 4835795, 4819788, 4924344, 5055543, 5326620, 4948388, 5254718, 4974542, 5423549, 5599684, 5446587, 5679681, 5566917, 5689607, 5499297, 5620840, 6094451, 6029287, 6140042, 6318800, 6194610, 6237490, 6306110, 6628245, 6645761, 6705599, 6759437, 6632359, 6724535, 6998414, 7021397, 7306193, 7503795, 7496021, 7875225, 7339280, 7945395, 7786217, 8088488, 8076702, 8305400, 8416461, 8384973, 8649164, 8874945, 8974202, 9023762, 9140451, 9236023, 9378711, 9791865, 9726595, 9953730, 10382037, 10014037, 10336807, 10703567, 10615702, 10822955, 11222961, 11396419, 11663067, 11533259, 12200460, 12105888, 12468118, 12739647, 12950410]
14380A2950410L0060K05668K59242O8182P38272j99989N33451M21950L10472p5749
14370A5241969L22779L05841M47556J58719L14018M02568O57134K65297J67673
14361A8283554O51523L13234J76472O31473L43896M50121L37645N07773O79495
14352B2375186M85724Q27508M13521K68087R84430N95888O17102O23171N71490
14343B7762107P86693Q43014L43277J409537O05856J048926P59978J070318N42398
14334C5172104J229580J312348J059473J364417J200397J185340J177853J540859
14326D5242371J387570J428888J813712J797379K065896J498828J960472K170176
14318E9365292K157417J865526K664061K530188K533257L008307L035311L056091
$$ y = [12950410, 12980470, 13186138, 13445380, 13513562, 14251834, 14051845, 14585296, 15007246, 15317718, 15241969, 15564748, 15870589, 16318145, 16476864, 16790882, 17193450, 17850584, 18115881, 18283554, 18935077, 19248311, 19424783, 20056256, 20400152, 20850273, 21187918, 21695691, 22375186, 22860910, 23688418, 24101939, 24370026, 25354456, 25950344, 26567446, 27190617, 27762107, 28548800, 29391814, 29735091, 31144628, 31750484, 32799410, 33559388, 34629706, 35172104, 36401684, 37714032, 38773505, 40137922, 41338319, 42523659, 43701512, 45242371, 46629941, 48058829, 49872541, 51669920, 53735816, 55234644, 57195116, 59365292, 61522709, 63388235, 66052296, 68582484, 71115741, 74124048, 77159359, 80215450]
14310H0215450L297311L645837L463454L944271M389161M658470M719428M844097
14302A13177479N595020N931590N484641O826249P072216P123967P800080Q291821
14294A67303063R119973R349481R994505J0793584J1190873J2134577J2611981
14287B42498037J3728589J4047438J4730487J4964026J5822948J6619160J6648309
14280C49058994J6702303J6258317J5826019J4986520J4132793J2590460J1488245
14273D51043651P925429M739375K307722J707958J304135k218850l417136o484210
14265D56908074q949734j1076411j3058063j4303803j5849897j6336023j6654385
14258C60679758j6864042j6274047j6428175j5699789j5203020j4455128j4323671
$$ y = [80215450, 83512761, 87158598, 90622052, 94566323, 98955484, 103613954, 108333382, 113177479, 118772499, 124704089, 130188730, 137014979, 144087195, 151211162, 159011242, 167303063, 176423036, 185772517, 195767022, 206560606, 217751479, 229886056, 242498037, 256226626, 270274064, 285004551, 299968577, 315791525, 332410685, 349058994, 365761297, 382019614, 397845633, 412832153, 426964946, 439555406, 451043651, 458969080, 463708455, 466016177, 467724135, 469028270, 466809420, 463392284, 456908074, 447958340, 436881929, 423823866, 409520063, 393670166, 377334143, 360679758, 343815716, 327541669, 311113494, 295413705, 280210685, 265755557, 251431886]
14251B51431886j3011853j2655992j1773704j1044970j0691260r775194r504595
14244A72974318q065635q562104p505985p383459o911885n988845n875957n505917
14236A17174531n567043m651417n194083m220722l979383l519288l650309l672396
14228H2719890l243519l208654k943891k932944k693374k507146k395926k110592
14220F0683844j849927j866057k286676j995450j978929j427503j620890r64337
14212D6694075j575781j948219j202331j394623n09541n33859j487067j114880
14204C6927774j749510j038466q11043p33472j38566j206581q10037j298606m44314
14195B8697179o67924m81171j001051l94917j249010r5320j075655o69258l07848
$$ y = [251431886, 238420033, 225764041, 213990337, 202945367, 192254107, 182478913, 172974318, 164908683, 156346579, 148840594, 141457135, 134545250, 128556405, 122680448, 117174531, 111607488, 106956071, 101761988, 97541266, 93561883, 90042595, 86392286, 82719890, 79476371, 76267717, 73323826, 70390882, 67697508, 65190362, 62794436, 60683844, 58833917, 56967860, 54681184, 52685734, 50706805, 49279302, 47658412, 46694075, 45118294, 43170075, 41967744, 40573121, 40063580, 39529721, 38042654, 36927774, 35178264, 34139798, 33328755, 32595283, 32456717, 31250136, 30440099, 29141493, 28697179, 28029255, 27548084, 26547033, 26152116, 24903106, 24807786, 23732131, 23062873, 22755025]
14186B2755025n78826n56518n55622n55198l1336n27646o20663l99916m20143
14177A8509157k73347n86466p8195p83181j96665j77561k23147l72138n52889
14168A5265568k13689m24308N2981j66995l78358p27828k22306n2296j13214N3593
14158A3073148o84049m8644o72864L18841l20647q0570m85086l27469J91200o2150
14148A0901710m31049l99568M12104l90322j11363k22411J37139m73938O6555
14139I488857j79290k16580k58086k47736j75892j48636L06931m67810L07112
14130H408870n4086o20508K38108j60237j04356L1706n10026J20774n5650l80414
14120F914181j34129K73196k92942J3635k41913K3737j06294K9339J8239Q7352
$$ y = [22755025, 22176199, 21619681, 21064059, 20508861, 20477525, 19949879, 19329216, 18929300, 18509157, 18235810, 17649344, 17571149, 16787968, 16591303, 16413742, 16190595, 15818457, 15265568, 15051879, 14627571, 14680552, 14513557, 14135199, 13407371, 13185065, 13132769, 13019555, 13073148, 12389099, 12340455, 11667591, 11986432, 11665785, 11585215, 11100129, 10772660, 10963860, 10901710, 10470661, 10071093, 10483197, 10092875, 9981512, 9759101, 9896240, 9422302, 9488857, 9309567, 9092987, 8834901, 8587165, 8411273, 8262637, 8569568, 8101758, 8408870, 8354784, 7734276, 7972384, 7812147, 7707791, 7739497, 7229471, 7350245, 7294595, 6914181, 6780052, 7053248, 6760306, 6773941, 6532028, 6555765, 6449471, 6478810, 6497049, 6584401]
14110F584401l27693j00635o5693j46253K0885q5133o3981k77730N9413K89937
14100E887518k35174j77801k32k12987j22414J49868k39829L4923l9394n06948
14090D537530N38571l74081K38840k73825m45216M62871J71478k15086l32002
14081D309080J68216J1404j01134j42664L8994J65827k01589N2140m40781N44260
14071D403753k66426J43432p09388O3446L08173k2105M6135l09295m7889O5512
14061C675348n733m4027L05318k28202k42845o1964j46588L57849o02425M86379
14051C493110m0502L9598m3646l43668J8882N2866l7645j79876J26762k93914
14041B791967K72239j42780L99192m96480j82496J50787r3360K57483k03664O3620
$$ y = [6584401, 6256708, 6156073, 6090380, 5944127, 5965012, 5879879, 5815898, 5538168, 5597581, 5887518, 5652344, 5474543, 5474311, 5261324, 5138910, 5288778, 5048949, 5083872, 5044478, 4537530, 5076101, 4702020, 4940860, 4667035, 4221819, 4684690, 4856168, 4641082, 4309080, 4477296, 4488700, 4387566, 4244902, 4283896, 4449723, 4248134, 4300274, 3859493, 4403753, 4137327, 4280759, 3571371, 3634817, 3942990, 3920885, 3967020, 3657725, 3609836, 3675348, 3669615, 3625588, 3930906, 3702704, 3459859, 3397895, 3251307, 3609156, 3006731, 3493110, 3452608, 3492206, 3448560, 3104892, 3123774, 3176640, 3138995, 2959119, 3085881, 2791967, 3064206, 2921426, 3320618, 2824138, 2641642, 2792429, 2699069, 2956552, 2752888, 2816508]
14031B816508j65165q2584o2781Q2583J63883l1302r4289l35896K45887j67185
14021B369659L43750l41220k03082L26856k33590k72454K71652j8671L07216k91315
14011B258801j75022K84152j80265Q7890k96304K17528k83673K53040k16912J06605
14001B055840j24455L69999l30293L31420l98152k63956J88288N8042Q7999k69848
13991A704884P04556M31220O04516K472007O635046J6134562J6295458j9378268
13983B5603981j2710995m947357k257359j342943m55811m15425m85005J18128
13975C107214j56417l91735K08522m30003J81341l90331j39651J8581j3976P0132
13965B063677J51046j24205k37422K45010l8903r2706K22497l52520j91168L01696
$$ y = [2816508, 2651343, 2568759, 2505978, 2588561, 2752444, 2721142, 2626853, 2290957, 2536844, 2369659, 2713409, 2372189, 2169107, 2495963, 2262373, 1989919, 2261571, 2242900, 2550116, 2258801, 2083779, 2367931, 2187666, 2275556, 1979252, 2196780, 1913107, 2166147, 1949235, 2055840, 1931385, 2301384, 1971091, 2302511, 1904359, 1640403, 1828691, 1886733, 1974732, 1704884, 2409440, 2840660, 3445176, 5917183, 12552229, 28686791, 44982249, 25603981, 12892986, 7945629, 5688270, 4345327, 3889516, 3474091, 2989086, 3107214, 2950797, 2559062, 2767584, 2337581, 2518922, 2128591, 1988940, 2007521, 1993545, 2063677, 2214723, 2090518, 1853096, 2098106, 2059203, 1966497, 2188994, 1836474, 1645306, 1947002]
13955A947002j85519l85156L15169L5469L56061m74601L19886k61790m8918k85100
13945A332503M10040l14463J60599j22619j2718K57479j08643R1157O6171n97190
13935A162316L79338M378K19989j11873j26770n58546O28471k29194J57202j34329
13925A390982j7228J18726l7564j32123j34347k0482K65518m7769k63769p32L14903
13914A436115o7224N0090l04534J47328j08308L03330n40280L7877J67861p3214
13904A049041L61481n29958M45913j04237J8059R6312j13003p3683L2003j45500
13894A036428J39124R751j31618J20186R9985j30391k10966Q2739R2987j94651
13884I13574J3297o8532n8612J1347K18958m6314L800P0575j26608L10814J20242
$$ y = [1947002, 1761483, 1376327, 1691496, 1726965, 2083026, 1608425, 1928311, 1666521, 1617603, 1332503, 1742543, 1428080, 1588679, 1466060, 1453342, 1710821, 1602178, 1693335, 1759506, 1162316, 1541654, 1546032, 1766021, 1654148, 1527378, 968832, 1597303, 1368109, 1525311, 1390982, 1373754, 1492480, 1454916, 1322793, 1188446, 1167964, 1433482, 1385713, 1121944, 1121212, 1436115, 1368891, 1418981, 1114447, 1261775, 1153467, 1456797, 916517, 954394, 1122255, 1049041, 1410522, 880564, 1326477, 1222240, 1240299, 1336611, 1223608, 1149925, 1181928, 1036428, 1175552, 1185303, 1053685, 1173871, 1273856, 1143465, 932499, 1015238, 1108225, 913574, 926871, 858339, 799727, 811074, 1030032, 983718, 987518, 1058093, 931485, 1242299, 1362541]
13873A362541k72827K25735F25365J45187R8858J67786k53110K73866m3405l16801
13863F97746K87479n0912J65094m38474M7844J95937k4751K12862k79026m3539
13853G70260K73290k54075K26660k31309M53554l80433P9441j64762K38508l24447
13843F86687J80219j24857n8608L64691k14552J17685l77931L95413l45805n7782
13833E65160M36172k81343L02720o1123k76061J93452J09219l33222N8123J60274
13823H73371M7020P9335n1435J53065k24831j81369K827J74964M7449l8897j99756
13812F81743k62782K84574k8102q2381L50509C91279M64063J7196k54972n3459
13802E64107M99685l33739j69408J31808j23728M5665J35314k17216M06972m2823
$$ y = [1362541, 1089714, 1315449, 625365, 770552, 869410, 1037196, 784086, 1057952, 1014547, 697746, 985225, 934313, 1099407, 660933, 708777, 904714, 879963, 1092825, 813799, 770260, 1043550, 789475, 1016135, 784826, 1238380, 857947, 937388, 772626, 1011134, 686687, 866906, 742049, 683441, 1048132, 833580, 951265, 573334, 968747, 622942, 565160, 1001332, 719989, 1022709, 961586, 685525, 878977, 988196, 654974, 713097, 873371, 920391, 999726, 948291, 1101356, 876525, 695156, 697983, 872947, 920396, 881499, 681743, 418961, 703535, 675433, 593052, 943561, 391279, 855342, 872538, 617566, 564107, 1063792, 730053, 560645, 692453, 568725, 614390, 749704, 532488, 939460, 896637]
13792H96637k01831j8413j9988p5737O1111N8990J25163l84675L12295l0874j4888
13781G07790j6422m3328n4506K32157R7039l23839M4084k38037K9756K24976m0196
13770F19474j65220J41316m6901q2052j25476L4110L38984j08421m2920L3128
13760E96022M8158J34942N4262j73187R907k44002L10053l38124K85173l14523
13750C68681R6991L98878j45386j39546J15533B71111K00509j75782K87396q3812
13740D99422J24256k52880L01235j56033k36804M71668j37005j47355J44806k77707
13730C33603L29342J4988k78351k9108J90568J38584m0168K10961l22362K26174
13720G74231k27255k43924L30207r8493r5864k7633Q0619J83706r5381L2743k08769
$$ y = [896637, 694806, 676393, 656405, 580668, 641779, 700769, 825932, 441257, 753552, 722678, 707790, 691368, 648040, 593534, 825691, 922730, 598891, 642975, 404938, 434694, 659670, 619474, 454254, 595570, 548669, 466617, 341141, 375251, 714235, 605814, 562894, 596022, 644180, 779122, 833384, 660197, 670104, 426102, 736155, 398031, 683204, 368681, 465672, 864550, 719164, 579618, 695151, 271111, 471620, 295838, 583234, 499422, 623678, 370798, 672033, 516000, 279196, 750864, 613859, 466504, 611310, 333603, 662945, 677933, 399582, 370474, 561042, 699626, 659458, 870419, 548057, 774231, 546976, 303052, 633259, 534766, 438902, 411269, 491888, 675594, 580213, 612956, 404187]
13709D04187K92113O7209C35960L7893Q9258A03712K87821q2629J44970J01834
13699E55708k44517K61050J24892k25095R574J17848O4815B52837r5674M48656
13689F05819N3688l0337C03698K95188k72928p7803L25188j18396J4083j05316
13679C63714J8960j89808R0962j6390K73864A84977K43965b1292E14466K89655
13669H04121C92638P3244A71460K88552j78115r3150J7482K73199N7360N7168
13659E93956B47646R823A21997L60208J79415C19021M9633N7744J10879m3298
13649D93979j52747l2034K48679O5898B25229M34797c6136B67735q6494M9654
13639B30895K75469j55059L091L25906k75039j3887A73827R6629M2373D383N42465
$$ y = [404187, 696300, 763509, 335960, 373853, 463111, 103712, 391533, 308904, 453874, 555708, 311191, 572241, 697133, 472038, 481612, 599460, 664275, 252837, 157163, 605819, 659507, 629170, 303698, 598886, 325958, 248155, 573343, 454947, 469030, 363714, 382674, 192866, 283828, 267438, 541302, 184977, 428942, -21292, 514466, 804121, 392638, 465882, 171460, 460012, 281897, 188747, 206229, 479428, 536788, 593956, 247646, 257469, 121997, 482205, 661620, 319021, 368654, 426398, 537277, 493979, 341232, 309198, 557877, 623775, 225229, 660026, -36136, 267735, 181241, 230895, 506364, 351305, 354396, 680302, 405263, 391376, 173827, 270456, 312829, 4383, 546848]
13628E46848A06438Q4180J38964j06852K47438R9762j49738L9856j85513L98806
13618F73341B91837J95776n1394j70953J52404C9457M08676l5365b6434A45544
13607D91947m4520b0366D22723J82297o7285A54092J69890j47552J88820j44179
13597B21071J03625J72931A70969F840M60667o9719j7340E8119K52596L2139j61666
13586A81188j3322L77503j61431Q2361M5026A62834K54885A81823K37652j5342
13576D04133J60405k78640I9458K71618a01254B83253l2532J13737j16636l030
13566B44792f6382B21886O7114J1811J38253C7153M34473B14081K37806r669j4423
13555D27795G5287J2223J93473m0756O3432N5083p6030J99885I7703J07898F7670
$$ y = [546848, 106438, 190618, 329582, 222730, 470168, 569930, 420192, 460048, 274535, 673341, 291837, 487613, 436219, 265266, 417670, 39457, 448133, 412768, -26434, 145544, 491947, 447427, -20366, 422723, 605020, 537735, 154092, 323982, 176430, 365250, 221071, 324696, 497627, 170969, 6840, 467507, 397788, 380448, 58119, 310715, 342854, 181188, 167866, 545369, 383938, 466299, 511325, 162834, 417719, 181823, 419475, 404133, 564538, 285898, 99458, 371076, -101254, 283253, 250721, 364458, 247822, 244792, -66382, 221886, 289000, 300811, 439064, 37153, 471626, 214081, 451887, 442218, 427795, 75287, 87510, 280983, 240227, 303659, 358742, 282712, 482597, 97703, 205601, 67670]
13543F6245a65112B40303C7286p422M07576j12744J15280k3437j75951K39996
13533D80584r9642J68880J47032o9519B73865A31270J13045J68253A06514K79854
13523C86368j84952K95110j84725J17257A73165K28016N4861a03700B62300J51025
13513D13325j24944F2724c7405D99495k03460n4966C2186J20114J96942J64947
13503E14189j84921j15415J09207E8200c8161A47795F9060L7061J33311K6892
13493B66324J36786R5428c5780B81927M8662r2427K20618A07767M5903n9019L3664
13482A28315J11370J04074p6972E6727R9273J57508J62380A43510r010c1846C06851
13470B60505L09258G0902K10016K10519P4998E0714f8717A71027J49203j05697
$$ y = [66245, -165112, 240303, 37286, 29864, 437440, 324696, 439976, 416539, 240588, 480584, 380942, 549822, 696854, 627335, 273865, 131270, 244315, 412568, 106514, 386368, 201416, 496526, 311801, 429058, 173165, 401181, 456042, -103700, 262300, 413325, 288381, 62724, -37405, 499495, 296035, 241069, 32186, 152300, 349242, 514189, 329268, 213853, 323060, 58200, -38161, 147795, 69060, 106121, 239432, 266324, 403110, 498538, -35780, 281927, 330589, 238162, 458780, 107767, 153670, 94651, 128315, 239685, 343759, 266787, 56727, 156000, 313508, 475888, 143510, 134500, -31846, 306851, 260505, 569763, 70902, 280918, 491437, 566435, 50714, -68717, 171027, 320230, 214533]
13460B14533J7557q3722J23554k0762b0324D51187k07939J18490A9948J01858
13450A21806L2515L75976G9862J23432a84115C8273f2102B64474a66126C42862
13439B19166J8592A5563P616K0554n818K50179b7609C26565j9344j33388F9965
13427B07908c5053A03713B3839J63186K48834b264k618B74925J9384A6904K35638
13416B52542J21280A48104g1651A65382M1194J47254A28808K25280j47829c6759
13405B57723P6352j28249o0523i3982A81102D4919J55960k6081C2399J39714a37802
13393B34755a52402d8595m3211H1253B1421d0988B82556B603J16072K14859e2474
13381B03992k490q0458R8895f7314C527J2579K24893J65257n435H2705L81074
$$ y = [214533, 232090, 148368, 271922, 251160, -20324, 451187, 243248, 361738, 19948, 121806, 154321, 530297, 79862, 203294, -184115, 38273, -62102, 264474, -166126, 342862, 219166, 237758, 15563, 23179, 43733, 37915, 288094, -27609, 326565, 307221, 173833, 69965, 207908, -35053, 103713, 23839, 187025, 435859, -2264, -4882, 274925, 294309, 16904, 252542, 373822, 148104, -71651, 165382, 206576, 353830, 128808, 354088, 206259, -36759, 257723, 334075, 205826, 145303, -93982, 181102, 44919, 200879, 174798, 32399, 172113, -137802, 234755, -152402, -48595, -91806, 81253, 21421, -40988, 282556, 2603, 118675, 333534, -52474, 203992, 201502, 121044, 219939, -67314, 3527, 16106, 240999, 406256, 400821, 82705, 463779]
13370D63779k07535M6120c5038B80509n8564J3029I053J84970E7976i2687D03376
13358B27937b9188C94533A49266J7389D7486K26353K90510B15382l2248K4067
13348B07201a09953J8890D05504j62322O3837j20093K76495j32073l9365r998
13338B81985j6658h5331A58457P6654J55424j6015A65492P088K02189q5542F7373
13326B01544K60527d374C28112m3197n7012J35302G3158M7653c8541a4198A67736
13314G3491K50696H8261K61656j37497o3914K9845b07967C19315c03741B63162
13303B38989C7361a12572C30420A42543C6298a60917C34039j24380K61093A85738
13292A41457J50799a30037e7762p8545A74832P6870r278F7547L5200J09310d812
$$ y = [463779, 256244, 302364, -35038, 280509, 221945, 234974, 9053, 194023, 57976, -92687, 403376, 227937, -29188, 394533, 149266, 166655, 47486, 273839, 564349, 215382, 183134, 207201, -109953, -91063, 405504, 243182, 307019, 186926, 463421, 331348, 291983, 281985, 265327, -85331, 158457, 235111, 390535, 374520, 165492, 172580, 374769, 289227, 67373, 201544, 462071, -4374, 328112, 284915, 227903, 363205, 73158, 120811, -38541, -14198, 167736, 73491, 324187, 88261, 349917, 212420, 148506, 178351, -207967, 319315, -303741, 263162, 238989, 37361, -112572, 330420, 142543, 36298, -160917, 334039, 209659, 470752, 185738, 141457, 292256, -130037, -57762, -136307, 174832, 251702, 242424, 67547, 102747, 212057, -4812]
13280G9063P9478Q9372j2581J5204L9621e095j18384B5865a62659c0112N772b746
13267B52416K5098A1160K08121c33746a28656B17454e4293C4154J33611j6041
13257A51724a87460d7896k89545a10550A12826a11817E5491N8753l49Q356h8364
13245H5417J10175a06271C78041G1183A7927O209e6900a7380B79025B9117Q0949
13234A10066A2865f6457A58650D3246R8762F8725N0562J88306B1774e9290A51528
13222A50962E645f4128A40875B670M17184b10049B22420C6663a8939B05197O8609
13211B73806L1078j49081n5694B2899Q1497J47562b8821D30432A55112o4818K06980
13200B97274J719L3845A23161a9447j63748J2081B50623o68K17644b63720B2556
$$ y = [79063, 158541, 247913, 235332, 250536, 290157, -5095, -123479, 25865, -162659, -30112, -24340, -2746, 252416, 277514, 11160, 219281, -333746, -128656, 217454, -54293, 34154, 167765, 151724, -187460, -47896, -337441, -110550, 112826, -111817, 55491, 114244, 113895, 122251, -88364, 85417, 195592, -106271, 378041, 71183, 17927, 24136, -56900, -17380, 279025, 29117, 110066, 12865, -66457, 158650, 43246, 142008, 68725, 119287, 307593, 21774, -59290, 151528, 150962, 5645, -64128, 140875, 2670, 419854, -210049, 222420, 36663, -18939, 205197, 273806, 304884, 155803, 100109, 22899, 104396, 251958, -28821, 430432, 155112, 90294, 297274, 298993, 332838, 123161, -19447, -183195, -171114, 250623, 249955, 467599, -263720, 22556]
13188A70791b1392A33260E1122d7147E6850J76854C8422a00629A62300E0091K95505
13177C45596b3915j22460B09316q3410m8872Q0505c73759B61454A18540k4901
13167I3639K15607e0395K5073l0548D36081A50055F0607J07533K71357f189D3822
13155a91931e2357l3396C8083J57978K50247j56258A44868a27917k78170e6469
13144a40165E9747a90053B15915G4248Q2846e7218k77928A30437m5328E950K5300
13133C1250a57759c3440l5190r2215A1379L05583a41554B70788j02524c97350
13122a08552d1519H0460O3021R653a27447M8711A00776A5415J77527C7259J47563
13111A84822G8990b04122F6990a66442B37898L29177a28892E3888b75767e4017
$$ y = [170791, -21392, 133260, 51122, -47147, 56850, 233704, 38422, -100629, 162300, 50091, 345596, -23915, -146375, 209316, 125906, 77034, 157539, -373759, 261454, 118540, 93639, 309246, -50395, -25322, -55870, 436081, 150055, 60607, 168140, 439497, -6189, 43822, -191931, -52357, -85753, 38083, 196061, 446308, 290050, 144868, -127917, -406087, -56469, -140165, 59747, -190053, 215915, 74248, 157094, -57218, -335146, 130437, 85109, 5950, 31250, -157759, -33440, -68630, -160845, 11379, 316962, -141554, 270788, 168264, -397350, -108552, -41519, 80460, 143481, 153134, -127447, -78736, 100776, 15415, 192942, 37259, 184822, 78990, -204122, 66990, -166442, 237898, 567075, -128892, 53888, -275767, -54017]
13100i7329A49197J42355J8326c0844I9812c5221A91666E9937J47262a02438A02567
13088a61568E7471L05072e27904A42968R28N9072l1821a32554H0170d4785k20735
13077b65520d8223A70308J18573j05057Q976f3508A40888f5123E52855A71166
13066a5800I1195K16817F0529b6683j60786C76871g0255D1457J2203J9981L6438
13055A10079m5575K6643f5640m2850B46626b8653k14075e0239E5411a06307j6649
13044a22956d558a17B8546K85645D3573b64931A94764d0107A25109a26849B90460
13032C13142a03042A26374O9362L0454b252I4093d7504A57603l1313m0622J6398
13021A02066J57764a10535i114L482D9299J69949i3516r3957e4163B88085E582
$$ y = [-97329, 149197, 291552, 309878, -30844, 99812, -35221, 191666, 59937, 207199, -102438, 102567, -161568, 57471, 362543, -527904, 142968, 143896, 202968, 171147, -132554, 80170, -44785, -265520, -48223, 170308, 288881, 183824, 192800, -63508, 140888, -65123, 552855, 171166, -15800, 91195, 308012, 60529, -26683, -187469, 376871, -70255, 41457, 53660, 73641, 110079, 64504, 91147, -65640, -108490, 246626, -28653, -242728, -50239, 55411, -106307, -122956, -4558, -117, 28546, 314191, 43573, -264931, 194764, -40107, 125109, -126849, 290460, 313142, -103042, 126374, 195736, 226190, -2252, 94093, -47504, 157603, 126290, 85668, 102066, 259830, -110535, -9114, -5632, 49299, 219248, -93516, -187473, -54163, 288085, 5582]
13009B29660A02383R2587a47354B53822D557J06984R8105G1353J18957f3189C9292
12997H1468j3310e3918R373G6374c06862c4211A23416O4187a39636N2880F6136
12985E3191e3478C5021Q2879L42258B00791C5753J82941p5779b28521A37350J11136
12974B48486b47184b140A76340E3165L20238a21654h804A2538L01347n3493g528
12962B00504r0091K39219A57359h7764M873l7995N5300m0523J0297j4028C99277
12950F2556K14501d8623j0748d906a714j41024A35277B783K95552l6040q5914
12939A76381b98675A14125M7621f7144C36354E5327b9021p5232a339B7740K38157
12928B65897k2007n8915J0372L1057A4767a83545f2206m2133E9794h3262B1676
$$ y = [229660, 102383, 194970, -147354, 253822, 4557, 111541, 209646, 71353, 190310, -63189, 39292, 81468, 68158, -53918, -44545, 76374, -306862, -34211, 123416, 187603, -139636, -86756, 66136, 53191, -53478, 35021, 117900, 460158, 200791, 35753, 218694, 142915, -228521, 137350, 248486, -247184, -2140, 176340, 53165, 373403, -121654, -8804, 12538, 313885, 260392, -7528, 200504, 110413, 349632, 157359, -87764, -82891, -120886, -65586, -106109, -95812, -109840, 399277, 62556, 277057, -48623, -59371, -4906, -1714, -142738, 135277, 2783, 298335, 262295, 176381, -298675, 114125, 161746, -67144, 336354, 55327, -29021, -104253, -1339, 27740, 265897, 243890, 184975, 195347, 226404, 14767, -183545, -62206, -104339, 59794, -83262, 21676]
12916B02131F3036N3111J7596M0834J10098h9419j96716G4173B7022l722a09066
12904c4961C87268a336o2471k57479D32244A78846b94176A32018b10661C1492
12893D04560j04223E6152Q7760a99617B5231J94724d99r4507D2272J22271a35118
12881G649K03025p9218A7917b248k69948A11461i9355A6180O3775a84408c5924
12869A65536a33012A95242l422b0841A57518a08210j31285P9129O8958l1535B59268
12857I8740a9363j97856I8925c6487A48169Q1177b34596B74940D6654a15050B68576
12845A26538n2026J582n100a57067a6023j10039b405B87489b68217a30758N7276
12834g3482A56022Q0736G7625d00285B44958m9992q2264K74209A88444c3472B46637
$$ y = [202131, 63036, 116147, 133743, 174577, 284675, -89419, -286135, 74173, 27022, 23300, -109066, -34961, 387268, -1336, -63807, -321286, 432244, 178846, -294176, 132018, -210661, 31492, 404560, 300337, 56152, 143912, -199617, 25231, 219955, -499, -95006, 42272, 164543, -135118, 7649, 210674, 131456, 17917, -2248, -272196, 111461, -99355, 16180, 79955, -184408, -35924, 165536, -133012, 195242, 191820, -20841, 157518, -108210, -239495, -160366, -91408, -122943, 259268, 98740, -19363, -217219, 98925, -36487, 148169, 229346, -234596, 274940, 46654, -115050, 268576, 126538, 74512, 76094, 70994, -157067, -16023, -126062, -2405, 287489, -268217, -130758, -73482, 156022, 236758, 77625, -400285, 244958, 194966, 112702, 386911, 188444, -33472, 246637]
12822B68267j5985a18011H7717K20322a57400A82022O9592J59467h5951p2299
12812a58250N0868A77015M1486H3224K26366a62752g8577m4617B6108K60772p0704
12801B16176H396J69089a8230r3636J0840B69466A15250a8246Q852A09872D4810
12789D4624b91930e3947j40502A91054A6773J02702L2172b69289Q9414r386r4433
12778b83694D4226a49450j43526E3436M9968c1918j29407j12802e3455A19578
12767h9746A79930F4174b03757H9670Q8854a57192H2291L7822p92c02493a2851
12755a21349L9274A15071K1410a24439l1568E2558R7184a41402F5582b79345C8002
12743b2763A48889n7297b86183A24256B8858a52000A12059M5512O6874F346J24279
$$ y = [268267, 252282, -118011, 87717, 308039, -157400, 182022, 251614, 411081, -85951, -158250, -107382, 177015, 218501, 83224, 309590, -162752, -78577, -123194, 26108, 286880, 216176, 8396, 177485, -18230, -111866, -101026, 269466, 115250, -18246, -9394, 109872, 44810, 44624, -291930, -53947, -194449, 191054, 16773, 119475, 151647, -269289, -179875, -189261, -283694, 44226, -149450, -292976, 53436, 103404, -31918, -161325, -274127, -53455, 119578, -89746, 179930, 64174, -203757, 89670, 178524, -157192, 82291, 120113, 119321, -302493, -12851, -121349, -82075, 115071, 136481, -124439, -156007, 52558, 149742, -141402, 65582, -279345, 38002, -22763, 148889, 91592, -286183, 124256, 28858, -152000, 112059, 157571, 224445, 6346, 130625]
12732A30625C030g8734K9103A38089L3578H2296P0525E4812J3623a09547B03202
12720c01584A47334a60904P5107j02872l4372A41749k1569D1811d5788d954B24601
12708A19247q613P8791Q1912A16965L37960B08803P5425E3026d4896j27215P8991
12697i3120B705L60690a0322k5820C29682b64100M8631j13504A22170a18551j40750
12686b59301a21823A24708J76306A05521b0824j0388j62376A00616J86966e1173
12675H4219J80534L9901a34457A79306B0374b07952I8325m8269J77227a61259
12664A72323l7258J292h6026C16670O9728A11753L60553A29506e0635B01622p1226
12653A30396C090L14292r6884a72317A86264b39507A76939p7076g6035A6066N6004
$$ y = [130625, 3030, -78734, -49631, 138089, 171667, 82296, 152821, 54812, 68435, -109547, 203202, -301584, 147334, -160904, -85797, -188669, -223041, 141749, 120180, 41811, -45788, -4954, 224601, 119247, 110634, 189425, 271337, 116965, 454925, 208803, 284228, 53026, -44896, -172111, -93120, 2705, 363395, -10322, -36142, 329682, -264100, -215469, -328973, 122170, -118551, -259301, -121823, 124708, 301014, 105521, -20824, -31212, -193588, 100616, 287582, -51173, 84219, 264753, 304654, -134457, 179306, 20374, -207952, 98325, 50056, 227283, -161259, 172323, 135065, 136357, -86026, 316670, 386398, 111753, 472306, 129506, -50635, 201622, 130396, 3090, 317382, 220498, -172317, 186264, -239507, 176939, 99863, -76035, 16066, 72070]
12642G2070i7061A68981o2404c6352j90317k6280b3471C6515J64217M756k637
12631B02851b46013C06808b6111E80810A75536q2985a07378D99892A34070J1281
12621A45351m6209a16313D14784A69049E670b78460O7482A07851a334I4810a12115
12609b974j26340I7078K25995g9266B45050C3762J26190p3886B9598K2853P1310
12598A23761a1042E3183k1032g4182e889C14598j43429E038K36764c9880n8628
12587i8508o7024f6807m408j23755A64401B2001L56511F8765q496b02514G7502
12575a04954j37149B2765L93357g9372B15457n0572g5696C585d1521B39851b4817
12563C05628b50433a10657E5637k0188a11801K3574B70938O0417b09494o8410
$$ y = [72070, -97061, 168981, 106577, -36352, -226669, -252949, -23471, 36515, 200732, 205488, 202851, -246013, 306808, -26111, 580810, 175536, 92551, -107378, 499892, 134070, 145351, 99142, -116313, 414784, 169049, 5670, -278460, -210978, 107851, -1334, 94810, -112115, -2974, -129314, 97078, 323073, -79266, 245050, 33762, 159952, 86066, 29598, 52451, 123761, -11042, 53183, 32151, -74182, -5889, 314598, 171169, 5038, 241802, -39880, -98508, -165532, -66807, -71215, -194970, 164401, 22001, 378512, 68765, 60269, -202514, 77502, -104954, -242103, 22765, 416122, -79372, 215457, 164885, -75696, 3585, -41521, 239851, -24817, 305628, -250433, -110657, 55637, 35449, -111801, -88227, 270938, 331355, -209494, -277904]
12553b77904A3552K45709H6045J51419i0844j1735C68133a26220M8955B64872
12542b6774l684l8389p9848N9167k87392A54271a59610M0406A52134J49359a14556
12530a38318A01088l4349N340N29057b06373Q0158L0675j09156C00897G4114K49437
12519C23551j25187J20419B6930i4094q209D0241J13643F4184L69894a80265Q3462
12508i6803A22404l4449l5740J25144f481B7072r328O6339i474j20000a5203I3835
12495H3878a27651A23781J13217a65613c8549A8011J19659n3734b72364F735c48682
12483b3712j40664R896L4340k07923A76624J60949b20054D3214J18290b09939
12472I6441g110j00317C0952q796K55514g2434j10495f2625b2873l7778j92533
$$ y = [-277904, 13552, 259261, 86045, 237464, -90844, -102579, 368133, -126220, -77265, 264872, -26774, -30458, -68847, -148695, -89528, -376920, 154271, -159610, -119204, 152134, 301493, -114556, -138318, 101088, 66739, 72079, 601136, -206373, -126215, -95540, -204696, 300897, 74114, 323551, 198364, 318783, 26930, -94094, -102303, 40241, 153884, 64184, 434078, -180265, -96803, 122404, 87955, 52215, 177359, -6481, 27072, 17744, 84083, -9474, -129474, -15203, 93835, 83878, -127651, 123781, 236998, -165613, -38549, 18011, 137670, 83936, -272364, 6735, -348682, -23712, -164376, -154480, -120140, -328063, 176624, 337573, -220054, 43214, 161504, -209939, 96441, -7110, -107427, 30952, 22156, 277670, -72434, -182929, -62625, -22873, -60651, -253184]
12461b53184A53563D0786g0471H2455i8835M2890E3542Q1556E5671b80105J13350
12450a66755a0879r3426B7285d51456F413K64761c26044A64870d218m9546a6480
12438A84311f0282j2909A89366G3759b98321g1366A45277R6003h5341C19629b6609
12426B80433a73625A518b1468k3458N878r0345B14409h5915p5453J6945E2728
12414c40342h4227F5148j0255a00136m8979l0047P5294j43986M8453A03907h3412
12402C1961b73750C1501b027m8417I787B665a34529N4721N1a7280k40096a02700
12389a42746B57593j06100G0408b84742A04208b50379N1900f7326A77261q3925
12379I3336m4938J0707R2526G2447k4557K12982h6445B04118G7798g3872A52481
$$ y = [-253184, 153563, 40786, -70471, 82455, -98835, -55945, 53542, 135098, 55671, -280105, -166755, -10879, -104305, 27285, -451456, 6413, 271174, -326044, 164870, -4218, -53764, -16480, 184311, -60282, -73191, 189366, 73759, -298321, -71366, 145277, 241280, -85341, 319629, -26609, 280433, -173625, 1518, -21468, -44926, -39048, -129393, 214409, -85915, -161368, -144423, 52728, -340342, -84227, 65148, 54893, -100136, -149115, -179162, -103868, -247854, -199401, 103907, -83412, 31961, -273750, 31501, -2027, -50444, 9787, 2665, -134529, -79808, -79757, -17280, -257376, -102700, -142746, 257593, 151493, 70408, -284742, 104208, -250379, -198479, -67326, 177261, 93336, 48398, 59105, 151631, 72447, 47890, 260872, -86445, 204118, 77798, -73872, 152481]
12367b02930o8612a34750F4854k4442J22093D4902c64018A28267E7134K9487P3420
12356A60041a19537k04897B98979A03259D4966a87302F6421N0077b34657M1877
12346a92780j3593A52582A5692J88959b14938a2124A32049a80828A55692a95371
12335A02829f8706C7582K9898J24190a49262f9273B5887a8864A0529b61424g4362
12323a35944M4257A05118B8332K13033A10180A6697R976J99128K59382q0017i7874
12311B75787B1934e9020j85144D185h8955C10467D309b40713F4613k2552a72088
12299C9496b97113A47095b2133G6159J29038c7878j4180o2079C4603J1406j1980
12288C4029a50615B34566a54983j94515A15861a31233I7734b0937F4770b25854
$$ y = [-202930, -271542, -134750, 64854, 40412, 162505, 44902, -364018, 128267, 57134, 86621, 160041, -119537, -324434, 298979, 103259, 44966, -187302, 66421, 116498, -234657, -192780, -206373, 152582, 15692, 204651, -214938, -12124, 132049, -180828, 155692, -195371, 102829, -68706, 37582, 67480, 191670, -149262, -69273, 25887, -18864, 10529, -261424, -74362, -135944, -91687, 105118, 28332, 241365, 110180, 16697, 26673, 225801, 485183, 405166, -97874, 275787, 21934, -59020, -244164, 4185, -88955, 310467, 4309, -240713, 64613, 42061, -172088, 39496, -297113, 147095, -22133, 76159, 205197, -37878, -52058, -114137, 34603, 46009, 34029, -150615, 234566, -154983, -349498, 115861, -131233, 97734, -20937, 64770, -225854]
12277B45780R021c15C04289j28291O1360A9740i3560D2196b73964B83865j33189
12266A50676c0594D0108J91520h5931A54622b85691N5907B00768j3356d2956j94558
12255b37514B26929B7948L70770b02359D1624K3410c4837A67234d1099A21973
12244B13476h5562c1727B29128D9293f1015H7861K99734b8426n8876A31770J59243
12233B91013j12431C8292L06345Q9291H4787J41610O5946q1786e4268F6957K04103
12222B71060A03355a32021A07452K66841C3907K26971J559G4779N9689C2944K38021
12211B70965b35450i2466D0283M24192j71277d8692F7181K58a13526A36072E7173
12199C96962j83958K64366C2527K54575j11177K4581J97043k7363q7491c35234
$$ y = [245780, 254801, -315, 304289, 175998, 237358, 19740, -93560, 42196, -273964, 283865, 150676, -30594, 40108, 231628, -85931, 154622, -285691, -229784, 200768, 187412, -42956, -237514, 226929, 27948, 398718, -202359, 41624, 65034, -34837, 167234, -41099, 121973, 213476, -85562, -31727, 229128, 49293, -61015, 87861, 387595, -28426, -87302, 131770, 291013, 178582, 38292, 344637, 433928, 84787, 226397, 292343, 210557, -54268, 66957, 271060, 103355, -132021, 107452, 374293, 33907, 260878, 262437, 74779, 134468, 32944, 270965, -235450, -92466, 40283, 464475, 293198, -48692, 67181, 67439, -113526, 136072, 57173, 396962, 213004, 477370, 32527, 287102, 175925, 200506, 397549, 370186, 282695, -335234]
12188A18171N5484m0182a49505A51374B1290P5226b2278G3669C4276h5071B02556
12176C57303A3757K27924j08723E0639J15737J92658A47532J34255j8907l8654
12166B24226K20859a4253A47076O4200G2614J00852M5814i0369L5514j28873I9831
12154I9647B7051L25J44998k0544a46213k6101B27069h8959J0643k58379B31822
12142D5875J65394O4168a1305A32934a8487B1753a24166B36241A17624c0860E2471
12130g1594B77592G7096E549a16313A89012a36156A45249g7770I4582J87857c35845
12118I9086J56760a11063b472j19517J9136c61C10452b07283a6909A25455d5287
12106D4741b19601j71472A30087j1939i8258B4704g1637J41k2434B56860a70175
$$ y = [118171, 173655, 133473, -149505, 151374, 21290, 96516, -22278, 73669, 34276, -85071, 202556, 357303, 13757, 241681, 132958, 50639, 166376, 359034, 147532, 281787, 262880, 224226, 445085, -14253, 147076, 211276, 72614, 173466, 219280, -90369, -54855, -183728, 99831, 99647, 27051, 27376, 172374, 151830, -146213, -172314, 227069, -88959, -78316, -336695, 231822, 45875, 211269, 275437, -11305, 132934, -18487, 21753, -124166, 236241, 117624, -30860, 52471, -71594, 277592, 77096, 5549, -116313, 189012, -136156, 145249, -77770, 94582, 282439, -335845, 99086, 255846, -111063, -2472, -121989, -102853, -361, 310452, -207283, -16909, 125455, -45287, 44741, -219601, -391073, 130087, 118148, -98258, 24704, -71637, -71496, -93930, 256860, -170175]
12094A04383G79b38138C6928j6820D499Q225J63065B8947b90946C89065b57115
12082a63342B47360c70858a62037L819B33253r2343i7717p3768B75621a34348
12071C10654c39046a22118F2275c88055D4166a01870A16551J383637l63911E33390
12060C79630B345N4432J44543L7984H9019A2792h2445m4318A22517A3780b14221
12048E893M6180g325G3134L363l2238f1026k20075g5802B13802a24056N4177J0854
12036e9025a9327B2856N7332a63781A02363c34750J4759a18158E5259J01779a17756
12024b14621c3883A77528j3722b14510A1336a24617N2837I0881E975J05932J16776
12013B28683r9930b82601C98267A30957b45910A63092b3491E2341K60919B7888
$$ y = [104383, 779, -238138, 36928, 20108, 4499, 12724, 175789, 28947, -290946, 389065, -257115, -163342, 247360, -370858, -162037, -158218, 233253, 140910, -97717, -171485, 275621, -134348, 310654, -339046, -122118, 62275, -388055, 44166, -101870, 116551, 1500188, 1136277, 533390, 379630, 2345, 56777, 201320, 239304, 89019, 12792, -82445, -126763, 122517, 13780, -214221, 5893, 52073, -7325, 73134, 76497, 44259, -61026, -281101, -75802, 213802, -124056, -69879, -59025, -19327, 22856, 80188, -163781, 102363, -334750, -319991, -118158, 55259, 157038, -117756, -214621, -33883, 177528, 163806, -214510, 11336, -124617, -71780, 90881, 5975, 111907, 228683, 128753, -282601, 398267, 130957, -245910, 163092, -23491, 52341, 313260, 27888]
12002e8951k81077J6123D7304k2289e8197A26456h8762B63133H9138a86402B5898
11990G128b59989a5781k25025c9894o0011e486j68541c9648k97625a40027j04559
11979b44586d2346A96363P8262F8036J82227B0630c14303J20768F7058J05655
11969A72713I253d3362j175C40812b9044B88003i4961c7967G3807c61699R2012
11958b69687d6722F6651N1554a59725D293J60751J30579b15137c1492j22927c2220
11946B17749C7036G699e0396E7988b90q8720B41727d1153A15359a86097C3101
11934A36714J24620A25222c81893e5944C30454F5029d6824H173a89642Q9051p9296
11923a79887A58025p2866g1500j78176F551A336K20555b63816a08634M9168K543
$$ y = [-58951, -340028, -323905, 47304, 25015, -58197, 126456, -88762, 263133, 89138, -186402, 25898, 7128, -259989, -15781, -240806, -39894, -99905, -5486, -174027, -39648, -337273, -140027, -244586, -42346, 196363, 274625, 68036, 250263, 20630, -314303, -193535, 67058, 172713, 9253, -43362, -44537, 340812, -29044, 288003, -94961, -37967, 73807, -361699, -269687, -46722, 66651, 118205, -159725, 4293, 165044, 295623, -215137, -31492, -154419, -32220, 217749, 37036, 7699, -50396, 57988, -290, -89010, 241727, -41153, 115359, -186097, 33101, 136714, 261334, 125222, -381893, -55944, 330454, 65029, -46824, 8173, -189642, -100591, -179887, 158025, 85159, -71500, -249676, 6551, 1336, 221891, -263816, -108634, -59466, -56923]
11912e6923B54291a83593f3168B68949A29372a41716q637D6436Q6334h4533B9657
11900A60368F2834i6858B55667e0045A84879a98421a8162o0290c21A16989R5376
11889B12365b53880f7128m42024F1154a93062A75430d0528G9375c4466A08869
11878g6893B09308g0108b4548l46076a03746D9849h0858A97026B5480L6712J80974
11867B43166i2435B28872e04845f3292j9614j07942F147b73303A49078d26935
11856a23430A84446c1767k26039c6834n8221A14659c51378J59124B1455b36410
11845c69230B71557B4276h7331A310c13795B2187K32954b99509E5132J12261k7632
11834A39761N6149F610P1600g6407m3802d2996J8343D1949a40516q8929A08933
$$ y = [-56923, 254291, -183593, -63168, 268949, 129372, -141716, -150353, 46436, 132770, -84533, 29657, 160368, 62834, -96858, 255667, -50045, 184879, -198421, -18162, -78452, -321, 116989, 212365, -253880, -67128, -509152, 61154, -193062, 175430, -40528, 79375, -34466, 108869, -76893, 209308, -70108, -24548, -370624, -103746, 49849, -80858, 197026, 25480, 62192, 243166, -92435, 228872, -504845, -63292, -82906, -190848, 6147, -273303, 149078, -426935, -123430, 184446, -31767, -257806, -36834, -95055, 114659, -351378, -192254, 21455, -236410, -369230, 271557, 24276, -87331, 1310, -313795, 22187, 255141, -299509, 55132, 167393, 139761, 195910, 6610, 78210, -76407, -120209, -42996, -24653, 41949, -140516, -229445, 108933]
11822i1212q4963j80470i6989d2934o1707A34095c08879c8678H469e0967K2192
11811b8775e667A53176m632j8166J28434A1609J53480a50212G3699a93533A93049
11799h8127A00503i9882d9592B25625i1588C0638b46327k333A53402E1146B1205
11787I4674M4387a38995d1907G245d6195D8315g0293L4729j04579e6392D8957
11775d7334A28917N4773a32713j41486A46737b9774j63539B46253a1373A6524
11764c00902a48236G8313a48355a4740B2381a33463J253c0392C09159O795C5093
11752B2656a53984l3914f165B72207a30946H7138l1500J0576a35288j0378A09800
11740c4219p1201H019J44592b60248C0613Q9441e1792H6409P3780b46943B02583
$$ y = [-91212, -176175, -356645, -96989, -42934, -104641, 134095, -308879, -38678, 8469, -50967, -28775, -5667, 153176, 148544, 130378, 258812, 11609, 165089, -150212, 73699, -193533, 193049, -88127, 100503, -99882, -49592, 225625, -91588, 30638, -246327, -248660, 153402, 51146, 21205, 94674, 139061, -138995, -41907, 7245, -46195, 48315, -70293, -35564, -140143, -56392, 48957, -47334, 128917, 183690, -132713, -274199, 146737, -29774, -193313, 246253, -11373, 16524, -300902, -148236, 78313, -148355, -14740, 22381, -133463, -132210, -30392, 309159, 315954, 35093, 22656, -153984, -187898, -6165, 272207, -130946, 87138, 55638, 66214, -135288, -145666, 109800, -34219, -105420, 8019, 152611, -260248, 30613, 120054, -51792, 86409, 160189, -246943, 202583]
11728a44032j8249j62676D8341M76337I8888J74137j00696e9571I7165Q7529c74258
11716e1134B61480A9262f5632m9806j02603a851H0740e7347B14188h1318A78449
11704a96266A7155R8826m9157a41399B00085L522m4634a1376L060p4958I4830
11692A62844a14463B1260o245b09336M3097O9663H2640Q7379g1762q9408A40366
11680B82711c2644k5587C01959a08197j90532A48460l0596i729A37588c81732
11669d7527A38712c32391B96414a18711L4027j80208E9175f9466j49392B85560
11658G8261a63321C5745d2280B2681K5346a17066C66953j83086o6703d5995B99291
11646A56870g8037k2901A84275n4494g7542a1045E6978A7415L36830A12887L4371
$$ y = [-144032, -162281, -324957, 48341, 524678, 98888, 273025, 172329, -59571, 97165, 184694, -374258, -51134, 261480, 19262, -65632, -115438, -218041, -1851, 80740, -57347, 214188, -81318, 178449, -196266, 17155, 115981, 66824, -141399, 200085, 203607, 158973, -11376, -8316, -83274, 94830, 162844, -114463, 21260, 15015, -209336, -166239, -96576, 82640, 170019, -71762, -161170, 140366, 282711, -32644, -58231, 301959, -108197, -298729, 148460, 117864, -9729, 137588, -381732, -47527, 138712, -332391, 296414, -118711, -84684, -264892, 59175, -69466, -218858, 285560, 78261, -163321, 35745, -42280, 22681, 48027, -117066, 366953, 183867, 117164, -45995, 299291, 156870, -78037, -100938, 184275, 129781, -77542, -11045, 56978, 17415, 354245, 112887, 147258]
11635A47258h2838l6872B90315q6898A7977K29568j21404b35710F3799J16758
11625A80557a06440E4692b37031A45132J4905C3186J37195B0019G859L72795b34501
11613b85509j30749C54813C2226d09562e4268B00063i496r3801F2351L77079d8546
11601A65865n2335i0650o8737C8646a44760j70954C327K13491e1044A69625a3960
11589A05685k615h9898G7945b6587G9638N6582h4739l7254C16645P692j17085
11578B07252f7715A82933o0744f1934C89704j46231j17879n4846Q2964M9337H0076
11566G1330a68121C30897A49221M2385C2290b22016A99088a14342F638J06595
11556A13233J5354a97099I5200K72869A6719O0769L22938A6283O557J4735c5342
$$ y = [147258, -82838, -119710, 290315, 203417, 17977, 247545, 126141, -235710, 63799, 180557, -106440, 54692, -237031, 145132, 160037, 33186, 170381, 20019, 7859, 380654, -234501, -285509, -416258, 354813, 32226, -409562, -54268, 200063, -9496, -103297, 62351, 439430, -48546, 165865, 113530, -90650, -159387, 38646, -144760, -315714, 3327, 216818, -51044, 169625, -13960, 105685, 103070, -89898, 77945, -26587, 79638, 136220, -84739, -121993, 316645, 324337, 207252, -67715, 182933, 122189, -61934, 389704, 243473, 125594, 70748, 153712, 203049, 80076, 71330, -168121, 330897, 149221, 191606, 32290, -222016, 199088, -114342, 6638, 113233, 128587, -197099, 95200, 368069, 16719, 77488, 400426, 16283, 22840, 37575, -35342]
11544A81133j244C7683J52334R8699l6881d2751j44143j73364A06016a13065N0628
11533f2437J1381B17382b40077a07328d920B82013A37177R8299H3604a28576L3937
11522i4639O602I4265C7584J3585a81516B57696A12726a86045C7238M32681e4724
11510a82342H910K96401j16160N0154d6963C08905B0993J44116o5399L12728a00845
11498B30767b1057D53297F8931Q5141g7769B34064L110a3105o2927A5545R7830
11487A13375P5785A273L55983a48374G3764J60176q7642m710F2750j5527b31238
11475A74809D4627a17394B8753f8141C44996K0500j75260k4962k7830e24B90305
11463g947B94065R9300j5455d101B15543E2560J66060m5137f2420E25320a99607
$$ y = [181133, 179889, 37683, 190017, 288716, 251835, -42751, -186894, -360258, 106016, -113065, -62437, -51056, 217382, -240077, -107328, -4920, 282013, 137177, 235476, 83604, -128576, -94639, -88037, 94265, 37584, 51169, -181516, 257696, 112726, -186045, 37238, 469919, -54724, -182342, 8910, 305311, 189151, 239305, -46963, 308905, 20993, 165109, 99710, 412438, -100845, 230767, -21057, 453297, 68931, 154072, -77769, 234064, 237174, -13105, -76032, 15545, 113375, 189160, 1273, 357256, -148374, 73764, 233940, 146298, 141588, 62750, 47223, -231238, 174809, 44627, -117394, 28753, -68141, 344996, 365496, 190236, 165274, 137444, -524, 290305, -7947, 294065, 393365, 377910, -4101, 215543, 52560, 218620, 173483, -62420, 525320, -199607]
11451B90898B472O2494J9396k1492i075A32756M6899a59806A96824b46912A49400
11439A27770K74397b04419C42610b20309j9095B17579O0507b71252R9900o3450
11429b34802b477r1666B41366d9327B11985d0852A66221a56727A94804E3153d0599
11417B28483d4777j74346g9093F7115J45135B3934J73621m2389J3225a57849C13578
11405B56653l089n8118K4055D1386R8521J81662b7556j52802A04076c60666d8251
11393F3510B8390a72645B04966j02105c7185B8480q956a25575a3617j09364j54264
11382b77245D3102f606A78614J784b91741B46972L2151P6449j23482e9858H0718
11370b51658A26310c6085j78159A15364g4155A13279a22941D20177b34779A33798
$$ y = [290898, 2472, 64966, 84362, 62870, -9075, 132756, 179655, -159806, 196824, -246912, 149400, 127770, 402167, -204419, 342610, -220309, -239404, 217579, 278086, -271252, -171352, -234802, -2477, -94143, 241366, -49327, 211985, -40852, 166221, -156727, 194804, 53153, -40599, 228483, -44777, -219123, -79093, 67115, 212250, 23934, 197555, 155166, 168391, -157849, 313578, 256653, 253564, 195446, 219501, 41386, 139907, 321569, -27556, -180358, 104076, -360666, -48251, 63510, 28390, -172645, 204966, 102861, -37185, 28480, 19524, -125575, -13617, -122981, -277245, 43102, -6606, 178614, 180398, -291741, 246972, 279123, 355572, 232090, -59858, 80718, -251658, 126310, -36085, -214244, 115364, -74155, 113279, -122941, 420177, -234779, 133798]
11359B4136a43268d5546l3887m6683A03345b61149c7210D9196P9957J21052A07046
11347d04933H2022B4455c05893g9549A91280b5559A06414a47936A04036a36778
11336c09551B0638J57786a20720M9504A24051o486b2596E056f7305l90061A75838
11324B99767b14507J06358a6277j20688a3104k53369b1932j06205C61226D2275
11313d9637p6169D2674b13472A25878a11820a2030k95268a2632B08156D6023c19566
11301i420j02307o0883C0572A3695a82779b231A38323b49134C17558M89a3725
11289E6610b44615K5574A51307a30339a601H7280E860g9055o5207o3682b3895
11277A24413f1993q1051e4050j12997L3856d7657n9713o2398a4812k27458B40438
$$ y = [24136, -143268, -45546, -79433, -126116, 103345, -261149, -37210, 49196, 129153, 250205, 107046, -404933, 82022, 24455, -305893, -79549, 191280, -25559, 106414, -147936, 104036, -136778, -309551, 20638, 178424, -120720, -71216, 124051, 117565, -22596, 5056, -67305, -457366, 175838, 299767, -214507, -108149, -16277, -136965, -13104, -266473, -21932, -128137, 361226, 42275, -49637, -125806, 42674, -213472, 125878, -111820, -12030, -307298, -12632, 208156, 46023, -319566, -9420, -111727, -172610, 30572, 13695, -182779, -2231, 138323, -249134, 317558, 318047, -13725, 56610, -244615, -219041, 151307, -130339, -1601, 87280, 5860, -79055, -144262, -207944, -23895, 124413, -61993, -143044, -54050, -167047, -133191, -47657, -107370, -169768, -14812, -242270, 240438]
11265d30884O3220c4560A86860a55990d2905D60c5497j77897A4239f9236k30711
11254b99947D01725a27385j06922A5352K0047a86135A37610b57802N7972e5316
11243f8878b9179A8428K7479n728K33573l3940p9509J14395e8499m4322j80499
11232b83320p4715b2525k11734I4399K82990A54187E546g7004B32854a5112p4801
11221h9913m8469E6147d04041A08565i5680j01007a1598j8132r5400A25704o572
11210A19132b83293J22315G1961G190L32386g407k46377h3947D10439c42304A39709
11198b21372Q9794B00118c2987G8490b64447J00291P1590o4334E1641K8479d9115
11186A40637O831n3010l1590b33918D0809a38242p6826G3610J3801a79015O6807
$$ y = [-430884, -367664, -34560, 186860, -155990, -42905, 460, -35497, -213394, 14239, -69236, -299947, 401725, -127385, -234307, 15352, 35399, -186135, 137610, -257802, -199830, -55316, -68878, -29179, 18428, 45907, 40179, 273752, 239812, 160303, 274698, -58499, -102821, -283320, -358035, -22525, -234259, 94399, 377389, 154187, 5546, -77004, 232854, -15112, -89913, -138382, 56147, -404041, 108565, -95680, -196687, -11598, -29730, -125130, 125704, 119132, -283293, -160978, 71961, 7190, 339576, -7407, -253784, -83947, 410439, -342304, 139709, -221372, -131578, 200118, -32987, 78490, -264447, -164156, -92566, -156900, 51641, 80120, -49115, 140637, 147468, 94458, 62868, -233918, 40809, -138242, -215068, 73610, 87411, -179015, -112208]
11175a12208A30235E7012a68442l4463J00098l0730A2402e7201B5810P1954a2688
11163B50796i7499C9549a44036B54252a45753C2522i5615B13181m9186a22771
11152A24422J74426q3477i4623k3814j10076N2200B40422A7747J72978F6934c85713
11140b4240A1195b34481Q3745b2465G3272a09380H9245a07710C52292P2826a31775
11128A98850J19898I0512q033a9978B5589c7905I7798c7679G5094c35092B78137
11116G0854L26935i1137j1135B87255Q6856b03600A69849j2567e5594j42501i3941
11104D04335B3466J62380n8323B3320N21557I2192O8559R3263g1718A79491e6036
11092C26782L54097B26704L0221D9632J76534M05137B30742k8366n3598D9542
$$ y = [-112208, 130235, 57012, -168442, -202905, -102807, -133537, 12402, -57201, 25810, 97764, -12688, 250796, -97499, 39549, -144036, 254252, -145753, 32522, -95615, 213181, 163995, -122771, 124422, 298848, 215371, -94623, -118437, -228513, -176313, 240422, 17747, 190725, 66934, -385713, -24240, 11195, -234481, -150736, -22465, 73272, -109380, 89245, -107710, 352292, 425118, -131775, 198850, 318748, 90512, 82479, -19978, 25589, -37905, 97798, -37679, 75094, -335092, 278137, 70854, 397789, -91137, -102272, 287255, 374111, -203600, 169849, 157282, -55594, -198095, -93941, 404335, 23466, 185846, 127523, 23320, 544877, 92192, 160751, 254014, -71718, 179491, -56036, 326782, 680879, 226704, 256925, 49632, 226166, 631303, 230742, 202376, 148778, 49542]
11081a0220C26396j20138a47763B65240J14497L9848j70874K29591B30050J36341
11071C66391l4457O8618j14529J69729P1965j53587P9941K31603C27500K00889
11061E28389J40493k43242l6435M5962k8666P5041P9355B39209O17406j1298j58279
11050F87038q4787L1696J20473J94485j72176P2126j77194K13627k32154L55004
11040A008138j66054L34540r9513j63695j32960j47312A99300N12272M6217m7282
11030G10507k39192J07595R9546K8005J17562k01905J35581q2827j25496J34510
11020F83886J13900J69306j62514j46996K19665l00463J65805L3109j59312K70081
11010H86467j35764q4916j51547J91432k81679O7957L23313l81856K47993j89119
$$ y = [-10220, 326396, 206258, -147763, 265240, 379737, 419585, 248711, 478302, 230050, 366391, 331934, 400552, 286023, 455752, 527717, 374130, 454071, 685674, 327500, 528389, 668882, 425640, 389205, 435167, 406501, 481542, 560897, 239209, 856615, 845317, 687038, 602251, 633947, 754420, 948905, 776729, 848855, 671661, 885288, 653134, 1008138, 842084, 1176624, 1077111, 913416, 780456, 633144, 199300, 711572, 757789, 710507, 471315, 578910, 678456, 706461, 824023, 622118, 757699, 674872, 549376, 683886, 797786, 967092, 804578, 657582, 877247, 576784, 742589, 775698, 616386, 886467, 750703, 665787, 514240, 705672, 423993, 491950, 815263, 433407, 681400, 492281]
11000D92281K57254L84642m04568m0679k30876K64166k19078N8866J65752j01184
10990F26576J34813l3072L18151O1557l16535N14255j8997j26926J69709j70186
10980A159345L4705N56493j45760K62889N51865L93262L15086J96081N0478j79487
10970C194957J81284l74705k46975l93412k21182k31934j56638o2048K7718j438
10960A715627j52589q9157q0601k59606K02117l93569j269k01193K85134k55158
10950G69736k61259k1043q7039l634J58915f0408C71232J22532b30153B61419
10939b7105C68105A78969E7631P0595l5764M5112a15043B91728j10636a19708
10928a668F6515f1835A99542E096J05594D0802g9393c3686C2717R5507c767j14757
$$ y = [492281, 749535, 1134177, 729609, 688930, 458054, 722220, 503142, 562008, 727760, 626576, 761389, 728317, 1046468, 1108025, 791490, 1305745, 1286748, 1159822, 1329531, 1159345, 1194050, 1750543, 1604783, 1867672, 2419537, 2812799, 3127885, 3323966, 3374444, 3194957, 3376241, 3001536, 2754561, 2361149, 2139967, 1908033, 1751395, 1689347, 1717065, 1715627, 1563038, 1473881, 1393280, 1133674, 1335791, 942222, 940953, 739760, 1024894, 769736, 508477, 487434, 400395, 396761, 555676, -60408, 371232, 493764, -230153, 261419, -27105, 368105, 178969, 57631, 128226, 92462, 137574, -115043, 291728, 181092, -119708, -1668, 66515, -61835, 199542, 5096, 110690, 40802, -79393, -33686, 32717, 128224, -3767, -118524]
10916a18524j80602E1190a98813h8681C2187J95097c44866A23499a85694d6640
10905A29936i2334m7213l8522l7119k519A28610e6175A43563i72A24656J82371
10894C07027A16028b72737O1216b0061k80896a38535E946O8753d4687q6346b3992
10882C36812j11840a45936j07043L1993h0997I5565d1136A88610e1298j3812K0678
10871d4432A94159a94750b3298F1609J38032d2531C5471b49837A5649K9332M1581
10860H6562D0441c15251D4841a64702b2042j58123A8622a85211C8598J55639e4352
10848a0182m7851A87206d0544B36453A0535L3356c2307D9801a18367B0716L43501
10837C64217g0622r6005j42P4081m7244j88299a24275E0821e2983B89027a20145
$$ y = [-118524, -299126, 51190, -198813, -88681, 32187, 227284, -344866, 123499, -185694, -46640, 129936, -92334, -139547, -178069, -215188, -217707, 128610, -56175, 143563, -972, 124656, 307027, 116028, -272737, -211521, -20061, -300957, -138535, 5946, 74699, -44687, -131033, -23992, 336812, 224972, -145936, -252979, -220986, -80997, 95565, -41136, 188610, -51298, -65110, -44432, 194159, -194750, -23298, 61609, 199641, -42531, 35471, -249837, 15649, 44981, 86562, 40441, -315251, 44841, -164702, -22042, -180165, 18622, -185211, 38598, 194237, -54352, -10182, -58033, 187206, -40544, 236453, 10535, 43891, -32307, 49801, -118367, 20716, 364217, -70622, -166627, -166769, -92688, -139932, -328231, -124275, 50821, -52983, 289027, -120145]
10825g6259A01546l3487e2719n7741j01063A81838c12916J43440D64048b60148
10814c31091R4932f6431a8830C598Q5300c08816g8943L1125h742q6946A8585a73083
10801b39569M4940E909J6879a26464k0813j76262f4418b997r3806m4883o0374
10790b02060j1532G942J02994M2566e5761r9509A63540a22689j1460n25m5566
10779a80240p0781J10586A31147L1312n1390b23340B13589e3498B69950C6637
10768a47478B9516M9339J17059d59184F9219c26066b2347j4734A53661b00666
10757f9086k47773C634c6139j80971Q183C88665F1488a72221G7461P9416h2821
10745a9812k069c499B82691a67317d2667j21872k22750a48468B34152p6868a00232
$$ y = [-76259, 101546, 68059, -52719, -110460, -211523, 181838, -312916, -169476, 464048, -260148, -331091, -236159, -66431, -18830, 3598, 88898, -308816, -78943, -47818, -8742, -95688, 18585, -173083, -239569, -194629, 5909, 22788, -126464, -147277, -323539, -64418, -2997, -96803, -141686, -202060, -213592, 7942, 110936, 153502, -55761, -155270, 163540, -122689, -134149, -134674, -180240, -251021, -140435, 131147, 162459, 111069, -223340, 213589, -53498, 269950, 36637, -147478, 29516, 78855, 195914, -459184, 69219, -326066, -22347, -37081, 153661, -200666, -69086, -316859, 3634, -36139, -217110, -208927, 388665, 61488, -172221, 77461, 156877, -82821, -19812, -21881, -3499, 282691, -167317, -42667, -164539, -387289, -148468, 234152, 157284, -100232]
10733F6810J07576B6031J88181E9042b12951R1593A09626J986b41108H8216c7226
10721C9723c28941J08918A77951b55508K9790F2080R3640n0895L6720b3284A94682
10709B58194r7029B4661J29617b31238e4589k13213j9709Q1510n739J346a8613
10697b0189B12512b27848A23534C1079a08897A22838i0765j91608J17867b5819
10686c07956R5482b7852P452C1241J35403b25767A12719i3146H6594J06554b28460
10674F3827L11051a36020H5132B0113J14816D6281J25368A6646a11497j90121
10664c01618F8229d8467D3618a5478l8351f628j41736A06434e5431b6362k93396
10653c19758M8984a23016q2348i9811c7863G2060P2805e4799r1431L1143n7689
$$ y = [66810, 174386, 26031, 214212, 59042, -212951, -121358, 109626, 111612, -241108, 88216, -37226, 39723, -328941, -220023, 177951, -255508, -225718, 62080, 155720, 104825, 141545, -23284, 194682, 258194, 161165, 24661, 154278, -231238, -54589, -267802, -287511, -206001, -211740, -210394, -18613, -20189, 212512, -227848, 123534, 31079, -108897, 122838, -90765, -282373, -164506, -25819, -307956, -212474, -27852, -20400, 31241, 166644, -225767, 112719, -93146, 86594, 193148, -228460, 63827, 374878, -136020, 85132, 20113, 134929, 46281, 171649, 16646, -111497, -301618, 68229, -48467, 43618, -15478, -53829, -6628, -148364, 106434, -55431, -26362, -319758, -270774, -123016, -205364, -99811, -37863, 72060, 144865, -54799, -146230, -115087, -172776]
10642a72776a8954A28395a20724j4323l9160B43500a69214Q2570j62219k45049
10632d93912B19303b10767A8658a07331A59745c41004a34909j4829P2957K8090
10622d8691p9832j2432A94737K983e7620G249J8180n456J49351a63528B29905
10610b63297a17124B08866h2899B47686B4489a31140n3984C2515a0591j15093
10600a25684B1591K2046P147f4920m08413K32706P6608k3043C957P6040a98101
10588b95362e6227F8529a82697d9094l2251A81678d4080J3423H6353c1991I7183
10576g413I1264e41285K19505A04957h3963k6868j79183A97983a84487i1339L6277
10565e5062j07491F1213i3800A84280p1648n3983J9079K41682D4298j7065b34162
$$ y = [-172776, -18954, 128395, -120724, -135047, -174207, 243500, -169214, -86644, -248863, -493912, 219303, -210767, 18658, -107331, 159745, -341004, -134909, -149738, -76781, -48691, -128523, -140955, 194737, 197720, -57620, 7249, 25429, 19973, 169324, -163528, 229905, -263297, -117124, 208866, -82899, 247686, 24489, -131140, -185124, 32515, -10591, -125684, 21591, 43637, 50784, -64920, -473333, -240627, -164019, -187062, 3957, 79997, -198101, -295362, -56227, 68529, -182697, -49094, -81345, 181678, -44080, -30657, 86353, -31991, 97183, -7413, 91264, -541285, -321780, 104957, -83963, -110831, -290014, 197983, -184487, -91339, -55062, -162553, 61213, -93800, 184280, 112632, 58649, 77728, 319410, 44298, 27233, -234162]
10553a49988p029A04496a93764d2283m2368k44282a8513f178j13242B601a32106
10541a14418j31672i947k3209j91810a2203j28346M4780j0960d2197j59971A79488
10529B61408a45928B38023J32002c13644f9515D4952e3477k7233j13650G8200
10518a67920r7826A54184P9941q0504a90447A83951g3904C8169M5169L42899a69610
10506a6818k77392F1132B0149J55437b42675j7375C23097a06586d3292J4230A43300
10494c2868l39441a19950m7512C1502J34968g9401B52818a1138B94147A09823
10483B74760n2905P0548F3907j7078C597K65998j13958J12025J01537a28607A34347
10471i9132a6907q8053B44651C0746J10201k1304J66096p9403g9344k97003e9548
$$ y = [-149988, -157017, 104496, -193764, -42283, -84651, -328933, -18513, -6178, -119420, 2601, -132106, -114418, -246090, -9947, -33156, -224966, -12203, -140549, -95769, -106729, -42197, -202168, 179488, 261408, -145928, 238023, 370025, -313644, -69515, 44952, -53477, -80710, -194360, 78200, -167920, -265746, 154184, 234125, 153621, -190447, 183951, -73904, 38169, 83338, 426237, -169610, -16818, -294210, 61132, 20149, 175586, -242675, -260050, 323097, -106586, -43292, -29062, 143300, -32868, -372309, -119950, -167462, 31502, 166470, -79401, 252818, -11138, 294147, 109823, 274760, 221855, 292403, 63907, 46829, 3597, 269595, 155637, 267662, 369199, -128607, 134347, -99132, -16907, -104960, 244651, 30746, 140947, 119643, 285739, 206336, -79344, -376347, -59548]
10459b39048J7174N8735j11312A64898a31876j57841O6799O8396F479d23120A09380
10447a61194k47447A14531b13789e518B6391c16998A75302p0007j9273b55419
10436a93960f2071A88476d27140F426J65506C7562N1186K4378a32671M0439B78998
10424a41595a3528l42007a62072k7822j1366K4053r70B26926G2206N4848m9115
10413G7939a17677K367j4572e4214m4059d939l70876a10592A18251A4746J18941
10402A33687B3308J52011k174J35924a50232f0593B30440Q2338e4161A02647g2449
10390C78179E4139K51097A9202J58984a27161A82097K4725M8378q0300j7358J95213
10379C52755A48650L21830A21936L31106l4231j25345A12473J20662K81044k30531
$$ y = [-239048, -221874, -163139, -274451, 164898, -131876, -289717, -222918, -154522, 6479, -423120, 109380, -161194, -408641, 114531, -213789, -5518, 26391, -316998, 175302, 105295, 86022, -255419, -193960, -62071, 188476, -427140, 6426, 171932, 37562, 88748, 113126, -132671, -92232, 278998, -141595, -13528, -355535, -162072, -189894, -201260, -177207, -178177, 226926, 72206, 127054, 77939, -117677, -115310, -129882, -54214, -98273, -4939, -375815, -110592, 118251, 14746, 133687, 23308, 175319, 173145, 309069, -150232, -60593, 230440, 312778, -54161, 102647, -72449, 378179, 54139, 305236, 19202, 178186, -127161, 182097, 206822, 255200, 174900, 157542, 352755, 148650, 470480, 121936, 453042, 418811, 293466, 112473, 233135, 514179, 283648]
10369B83648J81397L928J8273j79059L0323m0052H8329L19577j25005J296G0935
10357C47049j06496M6333i7042D52279L0785J90324J68292k14624K4682j54142
10347D97596k10165j40752J04197N1999J16300A00049K65121o6357a06491B44095
10336B0645Q2861J53362A4122K73279J39585F6662J34991F0506L8624a14389H0214
10324C5322J09593K59964c0803A4714d9506O207C44675e6020n1580k1891A98460
10312D81672C4035K4174b84902c5093E0525A3075a51525O0152E1603Q6084b56952
10300B4423L84937j10208j0694A20858m8238c630l8242C26957a18586j30809b3449
10288B07800c4026j77478D6555k838h2841A29721b35010a09596C75542a26662
$$ y = [283648, 465045, 468973, 487246, 308187, 338510, 298458, 88329, 407906, 282901, 284197, 70935, 347049, 240553, 286886, -97042, 452279, 483064, 673388, 841680, 627056, 651738, 497596, 287431, 146679, 250876, 302875, 419175, 100049, 365170, 298813, -106491, 244095, 20645, 103506, 256868, 14122, 287401, 426986, 66662, 201653, 60506, 99130, -114389, 80214, 35322, 144915, 404879, -30803, 14714, -49506, -43299, 344675, -56020, -107600, -129491, 198460, 481672, 34035, 58209, -284902, -35093, 50525, 13075, -151525, -91373, 51603, 137687, -256952, 24423, 409360, 299152, 288458, 120858, 72620, -3630, -41872, 326957, -118586, -249395, -23449, 207800, -34026, -211504, 46555, 43717, -82841, 129721, -235010, -109596, 375542, -126662]
10277b80199A1675i6905k1229I1287l4221M5619j5263a58149j65626D24505b15809
10265a32091B92210j04763M9163J11307J09571A51013d1325D7559J02846i0796
10254E18578a97267C17991h2028B7911a19500C3778J31818N454b21045f1981j77327
10243b39308C21844b01270n069h349C1580a58791O7620O792I7003k3081a26240
10231A8644L61573c19747B7664K9675P0415D8911c12957A43886N9818q0346b82156
10219b90078A05409b84066B6111d5173r2202H7278g0870A98286b6048A6540j788
10208A4752a01109F613i8755j4383j8257J9937r6897O2085A66831H462h9284B79237
10195e9315B02577d0909j11441r4796o964B35045I9843b34250B78463e4803j07596
$$ y = [-280199, 11675, -96905, -118134, 91287, 57066, 102685, 87422, -158149, -323775, 424505, -215809, -132091, 292210, 187447, 236610, 347917, 457488, 151013, -41325, 47559, 150405, -90796, 518578, -197267, 317991, -82028, 27911, -119500, 33778, 165596, 171050, -221045, -61981, -239308, 321844, -201270, -206339, -8349, 31580, -158791, -91171, -84379, 97003, 73922, -126240, 18644, 380217, -319747, 27664, 57339, 127754, 48911, -312957, 143886, 203704, 123358, -282156, -290078, 105409, -284066, 26111, -45173, -137375, 87278, -70870, 198286, -26048, 16540, 14752, -101109, 6613, -98755, -113138, -131395, -111458, -208355, -146270, 166831, 8462, -89284, 279237, -59315, 202577, -40909, -152350, -247146, -254110, 235045, 99843, -234250, 278463, -54803, -162399]
10184a62399B08414b52561R5774G3697J51087a63997B44128j4314F6882d86898
10173B7547N5063J13115g5833G7691Q2755a05949A48260a27580j00218b0628q0254
10162a00882H1234a53062G6468J13082a15491j91151I5804b36420k6105g986r9114
10151a07100K4590c5786l6139q3312a4661I6125K17410c5175j62636n1307G7304
10139g3303E7071B6131J82107A5311a74889L5789A1959J5371a9829I3542c35443
10127h9560n9299d1495j50227C3358M4550l6681f690l6004K0754A80871g00636
10115A39917b55203d2576A13503e7731A26348d96527b43458A68656a77907A32916
10104h4532C11050A3215J16201d78076B94472e4406k0413q2354j118B14882n2689
$$ y = [-162399, 208414, -252561, -156787, 73697, 224784, -163997, 244128, 229814, 66882, -486898, 27547, 82610, 195725, -75833, 77691, 160446, -105949, 148260, -127580, -227798, -20628, -100882, 81234, -153062, 76468, 189550, -115491, -306642, 95804, -236420, -262525, -7986, -107100, -82510, -35786, -71925, -155237, -14661, 96125, 313535, -35175, -197811, -249118, 77304, -73303, 57071, 26131, 208238, 15311, -174889, -139100, 11959, 27330, -19829, 93542, -335443, -89560, -148859, -41495, -191722, 33358, 77908, 41227, -6690, -42694, -21940, 180871, -700636, 139917, -255203, -42576, 113503, -57731, 126348, -496527, -243458, 168656, -177907, 132916, -84532, 311050, 13215, 129416, -478076, 294472, -54406, -74819, -157173, -158291, 214882, 162193]
10093A62193J55788a18265o1921f3078k13453e0347q4864E1990M43928I6505a11089
10081E2559a24380J7671A706K5374d34374i1756o4871A06917J12919c07793a15364
10069a2117A3625J78928b63056C24628I3342B1206b83251J30944J6205j6210I2560
10057e660p8295D2043a80752d3921j94543A70285c63566J29606q1787I139a03688
10045a57838N8842B42328g2084o3184C37959r0951m5403g6660B3804c08307B94046
10033B3449a64407O8970n7669C40024a08539B9618a96585M5215B7692b02076b3935
10021B39445A01848f4634F7317a47171n5143K5279L3789C01684a8583k06048a06772
10009a71420I8366f9849m7338A92961b83925g4331B47312a42665A38314a64820
$$ y = [162193, 317981, -118265, -180186, -63078, -276531, -50347, -135211, 51990, 495918, 96505, -111089, 52559, -124380, -106709, 1706, 27080, -434374, -91756, -156627, 106917, 219836, -307793, -115364, -12117, 13625, 192553, -263056, 324628, 93342, 21206, -283251, -152307, -136102, -152312, 92560, -5660, -83955, 42043, -180752, -43921, -238464, 170285, -363566, -233960, -315747, 9139, -103688, -157838, -98996, 242328, -72084, -135268, 337959, 247008, 201605, -76660, 23804, -308307, 294046, 23449, -164407, -95437, -153106, 340024, -108539, 29618, -196585, -151370, 27692, -202076, -23935, 239445, 101848, -64634, 67317, -147171, -202314, -177035, -143246, 301684, -18583, -224631, -106772, -171420, 98366, -69849, -117187, 192961, -283925, -74331, 247312, -142665, 138314, -164820]
9998B2632O4678a52220E4938J04393o3079b55962A17702d86450a96729k53419
9988d50148J26248B03379d07118A70363g3675j16265M2448k86236a05544l0084
9978a35628j18979O0080q6263c7180q3700q2151A8823d5244A02767J1874h7671
9966A41261J0568G4398B4696J20417c9563o8484j37394p4384I4800J3016b45726
9954A46292d05561C7521g4160j70139A87792a48040j22558J32292A28927O2323
9944A91250q9528a63473q1289A79006d1699a1720l24659B9226J59885f3961q3935
9933a47896A27970N0932a43770B93979H9196h2996l16860A2068b93284A7605c49716
9921d5082j3342A80244d16719a88154j71707d2387j9262k7396O210a584o7148
$$ y = [22632, 87310, -152220, 54938, 159331, 96252, -255962, 117702, -486450, -196729, -450148, -323900, 203379, -407118, 170363, -73675, -189940, -147492, -433728, -105544, -135628, -254607, -194527, -280790, -37180, -120880, -203031, 18823, -45244, 102767, 114641, -87671, 141261, 151829, 74398, 24696, 145113, -39563, -108047, -245441, -319825, 94800, 107816, -245726, 146292, -405561, 37521, -74160, -244299, 187792, -148040, -270598, -138306, 128927, 191250, 101722, -163473, -244762, 179006, -41699, -11720, -336379, 29226, 189111, -63961, -147896, 127970, 178902, -143770, 293979, 89196, -82996, -399856, 12068, -293284, 17605, -349716, -45082, -58424, 180244, -416719, -188154, -359861, -42387, -61649, -89045, -82835, -1584, -68732]
9910f8732B51788b93770a12254k3140M033k8200A84977b9345A91268A2066K01127
9899B13193a89134A03544K4308B5083c19996L1378a4920k37390A67976a85838
9888B26057p3457f2422p6962H7613a85434H5370r683j6435J48805a21238o9573
9877a90811M4799a7446j52879k2662g5413I060e5054l4995j1122b5565B32832
9865f2974j6805l00254A28430a87135e2320I9950a68846A69648d8239o3498C4170
9853e5725B2069N4993J57866a14944j748J9269k88712A6859a46619N8546p9263
9842a67336A99017c28143J4753J49891G9188a95362k6754N2898k0717l0876A36272
9830c75802A40144A304g8487A17733a8165C34209A11191a15153K6120A5288a93904
$$ y = [-68732, 251788, -293770, -112254, -135394, -131361, -159561, 184977, -29345, 191268, 12066, 213193, -189134, 103544, 127852, 25083, -319996, -288618, -14920, -252310, 167976, -185838, 226057, 152600, -62422, -139384, 87613, -185434, 85370, 75687, 59252, 208057, -121238, -190811, -146012, -17446, -170325, -192987, -75413, 9060, -55054, -90049, -101171, -25565, 232832, -62974, -79779, -380033, 128430, -187135, -52320, 99950, -168846, 169648, -48239, -111737, 34170, -55725, 22069, 77062, 234928, -114944, -116692, -97423, -386135, 16859, -146619, -88073, -167336, 199017, -328143, -313390, -163499, 79188, -195362, -222116, -169218, -189935, -220811, 136272, -375802, 140144, 1304, -78487, 117733, -18165, 334209, 111191, -115153, -89033, 15288, -193904]
9818d32479g9834j6970H3989N7942b05848i6567D9924K2551c01253J17794D9505
9806c66793H3086a49931M5702b3414l7693M500j90802F4966c42794A4393f3580
9794e938k21155D9835a16513B6548g9097p2908m127j07320d0309C969L06524r5367
9782B15126b46440F5016k0952Q9261b58231e1941C21187D7882b26175P4255e0253
9770f4283A401f7496I45L6694K55016A0116J16542h1330r5955F3771B3108L2970
9758E6078a96649D771b95754f0360A8676K01798a45448B59848A23608C577a43022
9746e4353m29209a90853R1028M7091A42398F4837h9130j07339O3428N2325B2774
9734A04993l9506Q4254D1102a67782j86947A67064n2188G568c19803M923d5593
$$ y = [-432479, -79834, -96804, 83989, 141931, -205848, -96567, 49924, 72475, -301253, -183459, 49505, -366793, 83086, -149931, -104229, -23414, -61107, -56607, -247409, 64966, -342794, 14393, -63580, -5938, -227093, 49835, -116513, 26548, -79097, -152005, -156132, -263452, -40309, 3969, 310493, 215126, -246440, 65016, 44064, 133325, -258231, -51941, 321187, 47882, -226175, -151920, -50253, -64283, 1401, -67496, 945, 37639, 292655, 10116, 126658, -81330, -177285, 63771, 23108, 56078, -196649, 4771, -295754, -60360, 18676, 220474, -145448, 259848, 123608, 3577, -143022, -54353, -483562, -190853, -99825, -52734, 142398, 64837, -89130, -196469, -133041, -80716, 22774, 104993, 65487, 149741, 41102, -167782, -354729, 167064, 114876, 7568, -319803, -314880, -45593]
9722A6512g0041J0795k86323E4693h9753k011c7640j47320j7730B3581K63284
9711B86865E0099c32395h7228p5476a0736r0994r1520M8241f3019k84485A7355
9699A93812a60065l04439a00119A47473a00621j41823J00479p1819o400H1289
9688c53384A51688c62523a07715o2183A61173N0480a08277A71017a29680L016
9678a26664l54874a6895k1523o9137k0290O0027A48569Q1311e9782m3591E0388
9666a56547j42410a20343k69735a4110j27674H5964d2009I7938b8208I4118c12845
9654B1714a00402C9229a05418F794J95547c4677B75746b3155n2109p9875O9956
9643h5183j03202G2017b53289H6140a45425A41218c65500J44287g02j57396F1193
$$ y = [16512, -70041, -59246, -345569, 54693, -89753, -91764, -37640, -184960, -202690, 23581, 286865, 50099, -332395, -87228, -162704, -10736, -101730, -193250, -145009, -63019, -347504, 17355, 193812, -160065, -464504, -100119, 147473, -100621, -242444, -141965, -213784, -220184, 81289, -353384, 151688, -362523, -107715, -169898, 161173, 211653, -108277, 171017, -129680, -126664, -481538, -16895, -38418, -107555, -127845, -67818, 148569, 229880, -59782, -103373, 50388, -156547, -298957, -120343, -390078, -14110, -141784, 85964, -42009, 97938, -28208, 94118, -312845, 21714, -100402, 39229, -105418, 6794, 202341, -34677, 275746, -23155, -75264, -155139, -85183, -188385, 72017, -253289, 86140, -145425, 141218, -365500, -221213, -702, -158098, 61193]
9631a67673P6222G5229h3659n2196k46854a4872k29975I68b5000C9577a46526
9619I0662b32794H7476R8152b9478j51482B5888P215b03096p0618D1548b73296
9607a9624j83805o4194K6074E4453a06600C26763c348m7070J2802D93424c62351
9595A16819e1960m0388B9718K02690a63004A7071K102e5448j06070P831B63368
9583D0881a96315l0794A74424a03374I7109b16085j4721P6618J4159m8545j246
9572a89820A59517J13328H0339B7641b67636p7040P1050M8468i8030j20133L3255
9561a84908H612L9766b77561j07688F7505b05976j05442c5065p9175k226E9673
9549I5823b62135h3326b7880B04386a74843A71256g5261l1372C2549a2654j04891
$$ y = [-167673, -91451, 75229, -83659, -135855, -382709, -14872, -244847, 968, -25000, 39577, -146526, 90662, -232794, 87476, 185628, -29478, -180960, 25888, 33103, -203096, -273714, 41548, -273296, -19624, -203429, -267623, -241549, 54453, -106600, 326763, -3348, -50418, -37616, 493424, -362351, 116819, -51960, -92348, 29718, 232408, -163004, 17071, 19173, -55448, -161518, -153687, 263368, 40881, -196315, -227109, 174424, -103374, 97109, -216085, -230806, -154188, -140029, -188574, -189820, 159517, 272845, 80339, 27641, -267636, -344676, -273626, -225158, -98030, -218163, -184908, 8612, 48378, -277561, -385249, 67505, -205976, -311418, -35065, -114240, -116466, 59673, 95823, -262135, -83326, -27880, 204386, -174843, 171256, -75261, -106633, 32549, -12654, -117545]
9538a17545q9870O0431E2693K6147A5462g5901m461k00169d8854B4322L1662P019
9526F3003L12504a29765B79276a82373I4149a02120A10154a13214K8965l50356
9516d34605J83699a18615a3863k36373a13977A64631E414a78436A7621a66006
9505H6751J1316l1089a91418a047m82441J90256b3584j18680d2752G6195h2547
9493g5806B69977m6128H9920b1072C031Q2112i3225k55545A90226c9489B79522
9481B7877e6878b1485o1402K1815l9586K5462j76152k5469a03101k57467A28567
9469b15453E0649b86850A27912e2249J4186F4690c56199J20776M1253f0851I8839
9457a69026K3900A6412J7580J58800a57470k22576l0621A73320h425j9587o7539
$$ y = [-117545, -207415, -146984, 52693, 78840, 15462, -75901, -80362, -280531, -48854, 24322, 55984, 63003, 375507, -129765, 279276, -182373, 94149, -102120, 110154, -113214, -84249, -434605, -250906, -118615, -13863, -250236, -113977, 164631, 5414, -178436, 17621, -166006, 86751, 98067, 66978, -191418, -1047, -483488, -293232, -23584, -142264, -42752, 76195, -82547, -75806, 269977, 223849, 89920, -21072, 3031, 85143, -93225, -348770, 190226, -39489, 279522, 27877, -56878, -21485, -82887, -61072, -100658, -75196, -251348, -276817, -103101, -360568, 128567, -215453, 50649, -286850, 127912, -52249, -38063, 64690, -356199, -235423, -194170, -60851, 98839, -169026, -145126, 16412, 33992, 192792, -157470, -380046, -410667, 173320, -8425, -28012, -95551]
9446i5551k48728c5804j71356h1227c6581a3352k99198A19129a00519A02163a61008
9434f6710A3975c20969Q2154j00338B0802i4491j58416J12240m4126J7227k5954
9423a93520A2535J10870a91940d0762E7895o10J37498D7163J06502a29964J5327
9412a14637k07817R4440B84234r8148F6887c60003a1524A98978b2513j89126M5032
9401a66607A19879i2584L8927j22408P44B40101F2915J17c6190r474o8277G5884
9388b30276b4093k42486A1374b44808G9628J63832i4136A89894d4256a7752A1603
9376E3666b2126l37983J43575N2577A10114b82459e3918k52960B57441b58737
9365a07865K6848F4606b94157a06284j44648d3643q1109k48400J26054R2714j10109
$$ y = [-95551, -344279, -35804, -207160, -81227, -36581, -13352, -312550, 119129, -100519, 102163, -161008, -66710, 13975, -320969, -238815, -339153, 20802, -94491, -252907, -140667, -184793, -167566, -193520, 12535, 123405, -191940, -40762, 57895, 57285, 194783, 47163, 153665, -129964, -114637, -322454, -228014, 284234, 186086, 66887, -360003, -11524, 198978, -22513, -211639, -166607, 119879, -92584, -53657, -176065, -175321, 240101, 62915, 63032, -36190, -45664, -113941, 75884, -230276, -24093, -266579, 11374, -244808, 79628, 243460, -94136, 189894, -44256, -17752, 11603, 53666, -22126, -360109, -216534, -163957, 110114, -282459, -53918, -306878, 257441, -258737, -107865, -81017, 64606, -294157, -106284, -250932, -43643, -124752, -373152, -247098, -154384, -264493]
9354b64493B596c7797J5211k67641G5506A0213c3798m3449j80l24318H8758A413
9341a19027k58074A22698b26760K0729O0177L1201k1899A8856O9743a80294h5043
9329d7725A92562H8224c46766A63983b77731j2757A75242a10849m7023n2652B04471
9317d2275D4360K64644b36003B14043A8728d6201k92145M4796L0780P518A32882
9305E4131k3561b06463k76234f2754g532r9592p1646g0518Q664H2207O5779a10469
9292C61913j42077A01229b12314J05931A36529b64685C59140c8289j48271q4167
9282b70727H1368b25012h1167B33613C2953F669a52706r9932a7896A67164b38295
9270A9579b00231B91751f695o012G0908C5272K16023k2520a05204c7239k8660
$$ y = [-264493, 2596, -37797, -22586, -290227, 75506, 10213, -33798, -77247, -77427, -401745, 88758, 1413, -119027, -377101, 122698, -226760, -206031, -145854, -114653, -136552, 18856, 88599, -180294, -85043, -47725, 192562, 88224, -346766, 163983, -277731, -290488, 175242, -110849, -157872, -210524, 204471, -42275, 44360, 309004, -236003, 214043, 18728, -46201, -338346, -293550, -262770, -255252, 132882, 54131, 30570, -206463, -482697, -62754, -7532, -107124, -178770, -70518, -61854, 82207, 147986, -110469, 361913, 219836, 101229, -212314, -106383, 136529, -264685, 359140, -38289, -186560, -270727, 81368, -225012, -81167, 233613, 32953, 6669, -152706, -252638, -17896, 167164, -238295, 19579, -200231, 291751, -6695, -12707, 70908, 35272, 251295, 228775, -105204, -37239, -65899]
9259f5899A90945E9966K9619c27329G0818a63145j78767J46573D3649c44030n3820
9248c97850a16644A67439C3339a56388j8976E3858b76284J25294c9690C64335
9237g429C6622a29344C971g4151C1080J2354a29161j88653B19685J8708a01678
9225A04763b06044R9194k6581A7729N5150J60603a27236q7755O8636j85795a45781
9213A3022J5413a1806B39490i8838c3677A54568a67426M5427j23593h28I9823
9201c5828k5896O12B81124j36319a14638A34918a90671c1417j38297A4883a36922
9189a26640B2913f4247a3020j50405B82034A27805M8383c6515j29875B52637e9283
9177e4951k88937I6871H71N5944d58861D9643b5371k2118r6943H7315d8198F3784
$$ y = [-65899, 190945, 59966, 89585, -327329, 70818, -163145, -341912, -195339, 43649, -344030, -397850, -116644, 167439, 33339, -156388, -175364, 53858, -276284, -150990, -39690, 364335, -7429, 36622, -129344, 3971, -74151, 31080, 43434, -129161, -317814, 219685, 238393, -101678, 104763, -206044, -106850, -133431, 17729, 72879, 233482, -127236, -214991, -146355, -332150, -145781, 13022, 28435, -11806, 239490, -98838, -33677, 154568, -167426, -121999, -245592, -828, 99823, -35828, -61724, -61112, 281124, 144805, -114638, 134918, -190671, -31417, -169714, 14883, -136922, -126640, 22913, -64247, -13020, -163425, 282034, 127805, 176188, -36515, -166390, 252637, -59283, -54951, -343888, 96871, 871, 56815, -458861, 49643, -25371, -47489, -144432, 87315, -48198, 63784]
9164g4252k44412B33226j2301c15263b4082A01394D5487b41632A80155a63383
9153a23577I5240b24251i3371B3019c8092l48566A14602d64284I1401B9988a74659
9141e5608m8183C1340J58394n9878a14842A2696L58590g5347G6537b3010A92725
9129d63109b21882L5837a901C9235j938a921j04779q7786b1169k55994J13514
9118a63649A61626a1984B28726b50799j42049E6835L8666C5916a44860B63209
9107c32918e8116k44621O9798B6799O1103d618k10391C2584M6785A5796e6614
9095C5041b8540E9142b27165a1618l12566A75833b55138a11545N1253p5507A35622
9083D3440b1971H9060d2571o0734A85091d74421A62149i2733m4644b0882p0162
$$ y = [-74252, -318664, 233226, 220925, -315263, -24082, 101394, 45487, -241632, 180155, -163383, -123577, 95240, -224251, -93371, 23019, -38092, -386658, 114602, -464284, 91401, 29988, -174659, -55608, -103791, 31340, 189734, 129856, -114842, 12696, 371286, -75347, 76537, -23010, 192725, -463109, -221882, -186045, -1901, 39235, 37297, -1921, -106700, -194486, -21169, -277163, -163649, 161626, -11984, 228726, -250799, -392848, 56835, 95501, 35916, -144860, 263209, -332918, -58116, -302737, -232939, 26799, 87902, -4618, -215009, 32584, 79369, 15796, -56614, 35041, -28540, 59142, -227165, -11618, -324184, 175833, -255138, -111545, -60292, -135799, 135622, 43440, -21971, 89060, -42571, -103305, 185091, -474421, 162149, -92733, -137377, -20882, -91044]
9072i1044A76449a37344C8521K85047i5537A42908m7895a83376j34975A98022
9061f1171B44567D3589d6495k22361C77370B8428f2036j43971c9318j21773m3583
9050b04674A90414F0314a67317d5612k91018a02994A15299b1523j59549d1393
9039D2049O6721b71A14887c4188p0398d5509E6260B2317b66926B16095a70101
9027A79285H792b03796A53615C4492R4069h0075I1170J84003A4866K01750c17622
9015d80479a97903p3932M8126L2863Q0372j23726A20008a24983K2237n2880O2319
9004i3307B38385D9291B2989J29041A1787J52716c26849B9885f0099l0421j92358
8993b82878Q3588A6063b44410b149A02418d60308I6050a8924k33083F4452Q90
$$ y = [-91044, 176449, -137344, 38521, 323568, -95537, 142908, 95013, -183376, -318351, 198022, -61171, 244567, 43589, -46495, -268856, 377370, 28428, -62036, -206007, -39318, -161091, -204674, 190414, 60314, -167317, -45612, -336630, -102994, 115299, -21523, -181072, -41393, 42049, 108770, -271, 114887, -34188, -104586, -45509, 56260, 22317, -266926, 216095, -170101, 179285, 8792, -203796, 153615, 34492, 128561, -80075, 91170, 275173, 14866, 216616, -317622, -480479, -197903, -271835, -223709, -190846, -110474, -234200, 120008, -124983, -102746, -155626, -93307, 238385, 49291, 22989, 152030, 11787, 164503, -326849, 29885, -60099, -90520, -282878, -199290, 16063, -244410, -2149, 102418, -460308, 96050, -18924, -252007, 64452, 65342]
8982F5342e0478G4122a71715q355H7548K3008c84005d8021j33670A96690d9377
8970c20612a48322O5672a9946B78580a01128A84714d15222A91215A4568O06a53396
8958b52677h8963K9387G9888c52642E542c25583A27190a12128k08271e2676B06635
8946b01391k00606C1407b66251R9342k65130A00884d2367j40279j2332B1593r137
8935A2456J8025c04060a27614H2383a29331J1134A17547Q1860I5407K56424K22978
8924E74809N49949K712506O413812A435679D54038A01601O0030b3936H2109Q6715
8914A68824b00205P1503o7810i3292A4138J71835d7969j00749k26826i828j04209
8903a14037C08340b71686C4731b34917Q8776H640c21773K5155f5235k97117A66761
$$ y = [65342, -50478, 74122, -171715, -180070, 87548, 110556, -384005, -48021, -181691, 196690, -49377, -320612, -148322, -82650, -19946, 278580, -101128, 184714, -415222, 191215, 14568, 15174, -153396, -252677, -88963, -59576, 79888, -352642, 5542, -325583, 127190, -112128, -320399, -52676, 206635, -201391, -401997, 31407, -266251, -166909, -432039, 100884, -42367, -182646, -194978, 21593, 12456, 30481, -304060, -127614, 82383, -129331, -118197, 117547, 199407, 95407, 351831, 574809, 1124758, 3837264, 10251076, 1435679, 454038, 101601, 161631, -23936, 82109, 168824, -200205, -128702, -196512, -93292, 14138, 185973, -47969, -148718, -375544, -9828, -114037, 308340, -271686, 34731, -234917, -146141, 8640, -321773, -296618, -65235, -362352, 166761]
8891A15399h0143k74046b5614k42423B18050c07030C2819g7704A41915a44537
8880B38901c6921l2103J4621n7872j75411L8818A29253R6498a09571j17492j9501
8869b46564J07733j3373P435A90225f6701d487k04996n3891A53949a27803B25461
8857i6628M0308q4740I1148j7111b96560J29954B01534e4222H7809C8308J20277
8846A58585b53797I7005K1228n6504b24541A28071a23774j05061A01774O3183
$$ y = [115399, -80143, -354189, -25614, -268037, 218050, -307030, 32819, -77704, 141915, -144537, 238901, -36921, -69024, -54403, -112275, -287686, -248868, 129253, 225751, -109571, -227063, -246564, -138831, -152204, -144769, 190225, -66701, -4487, -209483, -263374, 153949, -127803, 225461, -96628, -56320, -141060, 91148, 74037, -296560, -166606, 201534, -54222, 87809, 38308, 158585, -253797, 97005, 118233, 61729, -224541, 128071, -123774, -228835, 101774, 164957]
$$ [...]
##END NTUPLES=NMR SPECTRUM
##END=
