
##TITLE=AC1368_2392_7221419_SvWENlBDkv
##JCAMPDX= 6.0         $$ Bruker NMR JCAMP-DX V2.0
##DATA TYPE= NMR SPECTRUM
##DATA CLASS= NTUPLES
##ORIGIN= BRUKER
##OWNER= Administrator
$$ 1.72 TOPSPIN		Version 2.1
$$ 2012-12-14 01:35:35.867 -0500  Administrator@X
$$ Compression mode = diff/dup
##.OBSERVE FREQUENCY= 400.02188249412
##.OBSERVE NUCLEUS= ^1H
##.ACQUISITION MODE= SIMULTANEOUS (DQD)
##.ACQUISITION SCHEME= undefined
##.AVERAGES= 64
##.DIGITISER RES= 22
##SPECTROMETER/DATA SYSTEM= spect
##.PULSE SEQUENCE= noesygpps1d.comp
##.SOLVENT NAME= COFFEE_meoh
##.SHIFT REFERENCE= INTERNAL, COFFEE_meoh, 1, 14.96048
##AUDIT TRAIL= $$ (NUMBER, WHEN, WHO, WHERE, PROCESS, VERSION, WHAT)
$$ ##TITLE= Audit trail, TOPSPIN		Version 2.1
$$ ##JCAMPDX= 5.01
$$ ##ORIGIN= Bruker BioSpin GmbH
$$ ##OWNER= Administrator
$$ $$ E:\/data/COFFEE/nmr/AC1368_2392_7221419_SvWENlBDkv/22/pdata/1/auditp.txt
$$ ##AUDIT TRAIL=  $$ (NUMBER, WHEN, WHO, WHERE, PROCESS, VERSION, WHAT)
(   1,<2012-12-14 01:35:29.976 -0500>,<Administrator>,<X>,<go>,<TOPSPIN 2.1>,
      <created by zg
	started at 2012-12-14 01:23:59.568 -0500,
	POWCHK enabled, PULCHK disabled,
       configuration hash MD5:
       86 BA 57 50 F2 9D 5C 9B 26 00 A9 28 5F 66 2E 89
       data hash MD5: 64K
       77 86 29 9F EF 6A F8 45 A8 78 01 6A 5F B8 10 BE>)
(   2,<2012-12-14 01:35:33.054 -0500>,<Administrator>,<X>,<proc1d>,<TOPSPIN 2.1>,
      <Start of raw data processing
       efp LB = 0.3 FT_mod = 6 PKNL = 1 PHC0 = 0 PHC1 = 0 SI = 128K 
       data hash MD5: 128K
       DF EE E7 E9 09 1E 5D A8 68 63 DF B4 82 81 8F 68>)
(   3,<2012-12-14 01:35:34.132 -0500>,<Administrator>,<X>,<proc1d>,<TOPSPIN 2.1>,
      <pk PHC0 = -75.98694 PHC1 = 0 
       data hash MD5: 128K
       9B 6A 26 B0 B7 06 BD 6E DF 98 B7 5E 58 3F 3B AB>)
(   4,<2012-12-14 01:35:34.789 -0500>,<Administrator>,<X>,<proc1d>,<TOPSPIN 2.1>,
      <abs ABSG = 1 
       data hash MD5: 128K
       01 EB 2B C1 9F 78 B7 68 F2 4E 73 0A 31 70 3F 6D>)
(   5,<2012-12-14 01:35:34.961 -0500>,<Administrator>,<X>,<proc1d>,<TOPSPIN 2.1>,
      <abs ABSG = 2 
       data hash MD5: 128K
       4F 94 2F E3 7E CC ED AF 41 97 E3 A3 86 85 BF BE>)
(   6,<2012-12-14 01:35:35.148 -0500>,<Administrator>,<X>,<proc1d>,<TOPSPIN 2.1>,
      <abs ABSG = 3 
       data hash MD5: 128K
       7D 44 20 A7 F4 81 C3 FC A3 7D D5 12 00 9E B0 46>)
(   7,<2012-12-14 01:35:35.320 -0500>,<Administrator>,<X>,<proc1d>,<TOPSPIN 2.1>,
      <abs ABSG = 4 
       data hash MD5: 128K
       FF 9E 5C E1 E0 77 6C 82 4C E5 16 84 C6 FF 0C ED>)
(   8,<2012-12-14 01:35:35.507 -0500>,<Administrator>,<X>,<proc1d>,<TOPSPIN 2.1>,
      <abs ABSG = 5 
       data hash MD5: 128K
       77 35 7C 24 01 0A B9 5D E2 82 1C 8C CA E6 A9 0C>)
$$ ##END=
$$ 
$$ $$ hash MD5
$$ $$ 59 F9 6B EE 0C 86 11 16 B4 BF 27 BA A5 A8 4F AD
##$RELAX= 
##$RELAX= 
##$RELAX= 
##$RELAX= 
##$RELAX= 
##$RELAX= 
##$RELAX= 
##$RELAX= 
##$RELAX= 
$$ Bruker specific parameters
$$ --------------------------
##$DU= <E:\>
##$EXPNO= 22
$$ [...]
##$TP07= 0
##$TPNAME0= <>
##$TPNAME1= <>
##$TPNAME2= <>
##$TPNAME3= <>
##$TPNAME4= <>
##$TPNAME5= <>
##$TPNAME6= <>
##$TPNAME7= <>
##$TPOAL= (0..7)
0.5 0.5 0.5 0.5 0.5 0.5 0.5 0.5
##$TPOFFS= (0..7)
0 0 0 0 0 0 0 0
##$TUNHIN= 0
##$TUNHOUT= 0
##$TUNXOUT= 0
##$USERA1= <user>
##$USERA2= <user>
##$USERA3= <user>
##$USERA4= <user>
##$USERA5= <user>
##$V9= 5
##$VALIST= <valist>
##$VCLIST= <CCCCCCCCCCCCCCC>
##$VD= 0
##$VDLIST= <DDDDDDDDDDDDDDD>
##$VPLIST= <PPPPPPPPPPPPPPP>
##$VTLIST= <TTTTTTTTTTTTTTT>
##$WBST= 1024
##$WBSW= 4
##$XGAIN= (0..3)
0 0 0 0
##$XL= 0
##$YL= 0
##$YMAX_a= 5943490
##$YMIN_a= -11718756
##$ZGOPTNS= <>
##$ZL1= 120
##$ZL2= 120
##$ZL3= 120
##$ZL4= 120
##$ABSF1= 14.96048
##$ABSF2= -5.597702
##$ABSG= 5
##$ABSL= 3
##$ALPHA= 0
##$AQORDER= 0
##$ASSFAC= 0
##$ASSFACI= 0
##$ASSFACX= 0
##$ASSWID= 0
##$AUNMP= <proc_prof1d_extract.lims>
##$AXLEFT= 0
##$AXNAME= <>
##$AXNUC= <1H>
##$AXRIGHT= 0
##$AXTYPE= 0
##$AXUNIT= <>
##$AZFE= 0.1
##$AZFW= 0.1
##$BCFW= 0
##$BC_mod= 0
##$BYTORDP= 0
##$COROFFS= 0
##$CY= 15
##$DATMOD= 1
##$DC= 0
##$DFILT= <>
##$DTYPP= 0
##$F1P= 0
##$F2P= 0
##$FCOR= 0.5
##$FTSIZE= 131072
##$FT_mod= 6
##$GAMMA= 0
##$GB= 0
##$INTBC= 1
##$INTSCL= 1
##$ISEN= 128
##$LB= 0.3
##$LEV0= 0
##$LPBIN= 0
##$MAXI= 10000
##$MC2= 0
##$MEAN= 0
##$ME_mod= 0
##$MI= 0
##$NCOEF= 0
##$NC_proc= -2
##$NLEV= 6
##$NOISF1= 0
##$NOISF2= 0
##$NSP= 0
##$NTH_PI= 0
##$NZP= 0
##$OFFSET= 14.96048
##$PC= 1
##$PHC0= -75.98694
##$PHC1= 0
##$PH_mod= 1
##$PKNL= yes
##$PPARMOD= 0
##$PPDIAG= 0
##$PPIPTYP= 0
##$PPMPNUM= 2147483647
##$PPRESOL= 1
##$PSCAL= 4
##$PSIGN= 0
##$PYNMP= <proc.py>
##$REVERSE= no
##$SF= 400.020009845546
##$SI= 131072
##$SIGF1= 0
##$SIGF2= 0
##$SINO= 400
##$SIOLD= 131072
##$SPECTYP= <>
##$SREGLST= <1H.CDCl3>
##$SSB= 0
##$STSI= 131072
##$STSR= 0
##$SW_p= 8223.68421052631
##$SYMM= 0
##$S_DEV= 0
##$TDeff= 65536
##$TDoff= 0
##$TI= <>
##$TILT= no
##$TM1= 0
##$TM2= 0
##$TOPLEV= 0
##$USERP1= <user>
##$USERP2= <user>
##$USERP3= <user>
##$USERP4= <user>
##$USERP5= <user>
##$WDW= 1
##$XDIM= 131072
##$YMAX_p= 401149587
##$YMIN_p= -13117
##$CURPLOT= <Network HP LaserJet P1505>
##$CURPRIN= <$Network HP LaserJet P1505>
##$DFORMAT= <normdp>
##$LAYOUT= <+/1D_H.xwp>
##$LFORMAT= <normlp>
##$PFORMAT= <normpl>
##$SURQMSG= 1
$$ End of Bruker specific parameters
$$ ---------------------------------
##NTUPLES= NMR SPECTRUM
##VAR_NAME=  FREQUENCY,     SPECTRUM/REAL,   SPECTRUM/IMAG
##SYMBOL=    X,             R,               I
##VAR_TYPE=  INDEPENDENT,   DEPENDENT,       DEPENDENT
##VAR_FORM=  AFFN,          ASDF,            ASDF
##VAR_DIM=   131072,        131072,          131072
##UNITS=     HZ,            ARBITRARY UNITS, ARBITRARY UNITS
##FACTOR=    0.0627417313425164, 1,          1
##FIRST=     8223.62146879497, 47,           -59113
##LAST=      0,             2698,            -59460
##MIN=       0,             -13117,          0
##MAX=       8223.62146879497, 401149587,    0
$$ Real data points
##PAGE= N=1
##DATA TABLE= (X++(R..R)), XYDATA
$$ [...]
61816A442640l868j7199l0321m2040n1330n7852o2032o4386o4977o3664o0629
$$ 1442640 1438772 1421573 1391252 1349212 1297882 1240030 1177998 1113612 1048635 984971 924342
61805I24342n6414n1624m6846m2604l8974l5402l1385k7240k3731k1010j8527
$$ 924342 867928 816304 769458 726854 687880 652478 621093 593853 570122 549112 530585
61794E30585j6067j4108j2876j1783j0273q658p562o962o414n878n571n318m716
$$ 530585 514518 500410 487534 475751 465478 456820 449258 442296 435882 430004 424433 419115 414399
61781D14399l911l441l395l294k868k292j626p06L07Q86Q88P99R37R53M96r0k12
$$ 414399 410488 407047 403652 400358 397490 395198 393572 392866 393173 394059 394947 395746 396683 397636 398132 398042 397830
61764C97830J26M17L95L81Q27J804K934L703L866L575L135K745K501K432K269
$$ 397830 397956 398373 398768 399149 399976 401780 404714 408417 412283 415858 418993 421738 424239 426671 428940
61749D28940J477n1j535k032j534q64n32l80l25o94j486j997j601m92O97J595
$$ 428940 430417 430366 428831 426799 425265 424401 423869 423489 423164 422470 420984 418987 417386 416894 417591 419186
61733D19186K014J732Q93L03P56K109L434L982L750L259L117L672M724N635N909
$$ 419186 421200 422932 423825 424128 424884 426993 430427 434409 438159 441418 444535 448207 452931 458566 464475
61718D64475N657N365N353N624O006O241O016N096L511J558l29j889l333n098
$$ 464475 470132 475497 480850 486474 492480 498721 504737 509833 513344 514902 514573 512684 509351 504253
61704E04253p070q350q311p571p178p101o433n141m343m549m724l850k472j836
$$ 504253 497183 488833 480522 472951 465773 458672 452239 447098 442755 438206 433482 429632 427160 425324
61690D25324k194k864l405l732l581k845k127k085k443k525k395k512k576j932
$$ 425324 423130 420266 416861 413129 409548 406703 404576 402491 400048 397523 395128 392616 390040 388108
61676C88108r83q50j547j802j039k57k87m33K26J131J023r0r79r72o53o87r06
$$ 388108 387125 386275 384728 382926 381887 381630 381343 380910 381136 382267 383290 383200 382221 381249 380596 379909 379003
61659C79003q38m40P9P48J623K388K551K119J760K173L375M678N379N360N043
$$ 379003 378165 377725 377804 378552 380175 382563 385114 387233 388993 391166 394541 399219 404598 409958 415001
61644D15001M942N325O141P026P443P122O334N500M542L006Q54j315l027m570
$$ 415001 419943 425268 431409 438435 445878 453000 459334 464834 469376 472382 473236 471921 468894 464324
61630D64324o421q286r265q890p616o145m728l294j973j062n53k7Q74J983K735
$$ 464324 457903 449617 440352 431462 423846 417701 412973 409679 407706 406644 406091 406064 406938 408921 411656
61615D11656K740K143J474J073O72l27k066l921n151n785o472p393p849p226o018
$$ 411656 414396 416539 418013 419086 419758 419431 417365 413444 408293 402508 396036 388643 380794 373568 367550
61600C67550n366n667o192o170n677n243m986m594l937l335l133l285l427l220
$$ 367550 362184 356517 350325 344155 338478 333235 328249 323655 319718 316383 313250 309965 306538 303318
61586C03318k598j806j243j157j455j808j993k109k340k600k581k274k132k452
$$ 303318 300720 298914 297671 296514 295059 293251 291258 289149 286809 284209 281628 279354 277222 274770
61572B74770k758k418j803k026l272m163l435j666m36k39k16J51L45m9n98q26
$$ 274770 272012 269594 267791 265765 262493 258330 254895 253229 252793 252554 252338 252489 252834 252785 252187 251361
61556B51361q83r19o16L1K46m52j273j074O6J029J226J167J457J895J854J133
$$ 251361 250478 249559 248943 248974 249220 248768 247495 246421 246487 247516 248742 249909 251366 253261 255115 256248
61540B56248J72m66o49o61n64J07J662L378M012L273K135J433R16J02p51j187
$$ 256248 256420 255954 255305 254644 254080 254187 255849 259227 263239 266512 268647 270080 270996 271098 270347 269160
61524B69160j424j881k346k423k440k959l631l573k764k164k303k626k411j637
$$ 269160 267736 265855 263509 261086 258646 255687 252056 248483 245719 243555 241252 238626 236215 234578
61510B34578p47j25k2m93j144j335q64j55L05L51Jo09j118j128n80K26R35J214
$$ 234578 233831 233706 233684 233191 232047 230712 229848 229693 229998 230349 230350 229741 228623 227495 226915 227141 228076 229290
61492B29290Q12J2k93M05J330J244J03q33o60J58N83J87o87j385j282k33J054
$$ 229290 230102 230114 229821 230226 231556 232800 232903 232070 231410 231568 232151 232338 231651 230266 228984 228751 229805
61475B29805J578J159N90N23P41Q09P73Q94J054R48N67J68q2j88k41l77o18p04
$$ 229805 231383 232542 233132 233655 234396 235205 235978 236872 237926 238874 239441 239609 239527 239339 239098 238721 238103 237399
61457B37399l71J85M71L40J48K02N02R73J511J781J522J076R70R80M51l35r5J606
$$ 237399 237028 237213 237684 238024 238172 238374 238876 239849 241360 243141 244663 245739 246709 247689 248140 247805 247710 249316
61439B49316L436M009L711L923M923N745N801N502N207M576L378K105J307Q01
$$ 249316 252752 256761 260472 264395 269318 275063 280864 286366 291573 296149 299527 301632 302939 303740
61425C03740J09o70r15l41O63J591K387L292M269M852M653L904L293L216L295
$$ 303740 303849 303179 302264 301923 302586 304177 306564 309856 314125 318977 323630 327534 330827 334043 337338
61410C37338K759J265o98k292l171l777m695n855o579o450n770m999m154l104
$$ 337338 340097 341362 340664 338372 335201 331424 326729 320874 314295 307845 302075 297076 292922 289818
61396B89818k162j815k024k248k164j877j465q77l32k43n69p77o23m54m75k63
$$ 289818 287656 285841 283817 281569 279405 277528 276063 275186 274854 274611 274042 273265 272642 272188 271713 271450
61380B71450N87J666K175J882J303J009J090J259J262J211J623K847M351M921
$$ 271450 272037 273703 275878 277760 279063 280072 281162 282421 283683 284894 286517 289364 293715 298636
61366B98636L926K177J125J366K247K912L233L583M027M158L813L594M357O134
$$ 298636 302562 304739 305864 307230 309477 312389 315622 319205 323232 327390 331203 334797 339154 345288
61352C45288P917Q780Q951R391J0459J1475J1612J0825R660Q557P553O567N671
$$ 345288 353205 361985 370936 380327 390786 402261 413873 424698 434358 442915 450468 457035 462706
61339D62706N128N112N420N593N515N647O270O732N949L690Q18j743l790n439
$$ 462706 467834 472946 478366 483959 489474 495121 501391 508123 514072 517762 518580 516837 513047 507608
61325E07608o576p092p241p411p679p794p411o332m745l255k406k139k034j944
$$ 507608 501032 493940 486699 479288 471609 463815 456404 450072 445327 442072 439666 437527 435493 433549
61311D33549j921j620m92J274K745L466M065N302O979Q268Q621P957O320L854
$$ 433549 431628 430008 429516 430790 433535 437001 441066 446368 453347 461615 470236 478193 484513 488367
61297D88367R07k120m836o696p275o862o259n783n049l967l179l029k837j928
$$ 488367 489274 487154 482318 475622 468347 461485 455226 449443 444394 440427 437248 434219 431382 429454
61283D29454p78l81q59j486j709j416m77J114K800L963M810N987P408Q212Q022
$$ 429454 428676 428295 427436 425950 424241 422825 422348 423462 426262 430225 435035 441022 448430 456642 464664
61268D64664P483P257P195O817O183N856O239P225Q451R714J1111J2791J4482
$$ 464664 472147 479404 486599 493416 499599 505455 511694 518919 527370 537084 548195 560986 575468
61255E75468J5421J4958J3186J0906R058Q199Q206Q264P439N570L344J279r11
$$ 575468 590889 605847 619033 629939 638997 647196 655402 663666 671105 676675 680019 681298 680387
61242F80387l629o492q697j0005j0768j1192j1181j0828j0442j0093r634r174
$$ 680387 676758 670266 661569 651564 640796 629604 618423 607595 597153 587060 577426 568252
61230E68252r004r046q819q036o796n274l654k387j944k185k502k612k784l059
$$ 568252 559248 550202 541383 533347 526551 521277 517623 515236 513292 511107 508605 505993 503209 500150
61216E00150k855j725o3J290J983K285K499K509J960P05r25k203k476j620j36
$$ 500150 497295 495570 495507 496797 498780 501065 503564 506073 508033 508738 507813 505610 503134 501514 501378
61201E01378J230K043K530L396N152P534R793J1641J3548J5937J8376J9916J9945
$$ 501378 502608 504651 507181 510577 515729 523263 533056 544697 558245 574182 592558 612474 632419
61188F32419J8376J5407J1659Q368O620O296O302N985N761O107O559O147M609
$$ 632419 650795 666202 677861 686229 692849 699145 705447 711432 717193 723300 729859 736006 740615
61175G40615K607R08l36j385k355l027l168k858k490k468l013m095n475o827q004
$$ 740615 743222 744130 743794 742409 740054 737027 733859 731001 728511 726043 723030 718935 713460 706633 698629
61160F98629r177j0547j1941j2914j3276j3231j3015j2691j2284j1684j0360p738
$$ 698629 689452 678905 666964 654050 640774 627543 614528 601837 589553 577869 567509 559771
61148E59771m170r90P02Q93Rj956n062q652j1699j3729j4796j4841j3827j2279
$$ 559771 555601 554611 555313 556206 556215 554259 549197 540545 528846 515117 500321 485480 471653 459374
61134D59374j0875r454p307m547k399j680j662r76P14K487L524M133N241P147
$$ 459374 448499 439045 431738 427191 424792 423112 421450 420474 421188 423675 427199 431332 436573 443720
61120D43720R134J0408J1177J2359J4338J6500J8168J9432K0641K1589K1778K1290
$$ 443720 452854 463262 474439 486798 501136 517636 535804 555236 575877 597466 619244 640534
61108F40534K0743K0478K0300J9950J9411J8720J7851J6708J4977J2158Q153L584
$$ 640534 661277 681755 702055 722005 741416 760136 777987 794695 809672 821830 829983 833567
61096H33567q35m978q946j2352j4615j5808j6552j7222j7779j8275j8829j9251
$$ 833567 832732 827754 818808 806456 791841 776033 759481 742259 724480 706205 687376 668125
61084F68125j9315j9323j9681k0058j9698j8569j7356j6317j5069j3600j2558
$$ 668125 648810 629487 609806 589748 570050 551481 534125 517808 502739 489139 476581
61073D76581j2197j1855j0919r629q500p660p067o783o556n810m459l183k473
$$ 476581 464384 452529 441610 431981 423481 415821 408754 401971 395415 389605 385146 381963 379490
61060C79490k012j482j215j394j258l5J738K749K642K391K937M186N457O348O947
$$ 379490 377478 375996 374781 373387 372129 372094 373832 376581 379223 381614 384551 388737 394194 400542 407489
61045D07489P612Q726J0381J2146J3418J4039J4349J4679J5020J5310J5728J6524
$$ 407489 415101 423827 434208 446354 459772 473811 488160 502839 517859 533169 548897 565421
61033E65421J7639J8643J9123J9129J9185J9733K0622K1347K1866K2917K5391
$$ 565421 583060 601703 620826 639955 659140 678873 699495 720842 742708 765625 791016
61022G91016K9595L5371M2698N1796O2719P5463R0651J09738J34154J64752K02178
$$ 791016 820611 855982 898680 950476 1013195 1088658 1179309 1289047 1423201 1587953 1790131
61011A790131K45656K87645L09020K85093K04599Q6033k8448j00130j16334q8213
$$ 1790131 2035787 2323432 2632452 2917545 3122144 3208177 3179729 3079599 2963265 2875052
61001B875052l3253L2721Q8446J04668O0012l8713j56220k51277l00622l05018
$$ 2875052 2841799 2874520 2962966 3067634 3127646 3088933 2932713 2681436 2380814 2075796
60991B075796k79126k39125j96752j58610j27142j01993q1794o5528n2710m2823
$$ 2075796 1796670 1557545 1360793 1202183 1075041 973048 891254 825726 773016 730193
60981G30193l5065k8761k3810k0399j8331j6915j5606j4450j3712j3352j3075
$$ 730193 695128 666367 642557 622158 603827 586912 571306 556856 543144 529792 516717
60970E16717j2715j2301j1801j1136j0389r808r524r346q937q186p371o804o350
$$ 516717 504002 491701 479900 468764 458375 448567 439043 429697 420760 412574 405203 398399 392049
60957C92049n595m540l769l583l398k543j319n30j81M79J651K636L003L121L184
$$ 392049 386454 381914 378145 374562 371164 368621 367302 366772 366591 367070 368721 371357 374360 377481 380665
60942C80665K797K054J974L002L914L268J354m53j723l088m586n331n093m865
$$ 380665 383462 385516 387490 390492 394406 397674 399028 398575 396852 393764 389178 383847 378754 373889
60928C73889n381o051o013n430m975m693m172l465l001k710k082j091l65j88K1
$$ 373889 368508 362457 356444 351014 346039 341346 337174 333709 330708 327998 325916 324825 324460 324272 324293
60913C24293Q19J771K036J714J920L292M991N603M825L715L415M040M921N427
$$ 324293 325112 326883 328919 330633 332553 335845 340836 346439 351264 354979 358394 362434 367355 372782
60899C72782N342M770M027L494L276L009K205P46j007k549l559m008m164m456
$$ 372782 378124 382894 386921 390415 393691 396700 398905 399651 398644 396095 392536 388528 384364 379908
60885C79908n185o211o985o996o334n701n633n742n098l528k062j666j908j514
$$ 379908 374723 368512 361527 354531 348197 342496 336863 331121 326023 322495 320433 318767 316859 315345
60871C15345p9J475K230K240K010J686J261J085J572K596L663M556N396O191O636
$$ 315345 315266 316741 318971 321211 323221 324907 326168 327253 328825 331421 335084 339640 345036 351227 357863
60856C57863O510O015N647N750O108O053N138L771K905L048L793M389M522M364
$$ 357863 364373 370388 376035 381785 387893 393946 399084 402855 405760 408808 412601 416990 421512 425876
60842D25876M106L708L011J983Q38j65j087k272l702m664m560l880l800m709n759
$$ 425876 429982 433690 436701 438684 439522 439357 438270 435998 432296 427632 423072 419192 415392 410683 404924
60827D04924o004n429m719m457m813n528n942n498m421l485k947k349j592j393
$$ 404924 398920 393491 388772 384315 379502 373974 368032 362534 358113 354628 351681 349332 347740 346347
60813C46347k125k902k572j181K31J061J582K157K773L405M251N320O221O582
$$ 346347 344222 341320 338748 337567 337798 338859 340441 342598 345371 348776 353027 358347 364568 371150
60799C71150O548O670P318Q213Q690Q514Q342R072J0819J2947J4988J6934J8604
$$ 371150 377698 384368 391686 399899 408589 417103 425445 434517 445336 458283 473271 490205 508809
60786E08809J9519J9845K0687K2914K6040K8829L0640L1681L2383L3073L4021
$$ 508809 528328 548173 568860 591774 617814 646643 677283 708964 741347 774420 808441
60775H08441L5190L6011L5790L4232L1329K7079K1612J5278Q339R17o454j2796
$$ 808441 843631 879642 915432 949664 980993 1008072 1029684 1044962 1053301 1054218 1047764 1034968
60763A034968j7689k1859k6101l0074l2780l3964l4302l4374l4143l3420l2203
$$ 1034968 1017279 995420 969319 939245 906465 872501 838199 803825 769682 736262 704059
60752G04059l0544k8524k6302k3933k1264j8422j6058j4623j3711j2658j1539
$$ 704059 673515 644991 618689 594756 573492 555070 539012 524389 510678 498020 486481
60741D86481j0992j1233j1810j2218j2201j1624j0639r810r468r117q106o646
$$ 486481 475489 464256 452446 440228 428027 416403 405764 395954 386486 377369 369263 362617
60729C62617n529m869m029k769j726j468j681j615q93K92J476K232K462K465K573
$$ 362617 357088 352219 348190 345421 343695 342227 340546 338931 338038 338330 339806 342038 344500 346965 349538
60714C49538K770K861K783K510J898R78J26n02j333k661l985m669m943n464o132
$$ 349538 352308 355169 357952 360462 362360 363338 363464 362962 361629 358968 354983 350314 345371 339907 333775
60699C33775o293n968n891o240o235n320l985l007k526k235k008j974k246k738
$$ 333775 327482 321514 315623 309383 303148 297828 293843 290836 288310 286075 284067 282093 279847 277109
60685B77109l028k495j054L26M98m51j324j356r53p36o81n88o17q17o56L12J600
$$ 277109 274081 271586 270532 270858 271356 270905 269581 268225 267272 266536 265855 265267 264650 263833 263177 263489 265089
60668B65089K186J683O85Pj65k58n60o50J93J873L196L119K059J420J925L071
$$ 265089 267275 268958 269643 269650 269485 269227 268667 268017 268210 270083 273279 276398 278457 279877 281802 284873
60652B84873M087M770N167N206M966M831N059N590O361P319P927P328N376L044
$$ 284873 288960 293730 298897 304103 309069 313900 318959 324549 330910 338229 346156 353484 358860 361904
60638C61904J394N31m8n33q04j004j523k316k877k945k921l322m062m617m783
$$ 361904 363298 363829 363781 363248 362444 361440 359917 357601 354724 351779 348858 345536 341474 336857 332074
60623C32074m889n124n038m152k863k079j966j742r79l63o57j501j957j770j390
$$ 332074 327185 322061 317023 312871 310008 307929 305963 304221 303242 302879 302222 300721 298764 296994 295604
60608B95604j063p05m40n34q03q15o17o71j116j656k078k294k037j133K5Q84J368
$$ 295604 294541 293836 293396 292862 292059 291244 290627 289956 288840 287184 285106 282812 280775 279642 279667 280551 281919
60591B81919J537J019l18j523j456m35K03P3Q4P73J590K138K829L757M152L666
$$ 281919 283456 284475 284157 282634 281178 280743 280946 281019 281103 281876 283466 285604 288433 292190 296342 300008
60575C00008L229L866N419P087Q489R563J0079R876R040P398M594J111j621k861
$$ 300008 303237 307103 312522 319609 328098 337661 347740 357616 366656 374054 378648 379759 378138 375277
60561C75277l443m404n443n574m711l630k790k027j038M57K744N552P877R072
$$ 375277 371834 367430 361987 356413 351702 348072 345282 343255 342217 342674 345418 350970 358847 367919
60547C67919R724J0749J1967J2389J1566R901P747N054J925j185l839n795o842
$$ 367919 377643 388392 400359 412748 424314 434215 441962 447016 448941 447756 443917 438122 431280
60534D31280o929o381n604m657l456k150j009j34L29R0p88j639j879j594j006
$$ 431280 424351 417970 412366 407709 404253 402103 401094 400960 401289 401379 400591 398952 397073 395479 394473
60519C94473R4J709K942K855J948J771L075N023O468P273Q136R635J1843J4596
$$ 394473 394567 396276 399218 402073 404021 405792 408867 413890 420358 427631 435767 445402 457245 471841
60505D71841J7704K1015K4402K7740L0868L3579L5551L6286L5252L2074K6441
$$ 471841 489545 510560 534962 562702 593570 627149 662700 698986 734238 766312 792753
60494G92753J8059P181m872j6350k6300l4610m0793m3694m3002m0118l6734l3075
$$ 792753 810812 817993 813121 796771 770471 735861 695068 651374 608372 568254 531520 498445
60482D98445k8465k3156j8507j5386j3314j1413r489p899o873o260n775n261m810
$$ 498445 469980 446824 428317 412931 399617 388204 378715 370816 363943 357683 351908 346647 341837
60469C41837m535m302l877l416l345l607l492k579j401o77m28l27m44r88j619
$$ 341837 337302 333000 329123 325707 322362 318755 315263 312684 311283 310606 310178 309851 309407 308419 306800
60454C06800j818j749j997k621l089l114k852k310j297j07M62M9p54j058n91K48
$$ 306800 304982 303233 301236 298615 295526 292412 289560 287250 285953 285846 286308 286357 285603 284545 283954 284202
60438B84202R02J082Q34L75k02r52j772k262k123j533q62k38M02R68J240J159
$$ 284202 285104 286186 287020 287395 287193 286241 284469 282207 280084 278551 277689 277451 277853 278821 280061 281220
60422B81220Q75N58L50L15L74N00R14J711K278J778L85o26m77J85M62N08Q61J192
$$ 281220 282095 282653 283003 283318 283692 284192 285106 286817 289095 290873 291258 290632 290155 290340 290802 291310 292171 293363
60404B93363P99oj39O71J548J804J685J607J458J064P47R29J540K143K476K671
$$ 293363 294162 294156 294017 294688 296236 298040 299725 301332 302790 303854 304601 305530 307070 309213 311689 314360
60388C14360K950L209L039K219J209P26Q32R18P26P08J082J315J060Q75J274J694
$$ 314360 317310 320519 323558 325777 326986 327712 328544 329462 330188 330896 331978 333293 334353 335228 336502 338196
60372C38196J353O12M54R63J377J402J394J304O36m42r50m28M87J070J389J814
$$ 338196 339549 340161 340615 341578 342955 344357 345751 347055 347691 347249 346299 345871 346358 347428 348817 350631
60356C50631K313K616K644K561K582K785K848K200Q35l27n21k14l56r37j241j247
$$ 350631 352944 355560 358204 360765 363347 366132 368980 371180 372015 371688 371167 370953 370597 369660 368419 367172
60340C67172j634k375k554j770p17r0O3k33j063j873j701n88K21K3m03k32P7k86
$$ 367172 365538 363163 360609 358839 358122 358032 358095 357862 356799 354926 353225 352637 352858 352881 352478 352246 352323 352037
60322C52037j070j432j146n18M06J647K770L388L877M816O032O962P682Q791J0496
$$ 352037 350967 349535 348389 347871 348277 349924 352694 356082 359959 364775 370807 377769 385451 394242 404738
60307D04738J2430J4168J5258J4988J2942R743O500L510J64l815p783j0991j3288
$$ 404738 417168 431336 446594 461582 474524 484267 490767 494277 494441 490626 482843 471852 458564
60294D58564j4738j5029j3817j1366q565o318m993m293l637k781k021j689j503
$$ 458564 443826 428797 414980 403614 395049 388731 383738 379445 375808 373027 371006 369317 367814
60281C67814r14o2J49p59k013k443j921j367j386j594j463j205j259j401j101
$$ 367814 366900 366838 366987 366228 364215 361772 359851 358484 357098 355504 354041 352836 351577 350176 349075
60266C49075n73o35j408j952j552p03m24r93j896k550k623j961q55p3j08n06m60
$$ 349075 348502 347867 346459 344507 342955 342252 341828 340835 338939 336389 333766 331805 330950 330877 330769 330263 329803
60249C29803J09N69N55L17K32M26Q51J291J419J260J342J932K401K017J091N74
$$ 329803 329912 330481 331036 331353 331585 332011 332862 334153 335572 336832 338174 340106 342507 344524 345615 346189
60233C46189P30J018J199J541J881J508L84l66K21J695K748K634J701Q34O90J249
$$ 346189 346919 347937 349136 350677 352558 354066 354450 354084 354305 356000 358748 361382 363083 363917 364607 365856
60217C65856J934K269K345K403K293J855J565K001K851L268L179L312L908M433
$$ 365856 367790 370059 372404 374807 377100 378955 380520 382521 385372 388640 391819 395131 399039 403472
60203D03472M669N092N735N803M888L758L269L273L116K618K005J522J565K464
$$ 403472 408141 413233 418968 424771 429659 433417 436686 439959 443075 445693 447698 449220 450785 453249
60189D53249L658L857K568P69m86j263j923k165j804j639k362l273l332k885l007
$$ 453249 456907 460764 463332 464101 463615 462352 460429 458264 456460 454821 452459 449186 445854 442969 439962
60174D39962l512l126j676n79q47j832k453k547k420j947r24K17P89O65K02l50
$$ 439962 436450 433324 431648 431069 430222 428390 425937 423390 420970 419023 418099 418316 419105 419770 419972 419622
60158D19622q79j100p31Q5Q42J254J425J519J523J400J294J347J432J276R00P79
$$ 419622 418743 417643 416912 416997 417839 419093 420518 422037 423560 424960 426254 427601 429033 430309 431209 431988
60142D31988J363K552L811M743N374N891O328O524O176N006L139J250J0n81r62
$$ 431988 433351 435903 439714 444457 449831 455722 462050 468574 474750 479756 482895 484145 484155 483574 482612
60127D82612j223j066n07rK04L55M37J0r81j811j896j560j361j188o42Q8M28K38
$$ 482612 481389 480323 479816 479807 480011 480366 480803 480813 479832 478021 476125 474565 473204 472016 471374 471462 471890 472128
60109D72128j91o86j176j295p68n6O5m11o67k20M45N78l3j094k142k616j986l20
$$ 472128 471937 471251 470075 468780 468012 467956 468021 467610 466943 466723 467168 467746 467713 466619 464477 461861 459875 459555
60091D59555J492K427K253J603J127Q68N79M25R51K284L655M107L579K842K474
$$ 459555 461047 463474 465727 467330 468457 469325 469904 470329 471280 473564 477219 481326 484905 487747 490221
60076D90221K304J948J369P25K4p54j501k243l275m752o320p391p632p043n861
$$ 490221 492525 494473 495842 496567 496591 495837 494336 492093 488818 484066 477746 470355 462723 455680 449819
60061D49819m585l790l655l861m161m672n384n748n225m037k971k526k475k242
$$ 449819 445234 441444 437789 433928 429767 425095 419711 413963 408738 404701 401730 399204 396729 394487
60047C94487j454k83O76R68Q33R57J667K614L287L506L331K961K849L403M309
$$ 394487 393033 392750 393426 394394 395227 396184 397851 400465 403752 407258 410589 413550 416399 419802 424111
60032D24111M623L850K431R60n10j995l050l374l449l973m921n736o189o426o475
$$ 424111 428734 432584 435015 435975 435465 433470 430420 427046 423597 419624 414703 408967 402778 396352 389877
60017C89877o295o116o152o102n511m538l806l560l447l100k506j784j025l72
$$ 389877 383582 377466 371314 365212 359701 355163 351357 347797 344350 341250 338744 336960 335935 335563
60003C35563M5K84M61N79O37P59R58R85P25M83O10J067J567J914J977J709J432
$$ 335563 335608 335892 336353 336932 337569 338328 339286 340271 340996 341479 342089 343156 344723 346637 348614 350323 351755
59986C51755J640K276K640K430K267K753L534L874L605K918J836O08L0M63J017
$$ 351755 353395 355671 358311 360741 363008 365761 369295 373169 376774 379692 381528 382136 382166 382629 383646
59971C83646O95p4j75L28L56l18p06l20R1n2k08K48R81J335J298J217J082P54
$$ 383646 384341 384267 384092 384420 384776 384458 383752 383432 383523 383471 383263 383511 384492 385827 387125 388342 389424 390178
59953C90178M22L49M84O66Q74R89P65L15J51L98M98j3q84j758k748l936m754m608
$$ 390178 390600 390949 391433 392099 392973 393962 394727 395042 395193 395591 396089 396076 395192 393434 390686 386750 381996 377388
59935C77388l812l191k914k407j403m30p5l54r17j481j756j354k20J022J605J548
$$ 377388 373576 370385 367471 365064 363661 363231 363156 362802 361885 360404 358648 357294 357074 358096 359701 361249
59919C61249J676K556L749M366M223L968M135M478M482M154L956M142M543M904
$$ 361249 362925 365481 369230 373596 377819 381787 385922 390400 394882 399036 402992 407134 411677 416581
59905D16581N136N148M769L967L019K374K254K435K329J429k78k252l793m472
$$ 416581 421717 426865 431634 435601 438620 440994 443248 445683 448012 449441 449163 446911 443118 438646
59891D38646m323l783l345l035k366j026N36J623K219K895L836M577M904N186
$$ 438646 434323 430540 427195 424160 421794 420768 421304 422927 425146 428041 431877 436454 441358 446544
59877D46544N608N696N085M114L236K380J391N29j35j205l024m678m875l617k211
$$ 446544 452152 457848 462933 467047 470283 472663 474054 474583 474448 473243 470219 465541 460666 457049 454838
59862D54838j591j461j149o24l90q05j770k800l353l287k979k837k899l041l296
$$ 454838 453247 451786 450637 450013 449623 448818 447048 444248 440895 437608 434629 431792 428893 425852 422556
59847D22556l630l789l695l659l828l771l107k187j649j548j473j218q35l65Q8
$$ 422556 418926 415137 411442 407783 403955 400184 397077 394890 393241 391693 390220 389002 388167 387802 387890
59832C87890L38O10J494K916L814L552K950K987L151K276N27p73j127j285j735
$$ 387890 388228 388838 390332 393248 397062 400614 403564 406551 409702 411978 412505 411732 410605 409320 407585
59817D07585k107k195k326k443j977r74l38n23r43r99p97m78J34P91P05k44j047
$$ 407585 405478 403283 400957 398514 396537 395563 395225 394702 393759 392760 391963 391485 391619 392410 393115 392871 391824
59800C91824r01k50J23K51M77N29j02j237k201k735l106l505l820l907l698l210
$$ 391824 390923 390673 390796 391047 391524 392053 391951 390714 388513 385778 382672 379167 375347 371440 367742 364532
59784C64532k598k029j403n47L05O17L17j7J18O76J371J967K125J637R55Q37J246
$$ 364532 361934 359905 358502 357955 358260 358877 359194 359177 359295 359971 361342 363309 365434 367071 368026 368863 370109
59767C70109J315P35M26J208K502L057K590J953J835K040K082J967K128K780L574
$$ 370109 371424 372159 372585 373793 376295 379352 381942 383895 385730 387770 389852 391819 393947 396727 400301
59752D00301L980L964M043M534N139N443N486N384M802L513K191J782K227K633
$$ 400301 404281 408245 412288 416822 421961 427404 432890 438274 443076 446589 448780 450562 452789 455422
59738D55422K615K562K595K267J513R20P54N52O6l06l62n35j078j536j522j273
$$ 455422 458037 460599 463194 465461 466974 467894 468648 469200 469266 468960 468598 468063 466985 465449 463927 462654
59722D62654r89m26L84P64L06n01j081j491j783j485m10O16P04R3k29K02J105
$$ 462654 461665 461239 461623 462387 462693 462192 461111 459620 457837 456352 455942 456558 457262 457355 457126 457328 458433
59705D58433K040K673K783K587K655L103L299K801K092J864K155K651L335M116
$$ 458433 460473 463146 465929 468516 471171 474274 477573 480374 482466 484330 486485 489136 492471 496587
59691D96587M374L593K089M93j028k428l164k779j736r25n79l94m39j078k129
$$ 496587 500961 504554 506643 507136 506108 503680 500516 497737 496001 495076 494497 494103 493664 492586 490457
59676D90457k920l254l592m172m559m256l411k660k524k988l511l557l137k644
$$ 490457 487537 484283 480691 476519 471960 467704 464293 461633 459109 456121 452610 449053 445916 443272
59662D43272k165j356j92P06Q68O42N85O35M48K69P65K026L282L751L436K942
$$ 443272 441107 439751 439559 440265 441133 441775 442360 442995 443443 443712 444477 446503 449785 453536 456972 459914
59646D59914K665K327J414M5j002j381j851l200m855n442m649l500k733k059j283
$$ 459914 462579 464906 466320 466365 465363 463982 462131 458931 454076 448634 443985 440485 437752 435693 434410
59631D34410r70j398j845j693j376j496j811j850j815k055k308k299k508l476
$$ 434410 433440 432042 430197 428504 427128 425632 423821 421971 420156 418101 415793 413494 410986 407510
59617D07510m800n633n721n235m164k634j320o99l24M10J256J635J670J846K128
$$ 407510 402710 397077 391356 386121 381957 379323 378003 377304 376980 377390 378646 380281 381951 383797 385925
59602C85925K196K129K039J564N44l25l95q2r9j88K64R55J109Q27P54Q49O34L18
$$ 385925 388121 390250 392289 393853 394397 394072 393677 393595 393496 393308 393572 394527 395636 396463 397217 398066 398700 399018
59584C99018L83L33p48k518l686l993m405n195n357m323k987k331k165j897j650
$$ 399018 399401 399734 398986 396468 392782 388789 384384 379189 373832 369509 366522 364191 362026 360129 358479
59569C58479j806k099j910j094j59K72j20j031j627j282k65P03J373J941K227
$$ 358479 356673 354574 352664 351570 351411 351683 351563 350532 348905 347623 347358 348061 349434 351375 353602
59554C53602J775P54J15N27J713K911L626L924M302N242O612P778Q601R863J2265
$$ 353602 355377 356131 356246 356773 358486 361397 365023 368947 373249 378491 385103 392881 401482 411345 423610
59539D23610J5656J9645K3795K6250K3556J4005Q03j0038j5076j5255j2823q812
$$ 423610 439266 458911 482706 508956 532512 546517 547320 537282 522206 506951 494128 485316
59527D85316m046j90J691K375L031L615L656L508L682L707K860J341k41j974m141
$$ 485316 481270 481080 482771 485146 488177 491792 495448 498956 502638 506345 509205 510546 510305 508331 504190
59512E04190o163p122p128p209p895q685q912q505p856p312o827o064m900l917
$$ 504190 498027 490905 483777 476568 468673 459988 451076 442571 434715 427403 420576 414512 409612 405695
59498D05695l820m299m146k823j274o24p03m99L27J152J416J290J313J802K626
$$ 405695 401875 397576 393430 390607 389333 388709 388006 387507 387834 388986 390402 391692 393005 394807 397433
59483C97433L347L585L374L062K925L087L752N007O361P012O697N840M755L306
$$ 397433 400780 404365 407739 410801 413726 416813 420565 425572 431933 438945 445642 451482 456237 459543
59469D59543J475l31j806k972l632l255j775RJ251J880K366L142M470O339Q189
$$ 459543 461018 460687 458881 455909 452277 449022 447247 447256 448507 450387 452753 455895 460365 466704 474893
59454D74893R259R510R644J0039J0356J0336J0264J0233R784Q716P364N578K432
$$ 474893 484152 493662 503306 513345 523701 534037 544301 554534 564318 573034 580398 585976 588408
59441E88408k231o799r533j0485j0869j1056j0424q851p149o056n654n822o323
$$ 588408 586177 579378 569845 559360 548491 537435 527011 518160 511011 504955 499301 493479 487156
59428D87156o486n630l912k084m59J215K992M614O180Q129J0571J3242J6064J8998
$$ 487156 480670 475040 471128 469044 468585 469800 472792 477406 483586 491715 502286 515528 531592 550590
59414E50590K1629K3897K6826L0836L3091K8560J5215k726j7992k6104k7262k3801
$$ 550590 572219 596116 622942 653778 686869 715429 730644 727918 709926 683822 656560 632759
59402F32759j7797j0841l948K990J0084J5040J3426K953j3024k7509l5266l5703
$$ 632759 614962 604121 600173 603163 613247 628287 641713 644666 631642 604133 568867 533164
59390E33164l1373k5290j9687j5615j2726r984p144n068m309m092l315j966q70
$$ 533164 501791 476501 456814 441199 428473 418489 411345 406277 401968 397876 394561 392595 391725
59377C91725l91j32K53O17P39P38R25J434K039K293K062J839K239L080L480L042
$$ 391725 391334 391202 391455 392072 392811 393549 394474 395908 397947 400240 402302 404141 406380 409460 412940 415982
59361D15982K359K076K080K084K340L065L764L948M125N216P219R310J1055J2611
$$ 415982 418341 420417 422497 424581 426921 429986 433750 437698 441823 447039 454258 463568 474623 487234
59347D87234J3920J4635J4916J5418J6282J6906J6820J6199J5270J3891J1904
$$ 487234 501154 515789 530705 546123 562405 579311 596131 612330 627600 641491 653395
59336F53395R448O679L619M42k499n011p144q949j0476j1805j2718j2670j1541
$$ 653395 662843 669522 673141 673583 671084 666073 658929 649980 639504 627699 614981 602311 590770
59323E90770j0132r239q563p268n389l761k768k183k111l060m840o357o807o368
$$ 590770 580638 571399 562836 555568 550179 546418 543650 541467 539356 536296 531456 525099 518292 511924
59309E11924n629m993m736m843m730l877k750k291k585k898k974l123l079k107
$$ 511924 506295 501302 496566 491723 486993 483116 480366 478075 475490 472592 469618 466495 463416 461309
59295D61309n26K34l85j272j341r02o10k49N89J506J924J920J721J104J76p2J044
$$ 461309 460783 461017 460632 459360 458019 457117 456507 456258 456847 458353 460277 462197 463918 465022 465198 465126 466170
59278D66170K757L793M047M472N683P473R397J1107J2329J3049J3537J3828J3505
$$ 466170 468927 472720 476767 481239 486922 494395 503792 514899 527228 540277 553814 567642 581147
59265E81147J2397J0934R462P738N556L250J101j142l582n663o977p979r200j0297
$$ 581147 593544 604478 613940 621678 627234 630484 631585 630443 626861 621198 614221 606242 597042 586745
59251E86745j0614j0217r633q980q091p121o313n482m383l316k742k517k051j047
$$ 586745 576131 565914 556281 547301 539210 532089 525776 520294 515911 512595 509853 507336 505285 504238
59237E04238L51J831K995L554L762M097M266L284J071r36j560j515k298m097n873
$$ 504238 504589 506420 509415 512969 516731 520828 525094 528378 529449 528513 526953 525438 523140 519043 513170
59222E13170p079q081r049r515r147q189p081o230o030o500o917o429n003l322
$$ 513170 506091 498010 488961 479446 470299 462110 455029 448799 442769 436269 429352 422923 417920 414598
59208D14598j958j100q60j167j478j183l29M60O79L87Q7M26J636L103L909L974
$$ 414598 412640 411540 410680 409513 408035 406852 406523 406983 407662 408049 408136 408562 410198 413301 417210 421184
59192D21184M061M393M161K914J542J072J275J394J567K395L631M470M834N270
$$ 421184 425245 429638 433799 436713 438255 439327 440602 441996 443563 445958 449589 454059 458893 464163
59178D64163N723N545M696L884L463L096K728K939M080N678O977P651P865P966
$$ 464163 469886 475431 480127 484011 487474 490570 493298 496237 500317 505995 512972 520623 528488 536454
59164E36454Q203Q434Q213P463O718O324N814M551K698Q71q04k651m678o536p998
$$ 536454 544657 553091 561304 568767 575485 581809 587623 592174 594872 595743 594939 592288 587610 581074 573076
59149E73076q946r143q632q061p961p942p288o107n175m902n107n524n795n275
$$ 573076 564130 554987 546355 538294 530333 522391 515103 508996 503821 498919 493812 488288 482493 477218
59135D77218l690j848r10j058j609k134k623k746j977m74J040K330L788N475O882
$$ 477218 473528 471680 470770 469712 468103 465969 463346 460600 458623 458149 459189 461519 465307 470782 477664
59120D77664P835Q844J0270J1692J2442J2370J1935J1785J2296J3281J4218J4875
$$ 477664 485499 494343 504613 516305 528747 541117 553052 564837 577133 590414 604632 619507
59108F19507J5438J5795J5322J3816J2071J0887J0039Q939P768P024O353M953
$$ 619507 634945 650740 666062 679878 691949 702836 712875 721814 729582 736606 742959 747912
59096G47912K905J107o5j076k255l320l903l879l239k338k011k735l855m470m799
$$ 747912 750817 751924 751859 750783 748528 745208 741305 737426 734187 731849 729838 727103 723248 718778 713979
59081G13979n768p468r075j0172j1122j2050j2537j2450j2188j1972j1601j1008
$$ 713979 708211 700743 691668 681496 670374 658324 645787 633337 621149 609177 597576 586568
59069E86568j0362r635q790q198q114q001p203o056n337m961m340l748l921m453
$$ 586568 576206 566571 557781 549583 541469 533468 526265 520209 514872 509911 505571 501823 497902 493449
59055D93449m138k971k253k467k591k046j649j969k209j674j041r93q13L34J643
$$ 493449 489311 486340 484087 481620 479029 476983 475334 473365 471156 469482 468441 467448 466635 466969 468612
59040D68612J673O14R3Q79K033K473K343K458L102L831M166M110M036M272M894
$$ 468612 470285 470899 470992 471871 473904 476377 478720 481178 484280 488111 492277 496387 500423 504695 509589
59025E09589N889P310R092J0838J2113J2982J3903J5136J6549J7891J8848J8890
$$ 509589 515478 522788 531880 542718 554831 567813 581716 596852 613401 631292 650140 669030
59013F69030J7495J4572J0418N400P9m448p085p740p426p161p030o365m647k114
$$ 669030 686525 701097 711515 716915 716994 712546 705461 697721 690295 683134 676104 669739 665092 662978
58999F62978L70K109L207M153M886M800L779K468J218l93k514m424n667o778q071
$$ 662978 663348 665457 668664 672817 677703 682503 686282 688750 689968 689575 687061 682637 676970 670192 662121
58984F62121q677q046p388q113r527r727q409p024o342n623m240k551q72Q84K348
$$ 662121 653444 645398 638010 629897 620370 610643 602234 595210 588868 583245 579005 576454 575582 576466 578814
58969E78814K935L203M461O641Q030P674O655O396O906P423P650P568O954N815
$$ 578814 581749 584952 589413 596054 604084 611758 618413 624809 631715 639138 646788 654356 661310 667125
58955F67125M543L166J182j480m173o458q491j0168j0955j0881j0682j0551r774
$$ 667125 671668 674834 676016 674536 670363 663905 655414 645246 634291 623410 612728 602177 592403
58942E92403q011n959m322l145k546k970m223n342n986o827p941q099o499m190
$$ 592403 584392 578433 574111 570966 568420 565450 561227 555885 549899 543072 535131 527032 520533 516343
58928E16343k785k515k455k012j373r56j046j585j969j617q86o79j013j003m80
$$ 516343 513558 511043 508588 506576 505203 504247 503201 501616 499647 498030 497144 496465 495452 494449 493969
58913D93969l23p79p51M67K050L029L742M917O323P341Q068Q835R398R465R368
$$ 493969 493646 492867 492116 492583 494633 497662 501404 506321 512644 519985 528053 536888 546286 555751 565119
58898E65119R303Q658P066N404M817N241N794O153O742P963R951J2618J5306J6925
$$ 565119 574422 583080 590146 595550 600367 605608 611402 617555 624297 632260 642211 654829 670135 687060
58884F87060J7150J6934J7192J7512J6808J4719J1718Q329M962K008n33l186o284
$$ 687060 704210 721144 738336 755848 772656 787375 799093 807422 812384 814392 813859 810673 804389
58871H04389r507j2497j5250j7517j8488j7684j5634j3158j0626q319o792o302
$$ 804389 794882 782385 767135 749618 731130 713446 697812 684654 674028 665709 658917 652615
58859F52615o396o553o735o979p106p166p491p992q200q084q033p863o971n657
$$ 652615 646219 639666 632931 625952 618846 611680 604189 596197 587997 579913 571880 564017 557046 551389
58845E51389n000n027m445k749j239j153k096l158m209n230n626n274n044n289
$$ 551389 546389 541362 536917 534168 532929 531776 529680 526522 522313 517083 511457 506183 501139 495850
58831D95850n040l773k638k722l232k882j959j573j700j515r40m72o0N20Q11M15
$$ 495850 490810 487037 484399 481677 478445 475563 473604 472031 470331 468816 467876 467404 467344 467864 468675 469090
58815D69090OL85J111J303J164J537K410L042L086K610J584L04l05J76R01R89
$$ 469090 469096 469481 470592 471895 473059 474596 477006 480048 483134 485744 487328 487632 487327 487503 488404 489393
58799D89393O71L15n53k066l003k382j155q46j378j778k010k425k218m31K039
$$ 489393 490064 490379 489826 487760 484757 482375 481220 480374 478996 477218 475208 472783 470565 470134 472173
58784D72173L330L226L131L755M491M904N185N240M807M412M741N202M495K514
$$ 472173 475503 478729 481860 485615 490106 495010 500195 505435 510242 514654 519395 524597 529092 531606
58770E31606L47j320k547l197l109k928l328l686l085k232k665m194m962m168
$$ 531606 531953 530633 528086 524889 521780 518852 515524 511838 508753 506521 503856 499662 494700 490532
58756D90532k957k407k176j605p73P4R72J726J912J619J421J496J621J884K507
$$ 490532 487575 485168 482992 481387 480614 480688 481660 483386 485298 486917 488338 489834 491455 493339 495846
58741D95846L171L437L605M149M678M538M085M197M895N606O338P325Q046Q001
$$ 495846 499017 502454 506059 510208 514886 519424 523509 527706 532601 538207 544545 551870 559916 567917
58727E67917P919Q648R331Q487O467M941M172K847O23j224j937k096j961q65J146
$$ 567917 575836 584484 593815 602302 608769 613710 617882 620729 621352 620128 618191 616095 614134 613269 614415
58712F14415K795L379L612M096M387M124L735L454K833J737N99o70k771n646q296
$$ 614415 617210 620589 624201 628297 632684 636808 640543 643997 646830 648567 649166 648496 645725 640079 631783
58697F31783j0349j2454j4735j6244j6467j6097j5720j4981j3604j2116j0886
$$ 631783 621434 608980 594245 578001 561534 545437 529717 514736 501132 489016 478130
58686D78130r556p919o417n274m148l114k882l555m128l767k809k055j823j940
$$ 478130 468574 460655 454238 448964 444816 441702 438820 435265 431137 427370 424561 422506 420683 418743
58672D18743j945j207L05J559J714J704L187O002Q144Q506Q074Q068Q351Q211
$$ 418743 416798 415591 415896 417455 419169 420873 424060 430062 438206 446712 454786 462854 471205 479416
58658D79416P412N858L416O82j195j948k446l153l501l182k782k615k085q83K51
$$ 479416 486828 492686 496102 496784 495589 493641 491195 488042 484541 481359 478577 475962 473877 472994 473245
58643D73245N51J06p47j845k640k319j053j52l64r03o89K55J163J494J177N35
$$ 473245 473796 473902 473155 471310 468670 466351 465298 465146 464782 463879 463190 463445 464608 466102 467279 467814
58627D67814K42O87J268J109L63q3l6MR7Q46K115L088L670M499N596O404P151
$$ 467814 468056 468743 470011 471120 471483 471400 471364 471368 471465 472311 474426 477514 481184 485683 491279 497683 504834
58610E04834Q513R826R421P160M821L497K348N60j188k076k355k332j650m96j86
$$ 504834 513347 523173 532594 539754 544575 548072 550420 550980 549792 547716 545361 543029 541379 540883 540697
58595E40697j414l090l863l796l667l593l244k510j269O94K986M649N374N798
$$ 540697 539283 536193 532330 528534 524867 521274 518030 515520 514251 514945 517931 522580 527954 533752
58581E33752O329O738P154Q156R465R942R324Q641Q363P589N819M122L660M252
$$ 533752 540081 546819 553973 562129 571594 581536 590860 599501 607864 615453 621272 625394 629054 633306
58567F33306N165O260P547Q733R903J1678J4137J6552J8620K0749K2712K3435
$$ 633306 638471 644731 652278 661011 670914 682592 696729 713281 731901 752650 775362 798797
58555G98797K2628K1259J9728J7082J2890Q519N477L540J502j112l901o363q114
$$ 798797 821425 842684 862412 879494 892384 900903 906380 909920 911422 910310 906409 900046 891932
58542H91932q940r150r328r685j0324j1831j4466j7100j8403j8760j9362j9788
$$ 891932 882992 873842 864514 854829 844505 832674 818208 801108 782705 763945 744583 724795
58530G24795j8544j5901j3722j2387j0386p408n189m469l732k021n43k44j41N34
$$ 724795 706251 690350 676628 664241 653855 646447 641258 636789 633057 631036 630493 630249 630108 630642
58516F30642Q23K28K11J764L436L571K865K889L607M014L902L381K076J38j184
$$ 630642 631465 631693 631904 633668 637104 640675 643540 646429 650036 654050 657952 661333 663409 663547 662363
58501F62363j408j767l127m441m626m339m458m397l478k515k472k814k655k191
$$ 662363 660955 659188 656061 651620 646994 642655 638197 633800 630322 627807 625335 622521 619866 617675
58487F17675j719o54J091K291K286K245L299M927O466Q480J1205J3389J4177J4432
$$ 617675 615956 615302 616393 618684 620970 623215 626514 631441 637907 646387 657592 670981 685158 699590
58473F99590J4786J4197J2032R607P922N788K098j861m413o002p658q682q129
$$ 699590 714376 728573 740605 750212 758134 763922 766020 764159 759746 753744 746086 737404 729275
58460G29275o997o614o253m536j993m0J315K777M008M584N337O716P223N502K670
$$ 729275 722278 715664 709411 704875 702882 702842 704157 706934 710942 715526 720863 727579 734802 740304 742974
58445G42974M60j476m176o777p685p152o402n370l568k006j819k030r68R79K252
$$ 742974 743434 741958 737782 731005 723320 716168 709766 704396 700828 698822 697003 694973 694005 694984 697236
58430F97236K781L537M399M638M672N429O765Q250J0273J2689J3858J2905J1424
$$ 697236 700017 703554 707953 712591 717263 722692 729457 737707 747980 760669 774527 787432 798856
58417G98856J0852R951P182L744J639L77j615l743m432m253m919o206o637o319
$$ 798856 809708 819659 826841 830585 832224 832601 830986 827243 822811 818558 813639 807433 800796 794477
58403G94477o321o323n530m823n245n391l232M51L226M660N928O824O250M848
$$ 794477 788156 781833 776303 771480 766235 760844 757612 758063 761289 765949 771877 778701 784951 789799
58389G89799M223M134L201J698Q79M20p62j938j675n69j44J6J194K619K700K229
$$ 789799 794022 798156 801357 803055 803934 804354 803592 801654 799979 799410 799266 799282 800476 803095 805795 808024
58373H08024L162N011N574M662M040M235M374M576N646P002P646Q357J0262J2270
$$ 808024 811186 816197 821771 826433 830473 834708 839082 843658 849304 856306 863952 872309 882571 894841
58359H94841J2780J2693J3730J4987J4396J2315J0429Q495N633L355L497M445
$$ 894841 907621 920314 934044 949031 963427 975742 986171 994666 1000299 1003654 1007151 1011596
58347A011596L459J526J737L892N142N072N688P064P464P337Q750J1201J2360
$$ 1011596 1015055 1016581 1018318 1022210 1027352 1032424 1038112 1045176 1052640 1059977 1068727 1079928 1092288
58334A092288J2546J4069J6473J7044J5832J5501J6275J5642J3275J1652J1337
$$ 1092288 1104834 1118903 1135376 1152420 1168252 1183753 1200028 1215670 1228945 1240597 1251934
58323A251934J0194P714N866N229M377L434M096N790N980M615M241N585O975Q166
$$ 1251934 1262128 1269842 1275708 1280937 1285314 1288748 1292844 1298634 1304614 1309229 1313470 1319055 1326030 1334196
58309A334196J0500J3274J4328J4203J5455J7921J9097J8974J9872K1587K1595
$$ 1334196 1344696 1357970 1372298 1386501 1401956 1419877 1438974 1457948 1477820 1499407 1521002
58298A521002J9997J9408J9933J9212J7406J7098J8171J7934J6342J6015J7129
$$ 1521002 1540999 1560407 1580340 1599552 1616958 1634056 1652227 1670161 1686503 1702518 1719647
58287A719647J7477J7490J9662K3185K4825K4916K6635K9572L0296K9179L0046
$$ 1719647 1737124 1754614 1774276 1797461 1822286 1847202 1873837 1903409 1933705 1962884 1992930
58276A992930L2927L4021L3141L4164L7516L9376L9186M0708M4576M7064M7424
$$ 1992930 2025857 2059878 2093019 2127183 2164699 2204075 2243261 2283969 2328545 2375609 2423033
58265B423033M9256N3251N5922N6852N9803O5228O9108P0626P3335P7422P8672
$$ 2423033 2472289 2525540 2581462 2638314 2698117 2763345 2832453 2903079 2976414 3053836 3132508
58254C132508P6643P5849P7372P7499P6090P7530Q1882Q4111Q3963Q7194R4945
$$ 3132508 3209151 3285000 3362372 3439871 3515961 3593491 3675373 3759484 3843447 3930641 4025586
58243D025586J01648J05642J11932J21773J29964J35310J43357J55551J66380
$$ 4025586 4127234 4232876 4344808 4466581 4596545 4731855 4875212 5030763 5197143
58234E197143J74462J85514K00926K14750K25580K39753K59057K77405K93524
$$ 5197143 5371605 5557119 5758045 5972795 6198375 6438128 6697185 6974590 7268114
58225G268114L14224L41001L66761L90122M18878M54751M89921N23734N66916
$$ 7268114 7582338 7923339 8290100 8680222 9099100 9553851 10043772 10567506 11134422
58216A1134422O23309O84257P47439Q23533R17063J019582J129953J261641J421420
$$ 11134422 11757731 12441988 13189427 14012960 14930023 15949605 17079558 18341199 19762619
58207A9762619J602343J807551K058036K366493K729538L157376L678005M290203
$$ 19762619 21364962 23172513 25230549 27597042 30326580 33483956 37161961 41452164
58199D1452164M944120N602472O307105P165210Q288336R758257J1620856J3889192
$$ 41452164 46396284 51998756 58305861 65471071 73759407 83517664 95138520 109027712
58191A09027712J6578091J9749318K3477707K7731494L2264354L6499503L9288112
$$ 109027712 125605803 145355121 168832828 196564322 228828676 265328179 304616291
58184C04616291L8759366L2868404K0786180M119346j3390832k7747829l6646494
$$ 304616291 343375657 376244061 397030241 401149587 387758755 360010926 323364432
58177C23364432m0017234l9197987l5842238l1334771k6645536k2321354j8560981
$$ 323364432 283347198 244149211 208306973 176972202 150326666 128005312 109444331
58170A09444331j5381617j2752585j0615342q876260p447827o280529n335924
$$ 109444331 94062714 81310129 70694787 61818527 54370700 48090171 42754247
58163D2754247m560987l911185l370677k928557k558188k236942j963549j738756
$$ 42754247 38193260 34282075 30911398 27982841 25424653 23187711 21224162 19485406
58155A9485406j547915j377328j229280j106774r99834q99774q11466p39331o75528
$$ 19485406 17937491 16560163 15330883 14224109 13224275 12324501 11513035 10773704 10098176
58146A0098176o13264n57995n14577m76090m35896l98795l70114l44919l17565
$$ 10098176 9484912 8926917 8412340 7936250 7500354 7101559 6731445 6386526 6068961
58137F068961k91644k71467k53385k33917k17127k06038j95730j82405j70377
$$ 6068961 5777317 5505850 5252465 5018548 4801421 4595383 4399653 4217248 4046871
58128D046871j63006j55512j44035j33197j27429j22940j15400j07761j03436
$$ 4046871 3883865 3728353 3584318 3451121 3323692 3200752 3085352 2977591 2874155
58119B874155r9190r1784q4645q1182p8290p2889o8238o7251o6149o1315n6174
$$ 2874155 2774965 2683181 2598536 2517354 2439064 2366175 2297937 2230686 2164537 2103222 2047048
58108B047048n4743n4294n1025m7310m6677m6754m3870m0035l9005l9537l8544
$$ 2047048 1992305 1938011 1886986 1839676 1792999 1746245 1702375 1662340 1623335 1583798 1545254
58097A545254l7035l7242l7525l5552l3075l2549l2409l0361k7865k6909k5817
$$ 1545254 1508219 1470977 1433452 1397900 1364825 1332276 1299867 1269506 1241641 1214732 1188915
58086A188915k2601j9046j7403j6443j4709j3976j5621j7231j6730j6186j7681
$$ 1188915 1166314 1147268 1129865 1113422 1098713 1084737 1069116 1051885 1035155 1018969 1001288
58075A001288j9243j8779j8171j9476k0876k0408j9900k1039k1398j8710j5406
$$ 1001288 982045 963266 945095 925619 904743 884335 864435 843396 821998 803288 787882
58064G87882j4525j4607j3099j1280j1269j1436r585p676q535j0651j0883r841
$$ 787882 773357 758750 745651 734371 723102 711666 702081 694405 685870 675219 664336 654495
58052F54495r897j0290q903o805o458p209o874o037o568p542o781m988m557n470
$$ 654495 644598 634308 625405 618600 612142 604933 598059 592022 585454 577912 571131 566143 561586 556116
58038E56116n983n979o328o406n382m493n012n703n215m942o500q424q725q467
$$ 556116 550133 544154 537826 531420 526038 521545 516533 510830 505615 500673 494173 485749 477024 468557
58024D68557r463j0489r516p684p387q039p528o158n590n346m063k755l204m388
$$ 468557 459094 448605 439089 431405 424018 415979 408451 402293 396703 391357 387294 384539 381335 376947
58010C76947m124k930k762l171k362r25q09j575j234NL29o3O09K194K834K219
$$ 376947 372823 369893 367131 363960 361598 360673 359864 358289 357055 357060 357389 357326 357935 360129 362963 365182
57994C65182J638J326O44K90J367K805K501N59j150j932k292j988q11k97j824
$$ 365182 366820 368146 368790 369080 370447 373252 375753 376312 375162 373230 370938 368950 368139 367842 366018
57979C66018l902m167l158l139m139m314l507l281l758l559k544j784j124M01
$$ 366018 362116 357949 354791 351652 347513 343199 339692 336411 332653 329094 326550 324766 323642 324043
57965C24043K115K400J559J260J588J250M05M73J457K075K245K769L011J637o07
$$ 324043 326158 328558 330117 331377 332965 334215 334620 335093 336550 338625 340870 343639 346650 348287 347680
57950C47680j627j284j207j565r52N95J418J240J610K997M094M364M853O000O928
$$ 347680 346053 344769 343562 341997 341045 341640 343058 344298 345908 348905 352999 357363 362216 368216 375144
57935C75144P350Q058R138R638R270Q579P447N270K528K32j962n048q344j0212
$$ 375144 382494 390552 399690 409328 418598 427177 434624 439894 442422 442654 440692 435644 427300 417088
57921D17088j0860j1948j3488j3676j2062j0328r470q565p021n791n563n514m692
$$ 417088 406228 394280 380792 367116 355054 344726 335256 326691 319670 313879 308316 302802 298110
57908B98110l239j652j30J021J512J664J806J401R8j021q11m3k09r79r56l24m13
$$ 298110 294871 293219 293089 294110 295622 297286 299092 300493 300591 299570 298759 298716 298507 297528 296572 296248 295835
57891B95835j062q80R9N07K71O05J318P97j063k393k294j893j983j985j798k417
$$ 295835 294773 293893 293992 294499 294770 295375 296693 297490 296427 294034 291740 289847 287864 285879 284081 281664
57875B81664l952n094n286n483o109o219n378m574m466m437l965l327k469q55
$$ 281664 277712 272618 267332 261849 255740 249521 244143 239569 235103 230666 226701 223374 220905 220050
57861B20050J079K092K164K590L700M334M095M096M901N553N393N024M760L914
$$ 220050 221129 223221 225385 227975 231675 236009 240104 244200 249101 254654 260047 265071 269831 273745
57847B73745K351J062L98n21j970k936l036l381m583n549n273m365l707k988j673
$$ 273745 276096 277158 277556 277035 275065 272129 269093 265712 261129 255580 250307 245942 242235 239247 237574
57832B37574k41O10J100J852K984M274N384N644M629L125K409K460K142J203N60
$$ 237574 237333 237943 239043 240895 243879 248153 253537 259181 263810 266935 269344 271804 273946 275149 275709
57817B75709M51j6j111k029k560l540n024n846n610n398n778n806m978m405m974
$$ 275709 276160 276144 275033 273004 270444 266904 261880 256034 250424 245026 239248 233442 228464 224059 219085
57802B19085n783n590m600l722l160k701k450k363j868p57L65J018J367J521J334
$$ 219085 213302 207712 203112 199390 196230 193529 191079 188716 186848 186091 186456 187474 188841 190362 191696
57787A91696J228J977L348M202M332M769N925O854O933O785O914O898O499O220
$$ 191696 192924 194901 198249 202451 206783 211552 217477 224331 231264 238049 244963 251861 258360 264580
57773B64580O098N362L868K435J174q56l707n837o279n941n887n892n625n727
$$ 264580 270678 276040 279908 282343 283517 282661 278954 273117 266838 260897 255010 249118 243493 237766
57759B37766o536p143o885o478o565o459n476m324l975m222m374m393m305l649
$$ 237766 231230 224087 217202 210724 204159 197700 192224 187900 183925 179703 175329 170936 166631 162982
57745A62982k445j730k152l025l554l816l855l113j662o32m93k62O28J242R64
$$ 162982 160537 158807 156655 153630 150076 146260 142405 139292 137630 136998 136505 136243 136871 138113 139077
57730A39077P72J351J575M50q78q53M0L56R3J48L31r6n49J71J708K496K049J342
$$ 139077 139849 141200 142775 143225 142347 141494 141534 141890 141983 142131 142462 142366 141817 141988 143696 146192 148241 149583
57712A49583J076J027R97J045Q47L2r06j150o91l0R13K427L868M218L648L333
$$ 149583 150659 151686 152683 153728 154575 154607 153701 152551 151860 151830 152743 155170 159038 163256 166904 170237
57696A70237L715L954L171J388q13k815m063m360m032l491k759j856j227j192
$$ 170237 173952 177906 181077 182465 181652 178837 174774 170414 166382 162891 160132 158276 157049 155857
57682A55857j259n71J080L183N242P290R812J3279J7490K1557K5120K9317L5638
$$ 155857 154598 154027 155107 158290 163532 170822 180634 193913 211403 232960 258080 287397 323035
57669C23035M3966N2858O1411O8829P1725O4307M3220J1718k1967m9654o6581
$$ 323035 367001 419859 481270 550099 621824 686131 729351 741069 719102 669448 602867
57658F02867p1985o8542o0657n1772m3108l5018k8257k3201j9072j5150j1810
$$ 602867 530882 462340 401683 349911 306803 271785 243528 220327 201255 186105 174295
57647A74295r421p364n235l865l899m415m260l700l405k912j647m72n03j172j160
$$ 174295 164874 157510 152275 148410 144511 140096 135836 132136 128731 125819 124172 123700 123197 122025 120865
57632A20865o27p41j507j764j084j82L79N05p5j407k539k459j594j089j069q49
$$ 120865 120238 119497 117990 116226 115142 114960 115339 115844 115769 114362 111823 109364 107770 106681 105612 104763
57616A04763m89o54j180j218o88l12l15l24l55p53j278j364j083q51m95K46Q10
$$ 104763 104274 103620 102440 101222 100534 100222 99907 99583 99228 98475 97197 95833 94750 93899 93404 93650 94460
57599I4460N97J95M99J061Q19O7K2O57P03j81r07q35n98p20q06n55l63m88o20
$$ 94460 95057 95252 95751 96812 97631 97698 97720 98377 99080 98899 97992 97157 96559 95839 95033 94478 94115 93627 93007
57580I3007o30q03j031p75n5L60O7m25m73j2N96Q65M30m71j016q28n91r29j323
$$ 93007 92377 91574 90543 89768 89713 90073 90140 89715 89242 89230 89826 90691 91121 90650 89634 88806 88215 87286 85963
57561H5963j029m06k09j61M42J201J147M57J61L62K77j12o1L25N7j000j865k057
$$ 85963 84934 84528 84319 84158 84600 85801 86948 87405 87566 87928 88205 88093 88032 88357 88414 87414 85549 83492
57543H3492k037j847q87O22J476J261R48J182J286N98m05j070j554k148k450j986
$$ 83492 81455 79608 78721 79343 80819 82080 83028 84210 85496 86094 85689 84619 83065 80917 78467 76481
57527G6481j052l54k36o24j166j310p87j18k0l55l27K90R85J449J774J815J316
$$ 76481 75429 75075 74839 74215 73049 71739 70952 70834 70814 70459 70132 70422 71407 72856 74630 76445 77761
57510G7761P05P56J380J708J437J093R12N95K22M04J200J900K015J569M86j256
$$ 77761 78466 79222 80602 82310 83747 84840 85752 86347 86569 86973 88173 90073 92088 93657 94143 92887
57494I2887k772k844j537k93j19o56j169j346j015j27P14P55K69K32P86J185J232
$$ 92887 90115 87271 85734 85441 85322 84666 83497 82151 81136 81009 81723 82478 82747 82979 83765 84950 86182
57477H6182J475J844J469K06r59j421j589j669j154J3R83J279J319J334R05O4
$$ 86182 87657 89501 90970 91176 90217 88796 87207 85538 84384 84397 85380 86659 87978 89312 90217 90281
57461I0281l65j17Q0j20r1M91R88J008J003J079N48o35j322r12l83o60j128q06
$$ 90281 89916 89799 89879 89759 89668 90159 91147 92155 93158 94237 94785 94150 92828 91916 91533 90873 89745 88939
57443H8939R4Q07J273J716J793J174K96l28q38j362j464j007o43o66l36P54J625
$$ 88939 89033 89840 91113 92829 94622 95796 96092 95764 94926 93564 92100 91093 90450 89784 89448 90202 91827
57426I1827J305L86P4L84M59Q5k88o11j161j703j674j053k84L61Q14R04P22P78
$$ 91827 93132 93518 93592 93976 94435 94520 94232 93621 92460 90757 89083 88030 87746 88107 88921 89825 90547 91325
57408I1325J263J544J094L75J47L18K32l10r32j329j425j201p65l12J89Q16J122
$$ 91325 92588 94132 95226 95601 95748 96066 96298 95988 95056 93727 92302 91101 90336 90024 90213 91029 92151
57391I2151N45m61o22L68J360J501J432J929K468K213J496J166J142P44L4l06
$$ 92151 92696 92235 91613 91981 93341 94842 96274 98203 100671 102884 104380 105546 106688 107432 107466 107160
57375A07160j40j7l22r57j738k394k549k127j497q80j32O05P59L04J9K57L78j0
$$ 107160 107020 107003 106681 105724 103986 101592 99043 96916 95419 94539 94407 95012 95771 96075 96094 96351 96729 96719
57357I6719k23L18J045J268J314J609J615Q56J52M97J384J550R46N62O85O44J58
$$ 96719 96496 96814 97859 99127 100441 102050 103665 104521 104673 105170 106554 108104 109050 109612 110297 110941 111099
57340A11099l32n74p41p70l92K36O86R11J032Q18J87j58M30J358J409L99o67r72
$$ 111099 110767 110193 109452 108682 108290 108526 109212 110123 111155 111973 112160 112002 112432 113790 115199 115598 114931 113959
57322A13959n74L7L64M6o50p71J51J205J212L64j53J07N05N10K50r9n73j007j098
$$ 113959 113385 113422 113786 113832 113182 112411 112562 113767 114979 115343 115190 115297 115802 116312 116562 116463 115890 114883 113785
57303A13785r37q46q24o67m31k56KM25O59N02L81N60N55Q5J3J198K882L419K376
$$ 113785 112848 112002 111178 110511 110080 109824 109826 110251 110910 111412 111793 112353 112908 112993 113006 114204 117086 120505 122881
57284A22881Q43j05k46L18J358K153K009J208O67P02Q83Q88P16K32n64j058p30
$$ 122881 123724 123619 123373 123691 125049 127202 129211 130419 131086 131788 132671 133559 134275 134507 133943 132885 132155
57267A32155r5p2o04r93j207j696k133j711p47n14j220j529n55Q27J307Q44L39
$$ 132155 132060 131988 131384 130391 129184 127488 125355 123644 122897 122383 121163 119634 119079 119906 121213 122057 122396
57250A22396L14O06R17J074R98P36M30J63L8K34O94R90Q76O70O50M58k17q29o34
$$ 122396 122710 123316 124233 125307 126305 127041 127471 127634 127672 127906 128600 129590 130466 131136 131786 132244 132027 131198 130564
57231A30564J29N27K92K3K01P52J397J769J462O46K76Q94J749J929J767J970K028
$$ 130564 130693 131220 131512 131535 131736 132488 133885 135654 137116 137762 138038 138932 140681 142610 144377 146347 148375
57214A48375J025m46q64j25M19L33O76J806K443J709N73L31P87R19M55q5k22L37
$$ 148375 149400 148954 148090 147965 148384 148717 149393 151199 153642 155351 155924 156255 157042 157961 158416 158331 158109 158446
57196A58446J692L295M144L878L123K416J622P41L89Q84J617J995K231K686L092
$$ 158446 160138 163433 167577 171455 174578 176994 178616 179357 179746 180630 182247 184242 186473 189159 192251
57181A92251L086K913K921K894K525K126K236K811L279L236K820K538K848L599
$$ 192251 195337 198250 201171 204065 206590 208716 210952 213763 217042 220278 223098 225636 228484 232083
57167B32083L999L604L148L635M681M806L569K303K264L005L303K944K738L217
$$ 232083 236082 239686 242834 246469 251150 255956 259525 261828 264092 267097 270400 273344 276082 279299
57153B79299M135N066N944O987Q362R867J1004J1656J2484J4142J6251J7789J8478
$$ 279299 283434 288500 294444 301431 309793 319660 330664 342320 354804 368946 385197 402986 421464
57140D21464J8939J9467J9663J9493J9662K0557K1643K2483K3510K5286K7657
$$ 421464 440403 459870 479533 499026 518688 539245 560888 583371 606881 632167 659824
57129F59824L0237L3102L6350L9514M2112M4436M7273N0987N5268N9535O3393
$$ 659824 690061 723163 759513 799027 841139 885575 932848 983835 1039103 1098638 1162031
57118A162031O6879P0322P3730P6428P7922P8964Q0974Q4351Q8243R2158R6820
$$ 1162031 1228910 1299232 1372962 1449390 1527312 1606276 1687250 1771601 1859844 1952002 2048822
57107B048822J03029J10648J19385J29868J43255J60365J81852K08791K42515
$$ 2048822 2151851 2262499 2381884 2511752 2655007 2815372 2997224 3206015 3448530
57098C448530K84160L34890L96155M69214N54550O51979P60947Q80320J007976
$$ 3448530 3732690 4067580 4463735 4932949 5487499 6139478 6900425 7780745 8788721
57089H788721J140693J274138J402977J521305J622996J701283J748296J755671
$$ 8788721 9929414 11203552 12606529 14127834 15750830 17452113 19200409 20956080
57081B0956080J715426J619505J459014J226365R20444N50784J37426k92778p10875
$$ 20956080 22671506 24291011 25750025 26976390 27896834 28447618 28585044 28292266 27581391
57072B7581391j090237j409821j655554j820402j904527j915171j864647j767055
$$ 27581391 26491154 25081333 23425779 21605377 19700850 17785679 15921032 14153977
57064A4153977j636357j486154j328847j173765j026699q91389p70427o64370
$$ 14153977 12517620 11031466 9702619 8528854 7502155 6610766 5840339 5175969
57056E175969n71604m90277m19775l59846l09299k66536k30602k00953j76724
$$ 5175969 4604365 4114088 3694313 3334467 3025168 2758632 2528030 2327077 2150353
57047B150353j56783j39976j24908j10471r7113q6618p9795p5168p0647o5570
$$ 2150353 1993570 1853594 1728686 1618215 1521102 1434484 1354689 1279521 1208874 1143304
57037A143304o0388n5291n0281m5823m2330l9368l6293l3247l0767k8933k7555
$$ 1143304 1082916 1027625 977344 931521 889191 849823 813530 780283 749516 720583 693028
57026F93028k6671k6057k4888k2743k0452j9040j8315j7302j5682j3915j2397
$$ 693028 666357 640300 615412 592669 572217 553177 534862 517560 501878 487963 475566
57015D75566j1255j0657j0546j0405r915r444r304r071q241p102o161n386m674
$$ 475566 464311 453654 443108 432703 422788 413344 404040 394969 386728 379626 373465 368079 363405
57002C63405m427m829n187m894m429m414m321l271j632o29o91j233j830k319k031
$$ 363405 358978 354149 348962 344068 339639 335225 330904 327633 326001 325372 324681 323448 321618 319299 317268
56987C17268k15K653N213P030Q982J1445J3059J1946P663J581m358q910j1879
$$ 317268 317053 319706 324919 331949 340931 352376 365435 377381 385044 386625 382267 373357 361478
56974C61478j3567j4086j3339j1578r541p769o205m641l098j528K92K288L986
$$ 361478 347911 333825 320486 308908 299367 291598 285393 280752 277654 276126 276418 278706 282692
56961B82692N305O837R000J1528J4151J6927J9242J9307J5580Q383m14q749j4996
$$ 282692 287997 294834 303834 315362 329513 346440 365682 384989 400569 408952 408538 399789 384793
56948C84793j8182j8579j7590j6283j4417j1479p991m961k637n95J444L582N993
$$ 384793 366611 348032 330442 314159 299742 288263 280272 275311 272674 272079 273523 277105 283098
56935B83098Q511J0648J2606J5456J9516K3390K5393K4910K1482J3980K445j0197
$$ 283098 291609 302257 314863 330319 349835 373225 398618 423528 445010 458990 461435 451238
56923D51238k0058k5615k7779k7453k4848k0892j7218j4471j2049r656p805o643
$$ 451238 431180 405565 377786 350333 325485 304593 287375 272904 260855 251199 243394 236751
56911B36751n598m401l377k584j704q22l23j5N98J287J412J140J281J957K593
$$ 236751 231153 226752 223375 220791 219087 218265 217942 217927 218525 219812 221224 222364 223645 225602 228195
56896B28195L065L711M306M305M063M582O030P738R538J1802J4129J5413J5292
$$ 228195 231260 234971 239277 243582 247645 252227 258257 265995 275533 287335 301464 316877 332169
56883C32169J4160J1584O370j306r222j5100j8220j8779j7028j3715j0205p282
$$ 332169 346329 357913 364283 362977 353755 338655 320435 301656 284628 270913 260708 253426
56871B53426m589j641J478M670Q175J1945J5598J9315K3851K9320L5004M0577
$$ 253426 248837 247196 248674 253344 261519 273464 289062 308377 332228 361548 396552 437129
56859D37129M6297N1414N3359M9254L7858K0156p36k0103l3629l9986m0900l8426
$$ 437129 483426 534840 588199 637453 675311 695467 694731 674628 640999 601013 560113 521687
56847E21687l3195k5607j7231r854l921J236O264J1683J8175K6088L4923M3898
$$ 521687 488492 462885 445654 435800 431879 433115 439379 451062 469237 495325 530248 574146
56835E74146N2741O1607P0525P8749Q3736Q0750O5130L6471M49l4185o0475p5708
$$ 574146 626887 688494 759019 837768 921504 1002254 1067384 1103855 1104304 1070119 1009644 933936
56823I33936q0708p8071p0634o0595m9457l8522k8842k0625j3235o039J181Q597
$$ 933936 853228 775157 704523 643928 594471 555949 527107 506482 493247 487208 488389 496986
56811D96986J6423K4531L2574M0531M8396N5195N8868N7092M7730K9413L442k4753
$$ 496986 513409 537940 570514 611045 659441 714636 773504 830596 878326 907739 911181 886428
56799H86428m7927o1786o6876o5860o0571n2277m2918l4435k7435k1489j6198
$$ 886428 838501 776715 709839 643979 583408 531131 488213 453778 426343 404854 388656
56788C88656j1263o230r92L964Q387J2757J7451K2119K6240K9419L0451K7112
$$ 388656 377393 371163 370171 374135 382522 395279 412730 434849 461089 490508 520959 548071
56776E48071J7997M303j0865k4447l4437l9892m1044l9153l5617l1308k6826k2661
$$ 548071 566068 570371 559506 535059 500622 460730 419686 380533 344916 313608 286782 264121
56764B64121j8861j5177j1898r758q708p709o184m793m241m294m514n002n684
$$ 264121 245260 230083 218185 208427 199719 192010 185826 181033 176792 172498 167984 162982 157298
56751A57298n813m996l856l005k174j164n88p82r20l28J86m40j681k090j398o54
$$ 157298 151485 146489 142633 139628 137454 136290 135702 134920 134000 133672 133858 133418 131737 129647 128249 127595
56735A27595n43p60r33j105j210r51l29L22P86J048J007O44K29K4j6J4J62L32
$$ 127595 127052 126292 125359 124254 123044 122093 121764 122086 122872 123920 124927 125571 125800 125824 125808 125822 125984 126316
56717A26316L02K63O76J272J125Q7o98m19K35K73m5J18P20J094J112J114J084
$$ 126316 126618 126881 127557 128829 129954 130041 129343 128924 129159 129432 129387 129505 130225 131319 132431 133545 134629
56700A34629Q05N21O08R27J169J416J667J439N94o4Q3M30Q3p42j289j521j689
$$ 134629 135434 135955 136563 137490 138659 140075 141742 143181 143775 143711 143794 144224 144307 143565 142276 140755 139066
56683A39066j329l8J204J024k54r68n43j05m96j112j146p91n48l19J61O25P10
$$ 139066 137737 137699 138903 139927 139673 138705 138162 138057 137561 136449 135303 134512 133964 133645 133806 134431 135141
56666A35141O40R60J758K537K746K281J505Q59M54K46M39J293K415K913K581K253
$$ 135141 135781 136741 138499 141036 143782 146063 147568 148427 148881 149127 149566 150859 153274 156187 158768 161021
56650A61021K519K743K085R53N12J121K084K813L358L828M011L666K716J115r29
$$ 161021 163540 166283 168368 169321 169833 170954 173038 175851 179209 183037 187048 190714 193430 194545 193616
56635A93616k751l616l401k584j724j146r36q92o97k79K42Q49J400J169m35k588
$$ 193616 190865 187249 183848 181264 179540 178394 177458 176566 175869 175590 175832 176681 178081 179250 178815 176227
56619A76227l542k857j979k056k389j948j188j100j391j121m89m80j105j424j190
$$ 176227 172685 169828 167849 165793 163404 161456 160268 159168 157777 156656 156167 155687 154582 153158 151968
56604A51968j094j366j398q97l65k11k73l21l38k25J15M01L21J38L17P12P92N09
$$ 151968 150874 149508 148110 147213 146848 146637 146364 146043 145705 145480 145595 145996 146317 146455 146772 147484 148276 148785
56586A48785K57J57J02K54P47J113P74K0l03Q6P43J274J603J628J318J004R75
$$ 148785 149042 149199 149301 149555 150302 151415 152189 152209 151906 151992 152735 154009 155612 157240 158558 159562 160537
56569A60537J063J097J422K264L126L540L980N085O448P137P133P229P693P919
$$ 160537 161600 162697 164119 166383 169509 173049 177029 182114 188562 195699 202832 210061 217754 225673
56555B25673P276N584L038M55q77n03L80L35n27j128j235j442j736j504r08q89
$$ 225673 232949 238533 241571 242026 241149 240646 241026 241361 240834 239706 238471 237029 235293 233789 232881 231992
56539B31992j678k477k699k551k309k044k110k857l766l808k816j647r90q43j092
$$ 231992 230314 227837 225138 222587 220278 218234 216124 213267 209501 205693 202877 201230 200240 199397 198305
56524A98305j586j744j044mK78m08j269j794k148k316j942j146n69m10l04j26
$$ 198305 196719 194975 193931 193927 194205 193797 192528 190734 188586 186270 184328 183182 182613 182203 181899 181773
56508A81773j10j55R8N28P55R25J412J806J332J58p47j000j018r44n40j16l36
$$ 181773 181663 181508 181606 182134 182889 183814 185226 187032 188364 188522 187775 186775 185757 184813 184273 184157 183821
56491A83821j000j187p96o89j176j497j176p43p20q88q94p04k43O19J499J779
$$ 183821 182821 181634 180838 180149 178973 177476 176300 175557 174837 173949 173055 172351 172108 172727 174226 176005
56475A76005J524J278J014L59k34J62J316J839J118M7m72o04p24o71l12M2K96
$$ 176005 177529 178807 179821 180180 179946 180108 181424 183263 184381 184428 183956 183352 182628 181957 181645 181687 181983
56458A81983P36J229J159N04K4J27L59K87j2m83j180j625j182k43L8n71j029o90
$$ 181983 182719 183948 185107 185611 185635 185762 186121 186408 186396 185913 184733 183108 181926 181683 181721 181150 180121 179431
56440A79431j22M8J8Q2J29K28P40J376J273L82k40mM50N42O64J185J548J155L92
$$ 179431 179309 179357 179375 179457 179586 179814 180554 181930 183203 183585 183345 183341 183791 184333 184997 186182 187730 188885 189277
56421A89277LR0L06N22P23P57N02Mo77j249j068O8J221J359Q63Q64J347J237L53
$$ 189277 189280 189370 189676 190198 190921 191678 192180 192184 191507 190258 189190 189258 190479 191838 192701 193565 194912 196149 196502
56402A96502k88k82m32j111j494j022k56L14J069K217L113L249K989K732K360
$$ 196502 196214 195932 195500 194389 192895 191873 191617 191931 193000 195217 198330 201579 204568 207300 209660
56387B09660J877J681J744J569J184J075R63J8j442j980j225m90o28q17k46N03
$$ 209660 211537 213218 214962 216531 217715 218790 219753 219771 218329 216349 215124 214634 214006 213189 212943 213446
56371B13446P27Q37J355J833J836J889K448K885K490J573P79J68l40n02l77m67
$$ 213446 214173 215010 216365 218198 220034 221923 224371 227256 229746 231319 232098 232266 231926 231424 231047 230580
56355B30580p15m06L94N98p5m34K32R50P47K70N53J321J713J721J712J424N93
$$ 230580 229865 229459 229853 230451 230376 229942 230174 231124 231871 232141 232694 234015 235728 237449 239161 240585 241178
56338B41178j48o1N87J083J317J488J485J219J010R88Q23N25P13J603K544K918
$$ 241178 241030 240969 241556 242639 243956 245444 246929 248148 249158 250146 250969 251494 252207 253810 256354 259272
56322B59272K676J781L10p87m27Q03J079Kq67o15k42n62p36j2Q41J047J207J966
$$ 259272 261948 263729 264039 263252 262825 263628 264707 264709 263842 263227 262985 262423 261687 261675 262516 263563 264770 266736
56304B66736K736K971L207L720L671K819K442L172L595K482R10M47P13N08K7J02
$$ 266736 269472 272443 275650 279370 283041 285860 288302 291474 295069 297551 298461 298908 299621 300129 300156 300258
56288C00258M20L00K83J189K498L270L705M311M554L963L454L829M122L237K204
$$ 300258 300678 300978 301261 302450 304948 308218 311923 316234 320788 324751 328205 332034 336156 339393 341597
56273C41597K778M616N886O077O213O750P094P039P005P085P209P891R515J1315
$$ 341597 344375 348991 354877 360954 367167 373917 381011 388050 395055 402140 409349 417240 426755 438070
56259D38070J2312J2831J3863J5544J7376J9322K1577K3940K6471K9832L3960
$$ 438070 450382 463213 477076 492620 509996 529318 550895 574835 601306 631138 665098
56248F65098L7464L9569M1486M4552M8190N1143N3347N4975N4998N2620M9029
$$ 665098 702562 742131 783617 828169 876359 927502 980849 1035824 1090822 1143442 1192471
56237A192471M5708M1969L6077K8006J9061R710j29r436j6853k2653k8042l3057
$$ 1192471 1238179 1280148 1316225 1344231 1363292 1373002 1372873 1363437 1346584 1323931 1295889 1262832
56225A262832l6976m0118m3209m5503m5689m4222m2813m1820m0156l7543l5037
$$ 1262832 1225856 1185738 1142529 1097026 1051337 1007115 964302 922482 882326 844783 809746
56214H09746l3273l1839l0251k8284k5620k2439j9867j8598j7677j5893j3508
$$ 809746 776473 744634 714383 686099 660479 638040 618173 599575 581898 566005 552497
56203E52497j1331r123o588m783m672n242m948m095l879m025l470k529k163j868
$$ 552497 541166 532043 525455 520672 516000 510758 505810 501715 497836 493811 490341 487812 485649 483781
56189D83781m97J346J955J126J07m79q24o21M44J484J560J343J836K395J979J359
$$ 483781 483284 484630 486585 487711 487818 487339 486515 485894 486338 487822 489382 490725 492561 494956 496935 498294
56173D98294J869K941L240L235M132N170M707L327L138M479N968P258R030J0709
$$ 498294 500163 503104 506344 509579 513711 518881 523588 526915 530053 534532 540500 547758 556788 567497
56159E67497J1020J0502J0892J2244J3229J3853J5234J7054J8073J8908K1525
$$ 567497 578517 589019 599911 612155 625384 639237 654471 671525 689598 708506 730031
56148G30031K6097L1076L6234M2907N1292O0330P0180Q2051R5384J07807J17788
$$ 730031 756128 787204 823438 866345 917637 977967 1048147 1130198 1225582 1333389 1451177
56137A451177J24775J26830J21145J07468Q8881O9217N1960M0892L8407M2357
$$ 1451177 1575952 1702782 1823927 1931395 2020276 2089493 2141453 2182345 2220752 2263109
56127B263109M6927M7028M0379K6540P170j2826k7722l5386l7740l7704l8205
$$ 2263109 2310036 2357064 2397443 2423983 2431153 2418327 2390605 2355219 2317479 2279775 2241570
56116B241570m3133n5424p3597r2689j08555j19087j22403j17476j06463r3241
$$ 2241570 2198437 2143013 2069416 1976727 1868172 1749085 1626682 1509206 1402743 1309502
56106A309502p9635o5703n2788m2809l5123k7672k0818j6426j3746j0223o105
$$ 1309502 1229867 1164164 1111376 1068567 1033444 1005772 984954 968528 954782 944559 938454
56095I38454m013m068l623j902o48m7J677M253N306M789N258P150Q033P167O543
$$ 938454 934441 930373 926750 924848 924200 924153 925830 930083 935389 940178 945436 952586 960619 967786 974329
56080I74329O798O405N489O130Q124Q952Q488R187J0968J0930R065Q976J1636
$$ 974329 981127 987532 993021 999151 1007275 1016227 1024715 1033902 1044870 1055800 1064865 1073841 1085477
56067A085477J3601J3130J2943J4852J6608J6362J5734J6063J5983J5004J5381
$$ 1085477 1099078 1112208 1125151 1140003 1156611 1172973 1188707 1204770 1220753 1235757 1251138
56056A251138J8050K0537K1005K0738K0851K0399J9308J9221J9995J9440J7737
$$ 1251138 1269188 1289725 1310730 1331468 1352319 1372718 1392026 1411247 1431242 1450682 1468419
56045A468419J7717J9613K0420J9681K0649K4049K6212K5431K4800K6413K8120
$$ 1468419 1486136 1505749 1526169 1545850 1566499 1590548 1616760 1642191 1666991 1693404 1721524
56034A721524K8434K9457L2267L4535L5226L6686L9723M1731M1877M2792M5036
$$ 1721524 1749958 1779415 1811682 1846217 1881443 1918129 1957852 1999583 2041460 2084252 2129288
56023B129288M5658M4522M5816N0673N4663N5509N6806O0847O4414O5344O6735
$$ 2129288 2174946 2219468 2265284 2315957 2370620 2426129 2482935 2543782 2608196 2673540 2740275
56012B740275P0661P4153P5353P7350Q1870Q5586Q6770Q9168R5039J00841J04194
$$ 2740275 2810936 2885089 2960442 3037792 3119662 3205248 3292018 3381186 3476225 3577066 3681260
56001C681260J08431J15896J23322J28391J34137J42567J50758J57602J67087
$$ 3681260 3789691 3905587 4028909 4157300 4291437 4434004 4584762 4742364 4909451
55992D909451J80539J93303K03443K15632K32009K47927K61516K78182L00469
$$ 4909451 5089990 5283293 5486736 5702368 5934377 6182304 6443820 6722002 7022471
55983G022471L23217L44276L69717M02499M36804M70019N08910N57055O08254
$$ 7022471 7345688 7689964 8059681 8462180 8898984 9369003 9877913 10434968 11043222
55974A1043222O59960P20650P95688Q79171R68607J073696J201145J345801J507214
$$ 11043222 11703182 12423832 13219520 14098691 15067298 16140994 17342139 18687940 20195154
55965B0195154J699474J933777K208722K530283K923347L410656M000474M709291
$$ 20195154 21894628 23828405 26037127 28567410 31490757 34901413 38901887 43611178
55957D3611178N573770O623503P866660R321693J1037969J3069204J5461947J8289418
$$ 43611178 49184948 55808451 63675111 72996804 84034773 97103977 112565924 130855342
55949A30855342K1642562K5529131K9765051L3876313L6892668L7155064L2681897
$$ 130855342 152497904 178027035 207792086 241668399 278561067 315716131 348398028
55942C48398028K2375204P293682r325904k3632285l3084646l7241737l7172708
$$ 348398028 370773232 378066914 368741010 345108725 312024079 274782342 237609634
55935B37609634l4420089l0349824k5950954k1810927j8172172j5077378j2505389
$$ 237609634 203189545 172839721 146888767 125077840 106905668 91828290 79322901
55928G9322901j0407226q700145p299462o152647n222621m461415l824997l294341
$$ 79322901 68915675 60215530 52916068 46763421 41540800 37079385 33254388 29960047
55920B9960047k859121k496320k183288j915494j693192j504170j335417j188237
$$ 29960047 27100926 24604606 22421318 20505824 18812632 17308462 15973045 14784808
55912A4784808j066389r61238q62834p74371p02029o40705n82374n29190m86154
$$ 14784808 13718419 12757181 11894347 11119976 10417947 9777242 9194868 8665678 8179524
55903H179524m49439m13194l80037l54185l31778l07757k85135k68095k52890
$$ 8179524 7730085 7316891 6936854 6582669 6250891 5943134 5657999 5389904 5137014
55894E137014k34613k16353k02945j92022j79464j67591j59729j52617j42149
$$ 5137014 4902401 4686048 4483103 4291081 4111617 3944026 3784297 3631680 3489531
55885C489531j31237j24269j19046j11504j03400r8106r3675q7082q0662p7555
$$ 3489531 3358294 3234025 3114979 3003475 2900075 2801969 2708294 2621212 2540550 2462995
55875B462995p5298p0595o6063o5539o6836o5654o2770o1054n9118n4313m8623
$$ 2462995 2387697 2317102 2251039 2185500 2118664 2053010 1990240 1929186 1870068 1815755 1767132
55864A767132m5486m3908m1382l9371m0175m1561m0165l7379l6344l6048l3810
$$ 1767132 1721646 1677738 1636356 1596985 1556810 1515249 1475084 1437705 1401361 1365313 1331503
55853A331503l0841k9832k9559k7286k4260k3600k4780k5114k4747k5387k6052
$$ 1331503 1300662 1270830 1241271 1213985 1189725 1166125 1141345 1116231 1091484 1066097 1040045
55842A040045k4707k2396k1346k0820j8930j6724j6276j6623j5633j4120j4076
$$ 1040045 1015338 992942 971596 950776 931846 915122 898846 882223 866590 852470 838394
55831H38394j4730j4245j3436j3913j4411j2910j0552r664r705r017q629j0289
$$ 838394 823664 809419 795983 782070 767659 754749 744197 734533 724828 715811 707182 696893
55819F96893j2580j2992j2222j2430j2924j1682r692r546j0847j1059r857q874
$$ 696893 684313 671321 659099 646669 633745 622063 612371 602825 591978 580919 571062 562188
55807E62188q112o396m460l917l959k568k04J141J560K544L585L046J621J398
$$ 562188 554076 547680 543220 539303 535344 532776 532572 533713 535273 537817 541402 544448 546069 547467
55793E47467K143J892P46O35J789K672L075M073N029L685o29o320j1779j6048
$$ 547467 549610 551502 552248 552883 554672 557344 560419 564492 569521 573206 572577 566257 554478 538430
55779E38430j7876j6661j3928j1539r145n474j089K578N611Q164P925K482o352
$$ 538430 520554 503893 489965 478426 469281 463807 462718 465296 470907 479071 486996 489478 483126
55766D83126j3793j7380j8141j7119j4076r673n828l351j577m09m74j310j719
$$ 483126 469333 451953 433812 416693 402617 392944 387116 383765 382188 381779 381305 379995 378276
55753C78276j916l141n286o977p812q386q505p438n718m539l795k730j880k157
$$ 378276 376360 373219 367933 360956 353144 344758 336253 328815 323097 318558 314763 312033 310153 307996
55739C07996k672k031j169k259n049o984o868n776m433k430k96L12r20k450l316
$$ 307996 305324 303293 302124 299865 294816 287832 280964 275188 270755 268325 268029 268341 267421 264971 261655
55724B61655m115n153n674n377m942m615l741k077k35J356K646L355L348L305
$$ 261655 257540 252387 246713 241336 236394 231779 228038 225961 225726 227082 229728 233083 236431 239736
55710B39736L656L413J607p74j987k025k059k048j094K55K64j461l634n280o289
$$ 239736 243392 246805 248412 247638 245651 243626 241567 239519 238425 238680 238944 237483 233849 228569 222280
55695B22280o311n058l497k805k547j641o15q37j941k365k013k039k261j333N49
$$ 222280 215969 210911 207414 204609 202062 200421 199806 198969 197028 194663 192650 190611 188350 187017 187566
55680A87566J635J447J260J615J671J296J368J692R17r32k080j715r97q50q15
$$ 187566 189201 190648 191908 193523 195194 196490 197858 199550 200467 199535 197455 195740 194743 193893 193078
55665A93078o29r04j557j512n71K10M58R11J474R03q54k027j528l27M51R92J573
$$ 193078 192449 191545 189988 188476 187905 188115 188573 189484 190958 191861 191007 188980 187452 187125 187576 188568 190141
55648A90141J707J371J452K097K158J147J67L3%p34j712k417l295m651n688n737
$$ 190141 191848 193219 194671 196768 198926 200073 200240 200273 200273 199539 197827 195410 192115 187464 181776 176039
55632A76039n354n290n299m866m158l568l004k356j838j412o96K19O35K71l96
$$ 176039 170685 165395 160096 155230 151072 147504 144500 142144 140306 138894 138198 138417 139052 139323 138927
55617A38927j008j542j658r55n1j54j345k426k714k693k713k340j369l50K33L47
$$ 138927 137919 136377 134719 133764 133713 133559 132214 129788 127074 124381 121668 119328 117959 117609 117842 118189
55601A18189p7r13j308p14k13j139k653k605q73L98K61K74J574K862K604J350
$$ 118189 118112 117199 115891 115177 114964 113825 111172 108567 107694 108092 108353 108627 110201 113063 115667 117017
55585A17017N14L54M55R29J901K850L484M258N242N694N600O219Q108R877J0016
$$ 117017 117531 117885 118340 119269 121170 124020 127504 131762 137004 142698 148298 154517 162625 172502 182518
55570A82518Q710O803M252Q87k443m810o400p636q081p431o658o757p094o416
$$ 182518 191228 198031 202283 203170 200727 195917 189517 181881 173800 166369 159711 152954 145860 139444
55556A39444m926l977m083m474m451m051l454k645j701q58k88j35m94j084j382
$$ 139444 134518 130541 126458 121984 117533 113482 110028 107383 105682 104824 104536 104401 103907 102823 101441
55541A01441j314j291j313q27K31J034R89N47M25P14J198J832K361K234J384N27
$$ 101441 100127 98836 97523 96696 96927 97961 98950 99497 99922 100636 101834 103666 106027 108261 109645 110172
55525A10172J85R2j29l80n99j023j527j560j124j028j667k389k528k263j986j685
$$ 110172 110357 110449 110320 109940 109341 108318 106791 105231 104107 103079 101412 99023 96495 94232 92246 90561
55509I0561j407j437j663j528j041q63j022o68M18J188Q29j30q21j069r13j80
$$ 90561 89154 87717 86054 84526 83485 82622 81600 80932 81350 82538 83367 83237 82416 81347 80434 80254
55493H0254P18Q23J19j69M71Q94K67m90l44O4l15r49p20J8k5q96j406j003k97
$$ 80254 80972 81795 81914 81745 82216 83110 83377 82887 82543 82607 82292 81343 80623 80641 80616 79720 78314 77311 77014
55474G7014J70M69O18M27N7r6j2J9j17l99q24j092o95J96O62L81K55Q95J497J115
$$ 77014 77184 77653 78271 78698 78755 78659 78647 78666 78549 78150 77326 76234 75539 75735 76397 76778 77033 77928 79425 80540
55454H0540K35j28j45o75j584j889j365p65o07p22q62r00n34L03R92R36M65L22
$$ 80540 80775 80647 80502 79827 78243 76354 74989 74224 73617 72895 72033 71133 70599 70902 71894 72830 73295 73617
55436G3617N67P90R35J144J114N53j12l29k80l42j98N01J090P08k18n08O2O30
$$ 73617 74184 74974 75909 77053 78167 78720 78608 78279 77999 77657 77459 77960 79050 79758 79540 79032 79094 79724
55418G9724O71M17K6m36m81K20Q85N14m29o51k09m35j506j861o71O96O61l56q58
$$ 79724 80395 80812 80838 80402 79921 80141 81026 81540 81111 80460 80251 79816 78310 76449 75778 76474 77135 76779 75921
55399G5921m33K32Q09J501K029J694N42m40n34m7L55M93M86K89j68n57m54l2K3
$$ 75921 75488 75720 76529 78030 80059 81753 82295 81855 81321 81274 81629 82122 82608 82897 82729 82172 81718 81686 81709
55380H1709n63j259j481j356j325j427j436j423j490j223k65P33O89k19o24N7
$$ 81709 81146 79887 78406 77050 75725 74298 72862 71439 69949 68726 68461 69194 69883 69664 69040 69097
55364F9097P80N74l3j15R1k00q35r82n22j29j36k50k63k57j40K49O83P56N43L77
$$ 69097 69877 70451 70418 70303 70394 70194 69359 68377 67855 67726 67590 67340 67077 66820 66680 66929 67612 68368 68911 69288
55344F9288K52qj75P2M26L13j10j06M78R46P73J84l61p39r71r75q04o93o92n53
$$ 69288 69540 69532 69357 69429 69855 70168 70058 69952 70430 71376 72149 72333 71972 71233 70262 69287 68483 67790 67098 66545
55324F6545j23L58N77N51O07R52J330J201L81n85r92q38o93p07l84M33J060R31
$$ 66545 66422 66780 67357 67908 68515 69467 70797 71998 72379 71794 70802 69964 69271 68564 68180 68613 69673 70604
55306G0604M76M85J005J408J302Q11K13k16k67n7k5l05m32k3O53J115J278J255
$$ 70604 71080 71565 72570 73978 75280 76091 76304 76088 75821 75764 75739 75434 75002 74979 75632 76747 78025 79280
55288G9280R65M45J08K35M74L06l50j224j945k032j229j78M2o06r27l17K63p3
$$ 79280 80245 80690 80798 81033 81507 81813 81463 80239 78294 76262 75033 74855 74897 74291 73364 73047 73310 73237
55270G3237n73j05R17J199O03J03M7j55o98j002p86m21r8M05J017J252R26K98
$$ 73237 72664 72559 73476 74675 75278 75381 75428 75273 74575 73573 72787 72366 72268 72673 73690 74942 75868 76166
55252G6166m48j172j386p72J13M45L35M77Q24O41j13o05m71k41k20K8P34J339
$$ 76166 75718 74546 73160 72388 72501 72946 73281 73758 74582 75223 75110 74505 74034 73793 73573 73601 74335 75674
55234G5674J338R34M59j57q90j236q17j4M48K99j34l67j99J25K13J37M57J329
$$ 75674 77012 77946 78405 78248 77358 76122 75305 75291 75739 76038 75904 75537 75338 75463 75676 75813 76270 77599
55216G7599J982J618N34l32p06j017j364j278o23J16M83M84L12J69L13O99P60
$$ 77599 79581 81199 81733 81401 80695 79678 78314 77036 76413 76529 77012 77496 77808 77977 78290 78989 79749
55199G9749J63n14n02J8L05K83L76M31r7r38j229r52r50j340j193j75O72L90n71
$$ 79749 79912 79398 78896 78914 79219 79502 79878 80309 80212 79274 78045 77093 76143 74803 73610 73435 74107 74497 73926
55180G3926j161j050o11j42K89O73J033J264R78J01m60K80J828K529J701M70M9
$$ 73926 72765 71715 71104 70962 71251 71924 72957 74221 75199 75300 74840 75120 76948 79477 81178 81648 81697
55163H1697K94M37L06J04j87m88m18K1J57k92o05j60N17N55Mm55o11p27p96n75
$$ 81697 81991 82428 82734 82838 82651 82163 81745 81766 81923 81631 81026 80866 81383 81938 81942 81487 80876 80149 79353 78778
55143G8778j72Q8J90L28M43L60J93J34M6k70n71m10K26Q55J006N34m04j354j759
$$ 78778 78606 78694 78884 79212 79655 80015 80208 80342 80388 80118 79547 79137 79363 80218 81224 81758 81354 80000 78241
55124G8241j389n54K76R16J403J729J778J373L94r46j959k029j272l67L19Q83
$$ 78241 76852 76298 76574 77490 78893 80622 82400 83773 84167 83221 81262 79233 77961 77594 77913 78796
55108G8796J333J452J369J562K017K076J370M20r4j69k33m63p25q37o23o7M71
$$ 78796 80129 81581 82950 84512 86529 88605 89975 90395 90301 90132 89899 89436 88711 87874 87251 87184 87655
55091H7655O04N53Q87J547J699Q77l72j221j399j075n46k99o82j166p78L71R05
$$ 87655 88259 88812 89699 91246 92945 93822 93450 92229 90830 89755 89209 88910 88228 87062 86284 86655 87560
55074H7560J04q73n54P32J386P61k19n56l34k14m17n74k87K97N01j35j126j466
$$ 87560 87664 86791 86237 86969 88355 89116 88897 88341 88007 87793 87376 86802 86515 86812 87313 87178 86052 84586
55056H4586q80j21J73K34L60J71o92j631j690p67M19J290J713J677J311J028J037
$$ 84586 83706 83585 83758 83992 84352 84523 83831 82200 80510 79743 80162 81452 83165 84842 86153 87181 88218
55039H8218R07K37n27o73l52l92j019j577j537j062m51K31P99R34P42P90J223
$$ 88218 89125 89362 88835 88162 87810 87418 86399 84822 83285 82223 81772 82003 82802 83736 84478 85268 86491
55022H6491J346N25p82j373o22Q19J680J219j93j547k081j762j062m59j85j80
$$ 86491 87837 88362 87580 86207 85585 86404 88084 89303 89110 87563 85482 83720 82658 82199 82014 81834
55006H1834j18L15J015J484J425J071Q36P77P75Q92J247J606J481P73j4k83J8
$$ 81834 81716 82031 83046 84530 85955 87026 87862 88639 89414 90306 91553 93159 94640 95413 95399 95116 95134
54989I5134M23N01K71rk40n04p23o61l60k19l72l70J73Q79J121R37Q57R64Q44
$$ 95134 95557 96058 96329 96320 96080 95576 94853 94192 93832 93613 93241 92871 93044 93923 95044 95981 96838 97802 98646
54970I8646M15R8J08K71O21J396K229K184R46o53j654j902j687j164n95m98r76
$$ 98646 99061 99159 99267 99538 100159 101555 103784 105968 106914 106261 104607 102705 101018 99854 99259 98761 97785
54953I7785j385j164n14J02N89Q66N78k34p24k46O82J099Q87O23M92J62m28r10
$$ 97785 96400 95236 94722 94824 95413 96279 96857 96623 95899 95653 96335 97434 98321 98944 99436 99598 99170 98260
54935I8260j058r37o21k07N0R9L53J033J491Q66o14j597r34J248L779N358N408
$$ 98260 97202 96265 95644 95437 95487 95586 95939 96972 98463 99329 98715 97118 96184 97432 101211 106569 111977
54918A11977M494L855M227N229O108O663P049P082O304M573K133p10l525n656
$$ 111977 116471 120326 124553 129782 135890 142553 149602 156684 162988 167561 169694 168984 165459 159803
54904A59803o715p001p027o812o154n236m412l643k742j965j700j773j645j246
$$ 159803 153088 146087 139060 132248 126094 120858 116446 112803 110061 108096 106396 104623 102978 101732
54890A01732r60r14r44j040j209r33L42K122L048K477J293Q19J406K399L116L447
$$ 101732 100772 99858 98914 97874 96665 95732 96074 98196 101244 103721 105014 105833 107239 109638 112754 116201
54874A16201L723M215M825N214N249N108M850M155K846J369K89m85j459k706l828
$$ 116201 119924 124139 128964 134178 139427 144535 149385 153540 156386 157755 158044 157559 156100 153394 149566
54859A49566m614n191n465n060l973k796k121k057k416k949l231k790j635m23
$$ 149566 144952 139761 134296 129236 125263 122467 120346 118289 115873 112924 109693 106903 105268 104845
54845A04845J63L8m01q31j254j726k072j986j422p37k71L0L61N33K35k71l00K08
$$ 104845 105008 105046 104645 103814 102560 100834 98762 96776 95354 94617 94346 94376 94737 95270 95505 95234 94934 95142
54827I5142M64po13n89j36K1k26l36o7K38K47N7k1K46Q00J227J107O19M01N82
$$ 95142 95606 95599 94986 94397 94261 94282 94056 93720 93653 93891 94138 94195 94174 94420 95220 96447 97554 98173 98574 99156
54807I9156N63M4l81k32m8m79j124j109m78l0j0P3M25O58M32j63q52j227q23J92
$$ 99156 99719 99763 99382 99150 99102 98623 97499 96390 95912 95882 95872 95945 96370 97028 97460 97297 96445 95218 94395 94587
54787I4587Q58O06J65M44J053R86M04L67J009J324Q67L72M59Q92J351J872K188
$$ 94587 95445 96051 96216 96660 97713 98699 99103 99470 100479 101803 102670 103042 103501 104393 105744 107616 109804
54770A09804J792J036J078K277L586M068M118M638N741O880P580P586O866N806
$$ 109804 111596 112632 113710 115987 119573 123641 127759 132397 138138 145018 152598 160184 167050 172856
54756A72856M849L762J906n90k857m569o210p760q285p371n962n039m417l576
$$ 172856 177705 181467 183373 182783 179926 175357 169147 161387 153102 145731 139769 134730 130313 126737
54742A26737k715k185j657q83n13j223k467l058k616j640n65N07J323J571J370
$$ 126737 124022 121837 120180 119297 118784 117561 115094 112036 109420 107780 107215 107722 109045 110616 111986
54727A11986J100R20Q04P83Q17P90R66J884L449M779N415N927O737P136O349M824
$$ 111986 113086 114006 114810 115593 116410 117200 118166 120050 123499 128278 133693 139620 146357 153493 159842 164666
54711A64666L442K057m0k626m652n707o309o747o681n919m751l438k100j141j043
$$ 164666 168108 170165 170125 167499 162847 157140 150831 144084 137403 131484 126733 123295 121195 120054 119011
54696A19011j604k090k180k126k040j709j120n68j08L95O94L41m68r40q19p23
$$ 119011 117407 115317 113137 111011 108971 107262 106142 105574 105466 105861 106555 106896 106428 105488 104669 103946
54680A03946j138j618j405m06P85J468J307N18k57n42n06n57o49m68j72k39n44
$$ 103946 102808 101190 99785 99379 100164 101632 102939 103457 103200 102658 102152 101595 100946 100478 100306 100067 99523
54663I9523l98K72O25J38n63o70l43k25k80L9O62Q22K15m19k36N83J076O85j24
$$ 99523 99125 99397 100022 100160 99597 98927 98584 98359 98079 98118 98780 99602 99817 99398 99162 99745 100821 101506 101382
54644A01382m92j67L30M48K52K01M64P42P18M38J45o8k90n61p27n72p6M09L70
$$ 101382 100890 100723 101053 101501 101753 101954 102418 103160 103878 104316 104461 104393 104103 103542 102815 102243 102167 102576 102946
54625A02946l29j186j540j263p86m30j6P01J464J627Q71l52j142r47l1Q20J064
$$ 102946 102617 101431 99891 98628 97842 97412 97396 98097 99561 101188 102059 101707 100565 99618 99587 100407 101471
54608A01471Q51O93Q11R03N97l5m84l28L32R63J093O64l2o15p91m25K95Q71R17
$$ 101471 102322 103015 103826 104729 105326 105291 104807 104479 104811 105774 106867 107531 107499 106884 106093 105668 105963 106834 107751
54589A07751N41J79K9n8j99l05l59n28q24r67p92n30m04k47J73O03N55P0j82K66
$$ 107751 108292 108471 108500 108442 108243 107938 107579 107051 106227 105260 104468 103938 103534 103287 103460 104063 104618 104688 104506 104772
54569A04772J007J217O51lN5P50J186P63r6n22k88Q9J98J52J61K39M64J006J587
$$ 104772 105779 106996 107647 107644 107699 108449 109635 110398 110302 109780 109492 109581 109779 109931 110092 110331 110795 111801 113388
54550A13388J463M55m41j23J151K005J639O83K04M02O52N32L14M89J107J729J953
$$ 113388 114851 115306 114865 114742 115893 117898 119537 120220 120424 120826 121478 122010 122324 122813 123920 125649 127602
54533A27602J769J433J098P52M10J70N5o0k28l36k50o1k8l67r90j492j453q91
$$ 127602 129371 130804 131902 132654 133064 133234 133289 133229 133001 132665 132415 132354 132326 131959 130969 129477 128024 127133
54515A27133k82J2O9O5j34o23r78o80J10P41R14Q05L79n22j445j489n66K85K47
$$ 127133 126851 126863 126932 126997 126863 126240 125262 124582 124692 125433 126347 127152 127531 127009 125564 124075 123509 123794 124041
54496A24041k11j32O44J513J888J494L29j080j797j405n35l9NQ4M19Q51J174J170
$$ 124041 123830 123698 124342 125855 127743 129237 129566 128486 126689 125284 124749 124710 124715 124799 125218 126069 127243 128413
54478A28413O79O9J09R31J644J495Q81N62N87O82J048J797K230J755J018R36J114
$$ 128413 129092 129161 129270 130201 131845 133340 134221 134783 135370 136052 137100 138897 141127 142882 143900 144836 145950
54461A45950N71l47l57N38Q59K7q04p71o09j075j518j163o33q82j391r56K04N67
$$ 145950 146521 146174 145817 146355 147214 147241 146437 145666 145057 143982 142464 141301 140668 139786 138395 137439 137643 138210
54443A38210n25j960k391j654m20Q16J841K275J635k9j826k575j827l24P57R92
$$ 138210 137685 135725 133334 131680 131260 132076 133917 136192 137827 137798 135972 133397 131570 131246 132003 132995
54427A32995Q64Q45Q11N46K29P8p7l94n62k24L47N48K36k56p50j313j721j402
$$ 132995 133859 134704 135515 136061 136290 136368 136291 135897 135335 135111 135458 136006 136242 135986 135236 133923 132202 130800
54409A30800k63Q59R62M1q46p02L86J481J860J556R25J46n27n47L89J626K068
$$ 130800 130537 131396 132358 132399 131553 130851 131237 132718 134578 136134 137059 137205 136678 136131 136520 138146 140214
54392A40214J392L45k72l69k73k03k63m71n41j34N11P18L96K92P78J107M91n99
$$ 140214 141606 141951 141679 141310 141037 140834 140571 140100 139559 139425 139936 140654 141050 141342 142120 143227 143718 143119
54374A43119j030n81m7K0j13j40j67j84K16J158J983J899R39j11n59l99j24j48
$$ 143119 142089 141508 141461 141481 141368 141228 141061 140877 141093 142251 144234 146133 147072 146961 146402 146003 145879 145731
54356A45731m19n67m15k70n41j145j547j420j010p34o59n95m98n25o87o80k47
$$ 145731 145312 144745 144330 144060 143519 142374 140827 139407 138397 137663 137004 136409 135911 135386 134699 134019 133772
54339A33772M10Q02P64O65P97Q72M59j57j18Q46J868J942J166N97Q88J556J602
$$ 133772 134182 134984 135748 136413 137210 138082 138541 138384 138266 139112 140980 142922 144088 144685 145573 147129 148731
54322A48731O75o11j400j528j598k077k572k362j521r07r84j234j075p24o66p97
$$ 148731 149406 148795 147395 145867 144269 142192 139620 137258 135737 134830 133846 132612 131537 130813 130147 129350
54306A29350p91q24j207j535j118q0Q03J293J763K061J414j60j388j305n02j62
$$ 129350 128559 127735 126528 124993 123875 123795 124598 125891 127654 129715 131129 130969 129581 128276 127774 127612
54290A27612n07r73j215j160n63N68J448J404R87J178J756J596N90l0M04R96P79
$$ 127612 127105 126132 124917 123757 123194 123762 125210 126614 127601 128779 130535 132131 132721 132691 133095 134091 134870
54273A34870J07j83j08j15o8L61P32L67m66r04p83o00l41N10J708K141J386L95
$$ 134870 134977 134794 134686 134571 134503 134864 135596 135963 135497 134593 133810 133210 132869 133379 135087 137228 138614 139009
54255A39009J54M53N81M68M15L01j98q90j266j223j025p55l99k24m98r58j113
$$ 139009 139163 139616 140197 140665 141080 141381 141183 140293 139027 137804 136779 136024 135625 135401 134903 133945 132832
54238A32832r96j047j308j321q58k27K12L68J87m34j261j750j629j154o72k40
$$ 132832 131836 130789 129481 128160 127302 127075 127287 127655 127842 127408 126147 124397 122768 121614 120942 120702
54222A20702J24K00j79p84j146r53k34P28J530J846J564P60l43j282j504q73L7
$$ 120702 120826 121026 120847 120063 118917 117964 117730 118458 119988 121834 123398 124158 123815 122533 121029 120156 120193
54205A20193N34N74O35R52J324J602J877K108K033J615J118O40M4n54p21l94j58
$$ 120193 120727 121301 121936 122888 124212 125814 127691 129799 131832 133447 134565 135205 135249 134695 133974 133580 133422
54188A33422m65j015j285j274j280j271r90n25k70l55n67p66r77j097q70k92K52
$$ 133422 132957 131942 130657 129383 128103 126832 125842 125317 125047 124692 124125 123359 122382 121285 120415 120123 120375
54171A20375L56k7o13j029j059q02n62m74l39RL18K30p2L3P21J315J101K73l14
$$ 120375 120731 120704 120091 119062 118003 117201 116639 116165 115826 115835 116153 116383 116311 116344 117065 118380 119481 119754 119440
54152A19440k44N5J21J34M11O61K97n55j035p11j51q5m13m73L3Q59J638K096K044
$$ 119440 119196 119251 119372 119506 119917 120578 120875 120320 119285 118574 118423 118338 117925 117452 117485 118344 119982 122078 124122
54133A24122J609J230J066P03j19q11p03j07J44k8p5n2n57j376j404l06Q22J034
$$ 124122 125731 126961 128027 128730 128611 127800 127097 126990 127134 127106 127031 126979 126422 125046 123642 123336 124158 125192
54115A25192P40P03P76N43L39O56J065P96on90q25j151j534j454q85l18J40P83
$$ 125192 125932 126635 127411 127954 128293 128949 130014 130810 130804 130214 129389 128238 126704 125250 124365 124047 124187 124970
54097A24970J390J171l1j275j537p28M89J334J306M81l81n17o8K09R0Q9M22O13
$$ 124970 126360 127531 127500 126225 124688 123960 124449 125783 127089 127570 127189 126672 126604 126813 126903 126992 127414 128027
54079A28027L85K20N04Q18O13P5k52l05l64l89j24L29N74N01L28J09l28q90j151
$$ 128027 128412 128632 129136 129954 130567 130642 130390 130085 129721 129332 129208 129537 130111 130612 130940 131049 130721 129831 128680
54060A28680q59k80J98N08Q18J122J184R09N80N62Q26R56P30M43M71P17Q11P52
$$ 128680 127821 127541 127739 128247 129065 130187 131371 132280 132860 133422 134248 135204 135934 136377 136848 137565 138376 139128
54042A39128R17J398J716J465R43Q48J410K090K259J942J727J960K214J893J125
$$ 139128 140045 141443 143159 144624 145567 146415 147825 149915 152174 154116 155843 157803 160017 161910 163035
54027A63035O33O97Q05N58L38O25J151J484J996L335N194O548P113P523P822O868
$$ 163035 163668 164365 165170 165728 166066 166691 167842 169326 171322 174657 179851 186399 193512 201035 208857 215725
54011B15725L831n03m546p417r097r591q859p270n527m126l228k895l004l162
$$ 215725 219556 219053 214507 207090 197993 188402 179543 172273 166746 162620 159392 156497 153493 150331
53997A50331l031k627k098j470q32m01j71Q4K79j2p02j009o10k31m05m36M32J510
$$ 150331 147300 144673 142575 141105 140273 139872 139701 139785 140064 140052 139350 138341 137731 137500 137095 136659 137091 138601
53979A38601J530O64K60P08R43K99n36p57n55l26R2P64J112P76K88K23L28K60
$$ 138601 140131 140795 141055 141763 142706 143005 142469 141712 141157 140831 140923 141687 142799 143575 143863 144086 144414 144674
53961A44674L85J034J521J018o9n68k73r6n16q51l45Q12J792J990J395N34J76
$$ 144674 145059 146093 147614 148632 148563 147995 147722 147626 147110 146259 145914 146726 148518 150508 151903 152437 152613
53944A52613O74J549K076K189K340K589K584K429K734L625M382M453M116L733
$$ 152613 153287 154836 156912 159101 161441 164030 166614 169043 171777 175402 179784 184237 188353 192086
53930A92086L012J612J2r25j008q25j038j889l143m030l604j758L02J205R30N55
$$ 192086 195098 196710 196722 195797 194789 193964 192926 191037 187894 183864 180260 178502 178804 180009 180939 181494
53914A81494O70P34J55p74j389j570j752k228k843l215l048k305j245k84L16N34
$$ 181494 182164 182898 183053 182279 180890 179320 177568 175340 172497 169282 166234 163929 162684 162400 162716 163250
53898A63250M86K99J10n4l24p12q71n03R4K40k54q42r75o77k57J40M59O34P74
$$ 163250 163736 164035 164145 164091 163767 163055 162184 161681 161775 162015 161761 160919 159944 159267 159010 159150 159609 160243 161017
53879A61017J060J301R95J54m43k61J89J65j30J79J345K728L668M044L995L806
$$ 161017 162077 163378 164373 164527 164084 163823 164012 164177 164047 164226 165571 168299 171967 176011 180006 183812
53863A83812M099N441P637R918J1963J4136J6514J8261J8114J5107Q961O73p149
$$ 183812 187911 193352 200989 210907 222870 237006 253520 271781 289895 305002 313963 314636 307487
53850C07487j1674j2318j1225j0735j1147j1470j1404j1295j0860r432p382n927
$$ 307487 295813 283495 272270 261535 250388 238918 227514 216219 205359 195927 188545 182618
53838A82618n359m655l242j984j850k438k614j986j017j46N52R85J007O51J16
$$ 182618 177259 172604 169362 167378 165528 163090 160476 158490 157473 157327 157879 158864 159871 160522 160638
53823A60638m31q12q78p34o39n09J9Q33J209Q49M08M81O75L72j20q3L09K88j19
$$ 160638 160207 159395 158517 157783 157144 156635 156654 157487 158696 159545 159953 160434 161109 161481 161361 161278 161587 161875 161756
53804A61756m9P42J373J082J77n86q65o06J87J189J777J733J456J243R47O51Q89
$$ 161756 161707 162449 163822 164904 165081 164495 163630 163024 163211 164400 166177 167910 169366 170609 171556 172207 173096
53787A73096J676K022J162j75n91K07J153J188K15j192k332k691k260j633j373
$$ 173096 174772 176794 177956 177781 177190 177397 178550 179738 179953 178761 176429 173738 171478 169845 168472
53772A68472j332j026m23J12M69P57P77K69l53l26K82M84k73j344j832j647j210
$$ 168472 167140 166114 165691 165803 166272 167029 167806 168075 167722 167396 167678 168162 167889 166545 164713 163066 161856
53755A61856p22k42o7l61o72l98L55Q92Q32N01L67M62N03L13K3n2L26J097J890
$$ 161856 161134 160892 160825 160464 159792 159394 159749 160641 161473 161974 162341 162803 163306 163619 163642 163590 163916 165013 166903
53736A66903K288K122J578J061R25J197J587J817J911J988J942J637J304J291
$$ 166903 169191 171313 172891 173952 174877 176074 177661 179478 181389 183377 185319 186956 188260 189551
53722A89551J509J521J334J490K145K575K129J286J121J879K717K900K666K637
$$ 189551 191060 192581 193915 195405 197550 200125 202254 203540 204661 206540 209257 212157 214823 217460
53708B17460K793K526J696J076J475K576L151K505J400J126J981L153L946M408
$$ 217460 220253 222779 224475 225551 227026 229602 232753 235258 236658 237784 239765 242918 246864 251272
53694B51272M647M291L077J527M47nl14q05j285j406j058l77L17O77N81K71L7
$$ 251272 255919 260210 263287 264814 265261 265256 264942 264137 262852 261446 260388 260011 260328 261005 261586 261857 261894
53677B61894k8K6J59K07l9m81o89n09l54n23o10j30N64N97k20j127j392j073o79
$$ 261894 261866 261892 262051 262258 262219 261738 261049 260540 260186 259663 259053 258923 259487 260084 259864 258737 257345 256272 255593
53658B55593n64p92j249j659j740j469j037n52j3M99Q21Q81P02L50R0L57J134
$$ 255593 255029 254237 252988 251329 249589 248120 247083 246531 246518 247017 247838 248719 249421 249771 249861 250218 251352
53641B51352J625J154J65l03k5L36N36J126K194K764K112R47N59J241K338L338
$$ 251352 252977 254131 254296 253993 253968 254304 254840 255966 258160 260924 263036 263983 264542 265783 268121 271459
53625B71459M043M068L128J881J543K530M025N049N312M944M150L424L420M131
$$ 271459 275502 279570 282698 284579 286122 288652 292677 297726 303038 307982 312132 315556 318976 323107
53611C23107M691M473M020M285N233N798N105L321J353J57K31J253K182K154J397
$$ 323107 327798 332271 336291 340576 345809 351607 356712 360033 361386 361543 361774 363027 365209 367363 368760
53596C68760Q70R36R00O7j230k071k048j517j045j023j557k289k475j787r59j013
$$ 368760 369630 370566 371466 371533 370303 368232 366184 364667 363622 362599 361042 358753 356278 354491 353532 352519
53580C52519j866k319j619l81L41M03M31P88J300J799K355K904L208L219L132
$$ 352519 350653 348334 346715 346334 346675 347078 347509 348297 349597 351396 353751 356655 359863 363082 366214
53565C66214K919K250J082m8o45r41j536k441k929k486j576j077j167j217p72
$$ 366214 369133 371383 372465 372417 371772 370831 369295 366854 363925 361439 359863 358786 357619 356402 355630
53550C55630j73J24L21R41J924K674K938L021L180L358L670M443N555O346O661
$$ 355630 355457 355581 355902 356843 358767 361441 364379 367400 370580 373938 377608 382051 387606 393952 400613
53535D00613P270Q730J0387J1195J1121J0977J1169J1490J1933J2827J4066J5080
$$ 400613 407883 416613 427000 438195 449316 460293 471462 482952 494885 507712 521778 536858
53523E36858J5734J6518J7663J8799J9686K0673K2042K3534K4803K5816K6484
$$ 536858 552592 569110 586773 605572 625258 645931 667973 691507 716310 742126 768610
53512G68610K6477K5881K5433K5647K6179K6531K6868K7484K7990K7794K7087
$$ 768610 795087 820968 846401 872048 898227 924758 951626 979110 1007100 1034894 1061981
53501A061981K6547K6324K6059K5738K5636K5469K4540K2959K1731K1319K0900
$$ 1061981 1088528 1114852 1140911 1166649 1192285 1217754 1242294 1265253 1286984 1308303 1329203
53490A329203J9654J8056J7224J7462J8192J8951J9692K0240K0243J9645J8598
$$ 1329203 1348857 1366913 1384137 1401599 1419791 1438742 1458434 1478674 1498917 1518562 1537160
53479A537160J6931J4340J1161Q272O016L882J404j229l793o619j0049j3763j7096
$$ 1537160 1554091 1568431 1579592 1587864 1593880 1597762 1599166 1597937 1594144 1587525 1577476 1563713 1546617
53466A546617j9585k0803k0311j8545j7189j7712j9765k1861k3367k4813k6336
$$ 1546617 1527032 1506229 1485918 1467373 1450184 1432472 1412707 1390846 1367479 1342666 1316330
53455A316330k7160k6877k6091k5331k4335k3008k2101k2119k2344k1778k0413
$$ 1316330 1289170 1262293 1236202 1210871 1186536 1163528 1141427 1119308 1096964 1075186 1054773
53444A054773j8719j6530j3497j0243p862o512n480m483l868l504k517m53K141
$$ 1054773 1036054 1019524 1006027 995784 987922 981410 975930 971447 967579 964075 961558 961105 963246
53431I63246M468O210P393Q247R431J1618J4590J7280J8964J9861K0486K1050
$$ 963246 967714 973924 981317 989564 998995 1010613 1025203 1042483 1061447 1081308 1101794 1122844
53419A122844K1741K2875K4415K5885K7077K8365L0065L2007L4007L6231L8773
$$ 1122844 1144585 1167460 1191875 1217760 1244837 1273202 1303267 1335274 1369281 1405512 1444285
53408A444285M1318M3626M5887M8293N0693N2987N5375N7884O0023O1270O1627
$$ 1444285 1485603 1529229 1575116 1623409 1674102 1727089 1782464 1840348 1900371 1961641 2023268
53397B023268O1515O1458O2041O3565O5463O6494O5858O3703O0486N6524N2456
$$ 2023268 2084783 2146241 2208282 2271847 2337310 2403804 2469662 2533365 2593851 2650375 2702831
53386B702831M9345M7617M6464M4822M2425L9379L5458L0620K5771K1999J9237
$$ 2702831 2752176 2799793 2846257 2891079 2933504 2972883 3008341 3038961 3064732 3086731 3105968
53375C105968J6345J2309O717o43r769k0065l0591m0732n0111n8061o3802o7145
$$ 3105968 3122313 3134622 3141339 3140696 3130927 3110862 3080271 3039539 2989428 2931367 2867565 2800420
53363B800420o8508o8430o7535o6665o6320o5992o4734o2365n9578n6980n4757
$$ 2800420 2731912 2663482 2595947 2529282 2462962 2396970 2332236 2269871 2210293 2153313 2098556
53352B098556n3237n2922n3773n5046n5984n6226n5469n3377n0081m6285m2664
$$ 2098556 2045319 1992397 1938624 1883578 1827594 1771368 1715899 1662522 1612441 1566156 1523492
53341A523492l9566l7164l5365l3445l0465k6338k2057j8678j6495j5287j4817
$$ 1523492 1483926 1446762 1411397 1377952 1347487 1321149 1299092 1280414 1263919 1248632 1233815
53330A233815j4814j4978j5254j5688j5908j5278j3824j2367j1414j0438q754
$$ 1233815 1219001 1204023 1188769 1173081 1157173 1141895 1128071 1115704 1104290 1093852 1085098
53319A085098o591m720l372k118o17J025K577L925N019N908O804P905R258J0964
$$ 1085098 1078507 1073787 1070415 1068297 1067680 1068705 1071282 1075207 1080226 1086134 1092938 1100843 1110101 1121065
53305A121065J3296J6266J9265K1492K2781K3680K4719K5942K7172K8487L0146
$$ 1121065 1134361 1150627 1169892 1191384 1214165 1237845 1262564 1288506 1315678 1344165 1374311
53294A374311L2101L3714L4162L3167L1301K9387K7682K5841K3682K1595K0029
$$ 1374311 1406412 1440126 1474288 1507455 1538756 1568143 1595825 1621666 1645348 1666943 1686972
53283A686972J8850J7410J5124J1798P666L368l36l137n491q110j1262j4710j8217
$$ 1686972 1705822 1723232 1738356 1750154 1757820 1761188 1760852 1757715 1752224 1744114 1732852 1718142 1699925
53270A699925k1747k5243k8463l1152l3156l4390l4908l5063l5331l5864l6343
$$ 1699925 1678178 1652935 1624472 1593320 1560164 1525774 1490866 1455803 1420472 1384608 1348265
53259A348265l6403l6039l5473l4750l3705l2232l0513k8949k7937k7712k8222
$$ 1348265 1311862 1275823 1240350 1205600 1171895 1139663 1109150 1080201 1052264 1024552 996330
53248I96330k9176l0177l0879l1005l0443k9435k8462k7692k6601k4508k1474
$$ 996330 967154 936977 906098 875093 844650 815215 786753 759061 732460 707952 686478
53237F86478j8389j5955j3977j1880r690q133p815q555r479r695r030q296q557
$$ 686478 668089 652134 638157 626277 616587 608454 600639 592084 582605 572910 563880 555584 547027
53224E47027r911j1264j1702j1598j1894j2590j2819j2195j1241j0401r512q468
$$ 547027 537116 525852 514150 502552 490658 478068 465249 453054 441813 431412 421900 413432
53212D13432p613p053o401n575n173n574o287o790p306q104q686q481p870p613
$$ 413432 405819 398766 392365 386790 381617 376043 369756 362966 355660 347556 338870 330389 322519 314906
53198C14906p628p192o160n111m362l623k691j816j363j545k362l382l807l324
$$ 314906 307278 300086 293926 288815 284453 280830 278139 276323 274960 273415 271053 267671 263864 260540
53184B60540k646k475k422j712o55l33r38j565j679j680j774j432l80O98J028
$$ 260540 257894 255419 252997 251285 250630 250297 249359 247794 246115 244435 242661 241229 240849 241547 242575
53169B42575O00k30j246k131k343j787j052n77j82L09N81L78m6l97p17r56p87
$$ 242575 243175 242945 241699 239568 237225 235438 234386 233809 233627 233936 234517 234895 234849 234452 233735 232779 231992
53152B31992k61K1j97m62n45r24j778k315j888j064o98n41J53J105J266M51l38
$$ 231992 231731 231752 231555 231093 230548 229624 227846 225531 223643 222579 221881 221340 221493 222598 223864 224315 223977
53135B23977l05K71P21P91N28l3p30j223j250q29j66M27O83O28N59N60L43k14
$$ 223977 223672 223943 224664 225455 225983 225950 225220 223997 222747 221918 221752 222179 222862 223490 224049 224609 224952 224738
53117B24738p16q24p54q55j056j208j461j843j886j333p89r00j293j192p50q04
$$ 224738 224022 223198 222444 221589 220533 219325 217864 216021 214135 212802 212013 211113 209820 208628 207878 207074
53101B07074j456j885j614j030n61k72l34r94j800j804r11j49k02m65q7P16J122
$$ 207074 205618 203733 202119 201089 200528 200256 199922 198928 197128 195324 194413 194264 194062 193597 193510 194226 195348
53084A95348R33O43N85O08N47N28Q14J506K298K529J789N76j04J38P09R07O05
$$ 195348 196281 196924 197509 198117 198664 199192 200006 201512 203810 206339 208128 208704 208600 208738 209447 210354 210959
53067B10959n2r30j547j199M7J043R22K14NM08O83M90K01Q9Q0K08N76P42J8j465
$$ 210959 210907 209977 208430 207231 207278 208321 209243 209457 209462 209870 210553 211043 211244 211333 211413 211621 212197 212939 212957 211492
53047B11492k602k581j729q62l24l1j2l49q46j112r70n56j34O1l4k08j98j14l31
$$ 211492 208890 206309 204580 203718 203394 203363 203351 203002 202156 201044 200074 199518 199384 199445 199411 199203 199005 198891 198560
53028A98560q70j196r19l06J56M38P68R99P57J34k01K27J149J832J674N57j042
$$ 198560 197690 196494 195575 195269 195425 195863 196631 197630 198387 198521 198320 198547 199696 201528 203202 203759 202717
53011B02717k233k339j546p09m56o75r19r36o65q9O05R49O53Nl97k71J84N76N98
$$ 202717 200484 198145 196599 195890 195434 194759 193840 192904 192239 192150 192755 193704 194357 194362 193965 193694 193878 194454 195052
52992A95052K47n9K52J202K041K041J307N11K0k25k10J76O78P51K99k08l68j78
$$ 195052 195299 195240 195492 196694 198735 200776 202083 202594 202614 202389 202179 202355 203033 203784 204083 203875 203507 203329
52974B03329L68J355K392K626J799P95O13J154J577J589J646J954K054J544P10
$$ 203329 203697 205052 207444 210070 211869 212664 213277 214431 216008 217597 219243 221197 223251 224795 225505
52959B25505R3k58p05j366j883j921j693j744k294k959l252l107k755k258j581
$$ 225505 225598 225340 224635 223269 221386 219465 217772 216028 213734 210775 207523 204416 201661 199403 197822
52944A97822q96m30m7M70P57K14q77j382q10j7J74J78O57J053L72r89j566j028
$$ 197822 196926 196496 196449 196919 197676 197890 197013 195631 194821 194804 194978 195156 195813 196866 197238 196249 194683 193655
52926A93655o05r79j079J80K021K772K108J191Q45P21L72R2K59M48n1j174k016
$$ 193655 193050 192071 190992 191172 193193 195965 198073 199264 200109 200830 201202 201294 201553 202001 201950 200776 198760
52909A98760j903j141n59n26o70n14j59j11n07q14m70L84J021R54M31L6J2J21
$$ 198760 196857 195716 195157 194631 193961 193447 193288 193177 192670 191856 191386 191770 192791 193745 194176 194212 194224 194345
52891A94345J05J7K0J01J55L06P15J107Q67j29j118j293q23n26o38n22J99Q38
$$ 194345 194450 194467 194487 194588 194743 195049 195764 196871 197738 197609 196491 195198 194375 193849 193211 192689 192888 193726
52873A93726N55m18r71n14M14J031J245J426J696J850J846J844J750J155q5j454
$$ 193726 194281 193863 192892 192378 192792 193823 195068 196494 198190 200040 201886 203730 205480 206635 206550 205096
52857B05096k202k094j517j039j031j548k353k996l143k775k055j117j97K53K
$$ 205096 202894 200800 199283 198244 197213 195665 193312 190316 187173 184398 182343 181226 181029 181282 181284
52842A81284m92m86Q1M88K18l74o26m26j47J1K11N87R93J109P06j43r62j155n96
$$ 181284 180792 180306 180387 180875 181093 180719 180093 179667 179520 179531 179742 180329 181322 182431 183137 182994 182032 180877 180281
52823A80281K24O95O14J26n15r57q42k52K61L53L56P36J367J783J990K397L033
$$ 180281 180505 181200 181814 181940 181425 180468 179626 179374 179635 179988 180344 181080 182447 184230 186220 188617 191650
52806A91650L259K475P97j055k393l003l132l060k712j909r34m22m65m04J74O91
$$ 191650 194909 197384 198181 197126 194733 191730 188598 185538 182826 180917 179983 179561 179096 178692 178866 179557
52790A79557M47k21m19o1J34j14k32K39J039J744K209K240J504J91q48r88n64
$$ 179557 180004 179783 179364 179303 179437 179323 179091 179330 180369 182113 184322 186562 188066 188257 187409 186421 185857
52773A85857l51o41j081j180p54j49k8o76j449j438o51MK4j09R4L72L26J65J96
$$ 185857 185506 184865 183784 182604 181850 181701 181673 180997 179548 178110 177459 177463 177487 177378 177472 177844 178170 178335 178531
52754A78531K03n9j65L63J102J175N62J38L76P90Q21N98M95M71L41L21P88J572
$$ 178531 178734 178675 178510 178873 179975 181150 181712 181850 182226 183016 183837 184435 184930 185401 185742 186063 186851 188423
52736A88423K004J791J456J651K286K659K355J639Q87O3r71j974k547k624k287
$$ 188423 190427 192218 193674 195325 197611 200270 202625 204264 205151 205214 204243 202269 199722 197098 194811
52721A94811j381J62J665K090J222o1q54j090j139j145j098j097j154j021n89
$$ 194811 193430 193592 195257 197347 198569 198508 197654 196564 195425 194280 193182 192085 190931 189910 189321
52706A89321j78j16k69k73o3J40J66K2j25K5O06J223J245O31R2J78O54R91J029
$$ 189321 189143 189027 188758 188485 188422 188562 188728 188750 188625 188650 189256 190479 191724 192355 192447 192625 193279 194270 195299
52687A95299Q51N07J91L11Q87J288J064N96M28L76p5p66j015o21p4J41l6m45q40
$$ 195299 196150 196657 196848 197159 198046 199334 200398 200994 201422 201798 201723 200957 199942 199321 199247 199388 199352 198907 198067
52668A98067r46q04q52j191j070K29K193L506L602L057K568K254K005J683Q65
$$ 198067 197121 196317 195465 194274 193204 193433 195626 199132 202734 205791 208359 210613 212618 214301 215166
52653B15166q23k832l927l669k966k745k729k111r13K3J52k40n48l99K27J077
$$ 215166 214343 211511 207584 203915 200949 198204 195475 193364 192451 192474 192626 192386 191838 191439 191666 192743
52637A92743J723J882J678J445J332J179Q05L19J00M31J165J835K197K384K376
$$ 192743 194466 196348 198026 199471 200803 201982 202787 203106 203206 203637 204802 206637 208834 211218 213594
52622B13594J690O1j771k593k150j395j248j552j547r30o2N38O60N16O05J207
$$ 213594 215284 215345 213574 210981 208831 207436 206188 204636 203089 202159 202097 202635 203295 203811 204416 205623
52606B05623J905J934J116J37l04k18MK06M74Q12J169J477J515R86K9p10q46o91
$$ 205623 207528 209462 210578 210715 210411 210193 210197 210403 210877 211689 212858 214335 215850 216836 216865 216155 215309 214618
52588B14618o70o89n46m35m92k35P32J722J597M12m79j75P25J194J166J168J136
$$ 214618 213948 213259 212713 212278 211786 211551 212283 214005 215602 216014 215535 215360 216085 217279 218445 219613 220749
52571B20749M89p65j765j842j330j035j192j363j154p28m32k77MM01N29J78k28
$$ 220749 221238 220473 218708 216866 215536 214501 213309 211946 210792 210064 209632 209355 209359 209760 210289 210467 210239
52554B10239j25M07O98L77j78m76n24n19k26O71J671J631J75j568k126j327k49
$$ 210239 210114 210521 211219 211596 211418 210942 210418 209899 209673 210344 212015 213646 213821 212253 210127 208800 208551
52537B08551K14J46k2j66k44LO31J137R90K80n52j361k111k348j617l82K07k41
$$ 208551 208765 208911 208889 208723 208479 208482 209113 210250 211240 211520 210968 209607 207496 205148 203531 203149 203356 203115
52519B03115q27n96K25P66Q04R26J549K366K870K930K763K609K588K634K463J815
$$ 203115 202288 201692 201917 202683 203487 204413 205962 208328 211198 214128 216891 219500 222088 224722 227185 229000
52503B29000Q57J62M0M6n93j931k997k846j810j178j500j810j077Q3J25j105j900
$$ 229000 229857 230019 230059 230105 229512 227581 224584 221738 219928 218750 217250 215440 214363 214446 214571 213466 211566
52486B11566j021N69J133N26M9L13N64K47P2R06K374L230K764J346j06p95m34
$$ 211566 210545 211114 212247 212773 212822 213135 213699 213946 214018 214924 217298 220528 223292 224638 224532 223737 223303
52469B23303N56J349J491J260J131J182J237J276J321J260J132J260J673J700
$$ 223303 223859 225208 226699 227959 229090 230272 231509 232785 234106 235366 236498 237758 239431 241131
52455B41131P17p86j631j357p18o52j305k188k729k562j751r58q90j397j582j045
$$ 241131 241848 241062 239431 238074 237356 236704 235399 233211 230482 227920 226169 225211 224321 222924 221342 220297
52439B20297l98k82m58l75j31j21j98Q6N82O92M10M05J007J691J885J751J847
$$ 220297 219899 219617 219159 218784 218653 218532 218334 218420 219002 219694 220104 220509 221516 223207 225092 226843 228690
52422B28690K313K730K573J764R35J010K252L802M681N107O225Q449J0742J1758
$$ 228690 231003 233733 236306 238070 239005 240015 242267 246069 250750 255857 262082 270531 281273 293031
52408B93031J1004Q627M798l3m709q003r571r868r297p945o004l984k416j619
$$ 293031 304035 312662 317460 317427 312718 304715 295144 285276 275979 268034 262030 258046 255630 254011
52394B54011j580j865j785j008O2P87J008J060J269J724K291K610K311J535R88
$$ 254011 252431 250566 248781 247773 247835 248622 249630 250690 251959 253683 255974 258584 260895 262430 263418
52379B63418J141J684K136K516K943L086K752K665L662N321O352O368O244O518
$$ 263418 264559 266243 268379 270895 273838 276924 279676 282341 286003 291324 297676 304044 310288 316806
52365C16806O495N450L785K346J278L29k37J08J217K326K951L235L476L864M641
$$ 316806 323301 328751 332536 334882 336160 336489 336252 336360 337577 339903 342854 346089 349565 353429 358070
52350C58070N976P565Q780R351R632J0097J0822J1619J2438J3431J4653J5834
$$ 358070 364046 371611 380391 389742 399374 409471 420293 431912 444350 457781 472434 488268
52338D88268J6607J6943J7292J8103J9274K0264K0716K0746K0594K0350K0076
$$ 488268 504875 521818 539110 557213 576487 596751 617467 638213 658807 679157 699233
52327F99233J9855J9528J8740J7491J6293J5468J4619J3194J1318R526P800N499
$$ 699233 719088 738616 757356 774847 791140 806608 821227 834421 845739 855265 863065 868564
52315H68564K370q24l020l929m195m704n883p534r017r640r170q018o877o061
$$ 868564 870934 870110 867090 863161 858966 854262 848379 840845 831828 822188 813018 805000 798123 792062
52301G92062n330m310k918j270N95K563M104M613M283M216N238O796P598P313
$$ 792062 786732 782422 779504 778234 778829 781392 785496 790109 794392 798608 803846 810642 818240 825553
52287H25553P071Q135J0464J2928J4601J5479J6006J6304J6053J5052J3620J2290
$$ 825553 832624 840759 851223 864151 878752 894231 910237 926541 942594 957646 971266 983556
52275I83556J1191R997Q508O961N513L797J380j549m366o648q237q961q976r136
$$ 983556 994747 1004744 1013252 1020213 1025726 1029523 1030903 1029354 1024988 1018340 1010103 1001142 992166 983030
52261I83030j0191j1672j2326j1785j0900j0363r951r446r145q983q145o410m957
$$ 983030 972839 961167 948841 937056 926156 915793 905842 896396 887251 878268 870123 863713 858756
52248H58756m824n359n237m422l887l844l620l084k748k469j378N47K131K611
$$ 858756 853932 848573 843336 838914 835027 831183 827563 824479 821731 819262 817884 818431 820562 823173
52234H23173K579K763L025L089L303L827L983L331K696L129M323N083N026M837
$$ 823173 825752 828515 831540 834629 837932 841759 845742 849073 851769 854898 859221 864304 869330 874167
52220H74167M996N282N543N976O507O720O659O921P550P623O471M773L781L762
$$ 874167 879163 884445 889988 895964 902471 909191 915850 922771 930321 937944 944415 949188 952969 956731
52206I56731L862L281K066P92pm5N78J293J485J116O53L09k25j076j711j552p83
$$ 956731 960593 963874 965940 966732 966725 966680 967258 968551 970036 971152 971805 972114 971889 970813 969102 967550 966767
52189I66767r8K50N67R74J040L69q45k053k883l330l610m009m612n101n071m580
$$ 966767 966669 966919 967486 968460 969500 969869 969024 966971 964088 960758 957148 953139 948527 943426 938355 933775
52173I33775m021l437k489j281n66o21n42O26K432L554L595L453L934M834N588
$$ 933775 929754 926317 923828 922547 921981 921360 920818 921444 923876 927430 931025 934478 938412 943246 948834
52158I48834O062O320O269N974N790N825N682N160M758N002N694O413P384R139
$$ 948834 954896 961216 967485 973459 979249 985074 990756 995916 1000674 1005676 1011370 1017783 1025167 1034306
52144A034306J1428J3202J3799J3607J3351J3244J3083J2818J2581J2376J2057
$$ 1034306 1045734 1058936 1072735 1086342 1099693 1112937 1126020 1138838 1151419 1163795 1175852
52133A175852J1687J1629J2216J3338J4436J4909J4604J3913J3374J3124J2821
$$ 1175852 1187539 1199168 1211384 1224722 1239158 1254067 1268671 1282584 1295958 1309082 1321903
52122A321903J2165J1354J0857J0701J0212Q686O184L373O42k136m913p119q424
$$ 1321903 1334068 1345422 1356279 1366980 1377192 1385878 1392062 1395435 1396077 1393941 1389028 1381909 1373485
52109A373485r454j1070j3090j4387j4266j3186j1936j0709r228p278m723j487
$$ 1373485 1364031 1352961 1339871 1325484 1311218 1298032 1286096 1275387 1266159 1258881 1254158 1252671
52097A252671K074N055O833P789Q786J0104J1244J1710J1511J0991J0547J0498
$$ 1252671 1254745 1259800 1266633 1274422 1283208 1293312 1304556 1316266 1327777 1338768 1349315 1359813
52085A359813J0832J1129J1099J1165J2053J3767J5357J5860J5135J3586J1538
$$ 1359813 1370645 1381774 1392873 1404038 1416091 1429858 1445215 1461075 1476210 1489796 1501334
52074A501334R214P032N420M279K914O70k428n650q199r896j1309j3146j5516
$$ 1501334 1510548 1517580 1523000 1527279 1530193 1530863 1528435 1522785 1514586 1504690 1493381 1480235 1464719
52061A464719j7884j9742k1131k2411k3653k4521k4720k4317k3539k2407k0869
$$ 1464719 1446835 1427093 1405962 1383551 1359898 1335377 1310657 1286340 1262801 1240394 1219525
52050A219525j9212j8072j7835j8164j8310j7871j7020j6053j4981j3594j1749
$$ 1219525 1200313 1182241 1164406 1146242 1127932 1110061 1093041 1076988 1062007 1048413 1036664
52039A036664r435o853m459k696j534n16O05J559K082K369K630K571J758K76j425
$$ 1036664 1027229 1020376 1015917 1013221 1011687 1011171 1011776 1013335 1015417 1017786 1020416 1022987 1024745 1025021 1023596
52024A023596l205n162o989q109q505q835r444r912r888r820j0362j1446j2542
$$ 1023596 1020391 1015229 1008240 1000131 991626 982791 973347 963435 953547 943727 933365 921919 909377
52011I09377j3562j4914j6715j8411j9319j9219j8429j7534j6977j6674j6140
$$ 909377 895815 880901 864186 845775 826456 807237 788808 771274 754297 737623 721483
52000G21483j5220j4479j4445j4682j4259j3086j2020j1453j0547q498n953m411
$$ 721483 706263 691784 677339 662657 648398 635312 623292 611839 601292 592794 586841 582430
51988E82430m390m928m925m365l950m066m549n149n885o916q256r595j0380j0297
$$ 582430 578040 573112 568187 563822 559872 555806 551257 546108 540223 533307 525051 515456 505076 494779
51974D94779r647r041q609p911o749n624m919m077k258L49K620L949M856N848
$$ 494779 485132 476091 467482 459571 452822 447198 442279 438202 435944 436293 438913 442862 447718 453566
51960D53566O462N998M741L705L367L255K661J256r04l382n342o097n794n144
$$ 453566 460028 466026 470767 474472 477839 481094 483755 485011 484107 480725 475383 469286 463492 458348
51946D58348m423l249j405O98K638M489O365P981R081R888J0626J0983J0525R334
$$ 458348 453925 450676 449271 449969 452607 457096 463461 471442 480523 490411 501037 512020 522545 531879
51932E31879P625N102J441k769o307q642j0241j1515j2226j2230j2045j2104j2040
$$ 531879 539504 544606 546047 543278 536971 528329 518088 506573 494347 482117 470072 457968 445928
51919D45928j1275j0016r038q666q516q130p367o254m918l716k971k538j934j006
$$ 445928 434653 424637 415599 406933 398417 390287 382920 376666 371748 368032 365061 362523 360589 359583
51905C59583n5P34J652L005M653O224P569Q694R452R583Q987P685N607K773l33
$$ 359583 359528 360262 361914 364919 369572 375796 383365 392059 401511 411094 420081 427766 433373 436146 435813
51890D35813k821m021l879k682o28K152N254Q054J0217J2122J4519J7607K0307
$$ 435813 432992 428971 425092 422410 421782 423934 429188 437242 447459 459581 474100 491707 512014
51877E12014K0673J7329J0755L071l608q457j1614j3033j2393j0111p694o522
$$ 512014 532687 550016 560771 563842 560234 551777 540163 527130 514737 504626 496932 490410
51865D90410o659p306q108r323j0783j1575j1062r640q006o168l697q13J545K727
$$ 490410 483751 476445 468337 459014 448231 436656 425594 415954 407948 401780 398083 397270 398815 401542
51851D01542L003K950K651J762K01j557k868l455l540l532l689m070m584m927
$$ 401542 404545 407495 410146 411908 412109 410552 407684 404229 400689 397157 393468 389398 384814 379887
51837C79887m570l213j364j17km45n87m25n32r06q57j42M62J41r12j874k350k534
$$ 379887 375317 372104 370740 370623 370621 370176 369589 369164 368632 367726 366869 366727 367189 367330 366418 364544 362194 359660
51819C59660k591k470k226k006j648q07M41J599K518L666N289O685O810N402L079
$$ 359660 357069 354599 352373 350367 348719 347912 348353 349952 352470 356136 361425 368110 374920 380322 383401
51804C83401M84k102m336n618n742n276m925m739m310l535k736k166j848j910
$$ 383401 383885 381783 377447 371829 366087 360811 355886 351147 346837 343302 340566 338400 336552 334642
51790C34642k508l280l386k336n10J288K436K564J694O40O11J755K567J615m72
$$ 334642 332134 328854 325468 323132 322622 323910 326346 328910 330604 331244 331855 333610 336177 337792 337320
51775C37320j708j272k82J14K04P60J689K574L777N819Q025Q978Q428P675P731
$$ 337320 335612 334340 334058 334172 334376 335136 336825 339399 343176 348995 357020 365998 374426 382101 389832
51760C89832P947O964M399J011k333n248p557r080r756r657q841p515o218n411
$$ 389832 397779 404743 409142 410153 407820 402572 395015 385935 376179 366522 357681 350166 343948 338537
51746C38537m895l996k488q96L57J678L713O311Q598J0063J0942J1408J1019R345
$$ 338537 333642 329646 327158 326262 326619 328297 332010 338321 346919 356982 367924 379332 390351 399696
51732C99696O806M447L122L201M658O844Q287P503M272j79m346p400r029q993
$$ 399696 406502 410949 414071 417272 421930 428774 437061 444564 448836 448657 444311 436911 427882 418889
51718D18889p326m716k324j189j743l569n543o496o082m869l585k494j388J85
$$ 418889 411563 406847 404523 403334 401591 398022 392479 385983 379901 375032 371447 368953 367565 367750
51704C67750K610N527P368O383K648j521l729l614k418j038O27K754M908O242
$$ 367750 370360 375887 383255 389638 392286 390765 387036 383422 381004 379966 380593 383347 388255 394497
51690C94497N887L308r95n288p813q302p744o927n893m721l764k945j679J52J936
$$ 394497 400384 403692 402697 397409 389596 381294 373550 366623 360730 356009 352245 349300 347621 347773 349709
51675C49709L276M523N973P400Q833J0875J3507J5302J4809J2242Q908N318J029
$$ 349709 352985 357508 363481 370881 379714 390589 404096 419398 434207 446449 455357 460675 461704
51662D61704l845q056j0428j0777r376o361k289J271K522Q69k564n813p419p288
$$ 461704 457859 449803 439375 428598 419222 412861 410572 411843 414365 415234 412670 406857 399438 392150
51648C92150o475o016n923n496m500l579l350l608l780l814m079m613m937m693
$$ 392150 385675 379659 373736 368240 363740 360161 356811 353203 349423 345609 341530 336917 331980 327287
51634C27287m042l340k720k080j283l03O20R18J50j354k593k847k258j289m8J460
$$ 327287 323245 319905 317185 315105 313822 313519 314139 315057 315207 313853 311260 308413 306155 304866 304818 306278
51618C06278K755L239L125L275L976M442L889K525J099n2r58j444j272p23k84
$$ 306278 309033 312272 315397 318672 322648 327090 330979 333504 334603 334551 333593 332149 330877 330154 329870
51603C29870J92J394L561O061Q105R311R421Q093N258J413k673o182q206q106
$$ 329870 330062 331456 335017 341078 349183 358494 367915 376008 381266 382679 380006 373824 365618 357512
51589C57512o296m085k392j038L61J520K072K512L659N491P361R259J1930J5555
$$ 357512 351216 347131 344739 343701 344062 345582 347654 350166 353825 359316 366677 375936 387866 403421
51575D03421J9098K1210K1358J9956J8014J6807J7080J8043J7618J4301Q778L547
$$ 403421 422519 443729 465087 485043 503057 519864 536944 554987 572605 586906 595684 599231
51563E99231J237L224R097J6916K4464L0906L6917M2638M6010M4160L6496K5554
$$ 599231 600468 603692 612789 629705 654169 685075 721992 764630 810640 854800 891296 916850
51551I16850J4620N215k853j0040j6534k2680k8788l4363l8171l9424l8612l6883
$$ 916850 931470 936685 933832 923792 907258 884578 855790 821427 783256 743832 705220 668337
51539F68337l4936l2745l0239k7792k5883k4382k2417j9223j5147j1588r730r392
$$ 668337 633401 600656 570417 542625 516742 492360 469943 450720 435573 423985 414255 404863
51527D04863r275q315o572m811l582k905k632k764l275l826l891l215k101j120
$$ 404863 395588 387273 380701 375890 372308 369403 366771 364007 360732 356906 353015 349800 347699 346579
51513C46579n37j89Q5Q3m64j387k113k219j795j290j116j376j720j567o95L52
$$ 346579 346042 345853 345938 346021 345557 344170 342057 339838 338043 336753 335637 334261 332541 330974 330279 330631
51497C30631P99N33J80K24M77M73N1o76j575k344k524j975j158o38m68l44j43
$$ 330631 331430 331963 332143 332367 332844 333317 333368 332692 331117 328773 326249 324274 323116 322478 322010 321666 321523
51480C21523NO9J81M79J094K042K977L242K554J336N5j327k918m270m849m815
$$ 321523 321528 321597 321778 322257 323351 325393 328370 331612 334166 335502 335557 334230 331312 327042 322193 317378
51464C17378m612m088k796j098J5K68M46J157J997K279J884J003k36j462j905
$$ 317378 312766 308678 305882 304784 304799 305067 305513 306670 308667 310946 312830 313833 313597 312135 310230
51449C10230j129M25K064L671N591Q075J1103J4315J6650J6597J3467Q327L244
$$ 310230 309101 309526 311590 315261 320852 328927 340030 354345 370995 387592 401059 409386 412630
51436D12630k75j835j617l5K075L414K733m24n187r569j1719j1332r623p793o025
$$ 412630 412355 410520 408903 408868 410943 414357 417090 416666 411479 401910 390191 378859 369236 361443 355418
51421C55418m080k225r42k37J83L48J70j73m77q63j381j647j418j199j568k208
$$ 355418 351338 349113 348171 347934 348117 348465 348635 348462 347985 347122 345741 344094 342676 341477 339909 337701
51405C37701k307j741j085n97O7J056J998K535K669K544K413K790L986N503O505
$$ 337701 335394 333653 332568 331971 332038 333094 335092 337627 340296 342840 345253 348043 352029 357532 364037
51390C64037O953P590Q849J0449J2203J4436J7404K0888K4668K8883L3673L9027
$$ 364037 370990 378580 387429 397878 410081 424517 441921 462809 487477 516360 550033 589060
51378E89060M5061N1562N6980N8760N5563M8780M1188L4325K7656J9927J0669
$$ 589060 634121 685683 742663 801423 856986 905766 946954 981279 1008935 1028862 1039531
51367A039531L46j0278k0629l0296l8779m5489n0087n2757n3803n3109n0415m6093
$$ 1039531 1039877 1029599 1008970 978674 939895 894406 844319 791562 737759 684650 634235 588142
51355E88142m1155l6349l1688k7054k2725j9036j5908j3126j0731q867p468o383
$$ 588142 546987 510638 478950 451896 429171 410135 394227 381101 370370 361503 354035 347652
51343C47652n535m793l950l095k664k859l278l348k907k111j161l35K5j11l28
$$ 347652 342117 337324 333374 330279 327615 324756 321478 318130 315223 313112 311951 311616 311641 311530 311202
51328C11202k88q5M3M8j21o12j255j460r28j16L37L74L09J97j58q29j671k439
$$ 311202 310914 310829 310872 310920 310799 310187 308932 307472 306544 306428 306765 307139 307448 307645 307487 306658 304987 302548
51310C02548k729k233j259o29o61p96n42j93n7L57J510K670K644J435K25k93n77
$$ 302548 299819 297586 296327 295698 295037 294241 293699 293506 293449 293806 295316 297986 300630 302065 302290 301997 301420
51293C01420j140j756k000j863j442o46M87J601K451L131L663L853L727L675L916
$$ 301420 300280 298524 296524 294661 293219 292573 293060 294661 297112 300243 303906 307759 311486 315161 319077
51278C19077M178M090L577K705J564M46k23l74l55m24m90m81n19n63l64m5k55
$$ 319077 323255 327345 330922 333627 335191 335637 335414 335040 334685 334261 333771 333290 332771 332208 331844 331799 331544
51261C31544j385k935l955l947l147k198j704j812k116k173k115k346k701k500
$$ 331544 330159 327224 323269 319322 316175 313977 312273 310461 308345 306172 304057 301711 299010 296510
51247B96510j616p65m44k47K38N54Q2q13j111m09P06J470J516Q58j56q96r35m92
$$ 296510 294894 294129 293685 293438 293676 294230 294312 293499 292388 291979 292685 294155 295671 296529 296373 295477 294542 294050
51229B94050p0K28O07J073J445J747K126K467K599K713L037L229K745J694P82
$$ 294050 293980 294208 294815 295888 297333 299080 301206 303673 306272 308985 312022 315251 317996 319690 320472
51214C20472L84L07M52R48J486J297J66j128j759j742j560j402j193r34n50J58
$$ 320472 320856 321163 321615 322563 324049 325346 325512 324384 322625 320883 319323 317921 316728 315794 315244 315402
51198C15402J010J245L77j002j786j543p66j11J63J53J28L89R19J281J158Q58
$$ 315402 316412 317657 318034 317032 315246 313703 312937 312826 312989 313142 313270 313659 314578 315859 317017 317875
51182C17875R39J471K058K432K574K397J768R18K85n4m67j190k023k624k759k279
$$ 317875 318814 320285 322343 324775 327349 329746 331514 332432 332717 332663 332196 331006 328983 326359 323600 321321
51166C21321j206J07J248K186L008L326K576R49o18j592k312k989l096k296j387
$$ 321321 320115 320222 321470 323656 326664 329990 332566 333515 332897 331305 328993 326004 322908 320612 319225
51151C19225j375j980j943q12M73R35P41O77J037J501J760J760J480R14K45k46
$$ 319225 317850 315870 313927 313115 313588 314523 315264 315941 316978 318479 320239 321999 323479 324393 324638 324392
51135C24392n85j084j860k477k369j551o33p2L87J238K397L234L455L488L778
$$ 324392 323807 322723 320863 318386 316017 314466 313833 313761 314148 315386 317783 321017 324472 327960 331738
51120C31738M132M090L663L230K811J997O30q09j687j812j463j026o63k48M72
$$ 331738 335870 339960 343623 346853 349664 351661 352291 351482 349795 347983 346520 345494 344831 344583 345055
51105C45055J482K319K525K208J891J807J689J352J053J075J237J175Q82O92Q62
$$ 345055 346537 348856 351381 353589 355480 357287 358976 360328 361381 362456 363693 364868 365750 366442 367304
51090C67304J445K438L665M564M521L589K524J842J183l2j503k270k046j726k121
$$ 367304 368749 371187 374852 379416 383937 387526 390050 391892 393075 393043 391540 389270 387224 385498 383377
51075C83377k677k165m37J308K123K380K878L612M067M286M848O033P715R946
$$ 383377 380700 378535 378098 379406 381529 383909 386787 390399 394466 398752 403600 409633 417348 427294
51061D27294J2737J5077J5095J1828O518J798k51Q84M436Q998J2980J5134J5156
$$ 427294 440031 455108 470203 482031 488549 490347 490096 490980 495416 504414 517394 532528 547684
51048E47684J3862J2580J2081J1847J0494P161K534j575l629l329j645l88j433
$$ 547684 561546 574126 586207 598054 608548 615709 618243 616668 613039 609710 608065 607677 606244
51035F06244n496j1423j7106k1246k3741k4599k3438k0418j6693j3291j0072o578
$$ 606244 600748 589325 572219 550973 527232 502633 479195 458777 442084 428793 418721 412143
51023D12143l274j130k52J95P97J464K095K873L798M538M976N356N816O229O575
$$ 412143 408869 407739 407487 407682 408479 409943 412038 414911 418709 423247 428223 433579 439395 445624 452199
51008D52199O954P261P338P505Q180Q919Q710P619P245Q833J1589J3790J5063
$$ 452199 459153 466414 473752 481257 489437 498356 507066 514685 521930 530763 542352 556142 571205
50995E71205J6448J8319J9547J9285J8502J8859K0415K1533K0967J9158J7065
$$ 571205 587653 605972 625519 644804 663306 682165 702580 724113 745080 764238 781303
50984G81303J4617J1017O308J721j527l114l211j948L12K865N401Q544J3019J8550
$$ 781303 795920 806937 813245 814966 813439 810325 807114 805166 805478 808343 813744 822288 835307 853857
50970H53857K4175K9377L4289L8983M3346M7657N2437N7426O1464O3841O5134
$$ 853857 878032 907409 941698 980681 1024027 1071684 1124121 1181547 1243011 1306852 1371986
50959A371986O6251O7107O6751O4500O0329N4537M7603M0313L3524K7682K2783
$$ 1371986 1438237 1505344 1572095 1636595 1696924 1751461 1799064 1839377 1872901 1900583 1923366
50948A923366J8714J5413J2849J1058R941Q630N456p05q884j6351k0623k1144
$$ 1923366 1942080 1957493 1970342 1981400 1991341 1999971 2005427 2004722 1995838 1979487 1958864 1937720
50936A937720j9196j6752j5411j5780j7443j9685k2353k5854l0344l5297m0071
$$ 1937720 1918524 1901772 1886361 1870581 1853138 1833453 1811100 1785246 1754902 1719605 1679534
50925A679534m4504m8754n2794n6245n8504n8988n7515n4659n1350m7962m4180
$$ 1679534 1635030 1586276 1533482 1477237 1418733 1359745 1302230 1247571 1196221 1148259 1104079
50914A104079l9874l5685l2237k9257k6008k2434j9239j6933j5294j3778j2042
$$ 1104079 1064205 1028520 996283 967026 941018 918584 899345 882412 867118 853340 841298
50903H41298j0006p907o253n403n082m760m446m561n026n112m416l400k668k225
$$ 841298 831292 823385 817132 811729 806647 801887 797441 792880 787854 782742 778326 774926 772258 770033
50889G70033j805j403j028l48Q03J995K742L183L683M074M057M063M902O518P901
$$ 770033 768228 766825 765797 765449 766252 768247 770989 774172 777855 781929 785986 790049 794951 801469 809370
50874H09370Q429Q585R123J0109J1158J2168J3403J5052J7109J9436K1784K3966
$$ 809370 817799 826384 835507 845616 856774 868942 882345 897397 914506 933942 955726 979692
50862I79692K6139K8696L1831L5484L9746M4859N0725N6842O2993O9570P7023
$$ 979692 1005831 1034527 1066358 1101842 1141588 1186447 1237172 1294014 1357007 1426577 1503600
50851A503600Q5389R4540J04380J14398J23553J31086J37223J42604J47323J50896
$$ 1503600 1588989 1683529 1787909 1902307 2025860 2156946 2294169 2436773 2584096 2734992
50841B734992J52760J52128J47662J38041J23104J04078Q2714O0498L8633J8150
$$ 2734992 2887752 3039880 3187542 3325583 3448687 3552765 3635479 3695977 3734610 3752760
50831C752760j32j5635k7926l6828m2395m4568m2898l7044k7526j5839l933O275
$$ 3752760 3752628 3736993 3709067 3672239 3629844 3585276 3542378 3505334 3477808 3461969 3458036 3464311
50819C464311J3235J6119J4791R188r29j5113l1575m8224o4304q0269r6001j10153
$$ 3464311 3477546 3493665 3508456 3517644 3516715 3501602 3470027 3421803 3357499 3277230 3181229 3071076
50807C071076j21433j29728j35300j37592j35697j29688j20763j10098r8152q5175
$$ 3071076 2949643 2819915 2684615 2547023 2411326 2281638 2160875 2050777 1952625 1867450
50797A867450p1800n8847m6698l5208k4157j3656m068M257J1011J5752J8094J8196
$$ 1867450 1795650 1736803 1690105 1654897 1630740 1617084 1613016 1617273 1628284 1644036 1662130 1680326
50785A680326J6868J4845J2115Q283L551j086m644o984q739j0654j2974j5321
$$ 1680326 1697194 1712039 1724154 1732437 1735988 1734902 1730258 1723274 1714535 1703881 1690907 1675586
50773A675586j7209j8839k1209k5127l0208l5240l9356m2466m4595m5457m4848
$$ 1675586 1658377 1639538 1618329 1593202 1562994 1527754 1488398 1445932 1401337 1355880 1311032
50762A311032m3057m0626l8015l5446l2723k9257k4793k0136j6473j3852j1106
$$ 1311032 1267975 1227349 1189334 1153888 1121165 1091908 1067115 1046979 1030506 1016654 1005548
50751A005548p559m062j719k55J599M553Q301J2328J6364K0133K3396K6465L0091
$$ 1005548 997989 993927 992208 991953 993552 998105 1006406 1018734 1035098 1055231 1078627 1105092 1135183
50738A135183L4644L9742M4806M9770N5051O0926O7071P2639P6909P9863Q1979
$$ 1135183 1169827 1209569 1254375 1304145 1359196 1420122 1487193 1559832 1636741 1716604 1798583
50727A798583Q3479Q4107Q3729Q2601Q0694P7195P1264O2988N2929M0943K6241
$$ 1798583 1882062 1966169 2049898 2132499 2213193 2290388 2361652 2424640 2477569 2518512 2544753
50716B544753Q840r589k6503l9815m8403n1939n0725m5642l7957k8990j9771j0784
$$ 2544753 2553593 2544004 2517501 2477686 2429283 2377344 2326619 2280977 2243020 2214030 2194259 2183475
50704B183475k194N611J1778J5560J6799J5451J0979K852q377k1172l4306m7264
$$ 2183475 2181281 2186892 2198670 2214230 2231029 2246480 2257459 2260311 2251934 2230762 2196456 2149192
50692B149192n9135o8042p2454p2665p0159o5833n9580n1543m2684l3707k4241
$$ 2149192 2090057 2022015 1949561 1876896 1806737 1740904 1681324 1629781 1587097 1553390 1529149
50681A529149j3755k785P562J7190K7116L7848M8412N7572O5338P2397P8245Q0941
$$ 1529149 1515394 1512609 1520171 1537361 1564477 1602325 1650737 1708309 1773647 1846044 1924289 2005230
50669B005230P9155P3739O6681N9015N0407M0773L1408K4090J9381J6248J3300
$$ 2005230 2084385 2158124 2224805 2283820 2334227 2375000 2406408 2430498 2449879 2466127 2479427
50658B479427J0018O670L368l27m775r608j4085j7842k0897k3051k3774k2795
$$ 2479427 2489445 2496115 2499483 2499156 2494381 2484773 2470688 2452846 2431949 2408898 2385124 2362329
50646B362329k0250j6115j0077k296O042J3473J9389K4142K8229L1671L4025L4778
$$ 2362329 2342079 2325964 2315887 2313591 2319633 2333106 2352495 2376637 2404866 2436537 2470562 2505340
50634B505340L3969L2552L1916L2904L5605L9585M2823M0029K4233p109m7337
$$ 2505340 2539309 2571861 2603777 2636681 2672286 2711871 2754694 2794723 2818956 2811847 2764510
50623B764510q3600j05625j11315j04725r1021p4129n7029m1653k8356j6588o153
$$ 2764510 2680910 2575285 2463970 2359245 2268224 2194095 2137066 2095413 2067057 2050469 2044316
50612B044316K736J0146J6170K0227K1448J9709J5505Q924l14j1762k4014l5837
$$ 2044316 2047052 2057198 2073368 2093595 2115043 2134752 2150257 2159181 2158867 2147105 2123091 2087254
50600B087254m6859n6910o5298p1156p4146p4523p2901p0099o6830o3202n8801
$$ 2087254 2040395 1983485 1918187 1847031 1772885 1698362 1625461 1555362 1488532 1425330 1366529
50589A366529n3453m7635m1985l6712l1766k7180k2964j8965j5093j1533q428
$$ 1366529 1313076 1265441 1223456 1186744 1154978 1127798 1104834 1085869 1070776 1059243 1050815
50578A050815n625k954o10J059J974K349K490K791L686N241P035Q780J0879J3897
$$ 1050815 1045190 1042236 1041626 1042685 1044659 1047008 1049498 1052289 1055975 1061216 1068251 1077031 1087910 1101807
50564A101807J7686K1572K5301K9150L3112L6720M0042M4088M9606N5838O1161
$$ 1101807 1119493 1141065 1166366 1195516 1228628 1265348 1305390 1349478 1399084 1454922 1516083
50553A516083O4781O7092O8321O7631O3979N7486M9609M2096L6183L2531L1347
$$ 1516083 1580864 1647956 1716277 1783908 1847887 1905373 1954982 1997078 2033261 2065792 2097139
50542B097139L2349L4926L8536M2872M7530N1802N5129N7715O0386O3787O7870
$$ 2097139 2129488 2164414 2202950 2245822 2293352 2345154 2400283 2457998 2518384 2582171 2650041
50531B650041P2355P7360Q3340R0424R8058J05259J11057J14731J15884J14410
$$ 2650041 2722396 2799756 2883096 2973520 3071578 3176837 3287894 3402625 3518509 3632919
50521C632919J10245J03153R2939P9832O4334M6625K6478M058j9497m2678o4547
$$ 3632919 3743164 3846317 3939256 4019088 4083422 4130047 4156525 4160583 4141086 4098408 4033861
50510D033861q4780j02945j18252j29958j37515j40210j37258j28638j15535r9596
$$ 4033861 3949081 3846136 3727884 3597926 3460411 3320201 3182943 3054305 2938770 2839174
50500B839174q1850o2488m1595j9834J535K1132L8035N1893O2335O8303O8210
$$ 2839174 2757324 2694836 2653241 2633407 2634942 2656074 2694109 2746002 2808337 2876640 2944850
50489B944850O0921M6324K5111j385l0747n9564q4748j04735j19128j27650j30335
$$ 2944850 3005771 3052095 3077206 3075821 3045074 2985510 2900762 2796027 2676899 2549249 2418914
50478B418914j28451j24161j18852j12530j05055r7157q9691q2674p5792o9370
$$ 2418914 2290463 2166302 2047450 1934920 1829865 1732708 1643017 1560343 1484551 1415181
50468A415181o3946n9186n4156m8604m3134l8071l2995k7733k2952j9249j6211
$$ 1415181 1351235 1292049 1237893 1189289 1146155 1108084 1075089 1047356 1024404 1005155 988944
50457I88944j3010r596o723m972m243m031l678k524m41J745K945L094L209L955
$$ 988944 975934 966338 959615 954643 950400 946369 942691 940167 939726 941471 944416 947510 950719 954674
50443I54674M743M635L722L023L298M536O492R052J1925J4582J6898J9420K2634
$$ 954674 959417 964052 967774 970797 974095 978631 985123 994175 1006100 1020682 1037580 1057000 1079634
50430A079634K6120K8851L0212L0307K9447K7871K6129K5211K5829K7757L0239
$$ 1079634 1105754 1134605 1164817 1195124 1224571 1252442 1278571 1303782 1329611 1357368 1387607
50419A387607L2938L6193M0368M5405N0984N6758O2208O6610O9547P1302P2530
$$ 1387607 1420545 1456738 1497106 1542511 1593495 1650253 1712461 1779071 1848618 1919920 1992450
50408A992450P3459P3551P1846O7678O1217N3520M5751L8065K9389J8558N529
$$ 1992450 2065909 2139460 2211306 2278984 2340201 2393721 2439472 2477537 2506926 2525484 2531013
50397B531013q808k3801l9335n4921o9105q0194q7414r1016r1470q8923q3446
$$ 2531013 2522205 2498404 2459069 2404148 2335043 2254849 2167435 2076419 1984949 1896026 1812580
50386A812580p5526o6102n5995m5365l3961k1951j0264J63R211J7186K3852K8415
$$ 1812580 1737054 1670952 1614957 1569592 1535631 1513680 1503416 1503579 1512790 1529976 1553828 1582243
50374A582243L0401K9778K6179J8838P782n514j9084l1614m2362n0659n6165n9149
$$ 1582243 1612644 1642422 1668601 1687439 1695221 1689707 1670623 1639009 1596647 1545988 1489823 1430674
50362A430674n9954n8608n5492n1837m8773m6244m3579m0742l8144l5583l2441
$$ 1430674 1370720 1312112 1256620 1204783 1156010 1109766 1066187 1025445 987301 951718 919277
50351I19277k8811k5483k2723k0017j7061j4132j1345q510n874m092l163k244
$$ 919277 890466 864983 842260 822243 805182 791050 779705 771195 765321 761229 758066 755822
50339G55822q59N06J325J682J627Q38n55j577j579j106r94j188j139p73l73O8
$$ 755822 754963 755469 756794 758476 760103 760941 760386 758809 757230 756124 755130 753942 752803 752030 751657 751725
50323G51725O96J449K340L654N278O426O731P047Q514J1305J4907J9027K3377
$$ 751725 752421 753870 756210 759864 765142 771568 778299 785346 793860 805165 820072 839099 862476
50310H62476K7159K9755L1398L2096L0384K4598J5328N463k329p169r171q567
$$ 862476 889635 919390 950788 982884 1013268 1037866 1053194 1058657 1056328 1049159 1039988 1031421
50298A031421o119l293j273k79r7o97j960l480m992o544q078r356j0373j1301
$$ 1031421 1025302 1022009 1020736 1020457 1020360 1019663 1017703 1014223 1009231 1002687 994609 985253 974880 963579
50284I63579j1932j1836j1100j0172q836o293k437J926O407J1318J5840J7029
$$ 963579 951647 939811 928711 918539 909703 903410 900973 902899 909306 920624 936464 953493
50272I53493J2218K268q558j6006j8678j7855j5568j3044j0404p245l456M28L664
$$ 953493 965711 967979 959421 943415 924737 906882 891314 878270 867866 860621 857165 857593 861257
50259H61257N893P288Q258R053R405Q641O510L892K121J526J211L08j128k716
$$ 861257 867150 874438 882696 891749 901154 909795 916305 920197 922318 923844 925055 925363 924235 921519
50245I21519m383n938o790o744o539o862p295o977n933m878l971k660o89J599
$$ 921519 917136 911198 904408 897664 891125 884263 876968 869991 864058 859180 855209 852549 851860 853459
50231H53459M018O872J0303J4035J8001K2783K9011L6594M4715N2360N8766O3577
$$ 853459 857477 864349 874652 888687 906688 929471 958482 995076 1039791 1092151 1150917 1214494
50219A214494O6639O7471O5210N9487N1329M2830L5903L1581L0157L1220L3382
$$ 1214494 1281133 1348604 1413814 1473301 1524630 1567460 1603363 1634944 1665101 1696321 1729703
50208A729703L4674L3549K9229K1020Q096r494k9956n0389o8266q1990r0595r3652
$$ 1729703 1764377 1797926 1827155 1848175 1856271 1846777 1816821 1766432 1698166 1616176 1525581 1431929
50196A431929r1665q6008p8157o9073n9344m9554m0216l1548k3756j7625j4514
$$ 1431929 1340264 1254256 1176099 1107026 1047682 998128 957912 926364 902608 884983 870469
50185H70469j5331j9455k4835k9214l1350l1170k9201k6037k2170j7983j3813
$$ 870469 855138 835683 810848 781634 750284 719114 689913 663876 641706 623723 609910
50174F09910j0121p462o129n734n394m386k706r34L97J352K394L673M668M874
$$ 609910 599789 592327 586198 580464 575070 570684 567978 567044 567441 568793 571187 574860 579528 584402
50160E84402M663N019O239P509Q128Q666J0193J2523J4083J3729J2047J0450R380
$$ 584402 589065 594084 600323 607832 615960 624626 634819 647342 661425 675154 687201 697651 707031
50147G07031Q007N647K854Q68J09k49j081j925j364J165M458O908Q347R843J1847
$$ 707031 715038 720685 723539 724407 724516 724267 723186 721261 719897 721062 725520 732428 740775 750618 762465
50132G62465J3436J3629J2654J1364J0035Q507P147O770P568Q826R870J0738J1723
$$ 762465 775901 789530 802184 813548 823583 832090 839237 846007 853575 862401 872271 883009 894732
50119H94732J2895J4427J6819K0317K4361K8289L2318L7299M3586N0832N8934
$$ 894732 907627 922054 938873 959190 983551 1011840 1044158 1081457 1125043 1175875 1234809
50108A234809O8471P9840R2423J04964J16452J26179J33172J36066J33647J25569
$$ 1234809 1303280 1383120 1475543 1580507 1696959 1823138 1956310 2092376 2226023 2351592
50098B351592J12920R8525Q6304P9446P8565Q1563Q5202Q6599Q3468P3733N5784
$$ 2351592 2464512 2563037 2649341 2728787 2807352 2888915 2974117 3060716 3144184 3217917 3273701
50087C273701K9476l178l8436p2206j01315j23990j39718j49070j53461j54372
$$ 3273701 3303177 3299999 3261563 3189357 3088042 2964052 2824334 2675264 2521803 2367431
50077B367431j52414j47331j39044j28423j16741j04731r2511q0155o7943n6315
$$ 2367431 2215017 2067686 1928642 1800219 1683478 1578747 1486236 1406081 1338138 1281823
50067A281823m5962l7721l1916k7869k4580k1696j9337j7232j4790j2014r609
$$ 1281823 1235861 1198140 1166224 1138355 1113775 1092079 1072742 1055510 1040720 1028706 1019097
50056A019097q023o938n844m677l714l321l792m996o194o815p311q527j0224j1221
$$ 1019097 1011074 1004136 998292 993615 989901 986580 982788 977792 971598 964783 957472 948945 938721 927500
50042I27500j1100j0754j0909j1106j0758j0163r714r013p648o163n269m668l686
$$ 927500 916400 905646 894737 883631 872873 862710 852996 843983 836335 830172 824903 820235 816549
50029H16549k568k094k246k338k219k202k020j063K91P67j21j428k135k267k341
$$ 816549 813981 811887 809641 807303 805084 802882 800862 799799 800090 800857 800736 799308 797173 794906 792565
50014G92565k549k919l534m177m359m106m093m626n082m768l689j994N48L906
$$ 792565 790016 787097 783563 779386 775027 770921 766828 762202 757120 752352 748663 746669 747217 751123
50000G51123P239R922J2631J6439K0939K4317K5500K5423K5842K7569L0298L3698
$$ 751123 758362 768284 780915 797354 818293 842610 868110 893533 919375 946944 977242 1010940
49988A010940L7910M3115M9129N5540O1808O7043P0009O9665O5784N8911M9992
$$ 1010940 1048850 1091965 1141094 1196634 1258442 1325485 1395494 1465159 1530943 1589854 1639846
49977A639846M0260L1324K4856K1897K2510K5965L0826L4849L5270K9771J7314
$$ 1639846 1680106 1711430 1736286 1758183 1780693 1806658 1837484 1872333 1907603 1937374 1954688
49966A954688j667k5316n0560p3897r2579j05027j10374j08563j01207r1306q1058
$$ 1954688 1953021 1927705 1877145 1803248 1710669 1605642 1495268 1386705 1285498 1194192 1113134
49955A113134p0476n8931m7396l7787l0467k3931j7253j1432p826o344n981o170
$$ 1113134 1042658 983727 936331 898544 868077 844146 826893 815461 807635 801291 795310 789140
49943G89140o777p366p395o860o185n749o008p617j0839j5024j9096k2234k3820
$$ 789140 782363 774997 767602 760742 754557 748808 742800 735183 724344 709320 690224 667990 644170
49930F44170k3319k0866j7587j4657j2283j0109q137o616n310l810k278j173k97
$$ 644170 620851 599985 582398 567741 555458 545349 537212 530596 525286 521476 519198 518025 517728
49917E17728Q76K047K215J223K50L30J169J927K498L313M372N259N914O721P804
$$ 517728 518604 520651 522866 524089 524339 524669 525838 527765 530263 533576 537948 543207 549121 555842 563646
49902E63646Q870R812J1015J2703J4240J4427J2554R094N325K264Q0j538k663
$$ 563646 572516 582328 593343 606046 620286 634713 647267 656361 661686 663950 664030 662492 659829
49889F59829l095l030l361m917p599j0440j2573j3920j4925j5851j6463j6375
$$ 659829 656734 653704 650343 645426 637827 627387 614814 600894 585969 570118 553655 537280
49877E37280j5515j4140j2501j0633q574o604m988l614k192q17R8N26J089K223
$$ 537280 521765 507625 495124 484491 475917 469313 464325 460711 458519 457702 457800 458326 459415 461638
49863D61638L465M041L983M063M658N369N903O702Q213J0038J1424J2290J3065
$$ 461638 465103 469144 473127 477190 481848 487217 493120 499822 508035 518073 529497 541787 554852
49850E54852J3602J3040J0990Q181N612L543J709J58q07j378k323m138o457q470
$$ 554852 568454 581494 592484 600665 606277 609820 611529 611687 610880 609502 607179 603041 596584 588114
49836E88114r644r922r516q746p931p144o108m561k752j313n54p5P24J873K904
$$ 588114 578470 568548 559032 550286 542355 535211 529103 524542 521790 520477 519923 519848 520572 522445 525349
$$ [...]
##END NTUPLES=NMR SPECTRUM
##END=
