
##TITLE=AC1369_2393_7221595_eSSRFaH6zd
##JCAMPDX= 6.0         $$ Bruker NMR JCAMP-DX V2.0
##DATA TYPE= NMR SPECTRUM
##DATA CLASS= NTUPLES
##ORIGIN= BRUKER
##OWNER= Administrator
$$ 1.72 TOPSPIN		Version 2.1
$$ 2012-12-13 22:21:59.889 -0500  Administrator@X
$$ Compression mode = diff/dup
##.OBSERVE FREQUENCY= 400.02188249412
##.OBSERVE NUCLEUS= ^1H
##.ACQUISITION MODE= SIMULTANEOUS (DQD)
##.ACQUISITION SCHEME= undefined
##.AVERAGES= 8
##.DIGITISER RES= 22
##SPECTROMETER/DATA SYSTEM= spect
##.PULSE SEQUENCE= zg30
##.SOLVENT NAME= COFFEE_meoh
##.SHIFT REFERENCE= INTERNAL, COFFEE_meoh, 1, 14.98509
##AUDIT TRAIL= $$ (NUMBER, WHEN, WHO, WHERE, PROCESS, VERSION, WHAT)
$$ ##TITLE= Audit trail, TOPSPIN		Version 2.1
$$ ##JCAMPDX= 5.01
$$ ##ORIGIN= Bruker BioSpin GmbH
$$ ##OWNER= Administrator
$$ $$ E:\/data/COFFEE/nmr/AC1369_2393_7221595_eSSRFaH6zd/10/pdata/1/auditp.txt
$$ ##AUDIT TRAIL=  $$ (NUMBER, WHEN, WHO, WHERE, PROCESS, VERSION, WHAT)
(   1,<2012-12-13 22:21:51.811 -0500>,<Administrator>,<X>,<go>,<TOPSPIN 2.1>,
      <created by zg
	started at 2012-12-13 22:20:45.014 -0500,
	POWCHK enabled, PULCHK disabled,
       configuration hash MD5:
       86 BA 57 50 F2 9D 5C 9B 26 00 A9 28 5F 66 2E 89
       data hash MD5: 64K
       6B 8F EC 41 9D 39 68 C2 BA 7D 5C FF 31 EC D7 76>)
(   2,<2012-12-13 22:21:54.921 -0500>,<Administrator>,<X>,<proc1d>,<TOPSPIN 2.1>,
      <Start of raw data processing
       efp LB = 0 FT_mod = 6 PKNL = 1 PHC0 = 0 PHC1 = 0 SI = 32K 
       data hash MD5: 32K
       43 6F C9 F8 2D 4E 80 8F 61 A4 A6 74 94 E1 D7 22>)
(   3,<2012-12-13 22:21:55.389 -0500>,<Administrator>,<X>,<proc1d>,<TOPSPIN 2.1>,
      <pk PHC0 = 101.2445 PHC1 = 0 
       data hash MD5: 32K
       CC 42 84 4A 6F 37 02 12 97 B9 2C EF 28 85 63 3E>)
(   4,<2012-12-13 22:21:55.624 -0500>,<Administrator>,<X>,<proc1d>,<TOPSPIN 2.1>,
      <abs ABSG = 1 
       data hash MD5: 32K
       61 B1 20 C8 4E 63 3A A0 5A 90 06 25 4D BF 11 60>)
(   5,<2012-12-13 22:21:55.780 -0500>,<Administrator>,<X>,<proc1d>,<TOPSPIN 2.1>,
      <abs ABSG = 2 
       data hash MD5: 32K
       28 40 DD AC 9C 84 37 88 E6 EE BE AA 5D 1A EF FE>)
(   6,<2012-12-13 22:21:55.905 -0500>,<Administrator>,<X>,<proc1d>,<TOPSPIN 2.1>,
      <abs ABSG = 3 
       data hash MD5: 32K
       4F FD C8 EC 0A E9 30 C1 52 41 3D 5F A3 91 BB 40>)
(   7,<2012-12-13 22:21:56.061 -0500>,<Administrator>,<X>,<proc1d>,<TOPSPIN 2.1>,
      <abs ABSG = 4 
       data hash MD5: 32K
       FC A3 06 98 7D CB 90 A1 81 7A 47 65 E7 2C 24 13>)
(   8,<2012-12-13 22:21:56.202 -0500>,<Administrator>,<X>,<proc1d>,<TOPSPIN 2.1>,
      <abs ABSG = 5 
       data hash MD5: 32K
       5A C3 0A BD F3 73 AD BA 82 1A A2 10 4D 45 11 41>)
$$ ##END=
$$ 
$$ $$ hash MD5
$$ $$ A1 08 49 48 AB 82 50 26 69 BB CA 18 58 CE 32 21
##$RELAX= 
##$RELAX= 
##$RELAX= 
##$RELAX= 
##$RELAX= 
##$RELAX= 
##$RELAX= 
##$RELAX= 
$$ Bruker specific parameters
$$ --------------------------
##$DU= <E:\>
##$EXPNO= 10
##$NAME= <AC1369_2393_7221595_eSSRFaH6zd>
$$ [...]
150 150 150 150 150 150 150 150
##$TP07= 0
##$TPNAME0= <>
##$TPNAME1= <>
##$TPNAME2= <>
##$TPNAME3= <>
##$TPNAME4= <>
##$TPNAME5= <>
##$TPNAME6= <>
##$TPNAME7= <>
##$TPOAL= (0..7)
0.5 0.5 0.5 0.5 0.5 0.5 0.5 0.5
##$TPOFFS= (0..7)
0 0 0 0 0 0 0 0
##$TUNHIN= 0
##$TUNHOUT= 0
##$TUNXOUT= 0
##$USERA1= <user>
##$USERA2= <user>
##$USERA3= <user>
##$USERA4= <user>
##$USERA5= <user>
##$V9= 5
##$VALIST= <valist>
##$VCLIST= <CCCCCCCCCCCCCCC>
##$VD= 0
##$VDLIST= <DDDDDDDDDDDDDDD>
##$VPLIST= <PPPPPPPPPPPPPPP>
##$VTLIST= <TTTTTTTTTTTTTTT>
##$WBST= 1024
##$WBSW= 4
##$XGAIN= (0..3)
0 0 0 0
##$XL= 0
##$YL= 0
##$YMAX_a= 616427
##$YMIN_a= -526723
##$ZGOPTNS= <>
##$ZL1= 120
##$ZL2= 120
##$ZL3= 120
##$ZL4= 120
##$ABSF1= 14.98509
##$ABSF2= -5.573092
##$ABSG= 5
##$ABSL= 3
##$ALPHA= 0
##$AQORDER= 0
##$ASSFAC= 0
##$ASSFACI= 0
##$ASSFACX= 0
##$ASSWID= 0
##$AUNMP= <proc_prof1d_extract_pilot.lims>
##$AXLEFT= 0
##$AXNAME= <>
##$AXNUC= <1H>
##$AXRIGHT= 0
##$AXTYPE= 0
##$AXUNIT= <>
##$AZFE= 0.1
##$AZFW= 0.1
##$BCFW= 0
##$BC_mod= 0
##$BYTORDP= 0
##$COROFFS= 0
##$CY= 15
##$DATMOD= 1
##$DC= 0
##$DFILT= <>
##$DTYPP= 0
##$F1P= 0
##$F2P= 0
##$FCOR= 0.5
##$FTSIZE= 32768
##$FT_mod= 6
##$GAMMA= 0
##$GB= 0
##$INTBC= 1
##$INTSCL= 1
##$ISEN= 128
##$LB= 0
##$LEV0= 0
##$LPBIN= 0
##$MAXI= 10000
##$MC2= 0
##$MEAN= 0
##$ME_mod= 0
##$MI= 0
##$NCOEF= 0
##$NC_proc= -8
##$NLEV= 6
##$NOISF1= 0
##$NOISF2= 0
##$NSP= 0
##$NTH_PI= 0
##$NZP= 0
##$OFFSET= 14.98509
##$PC= 1
##$PHC0= 101.2445
##$PHC1= 0
##$PH_mod= 1
##$PKNL= yes
##$PPARMOD= 0
##$PPDIAG= 0
##$PPIPTYP= 0
##$PPMPNUM= 2147483647
##$PPRESOL= 1
##$PSCAL= 4
##$PSIGN= 0
##$PYNMP= <proc.py>
##$REVERSE= no
##$SF= 400.02
##$SI= 32768
##$SIGF1= 0
##$SIGF2= 0
##$SINO= 400
##$SIOLD= 32768
##$SPECTYP= <>
##$SREGLST= <1H.CDCl3>
##$SSB= 0
##$STSI= 32768
##$STSR= 0
##$SW_p= 8223.68421052631
##$SYMM= 0
##$S_DEV= 0
##$TDeff= 65536
##$TDoff= 0
##$TI= <>
##$TILT= no
##$TM1= 0
##$TM2= 0
##$TOPLEV= 0
##$USERP1= <user>
##$USERP2= <user>
##$USERP3= <user>
##$USERP4= <user>
##$USERP5= <user>
##$WDW= 1
##$XDIM= 32768
##$YMAX_p= 432000630
##$YMIN_p= -741466
##$CURPLOT= <Network HP LaserJet P1505>
##$CURPRIN= <$Network HP LaserJet P1505>
##$DFORMAT= <normdp>
##$LAYOUT= <+/1D_H.xwp>
##$LFORMAT= <normlp>
##$PFORMAT= <normpl>
##$SURQMSG= 1
$$ End of Bruker specific parameters
$$ ---------------------------------
##NTUPLES= NMR SPECTRUM
##VAR_NAME=  FREQUENCY,     SPECTRUM/REAL,   SPECTRUM/IMAG
##SYMBOL=    X,             R,               I
##VAR_TYPE=  INDEPENDENT,   DEPENDENT,       DEPENDENT
##VAR_FORM=  AFFN,          ASDF,            ASDF
##VAR_DIM=   32768,         32768,           32768
##UNITS=     HZ,            ARBITRARY UNITS, ARBITRARY UNITS
##FACTOR=    0.250966925370066, 1,           1
##FIRST=     8223.43324360094, -59994,       -43885
##LAST=      0,             119159,          -246994
##MIN=       0,             -741466,         0
##MAX=       8223.43324360094, 432000630,    0
$$ Real data points
##PAGE= N=1
##DATA TABLE= (X++(R..R)), XYDATA
$$ [...]
19565a71411N5806N2590E2478J01210b81664a04732h067F3010J78251m8333i538
19553e7699j46299M5288P8956j44709C0218J26414a83886k335A34448b35021k032
19542b37053A54885f5739j27928O6790E4989a97549r915B29850r7057O5777A949
19530b89941a5727j06443c0518H1022J32442a7827F274b86701h0866k98119B8648
19518A16594J82021A9909a78547k00452M8448b4139A81601b19055G3156J26453
19508A99609a84965A52514c55436A18036C5331c2959l05723a48306J7042a7814
19497h2429j3307A5701c17349a5442A11793b39933D45564B1452h9323M4066B59571
19485b17572f637j97287Q6935A11895L57225b39873H7385C945a30519L5973C00339
$$ y = [-171411, -115605, -63015, 52478, 153688, -281664, -104732, -8067, 63010, 241261, 192928, -9538, -57699, -203998, -158710, -79754, -224463, 30218, 156632, -183886, -186221, 134448, -235021, -237053, 154885, -65739, -193667, -126877, 54989, -197549, -207464, 229850, 132793, 198570, 1949, -289941, -15727, -122170, -30518, 81022, 213464, -17827, 6274, -286701, -80866, -378985, 28648, 116594, 298615, 19909, -178547, -378999, -330551, -24139, 181601, -219055, 73156, 199609, -184965, 152514, -355436, 118036, 35331, -32959, -338682, -148306, -131264, -17814, -82429, -95736, 15701, -317349, -15442, 111793, -239933, 445564, 21452, -89323, -45257, 259571, -217572, -6637, -203924, -116989, 111895, 469120, -239873, 87385, 3945, -130519, -94546, 300339]
19473D2679M9853a43465h558j618l47010b786k21139R0121o0368A646c8984B1131
19460i5389j51143J21893l2837g3172E7744P7566J63614b26441j29395a36547
19449A84407a71560B32677k8010F3749a08333I9469a58635f5828k30526G7759
19438c13810A70760e0184j52823N233j7618R1827L3900m5399K7212E5260c86393
19426b18652C486M2780d696k60135a06295m1195k81111G4555N480f1995j5298
19415g7293B38022A5117d43591A83732k3369o1958b59491P1254j48290A67860
19404A49280p2509a32592I8952i5402a5357A35039h6851l790o0497d5484k2020
19393f7504G8186J47626a58479A48523o4452l2551c5067j47626n7215a17754m305
$$ y = [42679, 92532, -143465, -8558, -10176, -357186, -2786, -223925, -133804, -194172, 1646, -38984, 21131, -95389, -246532, -124639, -157476, -73172, 57744, 135310, 298924, -226441, -355836, -136547, 184407, -171560, 232677, 204667, 63749, -108333, 99469, -158635, -65828, -296354, 77759, -313810, 170760, -50184, -203007, -197774, -215392, -123565, -89665, -135064, -107852, 55260, -386393, -218652, 3486, 46266, -4696, -264831, -106295, -147490, -428601, 74555, 80035, -61995, -77293, 238022, 15117, -443591, 183732, 160363, 98405, -259491, -188237, -336527, 167860, 149280, 76771, -132592, 98952, -95402, -15357, 135039, -86851, -90641, -151138, -45484, -67504, 78186, 225812, -158479, 148523, 84071, 51520, -35067, -182693, -239908, -117754, -122059]
19382a22059E9971c8793C33322A57145B2405N0901L1720a2441B17475b6164l05616
19371c31780B1815K11862a54093N3079p9451A55382E9928J25428b84773c5832
19360b95105a3437o35r007n3922K9737J189j10830g2269j59929m2550j09127P2445
19348c11430A74725h691A70595c28990D0966g9827j14377e6275A66806a57142
19337a08237p8627p1391E3680K84429b44101J09456j87924A80135J24826c14318
19326D86566c6226E3084K1656h1647q3432F0632a31110A29677d5541j32352D2328
19314E5719J47938k2844Q4859d3641A69761a49057k04274A98833G2176A9104M87473
19303E06577D5513a14032l4415a8872k06512E9438a45279m09728a38773M5818
$$ y = [-122059, 59971, -38793, 333322, 157145, 22405, 73306, 105026, -12441, 217475, -26164, -331780, 21815, 233677, -154093, -101014, -180465, 155382, 59928, 185356, -284773, -35832, -295105, -13437, -14072, -23079, -77001, -47264, -46075, -156905, -72269, -232198, -274748, -383875, -311430, 174725, -8691, 170595, -328990, 40966, -79827, -194204, -56275, 166806, -157142, -108237, -186864, -258255, 53680, 338109, -244101, -134645, -322569, 180135, 304961, -314318, 486566, -36226, 53084, 74740, -81647, -165079, 60632, -131110, 129677, -45541, -177893, 42328, 55719, 203657, 180813, 265672, -43641, 169761, -149057, -353331, 198833, 72176, 19104, 506577, 45513, -114032, -148447, -18872, -225384, 59438, -145279, -555007, -138773, -92955]
19293i2955M5626j17306j4212P5591A24005a29318c3220l1124j56294q7318J06390
19282b01566E2418e184p5361m6329A76641C6482b37923K6578D2176h3119k8388
19271a11507A9390c4196l0244q3683O8456K5202A042b251m07381A92815m2633
19260A50182f1089A2147l45J10352K29948b3127n2156l77486a12224k27636A35894
19248D2032a68336M5050j3148l92272E1912a0107k08091H8833a05044k13257J46653
19237a71648B3361a11350F2698f75257E8484a18052A48820a60513D3756c64320
19226b33318L7900k89065f7373j26328H0764P0692a43341c722k35634d6656D4409
19214a28286j36814e1298k63354G1070i4958c2128A17299a18573A4287a97034
$$ y = [-92955, -47329, -164635, -178847, -103256, 124005, -129318, -33220, -64344, -220638, -307956, -201566, 52418, -5184, -80545, -126874, 176641, 36482, -237923, -211345, 42176, -83119, -111507, 19390, -34196, -64440, -148123, -79667, -54465, 1042, -2251, -409632, 192815, 150182, -61089, 12147, 11802, 122154, 352102, -23127, -75283, -452769, -112224, -339860, 135894, 42032, -168336, -123286, -136434, -528706, 51912, -10107, -218198, 88833, -105044, -318301, -171648, 23361, -111350, 62698, -675257, 58484, -118052, 148820, -160513, 43756, -364320, -233318, -195418, -484483, -67373, -193701, 80764, 151456, -143341, -3722, -239356, -46656, 44409, -128286, -265100, -51298, -314652, 71070, -94958, -32128, 117299, -118573, 14287, -197034]
19203H5449Q5446p938l6963K5787g9178G6266K7457c7382j70288J1772h1481j41918
19191b23399j38798h9385J3471r3659B38947b97223N1645C47132A12647c734j96701
19180b00435j03500g7313I3286e4425j44022E0737Q3471N833a8775j2931M027
19169b7679B36467p2c15242C1789g4880b2169j53784C14181a4992k51587A16857
19157G5375a13570j44182C8713c3196Q353G1567a11643j96908J21401F2253d22565
19145i8522A06189j8351b43256B8179a30260E9170Q1937b42023c6247E1086f5954
19133d9183A28908E3857K8916K121a88649d9446A10766d44526A28687a12407k3352
19122a35759H291a15841p2421j01122c0304C6080L63866D3833Q0082M6283J05287
$$ y = [85449, 170895, 162957, 125994, 151781, -79178, 76266, 103723, -37382, -207670, -195898, -81481, -223399, -362197, -89385, -75914, -169573, 238947, -297223, -245578, 347132, 112647, -3734, -200435, -303935, -77313, 93286, -54425, -198447, 50737, 134208, 140041, -18775, -31706, -27679, 236467, 236395, -315242, 31789, -74880, -22169, -175953, 314181, -14992, -266579, 116857, 75375, -113570, -257752, 38713, -33196, -24843, 71567, -111643, -308551, -187150, 62253, -422565, -98522, 106189, 87838, -243256, 28179, -130260, 59170, 141107, -242023, -36247, 51086, -65954, -49183, 128908, 53857, 82773, 84894, -188649, -49446, 110766, -444526, 128687, -112407, -135759, 8291, -115841, -188262, -289384, -30304, 36080, 399946, 43833, 123915, 170198, 275485]
19111B75485f4524j68885A3468c3801j07475J0678l6197k63130a71030B2876c12925
19099a13231o8531k15256B67978A17279c38870B01603C0940a37208B55456i2451
19088c28795H8066a81153r8706c380A36041a93975C57099n0321b94491K2220E9163
19076A61033B766J67036b7461E5433a46767N3618o1933p7214C00639B7109b15130
19064C67257a55639g7437A42793g5056j00999A05951j0763d966j32336O4749B54938
19052C78263A56O3060g1772C11471G1857b64212q7775e1910R600k8627l49478
19041d20415b1808A92721J1000b59548f7990p0156j68897I476L6166J67379C5515
19029A45009P8213d5661G5120a69671A96905p0617b1087m6599b543A61150b24445
$$ y = [275485, -64524, -233409, 13468, -33801, -141276, -130598, -166795, -429925, -171030, 22876, -312925, -113231, -181762, -397018, 267978, 117279, -338870, 201603, 30940, -137208, 255456, -92451, -328795, 88066, -181153, -279859, -3380, 136041, -193975, 357099, 306778, -294491, -272271, 59163, 161033, 2766, 169802, -27461, 55433, -146767, -93149, -155082, -232296, 300639, 27109, -215130, 367257, -155639, -77437, 142793, -75056, -176055, 105951, 95188, -4966, -137302, -72553, 254938, 378263, 156, 63216, -71772, 311471, 71857, -264212, -351987, -51910, -42310, -70937, -420415, -21808, 192721, 203721, -259548, -67990, -138146, -307043, 9476, 45642, 213021, 35515, 145009, 223222, -45661, 75120, -169671, 196905, 126288, -21087, -67686, -2543, 161150, -224445]
19017F9346a90393i293l33679a70894C38678f1454B86757a21323a6910k20903
19007b37813E4680b90518G4860e07543D39888c14792A04919P8817b6160A65588
18996a86930k1346B7049N0699A5546a47813M8423K7679B12945i4974B7096c6913
18984h9177j77531a01879A263b08433j40200I131b25504c9395q5367C04303Q3134
18973C87437a29884A05911b84027B59609a12392A96144B1350h4142C04244A9038
18962c55543c2245j85059B58319b47388A17742l7856c7875l40150F7259a95186
18951H2719a05473J5949j0764a2521j91365J01831H8371i979j52690j3972e0266
18939c72143C0112a25422B73164j13179b70101C10969j08314c88223A06842c3766
$$ y = [69346, -190393, -9293, -342972, -170894, 338678, -61454, 286757, -121323, -16910, -237813, 54680, -290518, 74860, -507543, 439888, -314792, 104919, 183736, -26160, 165588, -186930, -208276, 27049, 77748, 15546, -147813, -99390, -71711, 212945, -94974, 27096, -36913, -89177, -266708, -101879, 1263, -208433, -348633, 9131, -225504, -39395, -124762, 304303, 387437, -129884, 105911, -284027, 259609, -112392, 196144, 21350, -84142, 304244, 19038, -355543, -32245, -217304, 258319, -247388, 117742, 79886, -37875, -378025, 67259, -195186, 82719, -105473, -89524, -100288, -12521, -203886, -102055, 88371, -9979, -162669, -176641, -50266, -372143, 30112, -125422, 273164, 159985, -270101, 310969, 202655, -388223, 106842, -33766]
18928i5156k7795q4484d532r0945P216L3896j759F5472c7079A08342b37284B60466
18915b11726f8815o2934N354e5865l10239G7854a15288k82051A54226d8171k99578
18904c47749a11147a0128A56131f9874j6273g149r4554k2216k6804o978L4008
18893a23693B9118L8934J1600K5729c8427B4734a71871k16207J26390A4649c96642
18881I9905f5161j45115A85825g5339A30605c53734a37362Q293A68050b40819
18870c23692R9976B6975c7197k98136J27372j32736J69768j65746q7916a9423
18859a50196A85623c01095a08151J9124j95377B91008j42697k7237j1097R8501
18849B08478E0713J62604d2493B63222H3c86767a377C1790J7696b00073j58325
$$ y = [-95156, -122951, -207435, -4532, -95477, -88261, -54365, -56124, 65472, -37079, 108342, -237284, 260466, -211726, -68815, -131749, -126395, -55865, -366104, 77854, -115288, -397339, 154226, -48171, -347749, -111147, -10128, 156131, -69874, -86147, -7149, -101703, -123919, -150723, -157701, -123693, 29118, 68052, 79652, 105381, -38427, 24734, -171871, -388078, -261688, 14649, -396642, 99905, -65161, -210276, 185825, -75339, 130605, -353734, -137362, -129069, 168050, -240819, -323692, -223716, 26975, -37197, -335333, -207961, -340697, -170929, -336675, -424591, -19423, -150196, 185623, -301095, -108151, -89027, -284404, 291008, 148311, 121074, 109977, 208478, 50713, 213317, -42493, 263222, 83, -386767, -1377, 31790, 49486, -200073, -358398]
18838c58398J13526I8128d1887l56705D1420a58560p3142A10771J00901b60869
18827d6662F7447K09260b02108J00523A70400b52984F5710b66264D9945a76598
18816B80983e3655B46464J3601A07656n2648a03625F336c19671A23436c4612A38964
18804B43184o6442O6953i1573o4486O6320k05002I8189g7482m7384l03330a47704
18792B73771A4543a45965d2765H4320b05168Q9897D5918d02861a07795a1243k7011
18781c8254r7459n2004P2587g437D3084g2450k03894H3711e93738a95212b9132
18769b72167R4957g5945k0062A7818L07262j5941j18737c05349G9909o297f97
18757b49179d7529k1689D3598i1028l49327A23936J24576c0170B29497k1667k3283
$$ y = [-358398, -244872, 98128, -41887, -398592, 41420, -158560, -231702, 110771, 211672, -260869, -46662, 67447, 276707, -202108, -101585, 170400, -252984, 65710, -266264, 49945, -176598, 280983, -53655, 246464, 260065, 107656, 55008, -103625, 6336, -319671, 123436, -34612, 138964, 243184, 176742, 243695, -91573, -156059, -89739, -294741, 98189, -77482, -124866, -428196, -147704, 273771, 14543, -145965, -42765, 84320, -205168, -115271, 45918, -402861, -107795, -11243, -38254, -135713, -187717, -115130, -7437, 43084, -72450, -276344, 83711, -593738, -195212, -29132, -272167, -177210, -75945, -96007, 17818, 325080, 309139, 190402, -305349, 79909, 73612, -697, -249179, -47529, -69218, 43598, -91028, -440355, 123936, 248512, -30170, 229497, 207830, 184547]
18746A84547b15824O5399d4003A09285K992e8749A59448n1736B4479r329a27700
18734G2841A463M0562a65531P5425k13818i0776p0659j54590c5483D9906J05637
18723A55543f3018A74740c52957J57716d7066n39006d0445k72245A62556a41235
18712I4520J4632m3343J23014f1887A27930h8314A51216c11478i9990M1872E2149
18700b38353d73j9300k00422e8452n712m6708c8973D9273a55184D7437i7953l71922
18688d69875d7526j48167R5089n6352F463b21037N884J01234q2569c8392A00895
18676c14626A5590a52584C57546a13480B0343J84157c41824G2069N6966J0582
18666A39617C69i7615B41080I7640b87642J23880P9721C3006a51700L6982C6934
$$ y = [184547, -215824, -150425, -44003, 109285, 112277, -58749, 159448, 107712, 24479, 15150, -127700, 72841, 1463, 42025, -165531, -90106, -303924, -90776, -161435, -316025, -35483, 49906, 155543, -63018, 174740, -352957, -195241, -47066, -586072, -40445, -312690, 162556, -141235, 94520, 109152, 65809, 188823, -61887, 127930, -88314, 151216, -311478, -99990, -58118, 52149, -238353, -473, -19773, -220195, -58452, -64164, -110872, -38973, 49273, -155184, 47437, -97953, -469875, -47526, -195693, -100604, -156956, 6463, -221037, -215153, -113919, -196488, -38392, 100895, -314626, 15590, -152584, 357546, -113480, 20343, 204500, -341824, 72069, 129035, 139617, 369, -97615, 241080, 97640, -287642, -163762, -84041, 33006, -151700, -114718, 36934]
18654B04898C9685a30499G113f3201L1r4660D3077b08454i2451d4907r2071L3264
18642a03714l06354a55812f9937j01314n550c9959A65337b05824B7694Q1074a22206
18630I9975m0288g2676D0192c83573B78611A2038D851P3377b00544d6282l814
18619e0096b2900j73134L5508k06147B23651B6193J81590c06701a27756a0677
18608e9169B07077C6016a48705l1996L6699q987b3597C3261J796L4538a99772
18596a16345M5197D227a9825l0303k9354n4558A54813i6760A36170b57403N5461
18585b01942L3829r4323J6262k38693b37019i2257j28406R8697C8559J91773C1142
18573a12892A38507H568a2003k04857k9993I3083L6240a16901B86321f04j75185
$$ y = [204898, 39685, -130499, 7113, -63201, -63170, -157830, 43077, -208454, -92451, -44907, -136978, -103714, -410068, -155812, -69937, -171251, -176801, -39959, 165337, -205824, 27694, 108768, -122206, 99975, 59687, -72676, 40192, -383573, 278611, 12038, 4851, 78228, -200544, -46282, -50096, -22900, -196034, -160526, -366673, 223651, 26193, 207783, -306701, -127756, -10677, -59169, 207077, 36016, -148705, -180701, -144002, -152989, -23597, 33261, 35057, 69595, -199772, -116345, -71148, 4227, -19825, -50128, -79482, -134040, 154813, -96760, 136170, -257403, -201942, -168113, -262436, -246174, -484867, -237019, -92257, -220663, -121966, 38559, 230332, 31142, -112892, 138507, 8568, -12003, -216860, -246853, 93083, 129323, -116901, 286321, -604, -175789]
18562a75789e1211A71735b42364f1985l40461I4442J6565a5971m020l1200j1460
18551f2651I9135a9488n9290j30343A27659g0923m2910o8057o1262R2697A92770
18539b27679n4153B23707a31281L2429a4908C18146a05051A6230J13506i9162
18528a42810d8258A36923a56765k6832j44032a11187A00981a27225p6300B95017
18517H1908h2126j37489P0015a3955F3370K09614b33728N0290A55875e30461A73887
18505C47359b31772g4650p6757G8116e9908j60640k29427a13500e0257A7602c64435
18493e5464k27713d5574k82928c8707B9784J83948c13919B916a14775k94411F1898
18481D5037a87458j67355d2675A31609L3451E8457j7383p163a13232k76609a08873
$$ y = [-175789, -51211, 171735, -242364, -61985, -402446, 94442, 111007, -15971, -19991, -51191, -62651, 99135, -19488, -78778, -209121, 127659, -70923, -113833, -181890, -243152, -150455, 192770, -227679, -281832, 223707, -131281, -98852, -14908, 318146, -105051, 16230, 129736, -99162, -142810, -48258, 136923, -156765, -183597, -327629, -111187, 100981, -127225, -203525, 295017, 81908, -82126, -219615, -149600, -13955, 63370, 272984, -233728, -183438, 155875, -530461, 173887, 347359, -231772, -74650, -151407, 78116, -59908, -220548, -449975, -113500, -50257, 17602, -364435, -55464, -283177, -45574, -328502, -38707, 29784, 213732, -313919, 2916, -114775, -409186, 61898, 45037, -187458, -354813, -42675, 131609, 165060, 58457, 41074, 33911, -113232, -389841, -108873]
18469B0972P0591J49534a18755E6075Q747a69437A99540d490B6651e5270k57798
18458c13068h6137A90693a63411H6889a40019j19486A42354b90226J39819b1868
18447a33851b0243D81328B6215c29018J42011j25147d161l4133m2974E6296a19289
18435A14706b15814I3963a09057k13751j6307e8689j7919J0574A2464c03261G1839
18423b04468j81531J44528R3424k0225l6398l50916e5851B89777a43392D207Q9458
18412I3665g6526j94950A75306J22770p8039h3856b2275B22438a09548G6588d5261
18400A46230g5041C1871a6101k29622r467b4187j30150B12457b49546h7513A18228
18388g1629c5034P458E3406a24438e6741C1227a00344E5752O9462O369a88711
$$ y = [20972, 91563, 241097, -118755, 56075, 64822, -169437, 199540, -4490, 26651, -55270, -313068, -86137, 190693, -163411, 86889, -140019, -259505, 142354, -290226, -150407, -21868, -133851, -20243, 481328, 26215, -329018, -187007, -312154, -4161, -38294, -81268, 56296, -119289, 114706, -215814, 93963, -109057, -322808, -339115, -58689, -76608, -66034, 12464, -303261, 71839, -204468, -385999, -241471, -148047, -168272, -204670, -555586, -55851, 289777, -143392, 4207, 93665, -76526, -271476, 175306, 298076, 220037, -83856, -22275, 222438, -109548, 76588, -45261, 146230, -75041, 31871, -16101, -245723, -255190, -24187, -154337, 212457, -249546, -87513, 118228, -71629, -35034, -27576, 53406, -124438, -56741, 31227, -100344, 55752, 125214, 131583, -188711]
18376d0170j1807A57207a32155H0901C8107j0899J61531b90250C8549J31844H3421
18364a855B71330D2030J57715b07667J6728k08763J86282O2569k25346d5838G6743
18352b14547P7078j86401A49441a82446A04192f3102C94742h9764A42045m5137
18342I6908j4557a43364A39809f5763l1012D8799c8073A79320l5678b28002e8277
18330c0728l10777g8871B2138r989P2832c04824B18895D7500a13229B0132c1208
18318a43325E5423J66963c1764D2970a10455B69432a69699n7430Q3579A79823
18307I9786a71889o4477G795a70235C9478N6148k0162i5132I4642c41103j310
18296c42413A61890j0570a99550M0963o2334R7702K1289E0702b37003g0389p1676
$$ y = [-40170, -51977, 157207, -132155, 80901, 38107, 27208, 188739, -290250, 38549, 170393, 83421, -1855, 271330, 42030, 199745, -207667, -190939, -399702, -213420, -150851, -376197, -45838, 76743, -214547, -137469, -323870, 149441, -182446, 104192, -63102, 394742, -89764, 142045, 96908, 82351, -143364, 139809, -65763, -96775, 48799, -38073, 179320, 143642, -228002, -58277, -30728, -341505, -78871, 22138, 12149, 84981, -304824, 218895, 47500, -113229, 20132, -31208, -143325, 55423, 222386, -31764, 42970, -110455, 269432, -169699, -227129, -143550, 179823, 99786, -171889, -236366, 7795, -170235, 39478, 95626, 75464, -95132, 94642, -341103, -342413, 161890, 151320, -199550, -158587, -220921, -123219, -101930, 50702, -237003, -70389, -142065]
18285a42065O5708E6715a59493C21831b19044o8593a41781A22053C1436K56788
18275B88224b7971l14462C284M0846c69314a35443M1922k2880B23271h9259n2304
18264a41563j45729f7400k01938B37166r974c53524A13237J66664g056o4754B29673
18252H1782M5657M9500H918d7593k2184A23892a9956G8279k156i6050D8075J44751
18240A92826a3245l3869a0458B28216p7708P0566d2921j69729p0141Q7086B10267
18228D9029P0193J0802g675j34367A26275h6006c6029A52599b63966a02092B57284
18216A68528p1442l2473j7850g7018B11919h1498L9404G6993h2074C5492a76875
18204d39921M7716J26482C8009Q0652b16262K9601j40643i8165p1505L9493c1482
$$ y = [-142065, -76357, 56715, -159493, 321831, -219044, -287637, -141781, 122053, 31436, 288224, -27971, -342433, 3284, 44130, -369314, -135443, -93521, -116401, 223271, -89259, -141563, -287292, -67400, -269338, 237166, 227192, -353524, 113237, 279901, -7056, -71810, 229673, 81782, 127439, 176939, 8918, -47593, -69777, 123892, -19956, 78279, 76123, -96050, 48075, 192826, -13245, -47114, -10458, 228216, 150508, 221074, -42921, -212650, -282791, -195705, 210267, 49029, 119222, 130024, -7675, -142042, 126275, -86006, -36029, 152599, -263966, -102092, 257284, 168528, 97086, 64613, 46763, -77018, 211919, -81498, -42094, 76993, -82074, 35492, -176875, -439921, -392205, -265723, 38009, 118661, -216262, -186661, -327304, -98165, -169670, -130177, -31482]
18192A71542C2355R4082L9673F8127J75955D2595J02207a36033a3753j04304A80178
18180a17654B8297K42158h7240A96353n3373c11064a9135k60732a8024k23720
18170b41744B8566L2691i4161b2283l5486k21360A11122L2262b63154G4419K18723
18159B93142e91298A66049a77862a2274q537I4605b02367L1295a5124G8200o28
18148G7572a88282F298a72904P1069I0358A4659J7676H940L1053d4277D1827b38231
18135C04887b10989B37546e975l12987h0533I6248f4735D2321R0583b77589H0090
18123b55538M4919j01723F6461a88653k58591E2951i3807j23922A35493c872B58554
18111f5191E257c11138C2795b43337G2735e3343B76725D5998k2465p140a47929
$$ y = [171542, 32355, 126437, 166110, 68127, 244082, 42595, 144802, -136033, -13753, -118057, 180178, -117654, 28297, 270455, -87240, 196353, 142980, -311064, -19135, -279867, -18024, -241744, 28566, 61257, -94161, -22283, -57769, -279129, 111122, 143384, -263154, 74419, 293142, -591298, 166049, -177862, -12274, -20811, 94605, -202367, -171072, -15124, 78200, 77572, -188282, 6298, -172904, -101835, 90358, 14659, 32335, 8940, 39993, -44277, 41827, -238231, 304887, -210989, 237546, -5975, -318962, -80533, 96248, -64735, 42321, 132904, -277589, 80090, -255538, -210619, -312342, 66461, -188653, -447244, 52951, -93807, -217729, 135493, -3872, 258554, -65191, 5257, -311138, 32795, -243337, 72735, -53343, 276725, 45998, 23533, 16393, -147929]
18099b60887J21801j85826A22322g5603A6593a25071F5359r087a18116d3511B2097
18087b14152a05594o9389Q6576D8006O7299c48912B09464K280b5078o7843l37773
18076d30694C1940R5833a71916E8701a69891A82422B5177K85270L750c09950F8108
18064a58725l9031H6948b63962E2436a18499C9211M3006N25L14509c37450B7600
18052d55940c6982f842E252J22137h7463a3311k39171a17474l30711b4102k7468
18041e1570b5052C2019a74291N2489f0891j9197j94842A24254a2579k07524A13454
18029a67357B56377D6070a21243j5489B23386g7108j6045I575a44830G0143a13269
18017g6032c2230A44047D2167b30255A41676l3097j7807B2422a87004m3592A6653
$$ y = [-260887, -139086, -324912, 122322, -75603, 16593, -125071, 65359, 56272, -118116, -43511, 22097, -214152, -105594, -174983, -88407, 48006, 115305, -348912, 209464, 211744, -25078, -92921, -430694, 31940, 127773, -171916, 58701, -169891, 182422, 25177, 310447, 314197, -309950, 68108, -158725, -197756, 86948, -263962, 52436, -118499, 39211, 82217, 82742, 397251, -337450, 27600, -455940, -36982, -6842, 5252, 127389, -87463, -13311, -252482, -117474, -448185, -24102, -51570, -25052, 32019, -174291, -121802, -60891, -80088, -274930, 124254, -12579, -220103, 113454, -167357, 256377, 46070, -121243, -136732, 223386, -77108, -93153, 9575, -144830, 70143, -113269, -76032, -32230, 144047, 42167, -230255, 141676, 108579, 90772, 22422, -187004, -230596, 16653]
18005b59727G2988K00426Q9380D786L354l750a1895j40216A62251a61859K7491
17994a34368B80055f0400k05881B7944b43914i6743C1909b00520A47963B859a2532
17982b86370C34267A15205N1316J6781G2721e4068l0832C18230k9381D1327b34932
17970B96723c3093B7195b56856h0963o1834d7982p1718k1786q3026C32164a83843
17958b66214g2598H3257a54722p9122L2647h0062A86051a58497f9142A56552B4275
17946b35465A05071O5670a13998L0572n09514d9462j68860q2037j4645L6741J31407
17935a46856A12592L50986b05410i2639j29331i8384J5049m0987K4963j77007
17925b76366A72301C6934J55900a77665A40895h8865E8397g8883j12743R2970
$$ y = [-259727, 72988, 273414, 362794, 4786, 8140, 4390, -11895, -152111, 162251, -161859, -134368, 280055, -60400, -266281, 27944, -243914, -96743, 31909, -200520, 147963, 2859, -12532, -286370, 334267, 115205, 166521, 183302, 72721, -54068, -84900, 318230, 288849, 41327, -234932, 296723, -33093, 27195, -256856, -80963, -142797, -47982, -119700, -141486, -224512, 332164, -183843, -266214, -72598, 83257, -154722, -233844, -201197, -80062, 186051, -158497, -69142, 156552, 24275, -235465, 105071, 170741, -113998, -83426, -592940, -49462, -218322, -300359, -315004, -278263, -146856, 112592, 463578, -205410, -92639, -221970, -98384, -83335, -124322, -99359, -276366, 172301, 36934, 192834, -177665, 140895, -88865, 58397, -78883, -191626, -98656]
17915i8656J4804p2777A78620a42471e7671K4117C7160a02373H9292B3436a96335
17903A47527b91379J7336B68253I7703e1192A62681c47159B8776J77732b70949
17892c04131A81337p1337J08411a54509l07D0430e584E0049K6004h2236I6867
17880C8959J27841a09910m9733B35784B7433g1435A00188c5467A28867A6458c34515
17868d2576j23827A26995F1035Q8223a48397g2995i329B67849n8173c0620q4523
17857a15143A69315g2157k92071C8963J39809c40973i0523I196K06931a49096
17846a25534m3250O1535C0478a22887A59927J48235A6884e4447l00565B84745
17835A72353C491i9174M1639F7900k9377m337a6218A54490K06832l8089b28709
$$ y = [-98656, -83852, -156629, 178620, -142471, -57671, -33554, 37160, -102373, 89292, 23436, -196335, 147527, -291379, -274043, 268253, 97703, -51192, 162681, -347159, 28776, 206508, -270949, -304131, 181337, 110000, 218411, -154509, -154816, 40430, -5584, 50049, 76053, -82236, 96867, 38959, 166800, -109910, -159643, 235784, 27433, -71435, 100188, -35467, 128867, 16458, -334515, -42576, -166403, 126995, 61035, 149258, -148397, -72995, -9329, 267849, 209676, -30620, -115143, 169315, -72157, -364228, 38963, 178772, -340973, -90523, 9196, 216127, -149096, -125534, -168784, -107249, 30478, -122887, 159927, 308162, 16884, -54447, -355012, 284745, 172353, 3491, -99174, -57535, 67900, 38523, 34186, -16218, 154490, 361322, 323233, -228709]
17823h0162C83253b4405j11802d3460j43107h1243E7796a1571j13503A1129O168
17812A7297L7735Q4822e226r1034D38919a26230C29545a66380B19022a73081Q3382
17801h9699k57981A13620K0589o4597B5950b63575B90282b26792A73919b02667
17790c45888H1673a07105b2373l2934l5171H151b7326a1796k67268b6423j9124
17779d5547C108Q617b01777P8584B10441b93074D3744A4296a58478P5944h772
17767c6464a45q578j03245E58J96343a59224B08999m8004c02465J47818A85094
17755c9273j51821B19292Q649A1901h5876A4242N3989c34553C67872c20824D8935
17743A02308J45485a48886D18658c77905A79465A6358d52704D7660c20441d9302
$$ y = [-80162, 383253, -24405, -136207, -43460, -186567, -81243, 57796, -11571, -125074, 11129, 17297, 55032, 139854, -5226, -96260, 438919, -126230, 329545, -166380, 219022, -173081, -89699, -347680, 113620, 134209, 69612, 25950, -263575, 290282, -226792, 173919, -202667, -345888, 81673, -107105, -22373, -55307, -90478, 8151, -27326, -11796, -279064, -26423, -45547, 3108, 11725, -201777, -123193, 210441, -293074, 43744, 14296, -158478, -82534, -8772, -36464, -145, -8723, -111968, 558, 196901, -159224, 208999, 160995, -302465, -154647, 185094, -39273, -191094, 219292, 227941, 11901, -85876, 14242, 68231, -334553, 367872, -320824, 48935, 102308, 247793, -148886, 418658, -377905, 179465, 16358, -452704, 47660, -320441, -49302]
17732b66714g0582C27782d6375A85674b79908c2420F3338k7974J128f119l00385
17721c06504c5288A78449G3579L77088b5889A6853P4390a21688B69142B7515a36124
17709a74696h1171A02927L05793I4307J4032C7886J60627o9322b92472P1273B40118
17697A51411a5355A77781f0479k29294C77773j87006g6238R630F2916L7668J13492
17686B14076l6134a93086f9000A47821e5803B66022A07757R5527H6037e7518A66893
17674H3373j5762J39466j01089B489J11498J67843j29736a69030g5933J3183A34883
17662e1889j3000G0927K15896D8751K4249b29653C28280j3236b01677C54592j25577
17651B29015A00124i9136n1388N6914C8406a04567E1679c05342A22100J33168
$$ y = [-266714, -70582, 327782, -46375, 185674, -279908, -32420, 63338, 35364, 36492, -6119, -306504, -35288, 178449, 73579, 450667, -25889, 16853, 91243, -121688, 269142, 27515, -136124, -174696, -81171, 102927, 408720, 94307, 108339, 37886, 198513, 129191, -292472, -221199, 240118, 151411, -15355, 177781, -60479, -289773, 377773, 190767, -76238, -66608, 62916, 100584, 214076, 177942, -193086, -69000, 147821, -55803, 266022, 107757, 203284, 86037, -57518, 166893, 83373, 67611, 207077, 105988, 2489, 113987, 281830, 152094, -169030, -75933, -62750, 134883, -51889, -64889, 70927, 286823, 48751, 73000, -229653, 328280, 315044, -201677, 354592, 229015, 100124, -99136, -150524, -93610, 38406, -104567, 51679, -305342, 122100, 255268]
17641B55268n3750O0198a43646B991a21614k6243c2343H5826a1146B9232a26277
17629i675m163A81041a56027N5446M9577p472B00054c9425B45902p8666p8678
17618H8558e4775A36263f6592j13955P7022A20653B3591O1118b90820A58398h9139
17606D8353i7605j22755C32918b73404b1288p8412N389B47908h622F0165R9721
17595A59886C4090h8076A58612G8282a08455q442b8366j69298Q8627A17731a56840
17583C7481b45523B13037J72564j62751l6523L8286c3085B24304j7073M9070F2091
17571B46414a99843g1609q1106b8035A92282o5212b23179F4614d8455l4461A8920
17559b02247M6549F9479d6940D4325J4847d0708C89549A2606a41865H201Q1180
$$ y = [255268, 201518, 261716, -143646, 2991, -121614, -147857, -32343, 85826, -11146, 29232, -126277, -9675, -13838, 181041, -156027, -100581, -51004, -58476, 200054, -39425, 245902, 167236, 88558, -54775, 136263, -66592, -180547, -103525, 120653, 23591, 84709, -290820, 158398, -89139, 48353, -97605, -220360, 332918, -273404, -21288, -99700, -94311, 247908, -8622, 60165, 159886, 34090, -88076, 158612, 78282, -108455, -116897, -28366, -197664, -109037, 117731, -156840, 37481, -245523, 213037, 385601, 222850, 186327, 224613, -33085, 224304, 207231, 256301, 62091, 246414, -199843, -71609, -152715, -28035, 192282, 127070, -223179, 64614, -48455, -82916, 18920, -202247, -155698, 69479, -46940, 44325, 59172, -40708, 389549, 12606, -141865, 8201, 89381]
17548H9381j3180B7456J64565i5319l32654B03502g0722A10519g8194A40423K7692
17537A68115K04701h4295D1867J8715Q6197R1877C4637a63538B09260E3012c4371
17525c0888A602a52122B78604i4825B7276a38576F0381k4664J30355i6382d4925
17513A2113J89771K2699o9628D5066b79514A32114a15216C18354j51259J89197
17503C56292A9204M9841b0671h746E3044N7550r694a15414a6743D7382b410A3417
17490A00352N16161k40712a99471B76621o9294R4936j23348a67510A49293n0315
17480I8978N5884m5669J17787a9670A50652J5108q1421l9688k0834L2109K1609
17469G7535J61742k3258j3646l2320B2146J60954H2505J89730j05302b2254q9230
$$ y = [89381, 76201, 27456, 192021, -95319, -427973, 203502, -70722, 110519, -78194, 140423, 168115, 372816, -84295, 41867, 60582, 146779, 238656, 34637, -163538, 209260, 53012, -34371, -30888, 1602, -152122, 278604, -94825, 27276, -138576, 60381, 35717, 166072, -96382, -44925, 12113, 201884, 224583, 154955, 45066, -279514, 132114, -115216, 318354, 167095, 356292, 19204, 69045, -20671, -8746, 53044, 110594, 100900, -115414, -16743, 47382, -2410, 13417, 100352, 616513, 375801, -199471, 276621, 207327, 302263, 178915, -167510, 149293, 98978, 154862, 109193, 226980, -19670, 150652, 165760, 84339, 44651, 23817, 55926, 77535, 239277, 216019, 202373, 170053, 22146, 183100, 82505, 272235, 166933, -22254, -111484]
17458a11484r7511H9552i1036b4559B43871j5439M7994j07792B0892R2042K33385
17447C46319p1660k9654M3932L2070q333A19494b12244G1452a0971B58957A10822
17435B03806Q8795g9380A78078J3333n7905b28048a6076H6034R2329J88390K16857
17424E83610A85752n9235J17732h8336B47079l8478L0420K32424j38738A34702
17413F6482A3677K96388R4864c432B23326J8919G17L0713J73336a61798O7801
17402i3997C05485j31914k9171R9365L4164j1363D8904J49846R1476f3928G5876
17390C14798p8110M1626D4103L0718l5744K20767g4806I3541K0635a120C28547
17378B39694K2703j04973a1819F6991K3702a6235B77039J11400j06040C5932L61189
$$ y = [-111484, -208995, 89552, -91036, -24559, 243871, 228432, 276426, 168634, 20892, 112934, 346319, 274659, 245005, 288937, 321007, 312674, 119494, -212244, 71452, -10971, 258957, 110822, 203806, 292601, -79380, 178078, 191411, 133506, -228048, -16076, 86034, 178363, 366753, 583610, 185752, 126517, 244249, -88336, 247079, 208601, 239021, 471445, 332707, 134702, 66482, 13677, 310065, 404929, -3432, 223326, 242245, 717, 31430, 204766, -161798, -93997, 305485, 173571, 144400, 243765, 277929, 266566, 48904, 198750, 290226, -63928, 75876, 314798, 236688, 278314, 44103, 74821, 39077, 259844, -74806, 93541, 114176, -1120, 328547, 239694, 262397, 157424, -11819, 66991, 90693, -16235, 277039, 388439, 282399, 35932, 397121]
17367C97121I8499J73051C8789J63951M8096J27086E5029A5839K96667a70902
17356a27924I5530k6882g8584D25210j73394A00262a6064k02550C072J01772a98636
17344i4586h645j42502q8792F5123a63767h828C07260o3695J12709E3895K7268
17333H1163M1371j5673R4999r766G6287a37194N1889H2911g8440k7214o4122A70215
17320I0217J70020j05873J4157g7670A23810J25628l230C3169f0464A65497E2973
17308i0774E8993K86960A55582M85286H7772h0298A55705G4156J97619J26499
17298C98274j40257M7726a73021A85194K10663A58754R6034A15445b8669B67228
17287A2746a05400A05432a7902C11897M6928A24876K6602p221E2553b20595A88638
$$ y = [397121, 98499, 271550, 38789, 202740, 250836, 377922, 55029, 15839, 312506, -170902, -127924, 95530, 68648, -78584, 425210, 251816, 100262, -16064, -218614, 3072, 104844, -198636, -94586, -8645, -151147, -239939, 65123, -163767, -8828, 307260, 243565, 356274, 53895, 81163, 122534, 106861, 201860, 192094, 76287, -137194, -85305, 82911, -78440, -105654, -169776, 170215, 90217, 260237, 154364, 168521, -77670, 123810, 249438, 246208, 33169, -60464, 165497, 52973, -90774, 58993, 345953, 155582, 640868, 87772, -80298, 155705, 74156, 271775, 398274, 258017, 305743, -173021, 185194, 395857, 158754, 254788, 115445, -28669, 267228, 12746, -105400, 105432, -17902, 311897, 358825, 124876, 151478, 144257, 52553, -220595, 188638]
17275b63150A49894m126o5083J63145D5873J71590e3927C28012f2180B76769K82700
17264E59469j33048A56663J15509B8091K2772k3224K20674I3593K39392q4634
17254B48351D2877M8049a52198I6553a9874B71922m3704A0633K30655C4874R1538
17243A26412C0955J85891r1200a71068A30911F1544J03860J50416j41382K85299
17233D59737E0360J32130A8571b41251A07406J44824a1925I6154a21744E01163
17222D4084K31393i8595D00102a54359A6353R9838K39740A28141K20035G7578
17211C31870a3687C82437j77055I5505J52296j4763A13604K93895j63026k1063
17201B23410R296b3418C43711M8478a13450A56647N5585o7570j434K13741K34246
$$ y = [-263150, 149894, 145768, 80685, 243830, 45873, 217463, -53927, 328012, -62180, 276769, 559469, 426421, 156663, 272172, 28091, 50863, 27639, 248313, 93593, 332985, 248351, 42877, 90926, -152198, 96553, -19874, 271922, 228218, 10633, 241288, 34874, 126412, 30955, 216846, 125646, -171068, 130911, 61544, 165404, 315820, 174438, 459737, 50360, 182490, 18571, -241251, 107406, 252230, -11925, 96154, -121744, 501163, 44084, 275477, -98595, 400102, -154359, 16353, 116191, 355931, 128141, 348176, 77578, 331870, -13687, 382437, 205382, 95505, 247801, 233038, 113604, 407499, 244473, 223410, 232706, -23418, 343711, 392189, -113450, 156647, 212232, 144662, 143228, 356969, 591215]
17190E91215B22897F13J19273N5899J59115B1836L04075o7741j18470N5395N7864
17179B52959n7716l4973Q0223j14443a58193A08285L87153j49055A40897J07753
17169B48650j71A02793k7208J19239e0397B42039E5348B7086c0630B71408E0008
17157i1108D38341j76739o4261L348N1278J33424A19459B9712N36575j75129A13521
17145C62250i1636B39367E0130L27426A07251k5777K58927j15436J13909i7316
17134a19455D20269G0837K66183M4080P048A51176R1230O9245j21607L0804B7560
17122A00189J35784H119K68245J23276A38922O53858A72989K4956H3353K00269
17112B83622j6257R158J93403A12563m7898M31206A64122L239J05365F8788R6357
$$ y = [591215, 222897, 613, 119886, 175785, 334900, 21836, 325911, 258170, 139700, 195095, 252959, 195243, 160270, 240493, 126050, -158193, 108285, 495438, 346383, 140897, 248650, 248479, 102793, 75585, 194824, -50397, 242039, 55348, 27086, -30630, 271408, 50008, -91108, 438341, 261602, 197341, 200689, 251967, 385391, 119459, 29712, 566287, 391158, 113521, 362250, -91636, 239367, 50130, 377556, 107251, 81474, 340401, 224965, 338874, -97316, -119455, 420269, 70837, 337020, 381100, 388148, 151176, 242406, 311651, 190044, 220848, 27560, 100189, 235973, 8119, 276364, 399640, 138922, 792780, 172989, 197945, 83353, 283622, 267365, 276523, 469926, 112563, 64665, 495871, 164122, 167361, 272726, 68788, 165145]
17101A65145L14536k23269K07796o2310j72071O93700A59468Q1296K14099G3180
17090C09597M6898a5982C94661k3962j75197J96994k2071r1426J56803M2487j84946
17079B93343K49070k03479n7069J54937B12062N19101j50395k06402j2035K63994
17069F26325l05945J95286p7126k5009J19170j39919A89782l66N5004J62296J68296
17058E75012G1979M24742J37586k98295j54764L89065j32577Q788A74037N93472
17048G67509k96996j09216J21926k15987M79866l36859J98179A52819L62097L5201
17038E50117k35182L66750j14763B17904M58556j70362j09267J33250n6577J64703
17028F38207j63529R7964J75265l35880k04536L19394B42814K49430J01826k37485
$$ y = [165145, 479681, 256412, 464208, 401898, 229827, 923527, 159468, 240764, 454863, 73180, 309597, 356495, -15982, 394661, 370699, 195502, 392496, 370425, 278999, 435802, 478289, 293343, 542413, 338934, 281865, 436802, 212062, 731163, 580768, 374366, 362331, 626325, 320380, 515666, 438540, 413531, 532701, 392782, 189782, 189416, 244420, 406716, 575012, 71979, 496721, 634307, 336012, 181248, 570313, 437736, 446524, 174037, 767509, 470513, 361297, 483223, 267236, 747102, 410243, 608422, 152819, 514916, 550117, 314935, 681685, 566922, 217904, 676460, 506098, 396831, 530081, 473504, 638207, 474678, 572642, 747907, 412027, 207491, 526885, 242814, 492244, 594070, 356585]
17018C56585K66412k69901J07744L80989B45027K95722o0600n3146K05291l01757
17008C30537R5278P3049K51004l24408q247o1935n0300m6085K07381J94506C18962
16996F04529R944L08235D34709N78507l74275J29427k37142K77358k55835J64271
16986G17020j041k03386O5417J86464P1535k655j05938j48482L18210j80060R6570
16975H13654J82282k96569k14777J33490K55544J33925l20632A24640Q22363m2078
16965I04925J9824k41406k527M9765K14925m38202K77593K14594o1288J05644
16955A043847j77847J1817j31348j2310q9679K48945l9421L93891m29447l5440
16945G83008J72148j34427r0624L60046J11541o9940j68665L50466j94541j88985
$$ y = [356585, 622997, 353096, 460840, 841829, 245027, 540749, 480149, 427003, 632294, 330537, 425815, 498864, 749868, 425460, 417213, 355278, 304978, 258893, 466274, 660780, 318962, 604529, 614473, 922708, 434709, 1013216, 638941, 768368, 531226, 808584, 552749, 717020, 715979, 512593, 578010, 764474, 836009, 833354, 727416, 578934, 897144, 717084, 813654, 995936, 699367, 484590, 618080, 873624, 1007549, 686917, 124640, 947003, 904925, 924749, 683343, 680816, 730581, 945506, 507304, 784897, 999491, 938203, 1043847, 866000, 877817, 746469, 734159, 644480, 893425, 854004, 1247895, 818448, 783008, 955156, 820729, 730105, 1090151, 1201692, 1131752, 963087, 1313553, 1119012, 930027]
16935I30027Q2102k17637J77847j48932p4730M16550P497R9226l4471l04860L54217
16924A286836j86715O3681r8161o4750N7100o445J16945j9349J29940P8113m89745
16913H67450M91445m52355N93238r6841j71692L04314k12371r100L77515m40433
16903A251170j01118K05878J24183j26850L92360o215k59223p6035j45996M28561
16893A686715L6814k4805l32773K70975m4011M24701l69085l7397K83503J21871
16883B016508k52367K02193j24517L76077k39239j41156k8604l0610L16348r0782
16873B003851K21402n22750J73553K30647J69619J2577J55272j16956k98369P5786
16863B104632M44248n90560K12389j91090L12004M17889m55464L03316j67152
$$ y = [930027, 1012129, 794492, 972339, 823407, 748677, 1165227, 1172724, 1271950, 1237479, 932619, 1286836, 1100121, 1163802, 1065641, 1000891, 1057991, 1051546, 1168491, 1149142, 1279082, 1357195, 867450, 1358895, 906540, 1499778, 1402937, 1231245, 1535559, 1323188, 1314088, 1691603, 1251170, 1150052, 1355930, 1480113, 1353263, 1745623, 1739408, 1480185, 1404150, 1258154, 1686715, 1723529, 1698724, 1365951, 1636926, 1592915, 2017616, 1648531, 1611134, 1894637, 2016508, 1764141, 1966334, 1841817, 2217894, 1978655, 1837499, 1808895, 1778285, 2094633, 2003851, 2225253, 1702503, 1876056, 2106703, 2276322, 2288899, 2444171, 2327215, 2028846, 2104632, 2548880, 1958320, 2170709, 1979619, 2291623, 2709512, 2254048, 2557364, 2390212]
16854B390212L62955k96677J11154j2139M16872J35273n14527K20605m412M60505
16844C269821k68151l4239J64546N6636j31441K87422N9447K44198j06008M7915
16834C590146k22935N29102k13857J64083j52759K29361J30617L37773j50697
16825D240834J39342r9142M6940L6672K47896J70060J0563k58092M46090l14209
16815D666954K34614K57379J70412K77035J97268k37419L10647R7430K23935j33933
16805F064322J09423N9117N86984k24810O17118J83810m3274m2294O86662j74547
16795G822511J54333J95048K24589j23465R42992m4775p8989P50553L64827R0669
16785A0298293J4980O16683P8427M21736L94254M47051j17298Q53446j18365J102864
$$ y = [2390212, 2753167, 2456490, 2567644, 2555505, 2972377, 3107650, 2593123, 2813728, 2809316, 3269821, 3001670, 2967431, 3131977, 3188613, 3057172, 3344594, 3404041, 3648239, 3542231, 3590146, 3367211, 3896313, 3682456, 3846539, 3693780, 3923141, 4053758, 4391531, 4240834, 4380176, 4281034, 4327974, 4364646, 4612542, 4782602, 4793165, 4535073, 4981163, 4666954, 4901568, 5158947, 5329359, 5606394, 5803662, 5566243, 5876890, 5974320, 6198255, 6064322, 6173745, 6232862, 6819846, 6595036, 7212154, 7395964, 7352690, 7310396, 7997058, 7822511, 7976844, 8171892, 8396481, 8273016, 9216008, 9171233, 9092244, 9842797, 10207624, 10298293, 10313273, 10929956, 11008383, 11430119, 11824373, 12271424, 12154126, 13007572, 12889207, 13992071]
16775A3992071K15767N56371J55492O46119R08795Q5702R92890P17205O12876
16766A8883288Q21546N91595O19230Q60696J026954R87958R85566P99844J549983
16757B7126660J238640J070364J232447J790396J367288J361376J497463K533366
16749C9218000J750207K098140K343073K498877K432832L139101L183153L184527
16741E9847910L403560L779667M132351M744331M543215M960199N383702O057824
16733I6852759N640658O737336P029429O726539P601984P640870P256161P638603
16725A53124339P460594P006069O428344N910689M626042L374004K367401Q19442
16717A91116924p352k071615l323913m373699n471031o165585o955010p582546
$$ y = [13992071, 14207838, 14764209, 14919701, 15565820, 16474615, 16560317, 17553207, 18270412, 18883288, 19704834, 20296429, 20915659, 21776355, 22803309, 23791267, 24776833, 25576677, 27126660, 28365300, 29435664, 30668111, 32458507, 33825795, 35187171, 36684634, 39218000, 40968207, 43066347, 45409420, 47908297, 50341129, 53480230, 56663383, 59847910, 63251470, 67031137, 71163488, 75907819, 80451034, 85411233, 90794935, 96852759, 102493417, 109230753, 116260182, 122986721, 130588705, 138229575, 145485736, 153124339, 160584933, 167591002, 174019346, 179930035, 184556077, 187930081, 190297482, 191116924, 191109572, 189037957, 185714044, 181340345, 175869314, 169703729, 162748719, 155166173]
16709A55166173p469326p855941p682633p303522p512735p093166o569010o750035
16701I6929805n767421n635304m753926n172534m284894m828738l653492l209889
16693E9623607m004415k619790l089866k747379k761144k205259j941798k242107
16685C8011849k119202j612639j267223j805711j045818j499668j040266j150438
16677B6470884j546791q26840j145780r83991r74458o96657o98747j119289p23530
16668A7754801k67554o23685m42047q52159m87023n97383l19115o18993j66485
16659A3380357q15020k3604m13822l16640m39361l90533k68002l83121m55269
16650I874985j31148o023q50141j03697j94480n16565J54115k96718k91645m4076
$$ y = [155166173, 147696847, 139840906, 132158273, 124854751, 117342016, 110248850, 103679840, 96929805, 91162384, 85527080, 80773154, 75600620, 71315726, 66486988, 62833496, 59623607, 55619192, 52999402, 49909536, 47162157, 44401013, 42195754, 40253956, 38011849, 35892647, 34280008, 33012785, 31207074, 30161256, 28661588, 27621322, 26470884, 24924093, 24097253, 22951473, 21967482, 20993024, 20296367, 19597620, 18478331, 17754801, 17487247, 16863562, 16421515, 15569356, 15082333, 14484950, 14165835, 13546842, 13380357, 12565337, 12541733, 12127911, 11811271, 11371910, 10981377, 10713375, 10330254, 9874985, 9743837, 9737814, 8887673, 8783976, 8589496, 8072931, 8227046, 7930328, 7638683, 7594607]
16640G594607j11111l30435k33108p28k89209l26023r3923j0011L4593k76451
16630E958201l92650n5014j78741M1185k01647k9535J19530m72207P3408k69907
16620D592623P2325l78284L95265K0464m46648j6833j01094l62534L80948m96230
16610C660002K99206J33273p21485K29400K05760k48779J15834N4496p59070K26933
16600C195570j97952P4087K74379o54518m5452O56491q81920M48237r9864l1105
16590B737953k22887J42293k6230J62372k26893j43320j99947J77962J29423j52750
16580B377976j46766J60515k59366j07529J36421j34287N0240m0866R1856j87720
16570A940474M32564o34156J10708K92244l78323J6114L7939P5005l72416M48688
$$ y = [7594607, 7483496, 7153061, 6919953, 6919225, 6630016, 6303993, 6210070, 6200059, 6234652, 5958201, 5565551, 5510537, 5331796, 5372981, 5171334, 5141799, 5261329, 4789122, 4862530, 4592623, 4664948, 4286664, 4681929, 4702393, 4255745, 4238912, 4137818, 3775284, 4156232, 3660002, 3959208, 4092481, 3370996, 3600396, 3806156, 3557377, 3673211, 3727707, 2968637, 3195570, 2997618, 3071705, 3346084, 2691566, 2646114, 3302605, 2420685, 2868922, 2769058, 2737953, 2515066, 2657359, 2631129, 2793501, 2566608, 2423288, 2223341, 2401303, 2530726, 2377976, 2231210, 2391725, 2132359, 2024830, 2161251, 2026964, 2077204, 2036338, 2128194, 1940474, 2373038, 1738882, 1849590, 2141834, 1763511, 1779625, 1817564, 1892569, 1520153, 1968841]
16560A968841j93068q557l9643J7388k23584j14662J69129l52434M31541j65534
16550A489417J34020n27973P44731m25331L27686k04995p4431P5929K28787o1032
16540A706808l70182o4245J48939k32935J06955j70583P4177R7666J4072q6633
16530A224039N9973m9536j31895j17500L29619k79079J47063N4176k75206L79624
16520A341278p2507j61854j44172K24588l08056K83173k32586K15524l34119L35726
16510A146995l88271j29939j97159N37257J22312k09330N0946k82785j18688L43190
16500H74528k70689J80166Q1311N9155J14287l71375j70533N98015l89128J85098
16490H90835q0152j61055N5441k6134J90666M9166j49299k69027L69805L312L117
$$ y = [1968841, 1775773, 1767216, 1727573, 1744961, 1521377, 1406715, 1575844, 1223410, 1654951, 1489417, 1623437, 1095464, 1840195, 1414864, 1742550, 1537555, 1463124, 1539053, 1767840, 1706808, 1336626, 1272381, 1421320, 1188385, 1295340, 1124757, 1198934, 1296600, 1310672, 1224039, 1284012, 1234476, 1102581, 985081, 1314700, 1035621, 1182684, 1236860, 961654, 1341278, 1268771, 1106917, 962745, 1187333, 879277, 1162450, 929864, 1145388, 811269, 1146995, 758724, 628785, 431626, 968883, 1091195, 881865, 932811, 650026, 531338, 874528, 603839, 784005, 865316, 924471, 1038758, 667383, 496850, 1094865, 705737, 890835, 810683, 649628, 705069, 678935, 869601, 918767, 769468, 500441, 870246, 873558, 876675]
16479H76675j93644K02872k64567M19K22585l29819J83786M617j8651J57086j71225
16468F70134O3099o8485K05043k11631P7441O2564Q6311j88353k09412J97392
16458F84103j8069O8893k97413J66182k20492K97806B37047K89259J4595j76204
16448C64697K52360j36956R3839j12413J87459n2438K49868C70779J62062M07443
16438I40284m01154J1143J47502J5375j88912k5835N4670K99912l34814J6561
16428E34732K2540R6434l24259M90249l85172m1391o5923L54565l16760L66754
16418G31769l37176J06667A18853J81633J40398q4036L08953j54646L4615j47510
16408C98260K45922k95647p9411J90924j57343k5321P2359j43461K57187B8394
$$ y = [876675, 683031, 885903, 621336, 621755, 844340, 514521, 698307, 702924, 684273, 841359, 670134, 733233, 664748, 869791, 658160, 735601, 798165, 884476, 696123, 486711, 684103, 666034, 734927, 437514, 603696, 383204, 681010, 237047, 526306, 540901, 364697, 617057, 480101, 573940, 461527, 648986, 596548, 846416, 370779, 532841, 940284, 539130, 550273, 697775, 713150, 524238, 498403, 553073, 852985, 518171, 534732, 557272, 653706, 329447, 819696, 434524, 393133, 327210, 681775, 365015, 731769, 394593, 501260, 118853, 300486, 440884, 356848, 665801, 511155, 545770, 398260, 644182, 348535, 269124, 460048, 302705, 277384, 349743, 206282, 463469, 28394]
16397D78701m0254q0861A24473N8497J57098J083L70177A33127J14055J93505
16387D40687K98121A01154N41041A41594M61233j01707A92225L71503B78860K3404
16377C02264L1071d1342C75646j71585J09416H0061M54171N009j65253A07102
16366F02594p2944k50434K15460j07274k2399j08429J51079A51224J35159D8467
16355B87921l6555J59697J6691B12463J9K55857B16241K45850K4955J60650k20389
16344D27307r9344J90117k06477j26147L68795F4918N1991K85863j6747j02052
16334B83973J20669j80340J80841L49814b14453E29020a98164A30736K29092K24192
16324E84020A87296L14551k25384d0888D39633j98245n3894L6298J28638F5281
$$ y = [478701, 438447, 357586, 124473, 182970, 340068, 341151, 711328, 133127, 247182, 440687, 738808, 101154, 642195, 141594, 602827, 501120, 192225, 563728, 278860, 302264, 333335, -41342, 375646, 204061, 313477, 80061, 534232, 539241, 373988, 107102, 602594, 529650, 279216, 494676, 387402, 365003, 256574, 407653, 151224, 286383, 48467, 287921, 251366, 411063, 427754, 212463, 212482, 468339, 216241, 462091, 487046, 647696, 427307, 327963, 518080, 311603, 185456, 554251, 64918, 116909, 402772, 386025, 283973, 404642, 224302, 405143, 754957, -214453, 529020, -198164, 130736, 359828, 584020, 187296, 501847, 276463, -40888, 439633, 241388, 187494, 223792, 352430, 65281]
16313D34741A67817P1467j16062A0630N40259a3458A15138M17230B63081J75143
16303D38224j51792J61367j27476F7110K20800a03809A97375n5937b86875D87039
16292H9078a19381F3032L60366r3869J37606B08901L3812r8349O1720a71290C95882
16280a32534D15957A00971R6466r3176D0339K69159l0721C8966M37142a4515A56520
16268A57997N5377d4878B37701A1215J76917d6318B95790n180J20190A0399M70015
16257D80414A05012a54939e4940D7179K3379K56086j43014M33783k71371O4431
16247D10473i877A56691G2639J54928g6518K8916C32834d0033C82506e3222k6314
16236g9536I9110L39199A99900R5987a77418A80031K29828j30102n283J1769j12513
$$ y = [434741, 167817, 239284, 123222, 10630, 550889, -13458, 115138, 532368, 263081, 438224, 286432, 447799, 320323, 67110, 287910, -103809, 197375, 141438, -286875, 487039, 89078, -119381, 63032, 423398, 329529, 467135, 208901, 242713, 144364, 206084, -171290, 395882, -132534, 415957, 100971, 197437, 104261, 40339, 309498, 278777, 38966, 476108, -14515, 156520, 157997, 213374, -44878, 237701, 11215, 188132, -46318, 295790, 290610, 410800, 10399, 480414, 105012, -154939, -54940, 47179, 70558, 326644, 183630, 617413, 346042, 410473, -9877, 156691, 72639, 227567, -76518, -47602, 332834, -40033, 382506, -53222, -79536, 99110, 438309, 199900, 295887, -177418, 180031, 409859, 279757, 274474, 286243, 173730]
16225A73730j964m7616A5194J24638N6647a7155G9395K38342D1577J61460J16085
16214C19122A05030K55763g578F2100J59754C8326b26783B08325N6839f0117J5758
16203d4359B3639J22766a11542A16238b95059a6397I9128a2954B5782J35585i2323
16191d939A11787l5845K5016J5321n3798b54425q8732A46792C9694Q023J35877
16180A83594D6135O6859a7795A92592i469D06456b90927P7925J06286B23925b29337
16168A76740b3071B33250b3876J1514G7022J17150n1979n109J75955P3931f7917
16156A60262K66838A9058J79629a46715B15641n8845b25710B53788k0562c63731
16145g1367b3346A66806G9643J04202k3006E8253g4767o4202A01039B4798a6458
$$ y = [173730, 171766, 124150, 15194, 139832, 196479, -17155, 79395, 317737, 41577, 203037, 319122, 105030, 360793, -7578, 62100, 221854, 38326, -226783, 208325, 265164, -60117, -44359, 23639, 146405, -111542, 116238, -295059, -16397, 99128, -12954, 25782, 161367, -92323, -4939, 111787, 75942, 100958, 116279, 62481, -254425, -343157, 146792, 39694, 47717, 183594, 46135, 112994, -17795, 192592, -9469, 406456, -290927, -213002, -106716, 223925, -229337, 176740, -23071, 233250, -23876, -12362, 77022, 194172, 142193, 137084, 313039, 386970, -67917, 160262, 427100, 19058, 198687, -146715, 215641, 156796, -225710, 253788, 233226, -363731, -71367, -23346, 166806, 79643, 183845, 160839, 58253, -74767, -138969, 101039, 24798, -16458]
16133H6145L2603j62J34447a93704B95091c0555A29273H193J82044J11045c5004
16121D42983b0967E8811K4517h9468C159b1973A34659g3482a1207j01408A59311
16109B2860O8868b7085j44562m1279N1177N203A51332R4480K99180g0992A33968
16097h9319A58588M8333c3588B05553a70697A32856a87071c1680j20092j50532
16087c02304B47319E3173a20978E5987a89019O0146A9270K00225b01782h7564
16076e1598A77826b88775A6798L2048J27659i58k50r2374E8903a90159B58816
16064A67704a495j438k26048A54833O9409a4781k68071G0825a67690K356k20596
16053c85930J69651A87680I0962c23419d9633A35033M5993I193J31023P9597p9847
$$ y = [86145, 118748, 118586, 253033, -193704, 295091, -30555, 129273, 8193, 190237, 301282, -35004, 442983, -20967, 58811, 83328, -89468, 3159, -21973, 134659, -73482, -11207, -112615, 159311, 22860, 91728, -27085, -171647, -212926, -161749, -156546, 151332, 245812, 544992, -70992, 133968, -89319, 158588, 206921, -33588, 205553, -170697, 132856, -187071, -31680, -151772, -302304, 247319, 53173, -120978, 55987, -189019, -128873, 19270, 219495, -201782, -87564, -51598, 177826, -288775, 16798, 48846, 176505, -958, -1208, -93582, 58903, -190159, 258816, 167704, -1495, -2933, -228981, 154833, 224242, -14781, -282852, 70825, -167690, -165334, -385930, -216279, 187680, 90962, -323419, -49633, 135033, 181026, 9193, 140216, 219813, 139966]
16042A39966a92307r5372P5731C5350c33601C41386a35687B50199d8519B08383
16031f3866o0075K1765n5260g2963j87165g0932c901C0702d973j67231O304j43813
16019c09713B62957d1814D2989K10308j15463a86493a3077p0766D3726c04385
16008c29873d8536J1882j09891c4176j51449j18816i9743B5359b2270l0391C57250
15996C1101a58533a3578D11061j61638a05724A62904C0114d52960J63327A10485
15985b153j47549D15937j146j94199O9533N3052q3819a08676B08334M9281n8502
15974A99113a83466I0865B8242K06035c40245a5470l83920a57753e3382j84818
15964b38200l1044f1552l14646B52948n5555F4616J10895a96951A13432M8290
$$ y = [139966, -192307, -287679, -211948, 35350, -333601, 341386, -135687, 250199, -48519, 208383, -63866, -123941, -102176, -157436, -72963, -260128, -70932, -3901, 30702, -4973, -172204, -165900, -309713, 262957, -41814, 42989, 253297, 137834, -186493, -13077, -83843, 43726, -304385, -329873, -48536, -36654, -146545, -34176, -185625, -304441, -99743, 25359, -22270, -52661, 357250, 31101, -158533, -13578, 411061, 249423, -105724, 162904, 30114, -452960, -289633, 110485, -2153, -149702, 415937, 414791, 220592, 290125, 343177, 259358, -108676, 208334, 257615, 199113, -183466, 90865, 28242, 234277, -340245, -15470, -399390, -157753, -53382, -238200, -269244, -61552, -376198, 252948, 197393, 64616, 175511, -196951, 113432, 161722]
15954A61722O7182i1720A55236a82535A01651a59347B2492a04331k00528G6701
15943a70269J2087h84j13584j74602i6491M6261B00754f5283j1597l0365n0845
15932a58090A46444B8211P6735a03606l34125G3780a3745l6515j0460j35836j53747
15921c50303M351e5811b3294F4476a72554k0003D9518N1479c0829k12215c70A95684
15908b53346A9726c6262F501L6497J15527b9952l32418A36190K99833a30929k0238
15897a51167l235c4115j42134r8050h0022I1273c5390j898C35647I0847d0785
15885a79305A21262J88715a7979l2186G5995K03090j31298b74024J10317P6063
15875h7644j48367R8069M7217A42465A5213J78379c33414J29288b7312k39396
$$ y = [161722, 228904, -91720, 155236, -182535, 101651, -159347, 22492, -104331, -304859, 76701, -170269, -158182, -884, -114468, -289070, -96491, -50230, 200754, -65283, -76880, -107245, -158090, 146444, 28211, 104946, -103606, -437731, 73780, -13745, -50260, -60720, -196556, -350303, -345952, -55811, -23294, 64476, -172554, -192557, 49518, 100997, -30829, -243044, -370, 195684, -253346, 19726, -36262, 6501, 42998, 158525, -29952, -362370, 136190, 436023, -130929, -151167, -154402, -34115, -176249, -274299, -80022, 91273, -35390, -37288, 335647, 90847, -40785, -179305, 121262, 309977, -17979, -50165, 75995, 279085, 147787, -274024, -163707, -87644, -236011, -137942, -90725, 142465, 15213, 193592, -333414, -204126, -27312, -266708]
15865b66708k4126L2785B45302a85971E3019b0404H7602l9203R2917a14373F5834
15853c10364h8415m5505L3034A29962l428J36383M6123D9378d253G0475a5360
15841A62969a95893A11773C4509J3627a42478O0862l4388A51007b81586R8870
15831a82716A48842a79327A1870a43297j81677A91058a9740k36122f3489F5381
15820a31454B6982b44671A00699b29608f8583j83528N8853M2985c8648l4071G5022
15808b16401f7003K9957j67968b4172n4444b8076N09C65h5506c4430B5157b6762
15795b12692A36865o1499K01772A10621l7577a50859O5058P585b265k50976J18698
15784a34543n58H4306b03463M0417f7904E1830J61504a21493J9848a7154k52056
$$ y = [-266708, -290834, -258049, 245302, -185971, 53019, -20404, 87602, 48399, 141316, -114373, 65834, -310364, -88415, -133920, -100886, 129962, 126534, 262917, 309040, 49378, -4253, 70475, -15360, 162969, -195893, 111773, 34509, 48136, -142478, -81616, -116004, 151007, -281586, -182716, 148842, -179327, 11870, -143297, -324974, 191058, -19740, -255862, -63489, 65381, -131454, 26982, -244671, 100699, -229608, -68583, -252111, -193258, -150273, -38648, -72719, 75022, -216401, -67003, -37046, -205014, -24172, -78616, -28076, -27567, 365, -85506, -34430, 25157, -26762, -212692, 136865, 75366, 277138, 110621, 73044, -150859, -85801, -78216, -2265, -253241, -134543, -135101, 84306, -203463, -163046, -67904, 51830, 213334, -121493, -101645, -17154, -269210]
15773b69210B6939e15394a52778r1460O441D13060A3429b8043j37107B4072a43194
15761a47287l94843D23627k04765a17914C37222h238j63470B04319a10425j39982
15751b50407A40540M976k7514R2313a59322A92239O0342b51577E021c9951E9492
15739A6264a5921j17205K8635B3393J349K44508k233b95496a8295B06272H4859
15727B03443a43081o8667b3028k0525a0878A01848a03028g039A465a62686K9683
15716a33003A04094c32199f4342A07775a76703k1742A09108n0677c0998B22265
15705b13265M8010L1115j18729O8154E4896g4405j07288A02005a37858H3015g38
15693a43733j12987F1513O3380a52060b0258O929B58979h9613m17624G8064a55426
$$ y = [-269210, 26939, -515394, -152778, -244238, -237797, 413060, 13429, -28043, -165150, 24072, -143194, -147287, -542130, 423627, 218862, -117914, 337222, -8238, -171708, 204319, -110425, -250407, 140540, 145516, 118002, 210315, -159322, 192239, 252581, -251577, 5021, -39951, 59492, 16264, -15921, -133126, -104491, 23393, 24742, 269250, 267017, -295496, -18295, 206272, 84859, 203443, -143081, -211748, -23028, -43553, -10878, 101848, -103028, -7039, 1465, -162686, -133003, 104094, -332199, -64342, 107775, -176703, -198445, 109108, 58431, -30998, 222265, -213265, -165255, -134140, -252869, -184715, 54896, -74405, -181693, 102005, -137858, 83015, -738, -143733, -256720, 61513, 124893, -152060, -20258, -13329, 258979, -89613, -507237, 78064, -155426]
15681B04977c20285p9030b1558j92383j35382R0415c7247j81332I7547d7319o3499
15670a10818j18796C62892b34177E5954A6365a90215B10453q1838J99778b19907
15659a71984B17447b06148A44141a54325n2868A48403O3864i5860k39570a13326
15648g3607A91910b8599A77240e5635G8966c5611k18611F4649J91793a69762M1037
15637a28725a1404k08491M1904B38291b59745j2478C4888R9638o6963a39080A37608
15625f9352n6707A84733j7405C9272J54557b73938P8853A27998n3994K42229b88292
15613f7936K1857m4036a4659k02647B38980I2818f5552j67437f0940k33633j83724
15602d78297E8586h4410B46753h5387j85803d7899A2209b50014H1766b87395A00114
$$ y = [204977, -320285, -399315, -21558, -213941, -349323, -258908, -37247, -218579, 97547, -47319, -110818, -229614, 362892, -234177, 55954, 16365, -190215, 210453, 128615, 328393, -219907, -171984, 217447, -206148, 144141, -154325, -207193, 148403, 212267, -95860, -335430, -113326, -73607, 191910, -28599, 177240, -55635, 78966, -35611, -254222, 64649, 256442, -169762, -128725, -11404, -219895, -177991, 238291, -259745, -272223, 34888, 134526, 67563, -139080, 137608, -69352, -126059, 184733, 167328, 39272, 193829, -273938, -195085, 127998, 74004, 316233, -288292, -67936, -46079, -90115, -14659, -217306, 238980, 92818, -65552, -232989, -60940, -294573, -478297, 58586, -84410, 246753, -85387, -271190, -47899, 12209, -250014, 81766, -287395, 100114]
15590e1188j71296A67502C7640K06658Q5176a19325E2745a18994j8115F8084O5946
15579A34030f6697A05350J0494a74934A88078B6053N5788a36121B24485A6845
15568g7847d40B4103K5149a10108A88193q545h5446c016B9481b37560o7063D836
15555E1411f4355j26366d904q6022f48j8768j5955B0974a16599j17581A05158
15543a73255B08671E7085M0115h6154j17595D1828J91387c05024R0501H2265f2568
15531I1179k8315J0684c6886B07499M4111p8945m9404g9206l2226A76565d3459
15519B72260A18395h3373A31679o4736c2988p1037D5242a15594H4128c003j08721
15508a11724J411j52378b6016a49j65994p21J0398A82222a9490k30262e6774m5450
$$ y = [-51188, -222484, 167502, 37640, 244298, 329474, -119325, 52745, -118994, -137109, 68084, 134030, -66697, 105350, 115844, -174934, 188078, 26053, 81841, -136121, 224485, 16845, -77847, -440, 24103, 49252, -110108, 188193, 179648, -85446, -3016, 29481, -237560, -304623, 4836, 51411, -64355, -190721, -4904, -90926, -648, -19416, -35371, 20974, -116599, -234180, 105158, -173255, 208671, 57085, 97200, -86154, -203749, 41828, 233215, -305024, -214523, 82265, -62568, 91179, 62864, 73548, -36886, 207499, 251610, 172665, 123261, -79206, -111432, 176565, -43459, 272260, 118395, -83373, 131679, 66943, -32988, -104025, 45242, -115594, 84128, -3003, -111724, -110313, -262691, -26016, -149, -166143, -166864, -156466, 182222, -19490, -249752, -56774, -102224]
15496a02224A09053M0982a52530A56366j9226c03618G6739M5543d15669A24061
15485B4599b50013J06181d6347k35288a6380D5607a56955L5277A23575J17882
15475B41457a13336A71502E4505K3618J97464a17618k48351B2500i0468A24993
15464E8324a67237j17430I4368k4090d4841A37656c68683a82642M7154k3805C11667
15452A75125p8428B1313J76375f9328p8415Q921m175e3293E610h0163B37369a72366
15439b14004R5760o2165A12541Q139J55262a54595g4864G217d919j19547L9745
15428h4721A21640b73298P2887d252B74450a57386K9888r5875a4014k33277B6000
15416C2339j4009J86486f0759C8769J60533a01019c3096r5974f0817j61664J06623
$$ y = [-102224, 109053, 150035, -152530, 156366, 137140, -303618, 76739, 122282, -415669, 124061, 24599, -250013, -143832, -46347, -281635, -16380, 45607, -156955, -121678, 123575, 241457, -113336, 171502, 54505, 78123, 275587, -117618, -365969, 22500, -90468, 124993, 58324, -167237, -284667, 94368, 70278, -44841, 137656, -368683, -182642, -135488, -159293, 311667, 175125, 96697, 21313, 197688, -69328, -147743, -138822, -142997, -53293, 5610, -80163, 237369, -172366, -214004, -118244, -180409, 112541, 120680, 275942, -154595, -74864, 7217, -4919, -124466, -84721, 121640, -273298, -200411, -4252, 274450, -157386, -127498, -223373, -14014, -247291, 26000, 32339, 18330, 204816, -60759, 38769, 199302, -101019, -33096, -129070, -60817, -222481, -115858]
15405a15858N2898n8890A72853c22354c3265D6626b46448C09368a065j28547A07592
15393c37106r655Q3654A75907b4132m8989r2751N8748j0886G7559C8330J1829
15382E0159c60444I5587J7852b04644A33936J48917a39357G397d4265r6538A2782
15370f1670A22743d7287a9505B51847A01500K54095j14844J70370j84819I1245
15359c623A38536l6080l2029e3981D7789O0340J72392J15861h0357F5414a42033
15347C0648o111a13702q6631O1299A49213b8612j99027B01628p7829a87426B61703
15335a51763A1977L935f6729k4236A85496L2464A0651N6029a47699q7397A31570
15323b77177B0285P1204P0214b00714D0227A5478J24010C1512a05969d8432r9700
$$ y = [-115858, -62960, -121850, 172853, -322354, -33265, 46626, -246448, 309368, -1065, -129612, 107592, -337106, -346761, -263107, 175907, -24132, -73121, -165872, -107124, -118010, 77559, 38330, 50159, -360444, 95587, 113439, -204644, 133936, 282853, -139357, 7397, -44265, -140803, 12782, -61670, 122743, -47287, -19505, 251847, 101500, 355595, 240751, 411121, 226302, 91245, -3623, 138536, 102456, 70427, -53981, 47789, 108129, 280521, 396382, -80357, 65414, -142033, 30648, 24537, -113702, -200333, -139034, 149213, -28612, -227639, 201628, 123799, -187426, 261703, -151763, 11977, 15912, -66729, -90965, 185496, 217960, 10651, 66680, -147699, -235096, 131570, -277177, 20285, 91489, 161703, -200714, 40227, 15478, 139488, 31512, -105969, -48432, -148132]
15312a48132P3417I9907a74548H4169K83295m5468d4542C05741H7533k9695a46127
15300c6717A50809a62189A3477f2372A94021Q0983g148r6162A43821a58199b0313
15288I6032O0080A3376J02280a4452G8229c13368D4514R6974b03099K5138c1641
15276g8631n386j8906A43202a28205A08424k7775R087Q5329e8900j19911n6383
15265b35194D9M3632a06001l619H2809B1670J20840j5226k5894A0824a84720j27850
15253c12570M9592J17386A81252H031e465D9152m431h3416A49813J03141F4036
15241G5963b55080j2919C53701b87543A09452f3591K4189A53083Q0010b16098
15230B40443G1491J40644r6558N3844c9651C95381j16083o5840F1917a27284k03525
$$ y = [-148132, -74715, 99907, -174548, 84169, 367464, 321996, -44542, 305741, 87533, 57838, -146127, -36717, 150809, -162189, 13477, -62372, 194021, 275004, -7148, -103310, 143821, -158199, -20313, 96032, 156112, 13376, 115656, -14452, 78229, -313368, 44514, 141488, -203099, -177961, -31641, -78631, -84017, -102923, 143202, -128205, 108424, 80649, 89736, 175065, -58900, -178811, -235194, 49, 43681, -106001, -109620, 82809, 21670, 142510, 127284, 101390, 10824, -184720, -312570, -262978, -145592, 181252, 8031, -5465, 49152, 44721, -83416, 149813, 252954, 64036, 75963, -255080, -267999, 353701, -287543, 109452, -63591, -39402, 153083, 233093, -216098, 240443, 71491, 212135, 115577, 169421, -39651, 395381, 279298, 213458, 61917, -127284, -330809]
15219c30809C25214a04703G8469J76877A11815P1130C1690J05260O7872J76323
15209C81145b6160l6624B83799a14517D93513b42265L1642A09826l8573K4413
15199I5666l7532a20745K7679q8713N6578A26903a08769j47335b5336j18296j17264
15188b60896C7995e5062O880n9274e606A41514d1233a5944A43242J8835Q6790
15177B48867n9930J52240P0552c18220c4762m1148C67236P1645a64158B00767
15166B0554J92868i371B97655I9488a35564K7184g618l00446D82364C8435a26318
15154b78672f0068j11831A64141K0676N6946F3844c282A33651K84910j44268a24376
15142e7433F7123a76215A72715c10954G8653J81295H7249a68922B30494a3647
$$ y = [-330809, 325214, -104703, 78469, 255346, 111815, 182945, 31690, 136950, 204822, 381145, -26160, -62784, 283799, -114517, 493513, -242265, -210623, 109826, 71253, 95666, 58134, -120745, -93066, -181779, -125201, 126903, -108769, -256104, -25336, -143632, -260896, 37995, -55062, -48182, -107456, -5606, 141514, -41233, -15944, 143242, 162077, 248867, 188937, 341177, 411729, -318220, -34762, -75910, 367236, 438881, -164158, 200767, 20554, 213422, -9371, 297655, 99488, -135564, -108380, -7618, -308064, 482364, 38435, -126318, -278672, -60068, -171899, 164141, 184817, 241763, 63844, -3282, 133651, 418561, 274293, -124376, -57433, 67123, -176215, 172715, -310954, 78653, 259948, 87249, -168922, 230494, -13647]
15131C17442r8426j07129j4563k7674M5315e6509D3709e4113I5905K60165j00682
15120B55388k2842j13996j3798a79882I8069a32819B46826a26627g856A53769
15109D5865b4926f89A2257N6390O2287i6305B21520F9738l178Q0662Q9934E6186
15096A78024n1106E0604J00194I910J33567O6947b51370B24938a49770k7301E93901
15084B87113h0846C59129d2327K0243C33982r0704C019J79908D6673a53335A09291
15072e2291I9945J07648o350C4548J11560k8282K01194H0884J50065l4299H4023
15060A6020J77404K07443D2493J98506j18866a08079B0562a49288l165D8894J84807
15049B33701j04504a87970C55187A20599R1104f793A1419K22532A0477L16076
$$ y = [317442, 219016, 111887, 97324, 69650, 114965, -56509, 43709, -54113, 95905, 356070, 255388, 232546, 118550, 104752, -179882, 98069, -132819, 246826, -126627, -7856, 153769, 45865, -24926, -689, 12257, 68647, 130934, -96305, 221520, 69738, 66560, 147222, 237156, 56186, 178024, 126918, 50604, 150798, 9910, 143477, 210424, -251370, 224938, -149770, -177071, 593901, 287113, -80846, 359129, -42327, -22084, 333982, 243278, 3019, 182927, 46673, -153335, 109291, -52291, 99945, 207593, 201243, 34548, 146108, 117826, 319020, 80884, 230949, 196650, 84023, 16020, 193424, 400867, 42493, 240999, 122133, -108079, 20562, -149288, -152453, 48894, 233701, 129197, -187970, 355187, 120599, 211703, -6793, 11419, 233951, 10477, 326553]
15039C26553A04852K9645J89077A38125K71183f0701I2950R9305f3654j56452
15029b20106D765K81146j06710K1760O3687f6264C24352d922A58045e0A93625
15017B08502K37075c1044q8898o8416B24940B9256b9679a062E3180M1874K48708
15006C43762E0987P206J58394D2976h333C26041A31621B4082J93454J47772j39755
14995B25553R9164J89062a45555N8273B65239j27307K96036r3847I977J87457
14985A97434K89624I6890L0527J949Q8027K2617G7103K46201A3586i1984k480
14974i4464C58291m8224j30853M52377B52316B0270J58507M7054K62799A67134
14963A29667K71976C109c2378C16189r8420o414J1765A8916O3882J70797j13756
$$ y = [326553, 104852, 134497, 323574, 138125, 409308, -60701, 92950, 192255, -63654, -220106, 4765, 285911, 179201, 200961, 264648, -66264, 324352, -4922, 158045, -50, 193625, 208502, 445577, -31044, -119942, -188358, 224940, 29256, -29679, -1062, 53180, 95054, 343762, 50987, 58193, 216587, 42976, -8333, 326041, 131621, 24082, 217536, 365308, 225553, 324717, 513779, -145555, -87282, 265239, 137932, 433968, 340121, 9977, 197434, 487058, 96890, 127417, 129366, 217393, 240010, 77103, 323304, 13586, -91984, -94464, 358291, 310067, 179214, 631591, 252316, 20270, 178777, 225831, 488630, 167134, 129667, 401643, 3109, -32378, 316189, 217769, 211355, 223120, 18916, 82798, 253595, 139839]
14952A39839p023J5808K47567j20626A26703J15813q3963F4152L16196K57774
14942F38122I5993Q6534L6873r5485J19324K11765A70281K11611D7839R4461K67533
14931D09833A27068J68193j1994l9242J0653J92676k03251A2160L52688J99445
14921E64293D6434h8524B16242C0076P35813l35216K77562D1627K33310m979J12075
14910C82033E4473P0856K4186j9623m6858J2007c1174F05165B46974L8368K09939
14899D95281H4339K39691Q5036A00157J45815n4180k6442o3651A5387L48698O8726
14888D32811j2200j66574N97449B16274c5976B94118R7997J69427B13257J45055
14878C58312H4035K5155C7943L15726A28956L56117Q6744I9301J90775Q0151J37139
$$ y = [139839, 132816, 148624, 396191, 275565, 126703, 242516, 158553, 64152, 380348, 638122, 95993, 182527, 219400, 123915, 243239, 455004, 170281, 381892, 47839, 142300, 409833, 127068, 295261, 283267, 244025, 254678, 447354, 244103, 12160, 364848, 564293, 46434, -88524, 216242, 30076, 765889, 430673, 708235, 41627, 274937, 269958, 382033, 54473, 125329, 149515, 129892, 83034, 95041, -31174, 605165, 246974, 285342, 495281, 84339, 324030, 409066, 100157, 245972, 191792, 165350, 101699, 15387, 364085, 432811, 420611, 254037, 851486, 216274, -35976, 294118, 392115, 561542, 213257, 358312, 84035, 109190, 37943, 353669, 128956, 485073, 571817, 99301, 290076, 370227, 507366]
14867E07366Q7423j62059A30247J32662j27322J28226J14725J06195p291A7859
14856G88806A90219J57091J09802Q6604B13764L27451j31382j09849L0834M1507
14846C72325j10403D9801L99420A58070N92803C55381K84621j3478F8715K24218
14836B92933G9772O1241K53810l6379A46419J49414O1514b5476C62499j32943
14826B29556Q3018J4505p8927n6953J86006J96053k17112j51623K5405K51642
14816D81570j56313J46583p5107j92361N00566j63847B28601K77937K30118p5982
14806F60674Q386j38321j14865L22918l38243J67748k8384N8674j44541K17983
14796F72029j09604p9423K25678C12325K39616j52474A85113K84229j12497J65381
$$ y = [507366, 594789, 432730, 130247, 262909, 135587, 263813, 378538, 484733, 477442, 17859, 788806, 190219, 347310, 457112, 543716, 213764, 541215, 409833, 299984, 330818, 372325, 261922, 49801, 449221, 158070, 750873, 355381, 640002, 626524, 68715, 292933, 79772, 141013, 394823, 358444, 146419, 295833, 357347, -25476, 362499, 229556, 312574, 327079, 248152, 191199, 377205, 573258, 356146, 204523, 229928, 481570, 325257, 471840, 396733, 204372, 704938, 541091, 228601, 506538, 736656, 660674, 669060, 530739, 415874, 738792, 400549, 568297, 539913, 598587, 454046, 672029, 562425, 483002, 708680, 312325, 551941, 399467, 185113, 469342, 356845, 522226]
14786E22226k8527k19838J47956R4655j7029j1082P0493K5565j4646j71104L7338
14775D36007n7372J14470l8793L7757K560K6088M8497k62004K59303J73241K6906
14764G66660q8873j02385j94138N26595D29548A82578L43494K6799J29717p3122
14754F09466P4295j36248l4183J33547k2044k86681J43772K27058k76003N36598
14744I69577k32125K7740l10357L38249l22568K40561k16817J07298j2545j82019
14734D06994m0859k9682M01783j25319k86953L63588j86302K95163K3844j58029
14724F64228J54523k05671K99693l35147J98953r9750p9310k69642M48417k27885
14714E48409J65026o2535J13699j29422N0096j4558m9983J27813k56868L23460
$$ y = [522226, 493699, 273861, 421817, 516472, 499443, 488361, 558854, 584419, 569773, 398669, 436007, 378635, 493105, 454312, 492069, 494629, 520717, 569214, 307210, 566513, 739754, 766660, 677787, 575402, 381264, 907859, 429548, 182578, 526072, 552871, 682588, 609466, 683761, 547513, 513330, 646877, 624833, 338152, 481924, 708982, 432979, 969577, 737452, 765192, 454835, 793084, 470516, 711077, 494260, 601558, 589013, 406994, 366135, 336453, 738236, 612917, 325964, 689552, 503250, 798413, 822257, 664228, 818751, 613080, 912773, 577626, 776579, 676829, 597519, 327877, 776294, 548409, 713435, 650900, 764599, 635177, 685273, 670715, 620732, 748545, 491677, 815137]
14704H15137r218N2794j38951j09056R2810M8912j22432j9535q6901K61832j81409
14693F03983J77261K02997m0601n84K7909j23130k35071J65239N8384J00608p886
14682I29109J02009k08276J63252o3497j59545j79384M27473m4881J79173l95757
14672G49676K08786j25839p2323J14255J23848Q1566l69714K67314j19288K77815
14662A136096J11243l27112Q1698o1427R2841K2137o887J09961D62845P71639
14652A234484l12844P6712j11980L958L85204k91300j18875M24997p0822k16129
14642A003405L1644R3463r1995j45135L58591J49785k01563L8971N3813k13853
14632A077126J8628J25556k40761K83870O6730j22533l83938K40502L48255J70260
$$ y = [815137, 805919, 858713, 719762, 610706, 703516, 752428, 629996, 610461, 523560, 785392, 603983, 781244, 984241, 943640, 943056, 970965, 847835, 612764, 778003, 836387, 936995, 929109, 1031118, 822842, 986094, 922597, 763052, 583668, 1011141, 966260, 1145433, 749676, 958462, 832623, 760300, 874555, 998403, 1079969, 710255, 977569, 858281, 1136096, 1247339, 920227, 1001925, 940498, 1033339, 1055476, 1048589, 1158550, 462845, 1234484, 921640, 998352, 886372, 890330, 1275534, 984234, 865359, 1290356, 1219534, 1003405, 1035049, 1128512, 1036517, 891382, 1249973, 1399758, 1198195, 1237166, 1290979, 1077126, 1095754, 1221310, 980549, 1264419, 1331149, 1208616, 824678, 1065180, 1413435, 1583695]
14622A583695l00855p377j71045N68732l68004K6474j51995l2127L60167J45590
14612A653255l53317L62188l69643K68136r8473j21680J70807j12897K02821j74313
14602A426884K98472l28088r9888M0303R0788P738J15197J38735J08701n84669
14592A214173N75022n4376k46790q2000L57219q8454k01207M77600k15534J64457
14582A900110j66204K72730j25430l87849K51268K26243J54679m5038j56576q4661
14572A839272k1720J79685p6834K48774q3092r6895L79046l28116J60591K6070
14562B226781l6725L31953P6799J51166j05644L43691j21405J86570j3105O63546
14552C703627p5555Q41235J095769J965392K844591P304636J2049892J0874795
$$ y = [1583695, 1282840, 1275463, 1104418, 1673150, 1305146, 1331620, 1179625, 1147498, 1507665, 1653255, 1299938, 1662126, 1292483, 1560619, 1462146, 1340466, 1511273, 1398376, 1601197, 1426884, 1725356, 1397268, 1297380, 1337683, 1428471, 1436209, 1551406, 1690141, 1798842, 1214173, 1789195, 1734819, 1488029, 1406029, 1763248, 1674794, 1473587, 1951187, 1735653, 1900110, 1733906, 2006636, 1881206, 1493357, 1744625, 1970868, 2125547, 2080509, 1923933, 1839272, 1817552, 1997237, 1920403, 2169177, 2086085, 1989190, 2368236, 2040120, 2200711, 2226781, 2190056, 2522009, 2598808, 2749974, 2644330, 2988021, 2866616, 3053186, 3040081, 3703627, 3628072, 4469307, 5565076, 7530468, 10375059, 17679695, 29729587, 40604382]
14544D0604382j7647474I927759D931901j544694r23540k14752N2295j80334k4896
14535B095980l53351K40240j60982n2268J25640M6328L41450n8662k15518R8006
14525B106863O3747K54107m4626j91435q0333p0159L66331k351J4492k3905M48416
14514B841147j16094N5664j58544p034P1346m6097J54053j05596R2166N0724K27839
14503C059574n90820R6709J69328L96760N7787j94542l00143K89844L12157j44159
14493C152495k67359K95119j54476O5353L60589q7637j49774J7658j95751N03662
14483C539879k13452M67204L2789J52640k93172j58244K03820n1141J21102N8966
14473C860391q6234K24047N9615n2664K16353P2211k73419K39003K9601Q6483
$$ y = [40604382, 22956908, 9927759, 4931901, 3387207, 2463667, 2248915, 2301210, 2120876, 2095980, 1742629, 1982869, 1821887, 1769619, 1895259, 1941587, 2283037, 2224375, 2008857, 2106863, 2170610, 2424717, 2380091, 2188656, 2108323, 2038164, 2404495, 2402144, 2416636, 2392731, 2841147, 2725053, 2780717, 2622173, 2615139, 2686485, 2640388, 2794441, 2688845, 2781011, 2831735, 3059574, 2468754, 2565463, 2734791, 3131551, 3189338, 2994796, 2694653, 2984497, 3296654, 3152495, 2885136, 3180255, 3025779, 3091132, 3451721, 3364084, 3214310, 3231968, 3036217, 3539879, 3326427, 3793631, 3826420, 3979060, 3685888, 3527644, 3731464, 3680323, 3801425, 3860391, 3774157, 3998204, 4057819, 4005155, 4221508, 4293719, 4020300, 4259303, 4288904, 4375387]
14463D375387k28849K00663J01236L1089j19617J57352L21117J73045m95818J78080
14453D693685o8046J84530N23687n15670R028L45189M6391q9818O48602r6584
14443E680994l35029J01897L25606j74112K24589J3500M11608j69988k3904j54397
14433E900764K37810L10304k24290K31337K14782J41471P5646R348J48728L92935
14423G438835m08193K56545K54391q1371M1627R9895K63607J66398J34351l23619
14413G842466N26814j74707K75222q3796K33452K95728j00294R462K81792M66283
14403I572422m6188p3916J08616L70497J55576N25204o1464K30761P6457M3787
14393A0901752M02340L39692k34359K82406L75363K43425Q582L38379J57289R4485
$$ y = [4375387, 4146538, 4347201, 4448437, 4479526, 4359909, 4517261, 4838378, 5011423, 4515605, 4693685, 4625639, 4810169, 5333856, 4818186, 4827214, 5172403, 5218794, 5128976, 5777578, 5680994, 5345965, 5447862, 5773468, 5599356, 5823945, 5837445, 6249053, 6079065, 6055161, 5900764, 6138574, 6448878, 6224588, 6455925, 6670707, 6812178, 6887824, 6897172, 7045900, 7438835, 7030642, 7287187, 7541578, 7460207, 7501834, 7601729, 7865336, 8031734, 8166085, 7842466, 8369280, 8194573, 8469795, 8385999, 8619451, 8915179, 8814885, 8824347, 9106139, 9572422, 9526234, 9452318, 9560934, 9931431, 10087007, 10612211, 10550747, 10781508, 10857965, 10901752, 11304092, 11643784, 11409425, 11691831, 12067194, 12310619, 12319201, 12657580, 12814869, 12909354]
14383A2909354K13679K54563K75835K74370J74111L3748P75105J40236K02857
14374A5253858L61040K07555L00943J99463N54021O77666L16103m6158N93156
14365A8417647K75542M40704M59142M48371K54601O18004K85627O79280L67826
14356B2246744J88080P00198P01451K43546R22835O40453L84480L70663J253976
14347B7652426N99148M82517R48004M60849Q59803O58603R16860P17410J140705
14338C4436325J229093J109175O47048J022476J161744J247592R60200J601941
14330D3415594J044431J879591R69262J674424J407674J654673K014309J919785
14322E5979743J955837J640567K278958K406483K073830K745580K475047K733621
$$ y = [12909354, 13123033, 13377596, 13653431, 13927801, 14101912, 14135660, 14910765, 15051001, 15253858, 15614898, 15822453, 16123396, 16322859, 16876880, 17554546, 17870649, 17824491, 18417647, 18693189, 19133893, 19593035, 20041406, 20296007, 20914011, 21199638, 21878918, 22246744, 22434824, 23135022, 23836473, 24080019, 25002854, 25643307, 26027787, 26398450, 27652426, 28251574, 28734091, 29682095, 30142944, 31002747, 31661350, 32578210, 33295620, 34436325, 35665418, 36774593, 37421641, 38444117, 39605861, 40853453, 41813653, 43415594, 44460025, 46339616, 47308878, 48983302, 50390976, 52045649, 54059958, 55979743, 57935580, 59576147, 61855105, 64261588, 66335418, 69080998, 71556045, 74289666]
14314G4289666K745182K867401L261577L258846L830423L676139L502694M584536
14306A02016464M225890M924969M768280N486706N134540O313974O053447O722895
14298A45647165O994152P058142Q041715Q335237Q320499R509165R572468J0296174
14290B13774717J0973751J1052904J2034304J2408238J2598567J2977417J3542695
14283B99362593J3891887J4093948J4087019J3539598J3729687J2869524J2399738
14276C93973994J1492953R622265P703212N530916K085865P34340Q57085o69684
14268D31330946k793003k748839m637341p592128r359390j1110736j1959678j3089801
14260C68040030j3601733j4089257j4267625j4564621j4081726j3969275j3236720
$$ y = [74289666, 77034848, 79902249, 83163826, 86422672, 90253095, 93929234, 97431928, 102016464, 106242354, 111167323, 115935603, 121422309, 126556849, 132870823, 138924270, 145647165, 152641317, 159699459, 167741174, 176076411, 184396910, 193906075, 203478543, 213774717, 224748468, 235801372, 247835676, 260243914, 272842481, 285819898, 299362593, 313254480, 327348428, 341435447, 354975045, 368704732, 381574256, 393973994, 405466947, 415089212, 422792424, 428323340, 430409205, 431143545, 432000630, 431330946, 428537943, 425789104, 421151763, 413559635, 404200245, 393089509, 381129831, 368040030, 354438297, 340349040, 326081415, 311516794, 297435068, 283465793, 270229073]
14253B70229073j2795893j2933594j1724957j1488309j0700895j0293195r874657
14246A90417573r486938q227708p873819p897239p496661p070485o185271o307192
14238A29872260n416239n225286n342842m833510m417420m707753l681867l681425
14230I2565918l650071l730081l477472l105820k875408k496018k994006k162381
14222F8074661k707853k343974j735864k112297k158048j770802k013120j633911
14214E1598792j396918j361313j409647j505328j477935j286622j476284o50882
14206D1033863p71170j552528j345383r17601r34368o57764p25775q69254j243527
14197C2016493p64593o86262p50617r33513m63378m73378j164965o40669m66425
$$ y = [270229073, 257433180, 244499586, 232774629, 221286320, 210585425, 200292230, 190417573, 180930635, 172702927, 164829108, 156931869, 149435208, 142364723, 136179452, 129872260, 124456021, 119230735, 113887893, 109054383, 104636963, 99929210, 96247343, 92565918, 88915847, 85185766, 81708294, 78602474, 75727066, 73231048, 70237042, 68074661, 65366808, 63022834, 61286970, 59174673, 57016625, 55245823, 53232703, 51598792, 50201874, 48840561, 47430914, 45925586, 44447651, 43161029, 41684745, 41033863, 40262693, 38710165, 37364782, 36447181, 35512813, 34855049, 34129274, 33260020, 32016493, 31251900, 30565638, 29815021, 28881508, 28418130, 27944752, 26779787, 26139118, 25672693]
14188B5672693r41845l87039o25253L8609j076632m08610j78906o70252q49065
14179B0573700j70832m30429m89838l23449j73227k75812o87294n44606j42765
14170A7335448r4484o07497m96299J13772m90366m22260k96910P9342l14334n01980
14160A4304432j60722j69044m79431j18448j07822n30487m06184K62139m39529
14151A2154904J25490m36028L0876k06117l05404n92123K42519K5702l72709Q843
14141A0675953o20493Q2463J8666j83924j04167n8315l21971o4541l18279k8768
14131I076624l17128J52354k75258k3702m89514J87676k17873q8656q7437m06158
14121G510928M60471o29864K61269j62127k64428J3495J94254P1020m15499j94271
$$ y = [25672693, 24730848, 24343809, 23718556, 23757165, 22680533, 22271923, 22093017, 21422765, 20573700, 20402868, 19972439, 19482601, 19159152, 18985925, 18710113, 18022819, 17478213, 17335448, 17240964, 16633467, 16137168, 16250940, 15760574, 15338314, 15041404, 15120746, 14806412, 14304432, 14143710, 13974666, 13495235, 13376787, 13268965, 12738478, 12332294, 12594433, 12154904, 12280394, 11844366, 11875242, 11669125, 11363721, 10771598, 11014117, 11039819, 10667110, 10675953, 10055460, 10137923, 10156589, 9972665, 9868498, 9810183, 9488212, 9423671, 9105392, 9076624, 8759496, 8911850, 8636592, 8612890, 8123376, 8311052, 8093179, 8004523, 7917086, 7510928, 7971399, 7341535, 7602804, 7440677, 7176249, 7189744, 7383998, 7455018, 7039519, 6845248]
14111F845248o631o2182j88819K2145K4033j04451l3638j92623j03765j68221
14101F031096N5328l37118J31878J28159l65452J79741l94284K22336j27806j30412
14091E393466p8120M2207K556k2088J19871n20430K69752K8805k40083j03805
14081D892131l5082l04739J8571j8641l29125K57891j22710R3850R3827j42241
14071D403732m7514j54573J11549k32506P7170n8620K0644P96k91920J00419J00529
14060D029706l02711j07114K72184J77187l08872m58582L90031p9650j94082L06117
14050C724214k59882P9723k96059K08823j77521R6690J3274l20970N00973n41110
14040C028155J71314k5373K15995l60341J56414j26563J63765k37671K45454J94701
$$ y = [6845248, 6838617, 6776435, 6587616, 6609761, 6633794, 6529343, 6495705, 6303082, 6199317, 6031096, 6086424, 5749306, 5881184, 6009343, 5643891, 5823632, 5429348, 5651684, 5523878, 5393466, 5315346, 5357553, 5360109, 5338021, 5457892, 4937462, 5207214, 5236019, 4995936, 4892131, 4857049, 4552310, 4570881, 4552240, 4223115, 4481006, 4358296, 4452146, 4545973, 4403732, 4356218, 4201645, 4313194, 4080688, 4157858, 4099238, 4119882, 4120678, 3828758, 3929177, 4029706, 3726995, 3619881, 3892065, 4069252, 3760380, 3301798, 3691829, 3612179, 3418097, 3724214, 3464332, 3544055, 3247996, 3456819, 3279298, 3375988, 3389262, 3068292, 3569265, 3028155, 3199469, 3174096, 3390091, 3029750, 3186164, 3059601, 3223366, 2985695, 3231149, 3425850]
14030C425850l02673k1770J31585o61485K83331K2830j00364P4320k48484P1663
14020B674803L358j3210k65143J45867n3432M1619m83355L94514O0183j83460
14010B321744k14497j76923K47325K83570k16054O8617k65150O1024J43540r8174
14000B155022l17315J62302k2897N06677k4722j94223j57839n7169M36073p1543
13990B414366M33592J049182K593872N835102J2445159J5974023j2132984j3682872
13982A4929440o143745k934023j006571o60950j96189j80528q36675N0830K9307
13973C050896l93354J20287r7461m1444q0409p1286k8106k05337P60p3273j87934
13962A993339J2281L59471k82853K02471j40893o4108j08804L39494k32547k00789
$$ y = [3425850, 3123177, 3101407, 3232992, 2571507, 2854838, 2877668, 2777304, 2851624, 2603140, 2674803, 2678161, 2664951, 2399808, 2545675, 2492243, 2533862, 2050507, 2445021, 2505204, 2321744, 2107247, 1930324, 2177649, 2461219, 2245165, 2313782, 2048632, 2109656, 2253196, 2155022, 1837707, 2000009, 1977112, 2483789, 2459067, 2264844, 2107005, 2049836, 2485909, 2414366, 2847958, 3897140, 6491012, 12326114, 24771273, 40745296, 28612312, 14929440, 8785695, 5851672, 4845101, 4184151, 3987962, 3807434, 2970759, 3021589, 3050896, 2657542, 2777829, 2680368, 2638924, 2558515, 2487229, 2459123, 2253786, 2254546, 2181273, 1993339, 2005620, 2365091, 2082238, 2284709, 2143816, 2079708, 1970904, 2310398, 2077851, 1877062]
13952A877062j96323L66733K0115j63660K54161m66790K41116J23604j57871l56438
13942A541709J66547N46402k67963r146j05463k3938k42787L1295l41621N60715
13932A855750j34174l29819J80242K82389k96613N7826k26493L4046K80464q4996
13922A618622j09541n4127R9135K67309k84601j43697j72933N25754m58081J13438
13912A401278j75824K59719J33347k35765K65966k22412k3532K24976k22522L5905
13902A441136j31460K3911J15403k21280K74406r0060J49978k68502R4836j03680
13892A284688J57875O8090n3109J86373n20152J17711J66971r4379l65256K85124
13882A233936k77209N1017N08174l25751j8187K9868M14305l59718K4292p3443
$$ y = [1877062, 1680739, 2047472, 2067587, 1903927, 2158088, 1691298, 1932414, 2056018, 1898147, 1541709, 1708256, 2254658, 1986695, 1977549, 1872086, 1848148, 1605361, 1636656, 1295035, 1855750, 1721576, 1391757, 1571999, 1854388, 1557775, 1615601, 1389108, 1423154, 1703618, 1618622, 1509081, 1454954, 1554089, 1821398, 1536797, 1393100, 1220167, 1745921, 1287840, 1401278, 1225454, 1485173, 1618520, 1382755, 1648721, 1426309, 1402777, 1627753, 1405231, 1441136, 1309676, 1333587, 1448990, 1227710, 1502116, 1412056, 1562034, 1293532, 1388368, 1284688, 1442563, 1510653, 1457544, 1643917, 1123765, 1241476, 1408447, 1314068, 948812, 1233936, 956727, 1007744, 1515918, 1190167, 1171980, 1201848, 1616153, 1256435, 1280727, 1207284]
13872A207284K17801l41324l18734L53139O9325R4567m24493J81176M5975P522
13862A092238j85061L28364M0999l37154K54709j97858q6122P1412j9344J5324
13852I77507O9171K90069m42654j05033M13405j93542j73789K13806k43934K3409
13842H28415L51048j63674O3080k77323m0191K55702m61251K52878M43531m1593
13832A210622j44607J49049n01101J17212J32628J51972k8579j50331q671J11050
13822A039244n8041D69603O52288k60893n1783J70454J3748m38451L79781P824
13812I42571k39300J83525k23703L40563k43307M27422l42152j25090j38599L27555
13802I09485j47720J00494j05184n9292N26755l43258M0967j1965j632q7662J15270
$$ y = [1207284, 1425085, 1083761, 765027, 1118166, 1187491, 1282058, 857565, 1038741, 1084716, 1092238, 907177, 1235541, 1276540, 939386, 1194095, 996237, 910115, 981527, 962183, 977507, 1046678, 1336747, 894093, 789060, 1202465, 1008923, 835134, 1048940, 805006, 828415, 1179463, 1015789, 1078869, 801546, 761355, 1017057, 555806, 808684, 1252215, 1210622, 1066015, 1215064, 713963, 831175, 963803, 1115775, 1087196, 936865, 928194, 1039244, 981203, 469603, 1121891, 860998, 809215, 979669, 993417, 554966, 934747, 942571, 703271, 886796, 663093, 1003656, 760349, 1187771, 845619, 720529, 581930, 909485, 761765, 862259, 757075, 697783, 1224538, 881280, 922247, 910282, 908650, 820988, 936258]
13791I36258j6313j67031R5527J8634j55655K5866J8548q5842K73663C53753j48606
13780B05147K24083L23514j95092N66800n38455K42569p2439M0516j18064R0158
13770G68737J50971j0094j80617k17737L54410k38639Q9836k69614J45400j24511
13760D68142N1007j41375L38569l12844K57465j23117k28869J35660j61014M53087
13750G36711n3616j18804k28307L25284k01355N6350m4043P8516K87643l46404
13740D91975L98904j80255M6813j87299K45954k75505J93980K4790k02761j65131
13730C91465J84747K36759j93907k2634J14692j90787J68501Q8688k62400m9021
13720D66103R4672K34J4196j99404J39914H4803N65988j50361j56699J36733L7681
$$ y = [936258, 919945, 752914, 848441, 867075, 711420, 737286, 755834, 669992, 943655, 353753, 205147, 429230, 752744, 557652, 1124452, 585997, 828566, 756127, 796643, 678579, 768737, 919708, 909614, 728997, 511260, 865670, 627031, 716867, 447253, 592653, 468142, 519149, 377774, 716343, 403499, 660964, 537847, 308978, 444638, 283624, 736711, 683095, 564291, 335984, 661268, 459913, 516263, 472220, 550736, 838379, 491975, 890879, 710624, 757437, 570138, 816092, 540587, 734567, 759357, 556596, 391465, 576212, 812971, 619064, 596430, 711122, 520335, 688836, 777524, 515124, 466103, 560775, 561009, 575205, 375801, 515715, 84803, 650791, 500430, 343731, 480464, 518145]
13709E18145j33576L36637A61992N83455k13783K37319k50926M37805j70754B32343
13698E77336L2747j45928r0520L40870j97086o1637K95082m5862o7469B53386
13687I77622m72359B25941L24303o6204O9484J44943B20910O01735D05465K98878
13677G04343k55124M00451m24444l3508L21846L5557k5413q4532j85939A77482
13666C06189M85987D7278M89657k14912L28241k22423K79762D4223Q2781N00973
13656F27977j79655j10442H2527M83775B6276M52960J38170k87204N0025j27660
13646B52567K24727j54598L64150j17049q1021j02001P834A35505K40942P5666
13636D52113N2468K9147k30763J59569K24130j50322q6406p3323B7383P3489J79890
$$ y = [518145, 384569, 721206, 161992, 745447, 531664, 768983, 518057, 955862, 785108, 232343, 577336, 610083, 464155, 373635, 714505, 517419, 455782, 750864, 705002, 637533, 253386, 977622, 505263, 225941, 550244, 484040, 553524, 698467, 220910, 822645, 405465, 704343, 449219, 849670, 425226, 391718, 713564, 749121, 723708, 639176, 453237, 177482, 306189, 792176, 47278, 536935, 322023, 650264, 427841, 707603, 44223, 127004, 627977, 448322, 337880, 82527, 566302, 26276, 479236, 617406, 330202, 380227, 252567, 477294, 322696, 686846, 569797, 488776, 386775, 394609, 135505, 376447, 452113, 504581, 533728, 302965, 462534, 686664, 536342, 449936, 376613, 27383, 100872, 280762]
13625B80762J8040K48191A88559L74397B51297Q6848J11315Q4319k39489L49653
13615F43943k94061n8195J62794F8887O23267O802l30367A56384j0539M22358
13605E68203k9970D475M91841J65919j13310j60138k4380A58798N39279n4714
13595F43363J29183E2171Q8013J05126J51262j78577K96525j2370A34690L14867
13585D49557j1703B12559J91750J43760K9437B01158M9329K36844q1241a4742
13574D71442o1973j52612J35420j02536N4253n6688r0437N4901Q1584J34377A95606
13562A83185L16859J75067A57706J00574Q9563L16373A62333K04151p9288O361
13552B93557J80930p5052A79853a88980B36534J14194j64971L24236J6745j63999
$$ y = [280762, 298802, 546993, 188559, 562956, 251297, 338145, 449460, 533779, 294290, 643943, 349882, 291687, 454481, 68887, 692154, 698956, 368589, 156384, 145845, 568203, 538233, 4475, 496316, 662235, 548925, 388787, 364407, 158798, 698077, 643363, 772546, 52171, 140184, 245310, 396572, 217995, 514520, 502150, 134690, 449557, 437854, 212559, 404309, 548069, 577506, 201158, 250487, 487331, 406090, -14742, 471442, 409469, 256857, 392277, 289741, 343994, 287306, 196869, 251770, 333354, 467731, 195606, 183185, 500044, 675111, 157706, 258280, 347843, 664216, 162333, 366484, 287196, 293557, 474487, 399435, 179853, -188980, 236534, 350728, 185757, 509993, 526738, 362739]
13542C62739B4840R0764J475K28335o1739Q1497o9579F2845L13051A44916K00176
13531C45092q7169J2593j1867l349K45389j81031J94644j68276C8763L01760b95585
13519B67439A065M47782j85766A14744L4293K07298j23161j8371r679K60908k8022
13508D38010A66356L20895F7029J35226l0537J77J92094j17581p9609m7736L6121
13497A55184J0169J57246J53806k00077p42F0516L7147K18216A10558J08729Q9698
13486C08985K5567J51955I7307O32761C41960p7523h030C7822J02068L02383j11328
13475C30945h6489D18571j90135K8090K69079B51205F8563L09927l5748A59247
13464B34150E055K67938p3410K25850H5256K64803j46221M77622r7116B90503
$$ y = [362739, 24840, 115604, 117079, 345414, 283675, 365172, 295593, 62845, 375896, 144916, 345092, 257923, 270516, 258649, 255300, 500689, 319658, 514302, 346026, 38763, 340523, -295585, 267439, 1065, 448847, 263081, 114744, 149037, 356335, 233174, 214803, 205124, 466032, 438010, 166356, 487251, 67029, 202255, 171718, 171895, 363989, 246408, 166799, 119063, 155184, 165353, 322599, 476405, 276328, 275586, 60516, 97663, 315879, 110558, 219287, 308985, 334552, 486507, 97307, 730068, 341960, 264437, -8030, 37822, 139890, 442273, 330945, -86489, 418571, 228436, 256526, 525605, 251205, 68563, 378490, 342742, 159247, 234150, 5055, 272993, 199583, 425433, 85256, 350059, 203838, 681460, 584344, 290503]
13453A05608J82571I6577L64607G5447K32019D0167K20639c2269B88427K35726
13443E24153a1804C28696A24553N3236d3830B03267J26104j49143E3965J49285
13433B03250M5176r937D403M59278j86078K96161A63671C8895L93023B14470H7947
13421B60472b22128B69749r9950d2801B01143J30825b2362A13035L63206J3062
13411D89303A08090K16021l8963i8015D37577d8916F6115k3639K38169e1997F9426
13399E0799K52268F373K11766P175A06746J73793o5909K43417j63239m5374A08928
13387A58002K94686j2119j91847N9059A41492d1394B48819j16615M260k7072R1389
13376B00781K49245A10937M1344M46926C7517P9278L48111B30531d0067B65446
$$ y = [105608, 288179, 96577, 461184, 75447, 307466, 40167, 260806, -32269, 288427, 524153, -11804, 328696, 124553, 177789, -43830, 203267, 329371, 180228, 53965, 203250, 248426, 238489, 4403, 463681, 277603, 573764, 163671, 38895, 431918, 214470, 87947, 260472, -222128, 269749, 169799, -42801, 201143, 331968, -22362, 113035, 476241, 489303, 108090, 324111, 285148, -98015, 437577, -48916, 66115, 42476, 280645, -51997, 69426, 50799, 303067, 6373, 218139, 225314, 106746, 280539, 214630, 458047, 294808, 249434, 108928, 158002, 452688, 440569, 248722, 307781, 141492, -41394, 248819, 132204, 136464, 109392, 200781, 450026, 110937, 152281, 599207, 37517, 116795, 464906, 230531, -40067, 265446]
13365D84921j85189N1819J22463D4699Q7272M07543h3165A57585R2579J25323
13355C75487A37433P8546R1634m5675H0912M83951j60403j82826L2254J57573
13345D11461d2761D80592B23118H6109J26169m7587L01622h0303a2518A71013
13334H2234K46405P6747n8149a47730A86567Q943K93111F2658J51057J06722K80516
13323F00953B30276R6280d8166C76313H6289K46068a22482B52869A11756C8671
13312B31900l5077J04319j28572l1135C8222N9506K03146j31143J13373H4100
13301a07137A12241K03791a66m3455B27567M5227H0543e194B15108H4333L07031
13290C91364A24610L4857E4281J90457D1039J16175Q9591J50824j19136F8414
$$ y = [484921, 299732, 351551, 474014, 44699, 131971, 539514, -83165, 157585, 250164, 375487, 137433, 215979, 307613, 261938, 80912, 564863, 404460, 221634, 253888, 411461, -42761, 480592, 223118, 86109, 212278, 164691, 466313, -80303, -12518, 171013, 82234, 328639, 405386, 347237, -147730, 186567, 195510, 488621, 62658, 213715, 320437, 600953, 230276, 326556, -48166, 376313, 86289, 332357, -122482, 252869, 111756, 38671, 231900, 196823, 301142, 172570, 141435, 38222, 97728, 300874, 169731, 283104, 84100, -107137, 112241, 316032, -166, -43621, 227567, 272794, 80543, -5194, 215108, 84333, 391364, 124610, 159467, 54281, 244738, 41039, 157214, 246805, 397629, 278493, 68414]
13279C28236A60722b81302D24569c3464D0202K2580i5762n2158A27780P261J47187
13268B82228i1134B13860I828L06292A32768C1695K20902n5055O2393D4980e2560
13256A427N4638J45681b61935A32140b16541A79613A578K22055J59488d78D24696
13244D2919L69685A0745c96394c877j45131C15933e6441G8436J41450J20315C3170
13232B12886H4591J28932m8867G6802K39641l9836a00635B55124A10291P7503
13222A87794k8420J48234q2036e8571D81776a7591B16610E5216J79797K46801
13212D81814a38968B58153p7608g425D16760D7013L76038j43537n8306J26205
13202C47413G0048L2793m8626N3499M6566J5862k0727J65597i5349D50408l1760
$$ y = [328236, 160722, -281302, 424569, -33464, 40202, 62782, -95762, -147920, 127780, 135041, 282228, -91134, 213860, 9828, 316120, 132768, 31695, 252597, 197542, 259935, 44980, -52560, 1427, 56065, 201746, -261935, 132140, -216541, 179613, 1578, 223633, 383121, -478, 424696, 42919, 412604, 10745, -396394, -3877, -149008, 315933, -56441, 78436, 219886, 340201, 33170, 212886, 84591, 213523, 164656, 76802, 316443, 276607, -100635, 255124, 110291, 187794, 159374, 307608, 225572, -58571, 481776, -17591, 216610, 55216, 235013, 481814, -138968, 258153, 180545, -7425, 416760, 47013, 423051, 279514, 221208, 347413, 70048, 102841, 54215, 107714, 154280, 170142, 149415, 315012, -95349, 450408, 418648]
13191D18648I4041l8553A3674Q0818K08108m9406a30537a2352k9183C05075j03838
13180B01237E1564J63664F0346o518j249j8865a60827e3023m1612G4791N2227
13169A27018N00751A05269j5308K9961K7676L78048A87469J20353G0086d562C07954
13157B49377c30144G5531L31695a85690g5534l33080F5965J5640a22294C45066
13146b8289A48376c4141j2001j95399c4578A08385J82109b17310d1959A9819L63793
13135C83612A16985C5729L92881C8952J77333J35463d8257A103K20925o4345A5233
13123A32385e8407E5839i8293l1609B21735d43099C9968b11467C50670c0441F5044
13111b69723A03597b00384j6233a2903A54378h644A93489g3522I7501g2129j34946
$$ y = [418648, 94041, 55488, 13674, 94492, 302600, 253194, -130537, -12352, -41535, 305075, 201237, 51564, 215228, 60346, 53828, 52579, 33714, -160827, -53023, -94635, 74791, 127018, 627769, 105269, 89961, 119922, 147598, 525646, 187469, 307822, 70086, -4562, 307954, 249377, -330144, 75531, 407226, -185690, -75534, -408614, 65965, 81605, -122294, 345066, -28289, 148376, -34141, -46142, -241541, -34578, 108385, 290494, -217310, -41959, 19819, 383612, 116985, 35729, 428610, 38952, 216285, 351748, -48257, 1103, 222028, 157683, 15233, 132385, -58407, 55839, -98293, -129902, 221735, -443099, 39968, -211467, 350670, -30441, 65044, -269723, 103597, -200384, -216617, -12903, 154378, -8644, 193489, -73522, 97501, -72129, -207075]
13100b07075C12584A49555f3699B87314h1283E3661J22268B4738a4998A00703
13089a51834C8563K60340a39590A02754J4786a24419o0419A47648e6955q2100
13079a39055C70804q2488Q0992l5432A66772g189A92484p0459K33525G8742K23045
13068C01787F8777i4479B38804m4804C0682J15999a3258B85217K3950i5047A13675
13056D12607l9480j72090r0838K33768E4952a18865B84559d953J491B24677a22461
13044A33197C7971h5747B13140d5155B57592A8529b38679E6993M906r009J32023
13033A84913O1436K41575L4422I2563J21432p3503F1681K9599c7381D14412E4909
13021C5282g8094A317J6358J17088J33838A20945d2850E15377b2726G5876c8375
$$ y = [-207075, 312584, 149555, -63699, 287314, -81283, 53661, 175929, 24738, -14998, 100703, -151834, 38563, 298903, -139590, 102754, 117540, -124419, -184838, 147648, -56955, -139055, 370804, 288316, 369308, 333876, 166772, -7189, 192484, 122025, 355550, 78742, 301787, 68777, -94479, 238804, 194000, 30682, 146681, -13258, 285217, 309167, -95047, 113675, 412607, 373127, 201037, 110199, 343967, 54952, -118865, 284559, -4953, -3462, 224677, -122461, 133197, 37971, -85747, 213140, -45155, 257592, 18529, -238679, 56993, 61899, 52890, 184913, 246349, 487924, 522346, 92563, 213995, 140492, 61681, 91280, -37381, 414412, 54909, 35282, -78094, 1317, 17675, 134763, 268601, 120945, -42850, 515377, -22726, 75876, -38375]
13009B8216a276j15908B91909r2257N1953M131A14838b58778A10446A418f0233
12997h6852B68129a29150A51128a30435B05097a84539A40994J80376b070k24890
12987b26960I6639k2316B1442Q4798b01848F6469l2870a14600N2913q7899C56407
12975A49875o2838j7425B6712b16734B24455l1290H7629L33626A37548D4169L18113
12964C62282j70953E9685e4305C25655f8209D8602k1876J59504a33770K8857n5959
12953a60872A62058b12685g3888j0468B89622j33506a94732C41124j30010F8576
12942B88103h1377F4344a4695l4410l76406E5599j4340J62524h1920a3474E0939
12930C25326C1313A5108d7587m8k30096A1328K56463K01269i0169m5240A57063
$$ y = [28216, -1276, -117184, 291909, 199652, 251605, 255736, 114838, -258778, 110446, 1418, -60233, -86852, 268129, -129150, 151128, -130435, 205097, -184539, 140994, 321370, -2070, -226960, 96639, 74323, 21442, 106240, -201848, 66469, 33599, -114600, -61687, -149586, 356407, 149875, 87037, 69612, 26712, -216734, 224455, 193165, 87629, 421255, 137548, 44169, 362282, 191329, 59685, -54305, 325655, -68209, 48602, 26726, 186230, -133770, -104913, -160872, 162058, -212685, -73888, -84356, 289622, 156116, -194732, 341124, 211114, 68576, 288103, -81377, 64344, -14695, -49105, -425511, 55599, 41259, 203783, -81920, -13474, 50939, 325326, 31313, 15108, -47587, -47635, -277731, 11328, 267791, 469060, -90169, -135409, 157063]
12918B85843q4320D4609d4983B56441J55267G8201K77289I5911j7471D012a51274
12906C8498e48732B85851L4328l3403A11312Q1462b36508c4588n4016l9968o9518
12895a98090e3905k02167J13391B17499E3935a40733f9487A3485f9786C6764K83065
12884C19829A25424Q0525j5721F894g5949C09719A4006d5262o3044J7591B14033
12872A15650g288k98757A67475N3570B7393K42696J15110D2063a33951A60534
12861A43669c1543G7454k1954J3728A6223A296J55071J01326j6695n1396o9955
12850A19647B4233a25780B02714G813J8074NK42018D4842R8674a69733B50803
12838A24872a02730j15648O9168K6983B50828Q262a01981p0537B38682k0602C6765
$$ y = [285843, 201523, 44609, -44983, 256441, 411708, 78201, 355490, 95911, 78440, 4012, -151274, 38498, -548732, 285851, 320179, 286776, 111312, 192774, -236508, -34588, -88604, -128572, -198090, -53905, -256072, -142681, 217499, 53935, -140733, -69487, 13485, -69786, 36764, 319829, 125424, 205949, 190228, 6894, -75949, 309719, 14006, -45262, -108306, -90715, 214033, 115650, -7288, -306045, 167475, 221045, 27393, 270089, 385199, 42063, -133951, 160534, 143669, -31543, 77454, 55500, 69228, 16223, 1296, 156367, 257693, 240998, 189602, 119647, 24233, -125780, 202714, 7813, 25887, 25892, 267910, 44842, 143516, -169733, 250803, 124872, -102730, -218378, -149210, -122227, 250828, 259090, -101981, -172518, 238682, 218080, 36765]
12826g0731p6306n9927q765i6085C32640e7031A5361K58099d1714k65520C16911
12814A8651L36703f301l39662B30196j13694b1481j47215B72961i5324A28107
12803B6873J27378a31410j05404B13536H7631M5837K61528C0692M20161i1678
12792i1566A02576m7188i1813j98906C24063a64069c0516A68367J54452n2210
12782B70609a46995d4440C2801L20067I3803a8795o0665j17110A27410l9406J12173
12771B00177i3717A68539K20675c3519G6472k2616B3208a92620E2329f4678O135
12760e8543M022k1039A94044O6984a08139r0460d2791q5136p5699i7260l2493
12749a29753C4669O8717b18485J00457c2588C90561e8853A06380j663k0835M4960
$$ y = [-70731, -147037, -206964, -215729, -96085, 332640, -57031, 15361, 273460, -41714, -307234, 316911, 18651, 355354, -6301, -345963, 230196, 116502, -21481, -168696, 272961, -95324, 128107, 26873, 154251, -131410, -236814, 213536, 87631, 133468, 394996, 30692, 450853, -91678, -91566, 102576, 55388, -91813, -290719, 324063, -164069, -30516, 168367, 322819, 270609, -146995, -44440, 32801, 352868, 93803, -18795, -79460, -196570, 127410, 88004, 200177, -93717, 168539, 389214, -33519, 76472, 53856, 23208, -192620, 52329, -64678, -58543, -54521, -75560, 194044, 261028, -108139, -198599, -42791, -127927, -203626, -97260, -129753, 34669, 103386, -218485, -118028, -32588, 390561, -58853, 106380, 104717, 83882, 128842]
12738A28842l5174J51389A01740B0775L56891j44647E1426L19182j44898m168
12728B21542c0185A84483m7039n9769B4625b34879A15460j8012N091a9990B21263
12716g3953j7827G0081a6489A48887K44391L70541C4312h52A63920o5636Q3207
12705A81491P1437h3722J1247L1144C48775A03423K37536K54459g6534C32725
12694A42520a32807B05030a88862G2243b02519B96087e0529E3072a1941A49903
12683H2446O4102b3707r3954B38778f8826C63803j8487A00825d6636H6722q53
12672H5869J78233a11779b4786B7392b5174C43152a7549B3028K96079R2962p1841
12661C40228i551A88042b4454B66054e433A28370E095K02005F6439r841Q4641
$$ y = [128842, 93668, 245057, 101740, 20775, 377666, 233019, 51426, 370608, 225710, 221542, -30185, 184483, 137444, 77675, 24625, -234879, 115460, 97448, 102539, -19990, 221263, -73953, -91780, 70081, -16489, 148887, 393278, 763819, 34312, -852, 163920, 98284, 181491, 252928, -83722, -72475, -41331, 348775, 103423, 340959, 595418, -76534, 332725, 142520, -132807, 205030, -188862, 72243, -202519, 296087, -50529, 53072, -11941, 149903, 82446, 146548, -23707, -117661, 238778, -68826, 363803, 345316, 100825, -46636, 86722, 85869, 264102, -111779, -24786, 27392, -25174, 343152, -17549, 23028, 319107, 412069, 340228, -9551, 188042, -24454, 266054, -5433, 128370, 5095, 207100, 66439, 56598, 141239]
12650A41239K22135e2370j03999B36285L0013d3304B0515Q4955L4008J62377o5192
12639B36663q0870p4788a48800D6044I020J45544a10300C77123a49919I2241i2007
12627B72630I0726L5606m7175C7247J03472M3036D6115M6264R4795a72222b3819
12615I9797l9266Q5103C3090J57927p4122j0264J05112r7701P3942p6966K41625
12604C52643l6542a40455B26020E9466A9717M6937J95719i8273j20530j52558
12594c71361d3542B21395E1767K68247j04045a55982k15749P7120A62764k1241
12584A41523E7538g8414A06417f5043B60817e0982E4416J01587a27704A79804
12573D13071A94518a95881d0326p2276C3737d4093j80984F0113K42301b81129
$$ y = [141239, 363374, -52370, -156369, 236285, 266298, -43304, 20515, 105470, 139478, 301855, 236663, 155793, 81005, -148800, 46044, 9020, 154564, -110300, 377123, -149919, 92241, -92007, 272630, 90726, 126332, 79157, 37247, 140719, 183755, 46115, 92379, 187174, -172222, -23819, 99797, 60531, 145634, 33090, 191017, 116895, 106631, 211743, 114042, 187984, 111018, 352643, 316101, -140455, 226020, 59466, 19717, 66654, 262373, -98273, -218803, -371361, -43542, 221395, 51767, 320014, 215969, -155982, -371731, -294611, 162764, 141523, 57538, -78414, 106417, -65043, 260817, -50982, 54416, 156003, -127704, 179804, 413071, 194518, -195881, -40326, -112602, 33737, -44093, -225077, 60113, 302414, -281129]
12562a29501E131e319C87126I9814J04803i7716m6678G4289b20605D40839b79
12550b49612A39339O8135q8289a6324F3302D148J2884R558a18690M6415c3100
12538h7659E2989P5516a31270E4583J13687J09504b05689E5004a95211Q2206j9411
12527a32416H2451J4796O7014a66150A0711a0297G5928c24486B3994Q727J64798
12516A97519J04658L7059k0835C9321J56622q5625n4451J37743R5933C5627J1821
12505D7448i4351I5047a83673D2939b56303f7245G6268B1228a44866K3014A73828
12493b36371B00426A6226b97872b5739A87596A7591e2814A19302i2054E4655J29048
12482A83703A9088R7043B9361d1393I8804N2557J27927H2145g1012F6930a06741
$$ y = [-129501, 5131, -5319, 387126, 99814, 204617, -97716, -144394, 74289, -220605, 440839, -279, -249612, 139339, 207474, 119185, -16324, 63302, 4148, 17032, 26590, -118690, -72275, -33100, -87659, 52989, 128505, -131270, 54583, 168270, 277774, -205689, 55004, -195211, -113005, -132416, 82451, 97247, 164261, -166150, 10711, -10297, 75928, -324486, 23994, 32721, 197519, 302177, 339236, 318401, 39321, 195943, 110318, 55867, 193610, 289543, 35627, 47448, -94351, 95047, -183673, 42939, -256303, -67245, 76268, 21228, -144866, -121852, 173828, -236371, 200426, 16226, -297872, -25739, 187596, 17591, -52814, 119302, -92054, 54655, 183703, 19088, 116131, 29361, -41393, 98804, 151361, 279288, 82145, -71012, 66930, -106741]
12470A44081J80591g5516k08139B4532a01009C49173c59065d247k11556l5364
12460b51167a01533B63084a54340j19614f2682A69879A4164M8687J6858b78685
12449A45952a74808F3251E644a81588h4379l6170J5052n8918P1522b17j40972
12438a41189D38752A18002N4032a99645A89120F4814a05727j261A34581a0076
12427B88708D1496J77424m6300b43904J08433A47620C5802J32435R7126b43481
12416e6336l8181A21323N5842c9171a1588A33346K6159b06085l14932a49014D21558
12404i8116D0352a19049A79536L3823B0452J49661o3703b63260O9789A00392R851
12393A10243a78545J9090j10158A72992A5835a94857B34185q4957b59417R8821
$$ y = [144081, 324672, -75516, -283655, 24532, -101009, 349173, -359065, -4247, -215803, -251167, -101533, 263084, -154340, -273954, -62682, 169879, 14164, 62851, 79709, -278685, 145952, -174808, 63251, 5644, -181588, -84379, -120549, -105497, -164415, -92893, -217, -141189, 438752, 118002, 172034, -199645, 189120, 64814, -105727, -106988, 134581, -10076, 288708, 41496, 218920, 172620, -243904, -135471, 147620, 35802, 168237, 265363, -243481, -56336, -94517, 121323, 177165, -39171, -11588, 133346, 159505, -206085, -521017, -149014, 421558, -98116, 40352, -119049, 179536, 213359, 20452, 170113, 106410, -263260, -193471, 100392, 110243, -178545, -159455, -269613, 172992, 15835, -194857, 234185, 149228, -259417, -160596]
12383a60596q95P1607m73330I5868L1157l4484R0411h0644E9131E865b46290A67096
12370B6605L37921a06782C48918A9435J03540F629a42606A64150N2718B8053b5048
12358b98430D2684J89045H1415g3443F9660B3547b642G0215L57356K1023A7129
12346b53932A40126e1815G4140d23409D25643e8842J9012m1671C597b74125C2030
12334A75987B2573K0157c09850M5122b1026C84173A78026p9375C4892b404l4024
12323c6428j93954k3400B07344q8921B1135J22733J97279H5230m1978J87498J66050
12312C96800i9755B00589H2400M1938a27340G599a80168k7464B53113d3753B46462
12300e8235J5845A18991g1302B8788Q1026J48228a48865q0950C277b74124A539
$$ y = [-160596, -161491, -89884, -563214, 95868, 127025, 92541, 182952, -80644, 59131, 5865, -246290, 167096, 26605, 364526, -106782, 348918, 19435, 122975, 6629, -142606, 164150, 216868, 28053, -25048, -298430, 42684, 231729, 81415, -73443, 69660, 23547, -2642, 70215, 427571, 448594, 17129, -253932, 140126, -51815, 74140, -423409, 425643, -58842, -39830, -81501, 3597, -274125, 32030, 175987, 22573, 42730, -309850, -264728, -21026, 384173, 178026, 98651, 34892, -2404, -36428, -230382, -253782, 207344, 118423, 21135, 143868, 341147, 85230, 43252, 230750, 396800, -99755, 200589, 82400, 124338, -127340, 7599, -180168, -207632, 253113, -43753, 246462, -58235, -42390, 118991, -71302, 28788, 109814, 258042, -148865, -229815, 3277, -274124, 1539]
12288C6747k411L5685K12805d147D0970N8146c77281b9544I1686f3375j79174
12277b42549k23047H8584B633J66766J54368C8460a80497G6207c41496C98766
12266G4500N7753Q1033A03052J37086E0373k4665a5263n8144j20596B62685a25499
12254C50416C2896L31229c32181a16344J0061A64983g9006B84744r665A33920
12243b02377h4077F754h892B19124I3595g8213c6534D7331L65647b13153A14682
12231B9129N7932L58034H7403K65704M5329A86010b7178A51176D809K81934j31105
12220A55638L83457A99979J88695l7862E1953J90694I5942a4135j34143A66296
12209B22954o941n6561N936L31963H2692L51989a35212A42671c20512B8447e62
$$ y = [36747, 34336, 70021, 282826, -4147, 40970, 99116, -377281, -29544, 91686, -63375, -242549, -465596, 88584, 2633, 169399, 323767, 38460, -180497, 76207, -341496, 398766, 74500, 132253, 213286, 103052, 240138, 50373, 25708, -15263, -73407, -194003, 262685, -125499, 350416, 32896, 364125, -332181, -116344, -106283, 164983, -79006, 284744, 275079, 133920, -202377, -84077, 6754, -8892, 219124, 93595, -78213, -36534, 47331, 412978, -213153, 114682, 29129, 87061, 445095, 87403, 353107, 398436, 186010, -27178, 151176, 4809, 286743, 155638, 539095, 199979, 388674, 350812, 51953, 242647, 95942, -14135, -148278, 166296, 222954, 216013, 159452, 165388, 497351, 82692, 434681, -135212, 142671, -320512, 28447, -562]
12197I1480N7305L30531a28590A92883p9846J48512J71537A58145C7447N6808
12187I4255L98576a20410B33109C186J13211M1950C0259J77655b44937A43424
12176C0851J78795b8855p3810d8618D84J78168K07294f5947C8509a37878A455
12164A78092g6600B5919L80589b91481C48787A58793G9338K9464c78448f2467
12153D4671e475H828C090N6605k5121i1167C03242a05479B16303b36688A00379
12141E22101d10612B43988b24753F2668h97B1205K17362c34054A59908b62482
12130B7482D323b4670j41936g1021q8556O1667B24733J63714j14508E6607g2097
12118b71161N9914A20501R0681g7465B71602c0994k21875G8181a82319g1558A16818
$$ y = [91480, 148785, 479316, -128590, 192883, 113037, 261549, 433086, 158145, 37447, 94255, 492831, -120410, 233109, 3186, 116397, 158347, 30259, 207914, -244937, 143424, 30851, 209646, -28855, -102665, -48618, 484, 178652, 385946, -65947, 38509, -137878, 1455, 178092, -76600, 25919, 406508, -291481, 348787, 158793, 79338, 108802, -378448, -62467, 44671, -5475, 8828, 3090, 59695, 34574, -91167, 303242, -105479, 216303, -236688, 100379, 522101, -410612, 243988, -224753, 62668, -897, 21205, 238567, -334054, 159908, -262482, 27482, 4323, -24670, -166606, -71021, -159577, -97910, 224733, 388447, 273939, 56607, -72097, -271161, -211247, 120501, 211182, -77465, 271602, -30994, -252869, 78181, -182319, -71558, 116818]
12106b36503O7390N7373G0674a964j78774c4339k75083G6396R6089N0595G4279
12094C317J58536J19629j11657a63002C4674a95369B6797a6750o704k78754C44602
12082D292L37308h8796H7398C9858i1003D1619R5223a95059R1870j29776n7976
12071b90941e1403E4955a31343K3088M9388H9329c24402A46772a84914l4331H8164
12059E92878C1601J91672N18215O38670J35765D20572a50044H79h5338j76059
12049b61397G2322c8387H6671e9907l08273J11642i9183A49973e0738k30031B29547
12037A25171B8572P3588c8476j50616G6407b85356A04723a94031B02889h6733
12026A84891G3553N7017M81262B22752a23745A96539H6876b40851E0206i9846
$$ y = [-236503, -169113, -111740, 70674, -1964, -180738, -34339, -309422, 76396, 172485, 223080, 74279, 3317, 161853, 281482, 169825, -163002, 34674, -195369, 26797, -16750, -23454, -302208, 344602, 4292, 341600, -88796, 87398, 39858, -91003, 41619, 136842, -195059, -103189, -232965, -290941, -51403, 54955, -131343, -108255, -58867, 89329, -324402, 146772, -184914, -219245, 88164, 592878, 31601, 223273, 741488, 1380158, 1515923, 420572, -150044, 879, -85338, -261397, 72322, -38387, 86671, -59907, -368180, -256538, -99183, 149973, -50738, -280769, 229547, 125171, 28572, 102160, -38476, -189092, 76407, -285356, 104723, -194031, 202889, -86733, 184891, 73553, 130570, 611832, 222752, -123745, 196539, 86876, -240851, 50206, -99846]
12015E4424J56140b14992F1038q967g4366F2418a82986K6476L1347A41972f1878
12003A93829G9200B9421Q6863O5587P3730a46017L0552a6892q7525B0700B186
11991I0300e7992A08846J01040b50587a09298a2379E1381p199Q975b67774B65880
11979a8431H4570c9025B30779j6853c2244n9648C33704c21600B41540a12886j081
11968a13967q1133A30708A0712m819B804J50060J3042a46390O0456B1061a63259
11956f9733E8665N4503N1606k0566e9293k3961M0662B2389J1233b02279R7718
11945a04561A33579L1029i4017A66523E503R9337l2161a67074g6174j0461D3135
11933a91811m327C70851a49283j84297D8473e4290l7033A07606f5651P494J9203
$$ y = [54424, 210564, -214992, 61038, 52071, -74366, 62418, -182986, -156510, -125163, 141972, -61878, 193829, 79200, 29421, 116284, 181871, 255601, -146017, -115465, -16892, -104417, 20700, 2186, 90300, -57992, 108846, 209886, -250587, -109298, -12379, 51381, 44182, 53157, -267774, 265880, -18431, 84570, -39025, 230779, 213926, -32244, -91892, 333704, -321600, 241540, -112886, -113967, -195100, 130708, 10712, 5893, 2804, 152864, 165906, -146390, -85934, 21061, -163259, -69733, 58665, 113168, 164774, 144208, -59293, -83254, -42592, 22389, 33622, -202279, -104561, 133579, 164608, -94017, 166523, 5503, 104840, 72679, -167074, -76174, -86635, 43135, -191811, -196138, 370851, -149283, -333580, 48473, -54290, -91323, 107606, -65651, -58157, -38954]
11922c8954F3312M7275K17930A33073a36446E7865a74136E0410q582L84308a1871
11910B02527d75193a69749H8336b2733B80333E5126J90366a84087B29540a03996
11899a93214A2129a6347N418B67409H0490d0907l9975j24562j02527K3671b559
11887a94066h5910l0418c6703p6373e1802C1226P4969b64654J02625e363K650
11876b713B9331J95779a05905a7558p0817K6262A80105b04436e7488A6782J22220
11865A39002a52630D5013g1299k8490A87639a65547B38462G2015a98229J4657
11855a83572e9663A61910a96625B52585g3724I1063N5381a09262j2685C67724
11844c44034A36872E0133a64348I8632N3924k5937b01449j27357E3496e8580a0286
$$ y = [-38954, 63312, 110587, 328517, 133073, -136446, 57865, -174136, 50410, 41828, 426136, -11871, 202527, -475193, -169749, 88336, -22733, 280333, 55126, 245492, -184087, 229540, -103996, -193214, 12129, -16347, -10929, 267409, 80490, -40907, -80882, -205444, -307971, -284300, -2559, -194066, -85910, -116328, -36703, -113076, -51802, 31226, 106195, -264654, -162029, -5363, -2713, 29331, 225110, -105905, -17558, -88375, -62113, 180105, -204436, -57488, 16782, 139002, -152630, 45013, -71299, -99789, 187639, -165547, 238462, 72015, -198229, -183572, -59663, 161910, -196625, 252585, -73724, 91063, 146444, -109262, -121947, 367724, -344034, 136872, 50133, -164348, 98632, 152556, 126619, -201449, -328806, 53496, -58580, -10286]
11832d42147f9015A40216J6629a07752L4786r0041I6798b15538C96108A35751
11821a21037A69283a10311l9466m4076d8013n9766A10963n3367d19412a11564
11810a03249j16742d484k50852B63737i0951F4886i0905L5894R97k2755D03991
11798a3676n0754N949I2046d9710l92148J70462e7324n347r1836A23237N0888
11787A74125G0773J11205a6918f016j29343k65095A54007D4811b9039H6424J15808
11776B02232d9072N799k16697a7881C00318F0874a57785M1412C941Q1866B4124
11764a13949A77622N2413i9059l6787b2960L575A68077K5470b8992E4044f4907
11752D36275A99001b84551B27650a37884A24853R0462c42957F5578J38761b52045
$$ y = [-442147, -69015, 140216, 156845, -107752, -72966, -163007, 96798, -215538, 396108, 135751, -121037, 169283, -110311, -149777, -193853, -48013, -107779, 110963, 57596, -419412, -111564, -103249, -219991, -4484, -255336, 263737, -90951, 64886, -90905, -55011, -54014, -76769, 403991, -13676, -64430, -58481, 92046, -49710, -441858, -271396, -57324, -62671, -154507, 123237, 174125, 70773, 181978, -16918, -6016, -135359, -400454, 154007, 44811, -29039, 86424, 202232, -49072, -43273, -259970, -17881, 300318, 60874, -157785, -116373, 3941, 85807, 24124, -113949, 177622, 230035, -99059, -135846, -22960, -19385, 168077, 193547, -28992, 54044, -64907, 436275, 199001, -284551, 227650, -137884, 124853, 215315, -342957, 65578, 204339, -252045]
11741A18766l8208g5755j95238h9585A16474J35562b14985A49716D134K38942
11731B43076a29543N5596C96588D2181b5447j30468c1763j8765j62099B86903
11720c4798j30238K3796D35920A9447b9383A25466k5222A6275c01938e6798r1046
11709a47844A44775e1995N378A6088P0819J73779a01418C9815K89306A15606k1708
11698I3898L6875a77880A31241R9485j11894k8275f3336A97856J74961B1342e4372
11686a75511f4655A36236a57579A25181a29935D22123c2103c571C03445A12424
11675A44069n238B78R8291i4415Q016a6958D6051N319a2740l9677A76924L5046
11663B11970R4755a27283k5414o6606R9518a8890Q411I4373J96169A35118A4775
$$ y = [118766, 80558, -75755, -270993, -89585, 116474, 252036, -214985, 149716, 4134, 243076, -129543, -73947, 396588, 42181, -25447, -155915, -31763, -50528, -212627, 286903, -34798, -165036, -141240, 435920, 19447, -29383, 125466, 100244, 16275, -301938, -56798, -147844, 144775, -51995, -46617, 16088, 86907, 260686, -101418, 39815, 329121, 115606, 93898, 130773, -177880, 131241, 230726, 118832, 90557, -63336, 197856, 372817, 21342, -54372, -175511, -64655, 136236, -157579, 125181, -129935, 422123, -32103, -3571, 303445, 112424, 144069, 138831, 278, 98569, -94415, -86399, -16958, 46051, 51370, -12740, -52417, 176924, 211970, 306725, -127283, -152697, -219303, -119785, -18890, -10479, 94373, 290542, 135118, 14775]
11651A4796L34922a72735N2488k01148G949L8738b1091E4115J27514n7571J19197
11640B43255b1855j18430P143C17233n9195b57907K5206B33769d2390G5567g6490
11628F588L63140a48244k04068f8392j52280j36392E0352J51238a89623j63372
11618c52995J69409L140Q3210C28695j04760H5299a95010Q1594G0101d908B7692
11606A53581b81501M8492A00929J6654N5188J44321f7710r9403k65170C53612
11595g5617E7430a61537A08670b6366C14573p2404C7765J54441J66075A14424
11584A80040J7033P41C8486a8874k49643a1999j31120a3465j81348A48713E2129
11572A6629g8195C95921A90831b9555C73060A7553K76001a04163A35540Q8986
$$ y = [14796, 349718, -172735, -120247, -321395, 7949, 46687, -21091, 54115, 181629, 124058, 243255, -21855, -140285, -133142, 317233, 258038, -257907, -232701, 233769, -42390, 75567, -76490, 6588, 369728, -148244, -352312, -68392, -220672, -357064, 50352, 201590, -189623, -352995, -183586, -180446, -97236, 328695, 223935, 85299, -195010, -113416, 70101, -4908, 27692, 153581, -281501, -233009, 100929, 117583, 172771, 317092, -67710, -167113, -432283, 353612, -75617, 57430, -161537, 108670, -26366, 314573, 242169, 37765, 192206, 358281, 114424, 180040, 197073, 197814, 38486, -18874, -268517, -11999, -143119, -13465, -194813, 148713, 52129, 16629, -78195, 395921, 190831, -29555, 373060, 17553, 293554, -104163, 135540, 224526]
11562B24526b7216C47464G1798J87004b8681A49213o0249l4471b8268r0314M8191
11551g0391a5263N72o1617q6215n9332i716j72671A57799a07329A94077b25826
11539C2321J2738c9766C48356a4911C37550f0534A58790G5050K20562k4983d6363
11527A78043P6880j3177F6360K20476j5494A22116J06111I0663B6784a0616C09288
11515a21468B86850A05505P387B0416O0073J8498J87822A42635b5266I8801P1008
11504A69809j1820o6359K39930F750Q3477L7806m1961P8856q1865A2222a54104
11492C56112A56576L6363a95152A57606h6623G8518L6751J30578g2846D8421K22268
11481B70689M162j8033i142E2106J92842o0755c506B21216Q5909o823e7892a5948
$$ y = [224526, -27216, 347464, 71798, 258802, -28681, 149213, 88964, 54493, -28268, -118582, -70391, -15263, -14691, -76308, -162523, -221855, -9716, -182387, 157799, -107329, 194077, -225826, 32321, 45059, -39766, 348356, -14911, 337550, -60534, 158790, 75050, 295612, 270629, -46363, 178043, 254923, 241746, 66360, 286836, 271342, 122116, 228227, 90663, 26784, -10616, 309288, -121468, 286850, 105505, 112892, 20416, 80489, 98987, 286809, 142635, -25266, 98801, 169809, 157989, 91630, 331560, 6750, 90227, 128033, 86072, 164928, 83063, 12222, -154104, 356112, 156576, 192939, -195152, 157606, -86623, 78518, 115269, 245847, -72846, 48421, 270689, 274851, 256818, -9142, 52106, 244948, 184193, -3506, 221216, 307125, 300302, -57892, -15948]
11468F5079c6266G0962O4896K5315c6426B1543h2873C16703a38639e6249j63088
11457b19337m6769A22186L4722m3392a51374C20408m0988F7320J26264o1522J48999
11446B81061o3451b1394B07627J09506j56055J222b5710a1881E3862J85154N807
11435B44823B7037L01319C4933J70398r9728a65171c7748n2350B50115C4246K4051
11424E8297J85419a3044A25528h5370j61861k5941B44384a57621e8990B12593
11413D30664E9743f231G1341J67925h4298H1905a01751E811P7690Q5496H3648
11401B07297h4204F1244P613h4609A26893h1472G2976f1004A9431p484a94944
11389B45465I1945h2421j9709J4589K2053I9878J30594J44029e8816F6402A5997
$$ y = [65079, -36266, 70962, 135858, 161173, -36426, 21543, -82873, 316703, -138639, -56249, -219337, -266106, 122186, 156908, 113516, -151374, 320408, 279420, 67320, 193584, 132062, 281061, 217610, -21394, 207627, 317133, 161078, 162300, -25710, -11881, 53862, 239016, 244823, 27037, 328356, 34933, 205331, 105603, -165171, -37748, -90098, 250115, 34246, 58297, 243716, -13044, 125528, -85370, -247231, -273172, 244384, -157621, -58990, 212593, 430664, 59743, -6231, 71341, 239266, -84298, 81905, -101751, 5811, 83501, 168997, 83648, 207297, -84204, 61244, 68857, -84609, 126893, -81472, 72976, -61004, 19431, 11947, -194944, 245465, 91945, -82421, -102130, -87541, -65488, 99878, 230472, 374501, -58816, 66402, 15997]
11377b90358A76559b53889b5376A90743b2547k27299i9105A97112j1492a5322
11366a0547j89666j56997A14731d84457a05854k4852B26801a07207H4707e0628
11355E3047J87770q1837o5014a27861B7113b03630o0176J16095C1805a83048H5598
11343B7521J70985K1252n3648a7010C42791b09861L9859j5882k8663C1995f7419
11331e5806b3019A05663b30680b4676B3077h985B40212d8806A23260a65109A88638
11319E3832i5650j4625A27091n9128K49504c1342l6395A97703A967J02324J1182
11308A15473b91882e0272A00001a37099B4630a17883c0622j35521j852k03234
11298c71229a5556B29254b35180E1446a55589N0306N1533C251J6786a83020j65212
$$ y = [-290358, 176559, -253889, -25376, 190743, -22547, -249846, -99105, 197112, 185620, -15322, -10547, -200213, -357210, 114731, -484457, -105854, -130706, 226801, -107207, 84707, -50628, 53047, 240817, 158980, 93966, -127861, 27113, -203630, -263806, -147711, 31805, -183048, 85598, 27521, 198506, 219758, 166110, -17010, 342791, -209861, -170002, -185884, -214547, 31995, -67419, -55806, -23019, 105663, -230680, -24676, 23077, -8985, 240212, -48806, 123260, -165109, 188638, 53832, -95650, -110275, 127091, 67963, 317467, -31342, -67737, 197703, 1967, 104291, 115473, -291882, -50272, 100001, -137099, 24630, -117883, -30622, -166143, -167995, -371229, -15556, 229254, -235180, 51446, -155589, -105283, -53750, 3251, 20037, -183020, -348232]
11287c48232B67062a19759C06521h2250A55137b71412B67587I913a48215D4735
11276A50833J07766c85539J02874a34368a2219m7188n09216C1187f6939D631J83955
11265A88586a8860c245l02124E1641i4100B42237c35897A14496b09124e856o8258
11254g4114B60129H8430a77427B03315r6762l2550A1732J0786J49053a14373l4884
11243a49257C52678c7385A40011c988l6530h808B0231c54647a58390M2611A18824
11231C39883A56339a35185J3602l7641a6268k02716P1909B5131d60659a23805
11220a26157H8121b62057I4697a06972j67810a8385j32018A94676o7398e5525
11209F2821L7401c20929l1721A58366o7615g3183E5176g45A00239e8940B2167
$$ y = [-348232, 267062, -119759, 306521, -82250, 155137, -271412, 267587, 9913, -148215, 44735, 150833, 258599, -385539, -282665, -134368, -12219, -59407, -568623, 31187, -66939, 4631, 188586, -18860, -3245, -305369, 51641, -94100, 242237, -335897, 114496, -209124, -5856, -74114, 260129, 88430, -177427, 203315, 106553, 74003, 11732, 22518, 171571, -114373, -149257, 352678, -37385, 140011, -3988, -40518, -8808, 20231, -354647, -158390, -115779, 118824, 339883, 156339, -135185, -121583, -159224, -16268, -218984, -147075, 25131, -460659, -123805, -126157, 88121, -262057, 94697, -106972, -274782, -18385, -150403, 194676, 127278, -55525, 62821, 100222, -320929, -352650, 158366, 90751, -73183, 55176, -745, 100239, -58940, 22167]
11197f0738I0607b06648j26327j23839C01151b34129O7701g7450G2476c3419k5920
11186e9339j21004A61536o2633b76841b0680E3119a34964A2532M4517i5196D4138
11174A27215j4984Q139a52203A78919d5072J2059G2278a75642A59002a58127P2087
11163h6040d272n3120Q011k25741f7593i495j12321A31616b34899G4253e7949
11151b35133C9323b37438K8540A26346a11249C608a29236e4357B30931a6790k69731
11140b86521F3137a48928C7778g147j1562D0551J38112D2784j4531Q2132R5841
11129B06226b89968D4677L6180j5628b12712G4276a3606o4423n6445e3090B20421
11117b3092A20508K56957J52116A24432a72066E9886c2951C50067d8661C02442
$$ y = [-60738, 90607, -206648, -332975, -456814, 301151, -234129, -166428, -77450, 72476, -33419, -59339, -180343, 161536, 98903, -276841, -20680, 53119, -134964, 12532, 57049, -95196, 44138, 127215, 112231, 120370, -152203, 178919, -45072, -33013, 72278, -175642, 159002, -158127, -86040, -4272, -57392, -49381, -275122, -67593, -9495, -121816, 131616, -234899, 74253, -57949, -235133, 39323, -237438, -208898, 126346, -111249, 3608, -129236, -54357, 230931, -16790, -286521, 63137, -148928, 37778, -7147, -18709, 40551, 178663, 42784, 28253, 110385, 206226, -289968, 44677, 80857, 65229, -212712, 74276, -13606, -78029, -134474, -53090, 220421, -23092, 120508, 377465, 529581, 124432, -172066, 59886, -32951, 350067, -48661, 302442]
11106C4165e1969H3189j018K191K80484f3951k2272j15763A08940b37001D44319
11094A08445d8979A29443a42595C07292p6637F8556L18494h2755B26534J23378
11084C49912r2517r4969L0438R0660J45307A51590K6079k0859L4983c84632B2488
11072B5805L78076A20546K11311n6854L58415k17236K38411J65344k28756k8188
11062E62993N7461K30644k03777l1075j66537J10831J00677K7633K0840N9297
11052G68987j00078M2034j25345k7049j66009N27294j86463R73J55029k09416
11042F79957J34444k24015J07400j03955q9133j73851L01994j30051K61567j22279
11032F42078J624K66731p5724k81328L40309K9467j42403j9468p6218j0010K63233
$$ y = [34165, -51969, 83189, 82171, 84362, 364846, -63951, -86223, -201986, 108940, -237001, 444319, 108445, -48979, 129443, -142595, 307292, 230655, 68556, 387050, -82755, 226534, 349912, 257395, 162426, 192864, 283524, 428831, 151590, 177669, 156810, 191793, -384632, 22488, 25805, 403881, 120546, 331857, 275003, 633418, 416182, 654593, 819937, 591181, 562993, 620454, 851098, 647321, 616246, 449709, 560540, 661217, 688850, 709690, 768987, 668909, 710943, 585598, 558549, 392540, 919834, 733371, 734344, 889373, 679957, 814401, 590386, 697786, 593831, 504698, 330847, 632841, 502790, 764357, 642078, 643702, 910433, 834709, 553381, 893690, 923157, 780754, 761286, 685068, 675058, 938291]
11021I38291j06864L3758J51249n00037J2016N536J25668o773Q0816j30830j01895
11010E00935R4805o914n9682J45394o5916R8968O1879l57730J29533J35584K0091
10999F96947K74162k84677B85175M94200j42101j8837J99911J3863L8988K75596
10989A146795p2568m852l53056J99490L1078L06036j83171k94847O65553J47074
10979A587532p1627R6638O72955J50843n09601N38728K08164M33928k80389L66661
10969C193832o44180l26812l23002N3740Q2994m35118N683R3411j4955m80267
10959A205326J68705L09925n26747K62502p6876k16699l64694L43137m32391j55599
10949E16589j12616A23512O6856b2213B52817Q2299A38939K17309D9274a27993
$$ y = [938291, 831427, 865185, 1016434, 516397, 528413, 533949, 659617, 652844, 733660, 602830, 500935, 595740, 588826, 529144, 674538, 608622, 707590, 769469, 411739, 541272, 676856, 696947, 971109, 686432, 285175, 779375, 637274, 618437, 818348, 832211, 871199, 1146795, 1074227, 1069375, 716319, 915809, 946887, 1252923, 1069752, 774905, 1440458, 1587532, 1515905, 1612543, 2285498, 2436341, 1926740, 2465468, 2673632, 3107560, 2827171, 3193832, 2549652, 2222840, 1899838, 1953578, 2036572, 1601454, 1607137, 1700548, 1685593, 1205326, 1374031, 1683956, 1157209, 1419711, 1342835, 1126136, 761442, 1104579, 672188, 516589, 403973, 123512, 190368, -22213, 252817, 335116, 138939, 356248, 49274, -127993]
10938C19597n3036A26334L4403a09991D3928e144j19553E9464j0486L94518b09907
10926b70336A03922F165N9320L0901b7144l2354q6181B61782A28888m3082P658
10915I3464a60396O072k03580h624B32930b01740f974A60492b9643k05959I4709
10903I8227L4400a27777A90269e8787a4717M450n9810k7317F7143j7960f7538
10891C55710F7211M06272j62204a53822M102O9590l1570o2475j68186E8469k7626
10880C0843c18361G8926a97772g8870B25704N6070f7254B02657j4906D4614d8273
10868d98191a21084j60023C27491e0642A03586a8046o3296c9568j58573j6275
10858b14416h7913L4977A4407M5388b23766j6175A00522a17952e080k45919B13321
$$ y = [319597, 266561, 126334, 160737, -109991, 43928, -5144, -124697, 59464, 48978, 443496, -209907, -270336, 103922, 6165, 65485, 96386, -27144, -59498, -145679, 261782, 128888, 85806, 93464, -160396, -154324, -357904, -8624, 232930, -201740, -6974, 160492, -29643, -235602, 94709, 98227, 132627, -127777, 190269, -58787, -14717, -10267, -70077, -97394, 67143, 49183, -67538, 355710, 67211, 473483, 311279, -153822, -149720, -80130, -111700, -174175, -342361, 58469, 30843, -318361, 78926, -197772, -78870, 225704, 281774, -67254, 202657, 187751, 44614, -48273, -498191, -121084, -281107, 327491, -50642, 103586, -18046, -81342, -39568, -198141, -214416, -87913, -52936, 14407, 59795, -223766, -239941, 100522, -117952, -5080, -250999, 213321]
10846C5726a77989F2718g0010A44352a17803A30355l757C6385J12291l2344B5072
10834a46617p7665N6479A21793J20670E8527e2101B56281a90478C58066A51289
10823a67530D66002f7874P806J2430k0935l0355j26973N2876A17908c3320j2629
10812d5949J9617B34997b01949M0768g0896G8623D997P6947a75865L0542F3444
10800A165a29117F0627g2552j85124J11471A49479J4025M0118F8346b81721a9381
10788b86019a10470e0321k54446E1503a44476E8675c12100j36240f9084a9085
10777a05212E0027b90455a13741M3657a7969o9572b005j14767l15558a20704k7604
10766a48308b1822C6459b55302M4350h6870A0604c6295A69051b03488A63053l6438
$$ y = [35726, -177989, 62718, -70010, 144352, -117803, 130355, 126598, 36385, 148676, 116332, 25072, -146617, -224282, -167803, 121793, 242463, 58527, -52101, 256281, -190478, 358066, 151289, -167530, 466002, -67874, -60068, -47638, -68573, -98928, -225901, -173025, 117908, -33320, -45949, -26332, 234997, -201949, -161181, -70896, 78623, 4997, 81944, -175865, -145323, 63444, 1165, -129117, 60627, -72552, -257676, -146205, 149479, 163504, 203622, 68346, -281721, -19381, -286019, -110470, -50321, -304767, 51503, -144476, 58675, -312100, -448340, -69084, -19085, -105212, 50027, -290455, -113741, -70084, -17969, -87541, -2005, -116772, -432330, -120704, -148308, -21822, 36459, -255302, -210952, -86870, 10604, -36295, 169051, -203488, 163053, 126615]
10755A26615a51538r8330A81426C1806C970J23237A1040b4212D15575e9014B61474
10743a58664R105A61448g1388m3883A44819j0931n825D1618N7522b07776f3795
10731a69535A4254b25883c5117C71864d1610C4228J34354b8133A53154k2979a02775
10719A04093N7875b65891J18087F2718i7616D4158b09511g7576A86881g6942K4554
10708e2388E8569b37112R3196A57498j0684O1915B0001M05468a39916B34952a78173
10696b52904o6328A17139E4210h0469n9201j73349c3297j44902A07356J67170
10686B74526b57281D656b4666l13047C5883c01811e8932k33256A11948a20259
10675a64403B27926p1271c01215A04438a81503b4608B12909B3285J1012J55690
$$ y = [126615, -151538, -249868, 181426, 31806, 3970, 127207, 11040, -24212, 415575, -59014, 261474, -158664, -149559, 161448, -71388, -115271, 144819, 133888, 128063, 41618, 99140, -207776, -63795, -169535, 14254, -225883, -35117, 371864, -41610, 34228, 168582, -28133, 153154, 130175, -102775, 104093, 161968, -265891, -147804, 62718, -97616, 44158, -209511, -77576, 186881, -76942, -52388, 58569, -237112, -143916, 157498, 146814, 208729, 20001, 425469, -139916, 234952, -178173, -252904, -319232, 117139, 54210, -80469, -139670, -313019, -33297, -178199, 107356, 274526, -257281, 4656, -24666, -337713, 35883, -301811, -58932, -292188, 111948, -120259, -164403, 227926, 156655, -301215, 104438, -181503, -24608, 212909, 23285, 34297, 189987]
10665A89987J1001a7350M03k89127A91752h343G3797J64065a66622A39790n5664
10654H4126b03383O3081A16397h2838j34594H0065g5725a1304A3809J72239b22418
10642b7678j47427Q1763k73098A14845J72789q2040f2036a1725j10075A28328
10631c61655A84702c06220F962a78922h5291L2968A03439k3584a55450A90309
10620e51401a74424P3538C8802K4122j4512b34496b6536F4527b45903h0779c98
10608F3022K876b722m0772D0100a18013c7456l52689g777B01702p9538J14179
10597B36343I269g4478k59365A85785b36435B44806c16791f3209A2172N775J78452
10586A96399r5926f9335B78921A16545R9592D2126c3390C584J19318D735J11371
$$ y = [189987, 200988, -17350, -16947, -306074, 191752, -8343, 73797, 237862, -166622, 139790, 84126, -203383, -140302, 116397, -82838, -217432, 80065, -75725, -11304, 13809, 186048, -222418, -27678, -175105, -93342, -366440, 114845, 287634, 205594, -62036, -11725, -121800, 128328, -361655, 184702, -306220, 6962, -178922, -85291, -52323, 103439, 79855, -155450, 190309, -551401, -174424, -100886, 38802, 62924, 48412, -234496, -26536, 64527, -245903, -80779, -398, 63022, 65898, -2722, -43494, 40100, -118013, -37456, -390145, -7777, 201702, 122164, 236343, 9269, -74478, -333843, 185785, -236435, 244806, -316791, -63209, 12172, 17947, 196399, 100473, -69335, 278921, 116545, 216137, 42126, -33390, 3584, 122902, 4735, 116106]
10575A16106b38529B39024m0876c40k36693A1856a22134c5192B51341a93331A71637
10563F1158L2654J24186e2204H3909R51d4315E0057J83061B076K28895a17456
10551b12657D0913O3411c62094a31800C16a66235m56804D4347N3974c57995D2007
10539e474o6256c2601j06258k85966A69097g8248A65212k7883b7416D9027c2589
10527D6307a29577e5226l41994G3214d3489j72287D5049b28633i029F026b14694
10515c57429J35053E6660J84956D8449L296d5222l1712A62218a23942J312A49348
10503A07262J45277b50901a18264C8655a85294B31843a20736A41255n9390H647
10492a86161B90677a13284J5820d0629r2419A80564H8285M30695K2060j70944
$$ y = [116106, -238529, 239024, 198148, -340, -237033, 11856, -122134, -35192, 251341, -193331, 171637, 61158, 93812, 217998, -52204, 83909, 84860, -44315, 50057, 233118, 2076, 230971, -117456, -212657, 40913, 104324, -362094, -131800, 316, -166235, -623039, 44347, 98321, -357995, 42007, -5474, -71730, -32601, -138859, -424825, 169097, -78248, 165212, 137329, -27416, 49027, -32589, 46307, -129577, -55226, -397220, 73214, -43489, -215776, 45049, -228633, -9029, 6026, -214694, -357429, -222376, 56660, 241616, 48449, 51745, -45222, -76934, 162218, -123942, -122630, 149348, 107262, 252539, -250901, -118264, 38655, -185294, 231843, -120736, 141255, 81865, 8647, -186161, 290677, -113284, -97464, -40629, -133048, 180564, 88285, 518980, 541040, 370096]
10482C70096A48603K75032A34808o0296c64439a10393D5852a60900H4490Q9595
10472A74085J59424d5389j98490G0567P7485o1578d4466C076a54564j8860j18886
10461b92310q8559H1055b57261G3653c80425O9837i5975B47718a13536A53200
10450a8962m3706j08269h3719l2281a2715D4121a05105B50864b65812A49218G059
10438C26351E4202c45588a62154l8772J2574F3066B5649J0515a44914F2536b0153
10426B12299p0417I921c44753B30437A5449h8688J1012j22461A10321g8778a3257
10414a9360A50917g1892o2388E4946c50032B2082e5022E7591b7106G7248b38867
10402B94281i1815a9112n8134I6703H43c2652j04612A12290g9725j31127D1588
$$ y = [370096, 148603, 423635, 134808, 74512, -364439, -110393, 45852, -160900, 84490, 174085, 333509, -45389, -243879, 70567, 148052, 86474, -44466, 3076, -154564, -173424, -292310, -380869, 81055, -257261, 73653, -380425, -310588, -95975, 247718, -113536, 153200, -18962, -62668, -170937, -83719, -116000, -12715, 44121, -105105, 250864, -265812, 149218, 7059, 326351, 54202, -345588, -162154, -200926, -188352, 63066, 25649, 36164, -144914, 62536, -20153, 212299, 141882, 9921, -344753, 230437, 15449, -88688, -77676, -200137, 110321, -78778, -13257, -19360, 150917, -71892, -134280, 54946, -350032, 22082, -55022, 57591, -27106, 77248, -238867, 294281, -91815, -19112, -77246, 96703, 843, -32652, -137264, 112290, -79725, -210852, 41588]
10390A23796a63335C03418e0757B16169K49912F9796K69345E890J25894o1218
10380G0566J16695D8449i5704B36941J59371e3184C26383F1947O82548A89409
10369D46553J65592L229k77528R30A07953K86173j70374q3058K27713J13415A46489
10357c5461B52724J07774j30170j5960K18221j02092M10463k6053A94067k8478
10347A65589L02714A98795M60169q8168G0332M56655a18043N6937j40750A40110
10336C47935n4019J76314F0217B8015J53679k5619g1592j22469H2099b4089B86300
10324c1247D89392j76895A1776h3242C18173f8766c3438A10808C9715J97275d0875
10312A98908J5479G4400C5180d0526A67521C2852g7461a2666D9132J6145e5337
$$ y = [123796, -163335, 303418, -50757, 216169, 466081, 69796, 339141, 5890, 131784, 70566, 187261, 48449, -95704, 236941, 396312, -53184, 326383, 61947, 744495, 189409, 446553, 612145, 615374, 337846, 338776, 107953, 394126, 223752, 140694, 368407, 481822, 146489, -35461, 252724, 360498, 230328, 214368, 432589, 330497, 740960, 714907, 194067, 165589, 468303, 198795, 658964, 570796, 70332, 526987, -118043, -61106, -201856, 140110, 347935, 293916, 470230, 60217, 28015, 181694, 156075, -71592, -194061, 82099, -24089, 286300, -31247, 489392, 312497, 11776, -83242, 318173, -68766, -33438, 110808, 39715, 236990, -40875, 198908, 214387, 74400, 35180, -40526, 167521, 32852, -77461, -12666, 49132, 65277, -55337]
10300a67931Q2942a4513A93444e3451B60233i3064j54074C9335a43450j80550
10290c24000a8004k8195F4063K15058c4191B71496F6023B1946a70442a6958p0411
10279h7369k5214j05880B31534b18965B49328a33978I3674J44520A4830J39890
10269A54720B0439K79797e0076H4836j1393M05012k29538k4359K0559G2493a23721
10257D61456A90981A319J48654k8680a8472C12402h6515A69745n9801B2105a24379
10245c65417e231j00858e1698A31196j8262Q300n5187b32198J12038a8138A33982
10233c76421A03363h9026q8320A58038G4217a55697n509A39433b72201B34245
10222A71917c30806A49092E9568a14122l82654C41565a32321k08733A07443g0628
$$ y = [-167931, -84989, -14513, 193444, -53451, 260233, -93064, -247138, 39335, -143450, -324000, -18004, -46199, 64063, 279121, -34191, 271496, 66023, 21946, -170442, -16958, -87369, -112583, -218463, 231534, -218965, 249328, -133978, 93674, 238194, 14830, 154720, 20439, 300236, -50076, 84836, 73443, 478455, 248917, 224558, 245117, 72493, -123721, 461456, 190981, 1319, 149973, 121293, -18472, 312402, -86515, 169745, 109944, 22105, -124379, -365417, -5231, -106089, -51698, 131196, 112934, 121234, 66047, -232198, -120160, -18138, 133982, -376421, 103363, -89026, -177346, 158038, 74217, -155697, -161206, 139433, -272201, 234245, 171917, -330806, 149092, 59568, -114122, -496776, 341565, -132321, -341054, 107443, -70628]
10211a26155H3976A7609F935L12273A10501n2774B5718c96798P8882M6244h0391
10199a05831I0502f4492A80647C0705b11568f1124k41425B7638L7830B0698a2013
10187d8074m21803J45328a50172E5906a18491L1088B47919a16027B08380d1929
10176a33059c7416r5508A83746b96406b5082G6473j3260f7380l0513k44417a49453
10164b21410j35548b1941j24261k2374g1494a2582j02619K4242B66606b76750
10153e6199A15180f3737L633B26495a56079B60380A03525j4725L5039b66835C55514
10141c22193B28495a23289k66581C293a24819G700J46521b23160f1616E8385a62381
10129a78693N0745B4645J71747c08324a52699O4278o2949L7787j14306B74248
$$ y = [-126155, 83976, 17609, 6935, 319208, 110501, 57727, 25718, -396798, -317916, -271672, -80391, -105831, 90502, -64492, 180647, 30705, -211568, -61124, -302549, 27638, 65468, 20698, -12013, -48074, -469877, -324549, -150172, 55906, -118491, -87403, 247919, -116027, 208380, -41929, -133059, -37416, -132924, 183746, -296406, -25082, 76473, 63213, -67380, -97893, -342310, -149453, -221410, -356958, -21941, -146202, -168576, -71494, -12582, -115201, -90959, 266606, -276750, -56199, 115180, -63737, -60104, 226495, -156079, 260380, 103525, 88800, 123839, -266835, 355514, -322193, 228495, -123289, -389870, 3293, -124819, 7700, 154221, -223160, -61616, 58385, -162381, -178693, -127948, 24645, 196392, -308324, -152699, -88421, -151370, -113583, -227889, 274248]
10118D57338A9611a11378r1238m7008A64883c75677G1441a2862G3350K58670b18918
10106C19654H0839A6234f0604j09733b6133n92375A17850j240h3859j22808Q9300
10095a17367e6247H6147b05190A17619a32832C4875a09793E5680a64496P1408
10085i3088j24763O0639A67512K48674b16180I9236R7600k3848b24445e1325a2684
10073d18121a30427G4463a16809l4374A2138m254R2448b57835A82086c06562J11182
10062a95380G065c02923a63B55229a36217d2250A57706c11822O5836i0492k39612
10051c30104J01078R448A84827i5759A7700a03839A55602E0722N7962d7617E4984
10039a7308k94851a3718p9693K3850J6283p360g739A75827d621H9064b64900O157
$$ y = [457338, 19611, -111378, -202616, -249624, 164883, -375677, 71441, -12862, 73350, 332020, -218918, 319654, 80839, 16234, -60604, -170337, -26133, -618508, 117850, 116610, -83859, -206667, -117367, -56247, 86147, -205190, 117619, -132832, 34875, -109793, 55680, -164496, -93088, -217851, -157212, 167512, 416186, -216180, 99236, 196836, 172988, -224445, -51325, -12684, -418121, -130427, 74463, -116809, -151183, 12138, 7884, 100332, -257835, 182086, -306562, -195380, 7065, -302923, -163, 255229, -136217, -42250, 157706, -311822, -245986, -90492, -330104, -229026, -219578, 184827, -95759, 17700, -103839, 155602, 50722, 108684, -47617, 54984, -17308, -312159, -13718, -93411, -69561, -53278, -60638, -7739, 175827, -4621, 89064, -264900, -258743]
10027b58743i2158K3203I1694h3629l19763P4090f2321B6456a57920k24339D0184
10015C9605b58254f7240l63694J82030H1488K6154h9558b8338l63704J60075B26524
10003a79052j78396E2423c0196A59693P2494a36030C1699a18261A4555b95820
9992b07708K0984G8253i4680M6207C5334J74698a6332a867A44650a83108D9581
9980A78141c77963a72596j64186d1494j72108F7707O4634b32377K6916j45644
9970c51105a73293A48536a99273c5922o6446K3932B08911a06071k47001G618g1815
9958d02203J84142D6508b06122O2238A18003a61470k11205J70497b6559k2187
9948d8746G73e4732G74J28685b43410C30406A61846b17059N4322D1287d0111j32540
$$ y = [-258743, -92158, -68955, 91694, -83629, -403392, -329302, -62321, 26456, -157920, -382259, 40184, 39605, -258254, -67240, -430934, -248904, 81488, 107642, -89558, -28338, -392042, -231967, 226524, -179052, -357448, 52423, -30196, 159693, 232187, -136030, 31699, -118261, 14555, -295820, -207708, -186724, 78253, -94680, -48473, 35334, 210032, -16332, -1867, 144650, -183108, 49581, 178141, -377963, -172596, -336782, -41494, -213602, 67707, 132341, -232377, -205461, -351105, -173293, 148536, -199273, -35922, -102368, -78436, 208911, -106071, -353072, 7618, -71815, -402203, -218061, 46508, -206122, -143884, 118003, -161470, -372675, -202178, -26559, -48746, 773, -54732, 774, 129459, -243410, 330406, 161846, -217059, -162737, 41287, -40111, -172651]
9936a72651F5880K0596j6639J23262c79732H4315a82230j82831a29581J024a7170
9924A14712m8293b17090H3109Q3288J13848m8664a82396G3784e7158K8071j49728
9913a78815F2245J10009l2986c4977p4937e0975B27437d04282J20050e4656q7761
9902a42417e9092l12581C24187A3242K22844a57946O5269p723b4290A3871J59180
9891A73051a65612G3337C3189Q0156a58696A03336K14165B2814e8066k95221R2755
9880b60532a02061r7331P6948B01490c3142J0010k48850i7831P536L297A80853
9868b32002J13013I4458N335J6869f7026j98033Q0205M4152d5241j2482H276a64411
9855a53620f1799K8315A79806p0815K72914A01443b06433B11940j03231a45906
$$ y = [-172651, 65880, 86476, 69837, 193099, -379732, 84315, -182230, -365061, -129581, -128557, -17170, 114712, 66419, -217090, 83109, 166397, 280245, 231581, -182396, 73784, -57158, -29087, -178815, 62245, 172254, 139268, -34977, -109914, -50975, 227437, -404282, -284232, -54656, -142417, -59092, -371673, 324187, 13242, 236086, -157946, -92677, -100400, -24290, 13871, 173051, -165612, 73337, 33189, 113345, -158696, 103336, 317501, 22814, -58066, -353287, -260532, -102061, -199392, -122444, 201490, -33142, -23132, -271982, -97831, -90295, -86998, 180853, -232002, -118989, 94458, 99793, 116662, -67026, -265059, -184854, -140702, -45241, -57723, 8276, -164411, -153620, -61799, -33484, 179806, 108991, 381905, 101443, -206433, 211940, 108709, -145906]
9844f5395n55550b5813l32945J15917P0039G2586b02559P5640C0177a77833a3533
9832a77174B09015a17853o8945B0806d11237E9056e4419k51579B10545c18008
9821A9381c51435M3676A21943J9318c5098F1773K08716A15532b49921c8966G8627
9809F0820c04199g6391j3762o6827A0387e5699k35591e2417j36676f3403q3745
9798a47148n9836F8233O3401e0773A7593b20115A81310m7708d5069H3863j8338
9787F5525g3208j42267L4648O3340A64462c135B88758C2197i8497D0246L69884
9776D10130d687n3306q0762A53656b95576l3235f562k39999A33700a28258H303
9764b85784B90265a45827N8797B61749F1863J36413n6157A5361d7692B9319b3053
$$ y = [-65395, -620945, -25813, -358758, -242841, -172802, 72586, -202559, -126919, 30177, -177833, -13533, -177174, 209015, -117853, -186798, 20806, -411237, 59056, -54419, -305998, 210545, -318008, 19381, -351435, -307759, 121943, 141261, -35098, 61773, 270489, 115532, -249921, -38966, 78627, 60820, -304199, -76391, -90153, -156980, 10387, -55699, -291290, -52417, -189093, -63403, -147148, -206984, 68233, 131634, -50773, 17593, -220115, 181310, 133602, -45069, 83863, 65525, -73208, -215475, -180827, -117487, 164462, -3135, 288758, 32197, -98497, 40246, 410130, -4687, -57993, -138755, 153656, -295576, -328811, -6562, -246561, 133700, -128258, 8303, -285784, 290265, -145827, -87030, 261749, 61863, 198276, 142119, 15361, -47692, 29319, -23053]
9752D70621a35935k46023c9170B4107a454k73981N8237C09730b96355B6184R9158
9741A25342c96586i7062c9485q0020I5850a71365D7271b75994f8772B9591J225
9730C0816a28006k77191A22837b6002e457l020n8157r7099k59525a51949A20327
9718F6919N1262d31199R7566J20882A90409a27653C31102a00847d5942C21866
9707D04189a05022d9256j61043j88152C7764c60068B30632h9453k16099B13276
9696a89373j88962A99813a76884h388A22669a38583D0576f2977m911q55l7359
9685a06102C8320a40859m4482e3732o5430r1572L7488N6049k08195d8035H5204
9673a8605o7408j10803j09605G1015R1808c2612j40068N683D2916b68484N942
$$ y = [470621, -135935, -381958, -39170, 24107, -1454, -275435, -217198, 309730, -296355, 26184, 125342, -396586, -97062, -39485, -119505, 95850, -171365, 47271, -275994, -68772, 29591, 30816, -128006, -405197, 122837, -26002, -5457, -8477, -66634, -163733, -423258, -151949, 120327, 66919, 118181, -431199, -333633, -212751, 190409, -127653, 331102, -100847, -45942, 321866, 404189, -105022, -49256, -210299, -398451, 37764, -360068, 230632, -89453, -305552, 213276, -189373, -378335, 199813, -176884, -8388, 122669, -138583, 40576, -62977, -67888, -68743, -106102, 38320, -140859, -185341, -53732, -119162, -210734, -173246, -117197, -325392, -48035, 85204, -18605, -86013, -196816, -306421, 71015, 162823, -32612, -172680, -166997, 42916, -268484, -262542]
9662b62542I9190d31648A14505b59294a03486F3053b24414a10962A41583b02866
9651g5680l12224C76408b11962d2264F7880a00141G6881a53382j08809H4955a61453
9639E8839a08516B88935c44452D52435E3729a30267B2105F746a07334J2661l0798
9628a25471j92500I633i8036j03225M8149j1955g1949j21040a8022r7413b5690
9616b08833c6917j85056m1183d1622A431i0297k0192j62689O9563C23091j32931
9605A90160J1165j0171a3085j84489G319b48982J3820O5860a4527j50900B05838
9593h807k14461C0635a96883G3408h3079K7277j70967l0856J8165D6394d3526
9581B46217A03813N939L951a02063j5407k26841A16710M1799a55152C8229a40755
$$ y = [-262542, 99190, -431648, 114505, -259294, -103486, 63053, -224414, -110962, 141583, -202866, -75680, -387904, 376408, -211962, -42264, 67880, -100141, 76881, -153382, -262191, 84955, -161453, 58839, -108516, 288935, -344452, 452435, 53729, -130267, 22105, 6746, -107334, -94673, -125471, -317971, 9633, -98036, -201261, -153112, -165067, -71949, -192989, -18022, -115435, -25690, -208833, -36917, -221973, -263156, -41622, 1431, -90297, -110489, -273178, -203615, 323091, 190160, 201325, 191154, -13085, -197574, 7319, -248982, -235162, -169302, -14527, -165427, 205838, -8807, -223268, 30635, -196883, 73408, -83079, -55802, -226769, -257625, -239460, 46394, -43526, 246217, 103813, 109752, 113703, -102063, -117470, -344311, 116710, 158509, -155152, 38229, -140755]
9569B20950b42958b3134r0121k95126I4550N503J83980A00324a15793A2957P0793
9558H3750O5677F1768b55975l3786a37840c4840r8450B02200p5996a24586E9195
9546D1825h8499j42032a13622C10102b3742B20364c88926A15303E4077i4853j24809
9535b19662c5724k54860a24199B4806K21262a9085B1091c1565o0549p7332A71062
9523b89491L8581a15455B47397b09052g7463l02470a48986F8728f7032k21890
9513b88922F2826k8443a47561O1102k58988a0716G6739f1931A07675B0905c21820
9501c7039G5178a96228c3311A05651e1124m0395I0989b16152R2630A17584A8856
9489A75819b29135m523k09200c3268B60138a91055I8261a41305m1723K6530B56111
$$ y = [220950, -242958, -23134, -113255, -408381, 94550, 100053, 284033, 100324, -115793, 12957, 83750, 149427, 61768, -255975, -289761, -137840, -34840, -133290, 202200, 126204, -124586, 59195, 41825, -88499, -230531, -113622, 310102, -23742, 220364, -388926, 115303, 54077, -94853, -219662, -35724, -290584, -124199, 24806, 246068, -19085, 21091, -31565, -92114, -169446, 171062, -289491, -250910, -115455, 247397, -209052, -77463, -379933, -148986, 68728, -67032, -288922, 62826, 34383, -147561, -86459, -345447, -10716, 76739, -61931, 107675, 20905, -321820, -37039, 75178, -196228, -33311, 105651, -51124, -91519, 90989, -216152, -123522, 117584, 18856, 175819, -229135, -233658, -442858, -33268, 260138, -191055, 98261, -141305, -183028, -156498, 256111]
9477a90625C5623J8922h9021j48596i0767j29709A01535b86593i3679q4744J7838
9466a60585c1627I642a62458g789l27995B55655A25159i1412L6310B3656M9333
9455G2989a75125G3170A6589a84886A7011d5438n2321l9863A60249P1917c9221
9443E0250b12635p6440C71b3737A25385B6210b8583j82108A62925e49322b0607
9431B43199c09391A0326m189K1894c19442Q0697I6933J11069c6804B383P0676
9420G3059b34508K8294J7564B4710e2902q2721B13842h5467j20391n4194a12255
9408a20172j52652J13840A92605a47107r0444D6654N2147m889J17836J54508A6885
9396a29119H1732b11201c8091G6790e35536C01897c57101A07166a32418B18079
$$ y = [-190625, 35623, 54545, -89021, -237617, -90767, -220476, 101535, -286593, -93679, -178423, -160585, -31627, 9642, -162458, -7789, -335784, 255655, 125159, -91412, -55102, 23656, 72989, -175125, 73170, 16589, -184886, 17011, -45438, -97759, -137622, 160249, 232166, -39221, 50250, -212635, -289075, 371, -23737, 125385, 26210, -28583, -210691, 162925, -549322, -20607, 243199, -309391, 10326, 6137, 28031, -319442, -238745, 96933, 208002, -36804, 2383, 73059, -234508, -206214, -188650, 24710, -52902, -135623, 213842, -85467, -205858, -260052, -112255, -120172, -272824, -158984, 192605, -147107, -237551, 46654, 98801, 93912, 211748, 366256, 16885, -129119, 81732, -211201, -38091, 76790, -535536, 301897, -357101, 107166, -132418, 218079]
9385a47864A65521E7459K23474l4344b69757Q3953B08644H2094P886O5408b73300
9373A18830b20024C29316b36119E9689K05886d4889K840E2072a33523e5838k33225
9362b89063R6347q9939K3517I9795B9264J40192K1925b46366Q3012i938F2776
9350A2349J0104b37705B04808c03341A27943c01308A07999c8578a6j64369A8360
9338A71390c20532J46408J1442j8762M4403q0107l5871f2405k50366A02111a09205
9326f4275k69754Q5607o9902B31317A4207K60968c23243c0340F3541c42583g1617
9314b70943A84306c0324n2718n1431A04752L9821a63257G4893M1915f7514A80518
9302C57768r2377A0085c11254B67191P7074F5693b16325d62k30469r7093i5850
$$ y = [-147864, 165521, 57459, 280933, 246589, -269757, -185804, 208644, 82094, 89980, 155388, -273300, 118830, -220024, 329316, -236119, 59689, 265575, -44889, -42049, 52072, -133523, -55838, -289063, -192716, -282655, -259138, 99795, 29264, 169456, 191381, -246366, -163354, -9938, 62776, 12349, 22453, -237705, 204808, -303341, 127943, -301308, 107999, -38578, -16, -164385, 18360, 171390, -320532, -174124, -162682, -181444, -137041, -217148, -253019, -62405, -312771, 102111, -109205, -64275, -334029, -248422, -318324, 231317, 14207, 275175, -323243, -30340, 63541, -342583, -71617, -270943, 184306, -30324, -83042, -134473, 104752, 144573, -163257, 74893, 116808, -67514, 180518, 357768, 265391, 10085, -311254, 267191, 344265, 65693, -216325, -462, -230931, -328024, -95850]
9290e872B22385c08030E911a83227l8931A50829e1731k86636a39422H068a81487
9278A41266E1577f2060A894R7807b57829K1975A90381E8651b10866m7382N9381
9267a98867l02750b39751C56513i8365P090A67916e1505o7092C115a54451c9629
9255a93796A8187b20699Q6744L9360j38015h7293A1373L12258D8840a87787B00270
9243B8661a42941K0724H7733J15541b69438R1356A32795c54557a27514f2211I218
9231i1112A93356d476o5326l4453A05300l3732J06136e7610l92179J55958h7817
9219a72104f037A9525b47079A0692c6226I6128a62329b1049k59583g2607F590
9207A09265a22350j85758a05644B77845d0750k4169j36196m495O580h8147J0845
$$ y = [-5872, 222385, -308030, 5911, -183227, -222158, 150829, -51731, -338367, -139422, 8068, -181487, 141266, 51577, -62060, 1894, 99701, -257829, -235854, 190381, 58651, -210866, -258248, -198867, -501617, -239751, 356513, -98365, -91275, 167916, -51505, -118597, 3115, -154451, -39629, -193796, 18187, -220699, -133955, -94595, -232610, -87293, 11373, 323631, 48840, -187787, 200270, 28661, -142941, -122217, 87733, 203274, -269438, -178082, 132795, -354557, -127514, -62211, 9218, -91112, 193356, -4476, -69802, -104255, 105300, 71568, 177704, -57610, -449789, -293831, -87817, -172104, -6037, 19525, -247079, 10692, -36226, 96128, -162329, -21049, -280632, -72607, 6590, 109265, -122350, -308108, -105644, 277845, -40750, -64919, -201115, -205610, -199030, -88147, -77302]
9196g7302C99916a84613A043K71088C6175b26740j70812B3242a51187C41360j66575
9185A74785N7396B7541c99858B76892b6806k89018J29341k3517a9053Q488A42702
9173A60624A3565N5497P9279b07682k98948a00180b840m5942M814k25923a1131
9161h4948L5592b082j76943L1588f183p3914b565j52655k6381N9184A21377P5893
9149A97270b62796l4746a31115j26310h857r8809j32229D5096f9454L1000o18
9138c9072o8703j39147C1010f2052K3471j22696A7573b5056k38036d7630j10309
9127a57939o5560Q0219L4191I6130l7683N5378a5201m4941j1505P774C8402b00948
9114d6546J5593H5360a37768K7116p7321b9691k00956i2808k71399L2762a7477
$$ y = [-77302, 399916, -184613, 1043, 272131, 36175, -226740, -397552, 23242, -151187, 341360, 174785, 232181, 27541, -399858, 276892, -26806, -315824, -186483, -210000, -19053, -10565, 142702, 160624, 13565, 69062, 148341, -207682, -506630, -100180, -2840, -48782, -43968, -269891, -11131, -84948, -49356, -2082, -179025, -147437, -6183, -80097, -2565, -155220, -181601, -122417, 121377, 197270, -262796, -297542, -131115, -257425, -8857, -107666, -239895, 45096, -69454, -38454, -39072, -107775, -246922, 31010, -62052, -38581, -161277, 17573, -25056, -263092, -47630, -157939, -223499, -143280, -109089, 96130, 58447, 113825, -15201, -60142, -71647, -63873, 38402, -200948, -46546, -30953, 85360, -137768, -110652, -187973, -29691, -230647, -92808, -364207, -331445, -17477]
9102a29085j30722G6682a3647B258K49533b89953d2602B23426h7300H2650N2325
9091A34975a48332f0614a4609l99486a18243M1955p0179A90257j4131b26205C2774
9079E380g1424A64825G4553R210a34895L8686A88953a64168B97151d8262D7922
9067c22021A75532A7421c04505e146n7437j22037O0373l0921A94616g7307m3219
9056a20526k7803q5057C094J32537L0832c87937F117c21119b7751C13725d4454
9044B8790b56684A13585a0620k27742h8012k16936A09969a32686m2290D5481d30745
9032A9006L7944L3484l0376c63566a48843f160j38951J3096H8245j0390d2770
9020b75426e8833k00149A08605D4680a35093j14696a01453E1693c2573j09955
$$ y = [-129085, -259807, 76682, -13647, 2258, 251791, -289953, -42602, 223426, -87300, 82650, 134975, -148332, -60614, -14609, -414095, -118243, -76288, -146467, 190257, 176126, -226205, 32774, 5380, -71424, 164825, 74553, 83763, -134895, -96209, 188953, -164168, 297151, -48262, 47922, -322021, 175532, 17421, -304505, -5146, -62583, -184620, -124247, -155168, 194616, -77307, -120526, -148329, -233386, 3094, 135631, 166463, -387937, 6117, -321119, -27751, 313725, -44454, 28790, -256684, 113585, -10620, -238362, -88012, -304948, 109969, -132686, -174976, 45481, -430745, 19006, 56950, 90434, 60058, -363566, -148843, -6160, -145111, -132015, 88245, 77855, -42770, -275426, -58833, -258982, 108605, 44680, -135093, -249789, -101453, 51693, -32573, -142528]
9010a42528G9606A6379a58346D3932g5547m2383d8761b1494l10346G4822K7946
8999A02768a70918g2602m9012c0495A78478A8001f540E3723h8511G1266c3066
8987c6909l41603C48431h6954L2578E0549a68812O0327c5102l5622l8126l7183
8976a46033G3672a49991E335d3706q6796j52229B18695B0279M6621b0598m7557
8965f8155r2804I6839f03k69549h7730c7495A44419g686k65341C1724L3906f9551
8952B4019J03365P4691a96832j6515j0309P6410A71989a96972C2823a65193g3238
8940a9189k8052j29191P1099A71978K06244A06213k8228a91488i2624K7905A77714
8928a40814C20853E3177K96247J90072J135249K060313N650739B443844E84178
$$ y = [-142528, 79606, 16379, -158346, 43932, -75547, -117930, -48761, -21494, -331840, 74822, 102768, -170918, -72602, -121614, -30495, 178478, 18001, -6540, 53723, -88511, 71266, -33066, -36909, -378512, 348431, -86954, -54376, 50549, -168812, -108485, -35102, -70724, -108850, -146033, 73672, -149991, 5335, -43706, -130502, -282731, 218695, 20279, 66900, -20598, -68155, -160959, 96839, -603, -270152, -87730, -37495, 144419, -7686, -273027, 31724, 65630, -69551, 24019, 127384, 202075, -196832, -213347, -223656, -147246, 171989, -196972, 32823, -165193, -73238, -19189, -47241, -176432, -105333, 171978, 378222, 106213, 77985, -191488, -92624, -64719, 177714, -140814, 320853, 53177, 349424, 539496, 1674745, 3735058, 9385797, 2443844, 584178]
8918A28027C4065b03795D59124g042I870a83317j5860B93704c23715A34869O4933
8907A99802D249h8647j61243A95498p7112f9422o0331b8180m150l4381m9338r4116
8895b10165I3862J6160c5909B14729b05568n7066A06867N3443L643Q1454g1809
8883g2962B2933J79552b80757P1430K0135D7096N016a29036o8672B60196b7807
8871c51185J53524B13638b66460e0806l521B89831a30750F4278f5549A55141c74209
$$ y = [128027, 34065, -203795, 459124, -7042, 9870, -183317, -199177, 293704, -323715, 134869, 199802, 4249, -88647, -249890, 195498, 118386, -69422, -129753, -28180, -32330, -66711, -116049, -210165, 93862, 110022, -35909, 214729, -205568, -262634, 106867, 160310, 163953, 245407, -71809, -72962, 22933, 202485, -280757, -209327, -189192, 47096, 52112, -129036, -197708, 260196, -27807, -351185, -197661, 213638, -266460, -50806, -54327, 289831, -130750, 64278, -65549, 155141, -374209]
$$ [...]
##END NTUPLES=NMR SPECTRUM
##END=
