
##TITLE=AC1369_2393_7221595_eSSRFaH6zd
##JCAMPDX= 6.0         $$ Bruker NMR JCAMP-DX V2.0
##DATA TYPE= NMR SPECTRUM
##DATA CLASS= NTUPLES
##ORIGIN= BRUKER
##OWNER= Administrator
$$ 1.72 TOPSPIN		Version 2.1
$$ 2012-12-13 22:35:02.219 -0500  Administrator@X
$$ Compression mode = diff/dup
##.OBSERVE FREQUENCY= 400.02188249412
##.OBSERVE NUCLEUS= ^1H
##.ACQUISITION MODE= SIMULTANEOUS (DQD)
##.ACQUISITION SCHEME= undefined
##.AVERAGES= 64
##.DIGITISER RES= 22
##SPECTROMETER/DATA SYSTEM= spect
##.PULSE SEQUENCE= noesygpps1d.comp
##.SOLVENT NAME= COFFEE_meoh
##.SHIFT REFERENCE= INTERNAL, COFFEE_meoh, 1, 14.96053
##AUDIT TRAIL= $$ (NUMBER, WHEN, WHO, WHERE, PROCESS, VERSION, WHAT)
$$ ##TITLE= Audit trail, TOPSPIN		Version 2.1
$$ ##JCAMPDX= 5.01
$$ ##ORIGIN= Bruker BioSpin GmbH
$$ ##OWNER= Administrator
$$ $$ E:\/data/COFFEE/nmr/AC1369_2393_7221595_eSSRFaH6zd/12/pdata/1/auditp.txt
$$ ##AUDIT TRAIL=  $$ (NUMBER, WHEN, WHO, WHERE, PROCESS, VERSION, WHAT)
(   1,<2012-12-13 22:34:56.500 -0500>,<Administrator>,<X>,<go>,<TOPSPIN 2.1>,
      <created by zg
	started at 2012-12-13 22:23:26.639 -0500,
	POWCHK enabled, PULCHK disabled,
       configuration hash MD5:
       86 BA 57 50 F2 9D 5C 9B 26 00 A9 28 5F 66 2E 89
       data hash MD5: 64K
       DF 11 4B 8F 89 CC 4A 5D 7B B3 49 96 86 39 65 04>)
(   2,<2012-12-13 22:34:59.516 -0500>,<Administrator>,<X>,<proc1d>,<TOPSPIN 2.1>,
      <Start of raw data processing
       efp LB = 0.3 FT_mod = 6 PKNL = 1 PHC0 = 0 PHC1 = 0 SI = 128K 
       data hash MD5: 128K
       96 E7 38 40 3D C8 8A C9 06 E1 C0 B2 B6 38 34 4B>)
(   3,<2012-12-13 22:35:00.563 -0500>,<Administrator>,<X>,<proc1d>,<TOPSPIN 2.1>,
      <pk PHC0 = -78.25562 PHC1 = 0 
       data hash MD5: 128K
       DE D2 51 EC 99 13 C5 60 F4 9C 03 9A 42 34 8D 2C>)
(   4,<2012-12-13 22:35:01.235 -0500>,<Administrator>,<X>,<proc1d>,<TOPSPIN 2.1>,
      <abs ABSG = 1 
       data hash MD5: 128K
       6E 5B 87 4D 46 91 5E E4 06 5D 86 AD 3A F3 59 31>)
(   5,<2012-12-13 22:35:01.422 -0500>,<Administrator>,<X>,<proc1d>,<TOPSPIN 2.1>,
      <abs ABSG = 2 
       data hash MD5: 128K
       62 48 05 38 3D C6 E2 79 B5 D7 7A 2C D1 41 2E 8A>)
(   6,<2012-12-13 22:35:01.579 -0500>,<Administrator>,<X>,<proc1d>,<TOPSPIN 2.1>,
      <abs ABSG = 3 
       data hash MD5: 128K
       28 12 E5 FC 80 19 49 5E 2F E6 0B FA F2 C5 E9 13>)
(   7,<2012-12-13 22:35:01.719 -0500>,<Administrator>,<X>,<proc1d>,<TOPSPIN 2.1>,
      <abs ABSG = 4 
       data hash MD5: 128K
       D1 69 7D 3D 43 16 55 38 6F 7C 28 6C 8E C2 EA D7>)
(   8,<2012-12-13 22:35:01.875 -0500>,<Administrator>,<X>,<proc1d>,<TOPSPIN 2.1>,
      <abs ABSG = 5 
       data hash MD5: 128K
       46 50 B1 AF A4 77 05 8E 13 D5 11 07 82 05 B5 80>)
$$ ##END=
$$ 
$$ $$ hash MD5
$$ $$ 91 AA 30 5E 8E 4A FB A4 EB 07 9A BC 7E 68 A0 16
##$RELAX= 
##$RELAX= 
##$RELAX= 
##$RELAX= 
##$RELAX= 
##$RELAX= 
##$RELAX= 
##$RELAX= 
##$RELAX= 
$$ Bruker specific parameters
$$ --------------------------
##$DU= <E:\>
##$EXPNO= 12
$$ [...]
##$TP07= 0
##$TPNAME0= <>
##$TPNAME1= <>
##$TPNAME2= <>
##$TPNAME3= <>
##$TPNAME4= <>
##$TPNAME5= <>
##$TPNAME6= <>
##$TPNAME7= <>
##$TPOAL= (0..7)
0.5 0.5 0.5 0.5 0.5 0.5 0.5 0.5
##$TPOFFS= (0..7)
0 0 0 0 0 0 0 0
##$TUNHIN= 0
##$TUNHOUT= 0
##$TUNXOUT= 0
##$USERA1= <user>
##$USERA2= <user>
##$USERA3= <user>
##$USERA4= <user>
##$USERA5= <user>
##$V9= 5
##$VALIST= <valist>
##$VCLIST= <CCCCCCCCCCCCCCC>
##$VD= 0
##$VDLIST= <DDDDDDDDDDDDDDD>
##$VPLIST= <PPPPPPPPPPPPPPP>
##$VTLIST= <TTTTTTTTTTTTTTT>
##$WBST= 1024
##$WBSW= 4
##$XGAIN= (0..3)
0 0 0 0
##$XL= 0
##$YL= 0
##$YMAX_a= 5974109
##$YMIN_a= -12285105
##$ZGOPTNS= <>
##$ZL1= 120
##$ZL2= 120
##$ZL3= 120
##$ZL4= 120
##$ABSF1= 14.96053
##$ABSF2= -5.597651
##$ABSG= 5
##$ABSL= 3
##$ALPHA= 0
##$AQORDER= 0
##$ASSFAC= 0
##$ASSFACI= 0
##$ASSFACX= 0
##$ASSWID= 0
##$AUNMP= <proc_prof1d_extract.lims>
##$AXLEFT= 0
##$AXNAME= <>
##$AXNUC= <1H>
##$AXRIGHT= 0
##$AXTYPE= 0
##$AXUNIT= <>
##$AZFE= 0.1
##$AZFW= 0.1
##$BCFW= 0
##$BC_mod= 0
##$BYTORDP= 0
##$COROFFS= 0
##$CY= 15
##$DATMOD= 1
##$DC= 0
##$DFILT= <>
##$DTYPP= 0
##$F1P= 0
##$F2P= 0
##$FCOR= 0.5
##$FTSIZE= 131072
##$FT_mod= 6
##$GAMMA= 0
##$GB= 0
##$INTBC= 1
##$INTSCL= 1
##$ISEN= 128
##$LB= 0.3
##$LEV0= 0
##$LPBIN= 0
##$MAXI= 10000
##$MC2= 0
##$MEAN= 0
##$ME_mod= 0
##$MI= 0
##$NCOEF= 0
##$NC_proc= -2
##$NLEV= 6
##$NOISF1= 0
##$NOISF2= 0
##$NSP= 0
##$NTH_PI= 0
##$NZP= 0
##$OFFSET= 14.96053
##$PC= 1
##$PHC0= -78.25562
##$PHC1= 0
##$PH_mod= 1
##$PKNL= yes
##$PPARMOD= 0
##$PPDIAG= 0
##$PPIPTYP= 0
##$PPMPNUM= 2147483647
##$PPRESOL= 1
##$PSCAL= 4
##$PSIGN= 0
##$PYNMP= <proc.py>
##$REVERSE= no
##$SF= 400.020009824959
##$SI= 131072
##$SIGF1= 0
##$SIGF2= 0
##$SINO= 400
##$SIOLD= 131072
##$SPECTYP= <>
##$SREGLST= <1H.CDCl3>
##$SSB= 0
##$STSI= 131072
##$STSR= 0
##$SW_p= 8223.68421052631
##$SYMM= 0
##$S_DEV= 0
##$TDeff= 65536
##$TDoff= 0
##$TI= <>
##$TILT= no
##$TM1= 0
##$TM2= 0
##$TOPLEV= 0
##$USERP1= <user>
##$USERP2= <user>
##$USERP3= <user>
##$USERP4= <user>
##$USERP5= <user>
##$WDW= 1
##$XDIM= 131072
##$YMAX_p= 393793821
##$YMIN_p= -11182
##$CURPLOT= <Network HP LaserJet P1505>
##$CURPRIN= <$Network HP LaserJet P1505>
##$DFORMAT= <normdp>
##$LAYOUT= <+/1D_H.xwp>
##$LFORMAT= <normlp>
##$PFORMAT= <normpl>
##$SURQMSG= 1
$$ End of Bruker specific parameters
$$ ---------------------------------
##NTUPLES= NMR SPECTRUM
##VAR_NAME=  FREQUENCY,     SPECTRUM/REAL,   SPECTRUM/IMAG
##SYMBOL=    X,             R,               I
##VAR_TYPE=  INDEPENDENT,   DEPENDENT,       DEPENDENT
##VAR_FORM=  AFFN,          ASDF,            ASDF
##VAR_DIM=   131072,        131072,          131072
##UNITS=     HZ,            ARBITRARY UNITS, ARBITRARY UNITS
##FACTOR=    0.0627417313425164, 1,          1
##FIRST=     8223.62146879497, -112,         -57012
##LAST=      0,             1890,            -57538
##MIN=       0,             -11182,          0
##MAX=       8223.62146879497, 393793821,    0
$$ Real data points
##PAGE= N=1
##DATA TABLE= (X++(R..R)), XYDATA
$$ [...]
$$ plain form
61801 712628 676886 644135 613855 586382 562395 542090 525011 510562 498362 488005 478736 469705
61789 469705 460600 451835 443937 436771 429638 422213 415125 409231 404483 399987 395294 391112 388372 386958
61775 386958 385805 384030 381506 378550 375586 373100 371382 370157 368880 367427 366147 365262 364675 364450 364921
61760 364921 366141 367743 369532 371689 374091 376130 377749 380159 384746 391412 398546 404545 408899 411977
61746 411977 414351 416357 417867 418412 417840 416733 415747 414712 412893 410161 407401 405682 405439 406496 408341
61731 408341 410303 411964 413664 416174 419689 423579 427347 431404 436515 442835 449835 456893 463666 470096
61717 470096 476453 483214 490602 498367 506192 514057 521874 528990 534464 537756 538891 538064 535396 530898
61703 530898 524428 515934 506137 496743 489294 483740 478668 472974 466784 460626 454491 448226 442311 437439
$$ packed form
61801G12628l5742l2751l0280k7473k3987k0305j7079j4449j2200j0357r269r031
61789D69705r105q765p898p166p133p425p088n894m748m496m693m182k740j414
61775C86958j153j775k524k956k964k486j718j225j277j453j280q85n87k25M71
61760C64921J220J602J789K157K402K039J619K410M587O666P134N999M354L078
61746D11977K374K006J510N45n72j107r86j035j819k732k760j719k43J057J845
61731D08341J962J661J700K510L515L890L768M057N111O320P000P058O773O430
61717D70096O357O761P388P765P825P865P817P116N474L292J135q27k668m498
61703E30898o470q494r797r394p449n554n072n694o190o158o135o265n915m872
$$ plain form
61689 437439 433462 429476 425076 420952 417913 415731 413419 410498 407504 405160 403460 401853 400113 398561
61675 398561 397372 396056 393934 390997 387998 385644 383890 382132 379974 377662 375786 374636 373919 373181 372468
61660 372468 372344 373167 374557 375829 376802 377868 379285 380832 382216 383488 384886 386626 389019 392401 396636
61645 396636 401026 405145 409506 414922 421400 428157 434647 440939 447071 452636 457230 460792 463191 463975
61631 463975 462905 460394 457083 453247 449021 444847 441205 438080 435167 432501 430461 429272 428960 429709 431702
61616 431702 434579 437604 440539 443806 447490 450636 451995 451240 449026 446028 442328 437692 432000 425255
61602 425255 417511 409054 400527 392587 385389 378610 372053 366037 361019 356943 353251 349508 345694 341831
61588 341831 337755 333450 329235 325290 321308 317053 312968 309721 307308 305170 303092 301378 300134 299006
$$ packed form
61689D37439l977l986m400m124l039k182k312k921k994k344j700j607j740j552
61675C98561j189j316k122k937k999k354j754j758k158k312j876j150p17p38p13
61660C72468j24Q23J390J272R73J066J417J547J384J272J398J740K393L382M235
61645C96636M390M119M361N416O478O757O490O292O132N565M594L562K399P84
61631D63975j070k511l311l836m226m174l642l125k913k666k040j189l12P49J993
61616D31702K877L025K935L267L684L146J359p55k214k998l700m636n692o745
61602D25255p744q457q527p940p198o779o557o016n018m076l692l743l814l863
61588C41831m076m305m215l945l982m255m085l247k413k138k078j714j244j128
$$ plain form
61574 299006 297752 296439 294893 292629 289680 286910 284989 283548 281886 280089 278791 278055 277182 275594 273425
61559 273425 271148 269080 267318 265872 264726 263900 263427 263190 262976 262858 263229 264173 265089 265359 265173 265244 265841
61542 265841 266584 267048 267059 266488 265423 264611 265044 266830 268958 270498 271593 272913 274588 276148 277300 278213
61526 278213 279060 279647 279572 278578 276719 274312 271738 269172 266507 263653 260801 258271 256128 254094 251832
61511 251832 249203 246270 243253 240596 238922 238607 239318 240182 240581 240680 241014 241700 242424 243048 243714 244285 244252 243579
61493 243579 243114 243646 244857 245800 246165 246437 246836 246839 245954 244418 242857 241632 240756 240143 239657 239181 238806 238787
61475 238787 239201 239882 240737 241817 242985 243866 244293 244469 244537 244340 243793 243192 242883 242850 242813 242529 241852 240830 239890
61456 239890 239583 239959 240504 240909 241447 242339 243227 243701 243967 244482 245242 245950 246629 247530 248630 249734 250942 252495
$$ packed form
61574B99006j254j313j546k264k949k770j921j441j662j797j298p36q73j588k169
61559B73425k277k068j762j446j146q26m73k37k14j18L71R44R16K70j86P1N97
61542B65841P43M64J1n71j065q12M33J786K128J540J095J320J675J560J152R13
61526B78213Q47N87p5r94j859k407k574k566k665k854k852k530k143k034k262
61511B51832k629k933l017k657j674l15P11Q64L99R9L34O86P24O24O66N71l3o73
61493B43579m65N32J211R43L65K72L99Lq85j536j561j225q76o13m86m76l75j9
61475B38787M14O81Q55J080J168Q81M27J76O8j97n47o01l09l3l7k84o77j022r40
61456B39890l07L76N45M05N38Q92Q88M74K66N15P60P08O79R01J100J104J208J553
$$ plain form
61438 252495 254382 256632 259786 264349 269810 274965 279262 283164 287066 290583 293236 295125 296513 297261
61424 297261 297157 296446 295587 294753 293937 293322 293249 294060 296115 299536 303617 306950 308609 308969 308973 308949 308614 307853
61406 307853 306825 305485 303670 301628 299829 298238 296266 293514 290065 286026 281386 276490 272178 269137
61392 269137 267431 266702 266382 265659 263867 261271 258995 257767 257166 256454 255733 255712 256658 258183 259907 261732
61376 261732 263508 265026 266443 268232 270498 272724 274424 275775 277337 279383 281706 283958 285894 287307
61362 287307 288028 288153 288271 289241 291576 294978 298578 301708 304417 307334 311158 316283 322659 329891 337605
61347 337605 345776 354526 363621 372473 380705 388325 395175 400752 404975 408703 412923 417692 422453 427100
61333 427100 431991 437043 441653 445562 449008 451785 452960 451991 449494 446433 443004 438849 433944 428769
$$ packed form
61438B52495J887K250L154M563N461N155M297L902L902L517K653J889J388P48
61424B97261j04p11q59q34q16o15p3Q11K055L421M081L333J659L60Mk4l35p61
61406C07853j028j340j815k042j799j591j972k752l449m039m640m896m312l041
61392B69137j706p29l20p23j792k596k276j228o01p12p21k1R46J525J724J825
61376B61732J776J518J417J789K266K226J700J351J562K046K323K252J936J413
61362B87307P21J25J18R70K335L402L600L130K709K917L824N125O376P232P714
61347C37605Q171Q750R095Q852Q232P620O850N577M223L728M220M769M761M647
61333D27100M891N052M610L909L446K777J175r69k497l061l429m155m905n175
$$ plain form
61319 428769 423850 419588 416288 413882 411816 409679 407731 406415 405627 405012 404767 405515 407415 410028 413140
61304 413140 417148 422444 428857 435884 443083 450045 456354 461764 466047 468485 468005 464278 458450 452299
61290 452299 446745 441559 436335 431196 426428 421999 417783 413949 410643 407486 403900 399979 396616 394528
61276 394528 393559 393233 393688 395575 399164 404009 409565 415731 422649 430226 438023 445409 451814 457087 461766
61261 461766 466749 472555 479061 486022 493591 502234 512317 523789 536007 547796 558084 566699 574312
61248 574312 581444 587857 593076 597138 600461 603264 605434 606795 607171 606360 604314 601201 597082 591761 585197
61233 585197 577832 570198 562440 554489 546571 539179 532682 527201 522723 519137 516356 514557 513971 514229 514306
61218 514306 513531 512332 511566 511413 511392 511217 511128 511569 512996 515743 519556 523362 526040 527273 527293 526146 523922
$$ packed form
61319D28769m919m262l300k406k066k137j948j316p88o15k45P48J900K613L112
61304D13140M008N296O413P027P199O962O309N410M283K438m80l727n828o151
61290D52299n554n186n224n139m768m429m216l834l306l157l586l921l363k088
61276C94528r69l26M55J887L589M845N556O166O918P577P797P386O405N273M679
61261D61766M983N806O506O961P569Q643J0083J1472J2218J1789J0288Q615P613
61248E74312P132O413N219M062L323K803K170J361L76q11k046l113m119n321o564
61233E85197p365p634p758p951p918p392o497n481m478l586k781j799n86K58P7
61218E14306p75j199p66j53k1j75q9M41J427K747L813L806K678J233K0j147k224
$$ plain form
61201 523922 521491 520195 520684 522582 525390 529220 534639 542265 552488 565126 579358 594393 610075
61188 610075 626366 642475 657206 670025 681172 690834 698990 705993 712459 718490 723734 728275 732645
61175 732645 736920 740613 743521 745768 746890 745991 743200 739930 737117 734080 729717 724015 717650 710867
61161 710867 703544 695818 687818 679173 669426 658688 647401 635863 624405 613543 603506 594185 586008
61148 586008 580114 576932 575276 573657 571898 570488 568888 565634 559899 551900 541904 529959 516747 503737
61134 503737 492121 482195 473880 467183 462007 458139 455661 454908 455916 458324 461873 466483 471875 477736
61120 477736 484394 492737 503203 515300 528352 542314 557622 574596 593262 613488 635045 657635
61108 657635 680949 704598 728104 751217 774187 797398 820656 843071 863605 881531 896423
$$ packed form
61201E23922k431j296M89J898K808L830N419P626J0223J2638J4232J5035J5682
61188F10075J6291J6109J4731J2819J1147R662Q156P003O466O031N244M541M370
61175G32645M275L693K908K247J122q99k791l270k813l037m363n702o365o783
61161G10867p323p726q000q645r747j0738j1287j1538j1458j0862j0037r321q177
61148E86008n894l182j656j619j759j410j600l254n735p999r996j1945j3212j3010
61134E03737j1616r926q315o697n176l868k478p53J008K408L549M610N392N861
61120D77736O658Q343J0466J2097J3052J3962J5308J6974J8666K0226K1557K2590
61108F57635K3314K3649K3506K3113K2970K3211K3258K2415K0534J7926J4892
$$ plain form
61097 896423 907989 915910 919673 918732 913084 903529 891085 876309 859515 841303 822311 802570 781645
61084 781645 759394 736126 712145 687742 663641 640838 619776 600100 581301 563225 545901
61073 545901 529373 513875 499774 487165 475743 465115 454964 444991 435087 425623 417216 410240
61061 410240 404809 401015 398635 396785 394593 392299 391033 391394 392839 394583 396411 398318 400059 401548
61047 401548 403271 405895 409743 414898 421401 429079 437582 446870 457235 468577 480199 491749 503872
61034 503872 517364 531995 546744 561016 575158 589891 605630 622241 639121 655693 672201
61023 672201 689960 710450 734268 761240 791370 825341 864316 909897 964258 1029725 1107955
61012 1107955 1199872 1306186 1426318 1554453 1675882 1769321 1816973 1815763 1779796 1731438 1689397
$$ packed form
61097H96423J1566P921L763r41n648r555j2444j4776j6794j8212j8992j9741k0925
61084G81645k2251k3268k3981k4403k4101k2803k1062j9676j8799j8076j7324
61073E45901j6528j5498j4101j2609j1422j0628j0151r973r904r464q407o976
61061D10240n431l794k380j850k192k294j266L61J445J744J828J907J741J489
61047D01548J723K624L848N155O503P678Q503R288J0365J1342J1622J1550J2123
61034E03872J3492J4631J4749J4272J4142J4733J5739J6611J6880J6572J6508
61023F72201J7759K0490K3818K6972L0130L3971L8975M5581N4361O5467P8230
61012A107955R1917J06314J20132J28135J21429R3439M7652j210l5967m8358m2041
$$ plain form
61001 1689397 1663911 1658999 1673390 1696560 1707181 1681531 1607472 1491390 1352316 1210125 1077968
60990 1077968 961788 862968 780527 712453 656609 611044 573894 543516 518735 498570 481751
60979 481751 467030 454078 443482 435450 428888 422242 414960 407639 400922 394929 389786 385969 383686
60966 383686 382376 381273 380223 379555 379414 379686 380410 381732 383494 385337 387300 389840 393102 396468 399046
60951 399046 400405 400770 400774 401085 401971 403046 403679 403823 404181 405349 407005 408227 408433 407772 406682 405386 403922
60934 403922 402337 400562 398188 394652 389854 384452 379317 374716 370224 365360 360030 354304 348224 342050
60920 342050 336292 331180 326399 321700 317434 314033 311261 308554 305886 303697 302119 300968 300389 300728 301671
60905 301671 302383 302789 303933 306548 309933 312858 315128 317575 320828 324731 328890 333185 337665 342264 346685
$$ packed form
61001A689397k5486m912J4391K3170J0621k5650p4059j16082j39074j42191j32157
60990A077968j16180r8820q2441o8074n5844m5565l7150l0378k4781k0165j6819
60979D81751j4721j2952j0596q032o562o646p282p321o717n993n143l817k283
60966C83686j310j103j050o68j41K72P24J322J762J843J963K540L262L366K578
60951C99046J359L65ML11Q86J075O33J44L58J168J656J222K06o61j090j296j464
60934D03922j585j775k374l536m798n402n135m601m492m864n330n726o080o174
60920C42050n758n112m781m699m266l401k772k707k668k189j578j151n79L39R43
60905C01671P12M06J144K615L385K925K270K447L253L903M159M295M480M599M421
$$ plain form
60890 346685 350371 352761 353867 354467 355400 356709 357736 358006 357716 357361 357159 356883 356146 354787 353066 351380
60874 351380 349778 347897 345507 342918 340659 338868 337160 335015 332180 328826 325452 322532 320077 317723
60860 317723 315342 313387 312359 312101 311946 311555 311268 311500 312049 312285 312058 312138 313540 316406 319849 323000 325917
60843 325917 329310 333607 338731 344490 350666 356728 362015 366269 369577 371783 372590 372418 372482 373589 375296
60828 375296 376653 377370 377804 378213 378561 378821 378981 378907 378635 378594 379117 379887 380336 380380 380236 379651 377993 375164 371822
60809 371822 368454 364770 360297 355186 349958 344743 339256 333522 328185 323900 320590 317511 314031 310233
60795 310233 306774 304291 302943 302375 302031 301557 301011 300608 300240 299492 298247 297048 296552 296822 297471 298316 299462
60778 299462 300853 302257 303719 305577 308003 310974 314709 319610 325618 332106 338505 344545 349890 354247
$$ packed form
60890C46685L686K390J106O00R33J309J027K70k90l55k02k76p37j359j721j686
60874C51380j602j881k390k589k259j791j708k145k835l354l374k920k455k354
60860C17723k381j955j028k58j55l91k87K32N49K36k27Q0J402K866L443L151K917
60843C25917L393M297N124N759O176O062N287M254L308K206Q07j72O4J107J707
60828C75296J357P17M34M09L48K60J60p4k72m1N23P70M49M4j44n85j658k829l342
60809C71822l368l684m473n111n228n215n487n734n337m285l310l079l480l798
60795C10233l459k483j348n68l44m74n46m03l68p48j245j199m96K70O49Q45J146
60778B99462J391J404J462J858K426K971L735M901O008O488O399O040N345M357
$$ plain form
60764 354247 358074 362410 367577 372710 377009 380776 384591 388178 390879 392811 394647 396567 398285 399927
60750 399927 401993 404393 406394 407692 408886 410665 413039 415615 418160 420574 422582 423753 423762 422638 420832
60735 420832 418886 416770 413690 408908 402680 396111 390156 385046 380516 376228 372033 368197 365340 363842
60721 363842 363321 362976 362396 361814 361701 362339 363654 365251 366857 368899 372213 376889 381940 386674 391822 398544
60705 398544 406746 415352 423955 433135 443221 453854 464958 477049 490197 503690 517269 531884
60693 531884 548465 566561 584844 602564 619915 637325 655107 673606 693117 713579 734573
60682 734573 755455 775306 793110 808421 821664 833369 843197 850074 853189 852567 848679 841797 831870
60669 831870 818924 803441 786200 767625 747442 725199 701083 676007 651002 626865 604278
$$ packed form
60764C54247L827M336N167N133M299L767L815L587K701J932J836J920J718J642
60750C99927K066K400K001J298J194J779K374K576K545K414K008J171Rj124j806
60735D20832j946k116l080m782o228o569n955n110m530m288m195l836k857j498
60721C63842n21l45n80n82j13O38J315J597J606K042L314M676N051M734N148O722
60705C98544Q202Q606Q603R180J0086J0633J1104J2091J3148J3493J3579J4615
60693E31884J6581J8096J8283J7720J7351J7410J7782J8499J9511K0462K0994
60682G34573K0882J9851J7804J5311J3243J1705R828O877L115o22l888o882r927
60669H31870j2946j5483j7241j8575k0183k2243k4116k5076k5005k4137k2587
$$ plain form
60658 604278 583739 565213 548244 532481 517789 503899 490561 478133 467425 458648 451061 443942
60646 443942 437400 431854 427255 423270 419776 416615 413275 409399 405358 401753 398513 395013 390911 386404
60632 386404 381886 377859 374938 373300 372271 371099 370111 370341 371996 374055 375611 376905 378633 380868 383222
60617 383222 385580 388009 390151 391369 391503 390966 390055 388604 386457 383813 380873 377499 373548 369309 365225
60602 365225 361335 357416 353626 350548 348390 346528 344110 340877 337137 333276 329674 326842 324973 323353
60588 323353 320858 317337 314019 312152 311620 311375 310941 310847 311617 313067 314925 317601 321698 326985 332485 337750
60572 337750 343469 350531 358832 367484 375847 383725 390613 395562 398145 398960 398638 396757 392404 385640 377886
60557 377886 370859 365627 362598 361724 362486 364237 366965 371428 378245 387039 396710 406379 415771 424855 433421
$$ packed form
60658F04278k0539j8526j6969j5763j4692j3890j3338j2428j0708q777p587p119
60646D43942o542n546m599l985l494l161l340l876m041l605l240l500m102m507
60632C86404m518m027k921j638j029j172r88K30J655K059J556J294J728K235K354
60617C83222K358K429K142J218J34n37r11j451k147k644k940l374l951m239m084
60602C65225l890l919l790l078k158j862k418l233l740l861l602k832j869j620
60588C23353k495l521l318j867n32k45m34r4P70J450J858K676M097N287N500N265
60572C37750N719P062Q301Q652Q363P878O888M949K583Q15l22j881m353o764p754
60557C77886p027n232l029q74P62J751K728M463O817Q794R671R669R392R084Q566
$$ plain form
60542 433421 441022 447150 451370 453322 452720 449483 444009 437192 430024 423271 417659 414015 412711 413023 413587
60527 413587 413630 413391 413281 413145 412627 411776 410930 410291 410063 410745 412808 416101 419944 423842 427901 432557 438189
60510 438189 445013 453131 462587 473480 486157 501260 519492 541206 566170 593758 623437 654936
60498 654936 687772 720689 751722 778725 799652 812568 815960 809286 792970 767887 735283 697281
60486 697281 656843 616681 578311 542410 509704 481001 456496 435624 417786 402934 391284
60475 391284 382630 376103 370528 364923 358752 351939 344849 338236 332894 329064 326142 323176 319670 315837
60461 315837 312170 309033 306649 305137 304324 303653 302466 300468 297994 295858 294724 294470 294300 293656 292786 292160
60445 292160 291680 291001 290426 290749 292130 293723 294585 294460 293550 292109 290519 289182 287979 286242 283645 280771
$$ packed form
60542D33421P601O128M220J952o02l237n474o817p168o753n612l644j304L12N64
60527D13587M3k39j10j36n18q51q46o39k28O82K063L293L843L898M059M656N632
60510D38189O824Q118R456J0893J2677J5103J8232K1714K4964K7588K9679L1499
60498F54936L2836L2917L1033K7003K0927J2916L392o674j6316k5083l2604l8002
60486F97281m0438m0162l8370l5901l2706k8703k4505k0872j7838j4852j1650
60475C91284q654o527n575n605o171o813p090o613n342l830k922k966l506l833
60461C15837l667l137k384j512q13o71j187j998k474k136j134k54j70o44q70o26
60445B92160m80o79n75L23J381J593Q62j25r10j441j590j337j203j737k597k874
$$ plain form
60429 280771 278512 277277 277032 277647 278816 279978 280795 281434 282148 282846 283389 283886 284434 284955 285605 286802 288430
60412 288430 289583 289701 289447 289742 290318 290102 288826 287402 286694 286674 286852 286928 286919 287183 288398 290925 294145 296906
60394 296906 298728 300052 301358 302687 304124 305988 308260 310392 312081 313716 315674 317624 319008 319856
60380 319856 320629 321489 322229 322798 323422 324162 324705 324773 324571 324719 325690 327288 328709 329311 329352 329734 330942 332526
60362 332526 333844 335026 336754 339120 341155 341702 340585 338774 337538 337635 339128 341607 344474 347276 350004
60347 350004 352983 356299 359517 362204 364538 366899 368885 369325 367578 364411 361219 358653 356460 354426
60333 354426 352855 352042 351723 351347 350713 350203 350409 351550 353210 354614 355209 354920 353930 352450 350800 349423
60317 349423 348597 348315 348628 349871 352302 355785 360211 365995 373786 383760 395626 409073 423616 437958
$$ packed form
60429B80771k259j235k45O15J169J162Q17O39P14O98N43M97N48N21O50J197J628
60412B88430J153J18k54K95N76k16j276j424p08k0J78P6rK64J215K527L220K761
60394B96906J822J324J306J329J437J864K272K132J689J635J958J950J384Q48
60380C19856P73Q60P40N69O24P40N43O8k02J48R71J598J421O02M1L82J208J584
60362C32526J318J182J728K366K035N47j117j811j236R7J493K479K867K802K728
60347C50004K979L316L218K687K334K361J986M40j747l167l192k566k193k034
60333C54426j571q13l19l76o34n10K06J141J660J404N95k89r90j480j650j377
60317C49423q26k82L13J243K431L483M426N784P791R974J1866J3447J4543J4342
$$ plain form
60303 437958 450193 458986 464244 466399 465417 460909 453058 443080 432667 423028 414426 406583 399475 393618
60289 393618 389445 386577 384094 381571 379501 378489 378274 377805 376233 373649 370874 368698 367358 366609 366118
60274 366118 365706 365245 364488 363158 361231 359047 357048 355345 353572 351295 348621 346247 344727 343823 342807
60259 342807 341236 339103 336401 333143 329850 327375 325936 324861 323673 322834 322857 323220 322940 321995 321363 321659
60243 321659 322501 323343 324245 325497 326956 328124 328706 328898 329299 330592 333032 336151 339157 341677 343938 346293
60227 346293 348844 351444 353747 355286 355907 356142 356779 358057 359706 361758 364686 368512 372407 375606 378358
60212 378358 381499 385309 389264 392829 396052 399339 402965 406921 411105 415539 420418 425840 431503 436807
60198 436807 441442 445764 450402 455483 460426 464532 467591 469820 471370 472199 472455 472670 473257 473889 473726 472324
$$ packed form
60303D37958J2235Q793N258K155r82m508p851r978j0413r639q602p843p108n857
60289C93618m173k868k483k523k070j012k15m69j572k584k775k176j340p49m91
60274C66118m12m61p57j330j927k184j999j703j773k277k674k374j520r04j016
60259C42807j571k133k702l258l293k475j439j075j188q39K3L63k80r45o32K96
60243C21659Q42Q42R02J252J459J168N82J92M01J293K440L119L006K520K261K355
60227C46293K551K600K303J539O21K35O37J278J649K052K928L826L895L199K752
60212C78358L141L810L955L565L223L287L626L956M184M434M879N422N663N304
60198D36807M635M322M638N081M943M106L059K229J550Q29K56K15N87O32j63j402
$$ plain form
60182 472324 470073 467633 465249 462778 460181 457740 455893 454915 454552 453907 452029 448880 445409 442460 439941
60167 439941 437432 435188 433884 433486 432982 431396 428740 425864 423632 422301 421529 420939 420654 421049 421955 422599
60151 422599 422628 422764 423928 426086 428513 430810 432992 434885 436328 437921 440674 444745 449177 453019 456139
60136 456139 458817 461290 463893 466965 470281 473158 475396 477576 480115 482579 484290 485124 485369 485262 485061
60121 485061 485170 485765 486576 487316 487964 488406 488268 487540 486927 487138 488122 489371 490631 491855 492859 493547 494267
60104 494267 495344 496407 496750 496302 495751 495629 495771 495770 495551 495239 494777 494025 493144 492560 492426 492369 492049 491826 492432
60085 492432 493836 494932 494792 493881 493482 494143 495313 496384 497355 498387 499420 500485 501722 502797 502868 501514
60069 501514 499218 496543 493344 489175 484007 478104 471648 465026 459110 454588 451157 447880 444251 440478
$$ packed form
60182D72324k251k440k384k471k597k441j847r78l63o45j878l149l471k949k519
60167D39941k509k244j304l98n04j586k656k876k232j331p72n90k85L95R06O44
60151D22599K9J36J164K158K427K297K182J893J443J593K753M071M432L842L120
60136D56139K678K473K603L072L316K877K238K180K539K464J711Q34K45j07k01
60121D85061J09N95Q11P40O48M42j38p28o13K11R84J249J260J224J004O88P20
60104D94267J077J063L43m48n51j22J42jk19l12m62p52q81n84j34n7l20k23O06
60085D92432J404J096j40r11l99O61J170J071R71J032J033J065J237J075P1j354
60069E01514k296k675l199m169n168n903o456o622n916m522l431l277l629l773
$$ plain form
60055 440478 436852 433360 429950 426797 424192 422311 421092 420204 419214 417898 416330 414711 413333 412700 413287
60040 413287 415059 417584 420668 424460 428798 433003 436612 439859 443117 446341 449372 452253 454820 456463
60026 456463 456730 455765 453742 450424 445793 440553 435296 429682 423261 416646 410861 405727 399998 393201 386399
60011 386399 380842 376609 372872 368876 364343 359491 355058 351913 350249 349376 348526 347624 347105 347259 347989 349037
59995 349037 350231 351665 353705 356708 360590 364771 368600 371876 375089 379128 384479 390524 395920 399955
59981 399955 403244 406733 410404 413467 415550 416923 417630 417215 415503 413047 410529 408235 406289 404820 403537
59966 403537 401699 399033 396347 394661 393955 393266 391933 390203 388585 387150 385690 384247 383146 382654 382876
59951 382876 383837 385399 387076 388259 388805 389207 390026 391286 392572 393575 394318 395022 395990 397464 399216 400400
$$ packed form
60055D40478l626l492l410l153k605j881j219q88r90j316j568j619j378o33N87
60040D13287J772K525L084L792M338M205L609L247L258L224L031K881K567J643
60026D56463K67r65k023l318m631n240n257n614o421o615n785n134n729o797o802
60011C86399n557m233l737l996m533m852m433l145j664q73q50r02n19J54P30J048
59995C49037J194J434K040L003L882M181L829L276L213M039N351O045N396M035
59981C99955L289L489L671L063K083J373P07m15j712k456k518k294j946j469j283
59966D03537j838k666k686j686p06o89j333j730j618j435j460j443j101m92K22
59951C82876R61J562J677J183N46M02Q19J260J286J003P43P04R68J474J752J184
$$ plain form
59935 400400 400236 398895 397280 395917 394538 392838 391138 389989 389529 389456 389287 388456 386652 384354 382594 381851
59919 381851 381610 381321 381240 381789 382606 382958 382830 382907 383633 384951 386836 389377 392274 394849 396759 398312 400053
59902 400053 402323 405140 408092 410387 411464 411630 411787 412570 414050 416091 418520 421011 423311 425629 428425
59887 428425 431866 435892 440711 446613 453241 459559 464729 468634 471482 473402 474631 475657 476837 478078
59873 478078 479080 479723 480063 480037 479356 477745 475378 472958 471031 469132 466099 461498 456262 451525 447325
59858 447325 443086 438866 435219 432095 428887 425587 422972 421473 420576 419594 418321 416768 414955 413274 412337
59843 412337 412076 411545 409946 407423 404600 401932 399764 398407 397655 396776 395483 394514 394729 395989 397413 398450
59827 398450 399244 400170 401469 403141 404752 405456 404589 402262 399206 396139 393457 391237 389229 387011 384447
$$ packed form
59935D00400j64j341j615j363j379j700j700j149m60p3j69q31j804k298j760p43
59919C81851k41k89q1N49Q17L52j28P7P26J318J885K541K897K575J910J553J741
59902D00053K270K817K952K295J077J66J57P83J480K041K429K491K300K318K796
59887D28425L441M026M819N902O628O318N170L905K848J920J229J026J180J241
59873D78078J002O43L40k6o81j611k367k420j927j899l033m601n236m737m200
59858D47325m239m220l647l124l208l300k615j499q97r82j273j553j813j681r37
59843D12337k61n31j599k523k823k668k168j357p52q79j293r69K15J260J424J037
59827C98450P94R26J299J672J611P04q67k327l056l067k682k220k008k218k564
$$ plain form
59812 384447 381912 379876 378386 377125 375809 374359 372830 371363 370087 368972 367911 367007 366517 366417 366298
59797 366298 365826 365067 364225 363303 362167 360717 358919 356920 355193 354198 353815 353489 353074 353008 353473 353892 353665
59780 353665 352965 352441 352444 352938 353735 354422 354479 354014 353992 355059 356451 356865 356315 356261 357755 360238 362504 364152
59762 364152 365616 367223 368921 370696 372667 374760 376826 379171 382541 387289 392812 398012 402172 405267
59748 405267 407769 410544 414621 420382 426910 432679 437148 441143 445414 449402 451984 453018 453462 454120 454962
59733 454962 455638 456017 456075 455806 455481 455518 455909 456128 455790 455124 454632 454590 454947 455430 455624 455291 454691 454291 454094 453662
59713 453662 452905 452395 452664 453557 454506 455219 455865 456842 458503 460872 463517 465939 468163 470689 473824 477419
59697 477419 481265 485262 489097 492322 495066 498222 502510 507589 512317 515635 517085 516920 516057 515586 515977
$$ packed form
59812C84447k535k036j490j261j316j450j529j467j276j115j061r04m90j00j19
59797C66298m72p59q42r22j136j450j798j999j727r95l83l26m15o6M65M19k27
59780C53665p00n24LM94P97O87N7m65k2J067J392M14n50n4J494K483K266J648
59762C64152J464J607J698J775J971K093K066K345L370M748N523N200M160L095
59748D05267K502K775M077N761O528N769M469L995M271L988K582J034M44O58Q42
59733D54962O76L79N8k69l25L7L91K19l38o66m92m2L57M83J94l33o00m00j97m32
59713D53662p57n10K69Q93R49P13O46R77J661K369K645K422K224K526L135L595
59697D77419L846L997L835L225K744L156M288N079M728L318J450j65q63m71L91
$$ plain form
59682 515977 516853 517672 518259 518538 518221 517128 515535 513796 511794 508998 504952 499661 493782 488476 484545
59667 484545 481533 478176 473986 469861 466788 464588 462495 460428 458972 458407 458489 459064 460202 461768 463480
59652 463480 465468 468241 471936 475965 479629 482832 486057 489709 493539 496666 498193 497870 496061 493157
59638 493157 489313 484816 480280 476123 472142 467886 463347 458965 455141 451946 449232 446779 444404 442047
59624 442047 439691 437177 434321 431214 428131 425121 421960 418551 414966 411086 406670 401929 397581 394151
59610 394151 391658 390059 389415 389428 389483 389467 389944 391161 392544 393555 394392 395297 395891 395837 395536 395421 395136 394201
59592 394201 393059 392562 392789 393190 393585 394134 394543 394252 393301 392202 391046 389519 387772 386404 385473 384293
59576 384293 382344 379732 376658 373117 369283 365653 362622 360264 358533 357242 355954 354436 353133 352624
$$ packed form
59682E15977Q76Q19N87K79l17j093j593j739k002k796m046n291n879n306l931
59667D84545l012l357m190m125l073k200k093k067j456n65Q2N75J138J566J712
59652D63480J988K773L695M029L664L203L225L652L830L127J527l23j809k904
59638D93157l844m497m536m157l981m256m539m382l824l195k714k453k375k357
59624D42047k356k514k856l107l083l010l161l409l585l880m416m741m348l430
59610C94151k493j599o44J3N5j6M77J217J383J011Q37R05N94n4l01j15k85r35
59592C94201j142m97K27M01L95N49M09k91r51j099j156j527j747j368r31j180
59576C84293j949k612l074l541l834l630l031k358j731j291j288j518j303n09
$$ plain form
59562 352624 352686 352505 351788 351043 350800 351167 352120 353583 355242 356878 358857 361624 364816 367593 369842 372281
59546 372281 375441 379361 384262 390500 397797 405558 414149 424783 437949 453203 470752 491437 513837
59533 513837 532680 542034 540129 530278 517584 505818 496885 491450 489231 489380 491105 493868 497168 500714
59519 500714 504736 509487 514436 518516 521170 522511 522433 520376 516300 511168 505867 500067 492738 483571 473379
59504 473379 463249 453898 445801 439272 434063 429335 424495 419853 416083 413162 410401 407563 405349 404505
59490 404505 404862 405651 406445 407259 407947 408147 407947 408137 409541 412355 416253 420849 425954 431623 438115 445590
59474 445590 453676 461525 468501 474651 480354 485533 489385 490875 489516 485816 481017 476324 472341 469222
59460 469222 467181 466641 467958 471233 476374 483119 491018 499633 508818 518635 529019 539815 551091 563062
$$ packed form
59562C52624O2j81p17p45k43L67R53J463J659J636J979K767L192K777K249K439
59546C72281L160L920M901O238P297P761Q591J0634J3166J5254J7549K0685K2400
59533E13837J8843R354j905r851j2694j1766q933n435k219J49J725K763L300L546
59519E00714M022M751M949M080K654J341p8k057m076n132n301n800p329r167j0192
59504D73379j0130r351q097o529n209m728m840m642l770k921k761k838k214q44
59490D04505L57P89P94Q14O88K00k00J90J404K814L898M596N105N669O492P475
59474D45590Q086P849O976O150N703N179L852J490j359l700m799m693l983l119
59460D69222k041n40J317L275N141O745P899Q615R185R817J0384J0796J1276J1971
$$ plain form
59446 563062 575563 587887 599265 609218 617213 622229 623069 619245 611447 601168 589902 578604 567671
59433 567671 557185 547062 537118 527281 517919 509757 503198 497843 492974 488549 485437 484605 486367 490570
59419 490570 497171 506218 517407 530251 544922 562356 582961 605647 629066 653614 680509 707877
59407 707877 729007 736543 728684 710210 687724 665510 645994 631532 623745 622247 625671 633071 642408
59394 642408 648314 643935 626123 597885 565460 534021 506231 483073 464483 449584 437386 427443
59382 427443 419641 413736 409476 406837 405759 405784 406170 406258 405692 404598 403551 403050 402955 402720 402133 401457 400945
59365 400945 400679 400819 401464 402323 403098 404181 406353 409750 413767 418044 422858 428413 434532 441293 449242
59350 449242 458556 468595 478685 488946 500034 512563 526966 543324 560938 578572 595479 611790
$$ packed form
59446E63062J2501J2324J1378R953P995N016Q40l824p798j0279j1266j1298j0933
59433E67671j0486j0123r944r837r362q162o559n355m869m425l112q32J762M203
59419D90570O601R047J1189J2844J4671J7434K0605K2686K3419K4548K6895K7368
59407G07877K1130P536p859j8474k2486k2214j9516j4462p787j498L424P400R337
59394F42408N906m379j7812k8238l2425l1439k7790k3158j8590j4899j2198r943
59382D27443p802n905m260k639j078K5L86Q8n66j094j047n01r5k35n87o76n12
59365D00945k66J40O45Q59P75J083K172L397M017M277M814N555O119O761P949
59350D49242R314J0039J0090J0261J1088J2529J4403J6358J7614J7634J6907J6311
$$ plain form
59338 611790 627693 642695 655989 666946 675035 679914 681989 682281 681277 678441 673176 665615 656022
59325 656022 644267 630678 616729 603910 592202 580545 568584 557107 546877 537913 529979 523019
59313 523019 516861 511114 505636 500665 496214 491724 486672 481383 476862 473808 471947 470444 468868 467538
59299 467538 466907 466878 466948 466806 466422 465765 464920 464457 465067 466651 468231 469014 469223 469718 471115 473404 476120 478746
59281 478746 481201 483905 487074 490122 492363 494204 496905 501068 506164 511777 518472 526973 537189 548567
59267 548567 560869 574065 587895 601963 615790 628468 638847 646553 652268 656497 658671 658071 655040
59254 655040 650493 644648 637113 628023 618280 608614 599054 589403 579877 571182 564124 558985 555199 551892
59240 551892 548858 546575 545217 544306 543647 543821 545173 546945 548158 548875 549915 551633 553650 555393 556209
$$ packed form
59338F11790J5903J5002J3294J0957Q089M879K075K92j004k836n265p561r593
59325F56022j1755j3589j3949j2819j1708j1657j1961j1477j0230q964p934o960
59313E23019o158n747n478m971m451m490n052n289m521l054j861j503j576j330
59299D67538o31k9P0j42l84o57q45m63O10J584J580P83K09M95J397K289K716K626
59281D78746K455K704L169L048K241J841K701M163N096N613O695Q501J0216J1378
59267E48567J2302J3196J3830J4068J3827J2678J0379P706N715M229K174o00l031
59254F55040m547n845p535r090r743r666r560r651r526q695p058n139l786l307
59240E51892l034k283j358r11o59J74J352J772J213P17J040J718K017J743Q16
$$ plain form
59225 556209 555211 551797 546288 539575 532279 524554 516332 507278 496958 485695 474855 465681 458137 451467
59211 451467 445420 440219 435714 431466 427514 424317 422037 420446 419314 418371 417202 415849 415077 415305 415629
59196 415629 414815 412998 411493 411092 411473 412167 413157 414484 416142 418413 421548 425091 428325 431354 435043
59181 435043 439863 445595 452054 459216 466573 473355 479540 485739 491908 497111 500904 504088 507691 511911
59167 511911 516475 521369 526768 532752 539456 547075 555431 563916 571991 579305 585372 589819 593070 595983
59153 595983 598531 599477 597732 593447 587569 581004 574496 568579 563136 557492 551322 544950 538536 531717
59139 531717 524564 518149 513354 509528 505116 499498 493595 488722 485331 482944 480897 478991 477541 476882
59125 476882 476909 477288 478058 479729 482678 486734 491448 496603 502370 509142 517240 526622 536993 548322 560927
$$ packed form
59225E56209r98l414n509o713p296p725q222r054j0320j1263j0840r174p544o670
59211D51467o047n201m505m248l952l197k280j591j132r43j169j353p72K28L24
59196D15629q14j817j505m01L81O94R90J327J658K271L135L543L234L029L689
59181D35043M820N732O459P162P357O782O185O199O169N203L793L184L603M220
59167E11911M564M894N399N984O704P619Q356Q485Q075P314O067M447L251K913
59153E95983K548R46j745m285n878o565o508n917n443n644o170o372o414o819
59139E31717p153o415m795l826m412n618n903m873l391k387k047j906j450o59
59125D76882K7L79P70J671K949M056M714N155N767O772Q098R382J0371J1329J2605
$$ plain form
59110 560927 574691 588616 601774 614401 627328 640553 653234 664967 676013 686215 694844 701868
59098 701868 708248 714390 719264 721806 722441 722398 722168 721465 720217 718607 716430 713305 709465 705649 702184
59083 702184 698740 694922 690589 685614 679830 673223 665755 657038 646596 634567 621817 609324 597681
59070 597681 587148 577781 569336 561259 553007 544456 536021 528287 521436 515065 508751 502709 497576 493520
59056 493520 489959 486246 482282 478286 474348 470509 466961 463846 461026 458299 455729 453567 452027 451278
59042 451278 451381 452002 452381 451924 450808 449855 449855 451079 453270 455913 458594 461212 463866 466661 469772 473601
59026 473601 478553 484603 491384 498727 506865 516042 526204 537126 548625 560606 573139 586393 600269
59013 600269 614163 627408 639761 650947 659889 665100 666041 663619 659283 654119 648870 644072 639820
$$ packed form
59110E60927J3764J3925J3158J2627J2927J3225J2681J1733J1046J0202Q629P024
59098G01868O380O142M874K542O35m3k30p03j248j610k177l125l840l816l465
59083G02184l444l818m333m975n784o607p468q717j0442j2029j2750j2493j1643
59070E97681j0533r367q445q077q252q551q435p734o851o371o314o042n133m056
59056D93520l561l713l964l996l938l839l548l115k820k727k570k162j540p49
59042D51278J03O21L79m57j116r53%J224K191K643K681K618K654K795L111L829
59026D73601M952O050O781P343Q138R177J0162J0922J1499J1981J2533J3254J3876
59013F00269J3894J3245J2353J1186Q942N211R41k422m336n164n249m798m252
$$ plain form
59000 639820 635901 632434 629977 628837 628822 629907 632450 636376 640704 644364 647025 648724 649248 648437 646637
58985 646637 644230 640987 636455 630779 624633 618511 612537 606716 600928 594905 588758 583373 579762 578093
58971 578093 577836 578720 581011 584834 589755 595215 600991 607105 613607 620638 628427 636987 645880 654461 662350
58956 662350 669593 676356 682558 687824 691675 693570 692820 688857 681871 672924 663087 652571 641109 629047
58942 629047 617546 607652 599548 592769 586776 581264 576199 571581 566926 561210 553879 545732 538224 531934
58928 531934 526406 521411 517496 515037 513618 512709 512269 512289 512462 512727 513432 514429 514680 513453 511410 509829
58912 509829 509226 509398 510438 512745 516130 519662 522675 525576 529583 535802 544397 554475 564902 575243
58898 575243 585604 595599 604173 610781 616085 621034 625782 630149 634663 640435 648207 658029 669652 682783
$$ packed form
59000F39820l919l467k457j140j5J085K543L926M328L660K661J699N24q11j800
58985F46637k407l243m532n676o146o122n974n821n788o023o147n385l611j669
58971E78093k57Q84K291L823M921N460N776O114O502P031P789Q560Q893Q581P889
58956F62350P243O763O202N266L851J895p50l963o986q947r837j0516j1462j2062
58942F29047j1501r894q104o779n993n512n065m618m655n716p331q147p508o290
58928E31934n528m995l915k459j419r09m40K0J73K65P05R97K51j227k043j581
58912E09829o03J72J040K307L385L532L013K901M007O219Q595J0078J0427J0341
58898E75243J0361R995Q574O608N304M949M748M367M514N772P772R822J1623J3131
$$ plain form
58884 682783 697217 713142 730945 750232 769432 786973 802524 816491 828683 838256 844687 847949
58872 847949 847778 843716 836012 825725 813628 799643 783703 766664 749891 734215 719654 706065
58860 706065 693688 683008 674230 666991 660529 654055 646965 638955 630188 621280 612797 604723 596618 588249
58846 588249 579743 571282 563088 555672 549495 544289 539348 534665 531101 529031 527429 524801 520637 515585
58832 515585 510604 506310 502762 499463 495881 492220 489275 487297 485573 483458 481249 479607 478681 478273 478324
58817 478324 478714 479111 479584 480838 483243 486153 488828 491452 494459 497359 499188 499891 500439 501630 503459
58802 503459 505534 507429 508705 509163 509047 508634 507824 506489 504871 503178 501163 498640 496080 494109 492809
58787 492809 492054 492093 493092 494532 495805 497098 499029 501813 505544 510795 517890 525821 532885 538372 542787
$$ packed form
58884F82783J4434J5925J7803J9287J9200J7541J5551J3967J2192R573O431L262
58872H47949j71m062p704j0287j2097j3985j5940j7039j6773j5676j4561j3589
58860G06065j2377j0680q778p239o462o474p090q010q767q908q483q074q105q369
58846E88249q506q461q194p416o177n206m941m683l564k070j602k628m164n052
58832E15585m981m294l548l299l582l661k945j978j724k115k209j642r26m08N1
58817D78324L90L97M73J254K405K910K675K624L007K900J829P03N48J191J829
58802E03459K075J895J276M58j16m13q10j335j618j693k015k523k560j971j300
58787D92809p55L9R99J440J273J293J931K784L731N251P095P931P064N487M415
$$ plain form
58772 542787 546523 549218 550458 550228 548549 545376 540957 535784 530194 524494 519222 514683 510493 506305
58758 506305 502682 500403 499079 497394 494685 491491 488636 486630 485903 486714 488695 491173 493978 497287 500805
58743 500805 503898 506434 508727 510810 512685 515122 519108 524466 530052 535467 541494 548667 556442 564126
58729 564126 571630 578912 585602 591692 597831 604438 611050 616901 621548 624707 626180 626261 625608 624473 622701
58714 622701 620652 619269 618955 619215 619848 621667 625337 630132 634538 637725 639982 641963 643913 645396 645484
58699 645484 643496 639670 634733 628719 620737 610110 597296 583411 569317 555459 542160 529748
58687 529748 518541 508816 500588 493490 487183 481681 476911 472255 467221 462340 458581 455962 453580 451038
58673 451038 448896 447617 447014 446990 447913 449801 451949 453822 455782 458565 462586 468002 474813 482533 490228
$$ packed form
58772E42787L736K695J240k30j679l173m419n173n590n700n272m539m190m188
58758E06305l623k279j324j685k709l194k855k006p27Q11J981K478K805L309L518
58743E00805L093K536K293K083J875K437L986N358N586N415O027P173P775P684
58729E64126P504P282O690O090O139O607O612N851M647L159J473Q1o53j135j772
58714F22701k049j383l14K60O33J819L670M795M406L187K257J981J950J483Q8
58699F45484j988l826m937o014p982j0627j2814j3885j4094j3858j3299j2412
58687E29748j1207r725q228p098o307n502m770m656n034m881l759k619k382k542
58673D51038k142j279o03k4R23J888K148J873J960K783M021N416O811P720P695
$$ plain form
58658 490228 497065 502467 505875 507231 507670 508695 510314 510917 509440 506735 504349 502817 501761 500844 499921
58643 499921 498812 497603 496696 496058 494969 493062 491130 490303 490811 492089 493691 495618 497993 500773 503530
58628 503530 505402 505723 504916 504156 503912 503492 502285 500673 499216 497714 495811 493943 492901 492813 493317 494499
58612 494499 497001 501282 507259 514630 523083 532129 541002 548818 554905 559172 562200 564778 567332 569913
58598 569913 572483 574753 576024 575802 574456 572670 570402 567117 562978 558953 555714 553269 551746 551647 553148
58583 553148 556032 560433 566678 574173 581549 588397 595851 604885 614886 624491 633068 640709 647559 653869
58569 653869 660209 666945 673884 680835 688087 696024 704804 714740 726390 739959 755180 772055 791024
58556 791024 812028 834023 855721 876185 894595 910231 923057 933504 941461 946289 948035 947587
$$ packed form
58658D90228O837N402L408J356M39J025J619O03j477k705k386j532j056r17r23
58643D99921j109j209r07o38j089j907j932q27N08J278J602J927K375K780K757
58628E03530J872L21q07p60k44m20j207j612j457j502j903j868j042q8N04J182
58612D94499K502M281N977P371Q453R046Q873P816O087M267L028K578K554K581
58598E69913K570K270J271k22j346j786k268l285m139m025l239k445j523r9J501
58583E53148K884M401O245P495P376O848P454R034J0001R605Q577P641O850O310
58569F53869O340O736O939O951P252P937Q780R936J1650J3569J5221J6875J8969
58556G91024K1004K1995K1698K0464J8410J5636J2826J0447P957M828J746m48
$$ plain form
58544 947587 945366 940980 934622 927567 920596 912966 903729 893014 881219 867912 852542 835488 817488
58531 817488 798671 779031 759282 740488 723376 708580 696778 687894 680881 674992 670498 667550
58519 667550 665252 662773 660582 659547 659477 659488 659292 659190 659251 659294 659315 659317 659257 659723 661956 666461 672171 677618 682267
58500 682267 686138 688996 690744 691910 692877 693265 692722 691592 690089 687693 684203 680582 677815 675738 673887
58485 673887 672685 672751 673749 675029 676854 680011 684782 691166 699482 709769 721179 732867 744947 757769
58471 757769 770866 783337 794566 803781 809793 812118 811560 808910 803935 796526 787749 778804 770033 762024
58457 762024 756410 754160 754130 754782 756332 759674 764256 768867 773718 779819 786807 793199 798420 802782 805727
58442 805727 805872 802814 797429 790541 782594 774474 767215 760950 755326 750786 748331 748248 750100 753510 757890
$$ packed form
58544I47587k221m386o358p055o971p630r237j0715j1795j3307j5370j7054j8000
58531H17488j8817j9640j9749j8794j7112j4796j1802q884p013n889m494k948
58519F67550k298k479k191j035p0J1j96j02O1M3K1Ko0M66K233M505N710N447M649
58500F82267L871K858J748J166R67L88n43j130j503k396l490l621k767k077j851
58485F73887j202O6R98J280J825L157M771O384Q316J0287J1410J1688J2080J2822
58471G57769J3097J2471J1229R215O012K325n58k650m975p409q777q945q771q009
58457G62024n614k250l0O52J550L342M582M611M851O101O988O392N221M362K945
58442H05727J45l058n385o888p947q120p259o265n624m540k455q3J852L410M380
$$ plain form
58427 757890 762054 765432 769177 774773 782120 790270 799321 809938 821595 833005 843928 854951 865792
58414 865792 875414 883425 889733 893259 892860 889381 885066 880990 876616 871726 867002 862700 858385 854136
58400 854136 850579 847703 845054 843030 842613 843921 846366 850049 855456 861887 867789 872629 877087 881457
58386 881457 885322 888729 892231 895691 898352 900132 901701 903425 905246 907214 908957 909264 907504 904918
58372 904918 903129 902127 901224 901084 902921 906433 910487 915231 921452 928531 935282 942312 951203 961707
58358 961707 972191 982612 994542 1008237 1022032 1034859 1047140 1059045 1069979 1079919 1089208 1097052
58346 1097052 1102326 1105862 1109775 1114579 1119158 1123487 1128921 1135719 1142739 1149881 1158521 1169320 1181729
58333 1181729 1195771 1211997 1229604 1246927 1263884 1281608 1299761 1316716 1332335 1347812 1362686
$$ packed form
58427G57890M164L378L745N596P347Q150R051J0617J1657J1410J0923J1023J0841
58414H65792R622Q011O308L526l99l479m315m076m374m890m724m302m315m249
58400H54136l557k876k649k024m17J308K445L683N407O431N902M840M458M370
58386H81457L865L407L502L460K661J780J569J724J821J968J743L07j760k586
58372I04918j789j002r03j40J837L512M054M744O221P079O751P030Q891J0504
58358I61707J0484J0421J1930J3695J3795J2827J2281J1905J0934R940R289P844
58346A097052N274L536L913M804M579M329N434O798P020P142Q640J0799J2409
58333A181729J4042J6226J7607J7323J6957J7724J8153J6955J5619J5477J4874
$$ plain form
58322 1362686 1374870 1383990 1391922 1399692 1406571 1412570 1418981 1425994 1432525 1438807 1446367 1455125 1463501 1471767
58308 1471767 1482210 1495488 1509961 1525164 1542594 1562312 1582158 1601316 1621452 1643272 1665179
58297 1665179 1686383 1708193 1731075 1753492 1774746 1795900 1816925 1836204 1853921 1872618 1893282
58286 1893282 1914246 1935024 1957578 1982426 2007255 2031104 2056375 2084947 2115665 2147385 2181105
58275 2181105 2217253 2254281 2291767 2331667 2374753 2419111 2463818 2510654 2560537 2611795 2663703
58264 2663703 2718083 2775694 2834779 2894956 2958701 3027107 3098085 3170603 3246629 3326970 3409411
58253 3409411 3493021 3579884 3670447 3761666 3852119 3944379 4040043 4137223 4235578 4338849 4449573
58242 4449573 4566046 4687269 4815814 4953002 5096588 5246370 5406643 5579922 5763776
$$ packed form
58322A362686J2184R120P932P770O879N999O411P013O531O282P560Q758Q376Q266
58308A471767J0443J3278J4473J5203J7430J9718J9846J9158K0136K1820K1907
58297A665179K1204K1810K2882K2417K1254K1154K1025J9279J7717J8697K0664
58286A893282K0964K0778K2554K4848K4829K3849K5271K8572L0718L1720L3720
58275B181105L6148L7028L7486L9900M3086M4358M4707M6836M9883N1258N1908
58264B663703N4380N7611N9085O0177O3745O8406P0978P2518P6026Q0341Q2441
58253C409411Q3610Q6863R0563R1219R0453R2260R5664R7180R8355J03271J10724
58242D449573J16473J21223J28545J37188J43586J49782J60273J73279J83854
$$ plain form
58233 5763776 5957151 6163896 6386489 6622422 6870685 7135597 7420250 7722731 8043202
58224 8043202 8388006 8762081 9164123 9594022 10057981 10561443 11104706 11691028 12331360
58215 12331360 13035562 13807217 14652997 15588470 16628844 17783837 19068574 20509715 22134718
58206 22134718 23967537 26043554 28416857 31145377 34284493 37905505 42102527 46967366
58198 46967366 52577900 59034477 66498914 75185186 85330061 97188759 111034239 127132706
58190 127132706 145731149 167068453 191326316 218476726 248124464 279390706 310680085
58183 310680085 339299209 361409652 372931013 371217687 356370038 331148816 299641080
58176 299641080 265755011 232398296 201368930 173563683 149247289 128315835 110496844
$$ packed form
58233E763776J93375K06745K22593K35933K48263K64912K84653L02481L20471
58224H043202L44804L74075M02042M29899M63959N03462N43263N86322O40332
58215A2331360P04202P71655Q45780R35473J040374J154993J284737J441141J625003
58206B2134718J832819K076017K373303K728520L139116L621012M197022M864839
58198D6967366N610534O456577P464437Q686272J0144875J1858698J3845480J6098467
58190A27132706J8598443K1337304K4257863K7150410K9647738L1266242L1289379
58183C10680085K8619124K2110443J1521361j713326j4847649k5221222l1507736
58176B99641080l3886069l3356715l1029366k7805247k4316394k0931454j7818991
$$ plain form
58169 110496844 95443234 82770741 72104609 63120572 55543224 49127700 43664917
58162 43664917 38993103 34984530 31525852 28520981 25900099 23609112 21595184 19811916
58154 19811916 18229001 16823947 15569836 14440491 13420583 12500445 11666331 10904466
58146 10904466 10208875 9576416 8998666 8466219 7976082 7527463 7114776 6731564 6376738
58137 6376738 6050308 5747341 5462462 5196117 4950292 4722136 4507651 4307488 4123160
58128 4123160 3951377 3787957 3633706 3490823 3357040 3228848 3107158 2994266 2888328
58119 2888328 2786193 2688789 2598547 2514227 2433221 2356223 2284807 2217101 2150680 2087061 2028473
58108 2028473 1972744 1916342 1860116 1807106 1756814 1706657 1657293 1611510 1569092 1527430 1486180
$$ packed form
58169A10496844j5053610j2672493j0666132q984037p577348o415524n462783
58162D3664917m671814m008573l458678l004871k620882k290987k013928j783268
58154A9811916j582915j405054j254111j129345j019908r20138q34114p61865
58146A0904466o95591o32459n77750n32447m90137m48619m12687l83212l54826
58137F376738l26430l02967k84879k66345k45825k28156k14485k00163j84328
58128D123160j71783j63420j54251j42883j33783j28192j21690j12892j05938
58119B888328j02135r7404r0242q4320q1006p6998p1416o7706o6421o3619n8588
58108B028473n5729n6402n6226n3010n0292n0157m9364m5783m2418m1662m1250
$$ plain form
58097 1486180 1447143 1410495 1374974 1340842 1309132 1279064 1249516 1221731 1197235 1174503 1151040
58086 1151040 1127340 1105449 1085104 1064735 1044860 1026903 1009830 991436 971924 952961 934373
58075 934373 915068 896060 879100 863197 845834 826979 808752 791863 775313 758981 743560
58064 743560 728661 713716 700001 689046 679800 670070 659885 650779 642640 634027 624818 615817 606525
58051 606525 595984 585022 575031 565422 554958 544627 536372 529820 523253 516941 512368 508759 503619
58038 503619 496558 489666 484172 479422 474975 471055 466975 461692 455780 450504 445191 438014 429040 419979
58024 419979 411225 401843 392296 384325 378027 371686 364796 358748 354229 350309 346447 343129 340164 336539
58010 336539 332378 329062 327049 325413 323743 322601 321968 321130 320257 320224 320750 320597 319686 319168 319350 319475 319552
$$ packed form
58097A486180l9037l6648l5521l4132l1710l0068k9548k7785k4496k2732k3463
58086A151040k3700k1891k0345k0369j9875j7957j7073j8394j9512j8963j8588
58075I34373j9305j9008j6960j5903j7363j8855j8227j6889j6550j6332j5421
58064G43560j4899j4945j3715j0955r246r730j0185r106q139q613r209r001r292
58051F06525j0541j0962r991r609j0464j0331q255o552o567o312m573l609n140
58038E03619p061o892n494m750m447l920m080n283n912n276n313p177q974r061
58024D19979q754r382r547p971o298o341o890o048m519l920l862l318k965l625
58010C36539m161l316k013j636j670j142o33q38q73l3N26j53r11n18J82J25P7
$$ plain form
57993 319552 320354 321411 320996 318513 315095 311712 308514 306134 305578 306367 306681 305836 304990 305051 305550 305955 306409
57976 306409 306773 306488 305817 305805 306687 307683 308482 309474 310427 310490 309678 308849 308148 307005 305727 305381 305944 306219 305774
57957 305774 305325 305027 304026 301964 299349 296257 292312 288147 285119 283221 280935 277533 273953 271097 268938
57942 268938 267644 267896 269608 271895 274806 279525 286418 294374 302518 311054 320041 328967 337986 347886
57928 347886 358193 366883 372673 376191 378308 378752 377060 373459 368053 360408 350704 340162 329778 319691
57914 319691 310136 301717 294286 286897 279354 272523 266740 261350 256205 252074 249041 246028 242573 239495
57900 239495 237082 234189 230039 225468 221360 217187 212228 207112 203086 200587 199404 199379 200185 201246 202486
57885 202486 204370 206828 209116 211039 213058 214853 215282 214346 213650 214060 214333 212992 210241 207039 203658
$$ packed form
57993C19552Q02J057m15k483l418l383l198k380n56P89L14q45q46O1M99M05M54
57976C06409L64k85o71j2Q82R96P99R92R53O3q12q29p01j143j278l46N63K75m45
57957C05774m49k98j001k062k615l092l945m165l028j898k286l402l580k856k159
57942B68938j294K52J712K287K911M719O893P956Q144Q536Q987Q926R019R900
57928C47886J0307Q690N790L518K117M44j692l601n406p645r704j0542j0384j0087
57914C19691r555q419p431p389p543o831n783n390n145m131l033l013l455l078
57900B39495k413k893m150m571m108m173m959n116m026k499j183k5Q06J061J240
57885B02486J884K458K288J923K019J795M29r36o96M10K73j341k751l202l381
$$ plain form
57870 203658 200276 197759 196561 195810 194601 193310 192601 192142 191420 190975 191646 193352 195696 199058 203986 210078
57854 210078 216526 223240 230545 238222 245623 252239 257567 261116 263218 265040 266981 267869 266529 263388
57840 263388 259630 255568 250866 245744 240810 236065 231026 225689 220682 216623 213714 211642 209614 207032
57826 207032 204390 202886 202892 203642 204571 205886 207416 208205 207949 207681 208185 208834 208850 208594 208520 207903 205808 202562
57808 202562 199106 195581 191667 187677 184212 181221 178440 176242 175112 174788 174789 175259 176390 177598 178181 178214
57792 178214 177967 177174 175839 174970 175337 176122 176032 175178 174583 174312 173548 172324 171811 172840 175201 178375 182011
57775 182011 185668 189045 192467 196392 200449 203683 205637 206513 206465 205480 203757 201492 198401 194151 189022
57760 189022 183520 177629 171237 165006 159916 156079 152791 149703 147133 145234 143542 141481 138838 135745
$$ packed form
57870B03658l382k517j198p51j209j291p09m59p22m45O71J706K344L362M928O092
57854B10078O448O714P305P677P401O616N328L549K102J822J941Q88j340l141
57840B63388l758m062m702n122m934m745n039n337n007m059k909k072k028k582
57826B07032k642j504OP50R29J315J530P89k56k68N04O49J6k56p4o17k095l246
57808B02562l456l525l914l990l465k991k781k198j130l24JM70J131J208N83L3
57792A78214k47p93j335q69L67P85r0q54n95k71p64j224n13J029K361L174L636
57775A82011L657L377L422L925M057L234J954Q76m8r85j723k265l091m250n129
57760A89022n502n891o392o231n090l837l288l088k570j899j692k061k643l093
$$ plain form
57746 135745 132611 129996 128202 127042 126153 125243 123920 121891 119623 118074 117347 116337 114323 112095 110791
57731 110791 110362 110099 110029 110733 112183 113666 114652 114993 114724 114320 114642 115878 117059 117404 117461 118049 118886 119400
57713 119400 120248 122603 126288 129957 132913 135437 137472 138322 137842 136829 136082 135937 136721 138671 141339 143959
57697 143959 146473 149419 152906 156500 159926 162923 164551 163728 160582 156340 151910 147466 143411 140641
57683 140641 139656 140264 142329 146007 151198 157691 165983 177150 191705 209386 230140 254630 283725
57670 283725 318332 359634 408464 464204 525039 588922 652599 709022 747331 757475 735858
57659 735858 687139 621444 549843 480781 418659 364605 318315 279302 247013 220611 199033
57648 199033 181179 166114 153360 142844 134341 127301 121527 117524 115536 114684 113811 112803 112269 112218
$$ packed form
57746A35745l134k615j794j160q89r10j323k029k268j549p27j010k014k228j304
57731A10791m29k63p0P04J450J483R86L41k69m04L22J236J181L45N7N88Q37N14
57713A19400Q48K355L685L669K956K524K035Q50m80j013p47j45P84J950K668K620
57697A43959K514K946L487L594L426K997J628q23l146m242m430m444m055k770
57683A40641r85O08K065L678N191O493Q292J1167J4555J7681K0754K4490K9095
57670B83725L4607M1302M8830N5740O0835O3883O3677N6423L8309J0144k1617
57659G35858m8719o5695p1601o9062o2122n4054m6290l9013l2289k6402k1578
57648A99033j7854j5065j2754j0516q503p040n774m003j988q52q73j008n34n1
$$ plain form
57634 112218 112058 111679 111486 111353 110584 109019 107245 105562 103596 101147 98611 96355 94368 92633 91137
57619 91137 89434 86997 84124 81716 80043 78565 77087 76168 76058 76106 75686 75004 74576 74483 74543 74745 75099 75412
57601 75412 75461 75133 74368 73345 72656 72823 73662 74581 75335 75968 76289 76148 75984 76211 76243 75143 73251 72122
57583 72122 72646 74131 75383 75814 75364 74355 73684 74224 75720 76992 77414 77296 76782 75532 73809 72662
57567 72662 72535 72625 72152 71297 70401 69273 67900 66899 66534 66199 65559 65331 66110 67231 67723 67730 68115 69191
57549 69191 70705 72523 74456 75850 76250 76211 76602 77397 77898 77910 77893 78128 78517 79173 80451 82220 83639 83956
57531 83956 83273 82470 82459 83538 85330 87322 89315 91270 92970 94255 95313 96164 96093 94462 92052 90624
57515 90624 90843 91540 91356 90220 88716 86966 84929 83079 81910 81219 80576 80052 79795 79398 78427 77278 76742
$$ packed form
57634A12218j60l79j93j33p69j565j774j683j966k449k536k256j987j735j496
57619I1137j703k437k873k408j673j478j478r19j10M8m20o82m28r3O0K02L54L13
57601G5412M9l28p65j023o89J67Q39R19P54O33L21j41j64K27L2j100j892j129
57583G2122N24J485J252M31m50j009o71N40J496J272M22j18n14j250j723j147
57567G2662j27R0m73q55q96j128j373j001l65l35o40k28P79J121M92PL85J076
57549F9191J514J818J933J394M00l9L91P95N01J2j7K35L89O56J278J769J419L17
57531H3956o83q03j1J079J792J992J993J955J700J285J058Q51p1j631k410j428
57515I0624K19O97j84j136j504j750k037j850j169o91o43n24k57l97r71j149n36
$$ plain form
57498 76742 76952 77378 77562 77225 75941 73501 70559 68289 67278 67185 67345 67282 66736 65714 64599 63896 63772
57481 63772 64018 64408 64950 65881 67414 69371 71066 71851 71778 71317 70498 68932 66784 64992 64187 63965 63656
57464 63656 63211 62903 62720 62625 62961 63966 65194 65993 66404 67091 68502 70450 72371 73723 74314 74481 74770
57447 74770 75323 75862 76322 76990 77831 78313 78243 78227 78861 79906 80744 81266 81853 82788 84108 85724 87299 88268
57429 88268 88337 87805 87209 86903 87008 87373 87499 87096 86728 87288 88695 89897 90379 90771 91650 92631 93197 93507 93791
57410 93791 93728 93138 92473 91966 91081 89610 88515 88691 89551 89805 89178 88345 87718 87228 86913 86689 85933 84314
57392 84314 82761 82565 83721 85067 85897 86452 87040 87651 88499 90005 92132 94410 96586 98614 100194 101059
57376 101059 101559 102227 102882 102911 102265 101423 100568 99641 99044 99342 100302 101075 101319 101287 100916 99828 98385 97778 98732
$$ packed form
57498G6742K10M26J84l37j284k440k942k270j011r3J60o3n46j022j115p03j24
57481F3772K46L90N42R31J533J957J695P85p3m61q19j566k148j792q05k22l09
57464F3656m45l08j83r5L36J005J228P99M11O87J411J948J921J352N91J67K89
57447G4770N53N39M60O68Q41M82p0j6O34J045Q38N22N87R35J320J616J575R69
57429H8268O9n32n96l06J05L65J26m03l68N60J407J202M82L92Q79R81N66L10K84
57410I3791o3n90o65n07q85j471j095J76Q60K54o27q33o27m90l15k24p56j619
57392H4314j553j96J156J346Q30N55N88O11Q48J506K127K278K176K028J580Q65
57376A01059N00O68O55K9o46q42q55r27n97K98R60P73K44l2l71j088j443o07R54
$$ plain form
57357 98732 100797 103117 105191 106733 107491 107515 107168 106763 106552 106923 107904 108624 108105 106658 105656 105838 106669
57340 106669 107521 108526 109872 111098 111717 112011 112650 113834 115195 116253 116721 116606 116214 115851 115481 114972 114619
57323 114619 114987 116218 117881 119518 120930 122031 122924 124103 126003 128313 130245 131481 132353 133130 133770
57308 133770 134366 135204 136230 137100 137871 138999 140514 141820 142545 143008 143589 144191 144602 144977 145672 146980 149130
57291 149130 152140 155552 158754 161733 165072 169139 173680 178207 182281 185435 187510 189195 191526 194627
57277 194627 197584 199784 201687 203978 206699 209693 213200 217348 221472 224634 226647 228079 229389 230547
57263 230547 231441 232267 233414 235139 237314 239499 241341 242952 244726 246817 249105 251686 254950 259012 263337
57248 263337 267216 270554 274053 278652 284681 291427 297692 303017 308208 314366 321614 329137 336287 343061
$$ packed form
57357I8732K065K320K074J542P58K4l47m05k11L71R81P20n19j447j002J82Q31
57340A06669Q52J005J346J226O19K94O39J184J361J058M68j15l92l63l70n09l53
57323A14619L68J231J663J637J412J101Q93J179J900K310J932J236Q72P77O40
57308A33770N96Q38J026Q70P71J128J515J306P25M63N81O02M11L75O95J308K150
57291A49130L010L412L202K979L339M067M541M527M074L154K075J685K331L101
57277A94627K957K200J903K291K721K994L507M148M124L162K013J432J310J158
57263B30547Q94Q26J147J725K175K185J842J611J774K091K288K581L264M062M325
57248B63337L879L338L499M599O029O746O265N325N191O158P248P523P150O774
$$ plain form
57234 343061 349634 355998 362259 368798 375996 384010 392807 402066 411205 419932 428737 438387 449033 460226
57220 460226 471556 482641 492700 501112 508547 516774 526980 538734 550816 562542 574132 586266
57208 586266 599453 613435 627213 640185 653196 667765 684275 701695 719192 737099 755939
57197 755939 775410 794873 814204 833589 853016 872527 892495 913060 933609 953266 971693
57186 971693 989117 1005931 1022592 1039536 1056731 1073590 1089653 1105144 1120619 1136378 1152458
57175 1152458 1168889 1185698 1202895 1220642 1239168 1258409 1278042 1297930 1318075 1338061 1357158
57164 1357158 1375344 1393711 1413454 1434772 1457001 1479429 1501713 1523894 1546397 1569698 1593735
57153 1593735 1617900 1641789 1665585 1689570 1713745 1738150 1763070 1788557 1814198 1839733 1865484
$$ packed form
57234C43061O573O364O261O539P198Q014Q797R259R139Q727Q805R650J0646J1193
57220D60226J1330J1085J0059Q412P435Q227J0206J1754J2082J1726J1590J2134
57208E86266J3187J3982J3778J2972J3011J4569J6510J7420J7497J7907J8840
57197G55939J9471J9463J9331J9385J9427J9511J9968K0565K0549J9657J8427
57186I71693J7424J6814J6661J6944J7195J6859J6063J5491J5475J5759J6080
57175A152458J6431J6809J7197J7747J8526J9241J9633J9888K0145J9986J9097
57164A357158J8186J8367J9743K1318K2229K2428K2284K2181K2503K3301K4037
57153A593735K4165K3889K3796K3985K4175K4405K4920K5487K5641K5535K5751
$$ plain form
57142 1865484 1891829 1918598 1945384 1972115 1998913 2025738 2052577 2079829 2108127 2137912 2169386
57131 2169386 2202685 2237851 2274823 2313636 2354445 2397292 2442129 2489140 2538762 2591385 2647434
57120 2647434 2707686 2772878 2842877 2916912 2995018 3078713 3169873 3269401 3377364 3494008 3620255
57109 3620255 3757733 3908962 4077347 4266560 4480118 4722019 4997765 5314621 5681168
57100 5681168 6107167 6604077 7185759 7868825 8672363 9617173 10724930 12017358 13514850
57091 13514850 15234326 17187326 19379214 21808771 24467259 27337297 30392168 33594926
57083 33594926 36897430 40241175 43559486 46776100 49797690 52508123 54776055 56476145
57075 56476145 57511107 57823616 57399094 56264805 54485171 52150919 49365709 46237177
$$ packed form
57142A865484K6345K6769K6786K6731K6798K6825K6839K7252K8298K9785L1474
57131B169386L3299L5166L6972L8813M0809M2847M4837M7011M9622N2623N6049
57120B647434O0252O5192O9999P4035P8106Q3695R1160R9528J07963J16644J26247
57109C620255J37478J51229J68385J89213K13558K41901K75746L16856L66547
57100E681168M25999M96910N81682O83066Q03538R44810J107757J292428J497492
57091A3514850J719476J953000K191888K429557K658488K870038L054871L202758
57083C3594926L302504L343745L318311L216614L021590K710433K267932J700090
57075E6476145J034962L12509m24522j134289j779634k334252k785210l128532
$$ plain form
57067 46237177 42873871 39383517 35869132 32423646 29124771 26031155 23181098 20594504
57059 20594504 18276404 16220048 14409863 12825316 11444411 10244994 9204751 8302071
57051 8302071 7517553 6834293 6237029 5711936 5247336 4833929 4464223 4132067 3832370
57042 3832370 3560454 3311613 3081831 2868899 2672333 2492181 2328062 2178891 2042867
57033 2042867 1917913 1802640 1696750 1600191 1512248 1431899 1358565 1291820 1230742 1174251 1121846
57022 1121846 1073381 1028368 986177 946664 909913 875543 842958 812028 782860 755091 728194
57011 728194 702363 678313 656209 635467 615682 597104 580134 564826 550950 538107 525842
57000 525842 514057 503279 494134 486646 480378 475066 470675 467040 463909 461271 459292 458128 458060 459482
$$ packed form
57067D6237177l363306l490354l514385l445486l298875l093616k850057k586594
57059B0594504k318100k056356j810185j584547j380905j199417j040243r02680
57051H302071p84518o83260n97264n25093m64600m13407l69706l32156k99697
57042C832370k71916k48841k29782k12932j96566j80152j64119j49171j36024
57033B042867j24954j15273j05890r6559q7943q0349p3334o6745o1078n6491n2405
57022A121846m8465m5013m2191l9513l6751l4370l2585l0930k9168k7769k6897
57011G28194k5831k4050k2104k0742j9785j8578j6970j5308j3876j2843j2265
57000E25842j1785j0778r145p488o268n312m391l635l131k638j979j164o8J422
$$ plain form
56986 459482 462392 466302 471030 477099 484814 493387 501398 507548 510385 508069 499568 485863 469192 451304
56972 451304 433106 415477 399304 384860 372026 361109 352677 346780 343141 341919 343451 347451 353374
56959 353374 361410 372171 385439 400172 415677 431665 446902 458719 464341 462350 453026 438092
56947 438092 420198 401808 384154 367560 352542 339959 330224 323200 318888 317471 318729 322231 328210
56934 328210 337551 350818 367888 388417 411869 437018 462023 484895 503184 513631 513469 502463
56922 502463 483014 458273 430883 403252 377544 354850 335232 318791 305821 295648 286524 277232
56910 277232 268025 259538 251713 244413 238277 234102 231795 230628 230242 230890 232874 236084 239992 244041 248246
56895 248246 253375 260114 268119 276387 284531 293138 302944 314308 327455 342431 358615 374849 390090
$$ packed form
56986D59482K910L910M728O069P715Q573Q011O150K837k316q501j3705j6671j7888
56972D51304j8198j7629j6173j4444j2834j0917q432n897l639j222J532M000N923
56959C53374Q036J0761J3268J4733J5505J5988J5237J1817N622j991r324j4934
56947D38092j7894j8390j7654j6594j5018j2583r735p024m312j417J258L502N979
56934C28210R341J3267J7070K0529K3452K5149K5005K2872J8289J0447j62j1006
56922E02463j9449k4741k7390k7631k5708k2694j9618j6441j2970j0173r124r292
56910B77232r207q487p825p300o136m175k307j167l86O48J984L210L908M049M205
56895B48246N129O739Q005Q268Q144Q607R806J1364J3147J4976J6184J6234J5241
$$ plain form
56882 390090 403286 412701 416258 412874 402936 387621 368623 348467 329866 314234 301529 291734
56870 291734 285596 283730 286069 292683 304189 320776 341652 366113 394522 427666 465779 508598
56858 508598 555537 604829 652661 693646 722227 734191 728242 706932 675527 639305 601984 566433
56846 566433 535525 511451 494904 485671 483674 489025 501672 521641 549285 584919 628646 680755
56834 680755 741572 810367 884748 961149 1034851 1098998 1144828 1164522 1154568 1116782 1057140 984095
56822 984095 906700 832342 765299 707215 658533 619299 589363 568647 557176 554578 560010 572944
56810 572944 593714 622909 660490 705570 756445 810278 862987 909509 943910 959812 952485 921717
56798 921717 872384 811803 746800 682871 624192 572949 529164 492162 461974 438881 422472
$$ packed form
56882C90090J3196R415L557l384r938j5315j8998k0156j8601j5632j2705r795
56870B91734o138j866K339O614J1506J6587K0876K4461K8409L3144L8113M2819
56858E08598M6939M9292M7832M0985K8581J1964n949k1310l1405l6222l7321l5551
56846E66433l0908k4074j6547r233j997N351J2647J9969K7644L5634M3727N2109
56834F80755O0817O8795P4381P6401P3702O4147M5830J9694r954l7786n9642p3045
56822I84095p7395p4358o7043n8084m8682l9234k9936k0716j1471k598N432J2934
56810E72944K0770K9195L7581M5080N0875N3833N2709M6522L4401J5902p327l0768
56798I21717m9333o0581o5003o3929n8679n1243m3785l7002l0188k3093j6409
$$ plain form
56787 422472 412100 407745 409524 416785 428610 444841 465618 490129 516621 543292 568097 587647
56775 587647 597446 594001 576705 547905 511555 471722 431680 393745 359413 329321 303202 280485
56763 280485 261025 244779 230875 217937 205594 194805 186251 179224 172643 166331 160614 155458 150798
56750 150798 147050 144386 142014 139039 135695 132940 131196 130197 129680 129434 128971 127903 126435 124994 123712
56735 123712 122727 122421 122741 122946 122736 122872 123780 124276 122926 120183 117874 116849 116421 116039 116116 116954 118016
56718 118016 118718 119149 119613 120128 120675 121324 121894 121970 121442 120641 119871 119250 119007 119407 120330 121320 122092 122633 122926
56699 122926 123059 123450 124450 125765 126733 127125 127222 127226 127133 127110 127452 128138 128824 129276 129490 129487 129362 129394 129749 130172 130252
56678 130252 129862 129110 128165 127371 127115 127229 126971 126012 124952 124468 124522 124955 126141 128202 130115 130566 129473
$$ packed form
56787D22472j0372m355J779P261J1825J6231K0777K4511K6492K6671K4805J9550
56775E87647R799l445j7296k8800l6350l9833m0042l7935l4332l0092k6119k2717
56763B80485j9460j6246j3904j2938j2343j0789q554p027o581o312n717n156m660
56750A50798l748k664k372k975l344k755j744r99n17k46m63j068j468j441j282
56735A23712r85l06L20K05k10J36R08M96j350k743k309j025m28l82P7Q38J062
56718A18016P02M31M64N15N47O49N70P6n28q01p70o21k43M00R23R90P72N41K93
56699A22926J33L91J000J315R68L92R7Mr3k3L42O86O86M52K14lj25L2L55M23Q0
56678A30252l90p52r45p94k56J14k58r59j060m84N4M33J186K061J913M51j093
$$ plain form
56661 129473 127874 126620 125952 125975 126551 126947 126532 125735 125437 125622 125595 125437 126157 128246 130990 133418 135148
56644 135148 136145 136530 136924 138283 140995 144480 147834 150479 152281 153619 155309 157874 160776 162908 163880
56629 163880 164344 165104 166470 168413 170679 172679 173834 174139 173973 173507 172833 172527 173295 174947 176330 176468
56613 176468 175332 173458 171364 169408 167752 166285 164839 163507 162524 162034 162119 162725 163219 162571 160503 157964
56597 157964 155840 153737 150884 147699 145386 144230 143396 142322 141305 140659 140314 140376 141112 142207 142832 142717
56581 142717 142444 142491 142651 142608 142472 142551 143044 144063 145587 147444 149660 152501 155704 158202 159379 160155 161891
56564 161891 164621 167471 170502 174806 180789 187660 194842 202637 211083 219178 225670 229919 231797 231677
56550 231677 230786 230668 231785 233216 233846 233234 231362 228535 225686 223858 223045 222316 221200 220084 219166 218082
$$ packed form
56661A29473j599j254o68K3N76L96m15p97k98J85k7j58P20K089K744K428J730
56644A35148R97L85L94J359K712L485L354K645J802J338J690K565K902K132R72
56629A63880M64P60J366J943K266K000J155L05j66m66o74l06P68J652J383J38
56613A76468j136j874k094j956j656j467j446j332r83m90Q5O06M94o48k068k539
56597A57964k124k103k853l185k313j156q34j074j017o46l45O2P36J095O25j15
56581A42717k73M7J60m3j36P9M93J019J524J857K216K841L203K498J177P76J736
56564A61891K730K850L031M304N983O871P182P795Q446Q095O492M249J878j20
56550B31677q91j18J117J431O30o12j872k827k849j828q13p29j116j116r18j084
$$ plain form
56534 218082 216796 215824 215170 214004 211837 209149 206527 204053 201940 200793 200703 200875 200629 200005 198974 196962
56518 196962 193702 189801 185937 182200 178667 175826 173861 172249 170605 169229 168336 167510 166551 166123 166792
56503 166792 167938 168313 167398 165701 164106 163260 163243 163467 163282 162888 163130 164267 165557 166296 166532 166521 166216 165731
56485 165731 165554 165870 166244 166293 166056 165508 164547 163752 164188 165933 167716 168581 169081 170082 171271 171726 171364 170961
56467 170961 171159 172138 173828 175682 176668 176226 175064 174396 174651 175409 176291 177360 178800 180650 182768 184809
56451 184809 186411 187526 188316 188769 188837 188882 189336 189926 190005 189695 189833 190579 191125 191118 191324 192302 193412 193863 193939 194369
56431 194369 195122 195616 195627 195289 194691 194130 194325 195677 197656 199397 200532 201020 200722 199711 198618 198078 198119
56414 198119 198426 198842 199292 199708 200270 201233 202303 202800 202725 202924 203912 205257 206376 207172 207571 207379 207039 207510
$$ packed form
56534B18082j286r72o54j166k167k688k622k474k113j147r0J72k46o24j031k012
56518A96962l260l901l864l737l533k841j965j612j644j376q93q26r59m28O69
56503A66792J146L75r15j697j595q46j7K24j85l94K42J137J290P39K36j1l05m85
56485A65731j77L16L74M9k37n48r61p95M36J745J783Q65N00J001J189M55l62m03
56467A70961J98R79J690J854R86m42j162o68K55P58Q82J069J440J850K118K041
56451A84809J602J115P90M53O8M5M54N90P9l10J38P46N46pK06R78J110M51P6M30
56431A94369P53M94J1l38n98n61J95J352J979J741J135M88k98j011j093n40M1
56414A98119L07M16M50M16N62R63J070M97p5J99R88J345J119P96L99j92l40M71
$$ plain form
56396 207510 208893 210116 210606 211283 213159 215847 218307 220185 221598 222418 222734 223265 224399 225420 225591 225279
56380 225279 225175 225126 224731 224350 224380 224201 223073 221623 221165 221804 222440 222498 222480 222799 223155 223314 223626 224476 225754
56361 225754 227029 227913 228252 228309 228645 229486 230411 230913 230976 230861 230757 230977 231997 233788 235491 236192 235756 234683
56343 234683 233666 233489 234643 236633 238322 239362 240605 242710 245221 247517 249809 252445 255060 257253
56329 257253 259456 262317 265689 269008 272202 275573 279234 283174 287316 291086 293588 294703 295256 295653 295280
56314 295280 293818 292176 291375 291489 292353 294221 296837 298999 300165 301464 303924 306682 308334 309203 310814
56299 310814 313686 317042 320193 322870 324648 325396 326001 327445 329411 330860 331652 332475 333575 334679 335946
56284 335946 337925 340739 344127 347965 351985 355469 358115 360665 363854 367388 370892 375090 380860 387770
$$ packed form
56396B07510J383J223M90O77J876K688K460J878J413Q20L16N31J134J021J71l12
56380B25279j04m9l95l81L0j79j128j450m58O39O36N8j8L19L56J59L12Q50J278
56361B25754J275Q84L39N7L36Q41R25N02O3j15j04K20J020J791J703P01m36j073
56343B34683j017j77J154J990J689J040J243K105K511K296K292K636K615K193
56329B57253K203K861L372L319L194L371L661L940M142L770K502J115N53L97l73
56314B95280j462j642q01J14Q64J868K616K162J166J299K460K758J652Q69J611
56299C10814K872L356L151K677J778P48O05J444J966J449P92Q23J100J104J267
56284C35946J979K814L388L838M020L484K646K550L189L534L504M198N770O910
$$ plain form
56270 387770 394773 401808 409523 417999 427012 437014 448559 461109 473639 486063 499000 512700
56258 512700 527446 544435 564839 588276 613502 640312 669670 702403 738981 780103 826222
56247 826222 876819 931313 990222 1054214 1122553 1193741 1267060 1342043 1417013 1489730 1559058
56236 1559058 1624474 1684281 1735926 1777805 1809280 1829216 1836184 1830053 1812061 1783519 1745772 1700963
56224 1700963 1651172 1596926 1538064 1475886 1412915 1350708 1289407 1229372 1171648 1116801 1064718
56213 1064718 1015580 969803 927161 887186 850213 816799 786539 758734 733736 712098 692957
56202 692957 674887 657940 643138 630394 618741 608222 599563 592295 585191 578449 573433 570301 567803
56189 567803 565416 563726 562654 561243 559254 557202 554895 551903 549404 549328 551431 553326 553764 553878 554853
$$ packed form
56270C87770P003P035P715Q476R013J0002J1545J2550J2530J2424J2937J3700
56258E12700J4746J6989K0404K3437K5226K6810K9358L2733L6578M1122M6119
56247H26222N0597N4494N8909O3992O8339P1188P3319P4983P4970P2717O9328
56236A559058O5416N9807N1645M1879L1475J9936O968o131j7992k8542l7747m4809
56224A700963m9791n4246n8862o2178o2971o2207o1301o0035n7724n4847n2083
56213A064718m9138m5777m2642l9975l6973l3414l0260k7805k4998k1638j9141
56202F92957j8070j6947j4802j2744j1653j0519q659p268p104o742n016l132k498
56189E67803k387j690j072j411j989k052k307k992k499p6K103J895M38J14R75
$$ plain form
56174 554853 556375 557965 559994 562744 565976 569807 574588 579798 584626 589641 596215 604358 612902 621598
56160 621598 631050 640786 649782 658950 670626 685269 701002 716830 733916 753211 774304 797357
56148 797357 823876 854725 889586 929201 976022 1031741 1096172 1169373 1252797 1347368 1452220
56137 1452220 1566072 1687613 1813273 1936262 2049170 2146898 2227487 2292369 2346389 2395440
56127 2395440 2442971 2489552 2534845 2577085 2610612 2627557 2623831 2601864 2567215 2524925 2479243
56116 2479243 2432930 2384444 2328008 2258319 2173942 2075885 1966027 1848671 1731045 1619855
56106 1619855 1518465 1428329 1350983 1287066 1235176 1193283 1159976 1133569 1111908 1094087 1080588
56095 1080588 1070981 1063528 1057770 1055089 1055714 1057579 1059253 1061592 1065272 1069128 1072306 1075753 1080231 1085142
$$ packed form
56174E54853J522J590K029K750L232L831M781N210M828N015O574Q143Q544Q696
56160F21598R452R736Q996R168J1676J4643J5733J5828J7086J9295K1093K3053
56148G97357K6519L0849L4861L9615M6821N5719O4431P3201Q3424R4571J04852
56137A452220J13852J21541J25660J22989J12908R7728Q0589O4882N4020M9051
56127B395440M7531M6581M5293M2240L3527J6945l726k1967l4649m2290m5682
56116B479243m6313m8486n6436o9689q4377r8057j09858j17356j17626j11190
56106A619855j01390r0136p7346o3917n1890m1893l3307k6407k1661j7821j3499
56095A080588r607p453n758k681O25J865J674K339L680L856L178L447M478M911
$$ plain form
56081 1085142 1090557 1097998 1107860 1118435 1128790 1140144 1153028 1165701 1177018 1188421 1201434 1215566
56069 1215566 1230178 1245953 1262882 1279262 1294312 1309430 1325404 1341028 1355990 1372335 1391256
56058 1391256 1411166 1430844 1451755 1475298 1500366 1525655 1551809 1579272 1606502 1632318 1657558
56047 1657558 1682715 1706631 1729281 1752950 1778664 1804321 1828352 1852311 1877917 1904567 1931859
56036 1931859 1961432 1994159 2028511 2063746 2101550 2142545 2184664 2227092 2272160 2321088 2371661
56025 2371661 2422437 2475185 2530647 2586203 2640652 2696997 2757349 2819401 2881322 2945725 3015220
56014 3015220 3088382 3163846 3243992 3330591 3421211 3513948 3611220 3714780 3821691 3929779 4042257
56003 4042257 4162212 4287324 4415190 4549017 4692594 4844199 5001119 5165694 5341324
$$ packed form
56081A085142N415P441R862J0575J0355J1354J2884J2673J1317J1403J3013J4132
56069A215566J4612J5775J6929J6380J5050J5118J5974J5624J4962J6345J8921
56058A391256J9910J9678K0911K3543K5068K5289K6154K7463K7230K5816K5240
56047A657558K5157K3916K2650K3669K5714K5657K4031K3959K5606K6650K7292
56036A931859K9573L2727L4352L5235L7804M0995M2119M2428M5068M8928N0573
56025B371661N0776N2748N5462N5556N4449N6345O0352O2052O1921O4403O9495
56014C015220P3162P5464Q0146Q6599R0620R2737R7272J03560J06911J08088J12478
56003D042257J19955J25112J27866J33827J43577J51605J56920J64575J75630
$$ plain form
55994 5341324 5527088 5721979 5929703 6153347 6390139 6637573 6899763 7181580 7481906
55985 7481906 7799322 8139002 8506941 8902984 9326894 9785484 10286074 10828904 11414188
55976 11414188 12050592 12748452 13511429 14343988 15260421 16277125 17403438 18650495 20041955
55967 20041955 21606044 23366397 25353356 27616454 30214619 33205625 36660790 40681412
55959 40681412 45387921 50906674 57385194 65007388 73975453 84492338 96782192 111108295
55951 111108295 127745759 146956082 169001441 194113442 222342518 253383493 286459658
55944 286459658 320102304 351711168 377342984 392479375 393793821 380778318 355953189
55937 355953189 323577048 287956155 252409087 219052014 188992431 162611429 139849798
$$ packed form
55994E341324J85764J94891K07724K23644K36792K47434K62190K81817L00326
55985G481906L17416L39680L67939L96043M23910M58590N00590N42830N85284
55976A1414188O36404O97860P62977Q32559R16433J016704J126313J247057J391460
55967B0041955J564089J760353J986959K263098K598165K991006L455165M020622
55959D0681412M706509N518753O478520P622194Q968065J0516885J2289854J4326103
55951A11108295J6637464J9210323K2045359K5112001K8229076L1040975L3076165
55944B86459658L3642646L1608864K5631816J5136391J314446j3015503k4825129
55937C55953189l2376141l5620893l5547068l3357073l0059583k6381002k2761631
$$ plain form
55930 139849798 120440538 104026887 90204403 78568544 68765180 60496193 53497255
55923 53497255 47539035 42443161 38072314 34305405 31035993 28185119 25694600 23508985
55915 23508985 21576686 19862216 18341255 16986178 15768369 14670206 13681806 12788884
55907 12788884 11975013 11232298 10558465 9945727 9382421 8862917 8386191 7946934 7537147
55898 7537147 7154363 6799695 6469810 6158896 5866469 5595273 5343266 5105235 4880571
55889 4880571 4672089 4478622 4295764 4122623 3961236 3810576 3667399 3531847 3406268
55880 3406268 3289717 3179284 3075408 2980220 2891965 2806629 2723836 2645681 2570953 2495998 2420350
55869 2420350 2346318 2273979 2201647 2130411 2063205 2000167 1939566 1882333 1830814 1783902 1738216
$$ packed form
55930A39849798j9409260j6413651j3822484j1635859r803364q268987o998938
55923E3497255n958220n095874m370847l766909l269412k850874k490519k185615
55915B3508985j932299j714470j520961j355077j217809j098163r88400q92922
55907A2788884q13871p42715o73833o12738n63306n19504m76726m39257m09787
55898G537147l82784l54668l29885l10914k92427k71196k52007k38031k24664
55889D880571k08482j93467j82858j73141j61387j50660j43177j35552j25579
55880C406268j16551j10433j03876r5188q8255q5336q2793p8155p4728p4955p5648
55869B420350p4032p2339p2332p1236o7206o3038o0601n7233n1519m6912m5686
$$ plain form
55858 1738216 1693394 1651500 1611905 1571749 1531179 1493387 1459373 1427056 1395640 1366583 1339831
55847 1339831 1313034 1285022 1256762 1228694 1200229 1171882 1144831 1118524 1091585 1064719 1039785
55836 1039785 1016582 993669 971669 952416 935283 917834 899884 883646 869937 857336 844982
55825 844982 833222 821677 809621 798075 788541 779817 768992 755484 741340 727735 714056 700296
55813 700296 687452 675432 663184 650893 639641 629173 618498 608363 600456 594480 588703 583060
55801 583060 578958 576309 573675 571158 570224 570722 570986 570926 572135 574739 576972 578156 579448 581384 583347
55786 583347 585745 589957 595526 599704 600196 596288 587424 573406 556367 539950 525862 513317 501946
55773 501946 492754 485946 480455 476182 474160 473783 472164 467099 458738 448039 435839 423926 414617 408351
$$ packed form
55858A738216m4822m1894l9595m0156m0570l7792l4014l2317l1416k9057k6752
55847A339831k6797k8012k8260k8068k8465k8347k7051k6307k6939k6866k4934
55836A039785k3203k2913k2000j9253j7133j7449j7950j6238j3709j2601j2354
55825H44982j1760j1545j2056j1546r534q724j0825j3508j4144j3605j3679j3760
55813G00296j2844j2020j2248j2291j1252j0468j0675j0135p907n976n777n643
55801E83060m102k649k634k517r34M98K64o0J209K604K233J184J292J936J963
55786E83347K398M212N569M178M92l908q864j4018j7039j6417j4088j2545j1371
55773E01946r192o808n491m273k022l77j619n065q361j0699j2200j1913r309o266
$$ plain form
55759 408351 403563 399443 396810 395782 394810 392687 389463 384752 377295 367042 355697 344421 332881
55746 332881 321272 311226 303794 298242 293703 290331 288041 285881 283521 281818 281131 280539 279352 277874
55732 277874 276121 273481 270262 267829 266486 264822 261876 258326 254838 250932 246307 241702 237533 233154
55718 233154 228332 224060 221150 219393 218776 219999 222947 226160 228737 231447 235061 238815 241426 242476
55704 242476 242081 240426 238357 237170 236942 236144 233646 230037 226348 222620 218429 213749 208645 203092 197635
55689 197635 193211 189995 187440 185647 185254 185760 185607 184433 183666 184265 185484 186540 187835 189639 191128
55674 191128 191758 192228 193083 193714 193643 193454 193443 192689 190597 188173 186631 185813 184996 184254 183970 183999 184217 185008 186378
55655 186378 187581 188375 189524 191276 192626 192956 193112 193817 194300 193691 192586 191954 191580 190951 190680 191588 193108
$$ packed form
55759D08351m788m120k633j028r72k123l224m711p457j0253j1345j1276j1540
55746C32881j1609j0046p432n552m539l372k290k160k360j703o87n92j187j478
55732B77874j753k640l219k433j343j664k946l550l488l906m625m605m169m379
55718B33154m822m272k910j757o17J223K948L213K577K710L614L754K611J050
55704B42476l95j655k069j187k28p98k498l609l689l728m191m680n104n553n457
55689A97635m424l216k555j793l93N06j53j174p67N99J219J056J295J804J489
55674A91128O30M70Q55O31p1j89j1p54k092k424j542q18q17p42k84K9K18P91J370
55655A86378J203P94J149J752J350L30J56P05M83o09j105o32l74o29k71R08J520
$$ plain form
55638 193108 193924 193648 192737 191348 189357 186938 184202 180818 176789 172804 169071 164802 159813 155549 153294
55623 153294 152315 151098 149592 148833 148983 149267 149391 149593 149525 148380 146026 143030 139760 136343 133180 130524
55607 130524 127837 124489 120837 117784 115570 113807 112370 111420 110855 110449 110237 110064 109273 107548 105585 104161
55591 104161 103099 101977 101306 102009 104065 106568 108835 110790 112617 114772 117840 121678 125253 128059 131047
55576 131047 135340 140730 146447 152763 160587 169849 179344 187837 194333 197744 197483 194251 189252 182917
55562 182917 175316 167363 160341 154479 149151 144350 140696 138013 135162 131562 127801 124479 121335 117906
55548 117906 114316 111048 108401 106339 104505 102406 100004 98003 97045 96756 96132 94736 93034 91786 91595
55533 91595 92761 94885 96875 97924 98298 98652 99023 99255 99885 101576 103840 105311 105310 104355 103157 101931 100754
$$ packed form
55638A93108Q16k76r11j389j991k419k736l384m029l985l733m269m989m264k255
55623A53294r79j217j506p59J50K84J24K02o8j145k354k996l270l417l163k656
55607A30524k687l348l652l053k214j763j437r50n65m06k12j73p91j725j963j424
55591A04161j062j122o71P03K056K503K267J955J827K155L068L838L575K806K988
55576A31047M293N390N717O316P824R262R495Q493O496L411k61l232m999o335
55562A82917p601p953p022n862n328m801l654k683k851l600l761l322l144l429
55548A17906l590l268k647k062j834k099k402k001r58k89o24j396j702j248j91
55533I1595J166K124J990J049L74L54L71K32O30J691K264J471jr55j198j226j177
$$ plain form
55516 100754 99829 99213 98792 98533 98332 97797 96705 95427 94272 92712 89988 86312 82734 79924 77751 75878
55500 75878 74022 71840 69333 67269 66376 66248 65767 64525 63046 61781 60841 60626 61679 63680 65428 66124
55484 66124 66052 65897 66068 66771 67973 69068 69227 68388 67377 66899 66936 67230 67757 68491 69183 69603 69672 69346 68715
55465 68715 68175 68033 67980 67406 66236 65012 64250 64124 64652 65630 66527 66964 67181 67555 67888 67807 67536 67509 67430 66671
55445 66671 65518 65047 65642 66519 66901 66846 66685 66420 66014 65678 65569 65674 66100 66945 67835 68257 68394 68896 69692
55426 69692 69824 68704 66851 65105 63854 63323 63803 65085 66229 66495 66141 65953 66353 67249 68341 69209 69466
55409 69466 69162 68762 68515 68196 67657 67200 67150 67394 67598 67593 67379 67066 66998 67561 68655 69631 69938 69586 68891 68099
55389 68099 67418 67118 67385 68181 69253 70163 70442 70009 69329 68879 68630 68347 68092 67984 67816 67487 67479 68142 68821
$$ packed form
55516A00754r25o16m21k59k01n35j092j278j155j560k724l676l578k810k173j873
55500G5878j856k182k507k064q93j28m81j242j479j265r40k15J053K001J748O96
55484F6124p2j55J71P03J202J095J59q39j011m78L7K94N27P34O92M20O9l26o31
55465F8715n40j42n3n74j170j224p62j26N28R78Q97M37K17L74L33q1k71k7p9p59
55445F6671j153m71N95Q77L82n5j61k65m06l36j09J05M26Q45Q90M22J37N02P96
55426F9692J32j120j853j746j251n31M80J282J144K66l54j88M00Q96J092Q68K57
55409F9466l04m00k47l19n39m57n0K44K04nk14l13o8N63J094R76L07l52o95p92
55389F8099o81l00K67P96J072R10K79m33o80m50k49k83k55j08j68l29qO63O79
$$ plain form
55370 68821 68561 67510 66606 66001 64917 63201 61834 61516 61721 61652 61258 60816 60316 59801 59609 59782 59938 60123
55352 60123 61042 62881 64692 65592 65868 66213 66577 66574 66392 66397 66283 65506 64275 63290 62763 62467 62475 63014 63713 63829
55332 63829 63225 62448 61825 61191 60543 60256 60465 60808 61035 61386 62117 62988 63503 63432 62904 62138 61247 60294 59428
55313 59428 58919 58947 59352 59750 59941 59994 59861 59223 58009 56822 56511 57384 59091 61122 63140 64886 66044
55296 66044 66346 65804 64866 64278 64563 65533 66455 66743 66291 65242 63848 62630 62192 62605 63329 64008 64950 66492
55278 66492 68271 69535 69955 69706 68967 67875 66841 66416 66727 67313 67613 67467 67177 67137 67378 67393 66668 65453
55260 65453 64730 65139 66162 66709 66387 65851 65998 67036 68351 69065 68762 67797 66872 66309 65936 65724 66068 67158
55242 67158 68384 68880 68548 68143 68322 68954 69386 69108 68028 66379 64605 63259 62802 63323 64373 65233 65486
$$ packed form
55370F8821k60j051r04o05j084j716j367l18K05o9l94m42n00n15j92J73J56J85
55352F0123R19J839J811R00K76L45L64lj82Nj14p77j231r85n27k96QN39O99J16
55332F3829o04p77o23o34o48k87K09L43K27L51P31Q71N15p1n28p66q91r53q66
55313E9428n09K8M05L98J91N3j33o38j214j187l11Q73J707K031K018J746J158
55296F6044L02n42r38n88K85R70R22K88m52j049j394j218m38M13P24O79R42J542
55278F6492J779J264M20k49p39j092j034m25L11N86L00j46k90m0K41J5p25j215
55260F5453p23M09J023N47l22n36J47J038J315P14l03r65r25n63l73k12L44J090
55242F7158J226M96l32m05J79O32M32k78j080j649j774j346m57N21J050Q60K53
$$ plain form
55225 65486 65359 65408 65925 66757 67610 68273 68599 68522 68134 67586 67025 66785 67340 68619 69596 69255 67925 66961 67020
55206 67020 67382 67217 66716 66521 66740 67122 67640 68275 68668 68682 68950 70123 71780 72811 72792 72296 71887 71471 70832
55187 70832 70257 70318 71261 72741 74037 74503 73954 72683 71131 69744 69085 69619 71080 72440 72877 72524 72015
55170 72015 71679 71531 71610 71785 71617 70996 70562 70894 71600 71935 72008 72531 73520 74199 74168 73753 73088 71853 70309
55151 70309 69620 70496 72149 73209 73230 72739 72238 71851 71677 71812 72052 72072 71922 71955 72240 72404 72119 71438 70602
55132 70602 69788 69165 68982 69362 70022 70352 69918 68913 68093 68130 69022 70155 70916 71181 71248 71469 71958 72536 72928
55113 72928 73031 72974 72820 72370 71423 70171 69111 68544 68355 68280 68197 68164 68404 69245 70833 72822 74523 75495 75856
55094 75856 76028 76377 77086 78080 78962 79291 79136 79181 80044 81573 82971 83540 83188 82362 81710 81728 82449 83298 83428
$$ packed form
55225F5486j27M9N17Q32Q53O63L26p7l88n48n61k40N55J279R77l41j330r64N9
55206F7020L62j65n01j95K19L82N18O35L93J4K68J173J657J031j9m96m09m16o39
55187G0832n75O1R43J480J296M66n49j271j552j387o59N34J461J360M37l53n09
55170G2015l36j48P9J75j68o21m34L32P06L35P3N23R89O79l1m15o65j235j544
55151G0309o89Q76J653J060K1m91n01l87j74J35K40K0j50L3K85J64k85o81q36
55132G0602q14o23j83L80O60L30m34j005q20L7Q92J133P61K65O7K21M89N78L92
55113G2928J03n7j54m50r47j252j060n67j89p5q3l3K40Q41J588J989J701R72L61
55094G5856J72L49P09R94Q82L29j55M5Q63J529J398N69l52q26o52J8P21Q49J30
$$ plain form
55075 83428 82409 80644 79047 78262 78242 78566 78996 79605 80441 81329 82032 82428 82455 82059 81360 80685 80284 80075 79811
55056 79811 79456 79232 79350 79793 80281 80441 80074 79343 78608 78076 77795 77897 78476 79106 79023 78087 77149 76980 77242
55037 77242 77052 76288 75613 75357 75176 74899 74924 75491 76209 76696 77186 78029 79026 79722 80113 80573 81236 81896 82414
55018 82414 82820 83048 82887 82226 81060 79354 77191 75097 73870 73971 75216 77093 79229 81460 83619 85406
55002 85406 86495 86781 86533 86211 86015 85704 84996 84129 83783 84395 85671 86868 87444 87415 87183 87150 87425 87776 87882
54983 87882 87737 87773 88489 89954 91752 93443 94841 95816 96084 95510 94453 93484 92741 91888 90773 89791 89437
54966 89437 89779 90572 91563 92432 92708 92173 91257 90703 90910 91819 93183 94587 95416 95385 95068 95296 95974 96155 95482
54947 95482 94870 95316 96528 97386 97410 97110 96961 96760 96174 95380 94841 94743 94983 95526 96405 97307 97425 96023 93277
$$ packed form
55075H3428j019j765j597p85k0L24M30O09Q36Q88P03L96K7l96o99o75m01k09k64
55056G9811l55k24J18M43M88J60l67p31p35n32k81J02N79O30q3r36r38j69K62
55037G7242j90p64o75k56j81k77K5N67P18M87M90Q43R97O96L91M60O63O60N18
55018H2414M06K28j61o61j166j706k163k094j227J01J245J877K136K231K159J787
55002H5406J089K86k48l22j96l11p08q67l46O12J276J197N76k9k32l3K75L51J06
54983H7882j45L6P16J465J798J691J398R75K68n74j057r69p43q53j115r82l54
54966H9437L42P93R91Q69K76n35r16n54K07R09J364J404Q29l1l17K28O78J81o73
54947I5482o12M46J212Q58K4l00j49k01n86p94n39r8K40N43Q79R02J18j402k746
$$ plain form
54928 93277 90434 88874 88937 89883 91027 92578 95091 98435 101855 104987 108236 112035 116262 120710 125692
54913 125692 131677 138527 145596 152556 159591 166641 172804 176820 178063 176838 173764 169074 162641 154681
54899 154681 146318 139138 134037 130567 127551 124215 120545 116836 113396 110654 108995 108197 107418 106060 104399
54884 104399 103091 102364 101984 101788 101896 102581 104220 107103 110914 114671 117635 120055 122559 125227 128011
54869 128011 131779 137796 145914 154200 160835 165639 169307 171924 172946 172073 169344 164745 158470 151372
54855 151372 144442 137981 131830 126222 121623 117899 114425 111127 108624 107067 105539 103045 99650 96216
54841 96216 93426 91436 90145 89307 88489 87390 86245 85570 85478 85497 85215 84890 85139 86076 87039 87396 87404 87889 89114
54822 89114 90381 90896 90637 90148 89872 90102 91160 93061 95097 96316 96404 95716 94607 93253 92036 91391 91161
$$ packed form
54928I3277k843j560O3R46J144J551K513L344L420L132L249L799M227M448M982
54913A25692N985O850P069O960P035P050O163M016J243j225l074m690o433p960
54899A54681q363p180n101l470l016l336l670l709l440k742j659p98p79j358j661
54884A04399j308p27l80j96J08O85J639K883L811L757K964K420K504K668K784
54869A28011L768O017Q118Q286O635M804L668K617J022q73k729m599o275p098
54855A51372o930o461o151n608m599l724l474l298k503j557j528k494l395l434
54841I6216k790j990j291q38q18j099j145o75r2J9k82l25K49R37R63L57QM85J225
54822H9114J267N15k59m89k76K30J058J901K036J219Q8o88j109j354j217o45k30
$$ plain form
54805 91161 90749 90138 90151 91332 93070 94307 94704 94596 94158 93287 92215 91640 91996 92922 93650 93793 93659 93860
54787 93860 94708 95956 97081 97768 98069 98150 98103 98017 98017 98119 98224 98423 99164 100844 103266 105674 107401 108470
54769 108470 109591 111625 115023 119551 124429 128764 132048 134484 136879 140107 144641 150548 157708 165666
54755 165666 173285 179115 182452 183824 184137 183560 181554 177684 171950 164585 156110 147518 139828 133390 128025
54740 128025 123777 120893 119038 117284 115204 113398 112524 112270 111771 110683 109352 108146 107152 106504 106501 107210
54724 107210 108131 108501 108089 107741 108917 112357 117293 122378 127350 133214 140614 148689 155993 161991 167005
54709 167005 171022 173335 173421 171541 168250 163782 158194 151865 145489 139628 134440 129878 125960 122736 120076
54694 120076 117667 115314 113060 110969 109033 107473 106745 106869 106968 106033 104126 102295 101336 101134 101233 101331 101099
$$ packed form
54805I1161m12o11J3J181J738J237L97j08m38q71j072n75L56R26P28J43j34K01
54787I3860Q48J248J125O87L01Q1m7q6%J02J05J99P41J680K422K408J727J069
54769A08470J121K034L398M528M878M335L284K436K395L228M534N907P160P958
54755A65666P619N830L337J372L13n77k006l870n734p365q475q592p690o438n365
54740A28025m248k884j855j754k080j806q74k54m99j088j331j206r94o48lP09
54724A07210R21L70m12l48J176L440M936N085M972N864P400Q075P304N998N014
54709A67005M017K313Q6j880l291m468n588o329o376n861n188m562l918l224k660
54694A20076k409k353k254k091j936j560p28J24R9r35j907j831r59k02R9R8k32
$$ plain form
54677 101099 100267 99252 99002 99731 100416 100089 99071 98308 97956 97436 96548 95696 95166 94931 95137 96033 97288 98017
54659 98017 97694 96632 95500 94815 94886 95718 96819 97518 97671 97640 97555 97057 96020 95030 94762 95133 95416 95081 94254
54640 94254 93446 93063 93262 94119 95686 97732 99482 99997 99047 97415 96159 95694 95757 95973 96093 95917 95459 95065
54622 95065 94976 94834 94088 92846 91917 91977 93013 94549 96008 96889 97046 96861 96767 96631 96086 95439 95601 96881
54604 96881 98467 99420 99703 99823 99910 99683 99115 98605 98533 98966 99733 100543 101024 100932 100309 99352 98253 97278 96837
54585 96837 97152 97891 98359 98216 97852 97955 98747 99752 100391 100626 100836 101130 101214 101051 101207 102125 103345 103928 103541
54566 103541 102619 101565 100383 99147 98271 98114 98727 100099 102169 104401 105826 105842 104741 103269 102022 101411
54550 101411 101696 102696 103814 104689 105547 106608 107532 107884 107862 108074 108793 109887 111335 113306 115684 117963
$$ packed form
54677A01099q32j015k50P29O85l27j018p63l52n20q88q52n30k35K06Q96J255P29
54659I8017l23j062j132o85P1Q32J101O99J53l1q5m98j037r90k68L71K83l35q27
54640I4254q08l83J99Q57J567K046J750N15r50j632j256m65O3K16J20j76m58l94
54622I5065q9j42p46j242r29O0J036J536J459Q81J57j85r4j36n45o47J62J280
54604I6881J586R53K83J20Q7k27n68n10p2M33P67Q10M81r2o23r57j099r75m41
54585I6837L15P39M68j43l64J03P92J005O39K35K10K94Q4j63J56R18J220N83l87
54566A03541r22j054j182j236q76j57O13J372K070K232J425J6j101j472j247o11
54550A01411K85J000J118Q75Q58J061R24L52k2K12P19J094J448J971K378K279
$$ plain form
54534 117963 119683 120741 121176 120948 120035 118675 117370 116577 116310 116049 115284 114185 113479 113563 113997 114067 113605 113058
54516 113058 112931 113331 113797 113484 111875 109618 108274 108832 110680 112407 113304 113634 113731 113577 113244 113140 113530
54499 113530 114100 114198 113365 111684 109857 108839 109090 110192 111420 112554 113800 115080 115970 116395 116873 117837
54483 117837 119057 119945 120172 119808 119100 118299 117642 117325 117527 118333 119476 120317 120447 120284 120712 122065 123790
54466 123790 125124 125775 125916 125931 126328 127481 129198 130784 131748 132187 132337 132139 131548 130960 130908 131431 132052 132368
54448 132368 132387 132317 132202 131797 130746 128947 126797 124991 124044 124057 124835 125934 126625 126297 125111 123878 123072
54431 123072 122300 121092 119826 119338 119794 120422 120380 119480 118084 116695 115796 115714 116478 117866 119543 121026 121754
54414 121754 121595 121234 121590 122746 123860 124280 124336 124765 125764 126960 128106 129281 130431 131100 130831 129706 128399
$$ packed form
54534A17963J720J058M35k28r13j360j305p93k67k61p65j099p06Q4M34P0m62n47
54516A13058j27M00M66l13j609k257j344N58J848J727Q97L30R7j54l33j04L90
54499A13530N70R8q33j681j827j018K51J102J228J134J246J280Q90M25M78R64
54483A17837J220Q88K27l64p08q01o57l17K02Q06J143Q41J30j63M28J353J725
54466A23790J334O51J41J5L97J153J717J586R64M39J50j98n91n88n2N23O21L16
54448A32368J9p0j15m05j051j799k150j806r47J3P78J099O91l28j186j233q06
54431A23072p72j208j266m88M56O28m2r00j396j389q99q2P64J388J677J483P28
54414A21754j59l61L56J156J114M20N6M29R99J196J146J175J150O69k69j125j307
$$ plain form
54397 128399 127717 128125 129616 131900 134568 137073 138788 139367 139027 138217 137031 135278 133210 131658 131071 130813
54381 130813 129993 128863 128692 130108 132172 133435 133507 133117 132939 132949 132880 132760 132791 133020 133349 133707 134061 134455 135053
54362 135053 135886 136399 135700 133646 131428 130496 130901 131244 130405 128841 127836 127888 128312 128288 127778 127332 127354 127709
54344 127709 127884 127430 126347 125065 123977 123113 122418 122163 122670 123634 124187 123827 122912 122063 121485 121270 121913 123806
54326 123806 126286 127911 127964 127227 126888 127042 126748 125375 123437 122077 122067 123386 125417 127351 128681 129551
54310 129551 130549 131948 133302 134020 134188 134482 135295 136355 137330 138413 139951 141780 143285 143958 143563 141901
54294 141901 138977 135417 132226 129912 128195 126738 125680 125141 124675 123737 122465 121481 121051 120954 121073 121556
54278 121556 122262 122593 122124 121095 120088 119501 119442 119817 120264 120357 120061 119806 119917 120249 120591 121130 122169 123573
$$ packed form
54397A28399o82M08J491K284K668K505J715N79l40q10j186j753k068j552n87k58
54381A30813q20j130j71J416K064J263P2l90j78J0o9j20L1K29L29L58L54L94N98
54362A35053Q33N13o99k054k218r32M05L43q39j564j005N2M24k4n10m46K2L55
54344A27709J75m54j083j282j088q64o95k55N07R64N53l60r15q49n78k15O43J893
54326A23806K480J625N3p37l39J54k94j373j938j360j0J319K031J934J330Q70
54310A29551R98J399J354P18J68K94Q13J060R75J083J538J829J505O73l95j662
54294A41901k924l560l191k314j717j457j058n39m66r38j272r84m30r7J19M83
54278A21556P06L31m69j029j007n87n9L75M47R3k96k55J11L32L42N39J039J404
$$ plain form
54260 123573 124881 125896 126890 128273 130205 132425 134253 134928 134246 132798 131382 130310 129498 128963 128769 128574
54244 128574 127744 126047 123945 122155 121190 121314 122507 124336 126147 127535 128409 128588 127745 125951 123866 122148
54228 122148 120924 120084 119752 120021 120443 120227 118973 116965 114808 113088 112253 112433 113215 113944 114331 114563 114719
54211 114719 114474 113604 112535 112054 112527 113713 115241 116908 118544 119970 121298 122877 124618 125667 125218
54196 125218 123555 121833 120818 120292 119813 119483 119582 119864 119718 118942 117926 117137 116778 116890 117414 118141 118897 119743
54178 119743 120675 121281 121164 120656 120529 120849 120713 119495 117834 116963 117411 118803 120623 122558 124267 125401
54162 125401 125899 125844 125056 123311 121020 119135 118164 117712 117199 116613 116211 115883 115380 114934 115055 115697 116246 116520
54144 116520 117193 118799 120728 121785 121608 121002 120866 121333 122044 122723 123149 123038 122411 121801 121668 121809 121795 121802 122397
$$ packed form
54260A23573J308J015R94J383J932K220J828O75o82j448j416j072q12n35j94j95
54244A28574q30j697k102j790r65J24J193J829J811J388Q74J79q43j794k085j718
54228A22148j224q40l32K69M22k16j254k008k157j720q35J80P82P29L87K32J56
54211A14719k45q70j069m81M73J186J528J667J636J426J328J579J741J049m49
54196A25218j663j722j015n26m79l30R9K82j46p76j016p89l59J12N24P27P56Q46
54178A19743R32O06j17n08j27L20j36j218j661q71M48J392J820J935J709J134
54162A25401M98n5p88j745k291j885r71m52n13n86m02l28n03m46J21O42N49K74
54144A16520O73J606J929J057j77o06j36M67P11O79M26j11o27o10j33J41j4PN95
$$ plain form
54125 122397 123524 124346 124263 123606 123022 122596 121905 120696 119176 117794 116984 116987 117732 118942 120452 122280 124276
54108 124276 125924 126737 126767 126519 126413 126395 126047 125070 123724 122656 122130 121646 120734 119900 120116 121329 122283 122129
54090 122129 121492 121399 121800 121909 121546 121311 121584 122171 122894 123796 124687 125143 125161 125253 125677 126023 125827 125213 124696 124589
54070 124589 124785 124948 124822 124526 124496 124936 125444 125522 125329 125484 126146 126785 126889 126419 125493 124212 122953 122305 122407
54051 122407 122753 122879 122871 123030 123536 124635 126562 128905 130587 131003 130800 131013 131858 132895 133975 135227 136351
54034 136351 136767 136573 136598 137286 138085 138273 137947 137856 138554 140057 142096 144317 146250 147413 147613 147102 146354 145700
54016 145700 145158 144570 143803 142750 141247 139239 137073 135375 134481 134119 133777 133192 132328 131128 129664 128440
54000 128440 128181 129219 131260 133713 136052 137852 138825 138983 138630 138066 137315 136252 134940 133829 133565 134440
$$ packed form
54125A22397J127Q22q3o57n84m26o91j209j520j382q10LP45J210J510J828J996
54108A24276J648Q13L0k48j06j8l48r77j346j068n26m84r12q34K16J213R54j54
54090A22129o37r3M01J09l63k35K73N87P23R02Q91M56J8R2M24L46j96o14n17j07
54070A24589J96J63j26k96l0M40N08P8j93J55O62O39J04m70r26j281j259o48J02
54051A22407L46J26qJ59N06J099J927K343J682M16k03K13Q45J037J080J252J124
54034A36351M16j94K5O88P99J88l26r1O98J503K039K221J933J163K00n11p48o54
54016A45700n42n88p67j053j503k008k166j698q94l62l42n85q64j200j464j224
54000A28440k59J038K041K453K339J800R73J58l53n64p51j063j312j111k64Q75
$$ plain form
53984 134440 136024 137515 138577 139607 140985 142359 143047 142977 142698 142472 141902 140732 139565 139380 140491 142298
53968 142298 144004 145370 146837 149074 152348 156222 160001 163629 167986 174038 181798 190498 199725 209848
53954 209848 220923 231508 239117 242053 240511 235831 229071 220658 211142 201649 193329 186630 181335 177136
53940 177136 173987 172117 171927 173765 177450 182055 186447 190135 193363 196389 198974 200698 201433 201244 200113
53925 200113 198164 196046 194582 193937 193470 192599 191460 190444 189393 187799 185721 183942 182961 182308 181196
53910 181196 179583 178102 177106 176277 175212 173953 172761 171724 170814 170075 169458 168665 167399 165680 163736 161704
53894 161704 159673 157913 156752 156207 155897 155356 154313 152745 150849 148982 147489 146553 146275 146784 148060 149693
53878 149693 151011 151565 151345 150557 149425 148301 147766 148305 149807 151552 152806 153384 153585 153633 153392 152659 151576
$$ packed form
53984A34440J584J491J062J030J378J374O88p0k79k26n70j170j167j85J111J807
53968A42298J706J366J467K237L274L874L779L628M357O052P760Q700R227J0123
53954B09848J1075J0585P609K936j542m680o760q413r516r493q320o699n295m199
53940A77136l149j870j90J838L685M605M392L688L228L026K585J724P35j89j131
53925B00113j949k118j464o45m67q71j139j016j051j594k078j779r81o53j112
53910A81196j613j481r96q29j065j259j192j037r10p39o17p93j266j719j944k032
53894A61704k031j760j161n45l10n41j043j568j896j867j493r36k78N09J276J633
53878A49693J318N54k20p88j132j124n35N39J502J745J254N78K01M8k41p33j083
$$ plain form
53861 151576 150549 149892 149758 150307 151538 152927 153623 153292 152505 152027 151906 151532 150457 148864 147289 146095
53845 146095 145268 144547 143761 143096 142859 142931 142720 141881 140828 140211 140157 140459 141236 142749 144575 145719 145887 146086
53827 146086 147480 149930 152131 153073 152954 152669 152766 153113 153386 153582 153937 154499 155059 155577 156356 157511 158560
53810 158560 158980 159092 159813 161460 163301 164578 165459 166585 168045 169360 170301 171144 172150 173303 174703 176803
53794 176803 180001 184252 189327 195256 202307 210652 220343 231562 244591 259374 275211 290764 304128
53781 304128 312932 315072 310038 299554 286430 272550 258219 243406 229019 216499 206528 198614
53769 198614 191815 185470 179439 174142 170358 168498 168043 168032 168079 168435 169110 169526 169226 168417 167547 166816 166314
53752 166314 166184 166291 166199 165856 165946 167024 168614 169637 169608 168969 168394 168211 168438 168907 169343 169650 170123 171083 172394
$$ packed form
53861A51576j027o57j34N49J231J389O96l31p87m78j21l74j075j593j575j194
53845A46095q27p21p86o65k37P2k11q39j053o17n4L02P77J513J826J144J68J99
53827A46086J394K450K201R42j19k85R7L47K73J96L55N62N60N18P79J155J049
53810A58560M20J12P21J647J841J277Q81J126J460J315R41Q43J006J153J400K100
53794A76803L198M251N075N929P051Q345R691J1219J3029J4783J5837J5553J3364
53781C04128Q804K140n034j0484j3124j3880j4331j4813j4387j2520r971p914
53769A98614o799o345o031n297l784j860m55j1M7L56O75M16l00q09q70p31n02
53752A66314j30J07r2l43R0J078J590J023k9o39n75j83K27M69M36L07M73R60J311
$$ plain form
53733 172394 173684 174904 176319 177989 179690 181359 183201 185330 187659 190199 193057 196078 198929 201696
53719 201696 204947 208921 212960 216064 217858 218861 220023 222192 225741 230372 235367 240317 245558 251668
53705 251668 258601 265577 271862 277411 282612 287532 291663 294494 296172 297387 298592 299597 299962 299522 298257
53690 298257 296003 292791 289334 286568 284579 282453 279437 275814 272418 269732 267836 266825 266674 266825 266486
53675 266486 265426 264082 262868 261730 260497 259302 258484 258234 258478 258950 259272 259113 258329 256943 255099 253181
53659 253181 251777 251108 250555 249216 247046 245008 243870 243396 243046 242959 243594 244765 245795 246578 247702 249339
53643 249339 250764 251341 251485 252179 253875 256285 258883 261156 262656 263398 264107 265545 267623 269625 271275
53628 271275 273044 275415 278405 281886 285795 289774 293180 295866 298527 301862 305750 309664 313559 317773
$$ packed form
53733A72394J290J220J415J670J701J669J842K129K329K540K858L021K851K767
53719B01696L251L974M039L104J794J003J162K169L549M631M995M950N241O110
53705B51668O933O976O285N549N201M920M131K831J678J215J205J005L65m40j265
53690B98257k254l212l457k766j989k126l016l623l396k686j896j011j51J51l39
53675B66486j060j344j214j138j233j195q18k50K44M72L22j59p84j386j844j918
53659B53181j404o69n53j339k170k038j138m74l50q7O35J171J030P83J124J637
53643B49339J425N77J44O94J696K410K598K273J500P42P09J438K078K002J650
53628B71275J769K371K990L481L909L979L406K686K661L335L888L914L895M214
$$ plain form
53614 317773 322291 326767 331221 336088 341438 346638 350979 354254 356559 357941 358586 359015 359686 360476 360899
53599 360899 360838 360738 361042 361670 362201 362431 362541 362762 363040 363054 362455 361071 359031 356745 354650 352845 351039
53582 351039 348976 346773 344721 342937 341428 340328 339655 338920 337439 335123 332555 330183 327922 325700 323882
53567 323882 322771 322145 321733 321814 322869 324844 327194 329433 331255 332402 332980 333694 335231 337480 339823 341986
53551 341986 344048 345829 347055 348084 349692 352055 354701 357580 361366 366386 372065 377874 384165 391509
53537 391509 399821 408710 418173 428293 438686 449043 459946 472413 486724 502295 518565 535375
53525 535375 552551 569886 587688 606703 627158 648300 669189 689619 709980 730533 751195
53514 751195 771955 793069 814758 836914 859304 882014 905429 929675 954261 978608 1002822
$$ packed form
53614C17773M518M476M454M867N350N200M341L275K305J382O45M29O71P90M23
53599C60899o1j00L04O28N31K30J10K21K78J4n99j384k040k286k095j805j806
53582C51039k063k203k052j784j509j100o73p35j481k316k568k372k261k222j818
53567C23882j111o26m12Q1J055J975K350K239J822J147N78P14J537K249K343K163
53551C41986K062J781J226J029J608K363K646K879L786N020N679N809O291P344
53537C91509Q312Q889R463J0120J0393J0357J0903J2467J4311J5571J6270J6810
53525E35375J7176J7335J7802J9015K0455K1142K0889K0430K0361K0553K0662
53514G51195K0760K1114K1689K2156K2390K2710K3415K4246K4586K4347K4214
$$ plain form
53503 1002822 1027531 1052887 1078217 1102938 1127398 1152298 1177480 1201858 1224595 1245966 1266878
53492 1266878 1287807 1308413 1328127 1346928 1365411 1384019 1402431 1420019 1436872 1453887 1471616
53481 1471616 1489454 1506282 1521521 1535089 1546667 1555717 1562181 1566581 1569180 1569357 1566015 1558524 1547331
53468 1547331 1533822 1519448 1504750 1489322 1472890 1456086 1439662 1423238 1405469 1385500 1363713
53457 1363713 1340960 1317650 1293799 1269534 1245234 1221434 1198703 1177272 1156642 1135928 1114843
53446 1114843 1094136 1074970 1058167 1044095 1032811 1023921 1016611 1010195 1004627 1000258 997275 995523 994798
53433 994798 995187 997163 1001338 1007935 1016505 1026362 1037296 1049578 1063289 1078114 1093916 1111086 1130026
53420 1130026 1150587 1172345 1195213 1219466 1245283 1272507 1300876 1330373 1361389 1394494 1429904
$$ packed form
53503A002822K4709K5356K5330K4721K4460K4900K5182K4378K2737K1371K0912
53492A266878K0929K0606J9714J8801J8483J8608J8412J7588J6853J7015J7729
53481A471616J7838J6828J5239J3568J1578R050O464M400K599J77l342p491j1193
53468A547331j3509j4374j4698j5428j6432j6804j6424j6424j7769j9969k1787
53457A363713k2753k3310k3851k4265k4300k3800k2731k1431k0630k0714k1085
53446A114843k0707j9166j6803j4072j1284q890p310o416n568m369k983j752p25
53433I94798L89J976M175O597Q570R857J0934J2282J3711J4825J5802J7170J8940
53420A130026K0561K1758K2868K4253K5817K7224K8369K9497L1016L3105L5410
$$ plain form
53409 1429904 1467322 1506554 1548151 1592917 1640852 1691224 1743786 1799172 1857612 1917922 1978444
53398 1978444 2038620 2099070 2160395 2222581 2285424 2348822 2412446 2475521 2537081 2596268 2652451
53387 2652451 2705350 2755036 2801676 2845409 2886515 2925296 2961430 2993759 3021184 3043652 3061897
53376 3061897 3076427 3087108 3093369 3094251 3088455 3074973 3053548 3024080 2985994 2939144 2885280 2827555
53364 2827555 2768201 2707361 2644444 2579856 2514898 2450685 2387772 2326502 2267085 2209524 2153841
53353 2153841 2100130 2048084 1996807 1945524 1894213 1843197 1792518 1742291 1693395 1647063 1603702
53342 1603702 1562728 1523651 1486844 1452993 1422222 1394109 1368359 1345081 1324419 1306100 1289418
53331 1289418 1273564 1257967 1242347 1226587 1210674 1194786 1179283 1164507 1150639 1137833 1126379
$$ packed form
53409A429904L7418L9232M1597M4766M7935N0372N2562N5386N8440O0310O0522
53398A978444O0176O0450O1325O2186O2843O3398O3624O3075O1560N9187N6183
53387B652451N2899M9686M6640M3733M1106L8781L6134L2329K7425K2468J8245
53376C061897J4530J0681O261Q82n796j3482k1425k9468l8086m6850n3864n7725
53364B827555n9354o0840o2917o4588o4958o4213o2913o1270n9417n7561n5683
53353B153841n3711n2046n1277n1283n1311n1016n0679n0227m8896m6332m3361
53342A603702m0974l9077l6807l3851l0771k8113k5750k3278k0662j8319j6682
53331A289418j5854j5597j5620j5760j5913j5888j5503j4776j3868j2806j1454
$$ plain form
53320 1126379 1116665 1108984 1103431 1099854 1097808 1096687 1096079 1096088 1097269 1100251 1105345 1112384 1120881 1130486 1141342
53305 1141342 1153912 1168451 1184823 1202849 1222573 1244015 1266949 1291171 1316901 1344559 1374050
53294 1374050 1404497 1434815 1464578 1494151 1523907 1553294 1580900 1605590 1627429 1647259 1665527
53283 1665527 1681960 1696238 1708281 1717665 1723424 1725040 1723223 1719095 1712879 1704065 1692630 1679182 1663691
53270 1663691 1644943 1621823 1594760 1565413 1535168 1504384 1472901 1440692 1407881 1374530 1340677
53259 1340677 1306452 1272023 1237579 1203518 1170545 1139369 1110222 1082754 1056331 1030301 1004028
53248 1004028 976965 948983 920452 891788 863050 834286 806076 779208 753804 729388 706084
53237 706084 685151 667785 653770 641841 631123 621562 613060 604923 596361 587033 576937 566195
$$ packed form
53320A126379r714p681n553l577k046j121o08RJ181K982N094P039Q497R605J0856
53305A141342J2570J4539J6372J8026J9724K1442K2934K4222K5730K7658K9491
53294A374050L0447L0318K9763K9573K9756K9387K7606K4690K1839J9830J8268
53283A665527J6433J4278J2043R384N759J616j817m128o216q814j1435j3448j5491
53270A663691j8748k3120k7063k9347l0245l0784l1483l2209l2811l3351l3853
53259A340677l4225l4429l4444l4061l2973l1176k9147k7468k6423k6030k6273
53248A004028k7063k7982k8531k8664k8738k8764k8210k6868k5404k4416k3304
53237G06084k0933j7366j4015j1929j0718r561q502q137q562r328j0096j0742
$$ plain form
53225 566195 555060 543701 531792 518738 504513 489886 475642 461974 448906 436829 426171
53214 426171 416788 408144 399936 392186 384877 377859 371077 364518 357999 351248 344187 336943 329650 322513
53200 322513 315911 310070 304694 299293 293951 289412 286187 283811 281249 278016 274743 272496 271560 271040 269810
53185 269810 267776 265851 264670 263747 262216 260047 258125 257276 257633 258821 260299 261468 261903 261665 261136 260513
53169 260513 259781 259170 259229 260160 261419 262185 262056 261112 259583 257791 256219 255270 254922 254784 254525 254108 253625 253110
53151 253110 252602 252281 252359 252779 253101 252841 251949 250799 249626 248187 246213 243992 242207 241240 240923 240880 240806 240404
53133 240404 239575 238709 238387 238621 238791 238514 238107 237946 237849 237473 236917 236395 235661 234354 232770 231657 231304 231368
53115 231368 231571 231917 232144 231605 230017 227841 225613 223350 221013 219075 218032 217566 216782 215279 213537 212205
$$ packed form
53225E66195j1135j1359j1909j3054j4225j4627j4244j3668j3068j2077j0658
53214D26171r383q644q208p750p309p018o782o559o519o751p061p244p293p137
53200C22513o602n841n376n401n342m539l225k376k562l233l273k247r36n20j230
53185B69810k034j925j181r23j531k169j922q49L57J188J478J169M35k38n29o23
53169B60513p32o11N9R31J259P66j29r44j529j792j572r49l48j38k59m17m83n15
53151B53110n08l21P8M20L22k60q92j150j173j439j974k221j785r67l17m3p4m02
53133B40404q29q66l22K34J70k77m07j61r7l76n56n22p34j307j584j113l53O4
53115B31368K03L46K27n39j588k176k228k263k337j938j043m66p84j503j742j332
$$ plain form
53099 212205 211482 211271 211469 211805 211717 210781 209156 207319 205453 203438 201424 200014 199644 200017 200422 200550 200736
53082 200736 201407 202486 203475 204036 204404 205223 206953 209379 211684 213048 213210 212481 211374 210344 209677 209392
53066 209392 209193 208745 208002 207154 206293 205342 204294 203258 202327 201658 201654 202635 204254 205727 206807 208051 209840
53049 209840 211657 212758 213095 212993 212348 210947 209375 208709 209170 209857 210009 209794 209558 209042 207960 206828 206472
53032 206472 206889 207265 207092 206767 206926 207602 208268 208507 208402 208287 208305 208320 208285 208479 209127 209832 209761 208554 206869
53013 206869 205824 206008 207137 208470 209337 209457 209018 208529 208434 208789 209208 209120 208210 206834 205949 206257 207374 208136
52995 208136 207788 206550 205000 203476 202363 202353 203798 206011 207826 208765 209177 209363 209167 208545 207949 207852 208195
52978 208195 208577 208820 209108 209724 210774 212071 213166 213568 213097 212069 211146 211019 212044 214016 216267 218097
$$ packed form
53099B12205p23k11J98L36q8r36j625j837j866k015k014j410l70L73M05J28J86
53082B00736O71J079R89N61L68Q19J730K426K305J364J62p29j107j030o67k85
53066B09392j99m48p43q48q61r51j048j036r31o69mR81J619J473J080J244J789
53049B09840J817J101L37j02o45j401j572o66M61O87J52k15k36n16j082j132l56
53032B06472M17L76j73l25J59O76O66K39j05j15J8J5l5J94O48P05p1j207j685
53013B06869j045J84J129J333Q67J20m39m89r5L55M19q8r10j376q85L08J117P62
52995B08136l48j238j550j524j113j0J445K213J815R39M12J86j96o22n96r7L43
52978B08195L82K43K88O16J050J297J095M02m71j028r23j27J025J972K251J830
$$ plain form
52962 218097 219231 219905 220642 221916 223812 225886 227522 228498 229005 229036 228199 226408 224378 222971 222279 221788
52946 221788 221192 220451 219249 217173 214547 212404 211358 211015 210733 210460 210527 211052 211891 212823 213453 213277 212180
52929 212180 210596 208902 206985 204739 202618 201243 200677 200473 200273 199969 199514 199013 198833 199134 199387 198841 197457
52912 197457 195920 194794 194096 193731 193800 194276 194776 194947 194894 195052 195764 197030 198488 199589 199993 199848 199480 198856
52894 198856 197673 196010 194512 193781 193868 194474 195303 196047 196409 196454 196696 197542 198816 200094 201251 202339 203121
52877 203121 203162 202375 201132 199888 198966 198634 198947 199469 199570 199227 199184 200001 201192 201702 201167 200377 200384 201413 202829
52858 202829 204024 204987 205909 206456 205790 203454 200013 196615 193959 191822 189582 187091 184971 184053 184422 185059
52842 185059 184723 183352 182281 182700 184142 185014 184503 183309 182404 181768 180761 179193 177487 176101 175243 174906
$$ packed form
52962B18097J134O74P37J274J896K074J636R76N07L1q37j791k030j407o92m91
52946B21788n96p41j202k076k626k143j046l43k82k73O7N25Q39R32O30j76j097
52929B12180j584j694j917k246k121j375n66k04k00l04m55n01j80L01K53n46j384
52912A97457j537j126o98l65O9M76N00J71n3J58P12J266J458J101M04j45l68o24
52894A98856j183j663j498p31Q7O06Q29P44L62M5K42Q46J274J278J157J088P82
52877B03121M1p87j243j244r22l32L13N22J01l43m3Q17J191N10n35p90PJ029J416
52858B02829J195R63R22N47o66k336l441l398k656k137k240k491k120r18L69O37
52842A85059l36j371j071M19J442Q72n11j194r05o36j007j568j706j386q58l37
$$ plain form
52826 174906 174755 174230 173246 172511 172637 173216 173430 173317 173561 174139 174173 173344 172527 172614 173519 174843 176688 179120
52808 179120 181489 183150 184482 186419 189261 192580 195895 198554 199334 197355 193486 189862 187705 186365
52794 186365 184728 182674 180761 179268 178204 177753 178091 178950 179773 180079 179501 177944 176004 174771 174723 175222
52778 175222 175537 175930 177150 179127 180957 182083 182823 183586 184143 183972 183055 182052 181712 182145 182673 182538 181816
52761 181816 181361 181733 182529 183034 183101 182917 182325 181093 179703 179077 179380 179796 179716 179547 179952 180785 181326 181353 181483
52742 181483 182397 184095 185991 187571 188788 189851 190806 191530 192077 192685 193308 193525 193229 193064 193679 194712 195178
52725 195178 194746 194028 193541 193115 192588 192350 192705 193198 193174 192664 192221 192130 192296 192697 193397 194167 194563 194387 193762
52706 193762 192793 191523 190151 188947 187941 186985 186110 185544 185476 185974 186987 188045 188287 187354 186145 186054 187428
$$ packed form
52826A74906j51n25r84p35J26N79K14j13K44N78L4q29q17Q7R05J324J845K432
52808A79120K369J661J332J937K842L319L315K659P80j979l869l624k157j340
52794A86365j637k054j913j493j064m51L38Q59Q23L06n78j557j940j233m8M99
52778A75222L15L93J220J977J830J126P40P63N57j71r17j003l40M33N28j35p22
52761A81816m55L72P96N05O7j84n92j232j390o26L03M16q0j69M05Q33N41K7J30
52742A81483R14J698J896J580J217J063R55P24N47O08O23K17k96j65O15J033M66
52725A95178m32p18m87m26n27k38L55M93k4n10m43r1J66M01P00P70L96j76o25
52706A93762r69j270j372j204j006r56q75n66o8M98J013J058K42r33j209r1J374
$$ plain form
52689 187428 189406 191253 193079 195041 196726 197870 199000 200618 202230 202935 202734 202425 202388 202259 201854 201668
52673 201668 202170 203125 203883 203960 203240 202016 201022 201008 201986 203215 204081 204639 205089 205266 205090 205153 206224 208250
52655 208250 210272 211331 211159 210053 208456 206763 205263 204131 203484 203294 203165 202400 200624 198268 196208
52640 196208 194998 194670 195126 196341 198176 200239 202045 203217 203651 203662 203811 204395 205245 206232 207645 209698
52624 209698 211968 213858 215360 216741 217616 217164 215335 213071 211124 209400 207734 206564 206336 206818 207488
52609 207488 208121 208543 208420 207888 207800 208608 209428 209069 207719 206780 207105 208265 209529 210751 212088 213539 215064
52592 215064 216712 218420 220054 221688 223421 224876 225446 225159 224793 224933 225364 225603 225576 225516 225630 226070 226841
52575 226841 227474 227180 225628 223319 221047 219273 218163 217723 217648 217461 217114 217036 217294 217193 216179 214728 213815
$$ packed form
52689A87428J978J847J826J962J685J144J130J618J612P05k01l09l7j29m05j86
52673B01668N02R55P58P7p20j224r94j4R78J229Q66N58M50J77j76O3J071K026
52655B08250K022J059j72j106j597j693j500j132o47j90j29p65j776k356k060
52640A96208j210l28M56J215J835K063J806J172M34J1J49N84Q50R87J413K053
52624B09698K270J890J502J381Q75m52j829k264j947j724j666j170k28M82O70
52609B07488O33M22j23n32q8Q08Q20l59j350r39L25J160J264J222J337J451J525
52592B15064J648J708J634J634J733J455N70k87l66J40M31K39k7o0J14M40P71
52575B26841O33k94j552k309k272j774j110m40p5j87l47p8K58j01j014j451r13
$$ plain form
52558 213815 213783 214233 214723 215018 214885 214284 213729 213862 214634 215379 215749 216041 216518 216936 216989 216845 216913 217269 217574 217483
52538 217483 217034 216614 216556 216730 216663 216204 215859 216206 217094 217752 217601 216587 214879 212724 210636 209151 208185 207116
52520 207116 205750 204738 204681 205230 205580 205596 205889 206875 208341 210063 212263 215178 218479 221477 223810 225689
52504 225689 227574 229769 232275 234694 236285 236414 235169 233393 231897 230686 229131 226872 224319 222200
52490 222200 220829 219951 219152 218214 217199 216388 216071 216242 216621 217201 218590 221287 224632 227059 227742 227556 227964
52473 227964 229332 230887 232045 232937 233570 233454 232544 231885 232630 234732 237276 239850 242862 246563 250513 254193
52457 254193 257496 260339 262305 263028 262503 260721 257501 253098 248583 245036 242575 240604 238711 236805 234677
52442 234677 232171 229728 228105 227431 227118 226719 226313 225939 225298 224324 223540 223538 224450 226116 228260 230238 231185
$$ packed form
52558B13815l2M50M90K95j33o01n55J33P72P45L70K92M77M18N3j44O8L56L05r1
52538B17483m49m20n8J74o7m59l45L47Q88O58j51j014j708k155k088j485r66j069
52520B07116j366j012n7N49L50J6K93R86J466J722K200K915L301K998K333J879
52504B25689J885K195K506K419J591J29j245j776j496j211j555k259k553k119
52490B22200j371q78p99r38j015q11l17J71L79N80J389K697L345K427O83j86M08
52473B27964J368J555J158Q92O33j16r10o59P45K102K544K574L012L701L950L680
52457B54193L303K843J966P23n25j782l220m403m515l547k461j971j893j906k128
52442B34677k506k443j623o74l13l99m06l74o41r74p84kR12J666K144J978R47
$$ plain form
52425 231185 230899 230277 230397 231431 232813 234173 235667 237660 240537 244625 249838 255515 261098 266864 273599
52410 273599 281596 290325 298910 306378 311495 313025 310527 304738 297059 288819 280994 274184 268590 264106
52396 264106 260514 257641 255463 254222 254244 255418 256995 258181 258800 259141 259347 259366 259354 259693 260600 262090 264225
52379 264225 267012 270137 273308 276834 281338 286807 292513 297999 303580 309592 315728 321515 327061 332813
52365 332813 338862 344867 350504 355616 360010 363487 366100 368244 370470 373255 376802 381011 385801 391432
52351 391432 398256 406198 414920 424510 435520 448123 461779 476049 491246 507822 525581 544026
52339 544026 563095 582948 603299 623592 643703 663887 684209 704609 725375 746809 768445
52328 768445 789286 808843 827278 844511 860094 874207 887864 901523 914217 924673 932703 938731
$$ packed form
52425B31185k86o22J20J034J382J360J494J993K877M088N213N677N583N766O735
52410B73599P997Q729Q585P468N117J530k498n789p679q240p825o810n594m484
52396B64106l592k873k178j241K2J174J577J186O19L41K06J9j2L39R07J490K135
52379B64225K787L125L171L526M504N469N706N486N581O012O136N787N546N752
52365C32813O049O005N637N112M394L477K613K144K226K785L547M209M790N631
52351C91432O824P942Q722R590J1010J2603J3656J4270J5197J6576J7759J8445
52339E44026J9069J9853K0351K0293K0111K0184K0322K0400K0766K1434K1636
52328G68445K0841J9557J8435J7233J5583J4113J3657J3659J2694J0456Q030O028
$$ plain form
52316 938731 942450 942965 940186 935173 929001 921961 914061 905638 897116 888585 879985 871452 863241 855626
52302 855626 849022 843904 840398 838258 837528 838869 842854 849151 856825 865324 874755 885267 896588 908202
52288 908202 919706 930993 942442 954887 968910 983921 998381 1011238 1022941 1034703 1046937
52277 1046937 1058828 1069291 1077891 1084661 1089459 1091976 1092413 1091729 1090832 1089499 1086400 1080368 1071464 1060587
52263 1060587 1048335 1034789 1020314 1005897 992257 979069 965517 951417 937387 924111 912004
52252 912004 901584 893516 887959 884198 881294 878950 877433 876684 875922 874381 872291 870694 870146 869946 869067
52237 869067 867647 866940 867755 869678 872132 875427 880027 885345 890257 894648 899406 904794 909821 913597 916527
52222 916527 919613 923212 927186 931793 937608 944655 952259 959847 967452 975342 983454 991284 998187 1003793
$$ packed form
52316I38731L719N15k779n013o172p040p900q423q522q531q600q533q211p615
52302H55626o604n118l506k140p30J341L985O297P674Q499R431J0512J1321J1614
52288I08202J1504J1287J1449J2445J4023J5011J4460J2857J1703J1762J2234
52277A046937J1891J0463Q600O770M798K517M37o84q97j333l099o032q904j0877
52263A060587j2252j3546j4475j4417j3640j3188j3552j4100j4030j3276j2107
52252I12004j0420q068n557l761k904k344j517p49p62j541k090j597n48k00q79
52237H69067j420p07Q15J923K454L295M600N318M912M391M758N388N027L776K930
52222I16527L086L599L974M607N815P047P604P588P605P890Q112P830O903N606
$$ plain form
52208 1003793 1008214 1011834 1014849 1017185 1018923 1020481 1022199 1024010 1025753 1027508 1029328 1030954 1032165 1033127
52194 1033127 1034003 1034392 1033673 1031794 1029335 1026895 1024850 1023533 1023055 1022938 1022493 1021666 1021064 1021012 1021061 1020586 1019370
52177 1019370 1017411 1014634 1011125 1007297 1003481 999582 995422 991203 987394 984452 982881 983184 985305 988309
52163 988309 991107 993499 996233 1000199 1005899 1013508 1022888 1033349 1043909 1054059 1064108 1074514 1085102
52150 1085102 1095200 1104549 1113839 1124170 1136071 1149096 1162455 1175896 1189810 1204488 1219608 1234673
52138 1234673 1249638 1264731 1279708 1293821 1306658 1318643 1330419 1342028 1353055 1363429 1373630
52127 1373630 1384108 1394835 1405544 1416082 1426367 1436309 1445999 1455740 1465497 1474382 1481094 1484957 1486267
52114 1486267 1485588 1483085 1478789 1473162 1466867 1459973 1451848 1442061 1431130 1420066 1409353 1398760 1388225
$$ packed form
52208A003793M421L620L015K336J738J558J718J811J743J755J820J626J211R62
52194A033127Q76L89p19j879k459k440k045j317m78j17m45q27o02n2M9m75j216
52177A019370j959k777l509l828l816l899m160m219l809k942j571L03K121L004
52163I88309K798K392K734L966N700P609R380J0461J0560J0150J0049J0406J0588
52150A085102J0098R349R290J0331J1901J3025J3359J3441J3914J4678J5120J5065
52138A234673J4965J5093J4977J4113J2837J1985J1776J1609J1027J0374J0201
52127A373630J0478J0727J0709J0538J0285R942R690R741R757Q885O712L863J310
52114A486267o79k503m296n627o295o894q125r787j0931j1064j0713j0593j0535
$$ plain form
52101 1388225 1378564 1370988 1366127 1363885 1364230 1367672 1374656 1384856 1397485 1412111 1428645 1446515 1464492
52088 1464492 1481694 1498433 1515594 1533312 1550599 1566223 1579671 1591333 1602101 1612777 1623560
52077 1623560 1633944 1643269 1651371 1658452 1664302 1668023 1668713 1666235 1661068 1653583 1643770 1631642 1617568
52064 1617568 1602036 1585158 1566605 1545994 1523234 1498421 1471623 1443090 1413653 1384562 1356689
52053 1356689 1330129 1304747 1280840 1258886 1238853 1220327 1203278 1188139 1174905 1162741 1150870
52042 1150870 1139501 1129433 1120911 1113370 1106241 1099586 1093873 1089428 1086262 1084187 1082965 1082453 1082709 1083813
52028 1083813 1085432 1086661 1086487 1084501 1081076 1076712 1071226 1063749 1053659 1041357 1027844 1013666 998704
52015 998704 983133 968001 954287 941575 928242 913070 896195 878360 859791 840284 820162
$$ packed form
52101A388225r661p576m861k242L45L442O984J0200J2629J4626J6534J7870J7977
52088A464492J7202J6739J7161J7718J7287J5624J3448J1662J0768J0676J0783
52077A623560J0384R325Q102P081N850L721O90k478n167p485r813j2128j4074
52064A617568j5532j6878j8553k0611k2760k4813k6798k8533k9437k9091k7873
52053A356689k6560k5382k3907k1954k0033j8526j7049j5139j3234j2164j1871
52042A150870j1369j0068q522p541p129o655n713m445l166k075j222n12K56J104
52028A083813J619J229j74j986l425m364n486p477j0090j2302j3513j4178j4962
52015I98704j5571j5132j3714j2712j3333j5172j6875j7835j8569j9507k0122
$$ plain form
52004 820162 800506 782258 765451 749594 734626 721075 709120 697861 685929 672902 659794
51993 659794 647985 637903 629013 620845 613597 607684 603173 599861 597614 596288 595467 594481 592709 589705
51979 589705 585202 579170 571834 563424 553971 543541 532590 521855 511825 502484 493592 485084 477205
51966 477205 470439 465327 462152 460785 460962 462697 466177 471201 477062 483089 488979 494464 499062 502537
51952 502537 505264 507653 509306 509307 507294 503792 499452 494521 489322 484758 481915 481320 482889 486413 491732
51937 491732 498537 506389 515005 524316 534145 543872 552496 559051 563038 564420 563088 558484 550113 538438
51923 538438 524865 510685 496351 481907 467601 453700 440203 427282 415658 405909 397639 390010
51911 390010 382967 377192 372874 369377 366329 364252 363668 364240 365319 366916 369591 373688 379148 385834 393571
$$ packed form
52004H20162j9656j8248j6807j5857j4968j3551j1955j1259j1932j3027j3108
51993F59794j1809j0082q890q168p248n913m511l312k247j326q21r86j772l004
51979E89705m503o032p336q410r453j0430j0951j0735j0030r341q892q508p879
51966D77205o766n112l175j367J77J735L480N024N861O027N890N485M598L475
51952E02537K727K389J653Jk013l502m340m931n199m564k843n95J569L524N319
51937D91732O805P852Q616R311R829R727Q624O555L987J382j332m604q371j1675
51923E38438j3573j4180j4334j4444j4306j3901j3497j2921j1624r749q270p629
51911C90010p043n775m318l497l048k077n84N72J079J597K675M097N460O686P737
$$ plain form
51896 393571 402017 410843 419885 428798 436775 442968 446912 448228 446244 440605 432141 422565 413250 404734
51882 404734 397325 391569 387852 386056 385917 387491 391017 396474 403320 410569 417185 422752 427834 433421
51868 433421 439909 446789 453268 458774 462887 465312 466199 466125 465481 464242 462595 461478 462093 465064 470395
51853 470395 477970 487692 499165 511558 523647 533706 539649 539983 534842 525749 514253 501086 486725
51840 486725 472198 458881 447587 438167 429929 422224 414714 407412 400640 394802 390049 386193 382977
51827 382977 380395 378661 377879 377869 378348 379166 380199 380996 380742 378781 375237 371016 367179 364337 362537 361566
51811 361566 361291 361842 363552 366648 370851 375370 379432 382801 385621 387780 388686 387757 384939 380545 374853
51796 374853 368196 361379 355519 351226 348197 345746 343514 341518 339797 338357 337334 336848 336774 336911 337275
$$ packed form
51896C93571Q446Q826R042Q913P977O193L944J316j984n639q464r576r315q516
51882D04734p409n756l717j796j39J574L526N457O846P249O616N567N082N587
51868D33421O488O880O479N506M113K425Q87p4o44j239j647j117O15K971N331
51853D70395P575R722J1473J2393J2089J0059N943L34n141r093j1496j3167j4361
51840D86725j4527j3317j1294r420q238p705p510p302o772n838m753l856l216
51827C82977k582j734p82j0M79Q18J033P97k54j961l544m221l837k842j800r71
51811C61566k75N51J710L096M203M519M062L369K820K159R06r29k818m394n692
51796C74853o657o817n860m293l029k451k232j996j721j440j023m86p4J37L64
$$ plain form
51781 337275 337950 338762 339490 340368 341881 343991 345974 347204 347722 347852 347705 347436 347652 349138 352224 356672
51765 356672 362022 367835 373825 380111 387132 394972 402886 409875 415609 420352 423980 425566 424124 419532
51751 419532 412580 404304 395387 386068 376620 367838 360811 355959 352636 350056 348384 348405 350425 354204 359918
51736 359918 368206 378923 390564 401436 410896 419073 426077 432139 438069 444688 451939 459071 465309
51723 465309 469582 469946 464596 453960 441062 429330 420328 413765 408863 405033 401647 398090 394200 390189
51709 390189 386066 381539 376738 372675 370663 371325 374421 379562 386634 395146 403396 409013 410762 409668
51695 409668 408053 407581 408445 410195 412762 416522 421601 427187 431360 431915 427932 420763 413040 406545 401335
51680 401335 396812 392911 389892 387632 385835 384666 384615 385879 388396 392385 398356 406631 417221 430006
$$ packed form
51781C37275O75Q12P28Q78J513K110J983J230N18J30j47k69K16J486L086M448
51765C56672N350N813N990O286P021P840P914O989N734M743L628J586j442m592
51751D19532o952q276q917r319r448q782p027m852l323k580j672K1K020L779N714
51736C59918Q288J0717J1641J0872R460Q177P004O062N930O619P251P132O238
51723D65309M273L64n350j0636j2898j1732r002o563m902l830l386l557l890m011
51709C90189m123m527m801m063k012O62L096N141P072Q512Q250N617J749j094
51695D09668j615m72Q64J750K567L760N079N586M173N55l983p169p723o495n210
51680D01335m523l901l019k260j797j169n1J264K517L989N971Q275J0590J2785
$$ plain form
51666 430006 444351 458501 469975 476962 479129 477039 471348 462904 453230 444320 437783 434127 432546
51653 432546 431227 428246 422698 415097 406639 398231 390371 383601 378528 375273 373248 371663 370045 368125
51639 368125 365430 361344 355671 348948 342019 335377 329073 323233 318337 314787 312387 310563 308999 307753
51625 307753 306764 305655 304197 302676 301547 300906 300487 300008 299354 298597 298096 298390 299677 301467 303059 304287
51609 304287 305488 306856 308267 309791 311904 314893 318421 321977 325638 330054 335764 342780 350694 358772
51595 358772 365842 370449 371554 369192 364425 358669 353075 348440 345436 344624 346134 349478 353853 358673
51581 358673 363770 369242 375471 383296 393710 406981 422272 438567 455844 474773 495131 515161
51569 515161 533079 549061 565176 583191 602677 621305 636867 649084 659984 672930 691138
$$ packed form
51666D30006J4345J4150J1474O987K167k090n691q444r674q910o537l656j581
51653D32546j319k981n548p601q458q408p860o770n073l255k025j585j618j920
51639C68125k695m086n673o723o929o642o304n840m896l550k400j824j564j246
51625C07753r89j109j458j521j129o41m19m79o54p57n01K94J287J790J592J228
51609C04287J201J368J411J524K113K989L528L556L661M416N710P016P914Q078
51595C58772P070M607J105k362m767n756n594m635l004q12J510L344M375M820
51581C58673N097N472O229P825J0414J3271J5291J6295J7277J8929K0358K0030
51569E15161J7918J5982J6115J8015J9486J8628J5562J2217J0900J2946J8208
$$ plain form
51558 691138 716605 749884 790446 836934 887082 937600 984426 1023365 1051028 1065845 1068517 1061211
51546 1061211 1045868 1023169 993168 956649 915495 871816 827107 782321 738301 695817 655439
51535 655439 617687 583231 552684 526186 503410 483891 467190 452807 440253 429306 419983 412158
51523 412158 405426 399446 394210 389804 385990 382204 377927 372972 367556 362217 357540 353713 350446 347497
51509 347497 345148 343867 343571 343568 343291 342723 342034 341205 340257 339550 339484 340041 340868 341663 342232 342444 342455 342750 343466
51490 343466 343846 342969 341008 339179 338284 337917 337310 336313 335109 333517 331240 328524 325918 323516 321006 318418
51474 318418 316258 314825 313888 313145 312532 311937 311028 309632 307992 306420 305020 303933 303577 304298 305924 307917
51458 307917 309983 312304 315198 318635 322067 324791 326624 328225 330487 333582 336897 340018 343442 348090
$$ packed form
51558F91138K5467L3279M0562M6488N0148N0518M6826L8939K7663J4817K672p306
51546A061211j5343k2699l0001l6519m1154m3679m4709m4786m4020m2484m0378
51535F55439l7752l4456l0547k6498k2776j9519j6701j4383j2554j0947r323p825
51523D12158o732n980n236m406l814l786m277m955n416n339m677l827l267k949
51509C47497k349j281k96lk77n68o89q29r48p07o6N57Q27P95N69K12J1K95P16
51490C43466L80q77j961j829q95l67o07r97j204j592k277k716k606k402k510k588
51474C18418k160j433r37p43o13n95r09j396j640j572j400j087l56P21J626J993
51458C07917K066K321K894L437L432K724J833J601K262L095L315L121L424M648
$$ plain form
51444 348090 354432 362459 372289 384324 398702 414723 430762 444636 454367 459142 459718 457775 454915
51431 454915 452299 450726 450197 449202 445118 436101 422727 407667 393816 382746 374569 368704 364528 361544
51417 361544 359308 357434 355742 354356 353582 353606 354301 355277 356158 356836 357484 358236 358865 358933 358380 357810 358013 359316
51399 359316 361527 364390 367742 371309 374783 378227 382032 386312 390687 394959 399759 406130 414630 425203
51385 425203 437834 452864 470665 491546 516223 545990 581991 624350 672271 724793 780992
51374 780992 839283 896909 950592 997935 1038127 1071234 1096902 1113858 1120628 1116470 1101522 1076292
51362 1076292 1041422 998044 948076 893888 837657 781085 725603 672623 623481 579187 540202
51351 540202 506508 477912 454289 435444 420741 409036 399127 390242 382025 374209 366546 359112 352467
$$ packed form
51444C48090O342Q027R830J2035J4378J6021J6039J3874R731M775N76j943k860
51431D54915k616j573n29r95m084r017j3374j5060j3851j1070q177n865m176k984
51417C61544k236j874j692j386p74K4O95R76Q81O78O48P52O29O8n53n70K03J303
51399C59316K211K863L352L567L474L444L805M280M375M272M800O371Q500J0573
51385D25203J2631J5030J7801K0881K4677K9767L6001M2359M7921N2522N6199
51374G80992N8291N7626N3683M7343M0192L3107K5668J6956O770m158j4948k5230
51362A076292l4870m3378m9968n4188n6231n6572n5482n2980m9142m4294l8985
51351E40202l3694k8596k3623j8845j4703j1705r909q885q217p816p663p434o645
$$ plain form
51338 352467 347281 343688 341014 338193 334542 330174 325669 321421 317441 313715 310473 307914 305863 303935
51324 303935 301954 300041 298341 296868 295566 294351 293155 292158 291917 292943 295007 297092 298149 297843 296650
51309 296650 295482 295220 296211 298019 299813 301135 302176 303270 304436 305553 306723 308150 309790 311280 312202
51294 312202 312297 311598 310398 308921 307050 304671 302295 300804 300367 300197 299752 299661 300836 303062 305295 307124
51278 307124 309033 311161 312701 312929 312137 311067 309955 308665 307506 307298 308623 311355 314937 318832 322728
51263 322728 326460 329856 332708 334912 336565 337721 338149 337614 336389 335108 333954 332369 329807 326516 323265
51248 323265 320504 318087 315669 313080 310383 307822 305732 304258 303114 301708 299592 296798 293816 291204
51234 291204 289140 287353 285603 284182 283679 284250 285359 286331 286913 287247 287608 288383 290047 292850 296502 300259
$$ packed form
51338C52467n186l593k674k821l651m368m505m248l980l726l242k559k051j928
51324C03935j981j913j700j473j302j215j196r97k41J026K064K085J057l06j193
51309B96650j168k62R91J808J794J322J041J094J166J117J170J427J640J490R22
51294C12202R5o99j200j477j871k379k376j491m37j70m45r1J175K226K233J829
51278C07124J909K128J540K28p92j070j112j290j159k08J325K732L582L895L896
51263C22728L732L396K852K204J653J156M28n35j225j281j154j585k562l291l251
51248C23265k761k417k418k589k697k561k090j474j144j406k116k794k982k612
51234B91204k064j787j750j421n03N71J109R72N82L34L61P75J664K803L652L757
$$ plain form
51218 300259 303297 305155 306042 306691 307651 308689 309259 309522 310400 312468 315215 317622 319063 319498 319273 319096
51202 319096 319733 321271 322980 324275 325488 327251 329523 331710 333463 334796 335696 336181 336550 337022 337281 336945
51186 336945 336263 335712 335030 333439 330918 328575 327509 327807 328761 329613 329883 329484 328788 328312 328191 328150 327963 327554
51168 327554 326772 325617 324751 325204 327287 330217 332992 335291 337407 339750 342547 345572 347916 348481 346965
51153 346965 344074 340684 337228 334013 331450 329573 327832 325795 323720 321990 320401 318473 316220 314144
51139 314144 312656 311852 311621 311626 311415 310969 310904 311702 312900 313561 313462 313428 314508 317106 320786 324610 327757 330135
51121 330135 332297 334533 336318 337041 336985 336988 337296 337436 337304 337662 339216 341703 344318 346749 349348 352390 355628
51104 355628 358657 361473 364451 367796 371193 374107 376337 378072 379387 379954 379449 378172 377001 376687 377218
$$ packed form
51218C00259L038J858Q87O49R60J038N70K63Q78K068K747K407J441M35k25j77
51202C19096O37J538J709J295J213J763K272K187J753J333R00M85L69M72K59l36
51186C36945o82n51o82j591k521k343j066K98R54Q52K70l99o96m76j21m1j87m09
51168C27554p82j155q66M53K083K930K775K299K116K343K797L025K344N65j516
51153C46965k891l390l456l215k563j877j741k037k075j730j589j928k253k076
51139C14144j488q04k31Nk11m46o5P98J198O61r9l4J080K598L680L824L147K378
51121C30135K162K236J785P23n6LL08J40j32L58J554K487K615K431K599L042L238
51104C55628L029K816K978L345L397K914K230J735J315N67n05j277j171l14N31
$$ plain form
51089 377218 377858 377843 377178 376696 377151 378300 379201 379415 379466 379933 380612 380921 380688 380101 379313 378695 379142 381323 384676
51070 384676 387888 390454 393139 396818 401540 407017 413385 421049 430131 440538 452193 464712 476906
51057 476906 487044 493784 496922 497531 497585 499135 503341 510037 518131 526379 534001 541009 548189 556354 565338
51042 565338 573795 580290 584527 587465 590444 594278 598725 602286 602601 597640 586859 571309 552751 532879
51028 532879 513184 494930 478835 464833 452433 441397 432038 424872 420048 417214 415867 415741 416796
51015 416796 418968 422125 426220 431313 437384 444233 451589 459132 466451 473243 479685 486345 493556 501076
51001 501076 508564 516207 524592 534095 544634 555958 567865 580137 592529 604953 617614 630964
50989 630964 645550 661754 679538 698533 718461 739181 760008 779338 795545 808308 818700
$$ packed form
51089C77218O40j5o65m82M55J149R01K14N1M67O79L09k33n87p88o18M47K181L353
51070C84676L212K566K685L679M722N477O368P664R082J0407J1655J2519J2194
51057D76906J0138O740L138O09N4J550M206O696Q094Q248P622P008P180Q165Q984
51042E65338Q457O495M237K938K979L834M447L561L15m961j0781j5550j8558j9872
51028E32879j9695j8254j6095j4002j2400j1036r359p166m824k834j347j26J055
51015D16796K172L157M095N093O071O849P356P543P319O792O442O660P211P520
51001E01076P488P643Q385R503J0539J1324J1907J2272J2392J2424J2661J3350
50989F30964J4586J6204J7784J8995J9928K0720K0827J9330J6207J2763J0392
$$ plain form
50978 818700 828025 837180 847155 859319 874603 892761 913029 935325 960388 988919 1021088 1056820
50966 1056820 1096082 1138922 1185585 1236568 1292136 1351717 1414142 1478573 1544841 1612815 1681702
50955 1681702 1750013 1815828 1877069 1932025 1979991 2021215 2056115 2084856 2107685 2125193 2138023
50944 2138023 2146691 2151838 2153942 2152295 2144876 2130159 2109044 2084551 2059729 2036260 2014644 1994655
50932 1994655 1975317 1955074 1932478 1906614 1876924 1843107 1805295 1763833 1718703 1669553 1616486
50921 1616486 1560414 1502525 1443831 1385441 1328697 1274604 1223407 1175077 1129981 1088703 1051525
50910 1051525 1018513 989851 965614 945224 927557 911646 897089 883814 871809 861126 851887
50899 851887 844096 837501 831729 826572 822091 818318 814827 810912 806483 802544 800203 799276 798493 797173 795955
$$ packed form
50978H18700R325R155R975J2164J5284J8158K0268K2296K5063K8531L2169L5732
50966A056820L9262M2840M6663N0983N5568N9581O2425O4431O6268O7974O8887
50955A681702O8311O5815O1241N4956M7966M1224L4900K8741K2829J7508J2830
50944B138023Q668N147K104j647p419j4717k1115k4493k4822k3469k1616j9989
50932A994655j9338k0243k2596k5864k9690l3817l7812m1462m5130m9150n3067
50921A616486n6072n7889n8694n8390n6744n4093n1197m8330m5096m1278l7178
50910A051525l3012k8662k4237k0390j7667j5911j4557j3275j2005j0683r239
50899H51887p791o595n772n157m481l773l491l915m429l939k341r27p83j320j218
$$ plain form
50884 795955 795579 795776 796103 797156 800007 804648 809973 815264 820863 827247 834300 841870 850385 860361 871686
50869 871686 883927 897090 911646 927897 945690 964848 985668 1008937 1035534 1066011 1100469
50858 1100469 1138841 1181335 1228719 1282274 1343405 1413062 1491406 1578131 1673235 1777359 1891257
50847 1891257 2015139 2148586 2290743 2440289 2595492 2754733 2916890 3080802 3244350
50838 3244350 3404215 3556297 3696034 3818753 3920645 3999760 4055844 4089304 4100932 4092692
50828 4092692 4068070 4031160 3985676 3935022 3882846 3832960 3788704 3752541 3725992 3709486 3702024
50817 3702024 3700961 3702174 3700773 3692212 3673055 3640854 3593640 3530053 3449958 3354550 3245706 3125504
50805 3125504 2996275 2860662 2721460 2581704 2444937 2314841 2194309 2085079 1988243 1904522
$$ packed form
50884G95955l76J97L27J053K851M641N325N291N599O384P053P570Q515R976J1325
50869H71686J2241J3163J4556J6251J7793J9158K0820K3269K6597L0477L4458
50858A100469L8372M2494M7384N3555O1131O9657P8344Q6725R5104J04124J13898
50847A891257J23882J33447J42157J49546J55203J59241J62157J63912J63548
50838C244350J59865J52082J39737J22719J01892P9115N6084L3460J1628q240
50828D092692k4622l6910m5484n0654n2176m9886m4256l6163k6549j6506p462
50817C702024j063J213j401q561j9157l2201m7214o3587q0095r5408j08844j20202
50805C125504j29229j35613j39202j39756j36767j30096j20532j09230r6836q3721
$$ plain form
50795 1904522 1833837 1775206 1727574 1690422 1663328 1645301 1634954 1630940 1631855 1636061 1642120 1649185
50783 1649185 1656518 1662874 1666862 1667825 1665969 1661744 1655472 1647367 1637453 1625508 1611434 1595526 1577994
50770 1577994 1558345 1535674 1509422 1479464 1445754 1408648 1369561 1330541 1292836 1256361 1220759
50759 1220759 1186507 1154677 1126064 1100911 1079114 1060261 1043673 1028938 1016460 1007252 1002080 1000911
50747 1000911 1003055 1007740 1014671 1024250 1037265 1054301 1075470 1100719 1130196 1164170 1202726 1245824
50735 1245824 1293635 1346584 1404951 1468542 1536858 1609493 1686208 1766665 1850316 1936613 2025071
50724 2025071 2114835 2204327 2291702 2375721 2455664 2530061 2595821 2649058 2686775 2707598 2711318
50713 2711318 2698515 2670930 2631698 2584761 2534068 2483354 2436217 2395790 2364056 2341501 2327424
$$ packed form
50795A904522p0685n8631m7632l7152k7094j8027j0347m014R15M206O059P065
50783A649185P333O356L988R63j856m225o272q105r914j1945j4074j5908j7532
50770A577994j9649k2671k6252k9958l3710l7106l9087l9020l7705l6475l5602
50759A220759l4252l1830k8613k5153k1797j8853j6588j4735j2478r208n172j169
50747A000911K144M685O931R579J3015J7036K1169K5249K9477L3974L8556M3098
50735A245824M7811N2949N8367O3591O8316P2635P6715Q0457Q3651Q6297Q8458
50724B025071Q9764Q9492Q7375Q4019P9943P4397O5760N3237L7717K0823L720
50713B711318j2803k7585l9232m6937n0693n0714m7137m0427l1734k2555j4077
$$ plain form
50702 2327424 2320577 2319629 2323185 2329465 2336023 2339870 2337941 2327538 2306541 2273607 2228485 2172208 2106865
50689 2106865 2035106 1959743 1883720 1810192 1742249 1682148 1630696 1587629 1552855 1527244 1512033
50678 1512033 1507631 1513334 1528227 1552005 1584714 1626011 1674975 1730487 1791311 1855564 1920343 1982348
50666 1982348 2039096 2089466 2133038 2169331 2198211 2220881 2239658 2256282 2270801 2282522 2291519
50655 2291519 2298487 2303352 2304995 2302683 2297177 2290049 2282317 2274155 2265627 2257420 2251049 2248574 2251807 2261447
50641 2261447 2277040 2297862 2323499 2353469 2386766 2422209 2458952 2496353 2533767 2570936 2608169
50630 2608169 2645670 2683063 2719912 2755351 2785303 2800272 2788539 2743845 2670282 2579515 2483830
50619 2483830 2391860 2308709 2237279 2178746 2133100 2100087 2079263 2069142 2067318 2071920 2082185 2096980
$$ packed form
50702B327424o847r48L556O280O558L847j929j0403k0997l2934m5122n6277o5343
50689B106865p1759p5363p6023p3528o7943o0101n1452m3067l4774k5611j5211
50678A512033m402N703J4893K3778L2709M1297M8964N5512O0824O4253O4779O2005
50666A982348N6748N0370M3572L6293K8880K2670J8777J6624J4519J1721Q997
50655B291519O968M865J643k312n506p128p732q162q528q207o371k475L233R640
50641B261447J5593K0822K5637K9970L3297L5443L6743L7401L7414L7169L7233
50630B608169L7501L7393L6849L5439K9952J4969j1733m4694p3563r0767r5685
50619B483830r1970q3151p1430n8533m5646l3013k0824j0121j824M602J0265J4795
$$ plain form
50607 2096980 2113406 2127606 2136632 2138874 2133000 2117436 2091018 2053663 2006230 1950136 1887221 1819586
50595 1819586 1749249 1677989 1607404 1538838 1473230 1411244 1353574 1300858 1253319 1210809 1173254
50584 1173254 1140712 1112949 1089306 1069115 1052008 1037737 1026083 1017171 1011520 1009439 1010580 1014389
50572 1014389 1020749 1029707 1040698 1052572 1064618 1077181 1091020 1106305 1122610 1139776 1158366 1179107
50560 1179107 1202241 1227736 1256028 1288120 1324819 1366136 1411590 1460779 1513347 1568599 1625485
50549 1625485 1682746 1738722 1791202 1838196 1879156 1915209 1948150 1979641 2011405 2045449 2083452
50538 2083452 2126158 2173683 2226165 2283667 2345713 2411524 2480902 2554688 2634356 2721209 2815679
50527 2815679 2917036 3023867 3135055 3250056 3367933 3486394 3602270 3712723 3815443
$$ packed form
50607B096980J6426J4200R026K242n874j5564k6418l7355m7433n6094o2915o7635
50595A819586p0337p1260p0585o8566o5608o1986n7670n2716m7539m2510l7555
50584A173254l2542k7763k3643k0191j7107j4271j1654q912n651k081J141L809
50572A014389O360Q958J0991J1874J2046J2563J3839J5285J6305J7166J8590K0741
50560A179107K3134K5495K8292L2092L6699M1317M5454M9189N2568N5252N6886
50549A625485N7261N5976N2480M6994M0960L6053L2941L1491L1764L4044L8003
50538B083452M2706M7525N2482N7502O2046O5811O9378P3786P9668Q6853R4470
50527B815679J01357J06831J11188J15001J17877J18461J15876J10453J02720
$$ plain form
50518 3815443 3907835 3986808 4049558 4094050 4118595 4121622 4102278 4060932 3998799 3917442 3818934
50507 3818934 3706152 3582591 3452225 3319820 3190851 3070422 2962253 2868946 2792839 2735969
50497 2735969 2699290 2682519 2684764 2704801 2740622 2789121 2846346 2907608 2967208 3018573 3055126
50486 3055126 3071228 3062704 3027412 2965895 2881249 2777978 2660986 2535505 2406961 2279886
50476 2279886 2156835 2038834 1926823 1822169 1725901 1638123 1558411 1486273 1420977 1361422
50466 1361422 1306618 1256118 1209755 1167253 1128435 1093565 1063112 1037243 1015777 998475 985044
50455 985044 974952 967553 962338 958832 956424 954610 953341 952803 952878 953208 953756 954962 957289 960853 965466
50440 965466 970714 976017 981049 986154 992061 999188 1007630 1017753 1030184 1045025 1061662 1079668 1099353
$$ packed form
50518C815443R2392P8973O2750M4492K4545L027j9344m1346o2133q1357r8508
50507C818934j12782j23561j30366j32405j28969j20429j08169r3307p6107n6870
50497B735969l6679j6771K245K0037L5821M8499N7225O1262N9600N1365L6553
50486C055126J6102q524l5292o1517q4646j03271j16992j25481j28544j27075
50476B279886j23051j18001j12011j04654r6268q7778p9712p2138o5296n9555
50466A361422n4804n0500m6363m2502l8818l4870l0453k5869k1466j7302j3431
50455I85044j0092p399n215l506k408j814j269n38P5L30N48J206K327L564M613
50440I65466N248N303N032N105N907P127Q442J0123J2431J4841J6637J8006J9685
$$ plain form
50427 1099353 1121042 1144333 1168594 1193805 1220326 1248186 1277338 1308451 1342663 1380435 1421293
50416 1421293 1464940 1512125 1564065 1621291 1683291 1749051 1817670 1888559 1961227 2034876 2108212
50405 2108212 2179681 2247892 2311674 2369879 2421399 2465330 2500725 2526018 2538992 2537538 2520562
50394 2520562 2488230 2441646 2382410 2312354 2233643 2149077 2062079 1976030 1893599 1816920 1748264
50383 1748264 1689961 1643351 1608209 1583566 1568929 1564379 1569581 1583130 1602866 1626519 1651807 1676099
50371 1676099 1696249 1708967 1711494 1702141 1680491 1647359 1604559 1554441 1499295 1441019 1381246 1321603
50359 1321603 1263594 1208254 1156037 1107091 1061557 1019697 981836 948146 918321 891626 867526
50348 867526 846248 828433 814238 803124 794586 788676 785527 784707 785388 787014 789377 792187 794937 797313
$$ packed form
50427A099353K1689K3291K4261K5211K6521K7860K9152L1113L4212L7772M0858
50416A421293M3647M7185N1940N7226O2000O5760O8619P0889P2668P3649P3336
50405B108212P1469O8211O3782N8205N1520M3931L5395K5293J2974j454j6976
50394B520562l2332m6584n9236p0056p8711q4566q6998q6049q2431p6679o8656
50383A748264n8303m6610l5142k4643j4637m550N202J3549J9736K3653K5288K4292
50371A676099K0150J2718K527r353k1650l3132m2800n0118n5146n8276n9773n9643
50359A321603n8009n5340n2217m8946m5534m1860l7861l3690k9825k6695k4100
50348H67526k1278j7815j4195j1114q538n910l149q20O81J626K363K810K750K376
$$ plain form
50334 797313 799307 800841 801626 801638 801423 801496 801571 800821 798916 796406 793972 791774 789819 788527 788379 789198 790323
50317 790323 791534 793325 796220 800341 805780 812843 821707 832249 844468 858518 873933 889373 903748
50304 903748 917199 930407 943281 955127 965837 975963 985586 994002 1000844 1006734 1012369 1017543 1021492
50291 1021492 1023759 1024269 1022995 1020125 1016309 1012304 1008479 1005014 1002469 1001732 1003416 1007476 1013305 1019962
50277 1019962 1026370 1031462 1034262 1034180 1031872 1029828 1031099 1036316 1041966 1042309 1033434 1015646 992565 968679
50263 968679 947474 930654 918144 908903 902088 897556 895329 894864 895018 894596 892886 889940 886472 883219
50249 883219 880232 876956 873057 868839 864604 860038 854690 848833 843190 837800 831835 824795 817292 810131
50235 810131 803019 794873 785267 774895 764521 754214 743923 734156 725475 717675 710170 703055 697088
$$ packed form
50334G97313J994J534P85J2k15P3P5p50j905k510k434k198j955j292j48Q19J125
50317G90323J211J791K895M121N439P063Q864J0542J2219J4050J5415J5440J4375
50304I03748J3451J3208J2874J1846J0710J0126R623Q416O842N890N635N174L949
50291A021492K267N10j274k870l816m005l825l465k545p37J684M060N829O657
50277A019962O408N092K800q2k308k044J271N217N650L43q875j7788k3081k3886
50263I68679k1205j6820j2510r241o815m532k227m65J54m22j710k946l468l253
50249H83219k987l276l899m218m235m566n348n857n643n390n965p040p503p161
50235H10131p112q146r606j0372j0374j0307j0291r767q681p800p505p115n967
$$ plain form
50222 697088 692556 688790 685127 681834 679659 678791 678803 679487 681290 684721 689663 695483 701746 708632 716740
50207 716740 726652 738709 753019 769454 787755 807933 830694 857213 888344 924167 964404 1008977
50195 1008977 1057837 1110399 1165468 1221599 1277128 1329931 1377718 1418976 1453618 1482765 1508111
50184 1508111 1531436 1554240 1577390 1600837 1623475 1642965 1655857 1658385 1647616 1622070 1581741
50173 1581741 1528024 1463690 1392408 1317979 1243953 1173569 1109362 1052671 1003922 963484 931729
50162 931729 908261 891803 881187 875867 875102 877182 879911 881365 879814 873771 863090 849675 836160
50149 836160 823905 812836 802796 793945 785867 777465 768204 758703 749668 740931 732065 723379 715703
50136 715703 709537 704990 702355 702157 704612 709302 715281 721285 726160 729580 732244 734991 737862 740421
$$ packed form
50222F97088m532l766l663l293k175q68J2O84J803L431M942N820O263O886Q108
50207G16740R912J2057J4310J6435J8301K0178K2761K6519L1131L5823M0237M4573
50195A008977M8860N2562N5069N6131N5529N2803M7787M1258L4642K9147K5346
50184A508111K3325K2804K3150K3447K2638J9490J2892K528j0769k5546m0329
50173A581741n3717o4334p1282p4429p4026p0384o4207n6691m8749m0438l1755
50162I31729k3468j6458j0616n320p65K080K729J454j551o043j0681j3415j3515
50149H36160j2255j1069j0040q851q078q402r261r501r035q737q866q686p676
50136G15703o166m547k635j98K455M690N979O004M875L420K664K747K871K559
$$ plain form
50122 740421 742751 745421 748394 750686 751539 751463 751615 752555 754227 757009 762012 770067 780965 793985 808767
50107 808767 825220 842883 860982 879164 897698 916840 936411 956235 976667 998289 1021054
50096 1021054 1043972 1065732 1085668 1104232 1122591 1141720 1161837 1182778 1204901 1229407 1257763
50085 1257763 1290992 1329634 1374154 1425184 1483487 1549904 1625132 1709155 1800702 1897446 1996716
50074 1996716 2095865 2191992 2281949 2363448 2436609 2504179 2569849 2636164 2703912 2772856 2842065
50063 2842065 2909087 2969309 3016750 3045612 3051238 3030574 2983018 2911153 2820006 2714977 2600370
50052 2600370 2479531 2355591 2231598 2110210 1993527 1883089 1779886 1684577 1597704 1519505
50042 1519505 1449664 1387713 1333589 1287209 1247435 1212274 1180321 1151315 1124953 1100139 1076164
$$ packed form
50122G40421K330K670K973K292Q53p6J52R40J672K782N003Q055J0898J3020J4782
50107H08767J6453J7663J8099J8182J8534J9142J9571J9824K0432K1622K2765
50096A021054K2918K1760J9936J8564J8359J9129K0117K0941K2123K4506K8356
50085A257763L3229L8642M4520N1030N8303O6417P5228Q4023R1547R6744R9270
50074A996716R9149R6127Q9957Q1499P3161O7570O5670O6315O7748O8944O9209
50063B842065O7022O0222M7441K8862N626k0664m7556p1865r1147j05029j14607
50052B600370j20839j23940j23993j21388j16683j10438j03203r5309q6873p8199
50042A519505o9841o1951n4124m6380l9774l5161l1953k9006k6362k4814k3975
$$ plain form
50031 1076164 1053833 1034398 1017797 1002906 989224 977169 966739 957041 947486 938462 930358 922650
50019 922650 914601 906322 898512 891390 884522 877554 870508 863206 854815 844379 831830 818278 805120
50006 805120 792874 781002 768841 756502 744787 734531 726268 720315 716904 716284 718759 724382 732412
49993 732412 741493 750730 760293 770494 780586 789084 795156 799142 801764 803393 804110 803862 802388 799374
49979 799374 794784 788846 781893 774666 768487 764409 762227 761057 760999 763424 769442 778880 791096 806068
49965 806068 824293 846324 872952 905168 943292 986614 1034531 1087596 1146724 1211600 1280456
49954 1280456 1350999 1420849 1487379 1548188 1602131 1649654 1692305 1732378 1772642 1815260 1860384
49943 1860384 1905938 1948617 1984500 2008866 2016591 2003715 1968786 1912801 1838460 1749695 1651139
$$ packed form
50031A076164k2331j9435j6601j4891j3682j2055j0430r698r555r024q104p708
50019I22650q049q279p810p122o868o968p046p302q391j0436j2549j3552j3158
50006H05120j2246j1872j2161j2339j1715j0256q263n953l411o20K475N623Q030
49993G32412R081R237R563J0201J0092Q498O072L986K622J629P17k48j474l014
49979G99374m590n938o953p227o179m078k182j170n8K425O018R438J2216J4972
49965H06068J8225K2031K6628L2216L8124M3322M7917N3065N9128O4876O8856
49954A280456P0543O9850O6530O0809N3943M7523M2651M0073M0264M2618M5124
49943A860384M5554M2679L5883K4366P725j2876l4929n5985p4341q8765r8556
$$ plain form
49932 1651139 1547131 1441081 1335978 1235167 1141986 1058574 985411 922054 867937 822312
49922 822312 783840 750860 722260 697998 678615 664199 653805 645797 638701 631767 624955 618621
49910 618621 613228 609130 606486 605431 606257 609156 613621 618458 622811 627194 633114 641548 652048 663461
49896 663461 675102 686897 698651 709702 719230 726459 730604 731219 728881 725055 720846 716033 709581
49883 709581 700836 689871 676940 662126 645528 627367 607849 587354 566856 547828 531452 518030
49871 518030 507171 498300 490978 485098 480986 479108 479424 481182 483544 486304 489817 494352 499736 505619
49857 505619 511843 518485 525660 533438 541962 551551 562548 574976 588380 602037 615263 627407 637730
$$ packed form
49932A651139j04008j06050j05103j00811r3181q3412p3163o3357n4117m5625
49922H22312l8472l2980k8600k4262j9383j4416j0394q008p096o934o812o334
49910F18621n393m098k644j055Q26K899M465M837M353M383N920Q434J0500J1413
49896F63461J1641J1795J1754J1051R528P229M145O15k338l826m209m813o452
49883G09581q745j0965j2931j4814j6598j8161j9518k0495k0498j9028j6376j3422
49871E18030j0859q871p322n880m112j878L16J758K362K760L513M535N384N883
49857E05619O224O642P175P778Q524R589J0997J2428J3404J3657J3226J2144J0323
$$ [...]
##END NTUPLES=NMR SPECTRUM
##END=
