
##TITLE=AC1369_2393_7221595_eSSRFaH6zd
##JCAMPDX= 6.0         $$ Bruker NMR JCAMP-DX V2.0
##DATA TYPE= NMR SPECTRUM
##DATA CLASS= NTUPLES
##ORIGIN= BRUKER
##OWNER= Administrator
$$ 1.72 TOPSPIN		Version 2.1
$$ 2012-12-13 22:58:16.117 -0500  Administrator@X
$$ Compression mode = diff/dup
##.OBSERVE FREQUENCY= 400.02188249412
##.OBSERVE NUCLEUS= ^1H
##.ACQUISITION MODE= SIMULTANEOUS (DQD)
##.ACQUISITION SCHEME= undefined
##.AVERAGES= 8
##.DIGITISER RES= 22
##SPECTROMETER/DATA SYSTEM= spect
##.PULSE SEQUENCE= zg30
##.SOLVENT NAME= COFFEE_meoh
##.SHIFT REFERENCE= INTERNAL, COFFEE_meoh, 1, 14.98509
##AUDIT TRAIL= $$ (NUMBER, WHEN, WHO, WHERE, PROCESS, VERSION, WHAT)
$$ ##TITLE= Audit trail, TOPSPIN		Version 2.1
$$ ##JCAMPDX= 5.01
$$ ##ORIGIN= Bruker BioSpin GmbH
$$ ##OWNER= Administrator
$$ $$ E:\/data/COFFEE/nmr/AC1369_2393_7221595_eSSRFaH6zd/20/pdata/1/auditp.txt
$$ ##AUDIT TRAIL=  $$ (NUMBER, WHEN, WHO, WHERE, PROCESS, VERSION, WHAT)
(   1,<2012-12-13 22:58:08.446 -0500>,<Administrator>,<X>,<go>,<TOPSPIN 2.1>,
      <created by zg
	started at 2012-12-13 22:57:02.157 -0500,
	POWCHK enabled, PULCHK disabled,
       configuration hash MD5:
       86 BA 57 50 F2 9D 5C 9B 26 00 A9 28 5F 66 2E 89
       data hash MD5: 64K
       38 2A 10 90 17 59 77 E2 15 A6 48 53 7E 5A D4 43>)
(   2,<2012-12-13 22:58:11.161 -0500>,<Administrator>,<X>,<proc1d>,<TOPSPIN 2.1>,
      <Start of raw data processing
       efp LB = 0 FT_mod = 6 PKNL = 1 PHC0 = 0 PHC1 = 0 SI = 32K 
       data hash MD5: 32K
       1C 8B 68 85 80 7F 4D 57 A4 60 31 4A 3E 9B 84 6D>)
(   3,<2012-12-13 22:58:11.579 -0500>,<Administrator>,<X>,<proc1d>,<TOPSPIN 2.1>,
      <pk PHC0 = 99.0033 PHC1 = 0 
       data hash MD5: 32K
       C6 EF E2 74 52 99 C9 89 CA E9 6B 33 14 AF E0 59>)
(   4,<2012-12-13 22:58:11.774 -0500>,<Administrator>,<X>,<proc1d>,<TOPSPIN 2.1>,
      <abs ABSG = 1 
       data hash MD5: 32K
       B4 E0 DE 08 43 64 D4 93 94 CA E3 05 BF 36 0F EA>)
(   5,<2012-12-13 22:58:11.913 -0500>,<Administrator>,<X>,<proc1d>,<TOPSPIN 2.1>,
      <abs ABSG = 2 
       data hash MD5: 32K
       BB 58 9C B7 2E C2 EB 48 1A F3 AE 1B 17 2D 6F BE>)
(   6,<2012-12-13 22:58:12.038 -0500>,<Administrator>,<X>,<proc1d>,<TOPSPIN 2.1>,
      <abs ABSG = 3 
       data hash MD5: 32K
       81 D9 D2 52 F9 C2 79 00 19 2C CB B3 FE E6 F0 3A>)
(   7,<2012-12-13 22:58:12.177 -0500>,<Administrator>,<X>,<proc1d>,<TOPSPIN 2.1>,
      <abs ABSG = 4 
       data hash MD5: 32K
       34 A9 80 82 04 20 DE CA BD 9F 48 41 0E C5 8C BB>)
(   8,<2012-12-13 22:58:12.303 -0500>,<Administrator>,<X>,<proc1d>,<TOPSPIN 2.1>,
      <abs ABSG = 5 
       data hash MD5: 32K
       45 31 C2 59 5C 2D 8B E3 75 31 D1 8F 3E B8 8E D3>)
$$ ##END=
$$ 
$$ $$ hash MD5
$$ $$ DF 75 1F 79 36 F9 C0 83 43 E5 8E 35 B4 2F D7 4A
##$RELAX= 
##$RELAX= 
##$RELAX= 
##$RELAX= 
##$RELAX= 
##$RELAX= 
##$RELAX= 
##$RELAX= 
$$ Bruker specific parameters
$$ --------------------------
##$DU= <E:\>
##$EXPNO= 20
##$NAME= <AC1369_2393_7221595_eSSRFaH6zd>
$$ [...]
##$TP= (0..7)
150 150 150 150 150 150 150 150
##$TP07= 0
##$TPNAME0= <>
##$TPNAME1= <>
##$TPNAME2= <>
##$TPNAME3= <>
##$TPNAME4= <>
##$TPNAME5= <>
##$TPNAME6= <>
##$TPNAME7= <>
##$TPOAL= (0..7)
0.5 0.5 0.5 0.5 0.5 0.5 0.5 0.5
##$TPOFFS= (0..7)
0 0 0 0 0 0 0 0
##$TUNHIN= 0
##$TUNHOUT= 0
##$TUNXOUT= 0
##$USERA1= <user>
##$USERA2= <user>
##$USERA3= <user>
##$USERA4= <user>
##$USERA5= <user>
##$V9= 5
##$VALIST= <valist>
##$VCLIST= <CCCCCCCCCCCCCCC>
##$VD= 0
##$VDLIST= <DDDDDDDDDDDDDDD>
##$VPLIST= <PPPPPPPPPPPPPPP>
##$VTLIST= <TTTTTTTTTTTTTTT>
##$WBST= 1024
##$WBSW= 4
##$XGAIN= (0..3)
0 0 0 0
##$XL= 0
##$YL= 0
##$YMAX_a= 619839
##$YMIN_a= -530268
##$ZGOPTNS= <>
##$ZL1= 120
##$ZL2= 120
##$ZL3= 120
##$ZL4= 120
##$ABSF1= 14.98509
##$ABSF2= -5.573092
##$ABSG= 5
##$ABSL= 3
##$ALPHA= 0
##$AQORDER= 0
##$ASSFAC= 0
##$ASSFACI= 0
##$ASSFACX= 0
##$ASSWID= 0
##$AUNMP= <proc_prof1d_extract_pilot.lims>
##$AXLEFT= 0
##$AXNAME= <>
##$AXNUC= <1H>
##$AXRIGHT= 0
##$AXTYPE= 0
##$AXUNIT= <>
##$AZFE= 0.1
##$AZFW= 0.1
##$BCFW= 0
##$BC_mod= 0
##$BYTORDP= 0
##$COROFFS= 0
##$CY= 15
##$DATMOD= 1
##$DC= 0
##$DFILT= <>
##$DTYPP= 0
##$F1P= 0
##$F2P= 0
##$FCOR= 0.5
##$FTSIZE= 32768
##$FT_mod= 6
##$GAMMA= 0
##$GB= 0
##$INTBC= 1
##$INTSCL= 1
##$ISEN= 128
##$LB= 0
##$LEV0= 0
##$LPBIN= 0
##$MAXI= 10000
##$MC2= 0
##$MEAN= 0
##$ME_mod= 0
##$MI= 0
##$NCOEF= 0
##$NC_proc= -8
##$NLEV= 6
##$NOISF1= 0
##$NOISF2= 0
##$NSP= 0
##$NTH_PI= 0
##$NZP= 0
##$OFFSET= 14.98509
##$PC= 1
##$PHC0= 99.0033
##$PHC1= 0
##$PH_mod= 1
##$PKNL= yes
##$PPARMOD= 0
##$PPDIAG= 0
##$PPIPTYP= 0
##$PPMPNUM= 2147483647
##$PPRESOL= 1
##$PSCAL= 4
##$PSIGN= 0
##$PYNMP= <proc.py>
##$REVERSE= no
##$SF= 400.02
##$SI= 32768
##$SIGF1= 0
##$SIGF2= 0
##$SINO= 400
##$SIOLD= 32768
##$SPECTYP= <>
##$SREGLST= <1H.CDCl3>
##$SSB= 0
##$STSI= 32768
##$STSR= 0
##$SW_p= 8223.68421052631
##$SYMM= 0
##$S_DEV= 0
##$TDeff= 65536
##$TDoff= 0
##$TI= <>
##$TILT= no
##$TM1= 0
##$TM2= 0
##$TOPLEV= 0
##$USERP1= <user>
##$USERP2= <user>
##$USERP3= <user>
##$USERP4= <user>
##$USERP5= <user>
##$WDW= 1
##$XDIM= 32768
##$YMAX_p= 467837959
##$YMIN_p= -693926
##$CURPLOT= <Network HP LaserJet P1505>
##$CURPRIN= <$Network HP LaserJet P1505>
##$DFORMAT= <normdp>
##$LAYOUT= <+/1D_H.xwp>
##$LFORMAT= <normlp>
##$PFORMAT= <normpl>
##$SURQMSG= 1
$$ End of Bruker specific parameters
$$ ---------------------------------
##NTUPLES= NMR SPECTRUM
##VAR_NAME=  FREQUENCY,     SPECTRUM/REAL,   SPECTRUM/IMAG
##SYMBOL=    X,             R,               I
##VAR_TYPE=  INDEPENDENT,   DEPENDENT,       DEPENDENT
##VAR_FORM=  AFFN,          ASDF,            ASDF
##VAR_DIM=   32768,         32768,           32768
##UNITS=     HZ,            ARBITRARY UNITS, ARBITRARY UNITS
##FACTOR=    0.250966925370066, 1,           1
##FIRST=     8223.43324360094, 50330,        19179
##LAST=      0,             94609,           105480
##MIN=       0,             -693926,         0
##MAX=       8223.43324360094, 467837959,    0
$$ Real data points
##PAGE= N=1
##DATA TABLE= (X++(R..R)), XYDATA
$$ [...]
23858 129641 45419 109258 55489 -315874 -11684 -92415 95696 -209811 7911 8670 -18743 20868
23845 244470 -69237 17599 -104387 31123 -391 14668 91575 -148361 -30732 113581 158554
23834 158554 79220 39223 1219 -119743 101430 -246608 -127405 200937 -216851 114440
23823 -134432 22595 191117 89849 -117794 8947 -192010 -309750 95361 34811 -34601 -180042
23812 -180042 41790 -462642 -107978 -146473 -260495 104556 76284 180829 100273 -10870
23801 164183 -70724 -152101 3987 -367681 -105632 168916 32249 -185524 -103158 -92700 -97241
23790 -97241 348614 -136316 -298764 -119484 64109 287319 -248459 82066 -241815 7074
23779 1547 171428 207213 96505 -28578 -59415 -78915 -49967 196407 276238 168759 -40498
23767 -150382 -70984 -76978 -65532 64383 323515 -61602 -84366 49348 -137479 284199 -151024
23755 59062 -184262 278273 -137398 11390 -195419 -265469 147389 -160034 152160 -174062
23744 456832 -14477 -160713 52780 160659 136373 155924 -137867 57887 -90283 -184601 27413
23732 -148187 -186288 -286091 -166809 -170406 -148462 -232278 47603 -115766 -30582 37974 35957
23721 35957 -294279 -306969 -66971 11248 -34928 -108189 48140 -146768 416099 48380 87970
23710 87970 256234 -73257 253222 287583 -188859 -163877 -120982 130188 199390 -160559 56625
23698 -235323 127236 -153484 57795 160888 -113474 103003 -69781 -43031 217066 -244540
23687 -43560 173320 83739 5468 -351824 154722 -165876 -21097 -118716 -144103 -131373 -127044
23676 -127044 -69886 107346 -31266 122921 -311202 -90701 -154344 235987 -112897 -289481
23666 -289481 -7369 215211 411893 648 -169320 -18471 -61813 238831 138875 -288621 -404419
23655 -404419 112687 -31195 -14106 -47320 -573119 151261 -52980 -190195 50393 -136517
23644 -45262 -109237 68384 197656 34833 266167 -223871 -52331 -81609 -215723 -132546 -196028
23633 -196028 -158392 -311501 -73769 25393 -10535 239361 39709 57938 43611 269551 34636
23621 -172237 66684 -126700 35477 -315408 259208 -146544 -38362 -202838 74530 -145324
23610 -137142 -190461 114235 43683 347121 -363745 257520 329062 170748 -311364 125641
23599 -4772 125533 130640 -317034 -120955 -160848 143777 89347 -3478 -85576 -156538 146538
23587 2280 156272 200953 108735 71031 -137982 -66775 204739 -181857 229822 -83198 -102421
23576 -102421 140820 296665 -419604 91081 -319413 -12467 222936 58540 41525 -232989
23565 -17600 131662 166342 331887 323110 -26600 -253826 1655 173508 -316793 232353 166162
23554 166162 135247 53997 -64081 -278625 -73334 156599 190184 47716 -173558 -106305 14356
23542 1563 -83306 -131925 -79479 -80219 221977 -78992 291649 -401534 -67445 -191785 -74960
23530 -104643 49880 204597 138048 -257437 141333 293342 -293227 19419 -969 -203609 262907
23518 -3895 42229 105808 -81852 -149865 106331 44103 157929 -61991 165336 12640 -756 -12081
23506 -12081 -199503 -189807 -108070 -33211 35207 -177476 367216 277675 224864 -184390 125166
23494 -39228 27771 -26819 -55727 191923 -439161 106807 243620 -46340 -367392 332685
23483 236666 -96463 -117742 -28033 -216137 -228974 178723 -56700 1721 67403 -87263 41086
23471 -925 156158 -28136 132040 180713 -249067 257644 -119848 85388 -394638 -298379 110207
23459 -68862 -90469 -132648 -24049 7532 291985 -464 -203149 -112406 -86558 -203991 48677 182655
23447 182655 -89736 -245163 -156641 25738 72089 225183 -30601 -105505 25893 -156299 13745
23435 -58882 56010 -39633 -210088 29102 203300 256637 219287 133573 347 230071 -71711
23423 128982 149843 -412609 -203433 13428 -171532 -100356 73301 -394816 245 176126 -146368
23411 -144287 -256834 94235 -182996 85287 -53528 -23328 -113082 19769 354948 18870 145338
23400 145338 -114036 55354 13601 -57468 -89660 99602 172372 -51970 81183 -21122 190969
23388 -209953 133957 12983 -15285 3064 222635 -488557 1280 -12509 -86132 -143974 -368150
23377 -368150 -72924 72117 -229604 -97177 193489 -18394 168196 8350 -16076 -302352 242863
23365 -155387 -74498 -224454 -239802 190994 -311308 -138664 -236676 116413 -62916 -210754
23355 -210754 -304862 181327 158177 -190489 120232 -109087 199199 22467 264368 -184780
23344 -178045 245940 35487 237988 -177428 -247830 -41682 264409 100062 -62188 -397179
23334 -397179 -88150 -314811 187704 -126000 83466 109821 -144894 -139109 -142224 20080 -153519
23322 179613 -239151 -44178 108024 298639 -40966 -14268 182537 -215165 -28737 -88301
23312 -88301 2689 -137078 -122922 -43152 -148908 -14784 -173976 -155142 -215295 -34201 439897
23300 -83256 -40054 -38521 -84257 -180767 -146709 125000 -302715 19168 -2929 74400 -182487
23288 -130655 -93357 307032 -50737 -229330 -200454 82827 -44608 208710 -83662 -370242 29241
23276 100362 95157 -184445 -142845 37179 132222 -91831 56394 -426770 -27180 181827 -130063
23264 -281650 -182494 9052 5867 -111272 168752 538388 49652 22811 113622 72844 -251663
23252 -151157 -302947 -12993 -88259 183777 -118505 -369317 -24338 -251448 -80166 116894
23241 107728 250561 209156 -116676 -78448 209633 -41967 -48632 9634 -144026 -88737 -186528
23230 -186528 -64152 -235332 97935 212490 100484 72551 108975 227233 -74377 -315155
23220 -315155 -26582 9011 144442 34750 -84854 249965 315268 -183712 172627 -200314 76986
23208 -201558 -42367 -374242 -10926 18555 92435 -86663 -23298 117807 -15436 -232813 157284
23196 121692 -55106 289420 73728 506323 -219244 20421 227331 153544 96372 -90746 -106910
23185 -106910 167225 -214684 80149 83904 -105612 -7355 -67300 39851 -55973 36733 -212976
23173 340664 339632 29849 -128169 -207314 178831 8901 107201 -104392 90069 -227289 45689
23161 -193326 9913 78131 113608 -15202 -266836 20673 158426 174863 52568 -91357 -245054
23150 -245054 71014 54755 -43296 37485 127764 177707 -143056 52599 -205409 100795 -55045
23138 105793 -252290 -303701 -194192 -68676 -178607 175499 -202817 82381 -177122 -263340
23128 -263340 -42642 -347115 -99986 -10724 -341618 178375 321370 -201568 -80075 -276069
23118 -276069 -121597 -205714 -266836 -17535 -191431 -1442 -140187 -11662 101271 -108697 242027
23106 -158187 -176270 -234299 99405 267386 191991 -188481 66597 148000 492664 175191 -117553
23094 -60229 -26377 26450 9045 151037 -171076 60933 110097 -78987 81791 -274987 -65488
23082 194694 127990 98440 302248 229088 55135 -21309 215546 213714 245197 94621 -46277
23070 -269113 84471 226652 58170 -79555 31372 -26105 -101110 91811 -102297 -60711 -20129
23058 -102916 485082 127465 304387 -176352 33033 255360 78805 -170071 91158 -121702
23047 -49349 58763 178120 101654 -176764 -132702 119074 183500 -20196 -137009 2906 -28902
23035 43757 183765 -31281 191682 -53437 202571 136578 -216490 -116649 -48398 29121 9189
23023 -53402 19749 -361496 -102647 25178 9629 -85526 -37058 -70125 103553 -44566 197187
23011 162439 -93253 -123036 172467 -137693 -85001 -41912 -82181 121074 142710 21159 -153022
22999 -353289 -143521 -106630 -136639 -90315 199538 66487 -93884 124360 -109018 -47058 -165984
22988 -165984 -69439 -132655 -339446 -89870 39936 -132820 194744 238076 198538 -221552 -202108
22977 -202108 30746 217095 -46806 439517 -60012 13724 45791 -33214 -239498 71290 25717
22965 154442 -135687 137538 244127 -211300 126844 227690 123085 -112839 94798 272803
22955 272803 253548 81319 -240502 -143824 85353 -40515 132076 41363 -2044 101092 -120196
22943 -276054 -219507 -48784 -9459 35530 40442 -138535 -17348 49191 -510383 -267861 96957
22931 232482 16646 159906 211559 -443187 93213 234098 -343027 18270 -241770 -83787
22920 26684 32273 91950 -298667 195136 -209258 102279 -23343 -28048 -77317 -326583 18753
22908 130541 73848 -43343 245743 320697 -24948 -248795 -212166 -329246 72629 81712 -37959
22896 -138067 42960 -164943 20467 -75342 32047 119846 55428 -30166 168020 -31713 -57665
22885 -57665 34542 -146059 -76570 -26571 -143872 118861 -291702 -17649 8156 -132829 70857
22873 -30401 -132666 -6813 13641 39517 -187910 274803 37701 389344 -66027 17745 -264581
22861 -4483 -1233 386267 -215275 -25542 -195165 58702 281948 142646 -135566 43819 22128
22850 22128 -224568 -156014 -23195 -159515 89774 -28208 59547 -84409 7392 -273865 -57041
22838 -58020 199159 -33747 -346888 -82395 -372288 -35322 15507 -5689 -69683 -280814 169464
22826 166965 -100256 181620 42670 -297797 152401 -155970 252425 -104035 -19990 -73215
22816 -73215 39624 -172941 64234 236388 -92938 -299678 307342 -184859 -111800 -80320 33020
22804 -43171 -13253 -50108 -44703 -261552 -119601 125520 -245163 128937 -301154 -39185 -36418
22793 -36418 -42624 113394 -707 -90336 -144419 -234152 65569 148238 -36258 -115741 -97582 -44897
22780 127093 214656 -13039 45928 -13412 69250 -310362 132353 -212138 -10629 176383 176925
22769 176925 -65636 50535 32488 117846 -292738 400393 -290024 -192112 -200643 -116411 -94241
22758 -94241 96084 78144 246263 -99333 -41369 202668 -21229 -109561 -45098 -39165 223306
22746 106198 -70501 -50455 -38094 -54511 -103492 -101663 -280447 -59992 -137007 -75694 66015
22734 66984 152880 65184 -212698 -65064 -400130 65969 13271 -33904 196776 1614 -190445
22722 132043 48335 198050 -105733 -170469 24785 -110201 41882 -180196 -72304 -298020
22712 -298020 -139515 -63087 -149501 -341072 -70566 74418 -403383 46773 -123115 -313643
22702 -313643 -221078 291857 154174 258793 -68209 140597 -15658 141340 -41579 66051
22691 -95288 7341 -242277 -126677 -322528 -30927 253366 117852 -17961 249801 -95859 233813
22679 -102273 -19556 -36876 64754 -9531 -10297 138722 -90710 -23693 -225223 -79978 -63788 -65535
22667 -65535 -12715 -43933 -118873 52974 81071 235256 100842 60209 -255277 103283 166665
22656 166665 136748 -137040 37318 107656 -193246 206769 -230328 -8221 205157 37134 182552
22645 182552 22300 -305072 -160167 90014 -393920 -201328 46191 -617205 80102 64790
22635 64790 -14804 -69164 -87201 -277064 150138 -179348 -390925 -45234 9833 -236522 37176
22623 231370 64976 129538 -155441 -61895 38431 155173 -128989 351880 17607 -44297 201403
22611 -127502 27863 208421 192851 119295 -21990 -37036 322838 46716 153007 -8667 20527
22599 -197924 -171633 131311 -303246 -154721 15189 -237267 -1018 -112359 -398355 357233
22588 -78631 291213 59739 105351 -270570 -46053 -185370 16731 -166100 80245 -53581 138131
22576 -50694 182055 30907 -251367 -183918 -184948 66306 -352269 -148073 198268 142904 135498
22565 135498 -49221 -56645 83828 161098 -182471 -120249 -48053 32100 155171 -211940 -3543
22553 144869 -119746 -123642 -104659 281785 -63738 -385415 48527 -181054 -341009 204322
22542 205800 -267617 -309710 102972 120544 -168179 279955 -57926 -41452 146498 -157911
22531 328881 34903 -108013 -65667 -86630 -185830 -42560 -384082 251361 95770 -246769 222247
22519 73259 -19419 197171 126388 15381 132550 -131855 -12688 -173743 -112686 -193152 -182886
22508 -182886 131404 103850 -136709 -18864 -63695 -172711 -144078 -4654 -1395 -226708 -197221
22497 -197221 -93818 73970 144337 -357030 -351419 -172559 210012 -218062 -75963 41647 -143989
22485 220276 -16590 -94752 -247005 -153502 -111006 131382 -56849 -53538 232137 295054 -78432
22473 -137099 140549 -17862 117805 171122 -138688 490413 -115563 -175158 3780 14556 244973
22462 244973 -345727 139835 -151186 -186985 -98202 66294 -40074 126100 -205007 -22092
22451 -113550 -49968 -317302 -94213 -81369 118509 -294622 -157994 -11181 -137728 -17010
22440 113302 225077 7587 164013 -215657 145346 91069 -191358 123722 -95147 28781
22429 159132 -185513 -79253 41702 231888 56632 137310 59845 -22874 109287 170528 -366164
22417 163174 28277 6074 -138766 -190180 99753 42343 7867 203393 -165004 -162673 161062
22405 -156270 14767 -15168 -54380 -22539 214942 -147202 209840 10942 195570 -169321
22394 280383 -17646 -337405 193385 57759 163978 -293106 145661 259597 94715 -6474
22383 -43197 -22706 -81665 -59653 -348761 73978 -157759 -92204 -392902 46344 -6249 -190342
22372 -190342 -9880 -92328 -121884 -68046 358638 -286890 -37405 -77348 145143 -28898 105170
22360 -121180 187038 209250 69509 -81633 -112622 66264 88006 -196075 -338525 140768 -58978
22348 -118033 2384 -191866 144116 76153 163043 197317 266243 115128 -59159 138832 -209319
22336 11063 67712 -102909 -34172 374676 41429 -49627 -71481 98572 -46798 228058 213419
22325 213419 -66808 111389 33798 78210 -104458 -55614 -140005 -67810 -261364 148318 -104302
22313 74008 -70564 50294 -285362 -50358 -163612 -323924 -303433 104780 93816 256966 139890
22302 139890 41328 -140667 32967 16170 212078 -96478 -149385 14911 -51896 141629 -119704
22290 76249 -57644 411229 -23707 -207290 -179956 -149309 98287 -465840 250146 -8682 -37366
22279 -37366 -128361 -135078 -16956 1073 -157265 78560 -78047 -99066 -156024 21921 -18854 -9422
22266 -252663 169380 -154189 332964 -132025 132863 102889 -190659 -29879 -181297 31975
22255 185046 139740 -363891 49343 -144851 -174123 -252948 -11733 -178077 -272131 -218241 -162005
22244 -162005 -177866 -76432 -148857 -103928 -154294 -85542 -4437 -223877 2983 220674 84973
22232 -213225 165050 17476 -83616 299693 49989 -215218 89165 41935 374303 -230821
22221 66251 58198 -67912 54626 -130238 202532 117369 66032 -80391 10331 239618 -199950
22209 -67788 -79378 -319379 -56506 -151962 201511 -149431 -204029 -454666 -48503 41924 -146071
22197 -168330 27535 265407 -224898 92762 70327 -260261 -123730 127103 27040 30525 164858
22186 164858 -127648 -296343 206745 56835 -96803 360100 -185755 -117647 30644 -137667
22175 -230320 -198785 -9179 -37633 55288 -603 -33045 105656 -107309 173808 -293656 -309385
22164 -309385 60655 332071 -7064 116299 -158714 531 38715 58966 -3737 -82527 -101301 -31614
22151 63688 -44636 104739 14334 -79167 -132305 -92390 -13082 323273 -113963 -339490 -134774
22139 263046 -27031 -118920 19488 85048 8919 -183191 -55717 47884 42962 -96292 2050 -67520
22126 71265 78786 -79535 29932 -242237 -139664 -141676 -192734 -42726 -151336 -22600 -102593
22115 -102593 -349908 -106 23902 219542 -85582 33303 126351 216878 22081 -240674 211899
22103 134555 -38581 151794 100976 389381 -26232 380542 126697 -223821 309920 122864
22092 5872 -385905 181123 15657 10460 116120 232957 306345 302978 -134310 -170027 -377301
22081 -377301 2589 18025 53287 -115209 -300343 -376165 29614 18521 59107 -323167 224104
22069 178381 74154 -101923 -183301 -170664 49046 -141980 -339767 -262208 -59797 -221388 -85787
22057 49865 -98621 64895 -134484 184912 -9384 159702 161709 -88914 -67365 34368 68176
22046 68176 -50838 36681 -78113 -13746 -222479 89554 600360 -69082 71038 15895 -371942
22034 -258917 589369 102183 262402 14263 18389 -332117 206319 39086 251751 -203060
22023 -50696 100160 -42044 -43920 94172 -13480 60369 -414419 -2675 189691 16179 113514
22012 113514 98115 311654 -167310 -116206 -93604 64691 -194722 -147420 -208366 -229678 286086
22000 -111394 9804 -107719 95490 90081 -22041 -400246 -289059 317187 -32140 96509 -133211
21988 317479 243984 -172690 -133639 25165 -197661 -126218 -182424 -258254 -553902 302275 121312
21976 50179 -78581 114168 34318 27076 7677 -87914 -76401 188557 -144521 -29156 -369081
21965 -369081 104098 170012 -51617 98812 -35663 -41807 -149391 85356 -326732 -123230 2863
21953 -174655 -39101 -12204 182803 333584 -121719 -219181 -40547 -295270 -285787 49061 -8122
21941 -290587 142546 -25992 14019 -191009 -2851 -123809 246854 231417 -109252 73378 -187838
21929 83722 -56340 162787 128627 214012 76197 -31844 -68030 14654 21419 20657 -37886 -205157
21917 -205157 43863 -106292 136064 -123084 44706 60713 -257649 -64408 274740 -106391
21906 -66535 21625 70117 -242018 106806 -54865 75408 -109875 -295675 112203 -181681
21895 -28007 -372019 87575 -229854 -229650 -57824 -68259 85581 -100713 18879 21789 -152697
21883 -84476 -13526 74608 -394166 93107 43678 103457 243063 -134903 28850 -97849 -244379
21872 -244379 -128861 116372 227018 32969 -311010 99401 53134 182418 -84428 -127609
21862 -127609 -64941 -118535 -3949 -33972 -414317 84292 -231706 -76580 3357 100828 -148440
21850 53126 17800 -376061 149787 -155308 162716 94784 -40374 65394 29760 -404366 19187
21838 -224434 -19315 365190 115132 -1410 4865 93035 233243 223343 -55197 -52495 -67160 -22043
21825 -533544 -22285 202571 -147484 -500466 -52230 153504 -69668 -65083 64250 -240228 74178
21813 -178574 -28249 -162037 -188316 -282690 -4304 -195344 -131776 163865 173921 95213 -17654
21801 -37868 -117634 -303994 -81155 -111737 -187130 -35010 -143787 305249 -47656 54392 177328
21790 177328 -44333 69347 83796 105297 -138864 129562 261938 -143416 -276098 -180544
21780 -180544 94585 -327657 46648 49752 146488 94921 -213527 -152043 -82285 59732 -116907
21768 -71160 -158560 -141524 72476 161473 102600 -7479 -139085 -25445 211728 43783 48787 -189915
21755 -20527 157650 -258049 -7709 130668 -73153 -320341 -39642 50761 380191 -32435 -29498
21744 -29498 -440988 -223212 -315995 -9082 6577 329814 -143383 -450260 -214607 2939 -139388
21732 -185434 -234958 371447 104556 81084 133953 -62013 116594 -46697 62307 -178708 -103311
21721 -103311 130938 -24046 173288 78796 -135814 262704 41587 -104672 -54599 -84419
21711 -84419 85545 -216912 95339 -406092 -163850 -116422 332609 203866 283795 -349395
21700 -162621 -439997 116757 102790 68931 153306 267172 87157 121698 34512 336491 -359927
21688 162823 91163 336320 228352 -132747 145025 -448428 29436 107822 -187185 93378
21677 -192579 -53677 160368 -279612 36429 99902 -79758 128803 -254354 -284577 264166
21666 -73609 -318816 -52716 14782 -312712 64595 -20906 -266060 339960 -64395 -197181 66705
21654 80795 -348949 -179441 340127 37074 -21105 -402296 -37807 -616507 -64887 -113409 77167
21642 8904 -99121 313018 -145819 61858 -78830 -197519 -78242 98170 -495996 190014 -220544
21630 109570 -75864 -372007 285498 -297116 -62810 -124754 211929 -276635 -288634 -148891
21620 -148891 265384 -132390 -11063 117570 -101380 115616 -224933 -122029 20326 -235586
21609 220155 48241 194403 -282218 -276121 -15671 -431835 -63831 15683 43149 -242084 3498
21597 144985 101394 238224 358838 -300776 -68262 -70742 -379409 -122978 -403705 72617
21586 284975 -11873 66872 -178729 -128883 247552 -148694 -81332 187064 -142442 25330
21575 -112474 11046 -5376 190507 24697 -47624 -253046 -26005 383620 -7410 -139430 44187
21563 205895 330761 -103737 -369534 -135577 -67932 -425439 -393933 85994 840 -59720 -45587
21552 -45587 102635 172430 128113 33211 62534 -115988 22043 -71351 49960 -80525 -164265
21541 -164265 34829 361387 -83258 109874 -36994 -328280 633 94358 -158093 -216468 37515
21529 -54648 -121687 183367 -170285 145710 -191795 -34265 12128 -3943 -36678 -147024 -87633
21518 -87633 76226 -182038 -21088 29175 -284322 -61750 -284368 -997 -139680 -157525 -160538
21507 -160538 -14018 -204212 134179 -23196 205535 -164130 -108580 29564 -268377 -124944
21496 195244 -131818 -158114 -93525 -165623 4013 -49858 37281 93248 -161882 50554 -115555
21484 -140334 -115264 -187546 -172709 172063 -58717 29289 70870 145472 346729 -55154 -227542
21473 -227542 -119674 -19586 -80845 9173 -34724 -178293 151905 -248065 190268 -118320
21462 8016 -86852 49593 -172562 283770 106278 -116511 16949 -126346 -241711 -181911 15536
21450 -141069 196156 -86550 79513 -131526 -162980 203168 18189 183576 11836 166926
21440 166926 -382548 25096 -256089 63961 441885 -103554 52299 -996 -14206 26679 36809
21429 36809 -78575 -263704 748 -163710 176442 -173537 -191398 41438 -531635 -286174 -82345
21417 -160491 -200006 -318813 100544 -88564 141386 95975 -100270 -234825 57921 -13885
21406 223728 136649 -190672 102198 -406798 -342695 -83030 117678 227970 -362539 -220384
21396 -220384 294181 -287601 -267389 -263029 -73710 -152053 -22930 19057 -270578 132164 122234
21385 122234 -298848 25137 -123480 -10419 -80116 -288036 -378410 56073 -343125 -38806 -217044
21374 -217044 -146058 61713 -145648 -289984 -42007 174489 -252372 -71161 -120917 -168195 49304
21362 -1755 260770 -44299 -80505 180279 -23397 -111580 107257 -159682 -21877 307475 1238
21350 -242905 -239754 -80035 91988 -146391 -53843 -190764 247091 315458 -140789 -197089 71520
21338 257657 -4234 315285 32246 329334 -225398 -190336 -207319 -154238 91827 -166641 -236495
21327 -236495 184918 -187830 -100837 -339175 149486 -59976 69368 -91570 -184272 -10457 -222728
21316 -222728 -43422 -120397 -303418 -181174 -232971 40202 -86822 -222744 -294368 -146928 207973
21304 115870 -7994 -218727 183780 -401145 -193725 -58342 -28867 -308139 -13354 -75103 -51772
21293 -51772 -64940 5494 2682 -363924 -154663 -42864 -3280 -211828 -169020 -8173 -355405 -45515
21280 46331 110204 204361 199219 -97843 182891 -282736 -132234 -54697 -177009 75524 -116349
21268 -186537 -26789 -166468 153656 -28015 312017 -247307 -297938 18419 16125 114209 181579
21257 181579 56613 -340591 -9954 -169474 -37027 161500 -22209 -243290 -507838 -14932 21159
21245 49901 -298411 -258250 -94820 271969 325046 141360 7680 56172 -23868 -71356 -212229
21234 -212229 -21822 412454 -31230 -26067 -104366 138043 150493 21236 26629 -86850 132541
21222 -279913 -198143 -156868 21873 -41105 -169457 49396 117720 -40122 -109913 -77265 -203319
21211 -203319 -81304 -250059 171145 -264682 2264 112181 -204544 -126214 -145203 123868
21200 -165895 -98509 -335416 -40198 242637 61095 -257517 -124730 51635 39384 -92364 -177451
21189 -177451 -91600 152482 -149826 -251536 -81828 49318 17334 -13289 419521 69171 39529
21178 39529 32975 -2611 283371 122396 -210021 -17756 52668 -24038 -101520 -106944 -136346 65236
21165 -105057 127569 -441948 155461 121207 -33527 -252199 360699 -359349 -151053 87459
21154 -282673 23546 -195984 77302 94697 -61678 -56080 -129080 84942 219660 -176475 -260474
21143 -260474 -104913 -65908 -353157 -87715 167257 -70265 226534 27830 -208608 239163
21132 -432418 145330 -140125 -137583 35793 -445531 118213 -210741 -232225 61635 144328 43627
21120 -127377 -22765 406210 -186630 -286334 105978 -149614 7239 -417483 -208266 -404790
21110 -404790 -288418 115807 -69939 -84713 -10555 -112036 -61242 -123266 199687 16782 63166
21099 63166 -244355 -28513 -259064 173168 90930 -300596 459283 6045 -137973 -148897 129641
21087 -262265 -236127 20862 -40691 -237489 -112477 174268 -29508 231575 -157571 -95809
21077 -95809 -56064 200282 -152812 27396 152569 -16295 64958 40150 -114309 -3822 -252829
21066 -252829 -277021 188784 188900 -171405 -171838 -329635 160443 -287026 -115840 101682 29131
21054 -170441 108863 -233112 -222629 27545 67595 299778 -126158 -264810 -183673 -65720
21043 -135406 15711 -294824 64224 -53027 327684 -46390 -36492 28393 -89175 -113666 65269
21031 -358542 -11598 50531 29961 -49743 -53047 9318 65733 -173659 156936 7269 -12619 -98944
21019 -98944 119488 -249973 280288 -54949 -274747 -310787 -27195 -48871 33819 -85547 47861
21007 -117396 -140709 281279 -104794 87656 -98804 -90443 -292930 -255029 251555 42615 103042
20996 103042 -1833 107255 -153947 217121 131736 115403 -97151 184092 -101508 -75099 -93242
20985 -93242 -138039 116678 13206 57483 52437 -166211 -55968 -274495 -108338 -159341 -83800
20974 -83800 -172811 -130483 227293 -27241 -226646 196789 10436 234557 -57102 145794 -212237
20962 70081 -12134 -87050 -33392 -100034 44651 -99546 -69315 -337730 -69944 -67057 -8117 -17052
20950 -17052 -110992 119071 -18046 -43595 13148 328591 -166230 27411 -284407 1740 -233570
20938 -61135 -181334 -95087 -198682 -118500 193078 -158173 -71577 32065 -87477 157035 -191374
20926 24645 220027 -460541 237109 -3130 -374723 -171475 -399619 -224624 -224518 175084 -100594
20914 -277043 -76896 -82955 -63802 -276725 141847 -2172 -291653 -254019 17895 -103061 -120840
20903 -120840 -46701 110012 159007 71372 -311917 -20228 116783 26368 -27798 -64301 23677
20891 -295262 -191311 -52634 215708 -226503 -254650 -225471 -259940 -176824 -307552 -126182
20880 -262265 -273870 79767 -431275 107660 -152766 26593 8403 -189188 -62012 -14073 47416
20868 48954 11305 381488 12918 -229931 -44127 1314 -121911 -107712 -251884 -227169 -20693
20856 -228852 103598 -154640 50248 13932 171701 -66850 -180110 -94889 -112533 147024
20845 54756 -212572 -115519 -25707 -277245 51868 44890 -81848 76915 36487 -182640 -18006
20833 -156426 -94999 -35879 -118012 -181546 100054 74778 -100418 254994 -285311 -45070 233909
20821 146299 -16687 -215722 146776 -157237 -232037 -134543 -55591 117986 132489 -56363 -134683
20810 -134683 155756 -33852 -203279 91280 11003 -188786 -166797 98869 -82289 -145453 109746
20798 153436 -178338 -16584 -9693 89315 -94358 -27673 -155786 -183971 162745 -17146 -345549
20787 -345549 15922 52639 103126 64241 -233028 -66066 -252995 87178 178156 -231263 398692
20775 -115461 -119409 -97267 416560 -281952 66652 129817 212904 -92895 34722 -38854 -53769
20764 -53769 -240845 -146505 -118112 104714 -3381 -104648 -648178 -16724 147287 -14724 68194
20752 335599 174142 4982 -7197 -67205 -131614 -332618 -64223 85326 -133085 -374434 171597
20740 119456 -206976 71617 214948 -20759 -99776 -400157 90101 -28642 232277 -41653 367123
20728 -305184 -231159 -24058 104284 -199365 -146094 -128696 -123004 -184550 175666 -196337 52002
20716 -27789 -99058 -175910 208328 271994 -53703 -377340 -338001 126781 -108307 -146161 370407
20704 -28341 -128645 223164 74417 -93104 16776 -64286 33555 -335499 -524567 -117956 228597
20692 -192868 -250782 -231871 -233554 -290222 -51042 83492 -129135 145128 -117731 -13089 -377111
20681 -377111 114274 -167918 -285474 -67314 14498 110751 -7536 -94413 19561 -215817 -322225
20670 -322225 -186320 -151478 -3627 -25155 131727 -45067 -62211 168155 -306518 46680 -484575
20658 -346419 57659 -54821 -58246 33868 -138163 -206723 -341788 -205044 -277357 146806 174016
20647 174016 -96167 -146262 56086 -179446 -357026 -344624 -408602 -334436 -111187 -43112 246628
20635 -68974 178103 -94408 220018 -171247 4932 158118 -444252 108380 -219280 -19156
20624 256066 459485 -52215 257359 -68051 -219530 -157268 -150683 -428537 -45912 -240031 -382857
20613 -382857 -136968 -108153 -60595 -102020 -100187 29018 -159764 -19941 327104 177767 71651
20601 179838 360058 -116896 -161877 391199 59308 -141893 25031 46557 -169339 -321264
20591 -321264 -80275 115944 -34933 168661 -6040 -163863 341793 326110 159239 112252 199355
20580 199355 186729 118963 335616 -115521 16516 45241 -118886 10938 -105858 -376674
20570 -376674 138821 99881 130543 180662 -40221 5544 -30987 64247 -318996 -104176 82528
20558 161786 124215 -167336 -75287 206963 -68090 -44793 304517 -324844 -111537 -166510
20548 -166510 273260 -173443 69504 -272743 -161330 -184615 -64390 -26405 -123238 147508
20537 -121067 -11938 -309280 242711 114452 16009 185484 -25399 -86364 76467 118632 225128
20526 225128 -55391 -77849 33957 -27905 -124842 -165351 -10969 -172638 164084 -125252 -22710
20514 -64016 84395 -468708 -93697 -50790 -304902 -151139 90180 -95714 13438 -40160 -17520
20502 -245478 -246467 237521 -415780 -161352 125084 111658 81165 -186820 -325029 -57466 -48897
20491 -48897 -52803 -96100 -90048 -179153 44663 -6738 75814 52784 224264 170229 -43951 -191870
20479 -191870 -51175 -239279 77155 -104001 -101477 -120717 147317 -28978 -131578 198715 -158813
20467 84876 356228 -197730 38456 -10625 -273972 -214489 152625 -214561 125568 -132370
20456 118004 -107909 180729 271703 -382365 17548 -227431 -162062 111727 -40084 -192440
20446 -192440 198272 -164989 303490 -155095 -67142 250077 70265 -28937 -33079 -964 -153318
20435 -153318 -52843 -155880 -225914 158296 16109 -121039 21948 -161408 -40899 -248175
20425 -248175 -16938 31987 15664 246980 -90909 -311834 -400523 -347634 72490 -147476 55630
20413 1067 -72848 -390809 111982 -188617 -267322 84508 208695 347345 -68723 -76288 17532
20401 -94368 16820 -136150 -213684 -134368 -133495 -57466 -212027 -240937 72207 126645 -79221 -117021
20389 -117021 -194785 173839 -285281 -176006 -290950 57931 -120268 161270 -230016 -62317
20378 9509 188174 -5971 221469 314270 -93861 -196706 43420 6208 -321669 -352565 -155771
20366 2529 81303 -1796 -169552 10966 -284492 -148259 31286 23052 311212 -200393 -194599
20355 -194599 109450 -106729 -70875 -24530 -154974 -146103 -96365 -71371 194496 -195697 -110209
20344 -110209 110527 -309484 -14444 174944 -101041 -81548 156664 23211 169177 -168091
20333 -194073 -125552 283939 -205668 9235 -214709 63758 49 4732 88133 200997 -195723
20321 -278569 7910 237610 63176 -113301 -95277 66488 44938 212222 -164193 -311572 45782
20309 74477 349700 172993 -37582 -119919 -11420 -142510 -203249 38156 -232474 124695 -136078
20297 -141424 112366 -76659 -129727 217090 186098 141900 43720 -39798 238227 -191798 -238274
20286 -238274 -167721 5554 91091 -142919 -49528 -149222 -57231 14632 86085 11123 -61141
20274 -231863 -187702 -76562 -224879 -502238 -132790 101116 -258894 -28068 -189607 52516
20263 160221 -175007 -254635 -61806 278895 -197101 -262796 -237629 188573 -347436 64926
20252 -205313 -43545 -175133 10865 51366 109512 -268343 -42852 -17800 -43529 -129431 -136025
20241 -136025 6117 -173179 -147307 -152377 128891 -177862 -250032 -455446 11649 -3278 -304774
20230 -304774 -72196 -63555 165392 383701 35380 195957 -144514 -36829 -136430 154548 -177783
20218 25109 -152915 -239266 -94875 132050 -210268 37689 182403 -201630 -345977 -224080
20208 -224080 -13763 -456861 103814 -310987 163587 -618632 -62265 -144559 168047 -360708
20197 -128869 70320 -288036 79100 30 -180698 -131638 140644 -225309 -200418 -168747 -204207
20186 -204207 88190 -175019 2960 -237810 16092 79018 -33562 263369 136691 71187 113267
20175 113267 98572 44907 -164135 233657 -161050 -311975 -150338 -144845 -82274 88707 81605
20164 81605 -232447 -29912 -161509 -130079 111281 -125309 92070 -247669 -10736 -73165 -282399
20153 -282399 -262941 145379 93872 -239960 -95916 -34658 -513635 -275935 -10681 159753
20142 -62353 31003 -8810 -89635 93754 49746 86429 13099 -21822 -82484 35923 -15788 -187161
20130 -187161 259945 166137 45528 219104 -313135 -181891 -246862 -80647 -361679 -33811
20119 -228382 -329909 164352 -536596 -65757 -44005 -96341 -251236 -91969 528498 393908
20109 393908 -226001 80255 53134 -49207 130031 -358967 -39118 27382 -307161 -282907 176250
20097 153493 49705 -62317 39243 118934 141702 -139084 111526 -297247 -280021 83793 138770
20086 138770 -129783 -119917 73471 -271725 -280637 29306 -282020 -59456 130552 7576 -279348
20074 -9774 11134 354718 -210048 62459 142432 92432 -77530 309454 -221697 123826 -49646
20062 19366 178163 -88842 -277464 -233979 36456 112650 -178449 -217911 66573 55117 -4946
20050 -159123 84206 116787 135635 261906 -365424 67735 184041 180018 -65580 135191 138154
20039 138154 144465 -178368 -371608 -98161 -82597 -181600 43436 156371 48029 -18746 164256
20027 -274668 -186577 -117612 -246167 -125422 63674 190717 357560 -64832 292454 -123278
20016 -373329 42684 -179628 -101124 -133349 -205786 -286193 -390425 -270152 130018 -137013
20005 188968 -125428 -144763 -170175 -253661 209535 -46515 -193569 -99791 -459797 3806 11990
19994 11990 -71916 -40788 269552 8682 52514 -80886 92689 -5742 -63052 189280 -16027 -194652
19982 -194652 215485 -192766 208213 260678 17943 -27179 -82927 254496 -201726 -135327
19972 -135327 120081 -342849 -307207 93316 -261364 -244181 -198343 -162999 318547 -111833
19961 28158 -188653 -19236 250674 204442 67036 -251076 255422 116948 -187121 -136800
19951 -136800 65205 -279963 139647 4693 -59099 233855 296283 -113043 -63831 67718 -103223
19939 -348327 -147999 117985 13576 51504 -355297 -224724 -254831 -42485 83466 -177873
19928 -183957 -233454 332733 -33646 -120491 -317230 -93639 103395 -318520 -175905 150742
19917 144994 -4615 1534 -646 9729 -218184 -68060 302339 -427494 -365928 -23960 -93385 16639
19904 -180805 98616 86208 59498 257972 -108502 -130101 -334306 -70918 174620 -42865 115313
19892 79693 104115 -161808 -64722 -75161 41707 -112366 54348 -100329 -170560 51344 -89089
19880 -237969 37226 -574435 -88838 25176 58592 -60596 -67234 -214966 147523 -175722 115446
19868 -24514 -91009 -199232 -191872 -66312 -257207 -243411 -10690 128165 -180947 -30945 -192669
19857 -192669 -178528 19535 -68241 -252903 58659 -71941 49515 -88530 34097 53431 175782
19846 175782 -40869 134825 13509 -83090 -108610 -187561 -305709 -151799 -206719 188306 -258161
19834 26616 -328904 -9303 -343768 252447 -310590 -779 144732 -147503 88553 -54516 21056
19822 -53379 -104615 350453 -24964 -227203 -90349 -253506 -409199 -110661 -323484 -39312
19811 24002 -445222 -157132 -141291 -254631 9484 -116168 -96320 -81366 83682 148066 169378
19800 169378 -207586 -83613 22280 177703 -111843 45326 -78796 -23058 -71874 -2254 -195522
19789 -195522 -256009 -326145 -139113 -401224 162353 138511 246404 -34185 -364105 47209
19778 -62390 66205 -126599 -52878 -231839 -227036 8417 -93450 -175993 115567 127739 -286417
19766 52981 54263 111557 -37073 203058 52445 -135897 6033 -111957 -144241 -96918 -25232
19754 25174 -125193 -97841 96147 50890 -116945 -102940 151105 -488660 -73186 -58314 5407
19742 -165406 -374487 -85878 156311 -105933 227536 349987 226452 -181019 67787 -55539
19731 -25670 -110669 58368 -38590 46624 -18431 135221 13881 -54179 117064 167203 -93822
19719 229541 -228756 66228 187648 -51612 -25202 -94665 44736 -693926 -34912 -110205 -275771
19708 -275771 375034 77607 -27975 -133867 -69973 -23059 29154 142594 -549151 93496 -102735
19696 -153310 -116741 135239 -31801 -138369 155609 -147370 328034 -171587 200770 46386
19685 -26431 -76212 91022 -362627 -80897 -59709 -223000 -153728 20613 -166395 152222 -118403
19673 -228314 -405048 -68763 -5171 134785 21024 -154714 26438 -351020 -20156 221613 -90758
19661 88266 -128024 -15913 -63383 76250 -119676 -566325 24625 -12641 -72600 -200012 -221236
19650 -221236 69162 -86770 -67319 -405590 -133749 -331310 19836 -151553 41736 276603
19640 276603 134409 -96007 -272980 -215096 -200225 169648 -87678 12254 -345771 -391585 -72825
19628 -235529 -110072 -108502 2958 -274386 30870 193320 -219785 -218053 -310305 76449 -117045
19616 -115868 22907 -181508 8909 -170956 254430 50872 -334394 -131541 -70063 -142907 14774
19604 -36688 18761 -226099 42640 -159348 129434 -167430 1518 -513945 -324031 -55209 119029
19592 -66300 -121839 -68076 -140173 -135609 279148 -121854 -222028 222787 -142001 -184929 44526
19580 -276143 -44042 99230 46955 -288051 -13221 13328 114785 -80005 394785 7181 -232649
19568 361520 -212029 -123132 -79063 -21990 -164674 -7962 -140397 -67652 -146829 8273 -178806
19556 -80238 -104936 -9545 -359181 -20882 34024 -174134 228042 -286951 -197365 -14948 -326563
19545 -326563 247729 -98786 -158136 -143006 301778 18369 -285339 -101824 -167134 -223938 62749
19533 -134227 -317740 -23172 -304089 -59793 1893 -202192 52107 -35897 34087 -108493 7171
19521 -75088 109108 201468 179564 -199340 183078 -26102 -269296 202940 -221753 -345508
19511 -345508 39459 275901 -194818 129059 -127510 -132936 -64987 -104642 58409 264984 -154306
19499 -233500 342443 -14818 200644 -162185 47511 79425 -84228 131949 -103676 -287512
19489 -287512 39131 162350 -166425 386104 -82018 246920 65427 -42124 155119 29827
19478 -60487 286953 -43412 -205158 -147261 -254314 -165637 131423 -182762 -70248 123463
19467 -299090 -177828 -28658 -193176 -174595 31183 145120 138748 -285525 -148510 -37192 -87113
19456 -87113 -258628 115855 212272 -421378 195192 -27866 -199928 -418365 -1685 14056 48343
19445 48343 -266041 -57833 1879 -32715 -51971 37702 -198392 33208 -227170 51788 171325
19434 171325 -110129 122436 13010 -50164 -37511 188526 169979 -240895 106281 354024
19424 354024 -102882 -210158 -143562 109825 102422 -199071 37905 75767 -17147 121110 -246134
19412 169134 -212516 -218562 -186626 -250118 -66978 -74304 -102451 -101363 -142765 136919 -63321 84717
19399 -64226 -115321 -12531 -542457 -245185 -164699 -72824 284706 -539739 75959 -195923 -344988
19388 -344988 259264 -330297 -82043 -302480 167425 -268506 307709 68153 14424 -136899
19377 -12613 -167507 -500746 -240540 -197971 99773 -103646 -188992 -253926 69009 -193499 -162086
19366 -162086 -1454 -183414 -46342 -55572 47366 135781 -104966 57828 -248818 -257486 -223745
19355 -223745 -212811 -16208 -23911 -218613 4410 39416 -232263 -463645 222920 -186450 -172
19343 -470924 70464 9173 -157780 -127589 57284 -5257 -26634 -259038 85059 46982 27401
19332 27401 166016 125310 -294881 -84955 306690 -21822 5402 26385 -8592 141385 -151758
19320 -256803 -48370 -23501 -356173 -107568 -826 -13789 93191 -91988 -42494 -195733 -526154
19309 -526154 191530 22447 -137558 -104067 19571 70460 182847 256190 -160434 283231
19298 -176830 17391 -94432 -177308 -123958 218462 12660 -172934 -23485 -86385 10050 -253966
19286 38416 -284033 72154 156885 -188253 -26772 -114684 -315317 -189049 91445 20355 -66114
19274 -201470 -199398 -147771 -303656 -31109 44228 -73760 244672 -10515 122813 137916 131938
19263 131938 93385 -62731 -55661 94050 -264388 -447598 -121582 -308540 238610 -238441
19252 4916 -21141 -114891 -21517 143397 -353424 101304 -295754 208366 23460 -4721 -127253
19241 -127253 -393701 -298700 -260394 -285823 -28380 38323 -35589 -95901 84385 -79753 13240
19229 8197 -245533 91512 21356 99289 -107018 -317155 -10271 169056 -141589 -72231 131452
19217 -237688 -197682 72344 -213148 -61108 152742 117970 -240331 -208452 -242350 39177 187343
19206 187343 -54835 -68653 144734 -140003 -115705 -146680 -91692 -266984 -185987 -67521 -203024
19195 -203024 -60357 -280604 -244901 -155505 -71911 -139142 -11928 108976 7168 -93261 3863
19183 -22373 125271 129377 56743 -392990 -260275 -255592 208838 109427 -129147 149176 15798
19171 -224165 -79392 116817 100682 264076 -126305 -8156 -405657 -330469 118685 3151 304783
19160 304783 218618 303653 -117885 120201 -185795 -15913 -421192 75899 -318523 -320973 -40849
19148 39775 -39884 66874 -124043 -102588 -10124 37119 16120 -13797 -108450 -98913 -77628 11381
19135 -271096 88435 135602 -43984 -90269 186703 44788 -80762 -5474 -391174 -384323 39950
19123 30613 -66407 -373478 -190429 -139009 -7349 -377572 -63676 -184568 -110971 -143341 101123
19111 -65020 -366995 137069 -180781 -176962 -7233 76403 -23333 7377 166501 -173347 -157127
19100 -157127 128240 -154676 -284497 -167142 -162537 -40011 -120168 -154915 -130888 -178945 57319
19088 116865 186272 158554 -207996 -79132 -209442 2625 138299 -361448 -328260 -29581 -110999
19077 -110999 -54322 164951 -76690 -79043 -18100 -29871 6931 54122 -366263 -237491 -25792
19065 2521 -27357 -388158 254326 27509 -199997 -125893 318166 212889 -184959 -207610 -168842
19054 -168842 -243042 -81295 -440879 -46680 -193019 -67407 8297 -108658 56786 65403 135278
19043 135278 56103 89919 -158451 -125641 -71471 242209 -184549 -245990 -86440 -31556 237525
19031 -55301 -212086 -75841 413805 -86165 62414 88484 -244207 316837 -139555 180709
19020 30347 -43701 250932 -199174 -216002 -133797 -248394 4950 -74409 207466 -271442 -5416
19008 75737 -196324 -84628 11044 217639 343561 -232265 105313 -87481 -155727 14079 -304177
18996 -153281 21375 -156145 -167674 -47439 -218530 78449 -20211 78402 -357878 -376555 -68521
18984 -225084 -141739 -148381 154483 -146515 -2038 -161997 168519 14722 253291 -14555 36983
18972 -70263 -3227 262515 133917 331099 -101364 -170812 -40015 23488 289959 274511 44747
18960 -92140 -202542 92846 -62861 -112078 -115862 336845 -123045 -198749 -174218 -18258 292852
18948 115565 -591115 -163986 -162563 -143988 69175 -357082 145712 42256 -146629 -112552 -135569
18937 -135569 -166081 17928 23601 -105527 167894 116390 110541 -168648 -63030 -148874 126989
18925 -148251 -32553 -157258 42781 -16431 -168276 -245087 -249881 -144893 -70796 229431 -95630
18913 387894 249779 87425 280716 -369797 209041 -48051 -257750 -129803 27818 -1994
18902 171004 36467 -217132 -251629 -96830 -277210 -297296 -200899 -132642 170417 -63961 -184690
18891 -184690 -201956 -452341 42923 78419 -154239 -276189 -66017 12161 15862 -290727 194852
18879 -2290 178580 257465 -38808 41261 203839 -79175 -281216 -360908 348959 107466 -52023
18867 -209003 -339717 -124938 121970 -159900 143201 165363 -240132 -328613 -77854 -46635
18857 -46635 64685 166457 -262902 -15759 -238196 448861 346029 -133950 168658 -167071
18846 -32435 -38521 -166191 -254380 94385 47719 -276174 -205282 -62698 -127996 -18049 -237307
18835 -237307 -120784 -124847 -257711 194402 26749 -234040 -110362 896 615398 8794 179761
18824 179761 126167 -406077 96290 -97376 234427 69467 78441 13471 306 204321 299295
18813 299295 119758 468617 188394 -276806 -83374 69423 29006 216715 -68830 -74425 301924
18801 -56198 103809 -29727 -1397 -47368 -251932 160264 70029 274277 -315494 -82045 -287928
18790 -287928 -367980 -70794 110597 -55268 -217505 -236023 201980 -39487 -350004 20417 -21904
18778 -352378 -25262 -171803 176679 -90722 18089 119317 291270 -340077 -149047 -185332
18768 -185332 93037 -145827 -63473 18690 230787 -37254 -134520 -414577 80105 151221 -123688
18756 -45791 94556 124815 62792 41292 -245926 110923 -122192 172034 -150259 8456 474267
18745 474267 -395251 123845 39268 -79854 -122741 128987 -192421 300217 -310504 -75534
18734 172840 -229212 -62791 -207574 74449 -282496 -105791 41181 -45168 361835 -285434
18723 -259251 -90119 -71655 380881 -97038 206941 -221323 -242993 -229511 -6179 -29173 84047
18711 -271935 75991 -48136 -220085 -140245 -439490 -151010 18991 -141786 26626 -125945
18700 122233 -202946 98894 -118309 -63009 -302097 -285241 -182114 -56871 -171067 -47834
18689 148236 -176757 -195760 -28548 65240 -166531 -218458 -309328 32597 -216309 -57986 77184
18677 31476 -327193 -163959 33462 -44320 -672224 -118093 198647 50379 90049 -280143
18666 276812 -2670 -26136 -59119 146767 -282079 -149896 -39728 29305 -48548 16484 138420
18655 138420 -32548 39212 -4446 181678 -50564 -92818 -119391 -15805 11620 -432578 47934
18643 292041 203207 -239363 -212950 -388665 -228692 -22509 -255811 -60024 -108920 -113483 69993
18631 -29111 215480 -136769 -27978 -94744 81963 -323803 -20197 -342305 187397 34808 212974
18620 212974 14785 -167006 -166571 -47490 -7217 -47185 263849 -125926 216985 -18924 -300268
18609 -300268 -20492 121610 95093 -224620 -122884 -84879 74077 102716 -201565 -268968 -139265
18598 -139265 -21094 -400837 213150 -98699 67296 -103512 -73050 -118364 35436 102444 -118986
18586 -131882 -241087 189043 -66704 -968 -121710 -114989 200409 -187971 -260635 130968 -35522
18574 -323707 27656 -70502 -249548 -114920 258149 26893 62778 -34565 -268318 -64125 58722
18562 -36502 -60001 -189197 -182022 51593 148382 -289648 -221052 -296845 -172808 39104 57919
18551 57919 -42946 -86336 -73065 98247 -164841 -53027 -73333 25357 20464 231742 95305
18539 69404 4823 -29459 125408 213135 -306588 -70332 -35008 -50198 -66857 46106 -205045
18527 90942 90702 -93051 119 -240535 136321 -51232 -1778 -29244 40075 114224 -233504 -438500
18515 -438500 -244777 89044 184361 134207 -322595 -212866 53231 -110981 -39340 205840
18504 -329906 -84337 -4959 -61392 8257 167651 -90683 -86215 -122217 -343548 -485583 -247045
18493 -247045 -163837 252018 -25162 -95063 -99646 291736 -222662 74576 -144289 -159018 -21761
18481 -289066 -142178 -21491 176432 -393877 -274278 164704 17913 56426 180558 -106535
18470 -279230 -141790 14130 139764 -63913 46588 32890 -118512 -280897 147815 -273645
18459 -64558 -244074 -132827 -161268 85434 -3094 247363 -82978 -2820 -303784 -91667 -8918
18447 59518 149812 -152685 140188 151938 -64355 -147575 -91659 -237732 17078 181166 -156763
18435 -194620 216961 -10057 -484258 117332 62345 -240463 24641 -226349 36814 -211069
18424 180649 -40398 219160 -130244 -346015 -35499 -246245 -49366 -223468 -590375 -301345
18414 -301345 -155905 -26851 -27115 109401 322870 187185 -88630 -370228 196119 -113301
18403 203428 -122261 163513 333547 -58425 -212087 -334626 -119275 169518 -28067 -184547
18393 -184547 -122277 -180718 134391 -244445 105053 -194422 233288 177903 -148757 11757
18382 25678 -124017 72119 207166 -222467 -300373 -46003 226965 155531 -103823 63938 -32555
18370 -278475 330420 285593 157714 136779 -48126 -122868 -151262 -101817 -125812 -88809 -109813
18359 -109813 -92390 62849 -94312 -40743 -229445 -150832 -220530 46640 -285476 103401 -181746
18347 36109 -123695 -11731 46197 -133082 -160265 -146758 47207 -8802 -71529 -170413 37378
18335 252646 -64703 35296 -7906 -200522 -170268 21530 90584 2532 164769 215227 -73348
18323 -225036 214491 -67606 59847 5932 136996 -142541 -135979 278332 -11404 -12416 -108889
18312 -108889 -167860 -28869 -107407 279896 -75153 -90020 -290878 187708 -118834 -344196
18302 -344196 47402 -172016 -65391 375603 -163631 -217643 138094 -61673 -85724 13818 149122
18291 149122 181672 -159606 -91720 -420803 90028 -183714 300661 -73447 30292 -149507
18280 181400 142109 -103169 -204743 173594 125679 -7702 187673 81200 68288 278059 -219296
18268 -168916 136242 -205891 40094 -279784 77877 -86748 71609 77831 -342392 -139781 -107426
18257 -107426 -10687 -32105 63516 -166514 65003 -304973 107133 26114 -297481 13015 -95949
18245 -128567 146701 -13811 97258 -57240 190035 253940 -396721 -20116 82961 -176763 323724
18233 -9839 24952 -212834 -165516 1313 -79152 320464 239185 206574 -256125 211173 -20850
18221 131043 -34721 -215020 -175234 -96249 101574 -274801 -325664 62797 161766 -176865 -204994
18210 -204994 -43009 41170 -42462 151856 85370 121099 -72369 -279229 79854 277334 -178848
18198 4200 132486 133472 123388 -45223 -207578 -89082 -148976 -55770 20134 -282779 228043
18186 -186969 14628 -45002 -129209 -27845 -109788 200828 -176729 116892 -263960 -283191 422316
18174 -111694 -336675 169514 -141220 134488 -417562 32761 157634 126850 -36084 16694
18163 -394770 -13961 -48098 25701 -91497 -80095 -201498 -186694 -230675 -191135 -38546 -42735
18152 -42735 -176444 243515 -8690 -302624 -158576 52901 195552 -372013 -64626 -127176 -79180
18141 -79180 -488829 -75815 -81956 101420 120154 11019 -37111 -178738 -387443 130992 -18096
18129 -201748 35563 -114699 99722 303305 -364493 -162183 205573 -1914 -63388 108594
18118 -32211 39911 155100 -43463 -85896 277002 59431 -77584 -306688 -196145 207071 155138
18107 155138 -105699 -134810 -32759 -162399 -143968 100224 -339394 -95830 -182386 6824 -6251
18095 18472 -14273 -17357 145981 -476959 -217639 -28388 91716 -54435 -206274 -66700 -184032
18084 -184032 -258070 133362 63396 -154801 -285212 32474 350222 -311233 115373 -153603
18073 -242652 -39808 80873 -115739 -49957 167478 -173792 -173245 -377486 -231108 -15524 -44287
18062 -44287 -146730 -245285 -164906 24581 -157381 -419383 -128865 -155790 206629 -67292 -94855
18051 -94855 56373 -192015 -86306 11711 236026 -101082 12904 -87680 -144010 -158407 -100568
18040 -100568 86879 -201865 -94587 47012 59217 -162981 -183551 85875 -415941 -149899 -1438
18028 -108178 49277 22147 376240 284781 93383 -249462 129947 -201450 3112 76073 4595
18016 -186820 -67504 -156783 346107 -205248 -208666 5229 -274594 -8791 86091 259009 -315045
18004 -194493 90087 -318683 -191008 376471 63461 20703 -14696 -240719 38177 -115814
17993 -21563 -145748 -35323 77038 210412 -137477 -132343 -68580 165372 21963 -6591 135357
17981 20213 -198015 -155037 422194 -189459 -233658 -178442 -15440 303604 387132 82405 5569
17969 -153765 -264562 -404635 -149661 -281655 -233802 -177099 -171276 -90570 156452 -90296 167936
17957 -173172 164799 -56978 162852 178290 -71586 -328992 -114967 431435 406804 79069
17946 168942 163772 -196341 -161349 12826 10466 38373 320596 -414998 171158 187545 11455
17934 -189517 286235 340355 196597 -284440 27848 -43325 -158466 226680 -217138 1875
17923 117174 80529 -146559 -61766 -220384 124324 -269917 10230 35972 -113345 -147236
17913 -147236 208834 -29991 -201747 121297 35647 47561 -49 122171 -291381 -33155 -240826
17902 -240826 -56651 -83299 80182 -125572 -8238 265370 228291 85016 -224891 35180 -300105
17890 137213 -64792 -185801 155423 -465174 175415 -111684 19689 -118128 -119567 -107114
17880 -107114 -38317 -37426 97827 -132129 160395 215567 200059 -160838 -53022 -153969 -62492
17868 89125 -187459 73557 -158733 162870 -384627 -43094 -8433 -6022 145265 315588 -194616
17856 215087 158648 173735 25500 4849 179675 -127160 -381073 62961 18465 128934 -110961
17844 -224656 -152317 -130897 -66269 185486 -96498 -136796 -81811 123989 215524 3915 -39291
17832 -21609 -360896 -256313 248056 182750 -139515 76192 159798 16166 -218577 -261056 -96839
17820 -280396 -180454 285549 -317821 221192 -255482 -93393 -18775 186934 -22692 222680
17809 -178769 -376749 21350 119601 -168586 -76206 361441 142908 240894 -158059 -201470
17799 -201470 171687 -204005 -139239 163704 207479 -90399 -43780 -91119 -78367 89661 -277253
17787 -8477 119501 -144298 -489231 -169025 277711 -270505 -219554 63275 63263 180283 -480816
17775 -273416 -101791 -77393 359096 -84060 -291816 -78030 -92694 -149645 74379 -76840 -341925
17764 -341925 -49703 -175660 -232290 265382 32664 25433 -194151 -274316 179877 -29432 76262
17752 328980 -143478 71338 309159 -431948 215320 143477 -10239 -21431 85404 -32613 49058
17740 90763 -153133 -292003 -168390 105748 -104576 -176151 -111379 -402665 154663 192854
17730 192854 -92233 121956 -40099 -30507 -19987 -325828 101966 -47209 -187063 198065 -105041
17718 -110126 -259949 -111226 37312 215350 -66987 -113693 -136342 321126 -480391 28103
17707 370819 -59808 -135181 -111658 167216 -56671 -176053 151982 -33415 -19979 44631 -72279
17695 -179402 -463666 -14087 150043 418865 129117 165392 -32302 50448 217844 62679
17684 477592 -154721 277287 -275086 -129744 -86987 71354 -172591 -168808 -103239 71962 23806
17672 -41066 93770 85630 246008 97625 136722 -63463 54258 -74988 402175 -292958 129543
17660 -220685 36072 172649 156413 202676 239096 -159444 35067 -265768 388326 -6785 -415038
17649 -415038 314662 17896 118747 -87281 -123513 -270641 69632 8782 266021 -32534 -7974
17637 94908 137891 -239455 114840 -298114 -53918 234949 -110351 114663 -31835 -188281
17627 -188281 -80458 105953 340410 242603 278588 68150 -117663 27523 -25802 218945 -255285
17615 -166398 23816 92449 150367 45617 -329699 266657 -12761 221366 51806 127127 -91579
17603 507754 281371 207008 264967 58322 -220031 20448 -16209 54369 272282 45121 -130047
17591 50820 1464 240629 -226952 -82218 45209 -84296 -153393 5612 78636 293732 317833
17580 317833 96763 81003 268979 -197707 78866 -224266 -233061 32275 262702 -85548 88710
17568 -152629 -43295 393375 -119230 201014 -76107 -130106 -301972 139975 55158 -59417
17557 -256155 102381 85944 70040 12158 197984 -129944 -65371 -59649 -187583 7623 103404
17546 103404 223732 -146705 78619 114169 111671 -165473 -19280 -54524 249932 -108103 279081
17534 -529687 -330670 217039 274119 -180046 210244 11831 -81905 -83448 278468 83132 218395
17523 218395 95180 78639 63440 -18406 103385 26557 3242 28359 12948 161287 55354
17511 -20302 -18649 -125548 26282 317463 -505729 73376 108475 -257014 -92430 242058 79494
17499 -60834 72861 -143893 104186 -126096 17263 205241 49967 113915 23673 -159240 41224
17487 393317 183345 281575 -141525 232999 120395 120882 41361 18130 -170027 -51108 -89397
17476 -89397 150294 -167866 78392 247373 156662 107284 47176 -74469 -156922 -16703 -8057
17464 -28119 178181 119699 412066 -97633 271193 50321 -103504 353448 438014 134519
17453 176228 323125 245999 357617 335056 262119 170715 194472 96101 342491 158709 278836
17442 278836 85714 56219 202093 320895 371446 451013 189891 181938 407600 160152 214511
17431 214511 259391 84719 275463 22213 185359 -22210 511736 219684 267280 -90945 284633
17419 4751 69028 481137 225399 154388 38630 11337 432522 61096 247519 332903 311472
17408 311472 218143 -378551 -28767 23867 -8934 258311 -82188 237492 129530 -55237 321854
17396 489871 205629 324305 374993 259058 208587 229694 -220181 89225 159321 192444 287038
17385 287038 -109700 242239 344351 182365 475660 -164659 37175 199486 83803 146069
17375 146069 44998 44899 9058 340819 25925 199279 -51771 66891 432475 119453 230859
17364 230859 -193222 -110562 115070 163492 181939 101458 -59851 -85348 68372 -93302 140132
17352 177396 244836 106754 61158 382057 219671 65485 483254 -107773 159151 239011
17342 239011 541129 -37192 58591 83478 139688 216211 141491 5726 228973 234064 78569
17330 -142227 -93067 -133621 212113 199149 328390 35878 -304283 185907 116872 55282 52711
17319 52711 28787 248149 10292 444842 -18540 168425 -66685 266009 55924 150021 321774
17308 321774 -148241 282479 17689 234791 -45258 100098 21182 153964 196517 38085
17297 66100 324211 345678 80361 32778 334814 7039 114118 178564 236582 278645 133916
17285 57424 254473 -107638 308008 162157 411239 278205 128095 73390 186516 35516
17274 168011 503197 -216078 266096 -179725 46528 -375757 186015 -70812 298813 -53894
17263 7714 -61989 150662 156660 124760 388358 155310 146046 97621 78514 94938 430365
17252 430365 -74237 375619 48334 204068 302896 218415 69829 293998 81352 -2428 265810
17240 204445 -53428 84968 143571 -124396 103937 26622 -26545 -63439 237737 -11320 -69652
17229 -69652 6294 -39500 84976 -38344 415801 109736 212630 75380 -2808 167450 141280
17218 141280 198772 239286 279206 118624 269402 230371 -7029 120725 -137765 97877 32380
17206 148414 104902 25503 522484 262343 34007 494633 5980 219462 -118838 75370 419549
17195 419549 154859 124752 179985 82971 210306 236164 213673 514963 -12883 432099 284290
17184 284290 351531 11136 203726 263124 563738 275865 344897 313342 38909 282755 163024
17173 163024 143277 330385 278232 62043 217275 122100 407382 168312 128271 387706
17163 387706 798 -60534 -51053 287029 95771 47917 354019 224424 346928 -18961 332411
17151 73244 116624 419384 324602 1921 308676 240490 -28996 212332 86973 -18518 538633
17139 169146 260937 396490 -25639 -63855 142983 230881 455680 89654 162335 30676 427894
17128 427894 -85463 191873 81194 22657 60412 418716 424988 209385 472609 406988 328784
17117 328784 187815 67285 -105857 339557 376111 134774 68088 432336 243411 -69920
17106 183526 202542 698802 452724 516225 161018 49328 277937 232363 308212 110548
17095 361282 185095 359441 398786 242400 -152478 163195 392960 486515 437984 279612
17085 279612 327714 285103 299715 305332 102059 419231 264751 182329 303690 221832 403760
17074 403760 234688 533047 429712 491403 317350 -56544 405735 703180 367328 134388
17063 534745 388617 158657 404639 218484 402636 456034 531710 475062 277546 373793
17053 373793 600923 497575 292722 601294 515921 9451 447561 270345 571345 322345
17043 322345 462230 737855 270505 318706 439905 359931 525921 609241 242752 652624
17033 652624 588753 225651 541171 530118 404226 532354 335048 569225 658157 445454
17023 445454 584451 401173 352536 739493 565439 641929 543147 551778 720740 420239
17013 420239 502610 648782 435907 352409 521096 750515 716164 628277 489293 843272
17003 843272 717899 798418 888033 739211 447123 463049 539559 803122 910563 649180
16993 649180 713027 840271 723685 616250 300315 923152 801784 831907 632240 742178
16983 742178 670600 966510 705523 669525 774802 583303 738530 747140 924888 541548
16973 541548 645862 344930 730831 784062 1114674 829404 578206 814449 936456 877729
16963 877729 1199088 823704 748629 741988 631414 774043 958867 866134 951102 965443 735738
16952 735738 966574 888035 1077149 841689 1145465 840242 1190717 797722 874503 1211972
16942 1211972 978942 726511 744784 706445 979044 1108324 1214697 1044530 1020998 860496
16932 860496 976908 939942 1034813 975277 1103101 1051086 1024506 937174 1033389 993821 1309713
16921 1309713 681041 1350644 1252053 1163121 1117015 1254198 931993 1086304 1340794 1192507
16911 1192507 1308539 1285160 1338499 1405434 1371093 1630705 1300589 1372000 1300985 1358811 1380393
16900 1380393 1830728 1619275 1653837 2114125 1427387 1690160 1444843 1794962 1665543 1547751
16890 1547751 1476493 1529779 1366948 1763677 1984377 2239328 1832507 1704428 1835927 1878191
16880 1878191 1798065 1988300 1924947 1871727 2273508 2399335 2114170 1946445 1802642 1898198
16870 1898198 2128138 2077538 2029976 2426345 1845685 2460243 2487551 2397050 2414364 2299095
16860 2299095 2650531 2643752 2873647 2308441 2433498 2972603 2472792 2529798 2472138 2508928
16850 2508928 2933344 2810926 3026428 2907626 2824477 3269643 2919977 3075959 2966938 2956875
16840 2956875 3128908 3352563 3746189 3544151 3285620 3250997 3629808 3873695 3721747 3951064
16830 3951064 4143055 3972890 4143966 4017846 4369247 4473956 4481114 4554931 4566033 4708843
16820 4708843 4498483 4872944 5010075 4850855 5013160 5053586 5389422 5455871 5429907 5528448
16810 5528448 5773700 5894188 6210519 6503029 6144362 6503380 6405777 6510715 7012876 7069322
16800 7069322 7313128 7730647 7785313 7667702 7974698 8003737 8399601 8709399 8849288 8951944
16790 8951944 9274795 9675363 10018300 10238103 10290808 11080851 11274634 11655570 11542077 12250638
16780 12250638 12455906 13050235 13279044 13689667 14089226 14809120 15508207 15968829 16019996
16771 16019996 16560049 17369384 18073779 19027987 19259635 20451497 21354808 21859800 22753789
16762 22753789 23654316 24825861 25715563 26649630 28376061 29304471 30592039 32522113 33703220
16753 33703220 35324637 37239590 38840884 41182016 43117142 45374861 47946465 50061924
16745 50061924 53465781 56590769 59677462 63240018 66974781 71387291 75309993 80074502
16737 80074502 85143431 90205705 96479746 102549319 108938913 116137393 123063618 130477963
16729 130477963 138291584 145974795 153534351 161159860 168500924 175167565 180681337 185975332
16721 185975332 189839705 192016355 193294411 192828041 191320053 188061840 183782911 178475715
16713 178475715 172330961 164767215 157710690 150171182 142107145 134409758 126754552 119558061
16705 119558061 112137675 105672027 99035488 92890742 87617316 82451431 77213410 72442047
16697 72442047 68297060 64242633 60631968 57279806 53924532 51214947 48281181 45760756
16689 45760756 43696326 41273434 38862526 37411092 35260666 33530511 32219970 30746108
16681 30746108 29332845 28001183 26713021 25449548 24657997 23517393 22548593 21741644
16673 21741644 20847164 20379845 19355452 18602910 18167771 17135055 16626050 15764202 15711281
16664 15711281 15264690 14820703 13936496 13917506 13232096 12934072 12430647 11917799 11937942 11212570
16654 11212570 10936405 10620648 10167807 9616087 9539679 9375129 9239924 9185808 8819053 8456784
16644 8456784 8488558 7868408 7741778 7522628 7693823 7216901 6969248 6950440 6881121 6351085
16634 6351085 6336915 6199263 6352636 6156823 5913937 5856800 5631661 5627117 5401028 5190478
16624 5190478 5182151 4958245 4907249 4705712 4710170 4660980 4439044 4413936 4735368 4515695 4153789
16613 4153789 4532115 4121364 4014094 3654319 3769959 4131880 3602698 3522447 3599856 3710386
16603 3710386 3282425 3405377 3282567 3359875 3012319 3181860 3068495 3095520 2798738 3141990
16593 3141990 2638202 2949193 2796541 3014229 2770244 2852357 2521173 2612203 2627976 2846159
16583 2846159 2482933 2651709 2564901 2526528 2465968 2477156 2233527 2466844 2392263 2029584
16573 2029584 2153767 2074633 2312439 2037381 2230202 1761478 2247469 2204074 1759002 1548562
16563 1548562 1920636 1781021 2016112 1769782 1693339 1666194 1633049 1841845 1439401 1654460
16553 1654460 1737112 1425280 1526780 1575937 1593144 1458303 1379024 1402647 1600139 1589632
16543 1589632 1883098 1401750 1566974 1564351 1344629 1241896 1281221 1337411 1368197 792176
16533 792176 1121730 1387143 1297269 1168004 1206106 1018357 1183444 1223232 1278828 1109659
16523 1109659 914231 1289941 941735 1177647 1191644 1207025 1190932 1023421 1004852 1270151
16513 1270151 1149658 876665 1015348 992248 825451 811205 906021 937777 947121 1139827
16503 1139827 734815 1082078 1096605 519090 992526 975120 1007887 667269 993627 1109874
16493 1109874 778796 632171 801579 1018549 852864 997276 1197297 612613 490380
16484 490380 992912 622053 622992 716030 706130 967114 724148 682312 673058 454602 860015
16473 860015 527161 975818 575736 601514 611398 333954 773849 498888 910370 1009733
16463 1009733 633513 558624 887537 499332 449211 553423 770164 705483 473602 332530
16453 332530 543944 723368 703233 682508 619238 722434 652223 618152 430220 697488
16443 697488 625261 627041 383240 382886 859183 747974 393587 639381 901319 551821 788035
16432 788035 343219 505348 316937 666556 690005 567457 872806 253898 620100 597277
16422 597277 262352 657364 761783 560712 -70259 207877 289840 350019 434517 453853
16412 453853 130530 661764 484255 285404 413646 476033 443434 470439 434789 551443
16402 551443 583320 68379 521320 349460 313894 388879 450311 673232 596505 462634 297928
16391 297928 163927 519811 420897 143918 428637 490485 566315 80295 476661 147512
16380 205448 523202 386902 360178 17557 488293 398889 159480 254277 136338 79396
16370 79396 362180 237404 695585 232985 459539 44096 687395 175671 115644 138096
16360 138096 109304 -110130 372100 624692 523026 350896 761233 159613 471323 292442
16350 292442 380348 -184035 98090 128874 495097 650519 632334 351991 306501 224523 194456
16339 194456 143603 257590 502790 130947 543012 176816 470813 446395 440207 116984
16328 247780 250179 380147 440026 394241 573839 43460 471820 361168 182807 459204
16318 459204 -105955 459592 270460 272990 332732 312812 269436 226683 175995 267021 122237
16306 293338 237570 158631 313050 -104758 196405 522368 259612 212207 224202 10939
16295 788555 608769 297530 51096 459505 239842 329371 576894 471821 172911 117963
16285 117963 393167 290296 248739 241638 -46911 21060 -61857 260012 309042 265933 186989
16274 186989 80573 202499 72298 151214 89230 211620 108216 -20393 473827 -105757
16263 381526 366211 139302 174827 160964 -49975 264249 178596 37435 95074 273186 369782
16252 369782 136595 -6884 319528 54369 -176439 163203 81991 267595 6445 -148719 27068
16240 376660 196977 29883 241688 -19065 110695 613 148534 319783 123493 -208808
16229 79579 -150348 236807 203164 221208 361104 -65457 232230 135517 180641 -195994 196417
16217 76143 195477 209005 181253 -8809 66918 252883 226363 167442 281672 206431 231196
16206 231196 160260 105760 259539 80837 -7955 285639 265032 226202 60341 278927 -1646
16194 -191791 -43524 284259 97927 371801 336385 386867 158139 -14328 173818 138618 -2500
16182 149969 591267 -134541 53669 71554 56975 94702 -138920 321819 11780 187911
16172 187911 80022 32265 64471 -19988 -28157 240558 339774 -241049 188369 55655 56755
16161 56755 290701 23034 -148600 147535 -197428 84322 -181625 101195 25622 179015
16151 179015 260215 42714 -168573 -48744 46095 133546 -226007 138250 121164 128298 267665
16140 267665 64122 237655 184442 -26155 163464 -206891 -124711 65419 149302 52657 -22785
16128 207410 104582 132384 -79542 200530 -38787 -64435 -276838 101023 114083 223875
16118 223875 122923 -30090 -71895 -34496 -177416 253127 78394 104218 304426 271007 135879
16107 135879 -131686 -38999 49911 -2633 27128 -15318 -100725 -87071 302581 189052 235544
16096 235544 -276103 75197 3753 28120 52449 10034 -11231 58453 169294 -27347 226383
16084 26417 -125393 -70019 -121465 -275692 -180843 383095 351254 199769 116080 -355401 -239263
16073 -239263 48227 596568 331184 231658 44037 -35851 66912 72164 -91962 -25848 -161670
16062 -161670 235143 4007 -18024 -97746 11337 65953 155523 -157824 -94223 183246 100389
16051 100389 -2883 -309950 179513 -37798 50586 255662 210662 15455 -490425 323753 -27498
16039 17923 58267 -150092 -162860 117519 214267 -88357 -238074 40455 49056 81605 -148299
16027 -185376 -6436 -287449 -317644 -411228 -137820 -85566 -34037 -39125 -120754 109415 176900
16016 176900 -52782 -78026 -22223 -94726 111952 41710 200224 53778 -12654 -253510 -78690
16004 -72425 -13090 -311870 -48448 71142 -139112 -192693 198471 -111278 192815 -265723
15993 92690 -346798 -78122 -160573 -292160 151756 -340040 -57206 -103651 45009 126284 -57793
15981 145289 341428 201101 74183 136944 -3634 137135 -29877 -18344 -149905 100814 256142
15970 256142 40065 -16420 -193774 -104381 -26320 127009 4091 -146693 160534 24023 102152
15959 102152 -163550 -84067 100968 34353 -309513 289361 -142269 -182222 -90897 -362411
15949 -362411 -82116 313638 41974 210830 -251375 -48099 -319512 80755 -196234 -62811
15938 -119212 237007 289114 -193400 -127281 179633 -350021 -107878 -335104 129146 41746
15927 103710 244230 215924 -354600 41748 -209984 -40982 156183 -180405 143705 108 -38636
15915 -399277 121835 149984 298639 -101843 34686 -240520 -140739 -29963 -85642 -124681 29612
15903 -52746 -191347 -111899 -104678 -5270 -76793 4430 91959 -83614 29898 207378 270902 -55826
15890 78422 -58296 194263 77622 246470 257349 155549 122340 250254 -164377 211316
15879 124166 -217536 -84702 52720 32003 42716 -126813 -92184 -199824 -419153 -384376 -473190
15868 -473190 -1676 35707 -81808 -143453 -107320 -321643 -245207 108598 -210842 71589 -150845
15856 120707 190370 -43458 -33816 70782 -235175 291401 -163106 -75860 493566 157963 -16876
15844 372178 -213783 -272258 106212 -207478 -385882 21535 -144994 -219694 -121755 -33185
15833 -185118 -197396 237963 386734 -96101 -83505 -291013 -258666 -84020 108232 -69885 -199128
15822 -199128 73011 -33956 -41084 34518 -30416 -14445 -142416 -198455 222508 -32190 -193110
15811 -193110 -316036 97089 150179 -40583 -212117 62804 203797 84580 -119871 -76164 -56666
15800 -56666 35746 69193 24483 -17589 154694 -91536 10495 -261975 217466 -165145 -273227
15789 -273227 -175261 -174256 14571 57586 4570 74629 -87284 -188142 252158 -221314 -163244
15778 -163244 108129 -97856 225179 -321167 77800 -67438 -120399 -58273 -90604 -42554 127657
15766 63298 71927 50891 118061 -178135 -164327 93675 93833 50117 -7433 173663 148032 164649
15754 164649 -196394 302498 -282683 53597 -474491 253288 -62811 230512 -45228 146145
15743 -23583 -306797 362 -129473 -10421 61007 -262702 88499 -197810 -177243 -353591 -428124
15732 -428124 -77553 -152334 -113664 -269134 -87419 -77463 106800 40890 -241607 -227179 -94459
15720 -294581 -106289 157707 -176857 172963 -251734 -122934 -169755 -113608 -93097 158537
15709 -65222 112228 112578 -275217 -13002 79888 -60951 -185007 36305 -9376 16971 -39021 66042
15696 -29801 264795 -145193 62553 -42438 198661 36236 -182836 -278066 214082 90974 194903
15685 194903 130512 -606970 282431 100699 -10627 -130727 101830 -192864 -156372 398122
15674 -80901 -158981 -171269 -335474 35160 20415 81375 113861 -199773 134825 -212885 49247
15662 -176750 60298 -412823 -315422 60628 150855 33673 364463 103193 66850 22206 -303751
15650 -61387 59077 -172674 -356913 131083 -116763 235051 -44650 -135418 -365158 323196
15639 171315 -98361 -147193 -22448 -178764 -274175 -41566 -195303 86149 -101454 -62526 148389
15627 -59733 90056 -203771 53276 -258481 167861 16423 101633 76137 71306 -2984 245372
15615 91386 -150625 -442767 -6194 -144767 -96908 -235310 -93228 12178 -372278 -243938 -35507
15603 -62163 -75496 2276 7912 -138906 84217 -253421 -338698 230808 -48371 -87831 -55983
15592 -55983 95113 -112199 -24850 -128079 -312748 157850 -238458 -238352 -753 66800 106000
15581 106000 118890 222435 112110 202164 -262699 -233843 -5116 -82963 -34241 186002 426210
15570 426210 85424 -74026 167844 82148 226401 -16201 45098 78052 -257050 58722 308531
15559 308531 409983 109325 247794 10313 107702 -112286 -69209 342497 108408 106678
15549 106678 -118164 -48690 111312 7118 -110176 103030 29711 -82422 -18023 -123487 621252
15537 133145 151499 -483811 -184431 -304822 -120804 -157603 -103677 151036 45371 -364011
15526 -70190 -286265 187945 -18057 155953 32706 183032 -11762 -213410 -39735 -5458 -53463
15515 -53463 -220528 -65616 -153834 -481702 170949 -61074 -149129 330123 58260 -61715 166019
15503 -75465 -232879 -44717 119539 74599 -41606 66716 35981 -251328 -228899 -148981 1579
15491 -100243 86260 -236327 47035 -384595 -220897 38532 -47457 1268 33081 -60385 181832
15479 136380 -39517 -340899 5065 22528 -3933 -122898 -109098 -100894 -389881 -22268 95252
15467 -7071 2944 -253518 -10908 -49518 -76825 -19774 -230139 678 206710 59078 -128827 39376
15454 -224678 311887 193804 205256 157118 -154161 -131711 -104726 155653 -125263 -53704
15443 197520 -301697 -23242 -157128 -131468 -21570 82117 -135179 3413 25226 -272003 70505
15431 -94520 -88560 76389 174412 148698 -68944 149295 510 -15779 20181 -67556 -310052 25964
15418 -293744 -355104 -158105 85377 -132293 -79578 -239675 -47737 -285230 26584 232324
15408 232324 77708 -179760 38210 -109730 -97091 47118 78037 457811 193425 8224 52294
15397 52294 3606 21460 -409998 139159 20932 63397 99998 -274471 -98888 30108 -324824
15385 -143147 249548 37466 280363 470301 -20528 -95086 -372929 -257789 396500 -195971
15374 109043 99005 -90671 257796 -62761 54907 -220654 -253075 31911 237879 130936 -36040
15362 -388136 -48983 -202101 83616 79775 101982 76993 64733 150691 -242812 50079 -359895
15350 -93512 -19411 -42621 22117 -102720 -123485 -136292 -43142 432118 220465 -66372 -146554
15339 -146554 399489 145014 30178 252942 192969 301904 -19935 191874 200760 64414 -116248
15327 111042 -517451 -284144 -72962 -154675 67703 363442 -93955 -162218 64266 -73607 -240627
15316 -240627 -49518 -173516 -5839 155927 -423737 -235399 -38683 219034 -460883 -127289
15305 93857 -212279 -5366 364314 -337429 -102107 -210728 290293 232910 -303858 204564
15294 -392518 -9175 -245958 146484 69673 45869 -23692 253171 132602 192275 -248785 369052
15282 116415 198863 -118 -260404 121168 93397 111874 146345 -20575 74913 41190 -217074
15270 23582 208014 -50602 -64290 -118425 209127 -144654 -128428 30787 -66243 81097 106849
15259 106849 251755 -206920 -22018 -89863 -296675 78256 418305 233611 -39099 11654
15248 163185 -27012 -66808 -199135 -57826 54300 148187 -14486 -351878 22542 220473 -173739
15236 178688 -190057 -287547 -99999 86770 66508 61190 164856 128487 -33173 -103793 78030
15224 -364135 -147151 -122541 126015 144136 209393 221937 -27462 -248475 90048 197693 219113
15213 219113 -29898 465332 -34076 113680 151443 -267645 75372 135980 93719 107964 270403
15202 270403 -97148 164924 -230397 -65750 -16829 -45131 53255 49393 64984 194513 -177607
15190 114350 -72383 354769 368228 -144658 54286 355756 8224 112044 229914 160687 -32976
15178 -145228 123383 -153682 -34308 317329 184711 105549 413878 -20292 371101 -113867
15167 199985 -4463 -41844 104957 -55455 83747 -161405 -323125 156621 293109 -147649
15156 -55138 119107 197996 116557 -174758 225871 402155 300234 -53443 111776 -20175
15145 20002 -144022 220337 -22928 -203497 175836 64961 351786 116692 -318085 76871
15134 77135 70563 303038 -32905 79347 31615 55123 70222 144603 -42035 94216 193173 158045
15122 158045 -294901 5218 51715 88013 1606 63876 -487061 -78119 219615 122818 35901
15110 321261 161613 23413 204818 15893 242662 316240 -100214 72658 377169 -27295
15099 201702 157029 282016 171280 44358 -128403 157386 12123 368327 -164345 50288
15088 -252554 71763 300227 119472 155029 -140812 311309 211141 212096 168277 290886 -200718
15076 423818 185131 3249 -90510 105543 177696 212191 -167124 391387 -51143 -1937 164754
15064 -188232 -58088 201420 376524 71286 253097 -39934 580745 401579 192288 163945
15054 163945 -187512 190604 -94337 195418 233404 239239 -207832 -167356 45159 213741 -127372
15042 -199992 306717 1117 454814 58520 363533 252229 189819 119360 266423 344906 517065
15031 517065 159323 174454 309399 62362 -14304 166480 342176 631393 25849 285149
15021 285149 -21130 51012 194519 572234 -13918 -67412 -21552 233959 387619 97321 175175
15010 175175 46754 446087 193132 -172100 132281 204402 100178 -41656 61542 149541
15000 149541 218947 254222 143545 316287 175413 478126 229616 176922 263906 66276
14989 261071 87403 390007 -34190 167769 187078 19219 375041 293613 23427 149723 77835
14978 77835 395243 178856 423964 -119701 213557 100779 223737 88587 -11187 358772
14967 130781 18925 645929 363767 -162488 226968 316762 292413 -120361 199134 290317
14957 290317 -149196 190573 314047 292729 435964 159544 32126 13410 22162 80361 217433
14946 217433 378397 10493 -252405 200064 -7845 143496 541839 167810 282816 376451
14936 376451 334529 147632 318608 271670 -155688 345222 -261411 302589 160880 -196210
14925 129721 429518 166861 29703 166854 439839 434310 309288 384775 160097 19598
14914 157523 161041 619366 530395 257093 368808 -1083 296002 313244 341070 212172 265227
14903 265227 -64834 342799 382277 394036 124332 590534 206288 -208311 197928 468202
14893 468202 227237 268216 436046 199469 -103625 66747 275722 353152 380990 292163
14883 292163 515753 283933 309927 103630 449646 344806 206615 201108 448955 330020
14873 330020 158037 431790 62991 371255 326152 183502 290248 529396 271691 80832
14862 383471 275754 459182 340814 172776 465928 361682 433263 238200 449701 129364
14851 474918 129355 67467 -6439 362044 212107 144336 138610 194741 54746 387901 277258
14840 277258 716265 332346 87373 455926 179117 398491 491086 580140 465923 265799
14830 265799 429601 332523 461793 501249 172008 303895 188460 427617 256941 678625
14820 678625 343330 289551 738579 629812 51380 242326 573183 341518 403712 377392
14810 377392 615159 383565 563548 264213 504708 353507 371716 631756 674419 379496
14800 379496 444222 297884 886735 459174 293101 556397 400354 288910 336875 229668
14790 229668 373517 651514 293556 405575 703983 452950 564336 329997 675183 559614
14780 559614 578265 404333 914650 578207 385990 232347 377029 431671 141727 589704
14770 589704 -11083 738888 574796 593209 598650 694083 595264 298859 254221 364304 631965
14759 631965 544791 520237 586241 675781 678795 525603 592101 554244 584767 247139 810383
14748 810383 460782 611478 745402 541392 542844 762992 528402 723469 793427 217540
14737 820379 503608 499086 463480 224593 846282 502714 720880 605887 537657 335754
14727 335754 631827 599501 694889 553139 827867 647165 786512 551398 751995 624984
14717 624984 615455 772576 778456 990969 670658 976656 526666 694377 767009 629482
14707 629482 622670 752528 723873 1001261 1014561 572850 564563 1039523 778430 727252 649430
14696 649430 1121305 765346 906764 751307 968667 883643 731482 518272 1076746 900301
14686 900301 378250 462482 956536 1068511 495081 845968 704301 761883 1023506 930099
14676 930099 795254 850325 861541 525794 1014724 647938 1108702 742129 868067 694824
14666 694824 969809 740771 638687 863225 493551 656662 780702 974971 745377 1174382
14656 1174382 1009718 1175419 1005489 957001 789687 1058727 1175978 1069454 1114153 950563
14646 950563 920557 1193761 1179839 847459 957603 1029289 927837 1240570 1080527 959580
14636 959580 956516 1245628 1051185 1109595 1103949 1315570 1410333 716428 1015786 647509 1288080
14625 1288080 863927 940367 830259 1161964 1397858 1362915 1053564 1184376 1217532 1278770
14615 1278770 1193633 1352498 1406066 1287774 1267949 1219167 1165793 1240076 1035262 1431638
14605 1431638 1540750 1236093 1366148 1551903 1557883 1676266 1036013 1466355 1883058 1444223
14595 1444223 1560949 1948744 1393437 1168656 1402023 1672591 1408019 1459215 1581611 1931845
14585 1931845 1309322 1582090 1690807 1871808 2029125 1666945 1462918 1657132 1714304 1961700
14575 1961700 1635239 1836159 2068382 1827998 1776276 1654540 1948198 2113584 1824744 2001431
14565 2001431 2077941 1970159 2070226 2318510 2353644 2438227 2356124 2043427 2583183 2727067
14555 2727067 2686018 2860926 3411243 3581597 4202214 5223046 6787829 10018263 17062169
14546 17062169 34326823 45014154 19421141 7748211 4093557 2762793 2407079 1966947
14538 1966947 2124915 1770420 1966174 2025626 1868076 1894351 2101382 1937427 1955747 2106771
14528 2106771 1432913 1877295 1842740 1989648 2141068 2170570 2014416 2034421 2269908 2437903
14518 2437903 2027387 2505219 2204591 2363167 2487375 2346433 2459905 2428047 2372419 2059106
14508 2059106 2461589 2307034 2850584 2453625 2787983 2427727 2918912 2649857 2735532 2943598
14498 2943598 2797422 3033768 2731202 2568432 3081426 2982193 2986574 3141046 2835618 3236376
14488 3236376 3187688 3180067 3165012 3480771 3399090 3311011 3093544 3480536 3556841 3514840 3319220
14477 3319220 3536371 3424492 3520560 3885446 3682645 3555278 3765767 4129238 4106267 3891578
14467 3891578 4091873 4076977 3811825 4158647 3980374 4170869 4502031 4540255 4120141 4303626
14457 4303626 4536112 4445504 4416943 4439949 4394687 4913939 4510213 4987845 5036549 4917869
14447 4917869 4855765 4929851 5168582 5035879 5346449 5644746 5515644 5452084 5299403 5555441
14437 5555441 5817456 5553827 5724363 6065810 5548571 6232849 6175020 6056080 6357141 6355217
14427 6355217 6479495 6623373 6721864 6660617 6750660 6928477 7035944 6743427 7233844 7156336
14417 7156336 6951821 7479644 7672382 7497748 7791684 7872804 8295004 8115867 8124727 8195360
14407 8195360 8306222 8322986 8684541 8851723 8853563 9023322 9017863 9394814 9482792 9635785
14397 9635785 10003236 9985400 10114897 10214505 10234127 10623711 11020534 11001747 11335990 11338187
14387 11338187 11202715 11794912 12050077 12363464 12243418 12968681 12888662 13209248 13350559
14378 13350559 13271668 13825542 13884588 14319752 14798409 14931030 14860868 15572346 15922540 16300469
14368 16300469 16603564 16770281 17135064 17499562 17992743 18114596 18758914 19261489 19525439
14359 19525439 19951842 20281174 20665747 21220681 22129749 22335782 22780047 23437908 24215007
14350 24215007 24285477 25404649 25816135 26286964 27119087 27528016 28706131 29334985 30356569
14341 30356569 31281281 31519646 32602363 33681365 34547159 35839841 36549680 37488343 39110497
14332 39110497 39585247 40958634 42186946 43489767 45108056 46659696 48129797 50028907
14324 50028907 51090915 52950083 55083146 56729919 59307746 61014458 63280849 65785103
14316 65785103 68589854 71191675 73604753 77149369 80216843 83594975 86991603 90665836
14308 90665836 94802889 98664852 103155488 107969192 112976289 118086984 123775845 130042489
14300 130042489 136211027 142870687 150430082 158171389 166186796 174827100 184268315 193745753
14292 193745753 204097932 215006269 226888631 239163949 252201588 265788338 280278390
14285 280278390 294668553 310379557 326228997 342141362 358656998 374887820 390966405
14278 390966405 406513457 421175371 434543119 446203175 455794781 461980448 465859960
14271 465859960 467555798 467837959 467790869 464966307 459943302 451962759 442349286 430746145
14263 430746145 417066524 401982896 385864789 369572202 352963834 336374360 320050352
14256 320050352 304540120 288987374 273972150 259776961 246530217 233572372 221236455
14249 221236455 209964263 199034815 188794140 179191844 170537188 161996305 154039007
14242 154039007 146509148 139258063 132696883 126288139 121080521 115778212 110180885 105582950
14234 105582950 100999125 96610611 92922503 89349547 85796930 82218564 79176763 75573268
14226 75573268 72790073 69849082 67735010 64890540 62759100 60849769 58546865 56555081
14218 56555081 54385550 52885380 50711830 49384668 48080695 47103248 45379165 43845780
14210 43845780 42421596 40943800 39975757 39499771 38259859 36966082 35634606 34780954
14202 34780954 34024098 32877483 32627006 31479342 30706141 29528197 28369238 27762952 27753419
14193 27753419 26806377 26139482 25485012 24790983 24522543 23512554 22904697 22603007 22105518
14184 22105518 21559071 21085678 20561930 20322503 19891887 19538781 19069339 18612045 18227488
14175 18227488 18070659 17613842 16855177 16817948 16306174 16109725 16049186 15457126 15316404 15061890
14165 15061890 14744566 14325625 14107836 13757141 13470530 13382099 13079365 13198770 12796636
14156 12796636 12436495 12346024 12026562 12365319 11804259 11237523 11446826 11029484 10938980 10755696
14146 10755696 10752375 10557502 10082111 10056138 10252389 10020142 9535624 9438280 9240134 9328439
14136 9328439 9011894 8930748 8869618 8793184 8660878 7977881 8546600 8003526 7976235 7916176
14126 7916176 7803111 7650324 7625117 7427476 7512434 7368769 7141112 7226049 7128040 6960658
14116 6960658 6906486 6659566 6681995 6449542 6723801 6231182 6225208 6297566 6335465 6177877
14106 6177877 6081777 6019328 6071368 6026497 5553918 5833951 5525893 5706248 5535467 5447066
14096 5447066 5362338 5386617 5129246 5089721 5076985 4824278 4991977 4990848 4741747 4812805 4962434
14085 4962434 4906570 4681025 4790475 4372229 4119362 4319406 4629739 4358588 4225095 4618799
14075 4618799 4418858 4608690 4171820 4006771 3865076 3889651 4086547 3676666 3876080 3860568
14065 3860568 3698821 3658048 3905766 3479782 4016041 3622737 3890859 3592951 3667255 3486777
14055 3486777 3718885 3378950 3227896 3084230 3694374 3314470 2866692 3273546 3338047 2905889
14045 2905889 3265445 3306684 3208305 3259402 2840992 2934077 2835859 3070918 2746636 3166290
14035 3166290 2836505 2714723 2994226 2720574 2947665 2864374 2631531 2958921 2587453 2463677
14025 2463677 2962043 2700692 2888278 2816478 2522263 2397290 2305282 2462611 2566042 2346833
14015 2346833 2628553 2199670 2782629 2561307 2625117 2224937 2535043 2283004 2408069 2178150
14005 2178150 2054029 2192593 2073475 1976939 2079974 2236254 1939916 2010978 1987134 2275953
13995 2275953 1741023 1913386 2045684 2012219 2293107 2812641 3721530 6016925 11950622
13986 11950622 28202223 46802380 25778483 12964259 7604862 5757765 4626165
13979 4626165 3679860 3660296 3223025 3177221 2848616 2608776 2852155 2632208 2252187 2235789
13969 2235789 2274899 2301870 2339804 2209702 2051040 1866904 1859156 1628407 1914395 1762563
13959 1762563 1891891 2109095 1912366 1757462 1808979 1813891 1863669 1570272 1558145 2012367
13949 2012367 1529159 1693849 1838512 1505898 1900269 1958877 1490703 1923981 1810842 1732471
13939 1732471 1463032 1723090 1790870 1562922 1658544 2271202 1445090 1291735 1452110 1623438
13929 1623438 1191322 1626095 1174860 1566105 1533267 1562449 1682611 1601463 1011582 1439104
13919 1439104 1466274 1607564 1461271 1463211 1608657 1380193 1229851 1443018 1231673 1621175
13909 1621175 1394636 1414436 1483308 1360545 1272148 1236865 1195782 1411296 1523162 1229663
13899 1229663 1192735 1238103 1250093 1492115 1525812 1204795 1619161 1220740 1331124 1257755
13889 1257755 1022509 1148812 1422866 997011 1212064 953765 1228214 1289924 1184340 1029001
13879 1029001 909665 1254114 1094234 1194138 1305250 1510868 987034 1096146 961758 1089925
13869 1089925 1109111 879578 988553 663466 1046022 1088037 1065501 946310 1195835 882857
13859 882857 1034898 678617 932011 1183035 897514 1439404 805029 1021091 879189 1339316
13849 1339316 944208 1049993 904883 912716 1140738 1047885 805571 810494 826396 663222
13839 663222 706429 591306 708902 611579 756521 881650 1004913 1004617 723921 827126
13829 827126 722127 1042732 807397 660345 1050767 776174 680956 1115046 713437 979250
13819 979250 1068712 872737 774074 796060 964349 1108345 1309048 874744 700539 601907
13809 601907 1022455 681210 613525 628828 751077 786095 842776 901218 707741 719955 630293
13798 630293 718196 876017 767982 840766 516428 547029 648837 590080 969590 778299
13788 778299 578239 439512 615455 720673 760093 799777 646407 841798 964693 733335
13778 733335 1074759 594241 828017 710023 854590 789380 517213 712199 741429 851709
13768 851709 824067 675514 834146 356093 819080 807174 504069 783298 751560 750300
13758 750300 624654 393672 414661 615691 633624 578155 652830 650448 586104 518705 727576
13747 727576 980782 327326 417991 470343 576187 585553 792046 708037 361319 866865
13737 866865 711755 689934 579148 739108 570347 754497 652277 754431 468190 572637
13727 572637 429471 533813 315170 564924 919052 673985 440145 108213 643504 452954
13717 452954 337528 737486 209247 426081 296646 542300 95513 498142 503803 540999
13707 540999 153737 537750 438563 190612 438738 525557 421843 684789 603028 474513
13697 474513 537222 447669 124328 434206 465538 524391 213801 583902 348856 674931
13687 674931 463586 299271 692270 742539 523631 147644 352109 610804 363261 770290
13677 770290 741365 568386 450855 331238 728381 611377 371003 52207 310793 392267
13667 392267 272284 390083 416045 732603 672757 236628 178648 480526 154480 511609
13657 511609 238743 194248 622266 372413 410602 653510 464993 452868 640597 617889
13647 617889 571611 491780 165943 219985 427911 488308 331861 534784 208341 289658
13637 289658 647646 569794 346204 175876 182824 349642 731306 307192 745128 331249
13626 483825 355721 566220 330731 442940 492138 463766 185279 429695 595077 542534
13616 542534 256912 605375 35562 339111 492611 384046 262130 259462 464805 410619
13606 410619 783050 417807 229847 267840 520055 440243 361169 273591 428519 -8956 397354
13594 233557 237965 296929 298551 264361 323690 102771 23593 125161 486612 -61848 439433
13582 570277 370824 470548 390377 241580 200085 218393 463841 398135 465613 358301 377408
13571 377408 94218 133312 452875 214822 372205 408593 94651 350415 196175 101677
13561 101677 67934 342166 267604 379811 90594 42690 -12161 -2771 214530 143476 571837
13550 571837 592158 180403 175295 154970 359748 133545 261936 384451 189482 559731
13540 559731 291149 -111783 685190 262282 470573 121419 163399 57131 444379 300962
13530 300962 388501 54631 578328 281414 110690 214444 365274 195595 72218 220244
13520 220244 249860 65445 235945 380349 240598 263462 129176 190667 148304 -27484 181869
13508 391995 97856 398445 150887 275410 331916 -221342 505416 312422 342263 393144
13498 393144 10411 199525 115253 498296 296439 395348 374132 200197 405592 361384
13488 361384 383672 502707 499871 227700 316019 458335 501061 163243 188503 -246691 255442
13476 199306 176302 143416 321152 -150520 109019 160520 84508 126301 181771 471590 457209
13465 457209 93795 361065 328988 160434 408598 311273 240275 33831 289392 105280
13454 374777 324394 263754 212337 -29879 -122614 459370 -20604 162866 157751 -89675 215391
13442 -24050 117975 463996 200104 258036 198736 204581 260382 285503 68671 -7714 197108
13430 86283 372170 155829 206349 455642 -98420 -261965 18724 30401 628797 296756
13419 30761 167176 344639 252424 320232 133659 90930 4278 260325 627745 316346 -33590
13407 110503 -26312 67614 176283 -48309 218124 202277 252285 297054 258003 122329 225840
13396 225840 286884 387581 187091 221468 14183 -29046 523848 250350 -154446 351886
13385 -157133 421899 -130388 222546 132525 374136 366380 448743 399168 186022 347562
13375 347562 180880 264616 163896 177952 340590 287078 175592 108113 95184 657124
13365 657124 151128 312820 371461 302809 138222 -130638 222772 183711 233547 164162
13355 164162 563184 58470 319863 141791 89339 -36079 175407 410296 75747 425048
13345 425048 396535 161196 239100 374870 406829 146944 284109 189508 489724 145995
13334 152415 43144 424311 597124 -24384 482168 141715 -27487 49174 -120074 -138421
13324 -138421 218383 304212 111437 299078 353885 -45687 -131722 20163 102990 306823 118728
13312 222510 452088 170145 273427 175126 321934 180546 170727 387286 258476 115489
13301 127270 245646 92127 112918 94639 97082 416663 76194 -55829 81563 -36081 139946
13289 -251922 60475 297095 -89291 221530 -863 498044 228786 79682 5222 141177 300005
13278 300005 182272 -46558 95544 10709 416157 411230 31598 142837 161541 138444 253897
13267 253897 132930 396805 350319 372658 315474 363137 -207523 213209 15535 147084
13257 147084 -12990 253194 22012 420636 275430 -73462 308166 170092 259166 -143483
13246 285544 -46122 387360 84338 183894 320118 102543 221301 301796 219676 -129009
13235 2432 -14528 -66269 241202 74066 257894 123991 134373 87005 66489 -70088 -271738
13224 -271738 385854 -72947 5993 253033 172095 -105682 -206231 2204 -24985 122360 -55582
13212 69281 132106 -47166 243267 185251 -47605 149301 59205 405560 186572 -78298 325072
13200 -128990 99594 256511 260291 136194 318654 360327 113961 354005 145397 79215
13190 79215 81513 101124 153456 279062 8454 218641 118272 23422 395875 139849 86363
13179 86363 401931 124089 196556 582559 160800 -79810 36244 103176 297602 161757
13169 161757 42676 -100244 -258732 110016 -154914 -351942 -173632 90443 217065 100349
13158 17392 231156 -68742 -42468 -27530 334835 -163800 -77738 226233 22109 91839 -73994
13146 -296458 -1356 262664 451050 -12290 91159 37197 -112742 215563 -70495 367988 7360
13134 137863 -92068 108425 332039 263630 24158 253656 -108242 215131 -210165 102856
13123 41936 273663 -37745 134856 -145700 -29490 179274 -18709 420507 -25902 311656
13112 -30977 337367 117219 28366 -239870 237598 -83183 156179 316075 -1681 4427 38171
13101 38171 323170 -92044 33619 409707 173183 574460 222611 -125167 333360 -165274
13090 286008 50328 139339 -38443 -50562 -115316 27708 253402 -108822 394545 332861 169678
13079 169678 56792 -90562 -57523 -117587 386194 112925 119254 88635 109991 -78310 160246
13067 57258 72481 -149241 -25080 151802 -101610 -126572 155380 204282 93953 51072 98732
13056 98732 536381 154071 39862 233519 95094 -33441 -114873 19858 -6645 162085 16246
13044 102097 232342 367428 61709 143102 466314 53731 -31433 -37593 209210 13695 45401
13033 45401 -258279 69970 12723 320538 -44590 256178 130189 75730 -83039 -143164 35980
13021 10149 135855 -51216 185759 157877 535651 -15713 232367 81113 151215 -167391 447634
13009 -187239 -75185 310391 374658 40619 126163 349875 274158 157707 121749 49486 -61382
12997 121745 -31135 456437 152525 397061 35883 -122296 29279 -32591 -92372 333321
12986 185422 -205896 -75902 307827 208502 102791 -181222 142431 112566 -103191 224170
12975 -186847 214303 37128 -79347 117776 -171791 138534 96440 -169925 102553 212449
12965 212449 448010 -33886 -49743 -86208 212884 169902 -207061 183485 178911 347969 48937
12953 -209174 28224 -138717 22721 22661 25530 379155 -106751 63773 49738 -25958 -69500 54565
12940 238225 -21701 161704 -141565 333836 18906 42756 106536 -51815 -219274 -60418 57569
12928 57891 246386 -200305 287309 51342 -172866 129807 -163571 256486 84183 -208861
12917 163092 49542 310336 50180 271144 -128691 155204 79136 -187826 144161 143035
12907 143035 -115201 286095 -148909 205492 212687 50562 155257 35969 -35806 -195001
12897 -195001 -248984 -104134 208286 -144994 92518 135508 167678 298187 7095 -192676 -38882
12885 161857 171995 -42984 -23332 -259945 247800 256543 -71732 97276 -249060 189204 -47707
12873 186368 161352 -344609 -47294 3822 -91131 393932 -12793 -105373 57023 -57370 -303132
12862 -303132 -160868 236001 157969 -180407 -410020 -88663 142499 151846 -181266 431078
12851 325307 31785 -287650 20230 -103424 166648 325157 86083 -98937 57446 -77478 -231714
12840 -231714 46952 -39644 379635 -108200 250599 64620 258485 -25389 -262475 -74140
12829 -50641 -75860 91054 334955 125860 31858 49115 -14598 -64375 32455 -363100 -248743
12818 -248743 235697 -256186 387 216866 -338213 203150 -20830 166334 -38619 6029 -128148
12806 -120046 238762 -93326 196185 -74762 292922 328086 -84353 251603 136418 398237
12796 398237 206339 -142380 105985 125446 -129143 -49306 134244 408337 -165126 -130958
12786 -130958 270966 -47283 -18727 -216312 114645 -93189 -126853 221205 75923 -98830 250067
12774 -29191 34292 237720 -190610 -69173 98580 381676 9922 -47184 107927 7340 178113
12763 178113 -13468 -104271 36877 50145 -168821 121627 73740 -22375 -291847 185123 115971
12752 115971 223946 -9566 -167133 -66720 2921 23370 76433 -227014 -197245 -255956 68093
12740 51034 -115685 228115 26149 -206862 89087 152354 -120740 -180319 169849 -63533 47144
12728 107531 99534 -406277 -76058 174028 219444 369573 -64517 448339 -60993 -26293 -8586
12716 255529 221446 -232322 -14428 60864 16899 157387 235275 379991 149399 211757 104858
12704 265362 -237676 277001 235937 125460 195255 132805 88611 234928 149263 433694
12694 433694 234067 -5559 235883 -298308 99007 -55387 78537 -291017 232087 73139 206432
12683 206432 14400 -75725 192886 60216 351488 -112275 237125 196841 -118001 279616
12672 -90002 -35633 152524 207624 -304743 61311 -11118 -4947 134547 188565 178112 160270
12661 160270 121460 -40909 455411 -69250 560467 259231 506323 122068 -4909 280058
12650 111523 57972 125054 144924 259619 171025 -7815 70962 -245868 217961 66507 214183
12639 214183 151157 -71214 449141 142483 279962 265325 432568 -222122 177591 306257
12629 306257 29036 440671 237397 239588 124026 146373 -451676 235748 -136792 217421
12618 106404 -125511 -106808 -12613 -7352 56689 -74524 198124 584093 260824 420586 388579
12607 388579 13645 -128876 -267828 354519 5402 223255 203538 182478 209152 413483 -5493
12595 -20335 -92367 -237444 31338 -165843 234535 129312 190829 219004 116871 175883 -27485
12583 338194 79108 21898 154382 -88139 -44592 -26259 80903 91153 -11292 87987 6578
12571 76685 130390 -85585 209917 -70878 73570 -162641 41327 150730 -176971 332317 116101
12559 -236558 126191 197300 220712 54714 37101 -128644 -99331 -58700 -328359 225010 85578
12547 42393 -150820 -153153 271728 -29271 -40591 -311483 141202 -178366 144849 -112391
12536 76795 -198929 204133 80139 94618 -23347 209623 130986 24175 199113 -102118 284986
12524 -182123 5390 -62153 306578 216919 313519 123084 196983 290210 -146432 198090 -155736
12512 407766 -37724 -275538 274016 565929 -32106 9697 232379 37700 12117 -149735 -104317
12501 -104317 57704 110827 -208905 -111664 -97686 158127 -135900 214183 19418 28262 -125597
12489 44011 -262419 481998 185893 -79969 -153444 53402 55093 -176707 -138497 58994 -284505
12477 -129026 116126 37310 -137697 291400 -24423 11919 -66791 52140 -246352 113554
12466 -150066 -882 -49461 -226272 -288003 140124 61765 26710 9566 -85060 -396634 91161
12454 -146276 21905 304783 43654 48317 -176242 -63971 -183358 191441 -11894 -11279 -354661
12443 -354661 -213076 123847 159558 -173631 158237 -422001 -350490 -146785 50818 -84675
12432 -60746 -89959 -235445 19239 253748 -320715 10986 10847 -54604 136482 -222641 83583
12420 83423 -110520 121890 209616 -292024 113579 -30331 121737 -88325 -338756 145919
12409 -121455 -149465 -46470 -34327 -67154 71140 -71507 54311 -34798 68655 -166348 -76791
12397 -53117 -29364 122739 237060 47220 -22850 -29834 -221735 67793 59016 -4123 -391646
12386 -391646 18216 24385 -13996 68818 -118991 277423 243317 6090 -67419 -41273 150911
12374 145463 120876 -173298 -75816 145697 40756 -150039 -216486 40750 26703 -90669 -691
12362 43949 -1179 -136162 77165 3907 33667 284493 6318 -227461 270588 130987 416769
12351 416769 -36139 -116283 -229165 -50525 -151882 -144605 194905 -192962 -140934 -211849 -238520
12340 -238520 187258 21991 -313460 -71005 -213876 -58262 -255260 18251 132922 -120913
12329 -195784 227468 -263598 -261701 -5414 104801 -213854 -56267 -200271 -198130 -198555 -63324
12317 138532 114524 -31561 -447047 119108 -49715 -95712 157470 101734 -65824 -196597 79410
12305 220375 47327 -549306 164801 16404 -75332 135431 -32995 214903 102486 194036
12295 194036 151933 16686 -75087 27598 87005 276462 426696 -51242 75252 146441 35020
12283 -214063 416709 257966 248807 28293 -178571 -33293 209765 27602 -116339 115163
12272 -87588 236769 121884 219798 137675 49767 266138 116731 -9800 235313 79759 340778
12261 340778 295710 245284 -121087 42560 372315 8359 -44923 164721 31971 130675 92895
12250 92895 85725 168134 -620 -228233 33598 72915 -192660 -376418 -69981 119784 47966
12238 -85259 126764 154350 333643 19794 -8248 148572 -112954 276878 -45583 255690 178955
12227 178955 444458 -32417 307294 -56209 117697 322317 141610 151336 221774 303071 -72720
12215 351668 190348 -175588 -201942 260766 89872 215276 83036 112848 364559 179487
12204 41026 268940 -169414 -116223 305537 -4961 60672 399188 109636 410612 126597
12193 631083 97163 543424 109683 125539 314737 32020 -133669 296093 150054 42132
12182 183014 151181 74161 295579 319002 180182 -49252 5606 185040 -64957 532920 -207082
12170 16514 223967 128642 227014 156772 72662 175235 -137239 -47250 -146325 -7933 -82152
12159 -82152 -352944 -135903 181104 159591 40989 29782 -138062 144724 -23107 120301
12148 -103605 75488 379821 -118665 86549 -30652 -305075 109970 75662 -93232 216511
12137 126590 29308 116524 46583 -345328 -34960 -324309 9435 -162052 138898 30980 -31254
12125 -197251 292314 264835 116398 -191026 390195 323432 -235557 -160133 -177923 -40982
12114 -226091 -76396 29148 -327330 180080 230463 401635 -6056 -23503 162657 -177118 182003
12102 -150943 91289 -72810 -79887 -315273 256611 251238 -138702 -221195 166679 -30147 262274
12090 -299006 -51 172503 105831 -261500 50729 -40846 99873 -115803 -289262 130214 -114877
12078 21849 219287 169893 -229364 140891 120354 -248129 137790 144852 188271 -175255 66566
12066 102070 26731 51353 -74194 26517 -118802 -274569 146840 341362 392499 1360693
12056 1360693 1651014 62084 -222564 159380 218219 59536 -299848 30571 -13773 -5155 44187
12044 82765 149138 21193 18680 43267 20075 133125 197862 88405 185981 -241810 34365
12032 -82389 147289 40396 198427 87067 67602 -55681 -236560 176494 -73792 -336398 201099
12020 20367 284107 -159132 -103314 82724 320665 22648 -74694 69940 -183556 127265 152527
12009 152527 99048 -93640 8975 -24016 69748 235550 48574 -167616 -18508 26293 -47762
11997 -1294 -71388 287165 103236 264181 96374 135370 -195527 -55698 -306784 156652 -127936
11985 -103162 125245 79261 41495 53817 -152869 -65026 -213889 -226435 53722 -185604 133479
11973 -93186 -286963 -316265 -46540 -65938 92887 117935 -198816 -402606 165271 -259091 15392
11961 -212280 235729 -57874 4133 -116111 -35873 -37712 98683 -286862 154810 -155638 191515
11949 203076 57974 132899 87734 -21270 -304549 130069 93774 -4704 130801 -109540 -291438
11938 -291438 284525 -89386 284898 134441 -250299 18974 -195603 283407 264306 -54432
11927 -49336 295057 93070 65309 230886 24370 121150 -423961 277867 -61512 250046 -205589
11915 -49574 -42228 -194595 -194758 -124918 -213163 -181857 -33896 100788 -250996 -83894 201399
11903 -74872 312385 -183943 60038 113259 57084 -90814 -33112 50926 -220054 141726 121450
11892 121450 -174172 -363481 18899 -161009 179410 -193632 -132727 10173 -102478 -223115
11882 -223115 -123314 80629 -80667 28125 230386 -64784 41060 72205 64760 130250 -126502
11870 65599 47255 223663 -23895 -222569 184209 -389823 79374 84484 360674 -66056 33985
11858 97984 82557 -61988 475947 -406411 110335 83277 36463 130491 -506038 220393 9996
11846 -186742 342428 255872 52202 490040 -80894 371818 -65039 -194490 -88791 6633 360083
11835 360083 -93275 -55377 74657 -188438 -183138 -226644 37142 -417128 -51572 -382416 -23032
11823 49939 -434753 -61698 234480 -132301 -90301 -103447 -38324 -155378 148521 -182304
11812 473778 414662 -228378 20276 174923 -181040 -173751 91027 -24061 -178502 -38474 -100991
11801 -100991 313376 -298729 8647 6374 208082 -235301 -24221 -145104 150168 38159 -364277
11789 -157572 -99474 -84096 -111796 30859 -191391 -58375 536036 70906 185658 271565 43593
11777 109146 -222757 -308080 -108533 246517 -96099 -90884 15871 204619 118971 15477 118207
11766 118207 -128775 173225 138853 15741 307604 -155928 149263 -280920 6716 90687
11756 90687 217695 -173607 277189 279929 -45813 -91327 -184290 -270465 14920 -187145 -39056
11744 180718 90425 431182 -14791 -333447 -338971 -144139 -68140 -78169 121179 406822 136989
11732 259980 -135891 105867 -27936 246979 -105161 84830 -190514 -389893 -55997 -23942
11721 16546 -219963 -87103 175412 -71873 345452 133669 -174974 -113307 111535 -175704
11710 160064 9980 161941 -119115 138423 95940 102732 42361 -59879 -227095 -45507 183676
11698 -138564 -2825 9238 12598 165332 193688 -160384 -63187 126082 214442 -56086 -183367
11687 -183367 -11818 114299 63801 -308464 68123 -19008 236652 119472 156291 269826
11677 269826 128335 -101499 276226 -75041 61106 144259 39516 126965 92328 39542 93331
11666 93331 160245 138671 175170 75353 -20575 -61116 334954 237429 -37819 -181819 55422
11654 130077 -183432 101904 23248 158671 -7978 -69907 418646 183985 321262 234990
11644 234990 151235 46039 110107 -218389 -125782 113616 104396 220572 -366647 21146 -47419
11632 87359 57453 -70291 -36036 -313753 48365 109844 114267 280249 -87326 100577 454316
11621 454316 64194 -350160 82978 178264 -3069 -154373 288921 -132345 -155822 -5907 -24126
11610 -24126 94582 7853 20908 395357 115342 -24881 -169585 -31375 125018 -72034 296379
11598 110710 -3157 -36660 250039 -79300 60647 -157661 415983 82536 -40778 85950 205616
11587 205616 234534 153160 153202 -32164 -68249 -148424 -18642 -331327 102304 239487 -39394
11575 102840 38314 -205795 -68951 170253 76017 -24955 -164294 61079 -165815 -131547 40277
11563 69333 393877 -120997 -42415 25434 163615 -197251 -42608 -176564 367775 -317710
11552 485283 110366 -110310 162077 84832 -5636 -383227 24798 50781 107790 33075 289989
11541 289989 -78551 322901 -416902 181823 -63825 228762 87062 231372 143426 217422
11531 217422 233607 35330 379399 50699 -7800 379956 -261342 113228 215877 388595
11521 388595 106141 113614 135156 332782 224493 -48617 69308 314824 131390 -186730
11510 256584 156235 93382 319506 160415 -2710 273529 172616 305051 312873 62136 -154454
11498 46345 40288 -35463 -52878 139723 186502 262186 -62239 559485 -1190 25805 393301
11487 393301 200719 298612 -194831 127940 103408 480342 314458 128954 121572 222176
11477 222176 150673 -78688 315750 237091 94244 196653 165545 259656 -16211 146792 264450
11466 264450 224085 102583 55831 18345 246455 61875 198080 431911 357718 71567 218535
11455 218535 -11688 217596 155070 276811 15125 110175 53357 -91671 107398 120562 221505
11444 221505 -92529 -90581 -6825 -195834 70547 -130430 -40860 -222949 -50649 156247 36133
11432 -106838 212753 207580 -17013 -172345 383865 111582 -50357 31400 148118 -81082 55696
11420 199639 -127864 -177695 36841 379496 38977 217183 91349 -103099 -49729 -221712
11410 -221712 -7424 119290 -45877 41676 91998 -290117 -57442 107931 2448 -8478 88590
11398 -52825 -23821 270385 13726 -48340 248664 86593 -17547 142234 15101 -391657 -147706
11386 101081 292130 -52294 -114519 -39350 -84510 -266346 58072 134236 -252895 -61189 197882
11374 385799 404506 305931 93638 -43453 -94143 -151809 28679 313564 19936 -122281 249923
11362 107432 -194392 -365203 -395661 -135124 347654 332506 -133191 -208234 216193 55240
11351 1592 -165276 -210588 -34831 -116401 25352 280880 -47934 134564 93834 -258960 -340714
11340 -340714 346641 -143136 246361 293635 -225933 -30337 -91889 6996 -13688 -158328 -123243
11329 -123243 57822 -8576 187335 59763 -45008 -419286 107216 244268 -128595 67425 -271894
11317 89660 -38491 -421520 -48129 -2511 78669 181117 -194663 127560 -177649 -240408 81414
11305 -222032 -193314 -97945 -69065 -138282 -300499 -142850 -264524 -353803 107046 -131948
11294 79644 121946 -264854 68034 -13196 -170160 -302763 62462 -71014 -293893 -249172 -355642
11283 -355642 -172428 -151021 267185 -196213 -22433 5065 273872 305043 122909 244100
11273 244100 -114698 370136 56615 -196602 58461 134031 68779 -168029 125744 -431585
11262 -171330 83916 -173521 -340657 -141561 -324849 74312 162068 177975 -89982 89092 -205062
11250 265305 164814 -5397 61957 -199866 -208232 -47169 -313609 -361684 162512 -370849 95685
11238 -5556 -91862 -63848 -35525 32449 -74852 -70048 204155 311731 -181938 -132037 -30073
11226 -242606 -32309 107840 -107256 52361 -104986 38080 6887 225658 -101001 -45106 165769
11214 153196 -266839 123200 -35262 -109987 157650 -245158 -60009 35013 42853 169670 -128875
11202 176385 -543896 -137848 -4961 140756 -261908 -250238 -57423 -17974 163128 96012 -184177
11190 80933 -172425 -335305 -47002 -35805 137169 -341964 -187031 -115304 9150 290638 80546
11178 -198936 -15128 183286 -69102 -207119 -181140 -19599 94292 -71502 -170778 -307524 51407
11166 -108643 -139396 -138019 -123862 -209 -259118 174083 -45429 190752 -184300 52890 -304386
11154 119199 -247427 -219995 -45444 -115976 19613 313078 -42710 22492 -231219 646354 -5736
11142 -147850 -59210 -159809 251362 187993 -39067 179704 -123731 203352 -232378 -235745
11132 -235745 198631 59953 79462 -150486 -35928 55649 409022 -355451 167009 145714
11122 145714 -141226 123931 -27939 -106645 40669 289405 156048 97431 135553 -330802
11111 479624 228796 -95136 217513 473415 280070 254277 -138703 164524 224900 10050
11100 77258 63565 337076 101271 5948 218251 173670 -60030 51211 -48648 181756 270420
11089 270420 233660 174908 266311 241199 157128 117353 458440 355484 210548 417907 216178
11078 216178 -50093 344040 421596 432575 14528 -47881 -48047 226335 285989 307196 417302
11067 417302 335811 522000 429357 270424 591082 289833 621568 573261 887294 722083
11057 722083 926295 761989 468991 789017 593746 885352 906908 668316 793757 731655
11047 731655 633627 670134 758649 732269 623290 434485 1066914 988553 970255 1084080 483231
11035 791761 628385 806796 852391 802846 481743 530726 711984 706055 771500 821638 541174
11024 541174 464397 814488 447974 587527 447518 840909 724278 599637 626050 709540
11014 709540 760995 884629 834125 491797 527359 405351 579628 468944 908936 706411
11004 706411 127191 651222 448765 869992 577435 387783 466258 893308 593592 767133
10994 767133 1081044 656088 806669 405871 684927 710973 885093 1077188 1128124 1179223
10984 1179223 950776 1009387 1070799 1519311 1501503 1867656 1880338 1719049 2062650 2361608
10974 2361608 2586369 2594211 3003718 2891579 3243850 2985015 2703882 2290975 2071319 1772622
10964 1772622 1911257 1714386 1763725 1751686 1481212 1449409 1628530 1118099 1388749 1366050
10954 1366050 1123174 957473 1088804 706705 399283 524666 144103 344200 431466 174951
10943 99993 223508 443561 221179 71370 267484 287260 -24326 124334 18891 141935
10933 141935 136402 60707 -32655 -55172 258253 116891 -198058 -416144 163945 -13854 253601
10921 93006 112161 332373 8175 231217 239022 -202710 278909 -308486 178401 -78702 152650
10909 -240822 -231119 -51392 55919 125077 -25984 -306968 -60094 -64884 -324393 12849 101804
10898 101804 -48264 25405 86624 -106918 86031 -220194 -131458 -21785 -63721 245227 101221
10886 66584 276090 -174308 176508 -82951 -137985 59179 120203 297495 238160 -71821 -155840
10875 -155840 -37076 75933 -112441 385515 -18257 267586 71422 263690 -22093 159144
10864 -307656 72404 -149701 -101811 -129255 56381 -17952 -452771 -83879 -66665 -33303 -138609
10853 -138609 -25876 262085 94086 20845 184015 -239277 -159887 20318 -195783 90776 -161892
10841 51112 118419 -220861 -155535 -58654 -35714 -169369 -29305 -103600 -96291 -134134 43783
10829 63458 189517 -49986 -134830 -53027 -73442 65544 4165 -260184 -62522 7653 -111228
10817 84175 307176 146928 226352 -117702 97616 47447 -122541 244745 249096 165855 13753
10805 -110034 136912 410545 -251485 173248 144616 184343 -55027 121794 -196368 -131299
10795 -131299 -176839 46497 -6645 8163 230270 132695 3008 109844 50121 115996 -57115 302261
10782 -169409 2706 -199811 -246400 -231669 -108655 -132876 49347 54984 -349278 179869 -162038
10770 88145 -106756 112121 281106 233203 65707 -49175 -120742 -126144 -4537 -196278 54227
10758 -167466 259136 -211525 -211736 50314 73945 46159 -317978 106124 -194947 -59643 21613
10746 154070 -51953 -4321 -235505 107861 -164146 -433302 -18052 16422 -220878 -390918
10736 -390918 -321084 33763 -120770 -315673 47581 85751 -5998 -242866 -88093 -134244 -88592
10725 -88592 -85625 4917 11930 106449 36337 -189149 -97944 185695 -304582 192033 -57018
10713 -312563 -366012 287221 -45969 -240692 -412932 -111695 418411 -111548 80469 -110998
10702 99826 343642 -107653 79145 -130230 -575263 187429 -108635 -247355 -267376 -6164
10691 -239865 -139126 -194823 -199218 345080 -137687 -28211 -172088 133534 55964 111198 27839
10679 68779 -299172 -124256 -3726 182545 3411 -272507 -268380 -38054 -269870 -1288 119739
10667 -105140 -130365 140355 448418 -42802 -83489 -255493 92844 42184 11615 -178830 295322
10655 141530 -7925 76031 256054 -92994 -438034 -150368 -245027 38804 138324 112402 44339
10643 285708 -136824 39552 -422125 -24672 159452 147054 33215 167550 -200380 -221515
10633 -221515 213195 8055 126642 -54011 12983 78323 -361681 -216702 217335 124778 230661
10622 230661 -1008 50390 270186 405459 -105378 75147 195009 -211496 -21193 -249113
10612 -249113 148998 -64553 -84766 -18102 -156558 10596 -77219 -53348 -232206 -52422 -22139
10600 -132162 -308051 -146606 111922 236641 -252715 -152764 236022 -114973 -151731 145839
10589 187697 -17253 216722 -228186 86681 -224483 -206941 72217 -137003 -120148 -17873 -206980
10578 -206980 150892 -198252 -217332 -4779 13577 78320 -138271 9532 -22132 -170163 -183224
10567 -183224 -376606 -47468 90562 132401 138702 44461 -89789 7884 126368 82187 89493 -203724
10554 39447 83116 66790 -4002 -38892 -103926 -15703 -260710 145143 367882 320677 -656 236013
10541 198547 49807 67498 240258 73837 -66222 -15954 -188536 -77866 -75707 -373354 -249799
10530 -249799 -179336 142256 -252391 -2907 -345658 -355162 -420228 -43365 -66589 234092 -22443
10518 58681 15276 -72401 14908 -192937 -434 435712 -168978 -327979 17933 226131 -137495
10506 -7147 169257 -114182 109676 -121489 235521 209404 479163 -144365 326150 73224
10495 -225744 248507 -10107 259801 148418 -208975 24456 175525 -266384 117797 125690
10485 125690 261194 355522 37788 434793 75573 -153850 157485 60780 -73276 -179027
10475 -179027 -155823 -214440 -6962 43644 -39952 -193964 -17358 147556 -29445 -123495 -115503
10464 -115503 173242 -143651 -133574 21388 -172738 68645 73918 -144480 -340085 -239007
10454 -239007 69454 -148488 -128012 -62972 -224503 -145678 -65051 -22495 213141 -390562 -169318
10442 290969 -138060 -21525 -105528 -172791 40481 -17727 -77678 -26105 43253 -234632 -421205
10431 -421205 12283 -136548 -82874 137635 318 -22131 -280140 22989 66280 83746 -48669
10419 -91851 -303896 45679 146668 85084 85365 -172611 -145183 -225802 -256433 88923 -23812
10407 -1463 106967 31574 249806 -113499 -172256 -204088 -110957 -232593 -185291 -30536 -191744
10396 -191744 83373 -55604 -143757 279719 242845 -46386 16773 146254 85951 278580 206182
10385 206182 274730 354743 -74193 239495 278813 18027 409889 -74812 386649 186421 390441
10374 390441 -71739 370289 511920 423304 61943 372120 551437 329646 512899 524070
10364 524070 336365 107748 337283 267686 420925 -45672 39719 284463 -107479 234946
10353 525485 534918 794928 326076 484127 577584 490298 387154 389318 167269 368329 59550
10341 458663 91412 244624 112483 62202 218053 491449 165066 66661 620809 139940
10330 22203 27206 51864 45453 107218 -42810 378645 199190 449993 235075 116742 150744
10319 150744 -238412 19623 117261 260292 203537 -131457 116613 -335883 2306 165975
10309 165975 142637 -70022 23022 76676 7848 164007 180152 25177 49171 59448 -37613
10297 -182567 -97338 39111 -179784 47580 -98481 -78113 -228426 73246 -198720 114329 127155
10286 127155 295739 267649 22349 -172948 -169595 202114 276473 -80725 226165 -57601 56819
10274 -232941 -43416 -33337 243671 48253 -144847 269295 -13260 289047 21251 101297 227446
10263 227446 326639 320606 487526 475375 115296 544328 125615 -8801 -10349 10907 42906
10252 42906 45997 3999 391153 -168710 -166013 108200 -126402 -48372 -21636 -162024 347574
10240 299020 -218942 -99883 82730 -69610 -60748 -107829 -66339 -153433 -275631 7344 -32784
10228 275848 136112 -34634 -232979 -63233 -99124 -94877 133071 -167763 46073 -237937 -318364
10217 -318364 277514 -86461 140478 -39209 165524 -51330 142453 105619 -51458 16154 204547
10206 204547 -239423 -260301 -182496 146057 64887 63122 -140215 -146257 -129655 -143538 -96243
10195 -96243 237809 -215814 -93525 192809 -66474 82073 221795 -134450 -135806 116511 -223662
10183 83320 -235872 -79781 184308 -54443 -144338 138491 -306436 -190911 -406341 -213487
10173 -213487 -270673 -65374 -178776 140317 139830 -23222 54723 -104044 -128375 -65837 -177548
10162 -177548 -147014 -74548 -160688 119643 -113028 -133451 -162167 213291 -221752 129238
10151 -65212 149495 11787 -96994 -270722 -112820 -365687 -282381 7604 -450034 -183593 -251822
10140 -251822 -295837 283535 -243114 -217968 -324222 200473 177421 -9687 -18433 -166488 -45359
10128 18818 54812 -301726 4139 118621 349071 26824 460747 69875 30489 111893 -43742
10116 35357 -15545 -490153 -158872 -224401 -249174 -603 -281911 58650 5369 316479 291263
10105 291263 183795 -43890 -92143 64499 -12875 -106612 63664 -72366 -142569 -92032 37629
10093 5597 -190547 280369 142936 25342 -55205 61587 -224931 -77501 -304123 -36138 -354280
10082 -354280 169071 -161 -187050 393338 -10332 -67124 -431331 -76725 -109488 49397 -134103
10070 -318115 -103598 -6199 -88434 166477 20370 192206 -82207 -34558 -111843 4886 -112465
10058 -122476 -202951 263026 239532 79745 -112521 -309704 292772 14718 -138970 4352 -159070
10046 100525 108919 -104818 47254 67429 -62600 -323828 -73556 123911 170923 -260982 -215882
10035 -215882 133398 -266657 315799 -172628 -201704 -185372 -118277 -203762 -338115 -20770
10024 -154686 -297967 -8465 204642 -162592 153065 78776 293528 -143287 115627 -373731
10013 48756 7296 -223062 -252468 -33282 140882 101718 216383 185179 -229786 -16689 63861
10001 149736 -263910 -23507 -132231 9651 -37877 230474 -147439 59219 44566 -187161 121356
9989 314801 6175 -289146 -232601 155449 78649 56775 53802 -58086 -200610 -192598 -136172 81745
9976 290448 -168282 -55857 -134490 -231900 -52004 -250580 -165518 -1666 94866 318347 125040
9964 170522 -188124 -222706 95498 288583 52409 -296828 54062 -233110 298911 27996 95616
9953 95616 -52263 -14522 -5679 -186900 -12155 94726 -214329 53677 -186964 -159075 -233359
9942 -233359 11772 -459103 -111521 46075 -274510 -489816 -200881 153473 -29401 -112079
9932 -112079 58401 17146 -15344 130985 -394921 -18034 -101940 144730 203008 -170681 -14159
9920 -319174 126237 -121275 13027 209878 82362 -75945 63413 -123028 -71117 52496 -295882
9908 18441 -239945 23852 -62200 -206422 54086 -9001 176176 -2160 -131359 147241 -193927
9896 -261048 -104926 84532 -278554 6295 -74354 35423 -276320 -109136 -38011 199066 17118
9884 56652 196938 -120686 -116496 -250315 37277 93014 180816 -173197 49055 -159594 87383
9872 -195608 133502 61989 -232505 64410 204693 -21624 -231193 -86842 280048 -167688
9861 -51450 -204083 -133175 69060 -163242 -288380 -51085 -263715 -250767 -43124 -137956 10123
9849 -238686 -33448 -43525 -140670 -270815 -105667 65654 -71808 -232918 -65208 -118255 3494
9837 259675 -11312 -92105 244261 -26803 -14820 -371914 -293522 -190851 -36269 433217 -146691
9825 -229744 46681 -46429 -26631 220529 -61586 12705 178622 60715 -213769 -98424 -54654
9814 -54654 280131 -196668 177487 -207582 -353966 -123443 -226309 402923 130253 -201886
9803 11892 -87485 -61215 -32018 114458 -197343 139046 58406 118744 107548 61469 -153920
9791 -27550 69803 -131084 -74724 -81162 -224539 -334392 -103906 -153117 -317397 234692 64353
9779 -21371 -178241 181867 -144659 -80136 60533 -53001 -251147 116059 -81662 -94147 126561
9767 -258693 -398433 -88337 135759 47500 66366 45499 -12434 281602 -160294 34428 351601
9756 351601 -148817 116264 -25127 11983 -49789 -166404 -114114 -206359 -197900 -159223 -260230
9745 -260230 137337 19897 199553 -290021 -14262 -126286 -20060 -78498 -158122 -63 -389473
9734 -389473 21856 -488237 -72750 -239209 -121892 -27886 -10939 -35871 -114086 57036 -246201
9722 33129 -42449 217819 -498440 59078 183899 -87158 224683 361203 -109419 -345312
9712 -345312 -212445 -409036 51475 -256887 -281399 -204568 -190410 -108383 33685 -30457 -145735
9701 -145735 162349 22440 -71418 296149 -175665 241167 -84432 275543 224436 -70677 -136685
9690 -136685 -137596 -170287 -51524 42664 150202 -149810 41627 10500 -339593 -208428 310149
9678 70174 -106965 111596 -52645 -227193 -128440 -97712 -345951 33492 -66072 -69369 -208247
9667 -208247 -8274 79269 -170826 186155 18936 -87752 -235467 -229995 -280709 102282 187813
9656 187813 -97255 219470 -77060 267066 1211 -187211 59547 -33117 9092 -127369 114657
9644 309798 -139013 104723 163413 14203 -292505 188728 -71894 291067 -84593 -105003 -145008
9633 -145008 -133616 -99380 216348 -264070 -43930 -253966 -77210 121418 -17357 -61936 -206451
9622 -206451 30465 -113092 287094 20097 -7744 -57581 19536 -74083 246247 -80601 7264
9610 -199945 11186 -19190 88832 84680 -157421 38700 -201090 -31281 184675 -216730 40201
9598 -58905 -301016 -150601 191497 -204799 -223344 -50745 60678 186170 -104962 173376
9587 -45762 15767 168583 -34825 -150285 160311 105112 -119429 -64020 -62401 -286655 36717
9575 -228242 -36293 -57369 12886 46406 -136864 -231580 162300 123216 84933 7284 121507
9564 121507 44734 -93793 143971 -437279 207701 -43817 12855 -321283 -51677 -119713 43009
9552 -217466 -63473 127838 -244808 245338 226310 -235000 156072 -115647 -258126 68264
9541 132677 -41549 53967 -14644 -119493 -409893 -4522 4132 -109239 39718 -179389 256372
9529 -88773 -30666 -317050 -25460 218480 -109650 -240244 -376932 -44015 -224350 200904
9518 166333 159788 -67804 -57384 -232924 -41359 -392939 101998 -343873 -220567 -247715 -196218
9507 -196218 -334814 153569 -288018 -105584 -349749 -233838 -124620 119180 61213 -419329
9496 -127971 35062 -190009 -33244 19557 -57110 -119992 -333348 -65680 -206504 128532 -25973
9484 -335777 118817 -38303 -150032 130575 -358101 714 -185878 -57746 401295 265850 -174727
9472 373132 24965 -90346 -311603 -244709 -215977 -91787 -38510 -249458 145249 68072 231683
9461 231683 169857 -267278 11806 -63705 -31473 89242 42638 -189322 18058 -48201 -395830
9450 -395830 -344611 -152750 187250 172080 -348412 -371808 -301662 145506 -9768 11335 2542
9438 -62373 -225055 34770 -164882 -392890 -156487 -166392 -29501 -9386 -69416 -47390 11277
9426 -175258 115950 -68068 21808 -65123 79698 -456410 203836 -175393 35041 222453 211392
9415 211392 -285331 131312 -54240 -212278 57945 -221965 111137 -137381 -393195 125318
9404 -114280 47380 -197579 -219501 -168296 -119950 178026 -70114 127184 386941 -96490 -58541
9393 -58541 -19367 170711 -72202 172490 153909 -40464 -86045 -115649 -197684 11070 317198
9382 317198 -255431 113727 -460256 40301 97637 143600 -318594 166714 107080 -228038
9371 -97025 -121184 -281562 -280583 190755 49620 67357 -174725 -7015 -23658 -91984 -90967 -289849
9359 -289849 -55353 66224 -410608 -119293 31030 52697 -91128 -31442 -166554 254964 -369936
9347 47034 -124941 -80609 -14379 -598677 -76470 -208002 -88660 -280071 -39470 -126798 -187746
9336 -187746 254963 -368792 46305 104960 167481 195327 -188194 56117 -180724 91991 -106949
9324 -51460 170739 -129646 -313026 -360059 -24831 -363226 -57031 204420 -157718 -107714 -122070
9313 -122070 -170586 -122483 24381 -73985 -111235 -237364 100334 8112 -218068 97210 -77151
9301 77632 -286818 -28717 -141657 64367 -134853 23569 234811 -250103 -33405 33964 -31993
9289 27302 -438926 116047 -244155 121394 -100270 -387908 -128014 54488 -230291 64755
9278 -139768 226292 -65239 290377 -127082 -41275 -104193 35906 -159373 -351451 -60358 157937
9266 -143743 230953 53663 257683 149788 -140517 -205538 105821 94743 -101856 -228937
9256 -228937 -218380 257238 84530 -74046 151629 -190709 80396 194367 -32159 -114772 40324
9244 115934 123346 -251371 -114306 60153 -152166 58851 -32821 -145187 -133329 -260530 -248674
9233 -248674 -158788 27384 6015 -142044 127408 207358 -156569 -72043 -72930 198342 -11345
9221 -90263 -155906 -115067 -255532 77697 80874 184490 76174 131543 -34325 -240768 78651
9209 212709 -398674 -227162 42126 80020 25850 -266994 4182 34982 336021 -213878 -335963
9198 -335963 -132000 329170 122484 -172159 -136287 -378972 -215515 -237717 -48589 -241501
9188 -241501 17119 55792 32253 242843 -35648 -168439 -174959 -217739 61311 -38706 171958
9176 -29103 -292587 -100397 153569 54621 -425188 -238003 202543 96166 -190448 102684
9165 64505 -172303 -134957 -274223 59562 -37308 -191341 -270249 8054 350952 -133792 36710
9153 -116892 -297045 198458 -83979 28453 -20102 -117174 -30706 -139382 247272 78077 -336296
9141 -111739 -70416 47892 -416142 -288866 116336 208851 -253770 -94470 -274207 -259243 -171893
9130 -171893 -107870 -139862 122021 94700 43317 154428 155581 -33506 262217 -218631 -123654
9119 -123654 -81286 -242495 -12498 -258686 10819 -84795 53209 -92756 -16830 -148788 -259276
9108 -259276 32587 -94569 17529 -404878 -241492 -6993 -192755 -370671 228218 125786 -177521
9096 -248172 -109922 196576 -13519 248450 232280 -161655 98159 -168048 -329700 81120
9085 -55900 20795 -138789 -115667 -120279 137964 -32327 12795 -226607 -257598 -22091 114542
9073 -75152 -9526 -34458 -165059 14371 -63665 97351 -109831 -25032 236972 76706 -131394
9061 -53501 -346689 -273338 -227483 -175341 48869 -80661 -200695 -171785 5023 81756 286466
9050 286466 127810 30383 -97028 -32819 -56353 -120204 -393950 -342694 426578 -219712 -299482
9039 -299482 154799 247192 274934 -29220 230029 -58764 81565 -147855 65300 -170740 -366378
9028 -366378 73471 32139 -351540 -175657 -125841 -351375 -126639 -150883 41774 -5457 186696
9016 -179697 -71067 176167 -62639 74124 -30755 -315584 -304981 -75242 67442 92784 -96969
9004 118664 -198907 33213 99361 -57065 -203980 -112294 64675 225552 59697 -57518 30617
8992 54434 35386 -260854 -82958 18503 -166359 -285691 -73547 204797 -266301 3 -19679 -157390
8980 -157390 -29051 -85009 34162 -18691 -289158 -463123 17750 -13206 -21314 -201924 -192635
8969 -192635 -288100 113624 -332244 29193 155301 -83304 -208703 9654 -395479 -128486 -209646
8958 -209646 169967 -131013 -24166 24823 -35714 -43718 -52838 -181856 -30396 -128673 10651
8946 -291654 7962 218643 -260386 -186773 58591 -84661 -281268 -204594 49845 -100531 -33788
8934 276492 20942 46795 -42224 -109593 -71737 457795 29780 45798 191454 389033 551005
8923 551005 3567353 10088907 1397455 440798 269238 198022 98736 165570 317280 159878
8913 159878 56676 138227 -191420 175160 276369 -407624 9984 -44898 -165012 -45362 408739
8901 -58681 170061 -112468 139173 18611 -65409 -231254 161529 220702 -109294 -203972 313565
8889 -142903 -106318 4884 105024 -317319 -391116 60637 -316711 -299775 -303800 -50665 223750
8877 -10617 181012 -1524 -119169 72253 -203942 131013 23907 -173063 -284129 6850 -33507
8865 -321687 -50872 138669 309729 1081 -171031 -301492 -8166 -310732 -212565 -104299 -43091
8853 214558 193564 -103686 30556 168719 -252925 72708 48782 -151376 149294 322229
8843 322229 2435 -199558 -147509 -192115 25911 -404056 -182731 111622 -18734 115262 -115387
8831 254476 -73402 -33726 -127909 18934 218417 -97327 -151300 -277118 -98136 -60040 -97428
8820 -97428 -169410 -42594 275826 -73060 86761 -388759 13679 -303724 -183970 -24346 10790
8808 49335 336112 -348219 257270 -254826 181525 67239 -130782 -211709 -390555 -169595
8797 -80393 -2869 59805 34077 42057 -274381 -247738 -20692 -144884 111739 -66180 264604
8785 174838 108466 -4317 -212052 -174730 -13027 -52788 -268372 -300991 -3521 -19444 -92325 209389
8772 140296 27718 -51437 -239070 -84567 6774 -52239 -136867 -228769 -150710 -29259 25728 -151246
8759 -121889 -92768 -61338 -113857 10001 5563 -218231 -2808 -55205 359709 139631 -76787
8747 -354930 -169275 -52965 -404391 245899 116822 -220464 59287 -167408 -216078 -47741
8736 312951 -160129 -194324 271898 -206356 -124360 -99875 279967 202810 -151758 129645
8725 -61904 73603 150455 -116188 -283958 -11455 87713 36120 11520 -277197 225446 16609
8713 -226552 11244 -86844 165699 37940 223840 -266532 18155 -91815 -166502 -136457 118949
8701 23135 65474 -218286 3266 -294148 -100123 -85817 86812 -219061 -30191 -70748 59294
8689 -108286 -68289 -88155 18660 -319181 10060 294215 -134873 150873 -206483 124584
8678 -52748 -205150 130553 83395 174491 10202 190598 264984 185384 367833 110249 171290
8667 171290 -226694 49856 -119572 32489 67855 121184 126267 -60831 -266311 -271738 252895
8655 162393 -353952 -125509 -64298 263314 -259025 -151065 -9122 51180 252028 -105201
8644 48082 97354 -8902 -82704 124166 29404 -358149 -120244 133777 -438659 -204579 46012
8632 -31713 -131707 23669 -150554 -153235 -212934 279008 2349 224619 -488396 -87817 -199861
8621 -199861 -39138 -147077 -128548 -130552 -81000 6700 -373538 -40419 95171 111179 77556 -264867
8608 -63893 28605 -258510 -119428 -188239 193538 80889 -30602 -165472 43260 90755 191684
8597 191684 -168514 365609 103649 -117039 -43155 221728 -371999 45723 -650291 65595
8586 -122661 -168971 -31733 101483 -222931 -9105 -137709 -305332 396228 29812 321016 206365
8575 206365 3565 -127493 -92157 -64772 -196068 114611 -30534 -34409 -250928 -150605 -7034
8563 454030 -175576 267211 -157573 -127625 -15564 70782 49651 -669 173413 -54569 112585
8551 153965 -190512 -310529 113833 -86883 -515266 -298180 -228211 -204234 -173916 -50532 73137
8539 -96769 -68880 56998 -76915 -218436 -283066 -350319 31571 140971 -51086 -53312 -248476
8528 -248476 203800 -194796 -55591 280894 64285 14829 -304284 558161 69504 160021 2919
8516 -151182 -114736 -110454 -106561 -102162 -30604 175300 75764 137621 279932 -91269 9237 -245610
8503 -40070 -152035 -39194 -216321 -302570 -399714 124239 -127992 115230 -153925 189496
8492 86695 -152697 -35044 -269012 -283844 99276 2806 64550 323688 56656 -66718 -161000
8481 -161000 -106708 124921 141049 -143847 251064 -86450 -183106 122500 123343 -109636 171992
8469 -81610 110969 -45607 265134 20183 -16588 24111 -370834 -269233 66362 -180831 13150
8457 -175915 -156435 -6769 21427 132651 224612 -43309 5712 -187893 -184044 -25188 -310486 -119645
8444 -132598 -262133 103363 173831 -352161 -70371 -198547 170735 -337275 -79968 -206507
8434 -206507 74449 153 27812 206566 97393 -146302 -167313 -316467 26233 -208015 -85350
8422 75825 54374 -238762 -91032 83676 -14428 -144787 279683 253285 218061 231150 -102648
8410 -18966 130231 -91788 118517 -102550 -156604 -216873 -114576 203291 -138741 308326
8399 18672 -304254 -51400 299044 -155173 13493 26289 -274738 -272805 -324109 -218788 156885
8387 -43390 -113942 68444 280315 -225298 76318 -42506 -3676 -102833 64986 88964 -296048
8375 203704 -7792 17779 -13565 14804 147941 -40946 -125334 -37811 103281 -45037 -358659
8364 -358659 17506 44918 -323636 22314 -183557 -270525 1010 230478 -234071 44337 -81606
8352 -155304 -247541 -116083 108422 -76598 -64293 -190666 -381623 -108547 205829 -73522
8341 -163358 -231313 107604 170686 6760 -34302 11116 -17211 77799 -210926 -3238 179875
8329 -180177 -190237 -147832 -152350 221678 -164092 -187076 152915 -293458 -216534 -164340 -200674
8318 -200674 -125195 109747 -170742 104860 127178 60327 -193673 -77467 157297 -224639
8307 195357 43863 -89577 86578 18797 392664 193167 -207341 -261011 37121 187012 -21562
8295 -43779 -83512 204057 13402 -230321 -275617 -264980 -95754 -204792 365773 -145804 -316057
8284 -316057 -369588 -13997 -224985 -338890 119798 -275638 255285 205956 -279168 -3534 197707
8272 109817 -259719 275002 52304 -166845 -84771 -14732 201185 -226581 -86004 -160550 6365
8260 -361934 135522 -116519 -490689 -186714 124495 74184 -218913 133392 204136 202318
8250 202318 -224044 -310317 -27412 94120 123723 -58212 -93896 35892 125982 -53623 -46293 -308792
8238 -308792 159235 28605 -60177 201162 -249014 -363222 -64420 -40171 -10570 -211642 -6371
8226 320578 -122990 -124709 -176347 -297777 -178167 -33223 -89050 19550 193221 -274926 100896
8214 -220540 123994 178441 -295488 -103491 72645 -218133 95231 -67957 50204 -257056 49172
8202 -115696 -156649 140222 -70142 -120632 151133 -133787 451392 206884 49072 -211833
8191 -161246 107054 -139706 -55045 139483 -246327 174227 -124066 -3774 -139640 153807
8180 84305 -200502 40809 -69658 141252 -211813 126122 -255334 -357657 282595 -52047
8169 1606 -40111 113555 -28595 -443600 324615 -199336 95034 126978 -14958 93217 188549
8158 188549 59174 -97114 -23763 -17749 281489 -2222 303814 -235165 -105874 -39795 44622
8146 -31890 89419 -47729 -238869 306758 26930 -102961 -84401 -38938 235215 -216971 203105
8134 179822 136841 -262218 18567 -168132 -437429 22803 -254803 -32574 16973 -53950 332101
8122 -126210 -129679 -36253 57396 -12769 -56408 -235991 -207456 -247027 -169070 32230 90754 -45879
8109 77398 284540 42228 -76322 -83402 86390 253721 -167997 -14322 55518 145532 77998
8098 77998 -61295 -29707 260877 -3246 -216692 -204314 -235231 108319 -204007 194991 -5887
8086 77290 24789 -357317 -285656 -165582 249555 -145045 -266410 3113 -42907 232680 -260115
8074 -113700 48577 -72551 95892 -227117 -351917 103713 45683 -3943 -81191 103794 105947
8063 105947 -97421 52713 324221 -161835 -48513 -193056 -35862 -67374 79254 64 -135998
8051 7060 -58062 154837 -182653 -144019 -16723 -166596 -58753 255995 101768 -131582 -114274
8040 -114274 -116545 -172069 112232 -90260 -156383 -329867 90442 83535 187707 111329 -205834
8028 -162312 -81211 19611 -492836 -265628 278689 -72353 -82872 108120 -253004 -74925 12965
8016 -142313 -370389 -25452 -78289 -238424 -329015 -83002 124206 -120741 7597 87311 -137773
8004 -131910 -69501 -255003 72192 59733 -317892 14120 -237762 -37809 -273018 -248076 -176568
7993 -176568 40830 -18046 58721 -124972 93045 163983 -28587 -340911 162821 -262724 -107644
7981 119513 -116070 -140424 -97410 185240 97570 -3394 296365 -136938 -365661 293503 -46593
7969 -118268 103753 270285 -1534 353228 205014 248991 24388 -41149 136207 174613 106638
7958 106638 -16369 -311055 -187509 -112451 -141443 -67918 45706 55147 89671 -64078 223178
7946 97714 -111721 -97110 31937 -165942 -81401 -437273 -156445 69199 -44084 177439 -54216
7934 49351 -438717 -185492 -408935 -10455 -93723 71226 150368 158228 -102418 -372628 -23751
7922 -74781 -345562 -197744 182646 -421207 53386 -163615 -185549 -125124 378583 31110 -47671
7910 -375686 -112115 283025 -246222 48917 -52886 -79674 -140525 87532 57127 -133893 -238804
7899 -238804 -328983 247175 2740 -253167 67965 9492 112151 164739 81001 122852 -156878
7887 194028 -228955 106757 -32942 -85081 318742 254658 132449 -306262 140987 77845
7877 77845 -238683 -116196 16136 -272164 -195181 179306 137688 -317995 -55754 -19247 -161714
7866 -161714 -168137 122472 -184374 134881 -112725 -35648 -230498 120138 -21074 -153259
7856 -153259 -236590 -84202 46814 25166 34060 26088 -234386 -151524 -169867 14919 269083 51277
7843 65287 109546 -54442 -90575 -228999 139561 187245 -240034 24358 -135554 -312042 14259
7831 -331446 -76768 87526 -362162 -273176 82170 45447 -163659 -130260 102525 -91671 -31134
7819 -148458 -369106 -260408 21016 221683 -115908 -79041 -113693 -116270 183404 -192913 197090
7807 268825 -109233 -162256 -38420 -39416 69071 -89879 -25034 -280228 -168817 91091 -227721
7795 -186616 -201787 -50985 -304642 161446 148971 -156437 92030 -209808 25736 34448 -49395
7783 -366694 136867 -44384 118556 -413135 40102 194942 259688 76278 -33347 187200 -272688
7771 286367 53231 35138 180977 75984 -13106 -156585 -88238 186197 -242815 -97726 71153
7759 11297 -225229 186646 23766 178381 235935 184385 32796 407999 -236668 -142865 1722
7747 398089 -76335 -174381 135003 -34490 -183542 2613 -44673 -376382 107123 248925 -93248
7735 -147446 268499 76167 -91730 -422557 343466 -105454 -13603 -63432 -80810 -259536 373103
7723 194364 -185108 76447 -75340 -44069 -2076 58238 231542 208022 137234 -107328 15434
7711 -74853 29159 -141253 13755 -342109 -313082 -69420 58155 7896 -668210 -84851 -44446
7700 -44446 -231793 299210 -276007 -49992 -141784 -59052 157570 -393033 81590 -184530 294344
7688 125866 -131995 -25966 370262 -68532 -89683 -268736 19547 70419 156301 325129 -160750
7676 -256128 138552 165369 148300 -42337 -89172 -147429 -31900 255113 -69123 -223458 92436
7664 13332 -70620 -278121 -133810 -132843 -237791 -245246 16126 -42447 -266 -159345 12631 159753
7652 159753 -321872 245508 -26690 -48219 -89040 -17323 74450 142537 38451 438511 57485
7640 115022 61595 -197331 -603 249848 128083 -222621 -61503 -122141 201326 -314641 227271
7628 -226362 178117 -264381 -120290 -41045 -35586 -71771 166656 33671 -13905 -173924 -292913
7617 -292913 -61535 89843 -14368 21781 330895 -110121 -150808 -157451 -128719 -244845 337127
7605 -393347 -146362 -47363 -62377 4549 -99274 25106 -393464 -323803 14719 65505 -152572
7593 116844 -426492 23002 -97197 -110680 -13911 -141721 48202 -344459 15957 19857 -169027
7581 186967 -136431 151441 75572 -60088 39956 177733 10281 8398 -44670 72265 -74202
7569 -31261 273726 -249321 165832 -16798 -79476 -119241 138539 -27187 -166560 -31370 228423
7557 39921 -165113 -354313 -244463 -155437 83741 -306781 -16175 -251 -296406 -18559 -276417
7546 -276417 -12762 169952 115888 112839 158047 115282 12871 -98888 -20707 290490 -293767
7534 20797 -99113 -109967 93599 -46026 -180443 393783 -190567 122699 249095 -150288 -12896
7522 -34245 -344708 -254587 -3702 -192799 179194 84288 -93997 103705 -146566 186385 -164882
7510 -273929 -89512 -89512 263704 -120882 239731 107274 141248 -135211 30678 130548 -263602
7498 59860 -36319 -14859 66383 234258 -54415 -135589 83061 142148 -184645 -250734 247781
7486 46150 -314384 -288151 48583 36656 -245137 -23139 185701 -167668 -180267 -242435 166532
7474 -64304 -120636 -55855 110094 154620 123047 -56028 -210753 150349 -65727 -284206 9028
7462 70492 -120044 -237427 -50588 298992 -130607 -148767 110496 -804 85438 -30976 -219588
7451 -219588 -51458 143728 -100053 -311301 132440 27808 19476 -13157 -196836 -38706 -257824
7440 -257824 25822 155891 -51618 106452 214241 -29253 99278 176429 370382 -50298 124903
7428 241249 -225165 -16190 308247 254204 -97084 -55005 -13662 -327388 -322157 140385 -377996
7416 -333752 -280667 98013 -602115 -2559 -164822 77155 -65316 -258371 15700 -201445 64094
7404 3096 -177430 344097 -318237 -81516 -206900 45631 59580 -27850 -5693 -315172 -218287
7393 -218287 150988 61712 30248 -298758 -46870 -260837 221785 -247967 24051 -33530 -52874
7382 -52874 333 144243 -208411 -51514 62874 -97558 -102571 126720 146654 32869 81635 261189
7370 261189 -59929 -123575 -161847 -105764 -379163 -107512 27845 -54538 -212679 -364379 -365929
7359 -365929 64415 190524 -180293 -105202 -169014 34727 41798 -150083 -70982 -98241 -194869
7348 -194869 -141231 -93621 -32744 -181701 13590 412773 284272 181759 112102 -145145 -316762
7337 -316762 44652 51379 -86997 169010 -101876 139293 34862 175977 -583499 265166 -112238
7325 -30438 172443 -28852 -152315 -174209 -202841 9723 14065 -261357 429359 230668 124316
7314 124316 187861 -70669 -362893 -243069 177328 203765 -93733 -193486 -315863 151210 41423
7302 -129491 -299459 197232 91559 55776 -152368 19186 143182 -209760 -80950 -31704 84320
7290 -96342 16797 120472 -25548 -49522 -396039 -82115 -74665 22332 -25350 278888 -247385
7278 -163504 110723 -21404 -169558 139719 -158557 28571 -81882 -142367 232181 172545 205334
7267 205334 225027 -220552 -184795 -93174 140616 -171749 -233460 -9550 160749 -42282 258054
7255 147112 -89796 92672 86244 -197788 277352 166392 132515 180755 74459 -20858 -122486
7244 -122486 -179114 -88892 21285 -264313 -145185 -157982 230428 -17946 -94551 -97705 -49949
7233 -49949 413983 -28057 236141 104364 92621 -76054 -314486 32551 -94253 100969 -123200
7221 47477 -377091 -138977 57764 -146155 89911 9137 -25883 227331 25448 -283437 -344198
7210 -344198 -57320 10896 -226085 -230165 -320352 -174447 -9033 506 -366924 90686 161684 92900
7198 92900 234810 -76928 -196595 26856 -407210 -128165 200140 -77046 3455 -289195 -152142
7187 -152142 110026 -100386 18077 31800 -190808 94371 -16184 -90607 122591 221431 -258443
7175 -76799 -104429 -226767 17606 14977 -78190 -47547 140339 194019 -226539 -85115 36188
7163 10229 -219623 136112 -115294 -135890 -39871 302592 -339572 -29106 -206638 -90107 -69332
7152 -69332 -162065 -118671 -189766 62101 498851 73235 -362173 -45963 -195183 85523 -183589
7140 -287512 -18116 84867 -18546 -51305 -244760 82084 29039 -118241 -143106 -156554 -197964
7129 -197964 -3073 -130038 -106769 -22650 80890 -37009 -320641 298484 -55721 160775 -36013
7117 -68617 84674 43986 219192 -57362 -202900 259122 -67789 346187 -255533 -285212 -110511
7105 -161665 94936 -262628 291319 63128 91751 -3432 -437435 -71333 -65015 84617 -7184 196261
7092 -127150 150868 -37368 -410326 45388 596389 -34764 -123149 193982 -396184 -351166 -56200
7080 71258 97993 -22818 102957 -67009 -223825 -133570 -69255 230462 123726 -157095 -269591
7069 -269591 -73817 273239 139103 -178392 -7652 216056 -134992 -91139 14942 137673 68747
7057 89100 68845 -220022 -3501 -72 -117494 -21612 -23449 -67357 6126 -65413 170953 124355
7045 124355 -23690 -112151 240887 25073 105903 -97996 -280612 4932 -139330 -233972 297127
7033 -200602 11559 143350 -65468 95594 328573 -48015 -48052 -59244 -78459 -49099 -246508 23157
7020 -271220 224911 36592 26950 -80748 -110859 -64704 154105 -161529 221033 -109941 74698
7008 43885 46065 -210519 192405 -221879 376667 -214828 -123392 -171229 -3609 -212924 -141534
6997 -141534 -19035 -148223 -186343 38550 120749 -60499 -192465 -174492 -190842 -323203 -156168
6985 76683 -169185 -171962 -64058 25457 -273609 -71773 -370974 -297521 30393 -130847 7230
6973 1587 -107921 303740 132094 -144503 88797 -171833 -266455 60253 -166209 -268440 -245107
6962 -245107 -161938 3726 -244769 -36719 -158890 133684 -280635 25080 39682 -107381 -128859
6951 -128859 -75303 -21783 -134542 160848 -3505 76325 -30665 106985 124500 -64302 407847
6939 326116 152307 132701 -12516 -29198 31216 26382 133235 -139637 -347581 195388 36120
6927 -158020 -119826 -131164 -12865 144356 530744 -121784 9511 12626 143098 138942 27460
6915 -197826 -45199 176665 -86512 -123036 -448983 70098 266298 87378 148693 82883 -39480
6903 -687947 33116 209747 451374 -134325 82080 132090 277113 -322536 -119640 -225942
6893 -225942 -48268 188566 311393 -89605 -63945 -348576 -92060 419980 -158603 -322552
6883 -322552 -154876 -123375 -195811 28377 90803 -1539 -493998 115862 -232969 40032 -104426
6871 -198492 27795 -58549 -174330 -78427 -134305 -285354 249498 -155973 -235542 -334284 153450
6859 -223096 29737 -43943 -130502 214034 -1580 -199708 255876 -78551 -260784 -143276 -212087
6848 -212087 -58428 139571 -44443 -1046 -123893 -189041 -180327 188150 -310713 -229148 -70882
6836 52259 33853 -89764 -250479 111026 -230221 38948 -100814 -3229 220579 -249655 158493
6824 -93362 -61686 -6483 -140823 38212 -127629 54649 -67243 -127211 -79542 162993 -116933
6812 32363 -205816 -191010 -261114 405978 493007 263014 130270 232645 -150607 -125612 -65183
6801 -65183 240297 -189980 -36705 99068 35544 -354112 -101474 -19032 -219737 87392 -197827
6789 42621 144232 -160750 -157407 -198695 -87861 114294 18096 -15030 -137475 -340746 120964
6777 29500 -96294 74394 264963 232433 -253142 79523 175339 310530 -129412 61652 -37616
6765 142401 14718 -88491 -364119 -40373 7873 -77930 -425818 -267501 -287295 97912 -18703
6753 -59942 -378181 -126023 150756 195457 -95276 -104055 90860 -159230 -162259 380429 200523
6742 200523 -129415 -34804 97835 -49421 -45124 -19919 -121921 15659 -228279 -145398 -7920
6730 178812 48351 180873 166793 48544 119550 5279 443484 133034 9973 44237 46401 452775
6718 452775 -162230 -13947 -266617 123142 -50087 311731 216266 -272747 -37350 93831 -21715
6706 -190850 -234862 30374 -6512 206284 -52134 -229190 1527 1517 -172221 -197191 36690 -417120
6693 -85802 -146547 -201638 -182967 227737 -57311 -115007 -227505 271125 5048 -116576 9186
6681 164622 27932 180234 -99058 138769 -42630 -142989 -76006 -170597 -52773 -64915 -77259
6670 -77259 -2195 -40067 -232010 155642 126534 9158 48273 1081 -311845 168424 173993 -51954
6657 12513 -143846 -188637 164687 -19708 269426 -270129 88893 -259807 402 -88471 -161501
6646 -161501 33795 -154120 133654 77781 -146024 557 152278 -73942 -15984 -53482 90809
6634 -260442 27819 154592 -346753 364068 107595 217446 177377 171323 -242464 259339
6623 -344210 -2299 -272747 -204490 49812 93015 191632 -758 131749 -248646 -59947 84486 -223516
6610 -308877 206899 -376828 -103750 -292700 -56853 -8832 -383190 290231 -286487 -61086
6599 948 -204703 -20794 -65537 -220157 -15208 419822 -100009 -57577 -50687 -408519 -250519
6588 -250519 6759 348108 37604 37982 -43539 126399 150997 -41732 -144654 135900 164060
6577 164060 -74868 -16422 -140860 66434 -118674 -80551 152597 116637 165951 104844 90368
6566 90368 -207646 10625 -151375 -67331 -327938 -182458 195808 116896 288253 39882 -109819
6554 74712 242139 -29522 -321376 -81472 -17224 46250 81132 88354 -102252 -235446 -88048
6542 -433239 -63126 -308263 106326 -73517 109223 -197404 97303 15563 441526 -103114
6531 -32892 -158946 -69174 -300095 -13702 -117704 416029 -81475 259658 231037 -86509 -16869
6519 212801 -191378 83133 -272375 -95050 12339 216762 -262399 -335824 -205033 -53480 -156026
6508 -156026 49661 99685 -107726 -51474 -241599 194770 93887 -10715 230988 716 -6133
6496 165605 93857 -274775 -106045 245487 191997 167597 -41067 -85705 97186 -3302 -231632
6485 -231632 -2386 -121180 -208922 -303990 229005 165717 234941 -127332 -194069 -127755 -79330
6474 -79330 214322 174694 46071 -55131 -260640 226315 145926 28139 -102202 -100882 -316676
6463 -316676 -235129 -36190 -54737 290314 -145260 -376330 31557 -34554 -89708 -280897 -68831
6451 93960 188613 87946 265186 58080 -173519 -24731 -103433 136649 -474491 -259814 105879
6439 -176577 -184044 32335 -131613 -12391 222585 -138909 -91866 -40422 -231680 -136656 186873
6427 43000 -109332 -87961 -62106 55642 -2968 -17973 -61747 -239381 -312279 -32459 21432 80675
6415 80675 388585 -235875 -259209 66380 -295113 -141984 -160527 154769 233110 -137585 -408018
6404 -408018 106970 146784 205640 -111908 -207163 20962 -15381 -241215 -187620 -296390 271454
6392 404765 27440 -111897 -113202 -293867 -168336 -153445 187072 28779 91888 32577 149051
6381 149051 222944 -92819 290889 113319 230571 97110 -40591 -110460 -100798 -160939 -250753
6370 -250753 -279559 18720 -212346 277497 261905 -33848 -139900 252896 110809 -46920 252442
6358 24918 -377110 1534 -330394 -93366 108771 -207921 -84285 64965 315068 -104495 182328
6346 -85278 -44422 -10363 -170900 -110935 254744 -378649 16438 -343888 122242 446595 -75970
6334 48263 -255700 -121909 37961 136029 105998 -170589 184778 -226383 142242 -88107 142863
6322 135959 -158595 67290 127360 -47149 -171261 207100 -111713 216893 8278 -176280 14410
6310 186421 -166258 -351128 112522 392099 -174052 -46375 -196542 94869 -164743 -5883
6299 -7804 93392 203339 -47332 355401 -60308 45089 213919 43169 266128 -70836 307829
6287 124741 -272282 -152451 -96636 73278 -64735 -103377 222178 -72447 178900 -434826 -27439
6275 -108115 132923 292872 63405 3818 409091 -220661 225226 -140256 -83061 114042
6264 -142777 209916 -165969 -171051 67873 -289113 179245 150750 -390303 -94274 -445832 43675
6252 -230381 -44772 -191453 41867 -51162 103102 -96216 -56917 -185658 -202835 -311743 416018
6240 5581 -254306 -80658 -56104 245214 31091 109171 -137140 24821 -44310 -213584 -40256
6228 -30480 9890 5022 -140394 -30524 -26909 -74206 187720 183320 -72502 -225989 186939 -153797
6215 102828 -233325 -157243 -84468 246917 65506 85408 205686 -208813 82199 -10493 -77748
6204 -77748 -406262 62148 -114558 221151 3396 -192845 -127330 -395886 -236974 87686 349495
6193 349495 345799 51269 -149721 -84227 -3503 -99127 80760 84851 187179 -373560 73431 -107082
6180 82948 -56839 164686 12784 -271921 266945 -162586 -51059 20391 217501 -976 -494682
6169 -494682 236900 -44979 200847 -45679 -218289 -114878 -28139 -119395 -125825 308020 -421802
6157 238603 -367429 156915 564844 -299122 -16696 151011 147001 -115658 8247 49231 62909
6146 62909 44371 -58674 48883 87386 -156330 -116367 145702 160531 11611 325625 -100408
6134 129893 111888 -54558 32421 7520 -169327 37774 -253915 -297542 -166276 -130571 405549
6122 -151022 187709 165056 -531143 -323931 80127 -171172 76483 -269476 -90880 -294072
6112 -294072 -31870 -135186 -281699 -115583 215111 -21185 237770 221495 -111609 -96420
6102 -96420 25409 -71270 -48235 37248 245463 19529 131248 -144767 -115238 -253580 325032
6090 -129799 -143916 -117833 420339 -359447 -60456 48929 -126376 -84273 260898 173342 -92774
6078 -28882 -156973 25098 -257810 202565 61891 -137966 209067 63330 -77636 -75189 -76187
6067 -76187 56985 -142428 43466 237289 -265805 45473 -30859 134106 -205556 220275 -412460
6055 42358 124223 150988 209694 -59959 107594 34077 -116590 21592 184095 187413 182032 -41957
6042 12083 -144223 -348011 -161586 -98992 4310 -60913 133988 -148794 -133249 -123719 221393
6030 -117675 -70467 179205 152805 79396 -93359 267716 -322721 211382 189720 16702 130297
6019 130297 -273152 7131 55664 -103415 220471 -2990 -18188 172592 -127781 -153041 -223264
6008 -223264 -176314 -76846 -134788 154853 -167642 136805 215667 -12499 -178462 174634 -63025
5996 -92708 98852 228728 -335420 157253 95918 259515 -73362 -268761 81778 -94643 -72821
5985 -72821 201256 128527 7492 -96200 165494 393085 -217049 -84317 455177 -96322 406814
5973 -22668 -183796 79821 -152471 45623 -113658 71500 -199186 124030 -123976 54107 108152
5962 108152 211021 388402 84718 -128214 147243 -31041 -118766 -15859 522 -29093 211181
5950 199197 139058 -411483 -38792 8703 194834 231814 -149865 16623 -130525 -149354 276021
5938 16659 -21313 35095 -6436 -205495 140681 321288 106416 -162064 308750 -147697 -39227
5926 77996 -161012 -160177 -193435 178144 221960 136103 -390881 -262580 154109 -16573 -128531
5915 -128531 64337 75984 -216841 62661 215028 -107291 158056 227485 -113653 -72627 -162269
5904 -162269 392849 24333 -194867 -98500 -404671 -41018 -357772 25560 35696 87102 -126101
5892 -383929 -196255 124142 -154083 232541 -199322 62877 -64946 -486639 38646 126424
5882 126424 -34870 293837 -45394 104886 -203517 91008 -82536 -326185 71091 293220 -207275
5870 -92242 208198 349516 -175407 59368 -50525 -63921 52609 125982 46396 -118760 -160107
5859 -160107 230342 32079 -130336 82487 14454 -179105 -180308 -142276 84687 -147357 -37509
5847 73522 133205 174517 171854 -360521 69717 -179427 119218 65519 259232 16784 204636
5836 204636 65602 93983 2658 -75759 262886 -7622 227576 -166397 50194 213655 -205045
5824 -165140 -178147 7727 307808 397312 -165269 -5055 -267346 -117286 380860 -153672 -175196
5813 -175196 -55534 127481 31370 79520 151494 68836 197081 45503 -65278 165666 111548
5802 111548 323693 -45964 -93639 -16222 -131635 174751 327849 -216533 -63443 -299594
5792 -299594 -125111 -4875 -20752 182839 -52149 -72712 64043 -9029 -177750 -207579 74950
5780 -53656 83639 -240289 -146058 -97527 120450 -131287 -2899 280913 128260 155417 -165974
5768 245384 -2544 275664 55397 -151690 61354 99500 -229636 -181950 -94291 -245249 193122
5756 129671 176533 -47524 -507800 567170 -131944 146358 92371 55679 244413 -80928 101394
5744 -35139 467413 -153204 329559 164224 -429834 -190880 179898 -17986 -193460 35705
5733 -185162 -41743 261098 178529 -21420 90145 77531 -58342 211375 -192178 71013 -119120
5721 -110931 -18459 -172411 -37569 30422 -214305 7655 -16315 115962 -280772 61009 -57171
5709 -176345 -4015 -84586 347372 57394 -381732 87480 -63967 52055 -92244 -34230 -108898
5698 -108898 -117950 106966 114723 -1585 223101 69924 -217892 -302829 5587 75405 -91004 -287458
5686 -287458 -15630 148652 72031 -16148 -43662 -51553 379058 -68337 157984 245415 -301779
5674 -567 -131804 -22971 -73881 87813 157316 32416 33106 336788 263090 -196394 -61825 -262153
5662 -262153 -252273 -5542 166135 -179937 -36187 56067 42338 -103108 113378 146849 74280
5651 74280 -319174 -7441 -171717 -46276 -171136 301598 147706 159416 -377675 -220488 -188012
5640 -188012 20304 246674 25299 -261486 181990 -221965 194872 -242981 66 62386 -43089
5628 121077 240425 101647 -67553 -143368 37798 196856 -7847 157149 37597 79406 39513
5616 75747 314554 -1024 45701 191394 -33322 133722 -152810 -174366 -98320 -68095 -5451
5604 169668 -418917 182679 1628 61427 -120094 -386837 -124860 -126895 -250315 -61220 -175302
5593 -175302 -64195 -142888 -43453 -59184 -27556 184127 -35920 157523 -67387 79307 -176722
5581 -189341 -32908 -29828 -117357 -63720 84230 174416 -252898 -89226 -162136 178504 -11428
5569 -9473 -231851 -40582 120230 122975 -162895 84949 44666 114254 306733 -34014 -6333 94361
5556 -184266 -83901 284789 232332 -318581 -65059 -294719 -344108 19021 -23026 -80859 -265553
5545 -265553 187792 488573 32738 -104894 -182072 -250614 75445 -96490 -181652 -194835 441083
5533 383465 -250524 -43890 -105088 483736 169376 -42103 -76671 91277 294417 -168560 -112603
5522 -112603 -140597 -259884 171758 -113611 158928 173178 -17870 417478 -82519 -124269 -118846
5511 -118846 -81818 32965 262711 -75402 -89594 291168 298715 1296 -32661 -144341 315350
5499 42940 -192941 226055 -10762 -312075 -209163 -68615 -156535 -4360 -11923 113520 -83568
5487 -25323 -66212 312722 36055 -72278 -172966 -206124 -153710 -53559 -3100 -269769 18125
5475 -348585 -105053 26649 207026 -50748 -185998 -156743 293860 182865 108213 -203457
5464 -364626 161457 -31960 65625 55152 -125357 8229 63045 -26300 147935 -215106 240044
5452 -133110 86097 -292329 291121 128072 28980 238747 -77541 -63794 122420 -204616
5441 3792 44237 88442 -160765 -230361 37019 -54962 21031 164601 -106504 -118728 -235719
5430 -235719 161955 52340 110282 97996 268201 -259040 1140 -441637 101393 -57532 -111517
5419 -111517 17593 269018 91351 -124210 -118610 52587 -189275 -302034 93266 324916 -166226
5407 -12601 15960 -85469 -7670 -239511 -68737 69966 86648 163814 125281 100434 -125346 -183697
5395 -183697 188141 -204057 -348662 150177 -73260 -323550 194009 -336128 229287 -76100
5384 -65831 -11135 114890 241256 -27181 42049 36818 -147864 113580 256373 10185 286093
5373 286093 75081 80291 228058 -115596 214468 36888 -56821 187752 -4129 -67047 139820
5361 27806 -52168 -136456 19329 176805 114009 174478 -78783 -95526 -238084 85433 -73228
5349 233041 197041 165893 -65932 196416 199144 197913 64119 7738 59124 190537 -134368 -257381
5337 -257381 -26004 177023 -38986 -166474 -117516 157217 176384 87241 341810 90637 51715
5326 51715 88360 -190265 124113 -74551 180734 -118127 166584 9223 -313572 194938 -308624
5314 -183372 -225902 31496 -120342 137026 -29359 -2570 -433361 -104188 98944 218924 -117703
5302 106050 -225155 30790 -28668 108621 128320 136908 17328 -285394 127145 -43217 364596
5290 63777 -189978 49815 -64223 -59450 -27797 -200791 -93561 32110 88544 145127 353337
5279 353337 407855 -42233 -75902 106473 59060 40246 14735 -194514 -78441 -65506 250038
5267 -116204 123566 282902 82909 -308790 123841 -388767 67245 -221257 -116031 100380
5256 -97731 -21230 4773 13449 132570 -392615 -86297 71706 172768 53588 -12250 -280918
5245 -280918 -52123 -142289 -218265 -575 310542 -30995 -278813 -59049 -83771 -99476 240696
5233 123009 375230 -41299 -71879 151930 67167 73588 -637138 -13735 -212152 -339882 180643
5221 -226153 316847 152549 -89440 -131148 155634 -71127 36701 61172 108153 301403 -155135
5209 189817 239754 32922 -40487 -181826 -74336 231523 -36086 84875 82205 174153 153871
5198 153871 133878 110946 -233374 -29661 92777 63709 -53072 43763 73603 138980 -219705
5186 -209309 -149901 101183 113221 134189 134565 -11886 20718 41520 101470 212683 -3913 44474
5173 63935 333058 -1883 93787 -43284 -83880 138670 235307 -78314 156980 -8731 -313090
5162 -313090 17801 418975 -61259 145504 -380005 206905 -6759 5777 -389480 62008 133757
5151 133757 132423 -9316 -163253 -124365 -278650 -321277 -135720 418343 -259607 117201 102514
5140 102514 -107651 44493 -111913 -258825 -165683 11792 -49942 -40448 10934 -321612 -46501
5128 -218347 -28680 31279 194029 478543 69903 361010 -92920 -4751 -93419 -258193 -132511
5117 -132511 -482909 64258 147441 374100 -32522 297993 -184884 -28026 289929 -164985
5106 47001 -139217 -71166 -417936 198544 -354640 42639 -196248 114228 21930 150333
5096 150333 1752 161331 -173079 130992 -97210 283300 437894 147237 -152994 2923 -136177
5084 149179 -75130 -15225 352317 -179068 -52522 64981 -142397 28462 -391642 -137926 144279
5072 349299 63521 -56110 157033 27298 62294 73085 166897 -114231 -120415 -60320 152538
5060 258324 -236446 -46772 68954 -62583 91057 20757 112068 -135226 -50472 307517 -59278
5048 -239099 223609 -91486 -4892 -210344 -143889 18814 -296674 168237 -559 -139609 254828
5036 -172399 -35658 -75095 238276 53631 78752 -108409 107304 90824 447843 193727 150292
5025 150292 -113248 147192 260601 69736 85231 98188 -57339 -145336 12876 73577 60882
5014 60882 -49123 179432 201888 380908 104311 35144 -91632 23994 264384 89780 -43354
5002 174886 24226 89883 254238 51361 -175249 -78991 -253424 7955 244688 303463 -597
4990 -180428 -141564 -31792 -275703 -53619 -350744 306202 82993 340634 -3827 -315236 -62850
4978 191991 -21031 -28373 315343 118150 23485 32040 46610 45510 117445 291125 -342928
4966 109351 -246731 -89323 -58197 168962 76718 -17887 515896 -260340 -37311 -34900 276163
4954 38611 -72712 -175692 -202677 -73678 -125575 111570 109213 103710 -160854 -69111 52028 -20855
4941 153597 137279 250735 -51561 156930 -121808 -50859 -127369 -35390 204127 -236340 116896
4929 -256804 -291262 -12799 14854 92951 -112572 -200550 118358 106839 -19239 -73402 283509
4917 -54939 96197 -136521 71137 107157 129252 133696 -8339 145670 147381 89590 42385 -305491
4904 -158521 257195 57409 336200 -420921 -86206 -230339 -191424 -178187 -359598 -34080 31147
4892 -255429 -64395 -438700 -52591 -225281 246699 80546 114001 331142 -27740 93136 89170
4881 89170 223006 190341 206804 184052 -62132 -126338 -65860 -20271 188924 283966 19347
4869 -128166 -180007 -102162 50190 16672 88436 62118 -164737 197760 -54129 172727 -48588
4857 -19243 -71338 42596 -199146 -212091 -44176 131289 -21110 -48002 -3264 95217 211665
4846 211665 -336238 114433 109598 -535 -161511 -32387 26672 219305 154370 -108197 220460
4834 76905 283306 -53415 190874 30370 294174 30994 48969 -326089 -43624 -24818 -43247
4823 -43247 39221 269991 -28924 63633 22384 126445 36056 59011 -72823 71460 -55519
4811 40360 -138363 12954 -257189 27152 31490 -155424 131337 69056 98764 -60620 -53755
4800 -53755 274343 -41865 30875 28415 31659 -170863 -425595 -132907 -45535 148468 97145
4789 97145 85380 -339931 7432 -216037 9015 19211 -108880 93163 189216 167234 -66858 -171389
4777 -171389 112983 23613 -71531 -64491 -253815 -13999 135456 -131321 216446 268957 81323
4765 70783 134722 404064 61271 -54112 -11176 76343 -151647 149125 -72321 199059 98003
4753 -100247 121473 -78576 -110006 52031 -19851 228056 81301 385331 40004 -186425 39415
4741 -99161 -32252 -33785 -61793 85187 632114 113667 -119896 -87109 -26382 -86637 42268
4729 -171220 -214300 -55081 220697 127914 -155215 -116817 -236594 409944 -21239 -65684 5328
4717 -134536 142572 240608 -202331 -121135 -153399 282971 24408 39462 76466 -244155 195842
4705 226264 -13908 210838 151660 -154889 -209402 379715 -19260 -20222 209633 -216280 -72440
4693 43423 -345914 -118067 -158262 423460 53177 149649 -87960 -245008 33153 -95058 -117593
4682 -117593 271558 8569 5703 251934 -231012 -158221 -148557 156853 69606 40167 199792
4671 199792 47447 46931 263940 -14295 41846 66914 55463 157770 131497 -286773 128655
4659 199057 -235532 -16871 -118280 -202582 -244090 43523 -70643 -256511 135655 62545 -201274
4647 118044 -69887 63919 94388 -113612 7796 -289116 -36514 -352836 54606 190906 157797
4636 157797 -279135 213132 379775 -267218 65885 90234 113771 67988 -2320 -215291 192619
4624 -175148 -257927 103903 -13101 -24862 -77106 -30540 207244 19331 -30140 127019 115854
4613 115854 159267 74326 109011 97940 188009 -225132 -152347 -69849 259696 -305651 61197
4601 -121284 -153128 18949 -135833 -112471 -94806 287512 -154705 87040 54366 140182 308802
4590 308802 45605 -114961 12745 -209594 -38567 19359 -115036 -62044 470912 183308 -128960
4578 381382 -155917 61729 -257755 -321331 117402 -303952 220632 -134567 -223689 11643
4567 -180600 -85035 -1181 -340948 91024 60038 -568172 -148797 86170 129106 45595 160878
4556 160878 349416 211142 110728 -6745 42615 219763 -142525 -135405 430 47145 106682
4545 106682 -216564 -183220 130797 220906 -57779 107610 -91679 209161 -112730 -125093 -85199
4534 -85199 -77128 -210330 23433 -121727 232330 -62269 73332 -402531 122736 144571 280634
4523 280634 66542 421067 54610 -301506 -276508 -80418 33266 -161865 -29607 -8822 -140311
$$ [...]
##END NTUPLES=NMR SPECTRUM
##END=
