
##TITLE=AC1369_2393_7221595_eSSRFaH6zd
##JCAMPDX= 6.0         $$ Bruker NMR JCAMP-DX V2.0
##DATA TYPE= NMR SPECTRUM
##DATA CLASS= NTUPLES
##ORIGIN= BRUKER
##OWNER= Administrator
$$ 1.72 TOPSPIN		Version 2.1
$$ 2012-12-13 23:11:19.627 -0500  Administrator@X
$$ Compression mode = diff/dup
##.OBSERVE FREQUENCY= 400.02188249412
##.OBSERVE NUCLEUS= ^1H
##.ACQUISITION MODE= SIMULTANEOUS (DQD)
##.ACQUISITION SCHEME= undefined
##.AVERAGES= 64
##.DIGITISER RES= 22
##SPECTROMETER/DATA SYSTEM= spect
##.PULSE SEQUENCE= noesygpps1d.comp
##.SOLVENT NAME= COFFEE_meoh
##.SHIFT REFERENCE= INTERNAL, COFFEE_meoh, 1, 14.9604
##AUDIT TRAIL= $$ (NUMBER, WHEN, WHO, WHERE, PROCESS, VERSION, WHAT)
$$ ##TITLE= Audit trail, TOPSPIN		Version 2.1
$$ ##JCAMPDX= 5.01
$$ ##ORIGIN= Bruker BioSpin GmbH
$$ ##OWNER= Administrator
$$ $$ E:\/data/COFFEE/nmr/AC1369_2393_7221595_eSSRFaH6zd/22/pdata/1/auditp.txt
$$ ##AUDIT TRAIL=  $$ (NUMBER, WHEN, WHO, WHERE, PROCESS, VERSION, WHAT)
(   1,<2012-12-13 23:11:13.830 -0500>,<Administrator>,<X>,<go>,<TOPSPIN 2.1>,
      <created by zg
	started at 2012-12-13 22:59:43.502 -0500,
	POWCHK enabled, PULCHK disabled,
       configuration hash MD5:
       86 BA 57 50 F2 9D 5C 9B 26 00 A9 28 5F 66 2E 89
       data hash MD5: 64K
       AC D8 5E 8D 99 46 37 F9 B9 48 17 DF 3C F1 B5 4C>)
(   2,<2012-12-13 23:11:16.940 -0500>,<Administrator>,<X>,<proc1d>,<TOPSPIN 2.1>,
      <Start of raw data processing
       efp LB = 0.3 FT_mod = 6 PKNL = 1 PHC0 = 0 PHC1 = 0 SI = 128K 
       data hash MD5: 128K
       48 61 35 64 10 4F 52 0D A7 39 1D 7B 0B E2 FF 69>)
(   3,<2012-12-13 23:11:18.002 -0500>,<Administrator>,<X>,<proc1d>,<TOPSPIN 2.1>,
      <pk PHC0 = -78.83789 PHC1 = 0 
       data hash MD5: 128K
       0C 44 34 36 0C C6 15 69 6B 7E D7 C1 1A 5F 4A 26>)
(   4,<2012-12-13 23:11:18.674 -0500>,<Administrator>,<X>,<proc1d>,<TOPSPIN 2.1>,
      <abs ABSG = 1 
       data hash MD5: 128K
       85 55 F3 7B EA 57 F6 6C C2 80 A0 49 03 77 76 B4>)
(   5,<2012-12-13 23:11:18.830 -0500>,<Administrator>,<X>,<proc1d>,<TOPSPIN 2.1>,
      <abs ABSG = 2 
       data hash MD5: 128K
       4F FE A1 E8 F8 CA 2B 03 46 B6 BC CE 13 BC 5A AD>)
(   6,<2012-12-13 23:11:19.018 -0500>,<Administrator>,<X>,<proc1d>,<TOPSPIN 2.1>,
      <abs ABSG = 3 
       data hash MD5: 128K
       F5 FC 66 7D 88 A0 18 20 08 9D 81 2F 76 4B 03 49>)
(   7,<2012-12-13 23:11:19.174 -0500>,<Administrator>,<X>,<proc1d>,<TOPSPIN 2.1>,
      <abs ABSG = 4 
       data hash MD5: 128K
       51 35 24 23 4D 33 F0 61 E1 9D 3D D3 5D E3 EB 1F>)
(   8,<2012-12-13 23:11:19.315 -0500>,<Administrator>,<X>,<proc1d>,<TOPSPIN 2.1>,
      <abs ABSG = 5 
       data hash MD5: 128K
       EF 6F BB C9 BA 2A 7B EA 58 6C 9B 3F 67 66 0A F1>)
$$ ##END=
$$ 
$$ $$ hash MD5
$$ $$ 68 5B 55 CA F4 1B B4 D3 F9 DA 5D 1C 30 26 EE C2
##$RELAX= 
##$RELAX= 
##$RELAX= 
##$RELAX= 
##$RELAX= 
##$RELAX= 
##$RELAX= 
##$RELAX= 
##$RELAX= 
$$ Bruker specific parameters
$$ --------------------------
##$DU= <E:\>
##$EXPNO= 22
$$ [...]
150 150 150 150 150 150 150 150
##$TP07= 0
##$TPNAME0= <>
##$TPNAME1= <>
##$TPNAME2= <>
##$TPNAME3= <>
##$TPNAME4= <>
##$TPNAME5= <>
##$TPNAME6= <>
##$TPNAME7= <>
##$TPOAL= (0..7)
0.5 0.5 0.5 0.5 0.5 0.5 0.5 0.5
##$TPOFFS= (0..7)
0 0 0 0 0 0 0 0
##$TUNHIN= 0
##$TUNHOUT= 0
##$TUNXOUT= 0
##$USERA1= <user>
##$USERA2= <user>
##$USERA3= <user>
##$USERA4= <user>
##$USERA5= <user>
##$V9= 5
##$VALIST= <valist>
##$VCLIST= <CCCCCCCCCCCCCCC>
##$VD= 0
##$VDLIST= <DDDDDDDDDDDDDDD>
##$VPLIST= <PPPPPPPPPPPPPPP>
##$VTLIST= <TTTTTTTTTTTTTTT>
##$WBST= 1024
##$WBSW= 4
##$XGAIN= (0..3)
0 0 0 0
##$XL= 0
##$YL= 0
##$YMAX_a= 5689792
##$YMIN_a= -11576025
##$ZGOPTNS= <>
##$ZL1= 120
##$ZL2= 120
##$ZL3= 120
##$ZL4= 120
##$ABSF1= 14.9604
##$ABSF2= -5.597782
##$ABSG= 5
##$ABSL= 3
##$ALPHA= 0
##$AQORDER= 0
##$ASSFAC= 0
##$ASSFACI= 0
##$ASSFACX= 0
##$ASSWID= 0
##$AUNMP= <proc_prof1d_extract.lims>
##$AXLEFT= 0
##$AXNAME= <>
##$AXNUC= <1H>
##$AXRIGHT= 0
##$AXTYPE= 0
##$AXUNIT= <>
##$AZFE= 0.1
##$AZFW= 0.1
##$BCFW= 0
##$BC_mod= 0
##$BYTORDP= 0
##$COROFFS= 0
##$CY= 15
##$DATMOD= 1
##$DC= 0
##$DFILT= <>
##$DTYPP= 0
##$F1P= 0
##$F2P= 0
##$FCOR= 0.5
##$FTSIZE= 131072
##$FT_mod= 6
##$GAMMA= 0
##$GB= 0
##$INTBC= 1
##$INTSCL= 1
##$ISEN= 128
##$LB= 0.3
##$LEV0= 0
##$LPBIN= 0
##$MAXI= 10000
##$MC2= 0
##$MEAN= 0
##$ME_mod= 0
##$MI= 0
##$NCOEF= 0
##$NC_proc= -2
##$NLEV= 6
##$NOISF1= 0
##$NOISF2= 0
##$NSP= 0
##$NTH_PI= 0
##$NZP= 0
##$OFFSET= 14.9604
##$PC= 1
##$PHC0= -78.83789
##$PHC1= 0
##$PH_mod= 1
##$PKNL= yes
##$PPARMOD= 0
##$PPDIAG= 0
##$PPIPTYP= 0
##$PPMPNUM= 2147483647
##$PPRESOL= 1
##$PSCAL= 4
##$PSIGN= 0
##$PYNMP= <proc.py>
##$REVERSE= no
##$SF= 400.020009875447
##$SI= 131072
##$SIGF1= 0
##$SIGF2= 0
##$SINO= 400
##$SIOLD= 131072
##$SPECTYP= <>
##$SREGLST= <1H.CDCl3>
##$SSB= 0
##$STSI= 131072
##$STSR= 0
##$SW_p= 8223.68421052631
##$SYMM= 0
##$S_DEV= 0
##$TDeff= 65536
##$TDoff= 0
##$TI= <>
##$TILT= no
##$TM1= 0
##$TM2= 0
##$TOPLEV= 0
##$USERP1= <user>
##$USERP2= <user>
##$USERP3= <user>
##$USERP4= <user>
##$USERP5= <user>
##$WDW= 1
##$XDIM= 131072
##$YMAX_p= 384437333
##$YMIN_p= -12083
##$CURPLOT= <Network HP LaserJet P1505>
##$CURPRIN= <$Network HP LaserJet P1505>
##$DFORMAT= <normdp>
##$LAYOUT= <+/1D_H.xwp>
##$LFORMAT= <normlp>
##$PFORMAT= <normpl>
##$SURQMSG= 1
$$ End of Bruker specific parameters
$$ ---------------------------------
##NTUPLES= NMR SPECTRUM
##VAR_NAME=  FREQUENCY,     SPECTRUM/REAL,   SPECTRUM/IMAG
##SYMBOL=    X,             R,               I
##VAR_TYPE=  INDEPENDENT,   DEPENDENT,       DEPENDENT
##VAR_FORM=  AFFN,          ASDF,            ASDF
##VAR_DIM=   131072,        131072,          131072
##UNITS=     HZ,            ARBITRARY UNITS, ARBITRARY UNITS
##FACTOR=    0.0627417313425164, 1,          1
##FIRST=     8223.62146879497, 209,          -61157
##LAST=      0,             3756,            -60868
##MIN=       0,             -12083,          0
##MAX=       8223.62146879497, 384437333,    0
$$ Real data points
##PAGE= N=1
##DATA TABLE= (X++(R..R)), XYDATA
$$ [...]
63939B256254K00146K05777K09008K08142K01647J89043J70818J47907J21578
$$ 2256254 2456400 2662177 2871185 3079327 3280974 3470017 3640835 3788742 3910320
63930C910320R3269O3982L4000L396k7429n8044q8322j17849j45132j68035j85116
$$ 3910320 4003589 4067571 4101571 4104967 4077538 4019494 3931172 3813323 3668191 3500156 3315040
63919C315040j96226k01845k02593j99523j94315j88320j81469j72573j60804
$$ 3315040 3118814 2916969 2714376 2514853 2320538 2132218 1950749 1778176 1617372
63910A617372j46605j31210j15722j00910q7334p5198o4246n4351m6041l9837
$$ 1617372 1470767 1339557 1223835 1122925 1035591 960393 896147 841796 795755 755918
63900G55918l5092l0317k4913j9904j6390j4025j1732r405p868p308o835n792
$$ 755918 720826 690509 665596 645692 629302 615277 603545 594140 586272 578964 572129 566337
63888E66337m544l564k505p74J534L871O087Q458J1114J3907J6744J9561K2120
$$ 566337 561793 558229 555724 554950 556484 560355 566442 574900 586014 599921 616665 636226 658346
63875F58346K4212K6057K8135L0584L3049L5049L6234L6386L5569L4286L3088
$$ 658346 682558 708615 736750 767334 800383 835432 871666 908052 943621 977907 1010995
63864A010995L1994L0482K8107K4771K0451J5181R475M252j06m298r218j4695
$$ 1010995 1042989 1073471 1101578 1126349 1146800 1161981 1171456 1175708 1175602 1171304 1162086 1147391
63852A147391j9665k3578k6989l0528l3836l6019l6886l7204l7717l8371l8643
$$ 1147391 1127726 1104148 1077159 1046631 1012795 976776 939890 902686 864969 826598 787955
63841G87955l8234l7287l6141l5083l4107l2798l0652k7695k4619k2093k0149
$$ 787955 749721 712434 676293 641210 607103 574305 543653 515958 491339 469246 449097
63830D49097j8448j6910j5661j4496j2933j0898q920p418o131m601l008k208k878
$$ 449097 430649 413739 398078 383582 370649 359751 350831 343413 337282 332681 329673 327465 324587
63817C24587m853p266r173j0042r881r131q362p868p433o594n257l981l484l843
$$ 324587 319734 312468 303295 293253 283372 274241 265879 258011 250578 243984 238727 234746 231262 227419
63803B27419m360m320l683k899k285j883j785k140k749l080k788k050j246n65
$$ 227419 223059 218739 215056 212157 209872 207989 206204 204064 201315 198235 195447 193397 192151 191586
63789A91586j31j82p92j577j992j877j508j130p53l71p3J05K22K26l6n41j017
$$ 191586 191455 191273 190481 188904 186912 185035 183527 182397 181644 181273 181200 181305 181527 181753 181717 181176 180159
63772A80159j236j123n86L83J246J070l85j947k080o37R98J602J347J033Q22L47
$$ 180159 178923 177800 177214 177597 178843 179913 179528 177581 175501 174864 175862 177464 178811 179844 180666 181013
63756A81013l29p18p55q83j168j087n06j60o01j175p93N80J893K439K513K585
$$ 181013 180684 179966 179211 178328 177160 176073 175567 175407 174806 173631 172838 173418 175311 177750 180263 182848
63740A82848K608K456K432K668K640J905J022R26J573K054K116K600L994N451
$$ 182848 185456 187912 190344 193012 195652 197557 198579 199505 201078 203132 205248 207848 211842 217293
63726B17293N900N473N013M690M110L528L782M867N582N042L685K296Q44j032
$$ 217293 223193 228666 233679 238369 242479 246007 249789 254656 260238 265280 268965 271261 272105 271073
63712B71073k952m109m388m362m343m120l579k934k305j619j018p68p31n17j59
$$ 271073 268121 264012 259624 255262 250919 246799 243220 240286 237981 236362 235344 234576 233845 233328 233169
63697B33169o5j22M10J799L157L391K515J597J520K271L252L993M417M662M772
$$ 233169 233104 232982 233392 235191 238348 241739 244254 245851 247371 249642 252894 256887 261304 265966 270738
63682B70738M615M120L399K575J612N77j73m19m78p02p37JJ204J815J470J026
$$ 270738 275353 279473 282872 285447 287059 287636 287463 287044 286566 285864 285127 285128 286332 288147 289617 290643
63666B90643J285J900K047J501N08r09k711m339n170n328n410n588n578n273m818
$$ 290643 291928 293828 295875 297376 297884 296975 294264 289925 284755 279427 274017 268429 262851 257578 252760
63651B52760m140l116k126j787j998j932j123r6M33M93O45J151J760K222K642
$$ 252760 248620 245504 243378 241591 239593 237661 236538 236442 236875 237368 238013 239164 240924 243146 245788
63636B45788L217L798M082M217M864O284P592P682O839O621P800R254R627R307
$$ 245788 249005 252803 256885 261102 265966 272250 279842 287524 294363 300984 308784 318038 327665 336972
63622C36972R744J1244J2633J3055J3038J3556J4933J6930J9149K1020K2142K2997
$$ 336972 346716 357960 370593 383648 396686 410242 425175 442105 461254 482274 504416 527413
63610E27413K4605K7115K9356L0239K9873K8745K6523K2480J6686J0003L190l192
$$ 527413 552018 579133 608489 638728 668601 697346 723869 746349 763035 773038 776228 773036
63598G73036q159j0598j0486r136p923p210o811o984q368j1042j4269j7343k0293
$$ 773036 764877 754279 743793 734657 726734 719524 712713 705729 697361 686319 672050 654707 634414
63585F34414k3373k6075k7209k6182k3769k1262j9119j6898j4344j1813r613p491
$$ 634414 611041 584966 557757 531575 507806 486544 467425 450527 436183 424370 414757 407266
63573D07266n176k902j072L03J471K529L456M302N093N820O797Q616J1285J3804
$$ 407266 402090 399188 398116 398419 399890 402419 405875 410177 415270 421090 427887 436503 447788 461592
63559D61592J5193J5702J6374J7549J8602J9136J9682K0903K2840K5308K8553
$$ 461592 476785 492487 508861 526410 545012 564148 583830 604733 627573 652881 681434
63548F81434L2912L8156M3409M7332M7943M2980L1502J5457r00j3502k0551k2622
$$ 681434 714346 752502 795911 843243 891186 934166 965668 981125 980225 966723 946172 923550
63536I23550k1481j8875j5756j2164q033m224k401l666p584j2819j8317k3634
$$ 923550 902069 883194 867438 855274 847241 843017 840616 836950 829366 816547 798230 774596
63524G74596k8457l2386l5083l6286l5803l3825l1094k8371k5868k3465k1269
$$ 774596 746139 713753 678670 642384 606581 572756 541662 513291 487423 463958 442689
63513D42689j9427j7622j5442j3205j1655j0809r814q183o453n282m621m214m204
$$ 442689 423262 405640 390198 376993 365338 354529 344715 336532 330079 324797 320176 315962 311758
63500C11758m595m709l955k682j533m21R68J992J496m36k212k501j547l99M31
$$ 311758 307163 302454 298499 295817 294284 293863 294831 296823 298319 297883 295671 293170 291623 291224 291655
63485B91655J088J787K670L912N443O745P290P033O289N373M533L906L264K141
$$ 291655 292743 294530 297200 301112 306555 313300 320590 327623 333912 339285 343818 347724 350988 353129
63471C53129M89j124k321l521n210o874p402o564n405m951n090n068m664m242
$$ 353129 353618 352494 350173 346652 341442 334568 327166 320602 315197 310246 305156 300088 295424 291182
63457B91182l906l246k010n31P39J733K473K698K327K080K994N140P430Q918R824
$$ 291182 287276 284030 282020 281489 282228 283961 286434 289132 291459 293539 296533 301673 309103 318021 327845
63442C27845J0917J2408J4080J6147J9303K3860K9403L5259M0648M4201M3994
$$ 327845 338762 351170 365250 381397 400700 424560 453963 489222 529870 574071 618065
63431F18065L8775K9282J8089Q092R42l326n377n395k958J876P869J3553J8659
$$ 618065 656840 686122 704211 712303 713245 709919 704542 699147 696189 698065 705934 719487 738146
63418G38146K3955K9599L4342L6716L6368L3779K9070K1896J2562K664n622j0888
$$ 738146 762101 791700 826042 862758 899126 932905 961975 983871 996433 999097 993475 982587
63406I82587j3117j3239j2289j0934r666r145j0053j2645j6612k1358k6219l0422
$$ 982587 969470 956231 943942 933008 923342 914197 904144 891499 874887 853529 827310 796888
63394G96888l3286l4695l5169l5130l4309l2169k8804k5100k1882j9211j6697
$$ 796888 763602 728907 693738 658608 624299 592130 563326 538226 516344 497133 480436
63383D80436j4289j2322j0766q954o387l534j279L22K086M423O732Q407R730J1113
$$ 480436 466147 453825 443059 434105 427718 424184 422905 423227 425313 429736 436468 444875 454605 465718
63369D65718J2211J2590J2928J4404J7049J9713K1755K3701K6022K8286L0065
$$ 465718 477929 490519 503447 517851 534900 554613 576368 600069 626091 654377 684442
63358F84442L1761L3860L6020L7533L8046L7136L3783K7279J8476R354J431m844
$$ 684442 716203 750063 786083 823616 861662 898798 932581 959860 978336 987690 989121 984277
63346I84277r432j2287j3637j3950j3522j2550j1603j1493j2620j4902j8282k2702
$$ 984277 974845 962558 948921 934971 921449 908899 897296 885803 873183 858281 839999 817297
63334H17297k7490l1417l3616l4068l3113l1050k8356k5577k2640j8806j3806
$$ 817297 789807 758390 724774 690706 657593 626543 598187 572610 549970 531164 517358
63323E17358q468l625J051O052R983R768L632o565j6538k2942k5197k4527k2254
$$ 517358 508890 505265 506316 512368 522351 532119 535751 529186 512648 489706 464509 439982 417728
63310D17728j9218j6064j3328j1152r395q014p120o664o315n826n293m908m557
$$ 417728 398510 382446 369118 357966 348571 340557 333437 326773 320458 314632 309339 304431 299874
63297B99874l916k966k181k045k461k852k896k842l010l207l038k578k282k231
$$ 299874 295958 292992 290811 288766 286305 283453 280557 277715 274705 271498 268460 265882 263600 261369
63283B61369k017j477j034r88r92o29j15J06R9K03L78L66L65Q25J676K318K433
$$ 261369 259352 257875 256841 255853 254861 254232 254117 254223 254322 254525 254903 255269 255634 256459 258135 260453 262886
63266B62886K227J905J495J216J408J989K564L057L627L994L684L066L198M319
$$ 262886 265113 267018 268513 269729 271137 273126 275690 278747 282374 286368 290052 293118 296316 300635
63252C00635N427N821O158P284Q786R657R886J0372J1564J3099J4671J6367J8091
$$ 300635 306062 311883 318041 325325 334111 343768 353654 364026 375590 388689 403360 419727 437818
63239D37818J9430K0248K0964K1954K3086K3906K4075K3586K2837K2302K1968
$$ 437818 457248 477496 498460 520414 543500 567406 591481 615067 637904 660206 682174
63228F82174K1272K0034J9084J9451K1049K2800K3973K4745K5342K5298K3949
$$ 682174 703446 723480 742564 762015 783064 805864 829837 854582 879924 905222 929171
63217I29171K1229J7571J3284Q316K562l872j0688j7482k3836k9339l3586l6311
$$ 929171 950400 967971 981255 989571 992133 988261 977573 960091 936255 906916 873330 837019
63205H37019l7501l7346l5975l3438k9986k6141k2277j8331j4152j0004o361l341
$$ 837019 799518 762172 726197 692759 662773 636632 614355 596024 581872 571868 565507 562166
63193E62166n81K280N253Q072J0505J2564J4517J6597J8626K0040K0486K0204
$$ 562166 561585 563865 569118 577190 587695 600259 614776 631373 649999 670039 690525 710729
63181G10729J9781J9661J9967K0507K0815K0514J9805J9316J9116J8307J6008
$$ 710729 730510 750171 770138 790645 811460 831974 851779 871095 890211 908518 924526
63170I24526J2410Q369M147p87o716j2978j8601k3268k7387l1330l4772l6905
$$ 924526 936936 945305 949452 948665 941949 928971 910370 887102 859715 828385 793613 756708
63158G56708l7270l6304l4894l3484l1829k9591k6824k3847k1050j8860j7383
$$ 756708 719438 683134 648240 614756 582927 553336 526512 502665 481615 462755 445372
63147D45372j5939j3626j0606q146p017o516n686m754m498m666m178k718j195
$$ 445372 429433 415807 405201 397055 390038 383522 377836 373082 368584 363918 359740 357022 355827
63134C55827n15o31r42r64n05K61P79O60K40K02O68J210J625K084K500K436J826
$$ 355827 355312 354681 353739 352775 352270 352531 353310 353970 354210 354412 355080 356290 357915 359999 362499 364935 366761
63117C66761J228J171J609K141K455K521K666L344M501N349N194M319L516L011
$$ 366761 367989 369160 370769 372910 375365 377886 380552 383896 388397 393746 398940 403259 406775 409786
63103D09786K571K326K651L306L591L397L258L274K948K238J857K216K822L043
$$ 409786 412357 414683 417334 420640 424231 427628 430886 434160 437108 439346 441203 443419 446241 449284
63089D49284K734J852L92j006j281k95Q61J363J578K046K547K943L916N866P813
$$ 449284 452018 453870 454262 453256 451975 451680 452541 453904 455482 457528 460075 463018 466934 472800 480613
63074D80613Q603Q660R331J0808J2006J2435J2959J4423J6546J8536K0099K1443
$$ 480613 489216 497876 507207 518015 530021 542456 555415 569838 586384 604920 625019 646462
63062F46462K2887K4866K7806L1583L5455L8811M1756M4684M7544M9875N1457
$$ 646462 669349 694215 722021 753604 789059 827870 869626 914310 961854 1011729 1063186
63051A063186N2573N3585N4441N4745N4345N3603N2950N2336N1518N0824N1153
$$ 1063186 1115759 1169344 1223785 1278530 1332875 1386478 1439428 1491764 1543282 1594106 1645259
63040A645259N2909N5362N7346N8244N7877N5848N1587M4909L6055K5308J2959
$$ 1645259 1698168 1753530 1810876 1869120 1926997 1982845 2034432 2079341 2115396 2140704 2153663
63029B153663l70j3971k7543m0928n3386o3731p1321p6337p8931p8786p5904p1196
$$ 2153663 2153293 2139322 2111779 2070851 2017465 1953734 1882413 1806076 1727145 1648359 1572455 1501259
63017A501259o5635n9168n1294m2536l4392k7556k0980j3365n044K396Q206J3275
$$ 1501259 1435624 1376456 1325162 1282626 1248234 1220678 1199698 1186333 1181289 1183685 1191891 1205166
63005A205166J8656K4055K8306L0875L2331L3426L4361L4936L5047L4800L4385
$$ 1205166 1223822 1247877 1276183 1307058 1339389 1372815 1407176 1442112 1477159 1511959 1546344
62994A546344L3937L3432L2751L1841L0615K8637K5195K0009J3491O044k581j2717
$$ 1546344 1580281 1613713 1646464 1678305 1708920 1737557 1762752 1782761 1796252 1802296 1799715 1786998
62982A786998k3868l4957m5317n4742o2734o8554p2072p3867p4208p2705o9192
$$ 1786998 1763130 1728173 1682856 1628114 1565380 1496826 1424754 1350887 1276679 1203974 1134782
62971A134782o4311n8925n3491m8376m4017m0290l6331l1673k7072k3610k1292
$$ 1134782 1070471 1011546 958055 909679 865662 825372 789041 757368 730296 706686 685394
62960F85394j9240j7000j4962j3527j2544j1662j0841j0313j0238j0476j0583
$$ 685394 666154 649154 634192 620665 608121 596459 585618 575305 565067 554591 544008
62949E44008j0233r678r543r930j0133r565q600q057q047p926p295o540o292o699
$$ 544008 533775 524097 514554 504624 494491 484926 476326 468269 460222 452296 445001 438461 432169 425470
62935D25470p342p608p146o104n010m283l972l914l929l805l342k689k247k078
$$ 425470 418128 410520 403374 397270 392260 387977 384005 380091 376162 372357 369015 366326 364079 362001
62921C62001j706q97k53n46j668k712k962k390j348k70L85L41j54n51n81m12l16
$$ 362001 360295 359398 359145 358599 356931 354219 351257 348867 347519 347249 347634 347975 347821 347270 346689 346277 345961
62904C45961l92o18q35p31j50N29O15k13j577k710k918j937j37J618K622K865
$$ 345961 345569 344951 344116 343385 343235 343764 344379 344166 342589 339879 336961 335024 334887 336505 339127 341992
62888C41992K813K763K653K386J994J456P27l9n14n69m27k94m5N58J398J939J742
$$ 341992 344805 347568 350221 352607 354601 356057 356784 356745 356231 355662 355235 354941 354896 355454 356852 358791 360533
62871C60533R58J79k56n62r82j216q12pL63n6o41n72K28J227J899K006J554Q71
$$ 360533 361491 361670 361414 360852 359870 358654 357842 357835 358198 358142 357501 356929 357157 358384 360283 362289 363843 364714
62853C64714M78N19N86M34M60J088J916K106J503Q19O55Q14P68M64L82Q50J520
$$ 364714 365192 365711 366297 366731 367191 368279 370195 372301 373804 374623 375278 376092 376860 377324 377706 378556 380076
62836C80076J670J025J09l15o9M94J172K065K993L364K836J774Q34M47P34J506
$$ 380076 381746 382771 382880 382565 382496 382990 384162 386227 389220 392584 395420 397194 398028 398475 399209 400715
62820D00715K170K243K077K478L427L945L588L180L527M222M491M512M941N721
$$ 400715 402885 405128 407205 409683 413110 417055 420643 423823 427350 431572 436063 440575 445516 451237
62806D51237O350O917P839Q885R492R867J0760J2231J3674J4999J6754J8970K0920
$$ 451237 457587 464504 472343 481228 490720 500587 511347 523578 537252 552251 569005 587975 608895
62793F08895K2339K3983K6587L0003L3773L7918M2725M8218N4238O0694O7458
$$ 608895 631234 655217 681804 711807 745580 783498 826223 874441 928679 989373 1056831
62782A056831P4255Q0751Q6569R1333R4952R7670R9312R8719R4584Q6753P6018
$$ 1056831 1131086 1211837 1298406 1389739 1484691 1582361 1681673 1780392 1874976 1961729 2037747
62771B037747O2877M7256K9495J0654q339k7031m4724o0220p2618q1846q8163
$$ 2037747 2100624 2147880 2177375 2188029 2179690 2152659 2107935 2047715 1975097 1893251 1805088
62760A805088r1777r3074r2644r0804q7635q3546p9130p4419o9058o3317n7997
$$ 1805088 1713311 1620237 1527593 1436789 1349154 1265608 1186478 1112059 1043001 979684 921687
62749I21687n3239m8402m3481l9468l6710l3999l0174k5750k1994j9114j6464
$$ 921687 868448 820046 776565 737097 700387 666388 636214 610464 588470 569356 552892
62738E52892j4011j2379j1529j0528q773o679m944l731k816k054j446r42l58N18
$$ 552892 538881 526502 514973 504445 495672 488993 484049 480318 477502 475448 474002 473060 472702 473220
62724D73220J710K887L651M039M481N272O360P776R790J2399J5139J7658K0063
$$ 473220 474930 477817 481468 485507 489988 495260 501620 509396 519186 531585 546724 564382 584445
62711E84445K2486K4758K6898K9501L3187L7943M3273M8690N3873N8784O3853
$$ 584445 606931 631689 658587 688088 721275 759218 802491 851181 905054 963838 1027691
62700A027691O9468P5000P8972Q0667Q0878Q0472P8858P4663O7441N7784M6125
$$ 1027691 1097159 1172159 1251131 1331798 1412676 1493148 1572006 1646669 1714110 1771894 1818019
62689A818019L2456J7195J454j3822k8365m2195n5100o6519p5541q1240q3504
$$ 1818019 1850475 1867670 1869124 1855302 1826937 1784742 1729642 1663123 1587582 1506342 1422838
62678A422838q3366q2005p9612p5822p0956o5959o1180n6088n0492m5196m1001
$$ 1422838 1339472 1257467 1177855 1102033 1031077 965118 903938 847850 797358 752162 711161
62667G11161l7699l4473l0961k7425k4199k1359j8849j6591j4483j2471j0641
$$ 711161 673462 638989 608028 580603 556404 535045 516196 499605 485122 472651 462010
62656D62010r144q072p369o855o389o042n978o075n880n155m217l544l223l020
$$ 462010 452866 444794 437425 430570 424181 418139 412161 406086 400206 395051 390834 387290 384067 381047
62642C81047k839k712k501j978j158k25P27J610K141K080J591J023M36k42p51
$$ 381047 378208 375496 372995 371017 369859 369634 370361 371971 374112 376192 377783 378806 379242 379000 378249
62627C78249o55K2P64J214J479J713J843J871K131K935M123N134N502N302N174
$$ 378249 377594 377616 378380 379594 381073 382786 384629 386500 388631 391566 395689 400823 406325 411627 416801
62612D16801N809P276Q948J0223J1133J2040J3059J4176J5686J7944K0776K3654
$$ 416801 422610 429886 438834 449057 460190 472230 485289 499465 515151 533095 553871 577525
62600E77525K6486K9667L3289L6905M0197M3363M6449M8735M9286M7847M4781
$$ 577525 604011 633678 666967 703872 744069 787432 833881 882616 931902 979749 1024530
62589A024530M0321L4316K6758J8086Q791j004j1245k1320l0181l7100m2088m5371
$$ 1024530 1064851 1099167 1125925 1144011 1152802 1151798 1140553 1119233 1089052 1051952 1009864 964493
62577I64493m6840m6468m4976m3404m1986m0102l7567l5130l3297l1307k8112
$$ 964493 917653 871185 826209 782805 740819 700717 663150 628020 594723 563416 535304
62566E35304k3941k0109j7448j5629j3986j2252j0388q401o570n355m850m601
$$ 535304 511363 491254 473806 458177 444191 431939 421551 413150 406580 401225 396375 391774
62554C91774m135l463l036l340m418n474n309l628j659q32j039r80p3R59J552
$$ 391774 387639 384176 381140 377800 373382 367908 362599 358971 357312 356480 355441 354461 354388 355347 356899
62539C56899K204L389M501M646L985L460L541L929M280M637N179O054P402R207
$$ 356899 359103 362492 366993 371639 375624 379084 382625 386554 390834 395471 400650 406704 414106 423313
62525D23313J1209J3266J5658J8708K2227K5650K8679L1439L4157L6990M0024
$$ 423313 434522 447788 463446 482154 504381 530031 558710 590149 624306 661296 701320
62514G01320M3050M5370M6236M5539M3733M1051L7044L1081K3111J3870M471m202
$$ 701320 744370 789740 835976 881515 925248 966299 1003343 1034424 1057535 1071405 1075876 1071674
62502A071674j1874j8790k5159l0683l4681l6711l7002l6259l5060l3389l0709
$$ 1071674 1059800 1041010 1015851 985168 950487 913776 876774 840515 805455 772066 741357
62491G41357k6675k1846j7456j4294j1867r014n266j241K347N612R078J2671J5703
$$ 741357 714682 692836 675380 661086 649219 640205 634939 633698 636045 641657 650735 663406 679109
62478F79109J7836J9545K1275K2633K2813K1548J9120J5606J0869N368K03m091
$$ 679109 696945 716490 737765 760398 783211 804759 823879 839485 850354 855722 855925 851834
62466H51834q239j3161j8640k3600k7368k9985l1521l1924l1587l1229l0951l0023
$$ 851834 843595 830434 811794 788194 760826 730841 699320 667396 635809 604580 573629 543606
62454E43606k7938k5110k2222j9413j6597j4133j2507j1454j0055p822n363l678
$$ 543606 515668 490558 468336 448923 432326 418193 405686 394232 384177 376355 370992 367314
62442C67314k977k401j074P51J920J816J214J309K230L062L171K738J971O25j256
$$ 367314 364337 361936 360862 361613 363533 365349 366563 367872 370102 373164 376335 379073 381044 381669 380413
62427C80413k816l259k920k845l492m311m597m276l799l494l213k620j796j400
$$ 380413 377597 374338 371418 368573 365081 360770 356173 351897 348098 344604 341391 338771 336975 335575
62413C35575j862k632k701j921j156r79r66o96o09j187j856j688q31l09m83n88
$$ 335575 333713 331081 328380 326459 325303 324324 323358 322662 322053 320866 319010 317322 316491 316182 315699 315111
62397C15111M3J138K023K400K314J926J590J682K068K114J527P92N60R55J711
$$ 315111 315154 316292 318315 320715 323029 324955 326545 328227 330295 332409 333936 334728 335288 336243 337954
62382C37954K661L761M929O075P174Q011Q218P786P348P631Q760J0281J1773J3118
$$ 337954 340615 344376 349305 355380 362554 370565 378783 386569 393917 401548 410308 420589 432362 445480
62368D45480J4285J5175J5834J6682J8313K0956K4163K7231L0007L3104L7084
$$ 445480 459765 474940 490774 507456 525769 546725 570888 598119 628126 661230 698314
62357F98314M1712M6309N0595N4633N7976N9464N8122N3819M6958L8008K7690
$$ 698314 740026 786335 836930 891563 949539 1009003 1067125 1120944 1167902 1205910 1233600
62346A233600J7115P342j098q136j4003j9379k5104l1264l6936m1264m4383m6696
$$ 1233600 1250715 1258057 1256959 1248823 1234820 1215441 1190337 1159073 1122137 1080873 1036490 989794
62334I89794m7736m6628m3544l9789l6236l2538k8130k3342j9022j5662j3346
$$ 989794 942058 895430 851886 812097 775861 743323 715193 691851 672829 657167 643821
62323F43821j2163j2022j2362j2607j2799j3283j3915j4155j3950j3862j4164
$$ 643821 631658 619636 607274 594667 581868 568585 554670 540515 526565 512703 498539
62312D98539j4370j3991j3227j2465j1514j0044q508p808p924p698o334m504l425
$$ 498539 484169 470178 456951 444486 432972 422928 414420 406612 398688 390990 384656 380152 376727
62299C76727l338l478l221k589j827j207j089j453j440k29J586K490K157J969
$$ 376727 373389 369911 366690 364101 362274 361067 359978 358525 357085 356856 358442 360932 363089 365058
62285C65058K932M199M471L976L833M197M318M122M299M935N329N349N741O736
$$ 365058 367990 372189 376660 380636 384469 388666 392984 397106 401405 406340 411669 417018 422759 429495
62271D29495P546P694P831Q639R832J0993J2484J4769J7458J9931K2538K6253
$$ 429495 437041 444735 452566 461205 471037 482030 494514 509283 526741 546672 569210 595463
62259E95463L1382L7262M3029M8202N2695N6755O0619O3827O5090O3210N7781
$$ 595463 626845 664107 707136 755338 808033 864788 925407 989234 1054324 1117534 1175315
62248A175315M8920L7036K3483J0605J98p800j4538k0731k6598l2588l9011m5288
$$ 1175315 1224235 1261271 1284754 1295359 1295557 1287757 1273219 1252488 1225890 1193302 1154291 1109003
62236A109003n0578n4805n8070n9468n7883n3847m9254m5170m1180l6897l2715
$$ 1109003 1058425 1003620 945550 886082 828199 774352 725098 679928 638748 601851 569136
62225E69136k8760k4610k0517j7579j6007j4497j2118r656q186p382o414n492
$$ 569136 540376 515766 495249 477670 461663 447166 435048 425392 417206 409824 403410 397918
62213C97918n272n425n042m101l292k728j965j225j332k378l311l118j827k11
$$ 397918 392646 387221 382179 378078 374786 372058 370093 368868 367536 365158 361847 358729 356902 356691
62199C56691R93J549J863K667M136N558O235O459P046Q204R471J0534J1409J1992
$$ 356691 357684 359233 361096 363763 367899 373457 379692 386151 393197 401401 410872 421406 432815 444807
62185D44807J2140J2136J2475J3140J3615J3477J2498J0403P271L975J589L62
$$ 444807 456947 469083 481558 494698 508313 521790 534288 544691 551962 555937 557526 557888
62173E57888m1N06K581O210J0658J5378K0381K5623L0710L5444L9911M3747M5931
$$ 557888 557847 558353 560934 567144 577802 593180 613561 639184 669894 705338 745249 788996 834927
62160H34927M5604M2663L7461L0569K2957J5667Q911K117m860j1151j5938j9595
$$ 834927 880531 923194 960655 991224 1014181 1029848 1038759 1040876 1036016 1024865 1008927 989332
62148I89332k3204k7286l1450l5010l7481l8564l8136l6312l3427k9884k5993
$$ 989332 966128 938842 907392 872382 834901 796337 758201 721889 688462 658578 632585
62137F32585k1866j7543j3347r810p002m218q33K727N479P183Q482R803J0923
$$ 632585 610719 593176 579829 570019 563017 558799 557966 560693 566172 573355 581837 591640 602563
62124F02563J1687J2400J3287J4249J5257J6302J6746J5563J2676R321O628M510
$$ 602563 614250 626650 639937 654186 669443 685745 702491 718054 730730 740051 746679 751189
62112G51189K367J42j987m308p156j0131j2450j3871j4639j4759j3902j2011r501
$$ 751189 753556 753698 751711 747403 740247 730116 717666 703795 689156 674397 660495 648484 638983
62099F38983o833m246j753P86L424N800P294P758P730P769P925Q122Q526R168
$$ 638983 632150 627904 626151 626937 630361 636161 643455 651213 658943 666712 674637 682759 691285 700453
62085G00453R682R922J0367J1426J2617J3191J3317J4079J6230J9430K2627K4920
$$ 700453 710135 720057 730424 741850 754467 767658 780975 795054 811284 830714 853341 878261
62073H78261K6088K6553K6743K6517K5475K3861K2527K1789K1055K0056J9690
$$ 878261 904349 930902 957645 984162 1009637 1033498 1056025 1077814 1098869 1118925 1138615
62062A138615K0830K2815K3997K3492K1529J8404J4056Q698L065k148o549r918
$$ 1138615 1159445 1182260 1206257 1229749 1251278 1269682 1283738 1292436 1295501 1293353 1286804 1276886
62050A276886j2470j5218j9287k4660l0168l4766l8267m0885m2748m3953m4540
$$ 1276886 1264416 1249198 1229911 1205251 1175083 1140317 1102050 1061165 1018417 974464 929924
62039I29924m4209m2704m0462l8340l6536l4409l1519k8155k4692k1116j7523
$$ 929924 885715 843011 802549 764209 727673 693264 661745 633590 608898 587782 570259
62028E70259j4378j1860r553p266n633n288n828o262o215o125o370o831p265p588
$$ 570259 555881 544021 534468 527202 521569 516281 510453 504191 497976 491851 485481 478650 471385 463797
62014D63797p657p223o281n240m502l949l020j250J253L866N972P417Q517R663
$$ 463797 456140 448917 442636 437396 432894 428945 425925 424675 425928 429794 435766 443183 451700 461363
62000D61363J0922J1909J1978J0630P907M384P80k371m666n855o163o374p207
$$ 461363 472285 484194 496172 506802 514709 519093 519873 517502 512836 506981 500818 494444 487237
61987D87237q607r921j0713j1103j1350j1425j1104j0230q913p490o318n432m627
$$ 487237 478630 468709 457996 446893 435543 424118 413014 402784 393871 386381 380063 374631 370004
61974C70004l893l556l711l901l693l255k900k418j540p59q11j396j338k10J048
$$ 370004 366111 362555 358844 354943 351250 347995 345095 342677 341137 340378 339567 338171 336833 336623 337671
61959C37671J496J428J724K605L630M477N136N615N986O514P347Q288R219J0499
$$ 337671 339167 340595 342319 344924 348554 353031 358167 363782 369768 376282 383629 391917 401136 411635
61945D11635J2498J4998J7412J9496K1473K3608K5973K8396L0362L1249L1031
$$ 411635 424133 439131 456543 476039 497512 521120 547093 575489 605851 637100 668131
61934F68131L0438L0003K9289K7616K5264K3151K1437J9256J6003J2033P837L206
$$ 668131 698569 728572 757861 785477 810741 833892 855329 874585 890588 902621 910458 913664
61922I13664k150p697j2382j5609j7452j8163j7950j7059j5522j2861q578l006
$$ 913664 911514 903817 891435 875826 858374 840211 822261 805202 789680 776819 768241 765235
61910G65235K868Q457J3903J9159K3421K5912K6720K6257K4243K0050J3997P414
$$ 765235 768103 776560 790463 809622 833043 858955 885675 911932 936175 956225 970222 977636
61898I77636J191n023j1708j8188k3087k5835k7110k7950k8821k9495k9356k7832
$$ 977636 978827 973804 962096 943908 920821 894986 867876 839926 811105 781610 752254 724422
61886G24422k4991k1764j9263j7820j6938j6114j5318j4675j4168j3779j3571
$$ 724422 699431 677667 658404 640584 623646 607532 592214 577539 563371 549592 536021
61875E36021j3425j2988j1985j0443q506o381m400k823j480K7J722L230M461N878
$$ 536021 522596 509608 497623 487180 478674 472293 467893 465070 463590 463617 465339 468569 473030 478908
61861D78908P857J0212J2577J4974J7726K1048K4941K9135L3051L6221L8936M1956
$$ 478908 486765 496977 509554 524528 542254 563302 588243 617378 650429 686650 725586 767542
61849G67542M5311M7959M9052M8983M8550M7666M5601M2084L7220L0634K1785
$$ 767542 812853 860812 909864 958847 1007397 1055063 1100664 1142748 1179968 1210602 1232387
61838A232387J1160K80r662j8322k5213k9289l0009k8054k4384j9264j2748n430
$$ 1232387 1243547 1243827 1234165 1215843 1190630 1161341 1131332 1103278 1078894 1059630 1046882 1041452
61826A041452K029R559J7000K3209K6764K7361K5688K2009J5859P177l104j3829
$$ 1041452 1043481 1053040 1070040 1093249 1120013 1147374 1173062 1195071 1210930 1218107 1215003 1201174
61814A201174k4209l3499m0883m6145m9793n2103n2673n1347m8941m6347m3465
$$ 1201174 1176965 1143466 1102583 1056438 1006645 954542 901869 850522 801581 755234 711769
61803G11769l9766l5454l1308k7594k3991k0458j7400j4949j2820j0993r804r213
$$ 711769 672003 636549 605241 577647 553656 533198 515798 500849 488029 477036 467232 458019
61791D58019q653p830p041o503o028n609n671o259o597n992m762l731l251l137
$$ 458019 449366 441536 434495 427992 421964 416355 410684 404425 397828 391836 387074 383343 380092 376955
61777C76955l210l318l127k541j990j802j580q57j5K21J4K36J056J606J334P91
$$ 376955 373745 370427 367300 364759 362769 360967 359387 358530 358515 358736 358750 358986 360042 361648 362982 363773
61761C63773P53J256J986K977M287N379N544M877M265M341M856N146M890M265
$$ 363773 364526 365782 367768 370745 375032 380411 385955 390832 395097 399438 404294 409440 414330 418595
61747D18595L486K449R07j013k628l211k648j466k97N19R05R58R68J196J568J774
$$ 418595 422081 424530 425437 424424 421796 418585 415937 414471 414174 414693 415598 416556 417524 418720 420288 422062
61731D22062J782J956K536L250L703L908M240M860N465N621N331N209N936P426
$$ 422062 423844 425800 428336 431586 435289 439197 443437 448297 453762 459383 464714 469923 475859 483285
61717D83285Q728Q972Q313P547O960O010M238J899n16k883n178p001p903q055
$$ 483285 492013 500985 509298 516845 523805 529815 534053 535952 535436 532553 527375 520374 512471 504416
61703E04416q093q309q401q049p407o880o638o557o478o286n788m796l457k375
$$ 504416 496323 488014 479613 471564 464157 457277 450639 444082 437604 431318 425530 420734 417277 414902
61689D14902k124k567k896k530j754j332j609k289k898l122k793j967j116q35
$$ 414902 412778 410211 407315 404785 403031 401699 400090 397801 394903 391781 388988 387021 385905 385070
61675C85070j243j880k263k293k111j872j776j933k080j805j187q48j115j449
$$ 385070 383827 381947 379684 377391 375280 373408 371632 369699 367619 365814 364627 363779 362664 361215
61661C61215j100r8P98J059R76J243K148L215L654L183K379K119K705L718M624
$$ 361215 360115 360017 360815 361874 362850 364093 366241 369456 373110 376293 378672 380791 383496 387214 391838
61646C91838N254N685O057O574P346Q105Q338P775O541M844K926J229P4q95k361
$$ 391838 397092 402777 408834 415408 422754 430859 439197 446972 453513 458357 461283 462512 462586 461691 459330
61631D59330m230n522n613m943m220l573k993k796k979k706j340M59J557J921
$$ 459330 455100 449578 443965 439022 434802 431229 428236 425440 422461 419755 418415 418874 420431 422352
61617D22352K483L623M701N081M728L722K056k1k111m229o548q560r376r002q451
$$ 422352 424835 428458 433159 438240 442968 446690 448746 448725 446614 442385 435837 427277 417901 408899 400448
61602D00448q349q307p965p665p628p333o487n767n813o086n612m406l203k238
$$ 400448 392099 383792 375827 368162 360534 353201 346714 340947 335134 329048 323436 319030 315827 313589
61588C13589j297o70r94k128l163l630l853l963l557k605j804j631j792j992k459
$$ 313589 312292 311622 310628 308500 305337 301707 297854 293891 290334 287729 285925 284294 282502 280510 278051
61573B78051l155l245k264j132j124k080k656k227j529j328j409j284j104j240
$$ 278051 274896 271651 269387 268255 267131 265051 262395 260168 258639 257311 255902 254618 253514 252274
61559B52274j425j006Q3J129J427R40J76l37l40J61Q82J328J075K31m48k74M46
$$ 252274 250849 249843 249926 251055 252482 253422 253598 253261 252921 253082 253964 255292 256367 256598 256150 255876 256322
61542B56322O68p3r65j036m12J55O58J731L231M041L629K848K561K405J578K20
$$ 256322 256990 256917 255952 254916 254504 254659 255317 257048 260279 264320 267949 270797 273358 275763 277341 277561
61526B77561r27j718k535l262l337k732k101j878j915k002k127k170j916j442
$$ 277561 276634 274916 272381 269119 265782 263050 260949 259071 257156 255154 253027 250857 248941 247499
61512B47499j015o04p5L12J80l05o87r70j361j453o77M26N39n90j671j752j413
$$ 247499 246484 245880 245805 246117 246297 245992 245305 244335 242974 241521 240844 241270 241809 241219 239548 237796 236383
61495B36383j461j467n45J034K096K043J278M22j75m02m56p46j247j305o11J05
$$ 236383 234922 233455 232910 233944 236040 238083 239361 239783 239608 239206 238750 238004 236757 235452 234841 234946
61479B34946J0n91p07l5Q51J438J604J251M14k94k19M09P63N99M04L80J74l10
$$ 234946 234956 234365 233658 233623 234474 235912 237516 238767 239181 238887 238668 239077 239840 240439 240843 241223 241397 241087
61461B41087o34o54q18j283j530j215o99k66M69J678K483J888K99p75n94M6J38
$$ 241087 240453 239799 238981 237698 236168 234953 234254 233988 234457 236135 238618 240506 240805 240030 239436 239482 239620
61444B39620j40P9R09J522J406J215J888L399M809N478N580N476N212M896M843
$$ 239620 239480 239559 240468 241990 243396 244611 246499 249898 254707 260185 265765 271241 276453 281349 286192
61429B86192M879M105K031l83j543j005K06R65J002N75m1m44j14J036K425L365
$$ 286192 291071 295176 297207 296824 295281 294276 294482 295447 296449 297024 296983 296539 296425 297461 299886 303251
61413C03251L582L115K103Q61k54j207k241l243l665l328k926l317m477n535n735
$$ 303251 306833 309948 312051 312912 312658 311451 309210 305967 302302 298974 296048 292731 288254 282719 276984
61398B76984n073m057l156k498j924j257n28O5M00M69K68k27q39j212j109o82
$$ 276984 271911 267854 264698 262200 260276 259019 258491 258556 258956 259425 259693 259466 258627 257415 256306 255624
61382B55624k68l6J74O66J520K357K593K069J290Q76R13J058J139J304J613J892
$$ 255624 255356 255320 255494 256160 257680 260037 262630 264699 265989 266865 267778 268836 269975 271279 272892 274784
61366B74784J969J859J624J385J420J922K651L046K864K382K017J969K264K863
$$ 274784 276753 278612 280236 281621 283041 284963 287614 290660 293524 295906 297923 299892 302156 305019
61352C05019L655M593N852P601R535J0960J1417J1006J0080Q865P478O111N086
$$ 305019 308674 313267 319119 326720 336255 347215 358632 369638 379718 388583 396061 402172 407258
61339D07258M773N264O011O086N182M108L780L995L733K530P95j105l211n215
$$ 407258 412031 417295 423306 429392 434574 438682 442462 446457 450190 452720 453515 452410 449199 443984
61325D43984o295o167n634n577n878n776m929l682k646k313k660k864j945j4J616
$$ 443984 437689 431522 425888 420311 414433 408657 403728 400046 397400 395087 392427 389563 387618 387604 389220
61310C89220K000J677J711K275K936L788N310P311Q950R786J0002R512P758M614
$$ 389220 391220 392897 394608 396883 399819 403607 408917 416228 425178 434964 444966 454478 462236 466850
61296D66850Q56k536n073o591p033o695o228n967n597m837m087l939m261m281
$$ 466850 467706 465170 460097 453506 446473 439778 433550 427583 421986 417149 413062 409123 404862 400581
61282D00581l557k481j686j286q83k10O01J357K170L202M231M862N161N688O646
$$ 400581 397024 394543 392857 391571 390688 390478 391079 392436 394606 397808 402039 406901 412062 417750 424396
61267D24396P353P019N771M535M003M211N002O344Q089R924J1714J3454J4659
$$ 424396 431749 438768 444539 449074 453077 457288 462290 468634 476723 486647 498361 511815 526474
61254E26474J4415J2483R967Q269P622P199O512N895N505M618K504m67l191n077
$$ 526474 540889 553372 563339 571608 579230 586429 592941 598836 604341 608959 611463 610996 607805 602728
61240F02728o360p231p400o733n811n469n983o962p841q148p556o126m444l187
$$ 602728 596368 589137 581737 575004 569193 563724 557741 550779 542938 534790 527234 521108 516664 513477
61226E13477k508k056j558j092q08p08p49q83q97n17K14Q79J188J319J639K204
$$ 513477 510969 508913 507355 506263 505455 504747 503998 503115 502218 501701 501915 502794 503982 505301 506940 509144
61210E09144K740K913K494J394j72j612k270j931r50J58J211K376L816N436P080
$$ 509144 511884 514797 517291 518685 518513 516901 514631 512700 511750 511908 513119 515495 519311 524747 531827
61195E31827Q853J1062J3763J6534J8799K0176K0468J9533J7430J4553J1507Q838
$$ 531827 540680 551742 565505 582039 600838 621014 641482 661015 678445 692998 704505 713343
61183G13343P005O258O312O344N749M737L885L238K281P40j112k889m342n123
$$ 713343 720348 726606 732918 739262 745011 749748 753633 756871 759152 759892 758780 755891 751549 746426
61169G46426m896l962l344l897n471p186q400r190j0014j1101j2176j2810j2968
$$ 746426 741530 737568 734224 730327 724856 717670 709270 700080 690066 678965 666789 653979 641011
61156F41011j3044j3209j3057j2105j0438q503o551m693l159j903l10J857L359
$$ 641011 627967 614758 601701 589596 579158 570655 564104 559411 556252 554349 554039 555896 559255
61143E59255K366j355n970r562j1687j2713j2711j1751j0484r469q378o611m450
$$ 559255 561621 560266 554296 544734 533047 520334 507623 495872 485388 475919 467541 460930 456480
61130D56480k777j845j044J66J682L153M473N771P258R076J1108J3035J4698J6239
$$ 456480 453703 451858 450814 450980 452662 455815 460288 466059 473317 482393 493501 506536 521234 537473
61116E37473J7794J9283K0699K2149K3470K4225K4338K4338K4566K4698K4436
$$ 537473 555267 574550 595249 617398 640868 665093 689431 713769 738335 763033 787469
61105G87469K4080K3848K3162K1397J8887J6391J3721R839M352j792p244j1373
$$ 787469 811549 835397 858559 879956 898843 915234 928955 938794 943146 941354 934110 922737
61093I22737j4364j6717j8803k0628k1923k2636k3180k3927k4682k4989k4747
$$ 922737 908373 891656 872853 852225 830302 807666 784486 760559 735877 710888 686141
61082F86141k4195k3536k2897k2367k1654k0131j7798j5739j4909j4845j4343
$$ 686141 661946 638410 615513 593146 571492 551361 533563 517824 502915 488070 473727
61071D73727j3115j1915j1162j0490r636q827q076o946n284l583k330j603j381
$$ 473727 460612 448697 437535 427045 417409 408582 400506 393560 388276 384693 382363 380760 379379
61058C79379j582j701j097J06J081J439J658K241L089M004N013N937O343O276
$$ 379379 377797 376096 374999 375105 376186 377625 379283 381524 384613 388617 393630 399567 405910 412186
61044D12186O441P264Q469R821J1489J3231J4128J3862J3497J4179J5629J6694
$$ 412186 418627 425891 434360 444181 455670 468901 483029 496891 510388 524567 540196 556890
61032E56890J6965J6914J6834J6503J5815J4977J4174J3588J3628J4508J5872
$$ 556890 573855 590769 607603 624106 639921 654898 669072 682660 696288 710796 726668
61021G26668J7453J9841K3817K9220L5523M3433N4721P0293Q9629J12217J37060
$$ 726668 744121 763962 787779 816999 852522 895955 950676 1020969 1110598 1222815 1359875
61010A359875J58482J63873J40241Q6410J8565l8642o7892o7063m4126q733K8967
$$ 1359875 1518357 1682230 1822471 1908881 1927446 1888804 1820912 1753849 1709723 1700990 1729957
60999A729957N4788N2926J6648m3676j05602j49016j66568j62762j46435j24993
$$ 1729957 1784745 1837671 1854319 1810643 1705041 1556025 1389457 1226695 1080260 955267
60989I55267j03169q3656o7457n4319m3646l5193k8783k3809j9506j5685j2757
$$ 955267 852098 768442 700985 646666 603020 567827 539044 515235 495729 480044 467287
60978D67287j0912r689q599p791p503p221o195m754m135m688n149m268k421q66
$$ 467287 456375 446686 438087 430296 422793 415572 409377 404623 400488 395800 390651 386383 383962 383096
60964C83096PP16J418J684J440J148R70O60L54N31J051J123N65J70M26Q00P81
$$ 383096 383103 383819 385237 386921 388361 389509 390479 391139 391493 392024 393075 394198 394763 394933 395359 396159 396940
60947C96940P41R83Q75r2j132j199o86p47j238q57N32J266R4k141l841m648n220
$$ 396940 397681 398664 399539 399447 398315 397116 396430 395683 394445 393588 394120 395386 395480 393339 389498 384850 379630
60930C79630n792o074o098o177o214n930n594n734o134n989n082m038l298k633
$$ 379630 373838 367764 361666 355489 349275 343345 337751 332017 325883 319894 314812 310774 307476 304843
60916C04843j875j359j315j374j146p37l40K01R84J600J630J316J233J553K033
$$ 304843 302968 301609 300294 298920 297774 297037 296697 296898 297882 299482 301112 302428 303661 305214 307247
60901C07247K529L058L533L841M107M484M864N149N499N884N637M206K201R62
$$ 307247 309776 312834 316367 320208 324315 328799 333663 338812 344311 350195 355832 360038 362239 363201
60887C63201R36J198Q24No50j271k380l754m477m168l497l265l453l514l208k709
$$ 363201 364137 365335 366159 366164 365514 364243 361863 358109 353632 349464 345967 342702 339249 335735 332527 329818
60871C29818k170j696j630k294l336l822l262k170j264o35o6K02j71p13m67O12
$$ 329818 327648 325952 324322 322028 318692 314870 311608 309438 308174 307539 307473 307675 307504 306791 306324 306936
60855C06936J450J323Q53J006J755K334K446K451K640K966L454M245N216N978
$$ 306936 308386 309709 310562 311568 313323 315657 318103 320554 323194 326160 329614 333859 339075 345053
60841C45053O311O250N811N034M149L334K359R54n09j244r86k81K80O48R60J087
$$ 345053 351364 357614 363425 368459 372608 375942 378301 379255 378746 377502 376516 376235 376515 377163 378123 379210
60825C79210P96J82l69n40k96J10K88j7p08j519k333l180m000m629m970n054m949
$$ 379210 380006 380188 379819 379279 378983 379093 379381 379364 378656 377137 374804 371624 367624 362995 358025 352971 348022
60808C48022m800m786m903m924m814m852n060m869l825k389j538j585j931j957
$$ 348022 343222 338436 333533 328609 323795 318943 313883 309014 305189 302800 301262 299677 297746 295789
60794B95789j607j164r13j086j647k021j520j78J213J981K136K053K016K173K483
$$ 295789 294182 293018 292105 291019 289372 287351 285831 285653 286866 288847 290983 293036 295052 297225 299708
60779B99708K633K342J892J926K717L896M990N772O163O179O047N941N653M929
$$ 299708 302341 304683 306575 308501 311218 315114 320104 325876 332039 338218 344265 350206 355859 360788
60765C60788M125L943M469N036N072M576L748K741J873J447J265Q83M32N09J149
$$ 360788 364913 368856 373325 378361 383433 388009 391757 394498 396371 397818 399083 399966 400398 400907 402056
60750D02056J681J767J851K316K926L359L525L147J873J42j031j518k342l914
$$ 402056 403737 405504 407355 409671 412597 415956 419481 422628 424501 424643 423612 422094 419752 415838
60736D15838n115m974m277m337m975m935l836k529j699j272j102j264j582j657
$$ 415838 410723 405749 401472 397135 392160 387225 383389 380860 379161 377889 376787 375523 373941 372284
60722C72284j390q54K05K011M016N340N824O071O426O682O754O959P529Q410R546
$$ 372284 370894 370040 370245 372256 376272 381612 387436 393507 399933 406615 413369 420328 427857 436267 445813
60707D45813J0875J2113J3059J4025J5345J6662J7381J7701J8437J9869K1456
$$ 445813 456688 468801 481860 495885 511230 527892 545273 562974 581411 601280 622736
60696F22736K2662K3353K3368K2568K1403K0638K0276J9484J7845J5865J3910
$$ 622736 645398 668751 692119 714687 736090 756728 777004 796488 814333 830198 844108
60685H44108J1362P428K334k712o630r315j1675j4829j8898k2602k4510k4644
$$ 844108 855470 862898 865232 862520 855890 846575 834900 820071 801173 778571 754061 729417
60673G29417k4195k3784k2894k1252j9703j9114j9125j8756j7796j6868j6399
$$ 729417 705222 681438 658544 637292 617589 598475 579350 560594 542798 525930 509531
60662E09531j6179j5809j5095j4020j2675j1158r479p661o034n059m711m414l787
$$ 509531 493352 477543 462448 448428 435753 424595 415116 407455 401421 396362 391651 387237 383450
60649C83450l018k290j361p2J146J777J802J391M21j150k772l777m174m389m438
$$ 383450 380432 378142 376781 376709 377855 379632 381434 382825 383246 382096 379324 375547 371373 366984 362546
60634C62546l960l018k111j436o52L90J274J605J619J790K191K451K277J752J178
$$ 362546 358586 355568 353457 352021 351369 351759 353033 354638 356257 358047 360238 362689 364966 366718 367896
60619C67896Q04P09Q41J030J002M79n63j745k570k905k994l045l037l016l237
$$ 367896 368700 369409 370250 371280 372282 372761 372198 370453 367883 364978 361984 358939 355902 352886 349649
60604C49649l774m314m524m448m295m091l820l595l414k968k118j310j070j289
$$ 349649 345875 341561 337037 332589 328294 324203 320383 316788 313374 310406 308288 306978 305908 304619
60590C04619j453j418j418j401r96j42P31J308J653J849J854J828K105K723L416
$$ 304619 303166 301748 300330 298929 297933 297791 298522 299830 301483 303332 305186 307014 309119 311842 315258
60575C15258M166N196O328P082P597Q656J0276J1064R705O579L140K16k308m465
$$ 315258 319424 324620 330948 338030 345627 354283 364559 375623 385328 391907 395047 395263 392955 388490
60561C88490n918o601o735o188m680k678j214n50J73J685L658N356O552P509Q573
$$ 388490 382572 375971 369236 363048 358368 355690 354476 353926 354099 355784 359442 364798 371350 378859 387432
60546C87432J0076J1972J3301J2728J0034O436L044j88l469o096p271p328p136
$$ 387432 397508 409480 422781 435509 445543 451979 455023 454835 451366 445270 437999 430671 423535
60533D23535o705n449l500j720n31L43R49R23K31o37j239j374p97M24J492J724
$$ 423535 416830 411381 407881 406161 405630 405973 406922 407845 408076 407439 406200 404826 404029 404453 405945 407669
60517D07669J638K209L196L499L170L594N346P221Q152Q789J0362J3038J6350
$$ 407669 409307 411516 414712 418211 421381 424975 430321 437542 445694 454483 464845 477883 494233
60504D94233K0284K4853K9278L2707L5239L7314L8488L7721L4472K8742K0565
$$ 494233 514517 539370 568648 601355 636594 673908 712396 750117 784589 813331 833896
60493H33896J0279j113j2673k4124l4878m3083m6899m6467m3587l9688l5224l0636
$$ 833896 844175 843062 830389 806265 771387 728304 681405 634938 591351 551663 516439 485803
60481D85803k6522k2829j9085j5571j3132j1697j0267q561p451p298p145o124
$$ 485803 459281 436452 417367 401796 388664 376967 366700 358139 350688 343390 336245 330121
60469C30121m641l445k549j820j769k760m030m506m120l503k817j800p60m53r46
$$ 330121 325480 322035 319486 317666 315897 313137 309107 304601 300481 296978 294161 292361 291601 291148 290202
60454B90202j315p76M27J400J530R07P1n69j106j828k544k576j678n35O8J68K34
$$ 290202 288887 288111 288538 289938 291468 292375 292446 291877 290771 288943 286399 283823 282145 281610 281678 281846 282080
60437B82080J45o59k058l062k957k078j208o53l30l14p46j281j169l8J630K968
$$ 282080 282225 281566 279508 276446 273489 271411 270203 269550 269220 268906 268160 266879 265710 265672 267302 270270
60421B70270L466L194K478J630Q85L83N3k83o33q08p15n65n74o38m96j81J6K1
$$ 270270 273736 276930 279408 281038 281923 282306 282359 282076 281443 280635 279920 279355 278781 278143 277647 277466 277482 277503
60403B77503K00Q91J840K342J984J154O95J013J668J891J467Q74O37Q20J220J733
$$ 277503 277703 278594 280434 282776 284760 285914 286609 287622 289290 291181 292648 293522 294159 294979 296199 297932
60387B97932K281K602K469J982J474J124R19Q74J051J358J600J698J712J676J567
$$ 297932 300213 302815 305284 307266 308740 309864 310783 311657 312708 314066 315666 317364 319076 320752 322319
60372C22319J470J556J809J914J520O60j36k87J88O74P39O97R90J288Q57j55o64
$$ 322319 323789 325345 327154 329068 330588 331248 331112 330825 331013 331687 332426 333123 334113 335401 336258 336103 335439
60355C35439j04P74J129J356K381M044N062M591L156J925J513J553J217J18j205
$$ 335439 335335 336109 337238 338594 340975 345019 350081 354672 357828 359753 361266 362819 364036 364154 362949
60340C62949j899j918j980k283k014p56M11K17r86j684j246m47q4j17k57l98l00
$$ 362949 361050 359132 357152 354869 352855 352099 352510 352727 351741 350057 348811 348364 348280 348163 347906 347508 347208
60323C47208K73Q94P67j57j050j318j042k78J128K803L891M302N036O791R084
$$ 347208 347481 348375 349142 348985 347935 346617 345575 345297 346425 349228 353119 357421 362457 369248 378332
60308C78332J1217J3229J5176J6240J5485J3067R839O134J724l198p773j1210
$$ 378332 389549 402778 417954 434194 449679 462746 472585 478719 480443 477245 469472 458262
60296D58262j3239j3854j3091j1205q763o448m773l855l366k913k508k435k587
$$ 458262 445023 431169 418078 406873 398110 391662 386889 383034 379668 376755 374247 371812 369225
60283C69225k417j679q46m95o44r63j313j718k067k231k372k747l283l566l280
$$ 369225 366808 365129 364283 363788 363144 362181 360868 359150 357083 354852 352480 349733 346450 342884 339604
60268C39604k571j925j677j633j339p85n17q57j354j449j244j097q93m15j19n56
$$ 339604 337033 335108 333431 331798 330459 329674 329157 328300 326946 325497 324253 323156 322263 321848 321729 321173
60252C21173j261j199k96M88O73P31R31Q65M41K09L06J36l80l55O24J695K047
$$ 321173 319912 318713 318417 318905 319578 320309 321240 322105 322546 322755 323061 323197 322817 322462 323086 324781 326828
60235C26828K030K119J944J315J133J964K596J586l42r79M38K455L563L751L657
$$ 326828 328858 330977 332921 334236 335369 337333 339929 341515 341173 340194 340632 343087 346650 350401 354058
60220C54058L388K802K205K128K741L666M230L983L260L011L660M437M381L722
$$ 354058 357446 360248 362453 364581 367322 370988 375218 379201 382461 385472 389132 393569 397950 401672
60206D01672L580M446N715O635P003O838O051M754L427K558K269K336K362K096
$$ 401672 405252 409698 415413 422048 429051 435889 441940 446694 450121 452679 454948 457284 459646 461742
60192D61742J800K036K813L327K966K136J534R64l18k266l867m368m042l577l304
$$ 461742 463542 465578 468391 471718 474684 476820 478354 479318 479000 476734 472867 468499 464457 460880 457576
60177D57576l165l063k977k995l249l675l894l558k675j548o16m27j221k334k574
$$ 457576 454411 451348 448371 445376 442127 438452 434558 431000 428325 426777 426161 425734 424513 422179 419605
60162D19605j636n64l82q41j122j096j103r99l80N58J348K061K908L376K808J707
$$ 419605 417969 417405 417023 416182 415060 413964 412861 411862 411482 412040 413388 415449 418357 421733 424541 426248
60146D26248J345K054K897L141L108L346L881M529N211N694N684N330N015M585
$$ 426248 427593 429647 432544 435685 438793 442139 446020 450549 455760 461454 467138 472468 477483 482068
60132D82068L540K067J012P00N74K66J05K10l2r20j637j190K12J423J691J277
$$ 482068 485608 487675 488687 489387 489961 490227 490332 490542 490510 489590 487953 486763 486975 488398 490089 491366
60116D91366P89N01L45L11N69J103J369P01p02j637j215J6P84O07l0p09j384j842
$$ 491366 492155 492656 493001 493312 493881 494984 496353 497054 496352 494715 493500 493516 494300 494907 494877 494168 492784 490942
60098D90942j797j617j968k579k275o73J066J684J292Q21O32M37J91K79Q89J684
$$ 490942 489145 487528 485560 482981 480706 480033 481099 482783 484075 484896 485528 485965 486156 486435 487324 489008
60082D89008K182K147J670J089P66Q34J168J505J505Q04o24k257l433m005m295
$$ 489008 491190 493337 495007 496096 496862 497696 498864 500369 501874 502678 502054 499797 496364 492359 488064
60067D88064m521m649m674m678m607m409m306m540m899m967m733m509m347m061
$$ 488064 483543 478894 474220 469542 464935 460526 456220 451680 446781 441814 437081 432572 428225 424164
60053D24164l703l491l302k843k205j654j028j8J000J283R11Q31J485K341K977
$$ 424164 420461 416970 413668 410825 408620 406966 405938 405920 406920 408203 409114 409945 411430 413771 416748
60038D16748L792N095O220O186M920L353K446K315K176J098r08k710l408l533
$$ 416748 420540 425635 431855 438041 442961 446314 448760 451075 453251 454349 453441 450731 447323 443790
60024D43790m256n611o482o381o105o405o973p256p315p294o845n770m648m131
$$ 443790 439534 433923 427441 421060 414955 408550 401577 394321 387006 379712 372867 367097 362449 358318
60010C58318m050l783l160k470j882j403j101r60o63J43J428K720L297K642J194
$$ 358318 354268 350485 347325 344855 342973 341570 340469 339509 338846 338989 340417 343137 346434 349076 350270
59995C50270M43J528L724N201N311N161N620O026N537M673M462M708M297K938
$$ 350270 350713 352241 355965 361166 366477 371638 377258 383284 388821 393494 397956 402664 406961 409899
59981D09899J569J069J296J539J290N05n25j455k169k793l389l837m083m187m053
$$ 409899 411468 412537 413833 415372 416662 417167 416642 415187 413018 410225 406836 402999 398916 394729 390676
59966C90676l471k570j791j324r79p20q40j378j871j853j244j90J027J882J982
$$ 390676 387205 384635 382844 381520 380541 379821 378981 377603 375732 373879 372635 372445 373472 375354 377336
59951C77336J635J456J399R47K66J81Q68J492J495J278J193Q95J98l88n62q22
$$ 377336 378971 380427 381826 382773 383039 383220 384088 385580 387075 388353 389546 390441 390639 390251 389689 388867
59935C88867j457j866j610j233j352j692j820j962k274k141j247n04q20j602j618
$$ 388867 387410 385544 383934 382701 381349 379657 377837 375875 373601 371460 370213 369709 368889 367287 365669
59920C65669q08n2M31J144K062K511K281J862J629J631K003K752L326L256L031
$$ 365669 364861 364809 365240 366384 368446 370957 373238 375100 376729 378360 380363 383115 386441 389697 392728
59905C92728L346L772L239J765O36O92J378J723J441P99J35j75K00J206K396L349
$$ 392728 396074 399846 403085 404850 405486 406178 407556 409279 410720 411519 411654 411479 411679 412885 415281 418630
59889D18630L871L962L921M231M925N333M963M216L756L527L126K707K672K742
$$ 418630 422501 426463 430384 434615 439540 444873 449836 454052 457808 461335 464461 467168 469840 472582
59875D72582K255J261N64O23J051J152L88j423l803n669o332o205o014n734n004
$$ 472582 474837 476098 476662 477285 478336 479488 479876 478453 474650 468981 462649 456444 450430 444696 439692
59860D39692m084l477l076k600k449k977l359k540j047m55j076j705j679j657
$$ 439692 435608 432131 429055 426455 424006 421029 417670 415130 414083 413628 412552 410847 409168 407511
59846D07511j959j821r71n25j300k343k257j216n54q30j342j344r10n51n24n94
$$ 407511 405552 403731 402760 402235 400935 398592 396335 395119 394565 393735 392393 391049 390139 389588 389064 388470
59830C88470k99N69J684K597L243L706L631K544O97j072k407l645m856n536n478
$$ 388470 388171 388740 390424 393021 396264 399970 403601 406145 406842 405770 403363 399718 394862 389326 383848
59815C83848n100m592l581k180j476k130l169l030j560j49O9n77r35m09N32R92
$$ 383848 378748 374156 370575 368395 366919 364789 361620 358590 357030 356881 356950 356373 355438 355029 355561 356553
59799C56553N93k81j076j608j866j608p54P7N2p32j240q30M8O35P70P32P05P32
$$ 356553 357146 356865 355789 354181 352315 350707 349953 350030 350082 349350 348110 347280 347328 347963 348733 349465 350170 350902
59781C50902Q21Q27M94q7m91n63o16q58j063j000p41k82N85J774K663K750K243
$$ 350902 351723 352550 353044 352957 352466 351903 351287 350429 349366 348366 347625 347343 347928 349702 352365 355115 357358
59764C57358J657J176O76J83j4L97J484K833L689L667L326L582M544N465N848
$$ 357358 359015 360191 360867 361050 361036 361433 362917 365750 369439 373106 376432 380014 384558 390023 395871
59749C95871N953O093O107N804N307M670L738K708K167K231K267J918J659J828
$$ 395871 401824 407917 414024 419828 425135 429805 433543 436251 438418 440649 442916 444834 446493 448321
59735D48321J843J159L63L74R10Q86J11m88m53n53j476k580k676j591k72N10Q19
$$ 448321 450164 451323 451686 452060 452970 453856 453967 453479 453026 452473 450997 448417 445741 444150 443878 444388 445207
59718D45207R52P78J62m21k67N61J166R39L62L51J138K160K847L103L091K946
$$ 445207 446159 446937 447099 446678 446411 446972 448138 449077 449439 449790 450928 453088 455935 459038 462129 465075
59702D65075K776K676K715L027L700M475M850M774M835N319N520M595K775J006
$$ 465075 467851 470527 473242 476269 479969 484444 489294 494068 498903 504222 509742 514337 517112 518118
59688E18118l34j528k492k650j929j024m45q6J20r4o49r69r05j060j815k751l416
$$ 518118 517784 516256 513764 511114 509185 508161 507716 507630 507750 507656 507007 506038 505133 504073 502258 499507 496091
59671D96091m018m811n451n532n250m900m327l434k728k636k606j743j06J320
$$ 496091 492073 487262 481811 476279 471029 466129 461802 458368 455640 453004 450398 448655 448549 449869
59657D49869J875J781J560J528J977L155M816O122O339N500M253L199K482J873
$$ 449869 451744 453525 455085 456613 458590 461745 466561 472683 479022 484522 488775 491974 494456 496329
59643D96329J048k48k077m116n633o029n610n377n787o098n423m031k911k352
$$ 496329 497377 497129 495052 490936 485303 479274 473664 468287 462500 456402 450979 446948 444037 441685
59629D41685j844j344j544k609l567l597l136l145l747m361m739n210n972o668
$$ 441685 439841 438497 436953 434344 430777 427180 424044 420899 417152 412791 408052 402842 396870 390202
59615C90202o764n979m427k540q43L14Q57Q39M79K61N80J240J620J464J112R18
$$ 390202 383438 377459 373032 370492 369649 369963 370820 371659 372138 372399 372979 374219 375839 377303 378415 379333
59599C79333Q12N78K01j91m03j60O02J338J301M85k86l71K1K49k5o74j275j427
$$ 379333 380145 380723 380924 380733 380330 380170 380772 382110 383411 383896 383610 383239 383260 383509 383484 382810 381535 380108
59581C80108j285j593k684l661l396k267j853k803m019m308l829l366l051k554
$$ 380108 378823 377230 374546 370885 367489 365222 363369 360566 356547 352239 348410 345044 341993 339439
59567C39439j850j142m88K7J65M8J86O52Q44M99L05R31K075K947L220K995K467
$$ 339439 337589 336447 335959 335986 336151 336199 336385 337037 337881 338380 338685 339616 341691 344638 347858 350853 353320
59550C53320K091K496L696M897N502N756N992O159O509P913J0762J4433J8295
$$ 353320 355411 357907 361603 366500 372002 377758 383750 389909 396418 404331 415093 429526 447821
59537D47821K2072K4294K1871J3137Q74r347j3920j3368j0303o790l749j324Q95
$$ 447821 469893 494187 516058 529195 530069 520722 506802 493434 483131 476341 472592 471268 472163
59524D72163L347N743P264P539O934N918M681L347J955L27j637l596n276o967
$$ 472163 475510 481253 488517 496056 502990 508908 513589 516936 518891 519218 517581 513985 508709 501742
59510E01742q825j0076r748q182o948p074q044q663q373p525o758o278n651m374
$$ 501742 492917 482841 473093 464911 457963 450889 442845 434182 425809 418284 411526 405248 399597 395223
59496C95223k696j439q48k99N85J240J191R61J167J455J305J199J850K782L017
$$ 395223 392527 391088 390240 389941 390526 391766 392957 393918 395085 396540 397845 399044 400894 403676 406693
59481D06693K779L209M523N823O688P611Q648Q997Q273P059N772L969J348j411
$$ 406693 409472 412681 417204 423027 429715 437326 445974 454971 463244 470303 476075 480044 481392 479981
59467D79981l370m237m221l572k629j709o92P98K601M078N056O107P655R459J1127
$$ 479981 476611 472374 468153 464581 461952 460243 459551 460349 462950 467028 472084 478191 485846 495305 506432
59452E06432J2521J3498J3935J4121J4508J4898J4529J3071J0774P589L033k732
$$ 506432 518953 532451 546386 560507 575015 589913 604442 617513 628287 635876 638909 636177
59440F36177q502j3014j5687j6292j4809j2078r677q567q428q672r342j0463j1235
$$ 636177 627675 614661 598974 582682 567873 555795 546118 537551 529123 520451 511109 500646 489411
59427D89411j0617q350m991j394J568L452M855O979J0112J3214J5438J7231J9322
$$ 489411 478794 470444 465453 464059 465627 469079 473934 480913 491025 504239 519677 536908 556230
59414E56230K1602K4053K7553L2021L4077K8827J4989k750j7469k5431k7356k5493
$$ 556230 577832 601885 629438 661459 695536 724363 739352 736602 719133 693702 666346 640853
59402F40853k1081j4568o609J891R759J4593J2857K765j2638k6678l4146l4692
$$ 640853 619772 605204 598595 600486 610245 624838 637695 640460 627822 601144 566998 532306
59390E32306l1113k5842k0099j5124j2054j0579r282p567o064n008l639j681j60
$$ 532306 501193 475351 455252 440128 428074 417495 408213 400646 394582 389574 385935 384254 384094
59377C84094Q6l15l21Qj6l06j26O47J337J430J109P77P18J125J948K685K767K269
$$ 384094 384180 383865 383544 383552 383536 383230 383104 383751 385088 386518 387627 388404 389122 390247 392195 394880 397647 399916
59359C99916J885K175L084M226N301O227P127Q291R956J1997J3984J5563J6694
$$ 399916 401801 403976 407060 411286 416587 422814 429941 438232 448188 460185 474169 489732 506426
59346E06426J7454J7749J7500J7056J7082J7794J8466J8076J6357J3869J1029
$$ 506426 523880 541629 559129 576185 593267 611061 629527 647603 663960 677829 688858
59335F88858P715L934K24l020o104r329j2177j3892j4527j4787j5030j5066j4729
$$ 688858 696573 700507 700731 697711 691607 682278 670101 656209 641682 626895 611865 596799 582070
59322E82070j4018j2840j1196r533q230p031n644m587m588n277n574n253n063
$$ 582070 568052 555212 544016 534483 526253 519222 513578 508991 504403 499126 493552 488299 483236
59309D83236n175m750l411k057j520j357p32J26K60n97j616j847j098J3O25L10
$$ 483236 478061 473311 469900 467843 466323 464966 464234 464360 464620 464023 462407 460560 459462 459475 460100 460410
59293D60410n71j251j284p96j62K02k3o80j005m70M67J028J341K152L465M491
$$ 460410 459839 458588 457304 456508 456346 456548 456525 455845 454840 454370 454837 455865 457206 459358 462823 467314
59277D67314N046N901P412Q840R528R951J0924J2452J3903J4804J4955J4276J3002
$$ 467314 472360 478261 485673 494513 504041 513992 524916 537368 551271 566075 581030 595306 608308
59264F08308J1683J0544R237P442N233K734j5k693m894o808q965j1113j2252j2078
$$ 608308 619991 630535 639772 647214 652447 655181 655166 652473 647579 640771 631806 620693 608441 596363
59250E96363j1482j1149j0663r502q030o831n915n188m802m418l093p77J063J359
$$ 596363 584881 573732 563069 553567 545537 538706 532791 527603 522801 518383 515290 514513 515576 516935
59236E16935J069J771L332M288L996L099K166J082k22j598l132m897o409p218
$$ 516935 518004 519775 523107 527395 531391 534490 536656 537738 537516 535918 532786 527889 521480 514262
59222E14262p857r154j0756j1363j0462q835p401o495o329o977p718p373n737
$$ 514262 506405 497251 486495 475132 464670 455835 448434 441939 435610 428633 420915 413542 407805
59209D07805l866k631j802q94o0L69M97M91Q6q96j978k446k086j104K92J764K614
$$ 407805 403939 401308 399506 398612 398552 398921 399418 399909 399995 399099 397121 394675 392589 391485 391777 393541 396155
59192C96155K391J634J478K357L541M079L946L937M608N681O498O763O639O371
$$ 396155 398546 400180 401658 404015 407556 411635 415581 419518 424126 429807 436305 443068 449707 456078
59178D56078O116O031O161O214N783M835L778L062K973L655M893N943O218O203
$$ 456078 462194 468225 474386 480600 486383 491218 494996 498058 501031 504686 509579 515522 521740 527943
59164E27943O980Q635R864R589Q227O843N733M584L468K695J867R8k722n516p192
$$ 527943 534923 543558 553422 563011 571238 578081 583814 588398 591866 594561 596428 596526 593804 588288 581096
59149E81096p748q022q622r293r295q323p029o400o644p044p039o851o759o374
$$ 581096 573348 565326 556704 547411 538116 529793 522764 516364 509720 502676 495637 488786 482027 475653
59135D75653n281l975l338l377l241k516j751j444j173j79J501K928L422L484
$$ 475653 470372 466397 463059 459682 456441 453925 452174 450730 449557 449378 450879 453807 457229 460713
59121D60713M337O461Q870J0214J0412J0622J1590J2715J3150J3078J3308J3936
$$ 460713 465050 471511 480381 490595 501007 511629 523219 535934 549084 562162 575470 589406
59109E89406J4226J3696J2704J1860J1313J0777R991R029Q164P442O436M698K440
$$ 589406 603632 617328 630032 641892 653205 663982 673973 683002 691166 698608 705044 709742 712182
59096G12182M22r42j956l033m139n022n541n536m888l996l635m035m612m929n318
$$ 712182 712604 711662 709706 706673 702534 697512 691971 686435 681547 677551 673916 669881 665269 660340 655022
59081F55022o090o859p273p818r131j0885j2135j2477j2180j1473j0454r451q769
$$ 655022 648932 642073 634800 626982 617851 606966 594831 582354 570174 558701 548247 538796 530027
59068E30027q173p278o283n709n598n564n504n562n538n068m387m161m444m480
$$ 530027 521854 514576 508293 502584 496986 491422 485918 480356 474818 469750 465363 461202 456758 452278
59054D52278l726k627k018k158k585k765k660k601k657k376j417k49L03K67N37
$$ 452278 448552 445925 443907 441749 439164 436399 433739 431138 428481 426105 424688 424439 424742 425009 425546
59039D25546J523K512K782K575K415K218J834J774K487L409L663L383L429M086
$$ 425546 427069 429581 432363 434938 437353 439571 441405 443179 445666 449075 452738 456121 459550 463636
59025D63636M953N927P273Q870J0256J1445J2856J4332J5061J4683J3785J3090
$$ 463636 468589 474516 481789 490659 500915 512360 525216 539548 554609 569292 583077 596167
59013E96167J2585J1588R387N785J458k380n006o651p643p631o298m286k595j312
$$ 596167 608752 620340 629727 635512 636970 634590 629584 622933 615290 607659 601361 597075 594480 593168
58999E93168J51J787K961L591M270N133N464M774L469K119P22r55k717m024m534
$$ 593168 593319 595106 598067 601658 605928 611061 616525 621299 624768 626887 627609 626654 623937 619913 615379
58984F15379m473m546n378o802p897q011p439o774n999m703k860q35J091K731
$$ 615379 610906 606360 600982 594180 586283 578272 570833 564059 558060 553357 550497 549662 550753 553484
58970E53484L884M679N550O456O795O630P079Q620R946R797R009R204J0082R870
$$ 553484 557368 562047 567597 574053 580848 587478 594557 603177 613123 622920 631929 641133 651215 661085
58956F61085Q150O314N068L346K42l619p254j0422j2847j3715j2874j1505j0748
$$ 661085 669235 675549 680617 683963 684205 680586 673332 662910 650063 636348 623474 611969 601221
58943F01221j0365r447p708n500l360k053k270l699n112n839o422p268p687o994
$$ 601221 590856 581409 573701 568201 564841 562788 560518 556819 551707 545868 539446 532178 524491 517497
58929E17497n737m865m351l549k484j851j919k245k373k229j864j359r50q30r07
$$ 517497 511760 506895 502544 498995 496511 494660 492741 490496 488123 485894 484030 482671 481721 480891 479984
58914D79984q87o02o3O52J424K183L009L985N047O173P584R355J0998J1926J2152
$$ 479984 479097 478495 478432 479084 480508 482691 485700 489685 494732 500905 508489 517844 528842 540768 552920
58899E52920J2008J1375R899P866O081M852L885L227L472M851O897R255J2052
$$ 552920 564928 576303 586202 594068 600149 605001 608886 612113 615585 620436 627333 636588 648640
58886F48640J5191J8032K0118K1579K2472K2334K0775J8050J4728J1224P746M289
$$ 648640 663831 681863 701981 723560 746032 768366 789141 807191 821919 833143 840889 845178
58874H45178N54l609p674j0938j3488j5970j8333j9671j9469j8229j6601j4697
$$ 845178 845732 842123 834449 823511 810023 794053 775720 756049 736580 718351 701750 687053
58862F87053j2510j0359q563p305o880p454q439q900q720q658r094r557r641r472
$$ 687053 674543 664184 655621 648316 641436 633982 625543 616643 607923 599265 590171 580614 570973 561501
58848E61501r081q235p119o362n997n355m282l561l712m247m506m462m345m276
$$ 561501 552420 544185 537066 530704 524707 519352 515070 511509 507797 503550 499044 494582 490237 485961
58834D85961m548n348o001n460l950k915k993l169k503j509r72o59r9L20R1k96
$$ 485961 481413 476065 470064 464604 460654 457739 454746 451577 449074 447565 446593 445934 445835 446155 446246 445950
58818D45950r1M97P47O05O18J056J839K777L435L272K507K139K510K622J643K64
$$ 445950 445859 446356 447103 447708 448326 449382 451221 453998 457433 460705 463212 465351 467861 470483 472126 472390
58802D72390l01k6J85J0j09J1p3p54j968l225l772l078j589n40n50r08o36L46
$$ 472390 472089 472063 472248 472258 472149 472160 472087 471333 469365 466140 462368 459290 457701 457161 456611 455703 455067 455413
58784D55413J541K722L877M830N537O231O857O810N784M326L095K168J417Q79
$$ 455413 456954 459676 463553 468383 473920 480151 487008 493818 499602 503928 507023 509191 510608 511487
58770E11487L51o55k050l050l339l534m014m232l838l475l662l840l424l002l348
$$ 511487 511838 511183 509133 506083 502744 499210 495196 490964 487126 483651 479989 476149 472725 469723 466375
58755D66375l970l683k253n16P53J383J553J689K226K971L185K701K289K491K933
$$ 466375 462405 458722 456469 455953 456706 458089 459642 461331 463557 466528 469713 472414 474703 477194 480127
58740D80127L293L987N201O243O602O739P040O994O345N957O519P346P573P598
$$ 480127 483420 487407 492608 498851 505453 512192 519232 526226 532571 538528 545047 552393 559966 567564
58726E67564Q059Q350P524N944M565L250J207j330l350m498n010m622k965p89
$$ 567564 575623 583973 591497 597441 602006 605256 606463 605133 601783 597285 592275 587653 584688 583899
58712E83899O84J482K657M435N805N999N283M181K847J308l69k225m236o234q337
$$ 583899 584583 586065 588722 593157 598962 604961 610244 614425 617272 618580 618211 615986 611750 605516 597179
58697E97179j0893j3521j4981j4737j3875j3581j3595j3071j2102j1155r865p748
$$ 597179 586286 572765 557784 543047 529172 515591 501996 488925 476823 465668 455803 448055
58685D48055n474m098l566l230l240m000m873m876m222l781l442k580j629j580
$$ 448055 442581 438483 434917 431687 428447 424447 419574 414698 410476 406695 403253 400673 399044 397464
58671C97464k077j702p8J745K999L909M737N410O151P268Q312Q498P841O851N475
$$ 397464 395387 393685 393607 395352 398351 402260 406997 412407 418558 425826 434138 442636 450477 457328 462803
58656D62803L461J404J37n61j443k349k676k696k962k914j820o60j145l022m240
$$ 462803 466264 467668 467805 467244 465801 463452 460776 458080 455118 452204 450384 449724 448579 445557 441317
58641D41317l825k747j857r08N3K33m08o99N2J206K001K347K182J357M15J99M84
$$ 441317 437492 434745 432888 431980 432033 432266 431858 431159 431211 432417 434418 436765 438947 440304 440719 440918 441402
58624D41402K77m77q69p71j012j571j292K42K042L372M604O035P259Q190R294
$$ 441402 441679 441202 440333 439562 438550 436979 435687 435929 437971 441343 445947 451982 459241 467431 476725
58609D76725J0315J0197Q724O935N452L859K084R46P43O67K63N6J57l68k015l902
$$ 476725 487040 497237 505961 512896 518348 522207 524291 525237 525980 526647 526910 526966 527123 526755 524740 520838
58593E20838n029n322m932l721k033p33J30J487L555N201N678N765O470P678Q802
$$ 520838 515809 510487 505555 501834 499801 499068 499198 500685 504240 509441 515119 520884 527354 535032 543834
58578E43834R679J0143R727Q498P259O401N464M291L536L545L817M040M694O091
$$ 543834 553513 563656 573383 581881 589140 595541 601005 605296 608832 612377 616194 620234 624928 631019
58564F31019P892R941J2522J5435J7947J9965K2020K3822K4250K3162K1669K0104
$$ 631019 638911 648852 661374 676809 694756 714721 736741 760563 784813 807975 829644 849748
58552H49748J7289J2682P664L774R52j490l386m318m689n226o150p491r387j1523
$$ 849748 867037 879719 887383 891157 892109 890619 887233 882915 878226 873000 866850 859359 849972 838449
58538H38449j3241j4630j6505j8832k0482k0998k1225k1578k1130j9243j6706
$$ 838449 825208 810578 794073 775241 754759 733761 712536 690958 669828 650585 633879
58527F33879j4353j1834q753n818l810k522j532j080j263j373r61n36m90l11L55
$$ 633879 619526 607692 598939 593121 589311 586789 585257 584177 582914 581541 580580 580044 579554 579243 579598
58512E79598R69J184J607K664L752M271M462M525M016K895K052K042K262K063
$$ 579598 580567 581751 583358 586022 589774 594045 598507 603032 607048 609943 611995 614037 616299 618362
58498F18362J566Q93k23j505k113k135k681l944m634m002k831j795n64P33J073
$$ 618362 619928 620821 620598 619093 616980 614845 612164 608220 603586 599584 596753 594958 594394 595127 596200
58483E96200N32P92K551M376N364O921J0227J3871J5863J6345J6426J5824J3674
$$ 596200 596732 597524 600075 604451 609815 616736 626963 640834 656697 673042 689468 705292 718966
58470G18966J0480P291M000K26l250n687p868j0519j2348j1738r381p253n768
$$ 718966 729446 736737 740737 740963 737713 732026 724158 713639 701291 689553 680172 672919 667151
58457F67151l962j830k59R12K766N383P680R004R475Q979P265M771K136p45m105
$$ 667151 663189 661359 661100 662012 664778 670161 677841 686845 696320 705299 712564 717335 719471 718726 714621
58442G14621p233r199j0041j0243r677q207o551n286l829j601N84J666K008K591
$$ 714621 707388 698189 688148 677905 668228 660021 653470 648184 644355 642754 643338 645004 647012 649603
58428F49603L390L907M600O157Q122R632J0860J2324J3488J3517J2778J2037J0852
$$ 649603 652993 656900 661500 667657 675779 685411 696271 708595 722083 735600 748378 760415 771267
58415G71267Q206M317L98k870n384o696o472n465m854m957n445o092o485n881
$$ 771267 779473 783790 784188 781318 775934 769238 762766 757301 752447 747490 742045 735953 729468 723587
58401G23587m348l035k419j473L40J733J634J133J762L169M161M820N718O153
$$ 723587 719239 716204 713785 712312 712652 714385 716019 717152 718914 722083 726244 731064 736782 742935
58387G42935N121L133J329l51k325l813l938l529l923m816n040m580m073l230
$$ 742935 748056 751189 752518 752167 749842 746029 742091 738562 734639 729823 724783 720203 716130 712900
58373G12900j618q9L86M65J287K577L618M871O754Q084P878P515Q825J1074J2267
$$ 712900 711282 711193 711579 712044 713331 715908 719526 724397 731151 739235 747113 754628 763453 774527 786794
58358G86794J2431J3068J4158J4347J3568J2911J2236J0279P029L879J626J48
$$ 786794 799225 812293 826451 840798 854366 867277 879513 889792 896821 900700 902326 902474
58346I02474l77J95R74J128J410K937N191P032Q634J0652J2486J3444J4513J6806
$$ 902474 902097 902292 903266 904394 905804 908741 913932 920964 929598 940250 952736 966180 980693 997499
58332I97499J9247J9950J8930J7453J5855J4051J2818J2380J1148Q166N236M148
$$ 997499 1016746 1036696 1055626 1073079 1088934 1102985 1115803 1128183 1139331 1147497 1152733 1156881
58320A156881L681K057N32J216L116L806L596M411N843O134O006P622J0547J2488
$$ 1156881 1160562 1162619 1163151 1164367 1167483 1171289 1174885 1179296 1185139 1191273 1197279 1204901 1215448 1227936
58306A227936J3331J4719J6383J6703J6276J7134J8932J9645J9440K0008K0688
$$ 1227936 1241267 1255986 1272369 1289072 1305348 1322482 1341414 1361059 1380499 1400507 1421195
58295A421195J9342J6639J5355J5712J5398J4055J3656J4565J5176J5436J6843
$$ 1421195 1440537 1457176 1472531 1488243 1503641 1517696 1531352 1545917 1561093 1576529 1593372
58284A593372J8989J9958J9999K1020K2773K3414K3425K4925K7515K9030K9873
$$ 1593372 1612361 1632319 1652318 1673338 1696111 1719525 1742950 1767875 1795390 1824420 1854293
58273A854293L2300L5811L7795L8325L9779M2072M3079M3353M5552M9373N2024
$$ 1854293 1886593 1922404 1960199 1998524 2038303 2080375 2123454 2166807 2212359 2261732 2313756
58262B313756N3453N6091N9763O2093O3563O6719P0668P2002P0962P0828P1622
$$ 2313756 2367209 2423300 2483063 2545156 2608719 2675438 2746106 2818108 2889070 2959898 3031520
58251C031520P0529O8441O9448P3616P6898P8547Q1990Q7911R3283R7806J04510
$$ 3031520 3102049 3170490 3239938 3313554 3390452 3468999 3550989 3638900 3732183 3829989 3934499
58240C934499J13219J20383J25966J33632J43616J52513J60402J70682J82801
$$ 3934499 4047718 4168101 4294067 4427699 4571315 4723828 4884230 5054912 5237713
58231E237713J93228K03571K19014K38541K56022K71314K90430L14191L37278
$$ 5237713 5430941 5634512 5853526 6092067 6348089 6619403 6909833 7224024 7561302
58222G561302L59524L86969M20367M54206M88940N32096N85217O42129P02471
$$ 7561302 7920826 8307795 8728162 9182368 9671308 10203404 10788621 11430750 12133221
58213A2133221P73888Q58512R51280J054486J179228J329522J500914J698244
$$ 12133221 12907109 13765621 14716901 15771387 16950615 18280137 19781051 21479295
58205B1479295J937863K228876K570370K968925L434370L952519M491362N051612
$$ 21479295 23417158 25646034 28216404 31185329 34619699 38572218 43063580 48115192
58197D8115192N692901O500684P550055Q909723J0649468J2826257J5490272J8716502
$$ 48115192 53808093 60308777 67858832 76768555 87418023 100244280 115734552 134451054
58189A34451054K2584434K7067626L1882857L6313984L9021466L8095368L1762701
$$ 134451054 157035488 184103114 215985971 252299955 291321421 329416789 361179490
58182C61179490J9645917L611926j2775987k6002077l4182209l7377121l6807062
$$ 361179490 380825407 384437333 371661346 345659269 311477060 274099939 237292877
58175B37292877l3923528k9934055k5691524k1696587j8161939j5139069j2618029
$$ 237292877 203369349 173435294 147743770 126047183 107885244 92746175 80128146
58168H0128146j0548984q849535p443579o284937n336111m550874l891813l342779
$$ 80128146 69579162 60729627 53286048 47001111 41665000 37114126 33222313 29879534
58160B9879534k890294k510352k183844j907432j678543j484342j314273j168996
$$ 29879534 26989240 24478888 22295044 20387612 18709069 17224727 15910454 14741458
58152A4741458j048216r42619q45662p61234o92090o31795n74850n24232m82302
$$ 14741458 13693242 12750623 11904961 11143727 10451637 9819842 9244992 8720760 8238458
58143H238458m44345m07251l75085l50014l26729l01636k78924k61947k46753
$$ 8238458 7794113 7386862 7011777 6661763 6335034 6033398 5754474 5492527 5245774
58134E245774k29745k13950k02169j91166j78056j65738j56892j48853j39202
$$ 5245774 5016029 4802079 4599910 4408744 4230688 4064950 3908058 3759205 3620003
58125C620003j30416j24465j18649j11027j04272j00075r5457q8568q2549p9577
$$ 3620003 3489587 3365122 3246473 3135446 3031174 2931099 2835642 2747074 2664525 2584948
58115B584948p6720p1693o7290o5894o4811o1333n7540n5890n4721n2190n0087
$$ 2584948 2508228 2436535 2369245 2303351 2238540 2177207 2119667 2063777 2009056 1956866 1906779
58104A906779m9749m8651m5133m2132m2088m2398m0141l7225l6418l6083l3506
$$ 1906779 1857030 1808379 1763246 1721114 1679026 1636628 1596487 1559262 1522844 1486761 1453255
58093A453255l0154k9058k9632k9396k8324k7579k6279k3351k0410j9299j8848
$$ 1453255 1423101 1394043 1364411 1335015 1306691 1279112 1252833 1229482 1209072 1189773 1170925
58082A170925j7304j5755j5901j6710j6522j6368j7830j9616j9586j8374j7883
$$ 1170925 1153621 1137866 1121965 1105255 1088733 1072365 1054535 1034919 1015333 996959 979076
58071I79076j7839j6877j5541j5227j5493j5104j4421j4214j3539j1367q974q240
$$ 979076 961237 944360 928819 913592 898099 882995 868574 854360 840821 829454 820480 812240
58059H12240q779q986q731q759q800q403q405r541j0790j1003j0850j1241j1331
$$ 812240 803461 794475 785744 776985 768185 759782 751377 741836 731046 720043 709193 697952 686621
58046F86621j0036q192p162o603n633m880n383o544p171p411p900p993o782m934
$$ 686621 676585 668393 661231 654628 648995 644115 638732 632188 625017 617606 609706 601713 594931 589997
58032E89997l850l834m442n613p141q132q285q522r248r379q333p365p498p743
$$ 589997 586147 582313 577871 572258 565117 556985 548700 540178 530930 521551 513218 505853 498355 490612
58018D90612o895n582m929m690m319m362n099n266l918k252j801k142k053j729
$$ 490612 483717 478135 473206 468516 464197 459835 454736 449470 445552 443300 441499 439357 437304 435575
58004D35575j940k200j535k31P90J397J749J447N48K48J171K252K558K826L778
$$ 435575 433635 431435 429900 429669 430459 431856 433605 435052 435600 435848 437019 439271 441829 444655 448433
57989D48433M471L940L065L020L270K815K091J785J139o12k359k652k105k263
$$ 448433 452904 456844 459909 462929 466199 469014 471105 472890 474029 473417 471058 468406 466301 464038
57975D64038l079l460l419l689l958l355k160j337r64o05n01r67j402j268j177
$$ 464038 460959 457499 454080 450391 446433 443078 440918 439581 438617 438012 437511 436544 435142 433874 432697
57960D32697j656j908j255n83r01j582j761k157l708n528o148n699n036l831j667
$$ 432697 431041 429133 427878 427295 426394 424812 423051 420894 417186 411658 405510 399811 394775 390944 389277
57945C89277J70K18o85o42L95J237K064M015O655Q337Q818R291J0120J0608J0760
$$ 389277 389447 389665 388980 388338 388733 389970 392034 396049 402704 411041 419859 429150 439270 449878 460638
57930D60638J1119J1055R291O087K948L28k451n211o936p697q601r806j0426j0346
$$ 460638 471757 482812 492103 498190 501138 501466 499015 493804 486868 479171 470570 460764 450338 439992
57916D39992j0294j0154r165p794p417q016q115p128n925m961l710k289j709k108
$$ 439992 429698 419544 410379 402585 395168 387152 379037 371909 365984 361023 357313 355024 353315 351207
57902C51207k468k520l148m459n228m793l962l395k640j468o88q27j225j141o60
$$ 351207 348739 346219 343071 338612 333384 328591 324629 321234 318594 317126 316438 315611 314386 313245 312585
57887C12585lJ007K150K576J984J154P48M74j26q25j222j398j670k216l112m208
$$ 312585 312582 313589 315739 318315 320299 321453 322201 322675 322549 321724 320502 319104 317434 315218 312106 307898
57871C07898m876m553l507k495j789j203q27q44q68k73Q65K018L068M143N000
$$ 307898 303022 298469 294962 292467 290678 289475 288648 287804 286936 286663 287528 289546 292614 296757 301757
57856C01757N453N984O871P296O523N374N101N317M653L127J981J408L05j527
$$ 301757 307210 313194 320065 327361 333884 339258 344359 349676 354329 357456 359437 360845 361150 359623
57842C59623k920l436m105n485o580o460n605m895m494m294m392m443l593j699
$$ 359623 356703 353267 349162 343677 337097 330637 325032 320137 315643 311349 306957 302514 298921 297222
57828B97222K66J444J877J823J301O16L10K80o8n36j80R87J640R92j62q41j243
$$ 297222 297488 298932 300809 302632 303933 304549 304859 305139 305071 304535 304355 305342 306982 307974 307812 306971 305728
57811C05728k025l127m100m814n216n013m224l416k981k644k044j241m93j3q8
$$ 305728 303703 300576 296476 291662 286446 281433 277209 273793 270812 268168 266124 264883 264390 264377 264289
57796B64289p72j407j233m93j57m92q39q38p86o65O3J332K206K112J549J220J318
$$ 264289 263517 262110 260877 260384 260227 259735 258896 258058 257272 256607 256670 258002 260208 262320 263869 265089 266407
57779B66407J857K871L968M493M320L775K840J400J47nM85P4j764l925n412o385
$$ 266407 268264 271135 275103 279596 283916 287691 290531 291931 292078 292073 292558 292632 290868 286943 281531 275146
57763B75146p132p364p072o851o820o324n249m463m385m257l546k893k951l311
$$ 275146 268014 260650 253578 246727 239907 233583 228334 223871 219486 215229 211683 208790 205839 202528
57749B02528l282k820k039p67P21J526J350J021J139J213P37J63M3J81L59Q99
$$ 202528 199246 196426 194387 193620 194341 195867 197217 198238 199377 200590 201327 201490 201533 201714 202073 202972
57733B02972J754J957R61l67r42q70q55r62q93p52p42o16k43m7k83m85k62J29
$$ 202972 204726 206683 207644 207277 206335 205465 204610 203648 202755 202003 201261 200645 200402 200355 200072 199587 199325 199454
57715A99454M99J168K059K360J804J248J196Q56l34j315q07P57K001K582L142
$$ 199454 199953 201121 203180 205540 207344 208592 209788 210644 210310 208995 208188 208945 210946 213528 216670
57700B16670L906M596N279O026O101M722K323k2k030l940n251n152m034l254l265
$$ 216670 220576 225172 230451 236477 242578 247300 249623 249601 247571 243631 238380 233228 229194 225940 222675
57685B22675l148k129m70J355L335N427P207Q461R626J1323J3822J7136K1308
$$ 222675 219527 217398 216928 218283 221618 227045 234252 242713 252339 263662 277484 294620 315928
57672C15928K6556L3306M2010N2710O4771P6779Q5826Q6783P3942M5414O329l3119
$$ 315928 342484 375790 417800 470510 535281 612060 697886 784669 858611 904025 910354 877235
57660H77235o3382p9930q3565p8252o8708n8503m9200m0870l3415k7101k2184
$$ 877235 813853 733923 650358 572106 503398 444895 395695 354825 321410 294309 272125
57649B72125j8505j5601j3017j0537q296o488m948l404k152j877k505k940k393
$$ 272125 253620 238019 225002 214465 206169 199681 194733 191329 189177 187300 184795 181855 179462
57636A79462j368p91p29o57m36k85j84q1l43j249k278k669k481k340k345k018
$$ 179462 178094 177303 176574 175917 175481 175196 175012 174931 174588 173339 171061 168392 165911 163571 161226 159208
57620A59208j249n41k27o2K62O26O29M7q67j432j098j28O09O69M28L22K56R5M4
$$ 159208 157959 157418 157191 157129 157391 158017 158646 158693 157826 156394 155296 155168 155777 156446 156874 157196 157452 157547 157591
57601A57591J19j39q40j250p96j4K39p3m89r86j685k070j543n07N5l3m8L89Q06
$$ 157591 157710 157571 156731 155481 154685 154671 154910 154837 154348 153362 151677 149607 148064 147557 147612 147579 147531 147920 148726
57582A48726P41L88J79J35q5p12j409j365k24J122J297K41o38m90j68o63j409
$$ 148726 149467 149855 150034 150169 150084 149372 147963 146598 146374 147496 148793 149034 148396 147906 147738 147075 145666
57565A45666j304n70k94o03o72k57P2J39L52O57N36J14K19J036J767J887J801
$$ 145666 144362 143792 143498 142895 142223 141966 142038 142177 142529 143186 143722 143836 144055 145091 146858 148745 150546
57548A50546J887J742Q97l29j136j151o78l28m05n04J44J600K833K842J854Q15
$$ 150546 152433 154175 155072 154743 153607 152456 151778 151450 151045 150541 150685 152285 155118 157960 159814 160629
57532A60629R5n69j153j260r21n56j95M90J271J321K48j356k542k761k086j184
$$ 160629 160724 160155 159002 157742 156821 156265 156070 156560 157831 159152 159400 158044 155502 152741 150655 149471
57516A49471r16j480k086k010j567j448j509j078j69O21J117J549J698J162L48
$$ 149471 148555 147075 144989 142979 141412 139964 138455 137377 137208 137829 138946 140495 142193 143355 143703
57501A43703J06L93L47k66p82q36p60o76l40k3k94p68l23R87J565M88j119j697
$$ 143703 143809 144202 144549 144283 143501 142665 141905 141229 140889 140866 140572 139804 139481 140468 142033 142521 141402 139705
57483A39705j164l98K66R73J493J490J194J032Q73M25o5j84j35m16r66j315j366
$$ 139705 138541 138143 138409 139382 140875 142365 143559 144591 145464 145889 145824 145640 145505 145089 144123 142808 141442
57466A41442j422j513j369j006p99q88r29n95k0L89M48L97O14J182J842K349K624
$$ 141442 140020 138507 137138 136132 135333 134445 133516 132921 132901 133290 133738 134135 134749 135931 137773 140122 142746
57449A42746K458J468k39j690j890r73O4O31R04J021P38R3k82P3Q72J522J750
$$ 142746 145204 146672 146433 144743 142853 141880 141944 142575 143479 144500 145238 145331 145049 145122 145994 147516 149266
57432A49266J568J062M98K87N57J007J283J225Q27K56k2L06Q48Q35J34o21r16
$$ 149266 150834 151896 152394 152681 153238 154245 155528 156753 157580 157836 157814 158120 158968 159803 159937 159316 158400
57415A58400q31o00k76L2J72K80O32R98P95k3p50q58n05l9L81N00qq75j302r94
$$ 158400 157569 156969 156693 156725 156897 157177 157809 158807 159602 159579 158829 157971 157466 157427 157808 158308 158300 157425 156123 155129
57395A55129n53m64l59K67J173J809K116K379K613K699K788L088L360L069K002
$$ 155129 154576 154112 153753 154020 155193 157002 159118 161497 164110 166809 169597 172685 176045 179114 181116
57380A81116M91q22j316p88K68R32P32J8n49o80n85o24r90j488j583r36J10Q82
$$ 181116 181607 180785 179469 178681 178949 179881 180613 180631 180082 179402 178817 178193 177203 175715 174132 173196 173306 174188
57362A74188J121J048Q25M16j8j49QJ33J79M34R72J518J907K188K245J890J342
$$ 174188 175309 176357 177182 177598 177580 177431 177439 177572 177751 178185 179157 180675 182582 184770 187015 188905 190247
57345A90247J021Q82N48J27J52O39R05N76M8j85r3K36P75J252J260Q82O41O75
$$ 190247 191268 192150 192698 192825 192977 193616 194521 195097 195145 194960 194867 195103 195878 197130 198390 199272 199913 200588
57327B00588O32M75N87R80J180J069R92Q85K08r46j670j536j130r01m49N11J434
$$ 200588 201220 201695 202282 203262 204442 205511 206503 207388 207596 206650 204980 203444 202314 201413 200964 201475 202909
57310B02909J814J937K066J785Q86J42M07J429K284K451J987J205P01J049J916
$$ 202909 204723 206660 208726 210511 211397 211539 211946 213375 215659 218110 220097 221302 222003 223052 224968
57295B24968K224J698J368J965K750K803K526K795L389L487L161L189L705M146
$$ 224968 227192 228890 230258 232223 234973 237776 240302 243097 246486 249973 253134 256323 260028 264174
57281B64174M344M663N155N455N412N121M525L632K913K813L089L246L259L248
$$ 264174 268518 273181 278336 283791 289203 294324 298849 302481 305394 308207 311296 314542 317801 321049
57267C21049K889J917Q56L95M26M19M29Q31J401J563J398J454J722J715J501J699
$$ 321049 323938 325855 326711 327106 327532 327951 328380 329211 330612 332175 333573 335027 336749 338464 339965 341664
57251C41664K419K990K942K561K308K341K700L503M673N893O813P129O657N661
$$ 341664 344083 347073 350015 352576 354884 357225 359925 363428 368101 373994 380807 387936 394593 400254
57237D00254M881M818N222N582N825O128O363O291N986N728N704O131P131Q212
$$ 400254 405135 409953 415175 420757 426582 432710 439073 445364 451350 457078 462782 468913 476044 484256
57223D84256Q515Q028P811Q455R160R130Q937R465J0325J0654J0738J1483J2657
$$ 484256 492771 500799 508610 517065 526225 535355 544292 553757 564082 574736 585474 596957 609614
57210F09614J3174J2933J2897J3383J3697J3502J3257J3153J2912J2851J3807
$$ 609614 622788 635721 648618 662001 675698 689200 702457 715610 728522 741373 755180
57199G55180J5605J6821J6585J5564J4738J4246J3949J4100J4716J5108J4782
$$ 755180 770785 787606 804191 819755 834493 848739 862688 876788 891504 906612 921394
57188I21394J4273J4380J5054J5558J5365J4505J3360J2500J2320J2558J2488
$$ 921394 935667 950047 965101 980659 996024 1010529 1023889 1036389 1048709 1061267 1073755
57177A073755J1822J1047J0722J0878J1287J1867J2536J3049J3271J3364J3512
$$ 1073755 1085577 1096624 1107346 1118224 1129511 1141378 1153914 1166963 1180234 1193598 1207110
57166A207110J3675J3677J3404J2984J2941J3790J5167J5756J4777J3162J2515
$$ 1207110 1220785 1234462 1247866 1260850 1273791 1287581 1302748 1318504 1333281 1346443 1358958
57155A358958J3051J3520J3080J2270J2058J2773J4200J5912J7214J7538J7182
$$ 1358958 1372009 1385529 1398609 1410879 1422937 1435710 1449910 1465822 1483036 1500574 1517756
57144A517756J7077J7581J8123J8212J8110J8225J8587J9151J9956K0668K0742
$$ 1517756 1534833 1552414 1570537 1588749 1606859 1625084 1643671 1662822 1682778 1703446 1724188
57133A724188K0394K0759K2512K4973K7059K8706L0728L3662L7255M0907M4172
$$ 1724188 1744582 1765341 1787853 1812826 1839885 1868591 1899319 1932981 1970236 2011143 2055315
57122B055315M6936M9390N1850N4533N7600O1235O5447O9950P4791Q0935Q9622
$$ 2055315 2102251 2151641 2203491 2258024 2315624 2376859 2442306 2512256 2587047 2667982 2757604
57111B757604J01028J14127J27980J42701J59065J77782J99276K23789K51586
$$ 2757604 2858632 2972759 3100739 3243440 3402505 3580287 3779563 4003352 4254938
57102D254938K83508L21390L67348M22623M87744N63918O53631P59874Q85599
$$ 4254938 4538446 4859836 5227184 5649807 6137551 6701469 7355100 8114974 9000573
57093I000573J034076J208498J410012J635778J878823K129037K373965K599266
$$ 9000573 10034649 11243147 12653159 14288937 16167760 18296797 20670762 23270028
57085B3270028K789202K926953K994887K976311K859496K641711K329447J933308
$$ 23270028 26059230 28986183 31981070 34957381 37816877 40458588 42788035 44721343
57077D4721343J461357R17564L08675l45558j008649j634530k179872k612912
$$ 44721343 46182700 47100264 47408939 47063381 46054732 44420202 42240330 39627418
57069C9627418k916344l087499l137003l084514k952630k763085k536371k291595
$$ 39627418 36711074 33623575 30486572 27402058 24449428 21686343 19149972 16858377
57061A6858377k044532j806045j582764j378597j195363j033232q91617p69435
$$ 16858377 14813845 13007800 11425036 10046439 8851076 7817844 6926227 6156792
57053F156792o64485n73737m95000m27617l70947l22921k80904k43461k10741
$$ 6156792 5492307 4918570 4423570 3995953 3625006 3302085 3021181 2777720 2566979
57044B566979j83457j61939j45615j32861j21826j11769j03220r6545r0977q5387
$$ 2566979 2383522 2221583 2075968 1943107 1821281 1709512 1606292 1509747 1418770 1333383
57034A333383p9391p3291o7468o2310n8099n4559n1007m7212m3587m0318l7075
$$ 1333383 1253992 1180701 1113233 1050923 992824 938265 887258 840046 796459 756141 719066
57023G19066l3876l1326k9560k7850k5781k3952k2765k1476j9318j6869j5347
$$ 719066 685190 653864 624304 596454 570673 546721 523956 502480 483162 466293 450946
57012D50946j4964j4882j4440j3616j2655j1827j1403j1244j0834j0065r532r527
$$ 450946 435982 421100 406660 393044 380389 368562 357159 345915 335081 325016 315484 305957
57000C05957r431q708p820p414p177o423n309m555m286m076l754l317k315k49
$$ 305957 296526 287818 279998 272584 265407 258984 253675 249120 244834 240758 237004 233687 231372 231123
56986B31123K512N106P312R464J1331J1939J0544P147K140l756r236j2965j4605
$$ 231123 233635 238741 246053 255517 266848 278787 289331 296478 298618 294862 285626 272661 258056
56973B58056j4781j3994j2294j0058q193p043n771l336Q7L189M927N595O480Q629
$$ 258056 243275 229281 216987 206929 198736 191693 185922 182586 182673 185862 190789 196384 202864 211493
56959B11493J2030J5795J8965K0954K1372J9745J5581Q711k32r435j6365j9337
$$ 211493 223523 239318 258283 279237 300609 320354 335935 344646 344414 334979 318614 299277
56947B99277j8912j7257j5956j4850j3057j0440p602n011k631k95K061M487P181
$$ 299277 280365 263108 247152 232302 219245 208805 201203 196192 193561 193266 195327 199814 206995
56934B06995J0464J4486J8879K2875K6015K8124K8112K3671J3568J35j1993j9962
$$ 206995 217459 231945 250824 273699 299714 327838 355950 379621 393189 393324 381331 361369
56922C61369k4396k6939k7761k6360k3353k0059j6973j3884j0958q734p266o184
$$ 361369 336973 310034 282273 255913 232560 212501 195528 181644 170686 161952 154686 148502
56910A48502n360m931m829m820m703m187k999j505n50l11J8J033K367L567M753
$$ 148502 143142 138211 133382 128562 123859 119672 116673 115168 114618 114307 114325 115358 117725 121292 126045
56895A26045N932O577O730P509R706J2704J5651J8715K2138K5056K6509K6787
$$ 126045 131977 138554 145284 152793 162499 175203 190854 209569 231707 256763 283272 310059
56883C10059K6316K3972J8142R289M9p191j1715j3853j4214j3614j2625j1068
$$ 310059 336375 360347 378489 387778 387827 380636 368921 355068 340854 327240 314615 303547
56871C03547q569n449k286J007M845R050J3222J7600K2673K8328L4308M0960M8291
$$ 303547 294978 289529 287243 288250 293095 302145 315367 332967 355640 383968 418276 459236 507527
56858E07527N4448N6226N1029L7998J8343m133k3769l6347m1783m2598m0375l5228
$$ 507527 561975 618201 669230 707228 725571 721438 697669 661322 619539 576941 536566 501338
56846E01338k7993k0548j3776p073j46O369J2442J9088K6806L5102M4006N4498
$$ 501338 473345 452797 439021 431948 431802 438171 450613 469701 496507 531609 575615 630113
56834F30113O6717P8855Q8125R1357Q4607O4622L2523m951l9237o4661p9475q4211
$$ 630113 696830 775685 863810 955167 1039774 1104396 1136919 1131968 1092731 1028070 948595 864384
56822H64384q0790p2377o2126n1682m1361l1445k2513j4694p395J11Q130J6520
$$ 864384 783594 711217 649091 597409 556048 524603 502090 487396 480001 480112 488242 504762
56810E04762K5043L3807M3208N2987O1343O5314O2028M9595K7885k25k8698n1074
$$ 504762 529805 563612 606820 659807 721150 786464 848492 898087 925972 925747 897049 845975
56798H45975o4192o8895o7526o1984n4061m5738l8182l1309k4845j8983j3633
$$ 845975 781783 712888 645362 583378 529317 483579 445397 414088 389243 370260 356627
56787C56627q165k396L137Q371J4111K0656K6986L1835L4451L3722K7854J6256
$$ 356627 348462 346066 349203 357574 371685 392341 419327 451162 485613 519335 547189 563445
56775E63445J037j4285k7126l6280m1129m1726l9299l5524l1321k6908k2665j9167
$$ 563445 564482 550197 523071 486791 445662 403936 364637 329113 297792 270884 248219 229052
56763B29052j6546j4412j2360j0218q080o360n453n127m779m416m651n457n732
$$ 229052 212506 198094 185734 175516 167436 161076 155623 150496 145717 141301 136650 131193 125461
56750A25461m723l086j883j287r06p63j042j417j422j184j060q81l17K95K63m20
$$ 125461 120738 117652 115769 114482 113576 112813 111771 110354 108932 107748 106688 105807 105490 105785 106048 105628
56734A05628j007r28l68O1r8p97j482j524q12L10J565K763L370K820J433L36K19
$$ 105628 104621 103693 103325 103386 103288 102491 101009 99485 98673 98983 100548 103311 106681 109501 110934 111270 111489
56717A11489P20J253J624J583P30o01j260p09J96M84L91O25J031R20K38m98j046
$$ 111489 112209 113462 115086 116669 117399 116798 115538 114829 115025 115509 115900 116525 117556 118476 118714 118216 117170
56700A17170j416j367o90J60M78J66l25o91q67p18k34K22L41L05L77L86J51K0
$$ 117170 115754 114387 113697 113857 114335 114501 114176 113485 112618 111900 111666 111888 112229 112534 112911 113297 113448 113468
56682A13468M01J029J264R36M35J22J04L45O77Q42P95P01M73j94j121j597j369
$$ 113468 113869 114898 116162 117098 117533 117655 117759 118104 118781 119623 120418 121119 121592 121398 120277 118680 117311
56665A17311j019q97m18Q67K198K404J400J20o97q87l81Q20K225L101L192K810
$$ 117311 116292 115395 114977 115844 118042 120446 121846 121966 121269 120382 120001 120821 123046 126147 129339 132149
56649A32149K313J848J463J111P23M95P57J349J565J121O06O30J023J314J459
$$ 132149 134462 136310 137773 138884 139607 140102 140859 142208 143773 144894 145500 146130 147153 148467 149926
56634A49926J574J474J073P76Q65R83P75N67P55R81O20k60j087j581j801j742
$$ 149926 151500 152974 154047 154823 155688 156671 157446 158013 158768 159749 160369 160109 159022 157441 155640 153898
56618A53898j504j499j882k135j779j061m33J43P25Q04K4j051j647j823j971j803
$$ 153898 152394 150895 149013 146878 145099 144038 143605 143748 144473 145277 145301 144250 142603 140780 138809 137006
56602A37006r03J16J87o17j203j154j251k075l011l040j904k34J077J486J131
$$ 137006 136103 136219 136406 135789 134586 133432 132181 130106 127095 124055 122151 121917 122994 124480 125611
56587A25611O67N15M92M22O47J363J883J357N8q31o61J43R28J480J785J769J441
$$ 125611 126278 126793 127285 127707 128354 129717 131600 132957 133015 132184 131523 131666 132594 134074 135859 137628 139069
56570A39069R40M33J92O12J704K832L420L695M243N164O231P496Q993J0006R465
$$ 139069 140009 140442 140634 141246 142950 145782 149202 152897 157140 162304 168535 176031 185024 195030 204495
56555B04495P192M139J463j49m74J92Q96P11k55j022r55l93jk5l26p52j269j889
$$ 204495 211687 215826 217289 217140 216666 216858 217754 218465 218210 217188 216233 215840 215839 215814 215488 214736 213467 211578
56537B11578k607l241l495l328l139l319l780m078l865l077j955j014o54o33l12
$$ 211578 208971 205730 202235 198907 195768 192449 188669 184591 180726 177649 175694 174680 174026 173393 173081
56522A73081L95P35J37r51j561j289n47p3k40p02p12k07j99j337k498k046l48
$$ 173081 173476 174211 174348 173397 171836 170547 170000 169927 169687 168985 168273 168066 167867 166530 164032 161986 161638
56505A61638N75N2l71L32R83L80n89n65j3j67q15r35p13r73j347q48J15K48m07
$$ 161638 162213 162265 161894 162226 163209 163589 163000 162435 162422 162255 161440 160505 159792 158819 157472 156624 156739 156987 156580
56486A56580n67K2K62l24r07r14p20m94J99J290J949J799J316P49j81j272j674
$$ 156580 156013 156035 156297 155973 155066 154152 153432 152938 153137 154427 156376 158175 159491 160240 160059 158787 157113
56469A57113j035Q1J154K130K747K540J724J122J003Q62N59O17J188J671J659
$$ 157113 156078 156159 157313 159443 162190 164730 166454 167576 168579 169441 170000 170617 171805 173476 175135
56454A75135J411J178Q88O53P45R06N19m43j330j783j987k016j765j445j326j044
$$ 175135 176546 177724 178612 179265 180010 180916 181435 180992 179662 177879 175892 173876 172111 170666 169340 168296
56438A68296j21R91J383J096R09R51O87K18K37O87Q24P42J280K258K350J233L09
$$ 168296 168175 169166 170549 171645 172554 173505 174192 174410 174647 175334 176158 176900 178180 180438 182788 184021 184330
56421A84330O14J326J222M25j80l10j80K12Q66J423J656J815J990J783J015J62
$$ 184330 184944 186270 187492 187917 187737 187427 187247 187459 188325 189748 191404 193219 195209 196992 198007 198169
56405A98169l32o05q67r75q26o21m58k27k6j31m30n23m22m25l74J45Q94J204J125
$$ 198169 197837 197232 196365 195390 194564 193943 193485 193258 193232 193101 192671 192148 191726 191301 190927 191072 191966 193170 194295
56386A94295J347J921K092J517O35k12r65j184m44N25N05k30n5J475K765K503
$$ 194295 195642 197563 199655 201172 201807 201595 200630 199446 199002 199527 200032 199802 199747 201222 203987 206490
56370B06490J425Q74R33R09O72M92M06M96J083J897J945R09j19o7P05J133Q83
$$ 206490 207915 208789 209722 210631 211303 211795 212201 212697 213780 215677 217622 218531 218412 218345 219050 220183 221066
56353B21066L81j2j00K73Q65J062P23M68P22J131J337J602K155K600K487J981
$$ 221066 221447 221435 221335 221608 222473 223535 224258 224726 225448 226579 227916 229518 231673 234273 236760 238741
56337B38741J507J249J271J563J778J556J238J486K127K316J891J610J817K030
$$ 238741 240248 241497 242768 244331 246109 247665 248903 250389 252516 254832 256723 258333 260150 262180
56323B62180K085K456L032K816J466M1n09m93n08l19L67R15N31n16j178q35K83
$$ 262180 264265 266721 269753 272569 274035 274076 273567 273074 272566 272247 272614 273529 274060 273544 272366 271531 271814
56306B71814J442J954J785J760K620L993M947N272N254M532K645N33j66N04P81
$$ 271814 273256 275210 276995 278755 281375 285368 290315 295587 300841 305373 308018 308551 308385 308889 309670
56291C09670j46j074q86k7Q12J880L337M401M488M046L602L071K612K898L899
$$ 309670 309524 308450 307564 307537 308349 310229 313566 317967 322455 326501 330103 333174 335786 338684 342583
56276C42583M741N211O042P154P413O775O876Q460J0026J0216R830J0136J0747
$$ 342583 347324 352535 358577 365731 373144 379919 386795 395255 405281 415497 425327 435463 446210
56263D46210J0761J0701J1666J3557J5577J7650K0093K2702K5247K8094L1426
$$ 446210 456971 467672 479338 492895 508472 526122 546215 568917 594164 622258 653684
56252F53684L4804L8223M2450M7552N2435N6641O1106O6178P0525P3131P4757
$$ 653684 688488 726711 769161 816713 869148 925789 986895 1053073 1123598 1196729 1271486
56241A271486P6119P6290P4342P0857O6220N9098M8505L5936K3537J1414j332
$$ 1271486 1347605 1423895 1498237 1569094 1635314 1694412 1742917 1778853 1802390 1813804 1812472
56230A812472j4118k5520l5399m4366n1939n7189o0520o3039o4697o4768o3432
$$ 1812472 1798354 1772834 1737435 1693069 1641130 1583941 1523421 1460382 1395685 1330917 1267485
56219A267485o1480n9143n6513n4184n2070m8820m3961l9334l6618l4788l1994
$$ 1267485 1206005 1146862 1090349 1036165 984095 935275 891314 851980 815362 780574 748580
56208G48580k8641k6316k4771k2539j9766j7810j6537j4549j1856r941r161q351
$$ 748580 719939 693623 668852 646313 626547 608737 592200 577651 565795 555854 546693 538342
56196E38342o998n785m872l620k170j507j698j690j012k84O0K74M48L72J57rl92
$$ 538342 531344 525559 520687 517067 514897 513390 511692 510002 508990 508706 508766 509040 509488 509860 510017 510008 509616
56179E09616r89r38K40J497J730J547K135L234L862M220N094O038O017N339N191
$$ 509616 508627 507689 507929 509426 511156 512703 514838 518072 521934 526154 531248 537286 543303 548642 553833
56164E53833N782O562P678R436J0902J0975J0318J0474J1578J2705J3822J5493
$$ 553833 559615 566177 573855 583291 594193 605168 615486 625960 637538 650243 664065 679558
56152F79558J7290J8488J9845K2670K6594L0374L4422M0378M8552N7859O8032
$$ 679558 696848 715336 735181 757851 784445 814819 849241 889619 938171 996030 1064062
56141A064062P9717R2511J04937J16113J25333J30107J26971J14906R6664P6884
$$ 1064062 1143779 1236290 1341227 1457340 1582673 1712780 1839751 1954657 2051321 2128205
56131B128205O0137M9998M7672N0878N5112N5920M9728L4547J2257j0858k8239
$$ 2128205 2188342 2238340 2286012 2336890 2392002 2447922 2497650 2532197 2544454 2533596 2505357
56120B505357l7657m0791m0254l9443m3345n5583p4506r4687j11747j23592j28279
$$ 2505357 2467700 2426909 2386655 2347212 2303867 2248284 2173778 2079091 1967344 1843752 1715473
56109A715473j24522j14199j01241q7783p3853o0324m9035m0010l1677k3999j8551
$$ 1715473 1590951 1476752 1375511 1287728 1213875 1153551 1104516 1064506 1032829 1008830 990279
56098I90279j5335j2407q986o167m311k475p22k23p01l47J289K811L619M522N580
$$ 990279 974944 962537 953551 947384 943073 940598 939876 939653 938952 938605 939894 942705 946324 950846 956426
56083I56426N911N856O767Q423R198Q963R245J0394J1179J1334J1816J2431J1897
$$ 956426 962337 968193 974960 983383 992581 1001544 1010789 1021183 1032362 1043696 1055512 1067943 1079840
56070A079840J0473R895J0524J1182J1752J3159J4847J5209J4635J5231J7385
$$ 1079840 1090313 1100208 1110732 1121914 1133666 1146825 1161672 1176881 1191516 1206747 1224132
56059A224132J9381K0478K1505K2486K2551K2177K2605K3219K2475K0980K0529
$$ 1224132 1243513 1263991 1285496 1307982 1330533 1352710 1375315 1398534 1421009 1441989 1462518
56048A462518K0641J9554J8026J8317J9876K0100J9089J9367K1065K1789K1378
$$ 1462518 1483159 1502713 1520739 1539056 1558932 1579032 1598121 1617488 1638553 1660342 1681720
56037A681720K2283K4943K7176K8546L0833L3854L5374L5606L7220M0350M2269
$$ 1681720 1704003 1728946 1756122 1784668 1815501 1849355 1884729 1920335 1957555 1997905 2040174
56026B040174M2527M3595M5928M7251M7396M8827N1720N3598N4464N7010O1084
$$ 2040174 2082701 2126296 2172224 2219475 2266871 2315698 2367418 2421016 2475480 2532490 2593574
56015B593574O3525O4260O6812P1816P5899P8027Q0932Q5122Q7773Q8940R2371
$$ 2593574 2657099 2721359 2788171 2859987 2935886 3013913 3094845 3179967 3267740 3356680 3449051
56004C449051R8624J03848J07054J11832J19122J25281J29430J35583J45139J54303
$$ 3449051 3547675 3651523 3758577 3870409 3989531 4114812 4244242 4379825 4524964 4679267
55994D679267J61434J69874J81064J92130K02704K16508K33776K49986K64632
$$ 4679267 4840701 5010575 5191639 5383769 5586473 5802981 6036757 6286743 6551375
55985F551375K82934L06215L29433L51185L76940M09075M43294M78465N20016
$$ 6551375 6834309 7140524 7469957 7821142 8198082 8607157 9050451 9528916 10048932
55976A0048932N69723O22578O77923P42897Q20584R06242R99922J110701J243535
$$ 10048932 10618655 11241233 11919156 12662053 13482637 14388879 15388801 16499502 17743037
55967A7743037J395031J567729J774931K025519K318661K659657L065182L546449
$$ 17743037 19138068 20705797 22480728 24506247 26824908 29484565 32549747 36096196
55959C6096196M104909M752546N518970O433952P527660Q857561J0509385J2561447
$$ 36096196 40201105 44953651 50472621 56906573 64434233 73291794 83801179 96362626
55951I6362626J5077241J8140525K1846829K6203954L0991381L5588031L8752133
$$ 96362626 111439867 129580392 151427221 177631175 208622556 244210587 282962720
55944B82962720L8592486L3189081K1862263O174464j0424756k4277708l3220383
$$ 282962720 321555206 354744287 376606550 382781014 372356258 348078550 314858167
55937C14858167l7076876l6965310l4341488l0458152k6219162k2172880j8568103
$$ 314858167 277781291 240815981 206474493 176016341 149797179 127624299 109056196
55930A09056196j5474678j2889091j0765329r023136p584082o397816n425350
$$ 109056196 93581518 80692427 69927098 60903962 53319880 46922064 41496714
55923D1496714m620989l946745l385114k922305k534257k200786j917817j683451
$$ 41496714 36875725 32928980 29543866 26621561 24087304 21886518 19968701 18285250
55915A8285250j485173j311137j161256j036707r29575q32185p46458o75200o13406
$$ 18285250 16800077 15488940 14327684 13290977 12361402 11529217 10782759 10107559 9494153
55906I494153n56107n06066m66128m31921l98970l69435l45458l23282k99964
$$ 9494153 8938046 8431980 7965852 7533931 7134961 6765526 6420068 6096786 5796822
55897E796822k78926k62945k48349k31668k15611k03118j91601j78285j65508
$$ 5796822 5517896 5254951 5006602 4774934 4559323 4356205 4164604 3986319 3820811
55888C820811j55736j46800j36641j27555j21350j15428j07751j00623r5633r0158
$$ 3820811 3665075 3518275 3381634 3254079 3132729 3017301 2909550 2808927 2713294 2623136
55878B623136q2743p6723p4455p3062o9917o7381o7845o8862o7478o5100o3747
$$ 2623136 2540393 2463670 2389215 2316153 2246236 2178855 2111010 2042148 1974670 1909570 1845823
55867A845823o1731n7206n2141m8754m5670m1410l8011l7317l7231l5393l3213
$$ 1845823 1784092 1726886 1674745 1625991 1580321 1538911 1500900 1463583 1426352 1390959 1357746
55856A357746l2645l2344l0575k8726k8304k7719k5593k4097k5253k6961k6535
$$ 1357746 1325101 1292757 1262182 1233456 1205152 1177433 1151840 1127743 1102490 1075529 1048994
55845A048994k5276k5698k6808k6069k3926k2515k1776k0315j8506j7485j6578
$$ 1048994 1023718 998020 971212 945143 921217 898702 876926 856611 838105 820620 804042
55834H04042j4729j3065j3167j4204j4267j3168j1732r933p818o611o851p237
$$ 804042 789313 776248 763081 748877 734610 721442 709710 699777 691959 685348 678497 671260
55822F71260p084p787r942j1556j1304j0992j2237j3269j1915r505q626q900q301
$$ 671260 664176 656389 646447 634891 623587 612595 600358 587089 575174 565669 557043 548143 539842
55809E39842p063o963p788p619o056m470l531k742j891j070J74K060L632M043
$$ 539842 532779 525816 518028 510409 504353 499883 496352 493610 491719 490649 490823 492883 496515 500558
55795E00558L847L801L552K795K354K743L107K965L367M765N327L047j774p492
$$ 500558 504405 508206 511758 514553 516907 519650 522757 525722 529089 533854 539181 542228 540454 532962
55781E32962j3000j7312j9052j8068j6036j4101j1516p868m449k016N57L492M304
$$ 532962 519962 502650 483598 465530 449494 435393 423877 416009 411560 409544 410101 413593 417897
55768D17897J092m258q464j0653j1611j1079q539n224k823j186N46J749J449L88
$$ 417897 418989 414731 406267 395614 384003 372924 364385 359161 356338 355152 355698 357447 358896 359284
55754C59284k20r51k974n646p394q057q435q492p818o930o421n866m982m548m644
$$ 359284 359064 358113 355139 349493 342099 334042 325607 317115 309297 302367 295946 290080 285098 280550 275906
55739B75906l804j670n54k167m638n208m189l647l758l310k513k387k409j600
$$ 275906 272102 270432 269878 267711 263073 257865 253676 250029 246271 242961 240448 238061 235652 234052
55725B34052r61k062m013m669m112m093m694m376l002j956j545p69N03J520K451
$$ 234052 233091 231029 227016 222347 218235 214142 209448 205072 202070 200114 198569 197800 198303 199823 202274
55710B02274L728M239K671K68n32J57J51q00o19J194K311J004j675l944n311n854
$$ 202274 206002 210241 212912 213180 212648 212805 212956 212156 211537 212731 215042 216046 214371 210427 205116 199262
55694A99262n500m789m626m732l957k383j378j354j320q46o46q13m91M18R71J093
$$ 199262 193762 188973 184347 179615 175658 173275 171897 170543 169223 168377 167731 166918 166427 166845 167816 168909
55678A68909J846L373M319L895K791J644K53j106j438o79m0j18k06L4j03p40q00
$$ 168909 170755 174128 178447 182342 185133 186777 187030 185924 184486 183807 183767 183649 183443 183477 183374 182634 181834
55661A81834Q2O74J06o69m17N08R44O31J94N9K59P24J248J520J521J436J160N44
$$ 181834 181916 182590 182696 182027 181610 182118 183062 183693 183887 183946 184205 184929 186177 187697 189218 190654 191814 192358
55643A92358J5N6K04m28j684k589k979l673m799n348m741l722l187l118l059k855
$$ 192358 192373 192429 192633 192205 190521 187932 184953 181280 176481 171133 166392 162670 159483 156365 153306 150451
55627A50451k500j982j443r70k85O78J191O70k23n10n41j313k539k975k588k611
$$ 150451 147951 145969 144526 143556 143271 143949 145140 145810 145587 145077 144536 143223 140684 137709 135121 132510
55611A32510l329l562k777k009k082k396k214j791j495j113p10r85j944k371j489
$$ 132510 129181 125619 122842 120833 118751 116355 114141 112350 110855 109742 109032 108047 106103 103732 102243
55596A02243k29N0o40j244j096l79M10Q77R56J055J537K086K142J926K243L215
$$ 102243 102014 102064 101424 100180 99084 98705 99115 99992 100948 102003 103540 105626 107768 109694 111937 115152
55580A15152M129M604M947N257N272N270O045P620Q951R279Q749P473N039J494
$$ 115152 119281 123885 128832 134089 139361 144631 150676 158296 167247 176526 185275 192748 197787 199281
55566A99281k111m692o030o486o498o641p299q116q467q406q332p885o402m416
$$ 199281 197170 192478 186448 179962 173464 166823 159524 151408 142941 134535 126203 118318 111916 107500
55552A07500l301l272l145k382j853k043k083j306m42l49o45n71k08j3kr8m99
$$ 107500 104199 100927 97782 95400 93547 91504 89421 88115 87673 87324 86679 86108 85900 85887 85885 85787 85288
55535H5288j003q32J81J187J660K233L326M039L379J790M42l64j050j603j572
$$ 85288 84285 83453 83634 84821 86481 88714 92040 96079 99458 101248 101690 101326 100276 98673 97101
55520I7101j024n69n43p41q77r00r56j245j687j845j527j339j839k418j973p31
$$ 97101 96077 95508 94965 94224 93347 92447 91491 90246 88559 86714 85187 83848 82009 79591 77618 76887
55504G6887j16o10j049n87N7ol69k46J27R2k18k16J34M66O14M41l12j391j876
$$ 76887 76771 76161 75112 74525 74582 74576 74207 73961 74088 74180 73962 73746 73880 74346 74960 75401 75089 73698 71822
55485G1822j342n10j15N5L74M83P4k63P0N98N38M1k62m23q49j283j133n58k59
$$ 71822 70480 69970 69855 69910 70284 70767 70841 70578 70648 71246 71784 71825 71563 71140 70291 69008 67875 67317 67058
55466F7058m19o55p73q27o16K6O98Q75O65M89K70l27r90r59q3Q68J078M35n29
$$ 67058 66639 65984 65211 64384 63768 63794 64492 65367 66032 66521 66791 66464 65474 64515 64432 65300 66378 66813 66284
55447F6284j086q19OO51O61K71k4L0M41J014J297R75M48M35Q93R99M18k37m28
$$ 66284 65198 64379 64385 65036 65697 65968 65944 65974 66415 67429 68726 69701 70149 70584 71477 72476 72894 72657 72229
55428G2229m02m73n18n40q64j262r42J10P76N11K85R05J526J015j12m98m8J99
$$ 72229 71827 71354 70836 70296 69432 68170 67228 67338 68114 68625 68910 69815 71341 72356 72244 71746 71698 71897
55410G1897j31m28m02m99q94j184j130r86r45r24q48o63k21L42M71q2p21p65l23
$$ 71897 71766 71338 70936 70437 69543 68359 67229 66243 65298 64374 63526 62863 62642 62984 63455 63373 62652 61887 61564
55391F1564J18M91R03J148J180J510K350K922K456J328L64m87j664k743k790j711
$$ 61564 61682 62173 63076 64224 65404 66914 69264 72186 74642 75970 76334 75847 74183 71440 68650 66939
55375F6939k49J032J830J614K46j217j521q74m91p36r28p59o56p14n31j94k07
$$ 66939 66690 67722 69552 71166 71412 70195 68674 67800 67309 66573 65645 64886 64230 63516 62985 62791 62584
55358F2584m16j30N61Q21N42M94P96N62m52j124o14L19M33l43j109j209p23j16
$$ 62584 62168 62038 62599 63420 63962 64456 65252 65814 65362 64238 63624 63943 64376 64033 62924 61715 60992 60876
55340F0876P0l28p15l28O80J377J370J152J013N78k09o35l43J8j76n53n15j98
$$ 60876 60946 60618 59903 59575 60255 61632 63002 64154 65167 65745 65536 64901 64558 64576 64400 63847 63332 63134
55322F3134L1L20Q27J004L09q03j418j374j189r84m06M55R07N85n4l92l72l43
$$ 63134 63165 63485 64312 65316 65625 64822 63404 62030 60841 59857 59451 59906 60813 61398 61344 60952 60580 60237
55304F0237m92o32m44J86J010J584J641J255O86K04O9M14J020J384J229Q03N80
$$ 60237 59745 59113 58669 58855 59865 61449 63090 64345 65031 65235 65304 65718 66738 68122 69351 70154 70734
55287G0734P68J152J362J190P59L61O0m01j154j800j770j045k15J14k05q53j178
$$ 70734 71502 72654 74016 75206 75965 76326 76386 75985 74831 73031 71261 70216 70001 70115 69910 69057 67879
55270F7879n82P89J926J996J354R39Q60M00n83j254j084o47o03o54j81N93Q69
$$ 67879 67297 68086 70012 72008 73362 74301 75161 75561 74978 73724 72640 71993 71390 70736 70555 71148 72017
55253G2017M16k70p85j178j505j577j234n65J34M29J0q57j291p24K96O80J56m80
$$ 72017 72433 72163 71378 70200 68695 67118 65884 65319 65453 65882 65892 65035 63744 63020 63316 63996 64152 63672
55235F3672m87m3K77L62M95O69N01j72r49j267r26j46P02J268J336R98O30M57
$$ 63672 63185 63142 63419 63781 64276 64945 65446 65274 64325 63058 62132 61986 62688 63956 65292 66290 66920 67377
55217F7377K51k95r64j165p34j97pQ1N36J214J443R16P5m56m93k69J8M17J026
$$ 67377 67628 67333 66369 65204 64470 64273 64266 64347 64883 66097 67540 68456 68531 68075 67582 67313 67331 67748 68774
55198F8774J641J792J243M04n0L0J43r0m84p76j061j344j145j45J033J396Q77
$$ 68774 70415 72207 73450 73854 73804 73834 73977 73887 73403 72627 71566 70222 69077 68932 69965 71361 72238
55181G2238L72M44O45L36l43p08m10K39O69N30j37r58j441j249l96O44J177R02
$$ 72238 72610 73054 73699 74035 73692 72984 72574 72813 73482 74012 73875 72917 71476 70227 69831 70475 71652 72554
55163G2554L48L79J040J347N60p43j364r48k21J27R4m1j73k49j63Pp1n95j325
$$ 72554 72902 73281 74321 75668 76228 75485 74121 73173 72952 73079 73173 73132 72959 72710 72547 72554 72483 71888 70563
55144G0563j728j346k17R40J197M26m62o68m96o21q58m85L25N31k04r65r24l74
$$ 70563 68835 67489 67272 68212 69409 69835 69373 68705 68209 67588 66730 66245 66570 67101 66897 65932 65008 64634
55126F4634J09O78J665K600K633J717O35k1k75k71L4N19P29L77k39n10j76M09
$$ 64634 64743 65421 67086 69686 72319 74036 74671 74650 74375 74104 74138 74657 75386 75763 75524 75014 74838 75247
55108G5247O84M31n9m13n47o12n95k77M27J240J739J730J385J056Q93O75J24n93
$$ 75247 75931 76362 76303 75890 75343 74731 74136 73859 74286 75526 77265 78995 80380 81436 82329 83004 83128 82535
55090H2535r52q05n83n53k86N89J471J306J6j302j718j405j129j206j366j244
$$ 82535 81583 80778 80195 79642 79356 79945 81416 82722 82738 81436 79718 78313 77184 75978 74612 73368
55074G3368p22M3P39J100J080P62K02l94n22J54J220J798J557J036Q31Q36M85
$$ 73368 72646 72689 73428 74528 75608 76370 76572 76178 75656 75810 77030 78828 80385 81421 82252 83088 83573
55057H3573l79j161j074o3R23Q79n7p57o02k18l55p18o03j39J3j16P3N56O46K00
$$ 83573 83194 82033 80959 80896 81819 82698 82641 81884 81282 81064 80709 79991 79388 79249 79262 79146 79219 79775 80421 80621
55037H0621j65k03l90q96j087n32K50N78M53K73K50M95J036J422Q90n88j950k157
$$ 80621 80456 80253 79863 78967 77880 77348 77598 78176 78629 78902 79152 79647 80683 82105 82995 82407 80457 78300
55019G8300j247m4P27P38R5n66n54L8L79R7k56j54J83L46L14R6m62j061r01J36
$$ 78300 77053 77009 77736 78474 78569 78003 77449 77487 77866 77963 77707 77553 77736 78082 78396 78492 78030 76969 76068 76204
54999G6204J003Q63K77K50P59J052R56R36J220J590J783J543N90p85j600j309
$$ 76204 77207 78070 78347 78597 79356 80408 81364 82300 83520 85110 86893 88436 89026 88241 86641 85332
54983H5332o22m46m94J37J434K474K721K383J646N77l50n53k20pK7L71R64J106
$$ 85332 84710 84264 83770 83907 85341 87815 90536 92919 94565 95142 94792 94239 94019 94012 94039 94410 95374 96480
54965I6480O09J35J68M23N63P23R88J017N73o4m92o31n39k89j23l23p36q38m61
$$ 96480 97089 97224 97392 97815 98378 99101 100089 101106 101679 101615 101123 100492 99953 99664 99541 99218 98482 97644 97183
54946I7183nJ21r3m70q16q66n69l52o00r49p22n5K40oM1Q65J734J707Q87J17j00
$$ 97183 97178 97299 97206 96736 95920 95054 94485 94133 93533 92584 91862 91807 92047 92041 92082 92947 94681 96388 97275 97392 97292
54925I7292J44N60R16J098J377K199L513M628N159N613O608P942Q935R275Q952
$$ 97292 97436 97996 98912 100010 101387 103586 107099 111727 116886 122499 129107 137049 145984 155259 164211
54910A64211P704N298K205o50k855m675o302p500q076q130p710o658n081l546
$$ 164211 171915 177213 179418 178768 175913 171238 164936 157436 149360 141230 133520 126862 121781 118235
54896A18235k564k117j906j814j884j973j733r16L69J611K108J441q8j579k237
$$ 118235 115671 113554 111648 109834 107950 105977 104244 103328 103697 105308 107416 108857 108769 107190 104953
54881A04953j878p54Q28K510L795M362M425M467M686N017N638O855Q360R129Q373
$$ 104953 103075 102321 103149 105659 109454 113816 118241 122708 127394 132411 138049 144904 153264 162393 170766
54866A70766O344L800J128j592m032n789o940p833q348q015o867n555m486l519
$$ 170766 177110 180910 182038 180446 176414 170625 163685 155852 147504 139489 132622 127067 122581 119062
54852A19062k676k384k698k939k653k315k498k840k556j689j056j088j402j557
$$ 119062 116386 114002 111304 108365 105712 103397 100899 98059 95503 93814 92758 91670 90268 88711
54838H8711j524j322p39K94J330J755J373N82Nq5L5l0k34k20LK9j89j12N04J084
$$ 88711 87187 85865 85126 85420 86750 88505 89878 90460 90465 90380 90415 90385 90151 89931 89934 89963 89774 89662 90166 91250
54818I1250J096Q99J045J187N50p39j646j573r28l25O4K30J26n0R2N40Q23O92
$$ 91250 92346 93245 94290 95477 96027 95288 93642 92069 91141 90816 90880 91110 91236 91186 91278 91818 92641 93333
54800I3333M35L78N55R23J412J662J257L46m04o34n60l90k7M71P55P47P35P48
$$ 93333 93768 94146 94701 95624 97036 98698 99955 100301 99897 99263 98703 98313 98286 98757 99512 100259 100994 101742
54782A01742M24k10n53l24J0J36M86J371K162K164J725J715K197K502K404K404
$$ 101742 102166 101956 101403 101079 101089 101225 101711 103082 105244 107408 109133 110848 113045 115547 117951 120355
54766A20355K834L465M076M752N529O330P239Q295Q898Q158O060L661J763j4k365
$$ 120355 123189 126654 130730 135482 141011 147341 154580 162875 171773 179931 185991 189652 191415 191401 189036
54751A89036n036p039p817p686p144o418n634m953m386l820l302k955k582j846
$$ 189036 184000 176961 169144 161458 154314 147896 142262 137309 132923 129103 125801 122846 120264 118418
54737A18418r58o74j232j824j589p68k28j21J84R01J375J110N14L02O34J329K364
$$ 118418 117460 116786 115554 113730 112141 111373 111145 111024 111208 112109 113484 114594 115108 115410 116044 117373 119737
54720A19737L676M844N489N818O299O943P311P006N887L970J558q02k812m628
$$ 119737 123413 128257 133746 139564 145863 152806 160117 167123 173010 176980 178538 177736 174924 170296
54706A70296o252p168p017o291n730n364m760l955l437l318l206k844k288j638
$$ 170296 164044 156876 149859 143568 137838 132474 127714 123759 120322 117004 113798 110954 108666 107028
54692A07028j138j270k012k330j328L04J019N09p0qQ7l51q11o15Q0P74J289J443
$$ 107028 105890 104620 102608 100278 98950 99254 100273 100782 100712 100704 100791 100440 99629 99014 99094 99868 101157 102600
54674A02600Q78j84q87r31j040j634k013j585r70r29r86k84Q71J496J519J634
$$ 102600 103478 103294 102407 101476 100436 98802 96789 95204 94234 93305 92319 92035 92906 94402 95921 97555
54658I7555J881J616Q18K71K70J88m20j061j065m18L49P16M21l30r15r15o39o21
$$ 97555 99436 101052 101870 102141 102411 102599 102179 101118 100053 99635 99984 100700 101121 100791 99876 98961 98322 97701
54640I7701p92o74k40J06L15P12J192J156M12m98r67q85l94K14M04j76r68r53
$$ 97701 96909 96235 95995 96101 96416 97128 98320 99476 99888 99390 98423 97538 97144 97358 97762 97586 96618 95665
54622I5665m8O48L48l73n28j52n1m75p59k53Q35J717J834J263M11m75j318j849
$$ 95665 95617 96265 96613 96240 95712 95560 95509 95034 94275 94022 94857 96574 98408 99671 100082 99607 98289 96440
54604I6440j571m43P36J094O91L30M65Q01R73R90R20P16N44P42J170J158L73o90
$$ 96440 94869 94426 95162 96256 96947 97277 97742 98543 99516 100506 101426 102142 102686 103428 104598 105756 106129 105439
54586A05439j342j477j352j042n33J3M16O97Q58P16L01j0p9k89q02r48j04J129
$$ 105439 104097 102620 101268 100226 99693 99706 100122 100819 101677 102393 102694 102684 102605 102316 101514 100566 100462 101591
54568A01591J434M83o18q12k36L63P29R83R10J88q52j356j041n32l72k65L03J057
$$ 101591 103025 103508 102890 102078 101842 102205 102934 103917 104827 105015 104163 102807 101766 101234 100862 100597 100900 101957
54550A01957J246P67L71O40J274J607J373P64J27j23L73J487K506K795K334J498
$$ 101957 103203 103970 104341 104981 106255 107862 109235 109999 110126 110003 110376 111863 114369 117164 119498 120996
54534A20996N81j49m17k92k75n76p02k62K36J20l22k81K02L14j55n10m23m33q66
$$ 120996 121577 121428 121011 120719 120444 119868 119166 118904 119140 119260 118938 118657 118859 119173 119018 118508 118085 117652 116786
54515A16786j165r05n70o49p37l07J90n4q12j080n54k1j56o91r97q63m17K74J121
$$ 116786 115621 114716 114146 113497 112760 112453 112643 112589 111777 110697 110143 110122 109966 109275 108278 107415 106998 107272 108393
54496A08393J736J652Q56q4n58m62j92m4R5L58M99K85J07O21J702K435K319J920
$$ 108393 110129 111781 112637 112553 111995 111533 111341 111297 111392 111750 112249 112534 112641 113262 114964 117399 119718 121638
54478A21638J923K092J709O96l17p84o29n8N78Q18N32J44N5J00o6k23J33R63J668
$$ 121638 123561 125653 127362 128058 127741 126957 126328 126270 126848 127666 128198 128342 128397 128497 128431 128208 128341 129304 130972
54459A30972J897J732J226L41o06j041q55n51n80r47j498k003j978j077J59O64
$$ 130972 132869 134601 135827 136168 135562 134521 133666 133115 132535 131588 130090 128087 126109 125032 125191 125855
54443A25855J78m38n27n20j026j723j869j416q63l08M75J185J095J10r10j135
$$ 125855 126033 125595 125068 124548 123522 121799 119930 118514 117651 117343 117818 119003 120098 120208 119298 118163
54427A18163n68K49Q50R64N20j26l28J51P99R74O66L13Q0k53p28r38m94M03J096
$$ 118163 117595 117844 118694 119658 120178 120052 119724 119875 120674 121648 122314 122627 122707 122454 121726 120788 120294 120697 121793
54408A21793J114O17J87K34O57J075J279J286J107P38M21N67J158J524J099K13
$$ 121793 122907 123524 123711 123945 124602 125677 126956 128242 129349 130087 130508 131075 132233 133757 134856 135069
54392A35069k85j90j45n90j045q52k45n4n52j104j052m54K31P42J031J008O42
$$ 135069 134784 134594 134449 133859 132814 131962 131717 131663 131111 130007 128955 128501 128732 129474 130505 131513 132155
54375A32155K20K01P08J278J223K56j068j659r10N10J213N64o15j119p30j57Q8
$$ 132155 132375 132576 133284 134562 135785 136041 134973 133314 132404 132914 134127 134691 134076 132957 132227 132070 132158
54358A32158J52K32R1m44j027j155q03l55m1J62J92j28o61q76n09j7o2n91q51
$$ 132158 132310 132542 132633 132189 131162 130007 129204 128849 128808 128970 129162 129034 128373 127497 126988 126971 126909 126318 125467
54339A25467l91L16N78M01L32M62K26o87j677j835j001Q7N96L24j97j61P51J910
$$ 125467 125076 125392 125970 126371 126703 127165 127391 126704 125027 123192 122191 122278 122874 123198 123001 122840 123591 125501
54321A25501K203J226k01r88r81q22q69p76j59R14K122L131L531L140K486K417
$$ 125501 127704 128930 128729 127741 126760 125938 125069 124293 124134 125048 127170 130301 133832 136972 139458 141875
54305A41875K878K727J248o39j406q91m33j054k291l032k907k359j778j132l83
$$ 141875 144753 147480 148728 148089 146683 145792 145359 144305 142014 138982 136075 133716 131938 130806 130423
54290A30423J87K08l98j287j840j544m51P05J005J97j056j725j350l41N20Q37
$$ 130423 130610 130818 130420 129133 127293 125749 125298 126003 127008 127205 126149 124424 123074 122733 123253 124090
54274A24090Q19Q79J104J254J109P23K58k29p20r86p42m9N25M75rk01L43J248
$$ 124090 124909 125788 126892 128146 129255 129978 130236 130007 129287 128301 127559 127510 128035 128510 128501 128300 128643 129891
54256A29891J743J490Q24K71K0j01k67l72k10J30J48n25j444j608o39N47O96k30
$$ 129891 131634 133124 133948 134219 134239 134138 133871 133499 133289 133419 133567 133042 131598 129990 129351 129898 130594 130364
54238A30364r98p18M9J10p63j624j584p19K88R12R27K90p00j342j161n61l80p12
$$ 130364 129366 128648 128697 128807 128044 126420 124836 124117 124405 125317 126244 126534 125834 124492 123331 122770 122390 121678
54220A21678p29O6R26Q25o6o19m13k54p67j357j209o23m88p83n75M91J650K148
$$ 121678 120949 121015 121941 122766 122700 122081 121668 121414 120647 119290 118081 117458 116970 116187 115612 116103 117753 119901
54202A19901K061J722J039q5j195j729j698j421q92J3R72J367J054N20K44K07
$$ 119901 121962 123684 124723 124638 123443 121714 120016 118595 117703 117716 118688 120055 121109 121629 121873 122080
54186A22080Q5l20q85j253j179p95m55k09K14Q44J210R66M24J14J45L46P13J192
$$ 122080 122165 121845 120960 119707 118528 117733 117278 117069 117283 118127 119337 120303 120727 120841 120986 121332 122045 123237
54168A23237J323P08k86q86q66o32m72l38k78m38o12l94Q7K81J08L0J68O0l90
$$ 123237 124560 125268 124982 124096 123230 122598 122126 121788 121510 121072 120460 120066 120153 120434 120542 120572 120740 120800 120410
54149A20410n65q8N68R24J188J511J278j0j596k156j452m36J33M41Q44J219J300
$$ 120410 119845 119757 120325 121249 122437 123948 125226 125216 123620 121464 120012 119576 119709 120150 120994 122213 123513
54132A23513J143Q81L90m17j180j319o79K09O42M89K86M44O83N28J99K87O27L70
$$ 123513 124656 125537 125927 125510 124330 123011 122332 122541 123183 123672 123958 124402 125085 125613 125812 126099 126726 127096
54114A27096n35q94M6J257J231R1o91l21O03J254J383Q57m11j818k312j706r76
$$ 127096 126561 125667 125713 126970 128201 128292 127601 127280 127883 129137 130520 131377 130966 129148 126836 125130 124154
54097A24154q87j039p20k2M80N44L22K3n7L40R19R13J53m88k25N71R72P04J79
$$ 124154 123267 122228 121508 121486 121966 122510 122832 122855 122798 123138 124057 124970 125123 124635 124410 124981 125953 126657 126836
54078A26836k75n66m83N8O57Q39P01N89L63l20j116j199l89N27P75L60k46o77
$$ 126836 126561 125995 125512 125570 126227 127066 127767 128356 128719 128399 127283 126084 125695 126222 126997 127357 127111 126434
54060A26434p26k88M49J046J190R23M24j79p17r41o88M5J083K038K485K375K117
$$ 126434 125708 125420 125869 126915 128105 129028 129452 129273 128556 127615 126927 126972 128055 130093 132578 134953 137070
54043A37070J988J697R45J17j13K38N22M44L71O21J013J366J757K052J733N63
$$ 137070 139058 140755 141700 141817 141704 141942 142464 142908 143279 143900 144913 146279 148036 150088 151821 152384
54027A52384r09j938k329k305j979j386p61l72k02j33k85p87j316j310o43J65
$$ 152384 151475 149537 147208 144903 142924 141538 140777 140405 140203 140070 139785 138998 137682 136372 135729 135894
54011A35894N47M31J21j95n74j060j456j495j175p52l92J8N91J209J676J968K066
$$ 135894 136441 136872 136993 136798 136224 135164 133708 132213 131038 130286 129894 129912 130503 131712 133388 135356 137422
53994A37422J791J098L83J09K47M44O07P98P56J50o82r51n13o3j8M8M66P63N53
$$ 137422 139213 140311 140694 140803 141050 141494 142101 142899 143655 143805 143123 142172 141659 141596 141578 141626 142092 142855 143408
53975A43408M68J378K982M116M309M258M712N706P057Q876J1096J2909J3147J1198
$$ 143408 143876 145254 148236 152352 156661 160919 165631 171337 178394 187270 198366 211275 224422 235620
53961B35620P376K591k185o194q963j0269j0178r113p718o480n512m753m183l723
$$ 235620 242996 245587 243402 237208 228245 217976 207798 198685 190967 184487 178975 174222 170039 166316
53947A66316l121k198j108j34O52J368K029K504K708K632K376K287K796L812M577
$$ 166316 163195 160997 159889 159755 160407 161775 163804 166308 169016 171648 174024 176311 179107 182919 187496
53932A87496M431L595K724J958R51k66j163j540j815k240k451k147j758j889k350
$$ 187496 191927 195522 198246 200204 201155 200889 199726 198186 196371 194131 191680 189533 187775 185886 183536
53917A83536k271j222J95R47O33k04p48q50j022j564j956j604q76p58j438j961
$$ 183536 181265 180043 180238 181185 181818 181614 180866 180016 178994 177430 175474 173870 172994 172236 170798 168837
53901A68837j623j029j179j925k156j401m80m13j184j954k090j716j364j357j508
$$ 168837 167214 166185 165006 163081 160925 159524 159044 158631 157447 155493 153403 151687 150323 148966 147458
53886A47458j280l69Q40J507J185L34j48J52Q23J137P42j52j069j538j239j43
$$ 147458 146178 145809 146649 148156 149341 149675 149527 149679 150502 151639 152381 152229 151160 149622 148383 148240
53870A48240J269K108J729M01q90j420j385j394j543j375p42j89k43o73q82p79
$$ 148240 149509 151617 153346 153747 152857 151437 150052 148658 147115 145740 144998 144809 144566 143893 143011 142232
53854A42232p55r15r37p35o23o16j71Q87J762J660R87P67J094J057K21o98r75
$$ 142232 141477 140562 139625 138890 138267 137651 137480 138367 140129 141789 142776 143543 144637 145694 145915 145217 144242
53837A44242q14p68q69q41n88n1Q93J895K098J319O10R32J738J849J229Q35Q89
$$ 144242 143428 142660 141791 140950 140362 140311 141204 143099 145197 146516 147126 148058 149796 151645 152874 153709 154598
53820A54598O61k1k23O44J851K361K067J478Q95M33L37O66J087J418J916K614
$$ 154598 155259 155238 155015 155659 157510 159871 161938 163416 164311 164744 165081 165747 166834 168252 170168 172782
53804A72782L012K873K857L669N167O872Q908J1574J4431J6717J8359J9501J9105
$$ 172782 175794 178667 181524 185193 190360 197232 206140 217714 232145 248862 267221 286722 305827
53791C05827J5272P425k461j1241j6768j8649j7756j5566j3426j1804j0241q329
$$ 305827 321099 328524 326063 314822 298054 279405 261649 246083 232657 220853 210612 202283
53779B02283o400m991m040l105k182j739j888k073j815j359j256j518j622j372
$$ 202283 195883 190892 186852 183747 181565 179826 177938 175865 174050 172691 171435 169917 168295 166923
53765A66923j267j710k237k029j040j06K04K43N26Q63P14J03m14m64r9N84J408
$$ 166923 165656 163946 161709 159680 158640 158534 158738 158981 159507 160370 161084 161187 160773 160309 160210 160794 162202
53748A62202J841J318O3r12q59l1Q08J285J606K094K793L402L517L067K547K565
$$ 162202 164043 165361 165424 164512 163653 163622 164430 165715 167321 169415 172208 175610 179127 182194 184741 187306
53732A87306L155L821M264M708N350N953O240O355O594O842O676N886M577K823
$$ 187306 190461 194282 198546 203254 208604 214557 220797 227152 233746 240588 247264 253150 257727 260550
53718B60550O16j862m043n284n344m591l719l156k711j917o51O75J572J834J463
$$ 260550 261166 259304 255261 249977 244633 240042 236323 233167 230456 228539 227888 228563 230135 231969 233432
53703B33432N87l34o01J32J479K795L812M535M746M152L013K071J681J391P16
$$ 233432 234019 233685 233084 233216 234695 237490 241302 245837 250583 254735 257748 259819 261500 262891 263607
53688B63607n6k31K13M96M0p76j176r64n48k20Q6K83J2p03j152p83ML66Q9l75
$$ 263607 263551 263320 263533 264029 264069 263293 262117 261153 260605 260385 260471 260754 260766 260063 258911 258128 258132 258498 258587 258212
53668B58212p99j400k084k291j837j332j366j686j672j258q80p63p30n87k81K00
$$ 258212 257413 256013 253929 251638 249801 248469 247103 245417 243745 242487 241607 240844 240114 239527 239246 239446
53652B39446P42J014Q39N53O00R07J072J079J300J791K100J893J301N75j29m77
$$ 239446 240188 241202 242041 242594 243194 244101 245173 246252 247552 249343 251443 253336 254637 255212 255083 254606
53636B54606n8R14J518J226O72Q03J602K279K530K775L174L199K567J913K009
$$ 254606 254548 255462 256980 258206 258878 259681 261283 263562 266092 268867 272041 275240 277807 279720 281729
53621B81729K749L451L852M195M497M443M057L837M036M309M353M384M610M671
$$ 281729 284478 287929 291781 295976 300473 304916 308973 312810 316846 321155 325508 329892 334502 339173
53607C39173M107L074K132J530J233J401K159K903K627J179l97j031p61l58l09
$$ 339173 343280 346354 348486 350016 351249 352650 354809 357712 360339 361518 361121 360090 359329 358971 358662
53592C58662n57r16j252j460j612j971k600l088l018k493j906j378q62n88r31
$$ 358662 358105 357189 355937 354477 352865 350894 348294 345206 342188 339695 337789 336411 335549 334961 334030
53577C34030j838k730k991k389j141L5K65n91j525j436m86K24K39J46K96J68m65
$$ 334030 332192 329462 326471 324082 322941 322976 323241 322650 321125 319689 319203 319427 319666 319812 320108 320276 319811
53560C19811o51M95K261L066K480J568J283J511J834K218K590K530K040J930K779
$$ 319811 319160 319655 321916 324982 327462 329030 330313 331824 333658 335876 338466 340996 343036 344966 347745
53545C47745L935M320L891L593M060N118O471P970R195R615R491R787J0849J1976
$$ 347745 351680 356000 359891 363484 367544 372662 379133 387103 396298 405913 415404 425191 436040 448016
53531D48016J2780J4046J6304J8339J8412J6728J5261J5046J4936J3636J1778
$$ 448016 460796 474842 491146 509485 527897 544625 559886 574932 589868 603504 615282
53520F15282J1072J2132J4180J6425J8636K0515K1596K2013K2592K3767K4999
$$ 615282 626354 638486 652666 669091 687727 708242 729838 751851 774443 798210 823209
53509H23209K5604K5651K5574K5303K4464K3322K2797K3314K4130K4203K3509
$$ 823209 848813 874464 900038 925341 949805 973127 995924 1019238 1043368 1067571 1091080
53498A091080K2958K3048K3208K2739K1845K1231K0956K0429J9482J8656J8279
$$ 1091080 1114038 1137086 1160294 1183033 1204878 1226109 1247065 1267494 1286976 1305632 1323911
53487A323911J7997J7588J7557J8255J8963J8668J7446J6248J5393J4131J1877
$$ 1323911 1341908 1359496 1377053 1395308 1414271 1432939 1450385 1466633 1482026 1496157 1508034
53476A508034R083O435L847Q15k610n819q474j0829j3075j4833j5514j5059j4178
$$ 1508034 1517117 1523552 1527399 1528214 1525604 1519785 1511311 1500482 1487407 1472574 1457060 1442001 1427823
53463A427823j3820j4502j6053j7945j9767k1384k2782k3795k4106k3585k2596
$$ 1427823 1414003 1399501 1383448 1365503 1345736 1324352 1301570 1277775 1253669 1230084 1207488
53452A207488k1832k1664k1793k1684k1205k0497j9420j7638j5307j3049j1103
$$ 1207488 1185656 1163992 1142199 1120515 1099310 1078813 1059393 1041755 1026448 1013399 1002296
53441A002296r058o801n072m508m597m285l223j767m1K112M339N849O501P086
$$ 1002296 993238 986437 981365 976857 972260 967975 964752 962985 962944 965056 969395 975244 981745 988831
53427I88831Q372J0404J2882J5541J7927J9407J9870K0008K0580K1729K3173K4696
$$ 988831 997203 1007607 1020489 1036030 1053957 1073364 1093234 1113242 1133822 1155551 1178724 1203420
53415A203420K6177K7534K8914L0610L2605L4548L6283L8014L9871M1832M4206
$$ 1203420 1229597 1257131 1286045 1316655 1349260 1383808 1420091 1458105 1497976 1539808 1584014
53404A584014M7497N1469N4891N6792N7515N8131N9183O0482O1682O2508O2693
$$ 1584014 1631511 1682980 1737871 1794663 1852178 1910309 1969492 2029974 2091656 2154164 2216857
53393B216857O2291O1791O1418O0575N8510N5374N2015M8844M5550M1931L8424
$$ 2216857 2279148 2340939 2402357 2462932 2521442 2576816 2628831 2677675 2723225 2765156 2803580
53382B803580L5532L3081L0325K6727K2539J8597J5466J2738R363M635j455q836
$$ 2803580 2839112 2872193 2902518 2929245 2951784 2970381 2985847 2998585 3007948 3012583 3011128 3002292
53370C002292j7716k7954l8467m7753n4851n9517o1918o2654o2737o2941o3128
$$ 3002292 2984576 2956622 2918155 2870402 2815551 2756034 2694116 2631462 2568725 2505784 2442656
53359B442656o2637o1147n8860n6067n3057n0281m8190m6950m6653m7579m9752
$$ 2442656 2380019 2318872 2260012 2203945 2150888 2100607 2052417 2005467 1958814 1911235 1861483
53348A861483n2358n4062n3890n1678m8078m4385m1825m0378l8640l5472l1355
$$ 1861483 1809125 1755063 1701173 1649495 1601417 1557032 1515207 1474829 1436189 1400717 1369362
53337A369362k7477k4060k0648j7567j5787j5312j5084j4715j5027j6337j7435
$$ 1369362 1341885 1317825 1297177 1279610 1263823 1248511 1233427 1218712 1203685 1187348 1169913
53326A169913j7026j5355j3552j2151j1074j0424j0254r845q225n386k331R0J792
$$ 1169913 1152887 1137532 1123980 1111829 1100755 1090331 1080077 1070232 1062007 1056621 1054290 1054380 1056172
53313A056172K958L580L726L848M489N818P542R213J0673J2278J4546J7481K0380
$$ 1056172 1059130 1062710 1066436 1070284 1074773 1080591 1088133 1097346 1108019 1120297 1134843 1152324 1172704
53300A172704K2455K3615K4539K6026K8271L0628L2164L2535L2180L1479L0081
$$ 1172704 1195159 1218774 1243313 1269339 1297610 1328238 1360402 1392937 1425117 1456596 1486677
53289A486677K7559K4485K2076K0747J9759J8381J6615J4559J1960Q894O024L530
$$ 1486677 1514236 1538721 1560797 1581544 1601303 1619684 1636299 1650858 1662818 1671712 1677736 1681266
53277A681266N56l397p227r477j0512j2245j5697j9849k3154k5285k6929k8594
$$ 1681266 1681822 1678425 1671198 1661721 1651209 1638964 1623267 1603418 1580264 1554979 1528050 1499456
53265A499456l0165l1331l1991l2359l2835l3672l4596l4991l4507l3296l1650
$$ 1499456 1469291 1437960 1405969 1373610 1340775 1307103 1272507 1237516 1203009 1169713 1138063
53254A138063k9778k8022k6941k6831k7295k7535k7118k6355k5958k6265k6889
$$ 1138063 1108285 1080263 1053322 1026491 999196 971661 944543 918188 892230 865965 839076
53243H39076k7137k6761k6130k5560k4771k3192k0634j7365j3795j0419p904o744
$$ 839076 811939 785178 759048 733488 708717 685525 664891 647526 633731 623312 615408 608664
53231F08664o729p230p962r130j0697j2039j2645j2779j3089j3664j3949j3488
$$ 608664 601935 594705 586743 577613 566916 554877 542232 529453 516364 502700 488751 475263
53219D75263j2482j1510j0928j0668j0429r893q840p309n766m927n175o133p041
$$ 475263 462781 451271 440343 429675 419246 409353 400513 393204 387438 382511 377336 371203 364162
53206C64162p559p923q325q460p989p168o640o629o645o101m933l576k549k155
$$ 364162 356603 348680 340355 331895 323906 316738 310098 303469 296824 290723 285790 282214 279665 277510
53192B77510k338k661k542j744o33J32K12j83o50j042j419j698j642j258r39r80
$$ 277510 275172 272511 269969 268225 267592 267724 267936 267753 267103 266061 264642 262944 261302 260044 259105 258125
53176B58125j156j063p27n44o34o88m90j99M5L41O68O39K6p33r15l52M30Q00O18
$$ 258125 256969 255906 255179 254635 254001 253313 252823 252624 252669 253010 253678 254317 254343 253610 252695 252343 252773 253573 254191
53157B54191K09n8j22j89l71m35j65J48q6r70j924k355k173j550o67L9o7r91j737
$$ 254191 254400 254342 254220 254031 253660 253225 253060 253208 253122 252152 250228 247873 245700 244150 243483 243522 243455 242464 240727
53138B40727j341r3Q02O55r2o50p87q00r55j190j249j132j191j649k086j824q59
$$ 240727 239386 239293 240095 240750 240658 240008 239221 238421 237466 236276 235027 233895 232704 231055 228969 227145 226286
53121B26286J00O44J021J224O18r05k180k117j269j004j505j756j359j041j240
$$ 226286 226386 227030 228051 229275 229893 228988 226808 224691 223422 222418 220913 219157 217798 216757 215517
53106B15517j326o99K59Q08P63L26l11q76j079j112j480k064k017j019P9L89J47
$$ 215517 214191 213492 213751 214559 215322 215648 215337 214461 213382 212270 210790 208726 206709 205690 205769 206158 206305
53089B06305J31M22M09j99j001j377j030j94M24K72l08l87K69Q02N64Q2J34M49
$$ 206305 206436 206858 207267 207068 206067 204690 203660 203466 203890 204162 203854 203467 203736 204538 205102 205184 205318 205767
53071B05767K05n61r51n05L29R58J176Q89N4r62j521j444j138r12n90O9R30J681
$$ 205767 205972 205411 204460 203955 204284 205242 206418 207307 207361 206399 204878 203434 202296 201384 200794 200863 201793 203474
53053B03474K127K259K158J941J550P38m44j344j304n21J74L22J56o1l59o50o26
$$ 203474 205601 207860 210018 211959 213509 214247 213803 212459 211155 210634 210808 211130 211286 211225 210866 210216 209590
53036B09590l04j59l73m93j24M74R08J237J552J399L60r82j449p63L8o5q46j300
$$ 209590 209286 209127 208754 208261 208137 208611 209519 210756 212308 213707 214067 213085 211636 210873 210911 210846 210000 208700
53018B08700r92m26k11l43m23k30R7L06K57n9n32r15r21m56K20O30M46j87p26
$$ 208700 207708 207282 207071 206728 206305 206075 206172 206478 206735 206676 206144 205229 204308 203852 204072 204702 205148 204961 204235
52999B04235p15k57J34J98K82P72J425J529Q15k43j037j330j004M7J417K086J551
$$ 204235 203520 203263 203397 203595 203877 204649 206074 207603 208418 208175 207138 205808 204804 204851 206268 208354 209905
52982B09905P32Q96J818J941O10r13j182m63J3k3J70P36Q97M24K07Q41J601J632
$$ 209905 210637 211533 213351 215292 215902 214989 213807 213344 213357 213334 213504 214240 215137 215561 215768 216609 218210 219842
52964B19842J388J820K674K752J747O50K04L1l36n99n39p97j901l122l319k552
$$ 219842 221230 223050 225724 228476 230223 230873 231077 231108 230772 230173 229634 228837 226936 223814 220495 217943
52948B17943j842j548j032p0N55K31n45j002j145j350j449r89j00N25M85n2p58
$$ 217943 216101 214553 213521 213451 214006 214237 213692 212690 211545 210195 208746 207757 207657 208182 208667 208615 207857
52931B07857j281j141j14J162J562P23m88r81o71l50o20j196j313o21L94Q15K14
$$ 207857 206576 205435 205321 206483 208045 208768 208280 207299 206628 206278 205658 204462 203149 202528 202922 203737 203951
52914B03951q87j537j311o10o1J38J55J13Lj34k10k71l60k86K28J003J300N91
$$ 203951 203064 201527 200216 199606 199545 199683 199838 199951 199954 199820 199610 199339 198979 198693 198921 199924 201224 201815
52896B01815p59j776j849j172l15L27O28O32N76P84J294J718J665J217P87N98
$$ 201815 201056 199280 197431 196259 195944 196271 196899 197531 198107 198891 200185 201903 203568 204785 205572 206170
52880B06170M54rr21j907k261j609m96R5p4j63N70J693K207J906J399J092Q66
$$ 206170 206624 206615 205694 203787 201526 199917 199421 199516 199442 199279 199849 201542 203749 205655 207054 208146 209012
52863B09012P02Q24J051P98%o57p26n91p55j146j611k416l564m198l467j732k20
$$ 209012 209714 210538 211589 212387 212387 211730 211004 210413 209658 208512 206901 204485 200921 196723 193256 191524 191304
52846A91304L82L15o8p32j531k059k102j861j528j116p69p38r02p17M7Q99J233
$$ 191304 191686 192001 191933 191201 189670 187611 185509 183648 182120 181004 180235 179497 178595 177878 177925 178824 180057
52829A80057J065Q88Q97P81K49m93r45q75n32k78j84j11j03l19n93m39K84J033
$$ 180057 181122 182010 182907 183688 183937 183444 182499 181624 181092 180814 180630 180519 180416 180097 179504 179065 179349 180382
52811A80382J244J137J439K385L355L576K817J426o7j238j900k123k092j934j744
$$ 180382 181626 182763 184202 186587 189942 193518 196335 197761 197694 196456 194556 192433 190341 188407 186663
52796A86663j668j758j834j652j237q55p44r32j253j404j113m12L47Q80J230J427
$$ 186663 184995 183237 181403 179751 178514 177659 176915 175983 174730 173326 172213 171801 172148 173028 174258 175685
52780A75685J208M67k64k93L36R00J004R79J112J023K54q75j456j042j36M38M33
$$ 175685 176893 177360 177096 176803 177139 178039 179043 180022 181134 182157 182411 181536 180080 179038 178902 179340 179773
52763A79773K65L32M98M18J55J67O20J114J217R78N87p8j127k020j944q29M70
$$ 179773 180038 180370 180868 181286 181441 181608 182228 183342 184559 185537 186124 186046 184919 182899 180955 180126 180596
52746A80596J154J233J158J150J162J190J197R97N40K29N58J437K219K436K256
$$ 180596 181750 182983 184141 185291 186453 187643 188840 189837 190377 190606 191164 192601 194820 197256 199512
52731A99512K058J840J313M74k37m51k98j93l49p38j269j803k022j706j114p73
$$ 199512 201570 203410 204723 205197 204960 204509 204211 204018 203669 202931 201662 199859 197837 196131 195017 194244
52715A94244q07p83l41K79N29J53n93j168j135n36R6L71N15Q82J126O19l85q28
$$ 194244 193437 192654 192313 192592 193121 193274 192681 191513 190378 189842 189938 190309 190824 191706 192832 193451 193066 192238
52697A92238m04m9l94o46J27J396J949J707J593J852J784J125N03L05J48j89k59
$$ 192238 191834 191785 191391 190745 190872 192268 194217 195924 197517 199369 201153 202278 202781 203086 203234 203045 202786
52680B02786J32L79M3l64j71L85M90q7p36p82j42O45Q56J84q98j510j208k85O82
$$ 202786 202918 203297 203340 202976 202805 203190 203680 203593 202857 202075 201933 202578 203434 203618 202720 201210 200002 199717 200399
52661B00399J306J485J416J554K165K899L133K614J436m16k706m401m374k865
$$ 200399 201705 203190 204606 206160 208325 211224 214357 216971 218407 217991 215285 210884 206510 203645
52647B03645j418j033j247j241r70o89k29M98R83Q31N21O96J172J315J062Q10
$$ 203645 202227 201194 199947 198706 197736 197047 196818 197316 198299 199130 199651 200347 201519 202834 203896 204706
52631B04706O37M01L56R16J879K587K767K591J995O93j040k271k381j728j070
$$ 204706 205343 205744 206100 207016 208895 211482 214249 216840 218835 219528 218488 216217 213836 212108 211038
52616B11038p34n21k30K5K8j73k32j2J01k75p40l83R94K430K930K511J801J113
$$ 211038 210304 209783 209553 209578 209606 209433 209201 209189 209290 209015 208275 207892 208886 211316 214246 216757 218558 219671
52598B19671M99K84P84J608J948J551R50P24R08J127R49J96q08j392j211o76l97
$$ 219671 220170 220454 221238 222846 224794 226345 227295 228019 228927 230054 231003 231199 230391 228999 227788 227112 226715
52581B26715m85o86q63r16n05M75J391J440O58k37q50j327j606j253k84M86L15
$$ 226715 226230 225544 224681 223765 223260 223735 225126 226566 227224 226987 226137 224810 223204 221951 221667 222153 222468
52564B22468n66j256j164m88J05J86o2j36M8M9l32n74j27O61R41N74K48M00O06
$$ 222468 221902 220646 219482 218994 219099 219285 219223 219087 219135 219184 218852 218278 218151 218812 219753 220327 220575 220975 221581
52545B21581L19l26p27n75j20J67P6j53q5L58P36N62j72j087j756j806j036J43
$$ 221581 221900 221574 220847 220272 220152 220319 220395 220242 220157 220515 221251 221813 221641 220554 218798 216992 215956 216099
52527B16099P88L63n93j201j283j199j018n58J3M06Q25J591K307K293J780J695
$$ 216099 216887 217250 216657 215456 214173 212974 211956 211398 211411 211817 212642 214233 216540 218833 220613 222308
52511B22308K228K652K748L208M262M892M210K694J367L86p46k078l131l671l822
$$ 222308 224536 227188 229936 233144 237406 242298 246508 249202 250569 250955 250209 248131 245000 241329 237507
52496B37507l648l155k545k022j542j128j082j479j785j478p55j23L97J062J665
$$ 237507 233859 230704 228159 226137 224595 223467 222385 220906 219121 217643 216888 216765 217162 218224 219889
52481B19889J695J140N59L89N96R83J330J282O43k04n68k36M05R88J483J849J923
$$ 219889 221584 222724 223283 223672 224268 225251 226581 227863 228506 228302 227734 227498 227903 228891 230374 232223 234146
52464B34146J770J821K359L184L908M277M053K937J012r68k168k536k825l617
$$ 234146 235916 237737 240096 243280 247188 251465 255518 258455 259467 258499 256331 253795 250970 247353
52450B47353m639n155m840l991k983j921q99k46k03n19p25o84n96n06k20K66O06
$$ 247353 242714 237559 232719 228728 225745 223824 222925 222679 222476 221957 221232 220548 219952 219446 219226 219492 220098
52433B20098N86M57O07J084J568J664J232N77L11P56J472J681J254R25J406K591
$$ 220098 220684 221141 221748 222832 224400 226064 227296 227873 228184 228940 230412 232093 233347 234272 235678 238269
52417B38269L836M710N274N896O963Q587J0384J1687J1947J0748P631K604l122
$$ 238269 242105 246815 252089 257985 264948 273535 283919 295606 307553 318301 325932 328536 325414
52404C25414p634r933j0544j0311r283p329n115l571k735j951j001k91J6K85O75
$$ 325414 317780 307847 297303 286992 277709 270380 265265 261694 258959 257008 256007 255716 255732 256017 256692
52389B56692Q58O00J78j3J61O29J214J604J651J691K192L056L702L905M026M363
$$ 256692 257550 258150 258328 258315 258476 259105 260319 261923 263574 265265 267457 270513 274215 278120 282146 286509
52373B86509M746N004N285N693O010O078O074O100N890N210M227L206K155J132
$$ 286509 291255 296259 301544 307237 313247 319325 325399 331499 337389 342599 346826 350032 352187 353319
52359C53319N61P87J550K290K860L469M141M779N666P240R258J0779J1299J1458
$$ 353319 353880 354667 356217 358507 361367 364836 368977 373756 379422 386662 395920 406699 417998 429456
52345D29456J2253J3833J5458J6472J6856J6948J7092J7542J8354J9247J9867
$$ 429456 441709 455542 471000 487472 504328 521276 538368 555910 574264 593511 613378
52334F13378K0260K0726K1249K1428K1192K1049K1290K1367K0590J9181J8026
$$ 613378 633638 654364 675613 697041 718233 739282 760572 781939 802529 821710 839736
52323H39736J7451J6883J5733J3952J1578Q403M588J081j144k174l035m533o525
$$ 839736 857187 874070 889803 903755 915333 923736 928324 929405 928261 926087 923052 918519 911994
52310I11994q182q796q306p324o611o455o576o635o534o212n453m160k509o24
$$ 911994 903812 895016 886710 879386 872775 866320 859744 853109 846575 840363 834910 830750 828241 827617
52296H27617J615M092O141P125P209P138P416Q013Q747R595J0632J2047J4027
$$ 827617 829232 833324 839465 846590 853799 860937 868353 876366 885113 894708 905340 917387 931414
52283I31414J6225J7610J7360J5839J4221J3100J2082J0714R127P547N838L934
$$ 931414 947639 965249 982609 998448 1012669 1025769 1037851 1048565 1057692 1065239 1071077 1075011
52271A075011K305J416R70M9k012n103q526j1444j3305j4116j4275j4073j3550
$$ 1075011 1077316 1078732 1079702 1079751 1077739 1072636 1064110 1052666 1039361 1025245 1010970 996897 983347
52258I83347j2866j2414j2311j2065j1147r754q542p766p038o014m877m001l488
$$ 983347 970481 958067 945756 933691 922544 912790 904248 896482 889444 883430 878553 874552 871064
52245H71064l261l315l673m112m255l874k962j547L43K452M180M976M821M259
$$ 871064 867803 864488 860815 856703 852448 848574 845612 844065 844408 846860 851040 856016 860837 865096
52231H65096L887L907M190M622N133N490N328M592L785L510L803M182M382M684
$$ 865096 868983 872890 877080 881702 886835 892325 897653 902245 906030 909540 913343 917525 921907 926591
52217I26591N384O233O824P310Q097Q811Q308O220L831K748K992L215K634J882
$$ 926591 931975 938208 945032 952342 960439 969250 977558 983778 987609 990357 993349 996564 999198 1001080
52203A001080J805K321K837L149L295L086K405J581R82N44J45J2K25K83j16l03
$$ 1001080 1002885 1005206 1008043 1011192 1014487 1017573 1019978 1021559 1022541 1023085 1023230 1023242 1023467 1023750 1023634 1023331
52187A023331M13J294R14p55k148k325k160k807m025m874n246n638n946n577m562
$$ 1023331 1023744 1025038 1025952 1025197 1023049 1020724 1018564 1015757 1011732 1006858 1001612 995974 990028 984451 979889
52172I79889l602k998k410j690j144p98j51J032K226K928L448M496O243Q128R439
$$ 979889 976287 973289 970879 969189 968045 967247 967096 968128 970354 973282 976730 981226 987469 995597 1005036
52157A005036R738Q961P515O240N863O367P048P330P423Q033R503J1278J2404
$$ 1005036 1014774 1023735 1031250 1037490 1043353 1049720 1056768 1064098 1071521 1079554 1089057 1100335 1112739
52144A112739J2604J2671J3540J5046J6034J5825J5073J4799J4942J4517J3155
$$ 1112739 1125343 1138014 1151554 1166600 1182634 1198459 1213532 1228331 1243273 1257790 1270945
52133A270945J1791J1492J2144J2768J2841J2797J3237J4140J4945J5149J4606
$$ 1270945 1282736 1294228 1306372 1319140 1331981 1344778 1358015 1372155 1387100 1402249 1416855
52122A416855J3512J2264J1196J0251Q998P095M664K091m19k932n370p330q495
$$ 1416855 1430367 1442631 1453827 1464078 1473076 1480171 1484835 1486926 1486507 1483575 1478205 1470875 1462380
52109A462380r219j0333j2244j4318j5454j5255j4297j3130j1482q746m930p23
$$ 1462380 1453161 1442828 1430584 1416266 1400812 1385557 1371260 1358130 1346648 1337902 1332972 1332249
52097A332249L229O604R199J1055J2715J4689J6492J6956J5815J4232J3378J3062
$$ 1332249 1335478 1342082 1351281 1362336 1375051 1389740 1406232 1423188 1439003 1453235 1466613 1479675
52085A479675J2425J1441J0895J1183J1988J3023J4263J5297J5301J3958J1848
$$ 1479675 1492100 1503541 1514436 1525619 1537607 1550630 1564893 1580190 1595491 1609449 1621297
52074A621297R631P344M823K316K02j668l865o680r816j2763j5280j7547j9884
$$ 1621297 1630928 1638272 1643095 1645411 1645613 1643945 1640080 1633400 1623584 1610821 1595541 1577994 1558110
52061A558110k2347k4598k6245k7222k7651k7491k6677k5495k4414k3454k2235
$$ 1558110 1535763 1511165 1484920 1457698 1430047 1402556 1375879 1350384 1325970 1302516 1280281
52050A280281k0699j9338j8442j7657j6604j5559j4968j4637j3959j2784j1524
$$ 1280281 1259582 1240244 1221802 1204145 1187541 1171982 1157014 1142377 1128418 1115634 1104110
52039A104110j0348q838o688m282k258p59N69J870K728K709J982J212P81L13q76
$$ 1104110 1093762 1084924 1078236 1073954 1071696 1070937 1071506 1073376 1076104 1078813 1080795 1082007 1082788 1083101 1082225
52024A082225k982n477p656r216j0322j1233j2010j2489j2537j2356j2488j3367
$$ 1082225 1079243 1073766 1066110 1056894 1046572 1035339 1023329 1010840 998303 985947 973459 960092
52012I60092j4910j6604j7976j8875j9355j9455j9161j8441j7370j6175j5113
$$ 960092 945182 928578 910602 891727 872372 852917 833756 815315 797945 781770 766657
52001G66657j4220j3435j3000j3348j4274j4648j3538j1418r623q661p751o223
$$ 766657 752437 739002 726002 712654 698380 683732 670194 658776 649153 640492 632741 626518
$$ [...]
##END NTUPLES=NMR SPECTRUM
##END=
