
##TITLE=AC1370_2394_7221551_PFWnt8R9C4
##JCAMPDX= 6.0         $$ Bruker NMR JCAMP-DX V2.0
##DATA TYPE= NMR SPECTRUM
##DATA CLASS= NTUPLES
##ORIGIN= BRUKER
##OWNER= Administrator
$$ 1.72 TOPSPIN		Version 2.1
$$ 2012-12-13 20:33:29.914 -0500  Administrator@X
$$ Compression mode = diff/dup
##.OBSERVE FREQUENCY= 400.02188249412
##.OBSERVE NUCLEUS= ^1H
##.ACQUISITION MODE= SIMULTANEOUS (DQD)
##.ACQUISITION SCHEME= undefined
##.AVERAGES= 8
##.DIGITISER RES= 22
##SPECTROMETER/DATA SYSTEM= spect
##.PULSE SEQUENCE= zg30
##.SOLVENT NAME= COFFEE_meoh
##.SHIFT REFERENCE= INTERNAL, COFFEE_meoh, 1, 14.98509
##AUDIT TRAIL= $$ (NUMBER, WHEN, WHO, WHERE, PROCESS, VERSION, WHAT)
$$ ##TITLE= Audit trail, TOPSPIN		Version 2.1
$$ ##JCAMPDX= 5.01
$$ ##ORIGIN= Bruker BioSpin GmbH
$$ ##OWNER= Administrator
$$ $$ E:\/data/COFFEE/nmr/AC1370_2394_7221551_PFWnt8R9C4/10/pdata/1/auditp.txt
$$ ##AUDIT TRAIL=  $$ (NUMBER, WHEN, WHO, WHERE, PROCESS, VERSION, WHAT)
(   1,<2012-12-13 20:33:21.773 -0500>,<Administrator>,<X>,<go>,<TOPSPIN 2.1>,
      <created by zg
	started at 2012-12-13 20:32:15.757 -0500,
	POWCHK enabled, PULCHK disabled,
       configuration hash MD5:
       86 BA 57 50 F2 9D 5C 9B 26 00 A9 28 5F 66 2E 89
       data hash MD5: 64K
       21 2E DB 94 85 E2 CF 36 67 BA 81 6A 13 BE 78 90>)
(   2,<2012-12-13 20:33:24.867 -0500>,<Administrator>,<X>,<proc1d>,<TOPSPIN 2.1>,
      <Start of raw data processing
       efp LB = 0 FT_mod = 6 PKNL = 1 PHC0 = 0 PHC1 = 0 SI = 32K 
       data hash MD5: 32K
       5F 91 57 8F 4C 90 45 B3 50 62 D2 FB CF B8 D8 BA>)
(   3,<2012-12-13 20:33:25.336 -0500>,<Administrator>,<X>,<proc1d>,<TOPSPIN 2.1>,
      <pk PHC0 = 101.8707 PHC1 = 0 
       data hash MD5: 32K
       6F D7 4D 8D C3 33 0B 94 F0 61 77 3D C9 24 93 4A>)
(   4,<2012-12-13 20:33:25.554 -0500>,<Administrator>,<X>,<proc1d>,<TOPSPIN 2.1>,
      <abs ABSG = 1 
       data hash MD5: 32K
       F3 2C 35 4E 57 61 4F ED 53 81 3A 70 27 3B 3F 8E>)
(   5,<2012-12-13 20:33:25.695 -0500>,<Administrator>,<X>,<proc1d>,<TOPSPIN 2.1>,
      <abs ABSG = 2 
       data hash MD5: 32K
       21 1C 5D 31 29 82 30 08 28 36 5A FA EC 83 F8 4D>)
(   6,<2012-12-13 20:33:25.836 -0500>,<Administrator>,<X>,<proc1d>,<TOPSPIN 2.1>,
      <abs ABSG = 3 
       data hash MD5: 32K
       AF CD 91 93 E5 8E 7E 60 33 86 74 C2 BC 23 58 EA>)
(   7,<2012-12-13 20:33:25.992 -0500>,<Administrator>,<X>,<proc1d>,<TOPSPIN 2.1>,
      <abs ABSG = 4 
       data hash MD5: 32K
       38 EB 80 D5 CC EC D6 2A 04 B4 06 AA AD 96 E4 19>)
(   8,<2012-12-13 20:33:26.132 -0500>,<Administrator>,<X>,<proc1d>,<TOPSPIN 2.1>,
      <abs ABSG = 5 
       data hash MD5: 32K
       9F 8F E1 05 77 B0 3A 4F 76 44 99 C1 77 EB 6A 52>)
$$ ##END=
$$ 
$$ $$ hash MD5
$$ $$ B5 FD A5 DD 1B 9F E3 5A 64 FC 04 60 B4 F2 43 6F
##$RELAX= 
##$RELAX= 
##$RELAX= 
##$RELAX= 
##$RELAX= 
##$RELAX= 
##$RELAX= 
##$RELAX= 
$$ Bruker specific parameters
$$ --------------------------
##$DU= <E:\>
##$EXPNO= 10
##$NAME= <AC1370_2394_7221551_PFWnt8R9C4>
$$ [...]
##$TP= (0..7)
150 150 150 150 150 150 150 150
##$TP07= 0
##$TPNAME0= <>
##$TPNAME1= <>
##$TPNAME2= <>
##$TPNAME3= <>
##$TPNAME4= <>
##$TPNAME5= <>
##$TPNAME6= <>
##$TPNAME7= <>
##$TPOAL= (0..7)
0.5 0.5 0.5 0.5 0.5 0.5 0.5 0.5
##$TPOFFS= (0..7)
0 0 0 0 0 0 0 0
##$TUNHIN= 0
##$TUNHOUT= 0
##$TUNXOUT= 0
##$USERA1= <user>
##$USERA2= <user>
##$USERA3= <user>
##$USERA4= <user>
##$USERA5= <user>
##$V9= 5
##$VALIST= <valist>
##$VCLIST= <CCCCCCCCCCCCCCC>
##$VD= 0
##$VDLIST= <DDDDDDDDDDDDDDD>
##$VPLIST= <PPPPPPPPPPPPPPP>
##$VTLIST= <TTTTTTTTTTTTTTT>
##$WBST= 1024
##$WBSW= 4
##$XGAIN= (0..3)
0 0 0 0
##$XL= 0
##$YL= 0
##$YMAX_a= 660138
##$YMIN_a= -564379
##$ZGOPTNS= <>
##$ZL1= 120
##$ZL2= 120
##$ZL3= 120
##$ZL4= 120
##$ABSF1= 14.98509
##$ABSF2= -5.573092
##$ABSG= 5
##$ABSL= 3
##$ALPHA= 0
##$AQORDER= 0
##$ASSFAC= 0
##$ASSFACI= 0
##$ASSFACX= 0
##$ASSWID= 0
##$AUNMP= <proc_prof1d_extract_pilot.lims>
##$AXLEFT= 0
##$AXNAME= <>
##$AXNUC= <1H>
##$AXRIGHT= 0
##$AXTYPE= 0
##$AXUNIT= <>
##$AZFE= 0.1
##$AZFW= 0.1
##$BCFW= 0
##$BC_mod= 0
##$BYTORDP= 0
##$COROFFS= 0
##$CY= 15
##$DATMOD= 1
##$DC= 0
##$DFILT= <>
##$DTYPP= 0
##$F1P= 0
##$F2P= 0
##$FCOR= 0.5
##$FTSIZE= 32768
##$FT_mod= 6
##$GAMMA= 0
##$GB= 0
##$INTBC= 1
##$INTSCL= 1
##$ISEN= 128
##$LB= 0
##$LEV0= 0
##$LPBIN= 0
##$MAXI= 10000
##$MC2= 0
##$MEAN= 0
##$ME_mod= 0
##$MI= 0
##$NCOEF= 0
##$NC_proc= -8
##$NLEV= 6
##$NOISF1= 0
##$NOISF2= 0
##$NSP= 0
##$NTH_PI= 0
##$NZP= 0
##$OFFSET= 14.98509
##$PC= 1
##$PHC0= 101.8707
##$PHC1= 0
##$PH_mod= 1
##$PKNL= yes
##$PPARMOD= 0
##$PPDIAG= 0
##$PPIPTYP= 0
##$PPMPNUM= 2147483647
##$PPRESOL= 1
##$PSCAL= 4
##$PSIGN= 0
##$PYNMP= <proc.py>
##$REVERSE= no
##$SF= 400.02
##$SI= 32768
##$SIGF1= 0
##$SIGF2= 0
##$SINO= 400
##$SIOLD= 32768
##$SPECTYP= <>
##$SREGLST= <1H.CDCl3>
##$SSB= 0
##$STSI= 32768
##$STSR= 0
##$SW_p= 8223.68421052631
##$SYMM= 0
##$S_DEV= 0
##$TDeff= 65536
##$TDoff= 0
##$TI= <>
##$TILT= no
##$TM1= 0
##$TM2= 0
##$TOPLEV= 0
##$USERP1= <user>
##$USERP2= <user>
##$USERP3= <user>
##$USERP4= <user>
##$USERP5= <user>
##$WDW= 1
##$XDIM= 32768
##$YMAX_p= 466719525
##$YMIN_p= -717182
##$CURPLOT= <Network HP LaserJet P1505>
##$CURPRIN= <$Network HP LaserJet P1505>
##$DFORMAT= <normdp>
##$LAYOUT= <+/1D_H.xwp>
##$LFORMAT= <normlp>
##$PFORMAT= <normpl>
##$SURQMSG= 1
$$ End of Bruker specific parameters
$$ ---------------------------------
##NTUPLES= NMR SPECTRUM
##VAR_NAME=  FREQUENCY,     SPECTRUM/REAL,   SPECTRUM/IMAG
##SYMBOL=    X,             R,               I
##VAR_TYPE=  INDEPENDENT,   DEPENDENT,       DEPENDENT
##VAR_FORM=  AFFN,          ASDF,            ASDF
##VAR_DIM=   32768,         32768,           32768
##UNITS=     HZ,            ARBITRARY UNITS, ARBITRARY UNITS
##FACTOR=    0.250966925370066, 1,           1
##FIRST=     8223.43324360094, -76123,       14140
##LAST=      0,             -104838,         50834
##MIN=       0,             -717182,         0
##MAX=       8223.43324360094, 466719525,    0
$$ Real data points
##PAGE= N=1
##DATA TABLE= (X++(R..R)), XYDATA
$$ [...]
23833 -164379 -215736 294402 -268554 42722 -317426 -40662 30675 -24727 -40702 -209600 -36643
23821 54441 -126453 381303 -133773 -8054 259395 -403939 15266 -177315 -4136 206118 93563
23809 -74878 352320 -13459 70507 -217234 -34077 -1518 187007 93777 305756 279457 279159
23798 279159 -213602 1967 -60104 -82974 47804 43941 -35130 -46527 -2991 -181470 9030 -332307
23785 183446 220688 4336 211292 14767 -20206 -114388 86801 56017 -146460 20534 46460
23774 46460 104152 48098 51875 141543 -195307 -33518 209170 -66108 180921 -291423 -108643
23762 -55516 -312752 -97518 108326 141777 -37986 -185104 -77618 201688 -110903 -149238 -159620
23751 -159620 -72402 64420 -288818 175225 -15982 -92881 -293957 55927 205066 145810 -42810
23739 209570 -335212 227164 -44839 70930 3918 -18352 190528 -14277 93883 143937 -151746
23727 -53608 8631 77745 -122069 -58454 292032 -80510 -117347 -369606 -157940 22937 -104276
23715 -147213 14997 60018 227952 -137651 -79298 -137463 -109519 112509 -426433 61739 -71649
23703 364887 -227294 -297088 254049 -149062 52918 20726 -110012 190713 -376640 110381
23692 486333 -26149 -105943 -81767 -67551 -87310 117220 41792 39634 -234457 -335623 117506
23680 109687 -144965 214723 -132525 189923 -29445 179937 92077 -50102 -106572 180918
23669 125297 -312484 56652 -146544 -92052 26664 8215 533 -42676 -18838 123354 -10035
23657 -193851 -16106 -1000 80925 111592 -122483 -319033 -288404 1678 171590 62082 -143388
23645 83598 -78436 -215185 79449 -189561 152478 127947 127078 19139 -83486 -102587 51577
23633 346768 66472 237034 -35637 101728 -58134 -29827 -177500 153741 -58313 101665
23622 130801 41652 -172321 -359273 211060 108234 175869 -276218 32615 8593 -86563 230471
23610 307715 98622 25522 186131 41090 -135784 -22434 118144 -86672 -179916 -313795 -121498
23598 -28634 -137380 3311 -133396 -133469 132745 -260630 249524 173964 -84546 14088 392728
23587 392728 332878 221879 62888 103079 17800 -1117 186914 -126321 -244998 -264339 -26055
23575 -37013 73945 156576 -131678 -151639 -483125 -195324 -32267 -122635 122963 -303927 31246
23563 -64665 61629 -101393 112943 -125261 336276 -257515 183812 105878 122580 -47762
23552 44970 -31975 46251 -154790 40116 132849 11872 -295143 47591 292937 -324673 -14359
23540 -96377 -223514 -196817 188617 178615 -205636 -197320 -57985 37929 -84520 268047 -164291
23528 -34639 51217 7646 -120114 -198555 263557 -145223 174443 -58329 144777 258235 137948
23517 137948 152861 65151 -197609 -182573 -257593 12300 29103 -66959 -310933 -52397 -38371
23506 -38371 -89233 -101023 -325245 105627 -116354 -53279 570395 118156 -159863 54568
23495 207005 199474 -227483 373132 -246144 107018 3672 -329879 -73867 108955 74808 256072
23484 256072 227071 118264 492223 158727 -128775 221211 25728 -59719 68061 -322968
23473 433233 150547 -85696 61646 -170757 -119579 58893 82664 84174 13383 60007 -30487
23461 -97839 72693 -147226 448049 -156371 -12156 -78362 82931 -373476 268580 39145 -189752
23449 75061 -93475 -168641 -222723 -109151 337868 -144200 -21208 -47852 67810 -100886 93976
23437 -156094 182201 -249371 19795 75639 42105 149094 -448011 -25385 -271760 448996
23426 -96880 2965 23960 -15842 172838 -194923 187629 -94738 -110310 -267752 -171220 150777
23414 -32086 -25430 -112135 -138461 178524 -143521 313313 -255310 257900 -150809 73205 -106382
23402 -57440 -28947 -43140 -579992 -104780 -38350 -11846 -170974 -199778 -27877 -270512 78930
23390 -151420 -67199 -354387 126373 55103 286819 286541 -93159 -69921 115891 153275 65023
23378 -75969 -113416 69047 362276 63013 53898 -163962 73141 -45751 -60833 162399 -67904
23366 92707 -97858 -224792 -189677 -179337 -81086 232737 -161566 401408 -74168 121998 -58871
23354 -28914 288117 11093 -237048 109330 -145710 -94247 -123470 -84390 -118295 -99842 -14955
23342 79455 -194122 -221862 328926 -32069 -41127 -71325 17193 -62847 102785 90747 -78545
23330 505 -68348 -252777 -384785 27861 -52006 -526326 139066 -178606 -178676 20722 193884
23319 193884 -85900 -34600 39209 160934 -232220 -78584 51867 -82290 -136866 -213001 -110818
23308 -110818 -55701 -148187 -175279 47247 -230651 -91656 -69216 -71967 -188976 -323348 -57623
23296 81657 -43193 228604 73030 -215361 -220823 -101377 109990 -134939 -4408 -210606 98390
23284 -3790 -379306 94346 -53772 37445 -290765 -273385 -293335 19847 78634 -217939 -283067
23273 -283067 -204743 151641 5723 17486 -60533 -172302 -239505 -2074 -202909 -435894 78185
23261 69331 -299200 89302 24426 -155292 -42249 -131744 137640 -171050 251835 -412383
23250 232471 -511405 107912 -50734 -45319 -75100 -83940 221807 -183414 326650 -249318 -101943
23238 165566 307937 78864 -147616 -72340 10889 -81079 -165182 -5227 -93981 115788 -44487
23226 -7504 -291057 260312 42537 154213 -30722 -141902 -95463 -90227 165363 106545 86395
23215 86395 -149166 -21140 69002 413718 64301 -353189 -13785 -126816 -90327 133183 -152936
23203 -9219 -31507 -157635 -161338 -73243 -181109 -362414 -4381 18542 123625 134800 70232
23192 70232 -25919 29556 313289 12071 230384 11664 -40058 399772 -124211 70468 -88468
23180 77975 -131348 -276498 -92084 9367 -87760 97736 281667 103046 -25297 -51915 242368
23168 -157919 64783 -22612 -110722 -224208 -24320 108139 -93731 154055 -74054 136737 80248
23157 80248 -135904 47839 132097 -77324 133438 20179 20548 212744 111465 -28109 174398
23145 155474 79411 338482 379200 -119643 -219564 239625 412061 136607 16695 -202043
23134 -30598 120704 -201877 -327141 -84076 -233737 346129 175897 108646 530605 -71306
23123 82236 173602 -12743 -173810 -98298 149039 -181339 -148412 -62554 87340 -238733 -15634
23111 383491 240082 45652 -50154 310152 16752 -223533 -98089 -362931 -249338 -43591
23100 196138 -59864 126202 103517 -213640 334960 -119872 109921 -222999 -289077 122714
23089 179846 382082 -57654 230204 129466 97844 -88189 -411937 -276750 105851 -211696
23078 -429849 -67150 -29334 -61824 62742 327768 23482 27494 33896 -48691 198523 40687
23066 -304271 35215 -286172 209025 -96417 39526 12320 -154162 -118400 213255 135497 1450
23054 -110131 -133990 -123754 -142515 -99173 101931 99819 -77617 122276 -208458 -69654 -32730
23042 294589 -268289 20372 144600 324681 4645 -352811 64361 41559 339238 24740 -435025
23030 128327 -54990 296574 27897 -5932 151854 -39273 -211271 -83732 40501 57476 -32020
23018 -115657 -206447 107911 -53820 -16375 -99694 30478 106908 -25438 -85701 -282670 -290914
23007 -290914 198324 -94768 183647 115872 -380930 -244681 116923 203073 -35183 108457
22996 -116658 -174613 -125043 -129338 169879 22275 107812 366482 -365245 62897 -320522 79640
22984 -471926 117975 -77904 -105828 -208452 -432774 -347113 -138822 85211 60295 5607 -194681
22972 -356713 116257 66874 53655 -137617 -243312 77414 58300 -225301 -180037 -221268 18222
22960 -197831 -70965 -96652 -10562 -180244 320629 -443302 59549 242854 -265215 -317883
22950 -317883 -8689 2924 253175 200300 -137648 -288647 -276972 144989 52241 -68050 -75051
22939 -75051 -130743 90756 -175062 -368717 312571 -269221 -72544 314922 102775 175629
22929 175629 116404 117180 -141150 -266220 360302 103524 163069 -124630 -287151 31266 118242
22918 118242 79196 144006 -57413 108678 78654 236160 67081 8955 -224873 -70771 94568
22906 50477 -182266 247260 42224 194948 56990 -136937 229528 61480 -308916 38168
22895 -413224 -71701 213741 -75839 -435553 378484 83151 66761 -200228 9466 -30117 -268255
22884 -268255 -273172 237714 244902 -196040 -34387 110381 -410912 10154 260626 -98215 -156174
22873 -156174 -27741 -126981 12530 -94531 -229127 -95758 -175731 130652 93118 46328 18359
22861 -385722 5321 344726 308298 -209661 47424 -151890 -270557 -159137 296260 -210811
22850 -76377 -156772 -46984 189180 25885 177243 316906 -147559 299124 254457 -61768 4627
22838 170894 -106066 -54995 199547 90833 121215 -259070 119189 -39881 -82010 178634
22827 -183695 -13230 47765 121582 -82285 110226 -110762 70231 -73885 69717 199849 6912
22815 -196821 72739 -171975 -56715 -1729 -286669 -47300 141858 -41172 -46751 -118103 276334
22803 405592 172699 -119613 -146730 -41093 -45450 -78788 -87050 -28113 156989 234691 -182077
22791 -463749 -103012 66818 -6450 139784 36351 -332627 72690 122393 -113027 -383063 -294066
22780 -294066 -134629 -79382 274686 47784 178842 -135431 -99495 40300 155703 176743
22770 176743 -115876 131315 -5745 109793 -21789 206297 16522 -110634 -414977 -49919
22759 -143873 25833 -290583 -148766 59507 180130 17812 -72922 -89422 42235 -81266 471166
22747 -27364 -115698 -302764 191704 23936 79381 -337385 178565 -114599 -145037 -62432 36842
22735 92324 1631 -160317 -79512 557 -341027 -47448 101393 56770 33428 -190602 -255075
22724 -255075 -51976 -49966 -276907 -49506 28117 22205 -127623 164904 -43523 -63081 187417
22712 5578 -163155 -76233 -96996 -21838 -51786 -90707 -12969 -248565 -27202 -153489 -140437
22701 -140437 -109091 121368 175915 34984 137759 274144 -10851 -21881 -554824 -308033
22691 -308033 61358 -57570 213674 16289 -131746 -301544 75066 118591 351391 -14681 -236308
22680 -236308 -124590 -90693 116986 -137637 -259517 -55018 -72603 81512 -142002 -106109
22670 -106109 272965 75959 -87063 -140126 -67178 18098 7265 -63543 84587 -152791 78572
22658 -141709 -151783 -255167 -135273 34339 22782 -240180 54314 -28512 -230900 -368089
22648 -368089 -422129 98629 -97669 -53932 -403317 -200287 156608 49777 -181446 -121201 -253901
22637 -253901 -145333 -238967 -28885 -67203 90240 196286 -389971 -40869 -10097 -70978 -163781
22626 -163781 -38588 -150369 -77056 -11938 -210615 118986 -26338 -341184 85656 -48725 -71085
22615 -71085 249668 -195246 -214699 -96500 -328432 245825 -308479 -86985 -516118 -18115
22604 -150182 -126522 -56409 113024 -335895 -37536 82562 120977 -193666 -22789 -33739 -74600
22593 -74600 43403 67924 -201114 42183 49544 -185972 -175421 -45145 -119906 136487 47319
22581 236170 140222 -20686 202006 27428 -69289 -421739 22127 4541 203395 -73555 67091
22569 62550 -313255 11992 45644 25884 -269774 -123445 -94294 -164077 -134055 33640 141865
22558 141865 -172115 -16403 41704 -13231 109549 14790 -165013 -122462 70021 74882 -297900
22546 63308 196926 546594 33875 7865 -434780 203502 45846 -123860 -184586 179424 51984
22534 -8126 48607 312299 270693 -152714 38624 -30292 -168060 31820 62071 1332 104965
22523 104965 95231 -61921 -20327 -346061 -111740 -7529 -4548 -485585 -78674 48655 -206859
22511 -331732 -86034 -106263 -55423 -161674 -62104 -21334 -16951 156625 37223 -260886 216595
22499 133909 -389984 -223455 -103622 -116964 286713 36486 19694 -113469 -257227 79208
22488 -106986 116460 -116528 -520309 -236946 224800 -186730 -250385 -88562 -188404 -31996
22477 1907 -34886 -265850 -113508 -167640 191447 111554 -402549 202829 7121 39796 -79856
22465 -154989 65338 115859 -112799 -28461 168632 43151 -205742 -104675 -251415 -138027
22455 -138027 87860 126751 -11695 2231 -45562 -227369 -79569 -231802 349504 103347 -8900
22443 -43169 44633 -101363 387325 67178 -2858 278784 155562 -132544 -298889 -52503 -18282
22431 -47701 65857 -186094 -473290 151407 323810 -16992 -372720 -351730 -166537 -330906
22421 -330906 -47775 -234216 -56811 179269 749 381607 -162397 77949 -32073 192746 -271015
22409 -231817 -199286 91538 -214409 -79060 25542 246175 281627 58501 -378250 -91166 186189
22397 251 -17256 244018 141127 371756 -105696 35963 -264572 -93432 144667 -48005 -389348
22386 -389348 -50652 -38091 38007 333917 173850 -147141 257300 -122557 -246855 -188979
22376 -188979 -282199 -322927 197050 67736 23630 -171918 198069 450386 -60451 -284889
22366 -284889 -75634 -329192 114391 177218 -1296 -274772 156108 -152289 -544883 -229940
22355 10530 124090 -179465 22717 -82867 -333895 -43696 -181863 35940 -75703 -81754 -110068
22344 -110068 167084 -57749 123196 -126515 6065 -12844 36700 -395856 155870 -157081
22333 -208054 186811 88807 -4666 -296958 -192587 75411 60653 6324 -24681 414799 -20781
22321 208122 258476 221791 8488 -78729 195260 -75976 -276122 -195111 -185604 -4421 308450
22309 52756 38092 84476 152183 -189706 -313885 -174009 116940 172683 -68667 -288846 -595873
22298 -595873 -56715 -146929 179730 -108072 -152756 -130340 2479 -87848 93695 -200168 -80048
22286 152223 -77646 113222 -273078 284832 17634 25639 72690 125876 -133142 -267258 264924
22274 -206175 -181011 -221400 254444 329563 67978 153173 -227187 54876 65661 -250530 -195094
22263 -195094 287879 -1559 164797 61900 -266445 -29810 -39240 97463 -212430 115236 -136755
22251 -311993 -94405 38507 -159426 -172225 -322549 -82997 120559 -192752 -112966 -266022
22241 -266022 -266441 323230 167398 30499 -69097 56729 93683 -12852 105699 101968 -118691
22229 282083 -255249 172398 -200978 32664 -207732 63233 -33216 -47011 -229757 56321
22218 140229 196285 -58326 -58457 106868 -176961 112053 8703 404403 157996 -81422 -97838
22207 -97838 -12679 -280405 -366628 1078 -9979 -34998 226351 20291 219561 44844 -440273
22195 -302024 88233 -21933 -24021 202831 -293337 112639 66284 -337045 -324677 -342547 432761
22183 -399201 92050 -131601 -251042 76638 -337473 -204097 20317 115252 -38645 37840 126382
22172 126382 131683 108624 -264552 -126608 -123953 190783 -192109 -351419 -72154 -17151 -28321
22161 -28321 -241032 -221463 261105 -125697 -298662 42853 -240143 -141945 -158930 18448 -320218
22149 -101935 -389429 73189 90900 -53168 172067 -22 -2879 -60182 169162 19522 -53727 -146521
22137 -146521 85823 77259 171290 -71834 -112243 -21854 -1300 2280 16625 81546 -208297 -228810
22125 -228810 47254 -146950 42876 207588 -100832 119106 -78434 269396 2857 111019
22115 111019 107355 -150525 -239008 383071 -13586 52168 -270485 22602 -176531 -34291 190264
22103 -16462 99972 170938 326184 -78567 -108171 -10090 -495899 272247 -46726 -226147 -256
22091 251 182661 251466 234139 267876 41403 -49885 151075 133756 188732 -198849 125661
22079 -46579 -38602 -223283 8334 -182193 18324 181548 -97365 -153653 -179664 -540746 83621
22067 -289110 93396 -122221 -90528 104646 -22521 116598 65028 16601 -182111 -208544 -146760
22056 -146760 138504 -59296 -117700 154132 100730 51197 -83008 338608 365872 61000 24832
22044 34794 -161505 -457158 -117567 74072 -93371 184058 -74801 43374 173324 208115 -403555
22032 104916 -68130 9133 3762 -237461 46638 -222784 -12876 53268 120556 -121498 -35771
22020 31706 9049 -295780 -413492 86373 -369857 -251714 -313776 -224948 -382 -224304 25263
22008 358011 -254623 -249195 -461375 -11841 26015 316025 115771 -260590 41623 78816 -293991
21996 -219192 14201 47791 -49631 7692 -44003 -327246 252648 -99572 31508 59955 10282
21984 -179851 -40181 55940 -133734 -161494 16689 -11168 -150025 -106520 37986 -125784 -77085
21973 -77085 189927 295943 -178701 280911 -184151 77376 -35184 -201291 -244624 32269
21962 -49645 -200021 -425652 97722 -512481 -412400 199816 136520 68110 -18393 221267
21951 229605 24350 -54701 -86642 -158827 -187172 176283 66170 167913 93024 54337 -9900
21939 201288 -244178 -176268 175834 -3237 -138232 -366892 97497 -180770 -292012 -25317
21928 -120769 -42609 39006 -191258 48134 -78243 39527 -100560 -291437 -151377 43267 -8718
21916 105684 -47748 -119196 -12907 -124886 50555 -303449 -282308 41117 -1068 93635 249868
21905 249868 98772 267698 411067 -192200 -242566 -3165 83574 32507 -338437 -4235 1160
21893 -270587 60888 -8414 17946 -20520 -171555 19384 192593 -347338 117475 -288102 -132484
21881 245310 79645 -162174 65726 -303507 -282174 39636 -88249 -178627 220638 171276 64401
21869 6834 -127582 217800 27281 -245437 -116033 -215757 -139299 -241089 -342963 -126848
21858 56032 -77437 -160518 162515 -195005 26222 -79616 46040 433286 224593 -222563 111092
21846 209823 -299587 251123 -251277 460407 -145693 -276877 282747 -184444 -25604 -31692
21836 -31692 105277 -123071 -111798 -69621 219547 -20277 -214415 -239126 161257 -98390 -105477
21825 -105477 242421 -163520 318634 -50575 -53959 11750 -131300 3535 144194 -525213 245582
21813 111823 83695 -42923 -47281 -120659 -229222 -218405 -1259 64512 26159 9719 -88152 34813
21800 -126169 130177 315235 83741 -170927 -102549 -211910 154292 65099 -131832 3960
21789 -108169 -148955 -108108 -73057 110904 -82083 248163 -215644 -390765 -32457 314668
21778 -426268 -11370 -50810 -121914 -59815 -38295 -175755 -92817 62756 -283589 -38879 11384
21766 100802 113449 156208 89746 -179406 253027 -168345 -194016 -148726 -147033 44547 -137237
21754 188677 168490 120190 -122595 -115183 28361 211271 31365 -102119 -136448 78406 -296844
21742 -65260 -108944 222015 75337 -94016 107685 357372 -104447 127229 -51051 -150907 -121709
21731 -121709 -124142 -152193 -518 -135117 -228384 -63097 139110 -292193 -155775 384426 -29450
21719 -141741 134131 -150362 -68279 -133661 -191138 58238 -112138 267587 32406 -259943
21708 -193785 -56667 -32832 -270515 -316799 185641 -116995 -263398 -43927 199346 38272
21697 172999 -155356 37189 70638 -200551 -326177 226037 66083 76359 -248188 58392
21686 -285177 121156 -200698 -46764 -26020 -92457 -72222 -168285 -109073 54009 -122950 -132374
21675 -132374 -46415 109516 -42013 -131067 50890 -218079 54333 230785 461282 -8403 -131964
21664 -131964 164103 -338372 174939 -34989 -177626 -116253 -203647 33217 -74292 -205923
21654 -205923 7858 -173976 109112 -454540 278850 -23213 -128425 -64272 -60207 -368805 -269043
21643 -269043 121226 -57382 543726 -82997 -168620 4181 287542 -128475 -17316 -294141 165028
21631 155618 -345470 310980 47450 -41991 106952 -91639 -582780 407775 54583 -73725
21620 -223710 -278676 -102134 -47084 -153768 -150613 -207473 217022 -275075 97019 138414 74282
21609 74282 -67889 170979 -52768 -154844 52995 -330838 53205 -173689 -191 97524 -214167
21597 -77492 -193354 239817 -11586 -230801 314764 -45558 114842 -120954 -25253 -172623
21587 -172623 250635 -270424 -181023 91005 109045 -8696 -248693 -32798 -307900 -256051 -134334
21576 -134334 -266085 91817 -56882 25975 -131812 60228 -135742 205031 76875 -284473
21565 -1115 -157566 152245 -15120 -196209 -37659 43131 -242943 -383033 34142 -16931 -275310
21554 -275310 -339169 67417 -337860 -50598 63401 -149562 119414 137989 105999 -26699 -9114
21542 -214257 -130210 -94489 90863 -62409 -161038 -27282 -364035 -50240 -269970 -61721 38166
21530 126132 -230363 170365 12250 -17658 93954 -158892 -198011 -7206 72810 83356 -117647
21518 -295667 -146009 -43635 -336743 -191687 -321311 -79068 69074 202370 -97721 -24613
21507 -343923 -94351 -71137 -44667 -12497 238360 -87597 249626 -14145 -154907 178146 -262850
21495 192457 -143234 -185913 -81035 290114 -184725 270250 -569796 -199729 37964 -2254
21484 -169242 -154316 -181212 -247871 22417 -384892 -1130 34971 174116 -148251 -105628 -13684
21472 -273429 174125 -14507 -130275 64371 -97537 -137166 -24076 -33166 -366848 -272753 -175269
21461 -175269 -175768 -449877 45011 35795 -279113 -308100 219063 -186989 288154 -155302 -153475
21450 -153475 7664 5952 57004 -82722 -59562 215361 -75026 -134458 122383 -98049 137983
21438 -137540 -249590 -26138 79667 67973 -290884 343680 30555 224117 104013 -197891
21427 -292484 -17665 1869 -222987 74210 48931 236131 116865 201736 -15811 -484770 234120
21415 8869 373287 170751 138918 -133238 42248 -418043 -240594 90932 -286815 -145618
21405 -145618 8556 -67804 -227974 -160644 -325331 -257146 64405 -253553 168821 -35339 -128093
21394 -128093 -72091 -172306 -35747 15723 -100825 -105493 224157 61950 57797 140536 -240602
21382 5218 -132676 -205302 -439752 217476 -179121 -337379 -85600 -91286 -96205 -7423 183019
21370 96828 6833 148092 -275615 -264741 -308407 449518 -118922 -129043 -52208 -154923 -22007
21358 -500375 -132750 -67728 -87444 275102 -130135 88824 17784 -84356 -379565 -166709
21347 19602 -87761 -26974 -144324 143171 62259 -117007 133683 329485 -95807 66752 -246883
21335 -51600 45463 207063 -339644 91331 -107867 -176136 293404 79844 371886 -210692
21324 -218716 -198074 -90941 210582 -321844 149397 -153579 71696 148016 -1021 100334 114705
21313 114705 12939 -266220 -6728 -412952 -190698 -436011 -120327 -118088 164858 192775 -248330
21301 88256 -210633 487687 -139307 -76612 -98808 -102565 95483 149579 11175 -92178 59163
21289 23505 -19478 261808 -89089 110857 4138 -35855 -128334 -119061 -122981 -18693 123321 -12322
21276 147243 128490 -15816 38375 174593 266254 -130048 -178683 -232407 -378692 154707 102910
21265 102910 201805 144254 -73353 118707 52154 -72752 -123954 290793 128505 111009 4823
21253 -87163 -192302 -36199 -202212 -166016 -233740 88384 -107724 -90367 -287202 -301759 -271295
21242 -271295 70544 -168894 260447 190400 69661 -16138 -174672 -6191 369811 -142251 264336
21230 -99898 330005 -94568 51616 -41232 27537 -378784 203293 -120389 -326663 -165160
21220 -165160 157377 -289714 -66198 141331 -43434 -84363 -15747 -174284 164910 -397986
21209 -104507 74164 -100872 350307 -172304 -181370 -235533 -13207 -148847 111371 -205841
21198 84000 -254613 -84051 55552 230763 11594 -284133 157377 -62992 28888 212780 -54261
21186 -224401 308532 -296278 -334450 -105741 -323942 22805 -31071 -407045 -177951 -142533
21176 -142533 -153582 -265569 -263574 32020 -130728 -105030 142627 -112457 -171101 257728 -172085
21164 71467 -60126 20447 -39936 326234 -247858 -211700 -157901 286493 -78323 31134 2295
21152 31784 -288743 123607 -119036 -226100 166792 149245 -389252 19529 137818 -249843
21141 -185403 82947 -372623 187271 256242 197124 -58863 -46231 94936 -205253 51570 6814
21129 -177312 126641 155820 -265186 -218415 -346712 -60530 -52846 27296 -8586 95349 -342810
21117 26601 132719 -439600 -111444 50588 -208095 -149373 -293982 -196243 93721 -430383
21106 -148919 -188750 -130058 -99583 -191655 -43365 223124 91230 323408 331761 -202564 -6979
21094 86254 228314 -182126 -200249 -335132 123007 -295110 -361015 -100696 -211640 -70177
21083 -20131 -148391 -41551 -43461 -97332 -83935 124527 168953 -50320 -25144 -239397 -48457
21071 143686 -48175 -57997 83374 -28226 -294299 -7361 2778 -339800 -260756 -143696 175871
21059 76878 -49456 -131872 -281267 359392 -273427 -142241 100611 -72448 25137 -56951 -129851
21048 -129851 -261386 -170588 117879 -318586 140420 -60341 -300900 -71670 181175 -113504
21037 -161765 -61242 283161 20084 -168894 48428 -383995 737 -277301 -136016 -293795 -164868
21026 -164868 56642 -124362 -346374 -194543 46598 -6791 15633 91842 181504 33398 -328451
21014 -312 37082 613470 63441 -58599 -68820 303148 -12293 155146 -63280 -93718 187082
21002 101772 -150302 -16379 -158071 110666 -215182 147712 -417067 -194245 -141134 -107042
20992 -107042 -139851 63251 -91717 57169 -240578 83706 401113 188595 101610 772 -197688
20980 -188063 102937 -103696 -25724 -201400 -4015 200891 60568 -322893 -97968 325184
20969 -63077 133914 8328 -113890 18732 110156 -24170 -106958 278342 -166140 144843 -123902
20957 -210043 88115 -279785 370204 -53338 -87546 13189 -252416 -117978 287230 -50132
20946 -136314 215732 -40426 -235334 -158041 175058 446896 -40639 67789 -4359 -198403 -86030
20934 -353421 82037 14570 -247429 139291 105855 -71502 -257613 36931 -135588 181181
20923 15958 -152676 -156087 94838 -3250 51283 41951 -226410 117177 -206953 -306858 -12324
20911 -36411 -324822 -185650 378803 -54152 -43724 -194686 10972 -72003 -171459 259781 -227994
20899 -127812 352611 86490 45365 24767 10283 42512 -84379 -44455 -95120 -35842 198108
20887 -29832 90732 -62672 -30188 -250142 -136356 32323 123218 136844 7923 -270849 -90190
20875 309510 35094 262750 236440 -94586 -169512 -65148 26998 76459 72377 110315 -52228
20863 439455 10773 107404 -302405 280367 -49399 223962 -263082 278189 -52074 -86893
20853 -86893 -227925 -245184 -1850 -217273 -220696 94723 -34346 -174777 66409 -110059 55158
20841 96675 -7637 51703 -27241 -162127 -78390 145206 -219550 -219389 -249303 -108503 -386607
20830 -386607 -66076 91661 -308472 -128436 69489 -340310 162361 -191415 300633 -189178
20819 -89646 -46142 -123707 -332603 56333 -82001 -150071 211617 5586 -70946 -95505 31858
20807 166107 -77918 -443960 305150 -154921 -68831 21400 -241959 -115603 -77728 -28196
20796 -108675 -142961 -247470 -91189 273016 17250 -61429 -321614 -32 206358 -15170 -110604
20785 -110604 -381450 10511 -94314 295793 113109 -344287 182914 -217846 235167 -57358
20774 -146557 119375 -144112 -147182 305403 5134 112187 -266935 -2304 -49873 -44038 -40726
20763 -40726 -370013 105886 -88129 -67995 90563 147502 43214 -159886 -270725 -159426 -260198
20752 -260198 -373550 -185913 70593 253921 62565 -109137 -216496 -178831 -135066 -18519
20741 397730 141135 256590 -333685 -18893 -65997 -68002 -200869 -161109 276434 60340 -233877
20729 151376 -434090 -51850 -189193 -108707 46419 6529 -328921 135867 -325768 -128290
20718 -11697 93249 -82398 -145489 25413 -46163 -204715 54522 79827 -281965 28205 145810
20707 145810 -97235 -89526 -64692 -66300 140689 -192595 -19561 219100 -99121 317108 -180693
20695 -228687 211198 -30747 -66589 135042 -151220 -123511 -273343 55683 -239929 -325788
20685 -325788 -298292 130624 -208635 -30537 12576 177289 68636 127369 83436 92860 -124996
20673 -218017 6991 -222438 14480 -210792 -31919 -90172 44251 -16315 103862 59906 -36259
20661 102515 -183961 10109 -238905 171459 -64 -138292 -421810 -46815 -282350 -63071 -259355
20650 -259355 -21900 252452 -169114 146129 -84696 390118 35096 -170513 -72124 -387324
20640 -387324 -91912 23344 225222 31750 6917 -429108 21077 -92010 -21490 274573 -35042
20628 410683 -235228 73497 -12298 4876 -223820 61770 263695 -44275 -131539 -230234 58300
20616 57857 -305541 -151624 -146758 -326152 12617 138552 -210427 83391 -116846 -26311 44884
20604 46053 113616 154524 -202145 -51264 -4832 89418 -110548 357690 82800 26591 262318
20593 262318 -19796 -94132 -11872 -127724 208717 -19049 317063 18326 85535 16779 -5292
20581 252271 156062 -114738 -142013 10702 -330600 337626 -338529 -134229 24557 298610
20571 298610 2684 -95777 -14075 -102577 -57952 -188872 -209341 -54592 24191 -41117 46455
20559 43417 -82256 231483 52122 -105147 188254 3358 -273563 -75054 -69063 -322761 -80486
20547 107251 508894 -139357 350792 -148415 14850 -178350 -290757 -66988 2251 140240
20537 140240 59312 -240920 -125845 -330635 -47537 4038 -59499 -211345 -449723 -38464 -62140
20526 -62140 88914 -103432 -86980 -77756 141574 -92258 -255545 -225035 -286172 -36229 -39376
20515 -39376 -276136 -41911 -223749 -395305 -3914 -182341 -38809 2359 192716 -192523 -239199
20504 -239199 204428 -96295 37560 -240135 -130103 -8667 -12411 -79635 -385797 50878 -287318
20492 74848 -90190 -88321 120367 100018 10899 -363718 -73121 -279877 184998 150629 -41574
20480 -118 -13475 23694 55574 154882 -113985 -28310 -220729 62813 -32959 42903 101448 -20901
20467 -79178 -4290 200525 -373731 106246 -16153 317138 -461592 33417 264080 -73123 22369
20455 197705 230705 103798 -52296 -194328 -52024 7624 302169 -176087 8629 410632 -175879
20443 195184 197463 78649 47387 71914 56494 -336899 47965 -223650 -319257 -250257 -393084
20432 -393084 -151120 1071 -92980 158785 -1325 93452 -73242 -103781 72067 -148760 -35323
20420 -297267 -281379 -172764 141653 -119572 -209517 -189532 -130223 99034 -158741 253308
20409 -147763 -202237 125389 -67916 -42024 -109979 276262 106908 -151072 11717 74300 4429
20397 46414 373347 -93309 -247175 24335 -166542 -399725 -48091 479095 -213307 -69412
20386 -343060 33171 -85011 219178 -34939 -70750 -281110 -101623 -30647 49061 168057 -427576
20374 -160251 -315211 343672 207662 122711 -247508 -53088 124096 -307838 -344745 -209151
20364 -209151 -630615 -262711 -102289 35668 43389 -93164 -28315 -211449 -115410 -387379 355643
20352 -210416 -36685 -194617 135799 -365326 -295289 77228 -36607 -43126 -292154 -144354 -213787
20341 -213787 -206115 -11984 -146989 125013 71526 -63209 -46348 -83979 272651 -90382 -277050
20330 -277050 341162 -276495 88883 -232580 37726 -8153 -233613 222015 -29244 -180876
20320 -180876 79343 -55130 -306387 -319570 -122591 -18433 137100 109467 -112748 -18229 -275603
20309 -275603 -232850 -108859 11312 -114704 266783 -229930 -496311 -255680 -134581 251711
20298 -103005 -121178 -210549 312642 -56826 117954 14538 -116602 35338 -56681 27799 -395367
20286 -148778 -347775 -221796 29522 -99830 26503 -76641 143529 -22064 16079 12332 -228609
20274 126437 -36122 -35401 -125790 94296 139121 -191010 -16706 -304279 -215658 111190 18683
20262 22059 -107058 -702836 -41022 63364 21247 -74649 -115979 45565 -198625 -377204 -340598
20251 -340598 235467 22246 73538 80243 115011 -144354 -71173 39939 21275 153473 5134
20239 40655 -100366 -273590 82286 29441 -82378 -47032 244423 -221510 -217787 10775 93517
20228 93517 -377430 -74695 120776 -161430 -417855 56407 180488 117626 -268831 302610
20217 257750 -290222 49706 -182355 94728 -10222 -138110 106970 174081 7657 17503 -83270
20205 26772 -31716 -136677 -90879 -11120 183613 -352670 -122004 247598 -223353 -31899
20194 -29345 366106 -112515 -32075 -136119 121561 209896 161124 -109167 -421939 -84288
20183 429391 -154798 24855 186592 6133 93423 249086 146352 221489 234048 58072 -22651
20171 -433051 -218269 -50214 35544 -311950 -50382 -162119 -56529 -325932 -296251 -467878
20161 -467878 -190907 -80328 98613 -50757 -28345 33747 -489213 -393705 9804 122253 -323493
20149 -137214 -59949 161084 1395 -56571 -153924 -64297 -3100 46585 10242 -198195 -319600
20138 -319600 -211452 -231930 98817 -18555 -93974 -157766 70836 -154054 -49982 -249747 -223707
20127 -223707 -166706 104024 235775 -116933 -230151 37000 76143 -13351 -112302 -36840 174340
20115 55563 174583 -286120 129427 -236524 -146744 90398 65318 -206299 -209798 -167005 61991
20103 19599 -181194 -53437 -271652 31562 -272822 -90126 -34991 71818 -203022 130681 -251893
20091 -429739 -76747 32372 -199295 -305006 -45536 121444 173642 -267645 77056 -23706 -49567
20080 -49567 -297648 177167 324238 -65644 108823 -99773 281408 228755 -255563 42769
20069 -367733 -26367 325173 -150691 -81403 -108597 279185 92559 -178420 130580 -160103
20058 81865 -113708 90247 -18437 -93431 -105247 47772 -60273 -4178 -70919 -291982 -152004
20047 -152004 -260868 -16213 85195 148275 32337 23849 -169579 -270662 -51944 -242115 -136544
20036 -136544 20004 285966 66639 -31513 19819 -150666 -142281 -25562 -171550 -15581 176143
20024 -201707 -145338 -36929 -97174 -111360 -141770 221301 -164435 -232740 141367 175995 9412
20012 88273 96797 168474 -219854 298941 155784 -80272 69161 163621 186981 -54487 29222
20000 266638 234923 -160704 -147288 -205968 -154427 39192 -240380 -256486 -7541 109012 83422
19989 83422 -78478 -253639 303766 -3769 172297 -100807 -27384 181456 146333 -368193 196426
19977 -87131 -92378 -36465 114836 178815 115446 -80914 134995 -40260 -107807 49055 53758 179907
19965 179907 -15899 205161 -186182 61756 -222629 -176881 -79240 -299573 26816 -51794 -294070
19954 -294070 -245190 -213130 -133008 -77144 -74291 -5150 -21580 39513 57282 -103802 -263476
19943 -263476 147796 50228 134600 -305494 6154 -120944 -232816 -254976 -64350 -120657 54493
19931 -150435 158636 277210 -28413 -142366 -108238 -63459 12162 309728 148778 -310629
19920 40319 -149870 -168433 -114144 -118963 -66357 -111747 34872 -22267 -178025 43027 76735
19909 76735 -278522 -172208 114822 -33286 -174659 68729 -215629 -231449 -150204 -128705 -63291
19897 -115213 -93725 -186369 -57062 -295220 75935 -292619 -344538 406719 -93344 -453783 44332
19885 -214549 -5449 110122 146847 41089 110975 23537 39235 -21900 28818 178673 342586
19874 342586 -18450 -188218 -58499 116050 364003 38705 -200201 169041 -198908 -217208
19864 -217208 59062 -17811 -347523 47751 -51079 -278425 -72684 105653 221976 13157 -88051
19852 191028 -58156 -189784 -244774 -179832 -232074 36668 -178401 -266966 -253101 -101349 161766
19840 -266782 -348817 262612 332757 -156192 -239689 239454 -234405 -300211 -129517 -262398
19830 -262398 -272322 -65500 -5724 653 -36220 -549248 37164 173266 -355032 -91020 -83722 -17953
19817 -159354 98615 -194782 17909 -367640 -306086 -115682 104804 220347 -59658 84926
19806 -68740 -33535 -69068 58261 297487 -182953 33951 -143364 -522 -114499 333462 27057
19794 -25054 36973 23774 17767 -171780 228607 79816 300390 191705 -27510 192901 -223351
19782 -210642 198174 -31785 -14016 -247670 72102 -208098 -259023 -92339 -41886 -217814 -137432
19771 -137432 -150283 69468 155479 80309 34208 -11058 37402 -143045 -433029 -115003 67933
19759 -209348 -266321 -30591 150939 -207332 -1004 69526 -224743 -152664 -155381 89539 -68709
19747 -20791 -376805 -84888 221342 -98796 -14394 -265629 -22040 -64696 -26597 245684 -131783
19735 -44915 254091 22947 40266 -232669 -51865 -270027 -29485 -87941 151456 -134673 -29497
19723 -181793 145136 -264392 -194790 -152924 -75011 82223 59504 215813 -384341 22287 -38217
19711 51868 -202734 89560 217029 16685 -377137 -89919 -79844 -130884 89528 -165559 -141966
19700 -141966 120233 -39678 -231217 -72590 -49828 -92592 141883 19818 -40889 -189004 -157931
19689 -157931 -85683 -89940 -49831 -235244 -122 -180118 82728 -238500 -88451 304429 -107103
19677 -107560 264526 -68694 -71906 123006 -103576 56119 -102593 -27938 60413 -225540 47177
19665 296525 -396047 -78102 -107776 -383327 127952 175637 -144580 22413 54153 25578 49049
19654 49049 315444 -175796 135556 -206752 -149826 -202660 -249992 -189043 175824 -73119 -349634
19643 -349634 -206160 178392 36878 -275776 360281 -12951 -164052 133882 -114997 -3610
19632 -67596 -211747 105859 -151670 -313624 46876 -85984 109239 126377 56923 -100311
19621 -261993 -37006 -257529 25221 -64779 -390516 -293750 -20181 -10539 -176190 32830 -96304
19609 -180694 -107040 68279 -190533 -183672 -266346 129659 250159 204424 -34369 325308 -30273
19597 166609 -51753 194305 69635 -332830 62345 -59589 253482 141100 -127925 134097
19586 126195 -20284 211805 -306592 -70790 208080 33526 -91288 -80500 70217 110032 149673
19575 149673 -80251 -21351 -184387 68779 38841 4693 189928 -121564 -61178 -76140 265236
19563 -355043 180068 -165713 20130 -134721 151926 -159126 -300266 -249216 -208668 -144697
19553 -144697 254683 -409172 -112854 198480 54 -291989 273135 -63922 -184547 -21182 -378213
19542 -378213 -143658 -189432 -323079 70210 -23293 -39979 -57741 -26523 -97360 -60064 131837
19530 -325759 -191157 92591 -141365 131178 -159968 -43830 -104115 -16853 -197465 -244685
19520 -244685 -101907 297608 2565 107663 -32335 121861 -113199 81321 -131104 -63320
19509 -184767 319316 -187652 -52999 221648 -44313 119322 -277062 -162000 -253384 -79011
19498 -107195 -173064 -110129 13709 -63183 -540834 505932 -561738 9989 823 275391 -1139
19486 -230059 148565 130862 364386 -273951 4164 -346126 101221 -259085 131156 7304
19475 -96467 -40732 123954 -170920 9364 -54940 -146652 8787 -653310 72122 -216687 -82839
19463 -14196 -249543 -103966 75634 -289338 -224212 152501 89008 -206579 157447 430774
19453 430774 -304706 -210370 280238 -207808 -194562 109168 324328 -106636 111383 -378387
19442 -39368 -184766 -23657 -198183 -204085 97401 528822 -570684 -138866 -8654 -54146 -124700
19431 -124700 -60072 356861 258992 11000 132402 49741 68851 82007 -163049 -34379 5499
19419 -280250 -251142 36230 34548 15144 -66385 10009 90222 51735 98015 31966 -379531
19407 -112560 184331 38756 -356706 -226728 -74047 331525 -264008 173599 -302016 -168360
19397 -168360 151408 -42579 -9847 -499314 87274 -54354 345902 -85193 -80184 244199 -75509
19385 294591 -200445 -209254 -156686 -245379 276940 260966 165310 -146924 -3994 231236 -64694
19373 -96705 267615 -92096 -202445 41847 106209 -183357 -90411 -89958 -113078 19494 38919
19362 38919 -175227 -166298 163471 -1180 100481 -277918 -278378 -380581 -184317 -14307 -59453
19351 -59453 89662 15940 -63002 69163 11468 103978 -170759 -210559 372108 144534 97120
19340 97120 184074 -123819 -156633 11381 -178033 94410 34999 -159128 -166843 -428615 66294
19328 54730 10399 -168352 26052 213338 -77456 -27856 -63451 127367 -294551 -8871 126829
19316 -85692 -66635 -366197 -160335 -26046 -192749 -236334 -258608 -369946 -231751 -384304
19306 -384304 -120316 316796 49220 -29543 -16128 -98891 173023 -9992 -239092 -204802 126509
19294 -98008 -234856 -192563 -85537 66290 112038 -240444 -83105 90337 -40311 -233 -139884
19283 -139884 129169 278903 13371 -11278 -25468 -350657 -249377 108230 -143829 -340873
19273 -340873 -36734 77798 -150767 -326906 -184393 -207576 -175221 -321747 -109099 -229754
19263 -229754 -42368 -373076 -88572 -288296 27899 -215000 110224 339845 -285081 -95041
19252 93343 -148842 -236086 -24509 -299259 -179709 -443661 -22951 136702 10952 88487 -113138
19240 14215 -269579 -389983 -124940 -243098 -54275 32133 -508805 -258100 -334433 2313 73989
19229 73989 -150750 -457 -219855 105782 -21980 -333616 -224637 174857 334148 63463 -254816
19217 6262 -134644 -38917 236059 66305 -105240 -156841 -196088 -72158 -62188 -136747 185912
19205 -30929 240639 -249295 72618 -131993 160352 -307233 19737 -278935 13923 205741
19195 205741 177142 -55681 -72169 -307031 4842 -126437 -45857 -230195 205551 -112201 53932
19183 -10952 -53008 -285689 -11229 -144017 7987 -49264 92491 -13841 -138649 -59480 -110422
19172 -110422 -142444 -179688 130200 -121531 -53103 -7407 -148443 -153452 -153358 -160776 -249380 -3770
19159 -120293 -233978 201072 -55786 -229920 -70516 -160926 -219234 59053 199805 314279
19149 314279 -199107 -136812 258054 -53525 -242398 29199 86824 -197650 126008 160882
19139 160882 -252733 -206510 -180174 -88046 240586 -179539 100204 -74744 24678 125862
19129 125862 -9973 82472 -48080 -17728 -191945 164357 44776 -117684 105185 -183878 35658
19117 52521 -33192 124625 22253 -105815 -149055 201652 -227724 -45034 -158790 -124640 179117
19105 65076 -260468 -277766 159529 -11740 -22987 -153398 -4378 5183 -225433 -3387 -8870 -130570
19093 -130570 78630 -18552 187843 -22099 -68872 254923 -327397 -138388 -138939 176318 -243563
19081 221583 -183580 57271 -62161 -205771 -256903 316347 3442 58880 -206160 99267 244640
19070 244640 -32932 -511978 28883 -382084 -71636 155259 -163674 -23296 174258 -9088 -281051
19059 -281051 788 -234203 -252311 131472 14338 -247556 -167475 -108964 -64084 241913 -250001
19047 -218808 -167763 -30865 77526 19119 -48089 -312595 173775 297533 14042 301 -120054
19035 -137568 519432 27463 -344240 44572 101044 111781 296653 28966 241751 257977 -84987
19023 -33959 -35727 -16969 226669 -73883 52658 59324 -268457 -154820 128205 202455 24165
19011 136750 -125457 21561 86790 -21912 217307 -27409 -182437 -175195 102514 110400 191697
19000 191697 -329294 -50505 -250935 -265922 -84534 -499350 -36492 -36165 20987 -12623 -255973
18989 -255973 203060 203999 -171095 -101522 54338 -152443 -461827 81608 -69977 77660 331360
18978 331360 -268387 46585 307421 75663 64314 141657 9024 -241984 137936 30243 -79187
18966 -39380 55387 47450 121994 5738 -43683 -70997 -6203 -253697 32108 80727 176733 -245831
18953 -36723 -113332 -115201 -35965 -121179 -247147 118602 118935 179118 -91601 -197205 -274351 -145379
18941 -145379 86138 -222914 364992 -91642 -59601 103499 244108 -130061 103645 136134
18931 136134 59030 75723 -13784 -42021 -166922 -70453 -173573 4124 -176664 -148277 -192600
18920 -192600 -231344 -211835 7640 223889 -407326 -350313 8736 234368 -137873 154138 -92909
18908 -119658 -8567 -258911 -92186 179111 -141139 -230310 283226 -206723 267943 -8173 -117513
18897 -117513 156117 -28129 -84190 56440 93111 -25106 -244579 -228441 -144786 -274210 -292634
18886 -292634 -258112 -106986 14571 122057 204153 82043 -188553 13994 272466 186567 -73906
18874 244707 -254056 -1148 90538 -47039 -276072 -298778 -213851 -127854 -230619 -12788 49156
18862 -211027 306791 -172674 6020 -223882 -272423 -122764 -45803 133836 17559 -114372
18851 -36381 -236421 201895 -50231 -116451 -317862 5318 -73305 -16395 116081 -89588 45943
18839 -131651 -123125 1997 44387 3268 -274933 -222612 57245 -132652 -162207 -1302 -24731 250984
18826 -127920 -19441 -292145 -93006 -206318 207285 -216737 25604 97204 -41217 218184
18815 -131597 121979 -209451 148773 150173 213312 186712 194990 43591 -227912 -85223 -148590
18804 -148590 -161466 -279698 -49271 463764 46727 -143371 -187411 -246543 -437117 -7082 -72543
18793 -72543 158178 133444 -63090 -135733 -18656 164347 -93188 -266980 230930 -22651 -132864
18782 -132864 -203805 178106 57427 110092 -136968 5341 -44527 23412 -43869 -142082 -267129
18771 -267129 56170 -199322 55286 37535 -228909 -349444 68729 -81955 -190843 -119535 167176
18759 -413904 10243 -257422 -303504 82705 -73669 -190895 -92243 302691 -334555 -389793 -136096
18747 74223 -302879 -54817 -75228 -54958 122977 227439 -369847 -226630 -273886 -255066 33341
18735 -18352 35357 -26683 -132900 -53435 -369993 -141604 -297022 -223636 -112207 -67340 23344
18723 -177136 74287 23177 66864 -225327 -103395 243739 -192261 -133546 -153031 126874
18712 16865 -97067 -247388 334741 -307264 -176500 195483 40221 -77683 152353 -203097
18701 -220586 -220281 -8313 182679 219254 -165636 -197550 -1194 -3545 -26245 520130 -171628 -231567
18689 -231567 -91689 -187386 -276448 -139813 42752 102550 158996 -16677 -126167 -341461 -156045
18677 224124 -185062 -575429 250943 136705 4288 97909 -170851 -90061 149473 348334
18667 348334 -71258 -367875 -99686 11861 -39551 335176 234054 52318 -324223 11323 -106991
18655 75592 20460 -98452 220247 -312540 7295 290073 -198149 -162937 -104087 14421 -58271
18643 166452 -218417 66585 151505 -83219 -72891 37700 150192 -52329 118062 159027 185231
18632 185231 8917 148765 -344313 -200637 145945 48193 -84914 -146583 115708 -177585
18621 -231339 175073 -84405 -251778 215276 -100394 -142639 -202202 -101781 68366 39558
18611 39558 -104504 -170637 -80230 -210935 -259973 -177737 -171215 -291207 -27416 -63396 -73334
18600 -73334 134564 -57887 -32478 -83005 -89081 232339 147410 73227 -107856 -143642 52563
18588 -136284 -93902 -33532 -9275 -171874 -248966 89554 -264345 -87497 -396994 -222771 28566
18576 -106466 -199755 -145613 56278 12362 39589 -12182 25350 -337421 -74786 116090 -8338
18564 -278954 -90613 -128987 299126 -171946 -252718 -219476 -171184 -160788 18691 -84023 -96854
18553 -96854 -92218 9880 -301404 -88098 -20862 147396 -245629 15091 351338 -285399 151003
18541 -301694 -52457 -82191 -88777 -42867 27445 -305460 325509 -12360 326265 71207 -136865
18529 174297 -218512 135812 -267585 11060 -113573 -98895 192408 -51912 104312 23173
18518 -83341 125519 -56170 -121569 -155102 23487 -70492 365416 241812 -119222 39644 9 77839
18506 77839 353014 -250209 115472 56980 34691 98155 -524519 10421 -100234 -4562 -183760
18495 -183760 -258273 -288720 -250184 -222418 120152 -126271 -15529 -396497 -191800 -485235
18485 -485235 -280433 -2420 131710 -114047 -61321 -168683 -120318 79049 -119375 -251512
18475 -251512 -181892 338497 106406 447614 165946 -270288 -26700 48631 -35769 -47392
18465 -47392 13291 -112041 39152 -326265 -66548 -154910 -47073 179193 -128486 -54725 163285
18453 -118147 141552 7428 -394905 -336489 -158802 -353243 -99025 -74558 -280350 -9141 -164449
18442 -164449 -101872 131970 122170 413165 85663 -15967 424575 73479 171584 -15403 87672
18430 116499 280307 -58481 68137 -12702 238367 236966 -10400 21343 -116396 -237506 54544
18418 -262028 11217 -130916 -17949 60080 -233099 339089 75311 -63782 331 -325586 76128
18406 168512 -8050 315997 -222299 -12861 -56394 24474 11636 178089 -30438 159536 -168355
18394 -14768 85472 -19210 -185996 209979 -21682 190143 -64625 -206687 14556 -97375 -82959
18383 -82959 -91274 -66373 -62626 -165497 -29929 -219332 116424 -79360 -132481 -17757 -245814
18372 -245814 105385 -182615 268730 74938 -135007 -17138 258101 -148355 61126 -51944
18361 94239 193490 63788 -201105 -33999 255499 -38596 -137231 -251648 -170794 -246727 -246468
18350 -246468 -246132 21465 167000 -177318 -201573 92608 148589 -324199 33292 173137 262039
18339 262039 61420 131277 -52394 -228260 203513 -39771 -232813 -478636 152244 -63572
18328 -140886 -204205 87327 -238011 -263542 -3148 149371 -18697 -57286 -119736 225041 347991
18317 347991 218871 -296721 13737 -156648 310809 36066 -233690 -51259 140445 -10789
18306 109181 -122041 -46758 -302426 -252563 160741 -194745 -59333 179224 -582871 10107
18295 -25618 65915 -62710 251021 -114465 -138994 249642 -104115 -349489 -97493 -24552 112157
18283 -192361 -150411 59142 -188210 -138204 -247853 -201966 -97783 -261118 -443820 -169988
18272 -143339 3087 375999 -322936 33710 140459 65792 -126611 67382 -234279 345257
18261 -12875 16138 121199 -261347 -266145 144587 -127400 -247148 -238537 -87364 153133 -166863
18249 46355 -143230 -196451 -394165 151800 -17071 152162 127029 97835 240788 -282932
18238 -95502 -59082 54392 -16889 -116983 14573 -108475 -196592 -144510 27381 -18161 -5666
18226 -52205 181590 -67299 13703 -50757 292624 68342 -45686 -53024 213096 -87417 -234945
18215 -234945 167929 28775 -87177 -312193 -49483 174472 30710 -357199 -107661 -303661
18205 -303661 82293 -123256 -90841 -93683 -324561 66571 98568 31077 150389 178411 -463900
18193 79106 -154639 209270 -294215 167966 -167951 -330319 72137 54198 -88192 -224715
18183 -224715 -90829 241475 -390702 -147250 -56420 82823 78315 -30067 137515 -265893 -164365
18172 -164365 63457 -65856 -5899 -94012 210676 52073 117594 -15056 -13321 148175 -193704
18160 350859 156930 -165094 124788 -420369 -11164 -286776 171508 -373791 264518 -99339
18149 30934 166158 -69015 129535 198399 -106458 -48961 -125797 -139969 122510 -422302 -65234
18137 -65808 -85514 69085 -74728 -17567 167606 -34018 121407 -94359 -172311 82253 -97854
18125 -104199 -383931 -254551 -197467 32216 24233 122302 296540 -132731 -50804 -137216 90987
18113 -100330 15289 -82818 -207935 96462 6743 -44146 215903 -130821 162492 171410 -7294
18101 -201236 -36383 -201566 -160522 -320500 -190014 214627 -235306 299591 -249524 -55846
18090 -169944 280565 137217 -326714 -182675 98628 -122475 -341136 -73772 -307875 -244012
18080 -244012 -88001 -235209 157466 -20667 65041 -55475 180606 -282187 -204286 -1341 74182
18068 227067 -37410 -157639 -174745 148214 -40114 -335469 -349844 -327005 -365933 293874 -516098
18056 -86030 -320747 -62916 -107421 -198082 83887 -223111 101118 -134773 -183473 -91057 181705
18044 -16568 -348608 106457 -395074 14766 -26889 33328 -138644 -134750 113445 -149652 -149475
18033 -149475 -60498 -228926 -136630 -205146 240417 -1758 183645 -126903 17270 97501 317491
18022 317491 34634 66587 -128007 -107026 -68510 219187 106074 364933 77733 58059 21450
18010 -104969 -47802 -278470 -258017 12965 -425319 107557 -321453 -218348 219571 72332
17999 107072 -269820 -75270 -217485 -158051 209844 -153606 229917 -68211 -85241 -193313
17989 -193313 109936 -88345 141644 72498 -1413 -92808 -275663 20417 -22588 -78529 -540323
17978 -540323 -478988 27105 217283 42114 -1062 -92598 132967 120820 -108367 33371 -144922
17966 154522 -185135 -83129 -133077 -45118 -9647 -177833 174204 -157599 -329409 241962
17955 204514 100712 -249643 62845 105193 114014 -296559 225901 -169289 196751 -12001
17944 -212305 -48112 -117622 89129 -299674 -273970 -100732 -103283 28632 101199 -223805 -3030
17932 -187191 177857 -14290 -20335 200336 208195 -332719 -128595 321132 -284252 -92581 -73917
17921 -73917 -190487 -81731 -308363 325972 -80340 26668 -175755 202233 -71613 172949
17910 -82138 -31191 109790 169870 -173005 24502 107216 -438243 148987 -362651 224603
17899 138884 -336740 -193782 133299 145146 -159201 -343106 -134925 -51206 -233929 -59856
17888 -250795 -230953 367736 274712 -205046 141469 190518 -318883 -136680 113869 100617
17878 100617 83022 -2752 28421 200070 116414 192079 14118 -83422 192259 234097 -37177
17866 -129429 214966 -29799 13561 -153235 -121253 265544 231723 47936 -288276 33833 41331
17855 41331 115090 -93962 -169950 -146151 -39646 267438 -233511 24655 -41095 98693 -414472
17843 -49379 -18284 340673 56018 119283 169478 49156 -13752 -429041 -45759 -188700 -241448
17832 -241448 60526 107895 204934 -47156 -121504 -113942 100525 -113402 -164469 70822 375364
17821 375364 519795 141010 130028 28222 -51911 -18751 -227362 221753 225123 -402385 -162013
17809 103256 20404 220367 187051 58345 50767 112746 243141 116199 -86348 -199768 -233722
17798 -233722 55197 8974 -16643 -57930 229213 -137046 -296226 -16428 -145434 -145765 97428
17786 340871 79970 377783 -127934 -252961 115648 118956 -208642 270006 -200615 65461
17775 -186677 67493 5094 -23342 65929 84609 40411 150771 47516 36711 92367 214220
17764 214220 -219547 -98756 56145 2177 -22719 -201513 142985 67187 57648 47102 30057
17753 30057 31161 -46171 151844 -41408 98436 -250967 388127 -29534 -218378 -41859 -266130
17742 -266130 -97962 189458 161030 -59540 416061 -77468 184016 -109691 531391 257230
17731 22710 235038 240134 56683 160086 -67781 197880 140188 164921 -66604 174977 -48279
17719 -313832 59136 158924 76264 -37875 36265 -363756 -100103 163849 119567 -130120 141656
17707 -26581 154295 -22347 121786 -150688 -106544 -14986 60848 53285 79331 -21592 -4947
17695 -3754 186469 156204 -240886 -321221 198812 -131774 127690 -135005 -85257 205431
17684 -315811 36720 186104 465474 305910 -152509 164983 -268980 -101030 -113440 15932
17673 -173858 17723 -96306 370038 205493 -112292 -176188 82570 148858 20515 -178204 -114597
17662 -114597 -168087 53779 -139367 -230829 39787 183004 107676 -157803 66133 -105488 92580
17650 -117105 -3262 211264 14960 21097 295814 -24078 -83034 22414 -262226 134739 -144773
17638 -271604 79625 299314 23724 -42203 4416 -144707 -231739 -73808 -82433 200672 67853
17626 -62862 -2524 -94032 -168930 -220928 66902 249712 -52700 -79076 271694 119132 -174997
17614 91539 -93378 246744 -143530 58987 229855 -83687 24353 314871 -48215 -37672 -2612
17602 313972 -244978 -12735 -46334 -146945 -157151 38894 82113 -103652 -45592 62859 222872
17591 222872 186510 -139594 -251691 174506 71356 -107832 -57893 83459 218105 81722
17580 14219 205529 40753 377797 76109 231849 82728 149047 117787 -179049 -85638 353314
17568 -69101 42290 236553 -63687 229808 84569 188370 199087 -59732 -174968 -55703 -86764
17557 -86764 157889 -48814 6359 58408 92832 -63114 -8324 72282 81350 26993 255372 107460
17544 -118561 -109951 6004 -149818 48542 99430 34446 69220 180782 -3127 -23574 144067
17532 -151334 -44708 47483 383937 -166970 199276 -242992 -43551 -45249 141809 -25154 5105
17520 89162 89836 -98640 -232184 157496 -363351 75629 -114520 130920 -189870 31608 69430
17509 69430 -34687 370428 22066 139585 414064 84203 -290169 -11558 61186 145005 302330
17498 302330 -216624 197525 -3971 56270 6860 198976 362496 432497 204771 125726 61411
17486 -32660 27903 -318100 237177 69136 62760 271672 293534 244189 97250 -55413 271605
17474 211379 272111 -59029 -63680 -195305 436256 -131806 -100078 362150 245036 327141 -165450
17462 -97584 27109 -9931 -285740 -142671 499243 368525 475634 -27388 -1651 256641 392948
17451 392948 338892 285003 566368 219730 463310 -159374 26595 122231 -139893 262810
17440 -157468 306939 236142 385232 253332 325565 24286 425659 54304 -16730 430187
17429 140039 198346 130356 -4431 275777 466776 263704 -58131 165788 9637 153021 609885
17418 609885 298580 571727 230688 147014 11375 228503 109059 -67839 -6689 64014 -153269
17406 -31881 369746 -63649 231386 578843 132494 -243420 296803 290789 182981 69564
17395 -122834 -52734 345027 243749 -70593 184250 -46545 -205641 -71413 350972 246181
17385 246181 460393 -57565 -120637 359774 101738 115410 -6116 189373 197205 -152496 255026
17373 216102 -123608 177175 424763 142036 675347 -160018 107222 186865 100577 -174842
17362 237237 187147 265394 320478 -29792 254417 316495 135553 -6329 248096 79589 150228
17351 150228 507797 117997 -86202 -2223 8846 174409 119510 304276 6585 25686 173884
17340 173884 144489 -96449 173409 423382 577368 -79017 -29621 358676 267415 279026 -160543
17328 143104 46209 542615 175178 -333868 -19900 29733 259770 -114923 -102887 44181
17317 -158353 -263487 287702 -34262 346329 123515 132015 128768 378015 234818 483312
17307 483312 209635 167855 -26231 277990 148023 12834 494565 58103 41298 331198
17297 331198 -20309 322196 374157 148784 172780 236287 193470 181788 176495 -38248 63221
17285 425952 45124 46438 29721 443033 106420 -6355 54057 283897 144847 -29124 -71037
17274 -71037 10496 306824 432016 238092 -158041 71591 221485 41451 -196745 238857
17263 114349 81348 -119774 242080 384410 95541 202466 -129414 107600 -201047 167539
17252 119952 -19744 423205 79061 182958 301140 357071 15548 63027 343085 38224 -10112
17240 182377 339698 15379 144403 570716 -41564 437991 459752 33733 82871 514179
17230 514179 166549 -56306 82016 275488 101356 -134543 167738 -130168 164307 215281
17220 215281 280810 -55521 225912 -90669 186692 154044 184731 274157 280818 426038 130504
17208 522422 63964 294991 -57184 985 308195 330019 249556 417441 299425 82044 346866
17197 346866 -94577 378925 472439 193579 241139 167148 359390 179799 402023 53101
17186 433029 275177 127684 183947 653153 393188 296891 570310 283000 298165 205809
17176 205809 162763 110379 3698 272436 287397 662853 218024 216362 130084 358009 4476
17164 57114 504929 102396 126724 256667 909850 263601 495260 216149 -102484 141380
17153 454499 290804 361855 203199 168819 186234 166190 -25406 -409827 55266 406270 134860
17141 417666 357623 550622 394475 513186 349933 407982 301465 166965 257961 537348
17131 537348 516850 401266 460436 19265 282614 424967 -33125 288094 320479 280370 45764
17119 71673 599695 452316 322529 98357 336331 491694 776177 179497 293749 636592
17109 636592 321408 237601 85133 288632 508938 535092 409595 280772 480179 392765
17099 392765 496539 562064 192521 129575 616004 525897 646228 280775 197768 599321
17089 599321 361543 366173 536787 568245 586426 385839 171407 394608 408088 821102
17079 821102 436014 698448 243490 173101 342980 549216 225106 654395 515529 -14461
17068 453831 293643 393086 448871 625036 704175 480350 347158 588951 431879 209061
17057 369320 478016 514799 359624 603394 285187 412487 439508 677915 402996 493776
17047 493776 487597 395328 744229 616898 554341 434238 485896 719450 442411 330498
17037 330498 512135 507984 -10764 449511 598815 325920 534753 284636 446240 530748
17027 530748 244050 594560 685128 646086 352560 856851 840009 655617 512944 603280
17017 603280 637267 793739 546324 279349 681375 334100 873959 686948 766044 836746
17007 836746 710040 572674 789555 667701 927971 608267 762635 650531 504844 545821
16997 545821 478268 260447 706620 726321 528062 555872 462662 564363 975058 594183
16987 594183 605709 672385 389765 831196 892844 929972 948166 900981 718023 698693 848467
16976 848467 906811 1078810 878074 307489 849484 716496 1035645 846014 671744 1093591
16966 1093591 812537 718554 912387 831024 961557 816486 721932 1096239 1024931 852793
16956 852793 789154 669393 766314 677858 826131 1117146 1154930 993438 1226949 642216
16946 642216 789096 1271702 1263148 929310 1021284 961479 1200297 868740 883352 1164518
16936 1164518 1033258 1332925 768185 994612 1305599 1277678 1239754 1304230 1240950 988358
16926 988358 1381420 852900 1233750 958940 1292607 1548434 1449940 1216501 1756747 1552851
16916 1552851 1319005 938618 1207621 1562681 1347701 1446799 1482221 1526675 1506936 1570982
16906 1570982 1610221 1409631 1591010 1648553 1622587 2095930 1473820 1484706 1565654 1693386
16896 1693386 1443851 2003660 1666854 1941230 1877978 1703639 1839046 1938213 1917193 2056071
16886 2056071 2022612 1769822 1695706 2056672 1848338 2122283 2238744 1927015 1774559 1994908
16876 1994908 1951350 2394496 1998315 2101980 2249018 2290208 2251034 2118700 2288033 2711983
16866 2711983 2490562 2590716 2525427 2687420 2552158 2507624 2523981 2550653 2671280 2888218
16856 2888218 2766564 3022376 2770624 3188926 3015861 3121529 2877342 3261593 3208308 3276957
16846 3276957 3240877 3357362 3184962 3512722 3543339 3843351 3539719 3764288 4013681 4073528
16836 4073528 3372292 4056369 4038064 4033621 4082827 4255805 4329413 4503672 4135306 4327623
16826 4327623 4615416 4852624 4836675 5133939 4894890 5040950 5238863 5270710 5308282 5516899
16816 5516899 5727089 5608826 5717024 5836603 6256113 6424601 6158710 6802829 6286877
16807 6286877 7081697 6827324 7117984 7030748 7247867 7614636 7624865 7857189 8262736 8284790
16797 8284790 8626972 8959336 9066457 9190877 9709605 9777088 9624246 10252393 10194635 10814340
16787 10814340 11164738 11368898 11661330 11901001 12523543 12634835 13053831 13595514 13807637
16778 13807637 14190891 14737705 15455065 16174259 16274287 17074057 17832555 18079069 19075362
16769 19075362 19551502 20654560 20935644 21588558 22212516 23358532 24360394 25562612 26530012
16760 26530012 27291817 28435473 30195887 31098903 32601445 34269940 35281092 37400671
16752 37400671 38912794 41029110 42817540 45533685 47764723 50100205 52692940 55878023
16744 55878023 58713960 61802891 65842668 68969322 73390169 77578319 82588911 87605512
16736 87605512 92849933 98409391 104916173 111304887 117959068 124881547 132392992 139541104
16728 139541104 147437606 155100316 162909676 169998737 176880925 182998090 188565302 193049250
16720 193049250 196394498 198423386 198646156 198456107 196090374 192673405 188096353 182653331
16712 182653331 176343605 169331712 161838552 153966441 146242941 138533746 130971686 123323300
16704 123323300 116314260 109382407 103045797 96814990 90918905 85484902 80489011 75980410
16696 75980410 71480818 67317598 63610866 59929318 56389020 53514396 51011796 47940858
16688 47940858 45758699 43569159 41435805 39074966 37363618 35462789 33898157 32525599
16680 32525599 30968412 29744687 28409618 26945397 26002790 25161063 24197327 23322620 22155793
16671 22155793 21290968 20239530 19571146 18955062 18325884 17890277 16983279 16627634 16028838
16662 16028838 15686001 14770639 14144643 14194292 13599065 13296597 12605378 12398778 11702971
16653 11702971 11519251 11142331 10995968 10875724 10437322 10134502 10099687 9635103 9400053
16644 9400053 8883885 8741357 8607810 7869826 8256694 7983183 7785878 7562575 7421033
16635 7421033 7425785 7094455 6991497 6374146 6532166 6230669 6301167 5992897 6055303 5780461
16625 5780461 5525045 5489010 5374778 5733817 4997520 5464400 5112384 5005697 4859377 4696270
16615 4696270 4774466 4447309 4223740 4319713 4257886 4085228 4077718 4260858 3846836 3988533
16605 3988533 3757129 3561847 3736717 3878799 3639338 3409096 3312555 3413720 3198438 3380489
16595 3380489 3269333 3247336 3126465 2881711 2738358 2988858 2934167 2816345 3096741 2881222
16585 2881222 2714893 3091369 2887247 2680010 2745034 2690493 2689097 2499709 2624093 2496547
16575 2496547 2400782 1960616 2419632 2045972 2308214 2090478 2105334 2147808 1969475 2003642
16565 2003642 2168565 1965790 1706464 1906314 1906877 2076686 1623867 1912139 1987358 1841978
16555 1841978 1668015 1970564 1661642 1762895 1497651 1617259 1538202 1678582 1030298 1908275
16545 1908275 1593076 1528042 1894981 1553486 1700280 1767859 1644764 1481848 1557578 1674432
16535 1674432 1432755 1344276 1475795 1435266 1270815 1154371 1288475 1381474 1565312 1115089
16525 1115089 1261638 1576882 1243622 1269138 1415937 1152875 1317187 1074894 1191340 974939
16515 974939 997914 1226597 831213 1474109 1006740 929515 1185888 1186460 1331497 754082
16505 754082 1439773 904754 783024 964787 785164 1188205 1006838 844866 860783 983524
16495 983524 681272 1083955 1031636 458138 851507 1011882 1200203 1135295 829393 955026
16485 955026 808622 590678 903286 869882 650663 801243 904884 713429 510941 818344
16475 818344 625738 604906 826894 821709 925399 956785 688996 582325 961863 615532
16465 615532 742739 820283 618852 819225 510819 1028850 930817 927345 868875 608332
16455 608332 456345 649123 277294 499428 425129 711219 661570 798846 615394 441303
16445 441303 994836 294992 333452 831043 474606 819174 722469 693237 449200 464096
16435 464096 327226 728064 496188 586399 483224 304691 265864 382815 368607 288702
16425 288702 720769 372673 293661 1003802 335002 403008 616841 603266 568842 342966
16415 342966 365007 426208 549352 540468 576147 401338 350709 208549 539850 248070 646601
16404 646601 714808 301917 448621 395723 328315 343995 659759 356893 243606 364505
16394 364505 410873 245534 523490 520673 664733 533878 697654 428256 251017 181328
16384 181328 237170 516070 374423 399483 697926 238137 547035 228584 66063 231279
16374 231279 430228 703727 214178 269316 43728 247414 290193 369399 470828 803682
16364 803682 241784 394564 309069 472612 628230 497066 17075 229147 246737 340594
16354 340594 249936 229436 6897 506268 371944 450624 574452 547252 159598 77929 403116
16343 403116 197748 135483 211017 288735 502920 243931 280944 294783 6626 262873 145818
16332 145818 22346 369346 458846 214236 111639 175952 304630 401316 446316 483144 296926
16321 296926 408854 470069 131575 339018 276233 305422 287342 397510 655031 363162
16311 363162 305219 570841 278582 109015 86008 399639 254283 490243 24213 -187178
16300 178909 207605 374824 421748 697760 328036 135052 442102 75799 124762 196083
16290 196083 403587 99250 331314 382458 115357 289710 147602 247903 179528 372922
16280 372922 -34015 257648 101594 -50120 99659 120476 241701 363069 507574 134750
16269 270307 373072 216982 463940 249000 200718 -29579 203750 351412 28032 31140
16259 31140 388122 102200 184465 66508 470424 60616 158280 525375 370466 4614 -141009
16247 276478 -233000 90181 25606 88733 142209 -117078 453182 -53511 -118390 90417 -31089
16235 305303 44887 102595 504972 216850 202563 91897 262333 137916 266528 188577
16225 188577 -70552 319976 171024 79103 -75170 15808 321202 155935 -72696 -25854 138752
16213 -61982 -141721 87018 285653 9836 93617 241821 215339 241613 328761 184615 115642
16202 115642 318704 -41574 185698 -91687 211182 -16637 285488 -47608 155909 197639
16192 197639 218879 203765 136168 -72349 317786 128998 117668 -197766 152803 -103149
16181 305298 425283 99756 -319749 -89095 72006 168282 -13414 -53148 381633 192753 122094
16170 122094 175973 -20873 161835 230776 22703 167106 370376 -182812 90947 -47887 107819
16158 58530 327470 63112 -63348 298149 -136294 99420 -100326 209670 47585 -8008 -168515
16147 -168515 191471 56151 127095 120966 15972 28388 97520 354 -18062 32314 95413 179370
16135 179370 145921 -99549 153126 97610 -91703 79117 239856 -28151 87378 -108742 166194
16123 184519 74514 186021 46895 10192 37555 34442 96963 7420 126020 -7093 63077 282723
16111 282723 -140265 -81771 -348756 209404 336990 62407 224310 48512 28357 230163
16101 230163 190559 -109578 -143783 -186647 -516586 240077 130458 232506 -25338 -60398
16091 -60398 8169 302732 137509 -139235 -260528 -93984 179219 186981 -225755 -130918 215169
16079 296564 13148 149329 -587614 -244211 49430 205624 -152936 293576 -71631 77265
16068 -107001 -44083 -52961 179839 270372 -208867 24303 77899 264290 -57587 199960 95121
16056 48100 -251358 -486358 -92743 -96484 -58899 -258856 -117097 -304830 -275425 -224924 -449
16044 34182 -107935 284030 41750 -447393 -5059 97258 -96676 345118 -138124 -25549 386983
16032 -171118 -22562 -115780 -116351 8855 1133 -327571 41025 -68127 -293860 -8327 123414 298183
16020 298183 95560 66866 -277140 -31395 -211538 -192251 20984 347914 61483 -161516 -156997
16009 -156997 -186241 432601 13873 99372 380718 -279718 84821 44460 -134760 208233
15998 -54532 72770 -19121 68801 74697 289814 -388747 -107127 359466 -277904 219689 4724
15986 92885 -138893 528575 -103684 432000 10862 460563 122431 117234 -34157 -120925 -346143
15975 -346143 85094 -96878 72761 209307 15767 -67538 -233909 -84408 28292 71721 266441
15964 266441 49271 -92419 179121 72861 -171181 23701 237306 -76708 -75227 -65539 -107405
15953 -107405 168882 -150195 -518526 93186 -74503 -144478 187079 -178802 -86076 293429
15942 4707 -81609 -17105 -212091 -60455 -155702 -136727 -4200 -11326 52204 -90957 -188424 -146060
15930 -146060 -77435 59239 228692 -55754 -177593 -22679 -78783 45242 -49962 -206700 -237833
15919 -237833 -75821 -154288 -300451 -62676 -85305 -39540 93708 -4495 -328004 -139576 77968
15907 140884 -96188 -83643 -137754 160496 -25405 -87940 4927 75214 -49419 -180375 -120427
15896 -120427 218626 134907 -104835 154043 89057 -12576 -122694 -60508 166774 46625
15885 207923 -17486 -161993 53489 42845 147846 -308813 112389 -168046 -186504 93006
15874 -358178 18943 -247197 -102800 -470299 -176067 -47319 -24627 94123 -237549 -177065
15864 -177065 -29095 8573 -213543 -192271 235436 23170 42276 -114828 -208552 -314273 239937
15852 -64141 -238348 -80883 -13086 295486 -243209 216986 -206093 209068 -91281 -166603
15842 -166603 -425250 4212 -188655 -85751 13329 64975 -34867 -113077 -140193 -155213 -1969
15830 -56605 188858 155283 -75456 -33881 -158940 -129231 -234446 -98721 -220916 -6254 -92539
15819 -92539 10015 -352368 227260 -282617 -80329 -63578 27055 -22590 -211775 -58406 173072
15807 -116913 -84425 -39671 -145527 2986 101187 190188 233854 73883 -224762 128926 -2146
15795 -98993 88586 163338 152263 -11398 260834 25576 -105779 -64913 -49351 120468 -154157
15783 98536 -11857 -63070 -24671 -187190 217977 -163141 302286 -95440 -63513 -87780 -64934
15772 -64934 216314 209721 -265428 -325689 -171295 -109261 267424 -302749 -94402 419799 187751
15760 142762 -29154 -55450 124567 329588 -63839 -65386 144213 54577 8276 85905 111407
15749 111407 -113350 36535 211389 223573 -280787 475035 -442449 -317632 160307 249436
15739 249436 -95530 214471 84523 -126564 -181872 -2142 -54317 -114630 -217754 173844 -130151
15727 -7074 -49844 -108441 -82981 37154 398406 -286082 107161 -79855 -255806 -114601 69165
15715 76989 -23895 233543 39730 347529 -32028 223138 29795 -294100 -199321 -101890 -181856
15704 -181856 22070 49908 -9799 -216872 189399 -203260 -201912 -38772 -419323 -180065 148338
15692 22916 -22846 -13955 165153 -249238 53084 9128 -100317 116117 92587 -202489 -74959
15680 -9127 -250230 15310 229168 -182303 74473 -9884 35849 -198207 -155981 131874 -50070
15668 -34804 -159768 42419 261476 -460696 -132339 -192846 -64679 -219347 -191201 -390653
15658 -390653 -153301 -308869 -157985 -46590 167284 59187 -184641 42524 88907 -240187
15647 149487 -22877 -193401 514963 67959 108342 -56530 43035 -93241 -107632 -310590 193390
15635 294640 -133411 347584 -39193 -457034 -57202 125823 147952 73668 197733 -333669
15624 -106167 -132005 162719 80121 -210248 52994 408680 -322575 182909 257510 94037
15613 -236001 107798 -152 -290723 -28391 -236585 -236903 41535 -177043 15102 -64708 -32987
15602 -32987 2394 -162129 -103330 -157851 -59276 113797 -36965 -163667 -613152 -158909 -109201
15591 -109201 21411 -27470 -210694 -67423 -441646 443874 -96789 -5051 4229 -3385 -128365
15580 -128365 125806 -152975 282066 403435 -302675 -42584 160948 337557 140559 15443
15569 -246463 -163795 99650 38695 21744 -56338 -273459 34320 90162 -22834 295580 124208
15557 34526 103135 212937 461479 -413451 192726 -97712 61407 -255511 -51063 -80014 21261
15545 32561 157043 39424 142763 192162 53837 -257910 229304 73417 155949 -362875 152849
15533 19890 140460 87873 141254 147322 78284 38041 -81899 96367 -15098 -70942 -54954 -22610
15520 -196285 -136642 92241 -191293 -168478 -171725 149701 139053 222332 -100644 -10498 133935
15508 -110178 -51346 -356320 -204767 178159 -26155 -207260 -260869 -18233 329926 299251
15498 299251 -31105 2753 168557 -231748 -43002 400982 180894 74489 -317820 -117175
15487 68516 -582 3600 -249388 180760 -247997 113963 101403 55831 -184889 -49463 132542
15475 -226058 142690 -112560 -15374 -142478 131577 -191565 -73103 -221451 -201759 -61026
15464 -91473 -108954 206625 -69226 -56277 364895 258507 -95300 -81020 72401 244033 -58920
15452 292820 -111279 -160746 94192 -29703 12689 -123028 63961 -60408 418345 201148 -445470
15440 162909 -86283 -188421 -9395 10341 -63272 -249165 275164 176744 -2446 -120759 -158407
15429 -158407 -122340 -218236 23967 -244844 323958 -61482 -331012 -21647 -39383 -222899 127803
15417 -42979 51982 -17849 45189 64377 -179416 -308701 -18538 289366 400290 -262488 -206799
15406 -206799 -47191 -47823 13556 456521 215703 20148 -99344 -151382 -58321 204474 43584
15394 -138253 133660 307618 -209881 48510 -277156 -120604 260799 -53371 -33689 130851
15383 -83745 -274275 -111480 43232 -195927 -155022 -199778 50144 -131761 -116551 -14360 -165718
15372 -165718 9977 205305 31280 181220 -72809 86480 -75411 -152956 107680 -66736 -158293
15361 -158293 26120 -1306 204167 61434 178513 -235211 232769 -42526 57699 21327 -324249
15349 253601 279970 113204 -158673 114070 -193483 77571 442362 107227 119269 75438
15339 75438 7659 241179 -143657 114862 -3692 -125986 -151448 49524 -300901 62520 10062
15327 -104625 -245523 -443535 161837 -60618 351477 57111 47261 -79391 156040 -227628
15316 -629540 -29735 196759 87120 103608 -12761 14252 139301 55548 162910 -236238 64075
15304 -104904 99361 -204329 -28222 -40415 -163037 95630 -84792 324697 208827 377632
15294 377632 411552 161317 -53999 -181917 7952 7691 -79009 -309363 320719 109567 -167177
15282 111515 -60115 355315 -59018 8659 -311587 -110203 -104826 -121167 -560 -43035 30593 113657
15270 113657 264001 75279 -156261 106233 418650 91544 -21292 97846 54299 128210 374197
15259 374197 12888 215826 -211192 211949 37013 125219 42432 273687 188044 -41792 130238
15247 56585 230282 -9995 -27714 116245 -84284 6954 -200812 -285672 -1286 5188 162910 20383
15234 117642 101780 22856 -30629 88402 -53810 25885 25510 24896 -148260 83747 -376896 299446
15221 -93765 296986 -53715 -25734 211144 -16148 -25222 -12735 195840 368364 -162092 232311
15209 267707 172616 -114354 311891 435167 -150490 -72039 47668 220266 206671 382810
15199 382810 -259583 55109 63360 17811 329655 159245 251428 -152256 333482 -53452 170178
15187 233571 285639 -314442 148312 216317 137887 238877 -182442 279515 87715 136146
15177 136146 269552 203259 -112140 -78404 -116913 163189 89081 -57372 -216434 178772
15166 176543 164990 -134030 268911 109674 15023 172635 282265 398346 -28391 -79740
15156 -79740 71830 89214 46001 378929 -173998 157247 -366092 330345 -206374 82726
15145 -128924 -78227 -119540 239551 -144626 119497 263250 29120 126469 -123622 -188881
15135 -188881 46605 65557 194307 415010 162184 9811 221704 -101470 510830 -126843
15124 267130 -81424 -59156 -63147 208556 348363 194738 324527 81840 202876 145520 43142
15112 49815 -163765 261240 26784 33000 469105 -5060 283069 382354 21689 -8755 422653
15100 -44231 -122788 306366 129638 384095 128630 -102762 204143 246564 -55828 29242
15089 609374 220181 -122330 295781 -90987 -316597 159444 300787 132604 -6780 203305
15078 36080 -26861 85935 -64356 -80867 70363 123700 272659 -68203 132641 341852 366419
15067 366419 101076 149735 387910 261027 -102816 208038 -137514 181358 176764 83329
15056 78083 148623 343004 52466 -2324 -44386 220205 97218 107303 52405 -121720 161963
15044 233233 231038 94858 142565 143864 159542 230021 463293 76041 308806 94016 179485
15033 179485 238429 399394 111529 63259 213920 -354116 -171958 382653 248366 135348
15023 135348 159432 225209 137145 74295 168508 311443 72504 -50057 165063 101726 711003
15012 711003 139109 168008 97342 138495 122497 214202 220717 238881 280530 109922 186819
15001 186819 168463 412581 334629 167902 18426 317516 308852 263664 -19026 -136824 362761
14989 248003 288388 186627 170912 -212805 355111 91313 121117 306957 143943 273408
14979 273408 -38487 -51554 162031 320899 55517 438174 111569 434529 204673 -19751
14968 150839 438654 496379 239340 337904 369545 56034 102897 248988 287250 228411 81146
14956 -1308 458879 212332 157597 151213 36592 110798 553585 326471 361429 597425 345794
14945 345794 125375 594350 171232 313769 176369 453374 422256 36077 -318625 312483
14934 195728 100803 427091 279681 62338 440626 465366 157016 -69188 471751 -44538
14923 235690 486085 338227 321091 374869 314528 428346 318314 245280 432156 182750
14912 182563 142962 438774 220821 133512 188590 325975 505118 649928 187034 308138
14902 308138 171639 -103786 67721 -150897 -11711 305253 136314 249870 347332 157202
14891 267142 306066 123432 280396 564869 222810 142121 357129 207219 444914 328638
14881 328638 411579 419209 383158 474867 456728 430731 144710 430830 225300 673964 695940
14870 695940 648393 461968 311667 739664 561378 336162 206810 299019 370025 652402
14860 652402 286105 539857 221913 767386 650633 320291 275414 672939 451872 444918
14850 444918 364483 406581 541038 747156 594651 231847 298223 365918 343623 199055
14840 199055 486939 416401 567961 364278 229789 141209 606961 410877 696371 225363
14829 652387 461199 461408 550417 343505 271323 834939 148781 398086 413861 641115 496234
14818 496234 546592 161794 563782 606017 466026 666107 519180 200678 606814 172134
14807 519897 941922 662139 815066 619390 639867 449760 495529 507279 637089 515747
14797 515747 547931 594696 900561 456062 444647 403703 333983 1017345 727513 668576 697263
14786 697263 625912 505485 797046 466427 621093 278570 541502 797355 687596 829899
14776 829899 401724 332643 615860 282152 502537 256688 680600 655364 386903 285223
14766 285223 703754 272557 446763 626912 471136 583985 783007 527120 552963 537425
14756 537425 484907 667952 736990 637809 774492 489000 763940 429120 628760 789015
14746 789015 825993 753945 802485 428804 583856 762307 647046 769812 608391 1012174
14736 1012174 625905 789405 660906 923891 690266 513702 715585 688246 521700 734440
14726 734440 1018023 690300 686839 730706 649618 615522 531116 995232 935076 515686 1061427
14715 1061427 1043733 732132 723550 796573 674027 602802 908229 1055054 933293 636618
14705 636618 745209 736580 923054 1066227 778086 806348 757952 985998 616770 616698 723668
14694 723668 706955 747608 925785 703346 868132 896252 1138314 898546 783225 929150
14684 929150 991043 872874 687730 1050492 1147612 1077015 713575 1028852 998043 927774
14674 927774 877206 897677 776395 720560 1055609 967978 873180 1160894 1023336 1119336 1273472
14663 1273472 963231 1211923 893012 1057568 879014 1133281 918765 859428 1221290 1007438
14653 1007438 1223545 1166269 1186633 1102749 1176902 966819 1338504 1135889 1049549 1455573
14643 1455573 1001347 1292475 1209073 1516961 1161329 1109216 1417063 1191325 1308935 960687
14633 960687 1184313 1302350 1432463 1155156 1261122 1567167 1327014 1244819 1458222 1026247
14623 1026247 1338760 1313898 1238419 1503565 1121402 1619217 1089185 1241305 1595666 1741068
14613 1741068 1510032 1200232 1929124 1663702 1460963 1548694 1349346 1356927 1597891 1952977
14603 1952977 1471085 1639936 1501821 1496050 1762801 1739947 1517023 1655750 1826623 1587496
14593 1587496 1655636 1753000 1602318 2009700 1693200 1793887 1972364 1599181 2042671 1957328
14583 1957328 1783685 1868423 2016687 1915572 2136216 2102639 1967774 2355584 2052612 2048080
14573 2048080 2108428 2066560 2248972 2248725 2222562 2030755 2327339 2425246 2395714 2080779 2531983
14562 2531983 2501358 3018566 2857620 2919002 2784254 2775967 2815268 3097354 3427561 3830543
14552 3830543 4321801 4745791 5877094 8238051 11648567 19643119 36894913 44274993
14544 44274993 20381911 8536737 4493279 3173998 2451070 2831368 2099034 2214409
14536 2214409 1860256 2154806 2202442 2102087 2050262 2141209 1946635 2127632 2577308 2316497
14526 2316497 2421119 2231222 2540970 2708906 2048529 2517004 2375294 2435767 2704264 2832644
14516 2832644 2520875 2717356 2829299 2801533 2540994 2642894 2593357 2704742 2967319 2974975
14506 2974975 2939043 2705932 2535244 3075901 3212332 3193406 3080738 3221496 3357391 3186177
14496 3186177 3031564 3332376 3251522 3168614 3468317 3376503 3563663 3856100 3495043 3791938
14486 3791938 3856352 3799552 3594917 4060110 3494801 3745727 3992456 3807005 4377491 3817807
14476 3817807 4006376 3871996 3962709 4372224 4407385 4407416 4329640 4321637 3825801 4328114 4565015
14465 4565015 4473053 4583043 4365098 5058972 5009634 5005831 4472013 5137141 4557443 5003969
14455 5003969 5055523 5458968 5220038 5303793 5148018 5404158 5432194 5217216 5495062 5451917
14445 5451917 5665952 5834855 5799336 5770188 6056902 6039623 6230294 6658819 6198646 6454639
14435 6454639 6347803 6660613 6648993 6494597 7020440 6613274 7121477 7241221 7318098 7390032
14425 7390032 7583110 7766900 7588921 8108996 7873413 8038124 8083904 8483779 8476153 8446607
14415 8446607 8598086 8629047 8685041 8752729 9018694 9056037 9233961 9339123 9488285 9926251
14405 9926251 9930465 9968247 10149299 10415716 10272358 10532749 10662748 11125778 11008983 11248059
14395 11248059 11433786 11680097 11980660 11884365 12113045 12474152 12532812 12391904 13058157 13166235
14385 13166235 13539367 13492541 13923934 14310660 14746306 14867039 15439853 15506640 15678671 15776701
14375 15776701 15988694 16555176 16861090 17356731 17404355 17699252 18362330 18636252 19003315
14366 19003315 19381218 19697020 20064362 20254694 20904925 21379176 21864554 22837388 23036343
14357 23036343 23442205 23982880 24513579 25145679 25602785 26202633 27149624 27377740 28349428
14348 28349428 28783755 29742311 30265433 31166391 31967471 32538573 33817915 34529137 35534697
14339 35534697 36282025 37434907 38588335 39555269 40866874 42104555 43447449 44441005
14331 44441005 45649463 47041635 48800237 50161192 51808774 53446601 55905572 57316785
14323 57316785 59136710 60927434 63089079 65218275 67550781 69855320 72896798 75410446
14315 75410446 78022668 81249292 84099357 87620486 90765435 94885565 98875886 102888281
14307 102888281 107092244 111764097 116464330 121597680 127358961 133197049 139123610 145964504
14299 145964504 152961025 160086569 167723428 175841427 184778890 194076334 203645221 214278333
14291 214278333 224718069 236236689 248211627 260817530 274048990 287333981 301524151
14284 301524151 315829853 330589994 345844054 360779408 375942695 390997026 405151234
14277 405151234 419019901 431721879 442629826 451845362 458367649 461829854 464267795
14270 464267795 466055648 466719525 464228356 461549836 455899330 448120462 438205314 426608648
14262 426608648 413743249 399851952 385445252 370220128 354652766 339424501 323932602
14255 323932602 308605276 293677853 279863610 266072065 253108869 240532871 228962744
14248 228962744 217390152 206693047 196781515 186959425 178514752 170103893 161835931 154293246
14240 154293246 147099868 140546275 134782078 128705967 123208658 117596280 112667001 108090195
14232 108090195 103481549 99826918 95730357 92031656 88093229 84801046 81850435 78032469
14224 78032469 75609459 72772797 69969194 68035207 65383574 63436326 61309415 59061678
14216 59061678 56996828 55671321 53604262 52826898 50772671 49079282 47723151 46163058
14208 46163058 44680676 44002137 42709099 41299342 40306132 38858009 38098202 36972660
14200 36972660 36335342 35363212 34050109 32956483 32421108 31541160 31245354 30309780 29612005
14191 29612005 28875754 28101838 27728968 26332060 25964889 25280017 24980990 24257987 23777941
14182 23777941 23320819 22911843 22262039 21683878 21367217 20905281 20457824 20168177 19677752
14173 19677752 19139755 18723977 18523176 17861458 17623927 17580189 17210865 16888663 16396419
14164 16396419 16170757 16077878 15757371 15232334 14791527 14608372 14606126 14286258 13772136 13670604
14154 13670604 13562563 13463499 13527907 12787227 12649504 12445865 12213693 11921107 11815611 11671796
14144 11671796 11553700 11280806 11318765 10878676 10911996 10526599 10342325 9988949 10168910 9979461
14134 9979461 9857395 9431740 9449687 9602134 9354631 9014408 9162904 8975098 8739594 8805055
14124 8805055 8441141 8416122 8726440 8204327 8197709 8098027 7756659 8033495 7606913 7495964
14114 7495964 7345962 7415505 7307182 7289503 7460236 7128259 6707366 6912672 6774480 6730323
14104 6730323 6700594 6491724 6731704 6334915 6141229 6184476 6190029 5862977 6526876 5980607
14094 5980607 6045470 5659075 5644956 5523271 5982461 5362651 5455878 5224817 5320620 5333482
14084 5333482 5058275 4932312 5393318 5223659 5009903 5096098 5212109 4648644 4892114 5121982
14074 5121982 4492002 4785899 4629724 4625118 4688029 4393278 4470381 4287245 4258342 4120095
14064 4120095 4370791 4515347 4241562 4190971 4383855 3879752 4209054 4052850 4009806 4347320
14054 4347320 4124520 3685284 3636347 3738699 3507382 3686363 3734698 3295965 3290319 3364973
14044 3364973 3562666 3368028 3494734 3547081 3264951 3379431 3279892 3343352 3175068 3437133
14034 3437133 2862079 3319424 3473111 3144567 3394698 3080502 3085627 3015913 3179754 3137540
14024 3137540 2918754 3006500 2666872 2762227 2662655 2655622 2869266 2776289 2607076 2669692 2835252
14013 2835252 2846947 2804682 2662215 2812681 2513724 2326670 2704302 2348361 2552901 2349102
14003 2349102 2412681 2476425 2200280 2150263 2561526 2442641 2353284 2053721 2129738 2182688
13993 2182688 2230248 2729510 2703719 3076218 4235968 7031138 13587873 30611838 46560675
13984 46560675 26988039 13838359 8417687 6356246 4877052 4549064 3913080 3917669
13976 3917669 3671770 3246912 3127357 2725400 2868160 2815431 2880923 2691755 2697653 2663683
13966 2663683 2542863 2537002 2680166 2219211 2495308 2449600 2355003 2275086 2333146 1869303
13956 1869303 2038349 2062658 1530188 2175925 1959051 2231614 1968685 1959363 1944753 1886898
13946 1886898 2061049 2005455 2010932 2133861 1750308 1907332 1878916 1859638 1892170 1960765 1520414
13935 1520414 1931425 1907468 1859933 1589492 1910731 1788719 1676259 1726557 1458500 1635045
13925 1635045 1478661 1474387 1743031 1847720 1470198 1506916 1480668 1768627 1719414 1623563
13915 1623563 1959951 1375899 1599616 1497887 1846111 1584968 1018026 1524426 1376421
13906 1376421 1742300 1560886 1233710 1631015 1736059 1546860 1357588 1648684 1523007
13897 1523007 1620228 1477560 1406017 1423945 1138695 1675162 1398615 1467021 1142873 1200997
13887 1200997 1201843 1606704 1455246 1389539 1357217 1213764 1423643 1210388 1469705 1049385
13877 1049385 1276907 1012957 1062360 1218465 877199 1426683 1202493 1154848 985091 1178874
13867 1178874 928341 1009929 1170028 869194 1439809 1090561 1131659 838122 1177455 1200085
13857 1200085 1099272 1137767 1455954 718301 1098127 767022 978789 1144689 1190175 1187939
13847 1187939 1070886 997632 1185472 1160659 1040562 1089244 808183 941403 837198 957453
13837 957453 995234 801328 737920 1150639 971228 1122294 985964 730276 1088299 841102
13827 841102 1038124 1255334 737245 960841 1207430 944211 1251798 1184962 897984 562514
13817 562514 792930 883280 1361560 979838 958380 837917 391111 1142331 848609 1177479
13807 1177479 708954 773501 873580 557343 710829 960077 814035 967339 824355 1019115
13797 1019115 453065 545500 712362 616052 807354 629419 806915 957619 786175 681012
13787 681012 908205 846469 711770 660114 536929 1049978 745389 783324 455391 766926
13777 766926 802746 644320 688811 696057 629482 37190 695171 472876 764147 845313 951559
13766 951559 487717 424115 520949 646584 619985 752504 851293 700823 805427 673704
13756 673704 742725 429652 567376 606245 805091 574431 804883 635506 733057 621220
13746 621220 766671 672609 951089 640173 782046 544762 745623 584591 717469 725824
13736 725824 490914 466369 782045 634013 535719 249195 548377 755747 658125 596114
13726 596114 815962 653112 659138 418669 478830 592212 589988 445887 591192 410544
13716 410544 545563 436091 582262 463482 449107 309357 304601 586429 570796 409613
13706 409613 696502 567823 484392 619022 551536 448445 682157 511182 594536 695617
13696 695617 628723 413075 568684 854367 375981 298832 500252 571998 522327 643120
13686 643120 394266 317491 348454 388807 532137 585652 621774 641713 258600 203759 338016
13675 338016 835647 541587 806262 428837 646743 551248 514827 619363 284967 502780
13665 502780 437287 258525 486007 689375 -33642 403220 691694 604059 703561 510722
13655 510722 421404 461507 774609 519046 550210 681003 458869 453857 445710 474197 719429
13644 719429 678906 404076 230664 540520 521735 380103 339742 296027 144696 485911
13634 485911 606364 317137 487598 436227 284859 537126 374343 532196 118286 619080
13624 619080 562168 514757 371719 339389 357900 -95690 507721 332121 529916 347667
13614 347667 350526 280487 310872 386026 305863 334845 -3133 498754 554229 416974 206447
13602 158865 717437 305527 441786 319805 395189 393705 184826 344571 787852 305341
13591 318596 589886 287432 180088 215725 30645 388981 105901 394235 350924 387995
13581 387995 343789 380505 600219 599208 491799 394373 279138 394855 167229 438076
13571 438076 498910 135857 445077 347432 89253 267797 249115 372841 469613 289724
13561 289724 286670 159456 -83885 223779 153230 103547 311620 382565 327277 545934 383486
13550 383486 661367 21477 407921 248248 346446 343184 344942 179363 393637 119641 337601
13539 337601 -33961 582835 279488 244574 293468 267263 405086 219788 75122 148079 485379
13528 485379 185938 374916 636801 621202 283955 289117 517587 353869 240292 336079
13518 336079 357110 464151 108122 456848 254835 99090 241068 499958 174137 14343
13507 13569 258961 665597 268855 225550 207549 411367 347176 279972 378768 469737 319713
13496 319713 156477 115585 854216 525617 639356 -15308 171153 194958 -73819 180015
13485 185293 115975 122608 418367 82434 -3337 547704 245492 122479 57679 236895 45108
13473 171976 313748 173441 300969 171955 718153 370009 214534 33331 -64694 -122771
13463 -122771 -22567 188981 574386 65145 221729 312980 320532 105659 193172 222673 386361
13452 386361 -50178 322410 488888 301662 189903 112699 148482 145404 368169 328958 120388
13440 496177 67101 -93358 366127 353397 277241 242839 284830 67694 176865 473583 335628
13429 335628 575969 356680 -234121 147981 -4842 360163 106388 237059 313986 -176468
13418 56554 170810 -40949 134864 328579 375751 295400 135143 464584 245994 449723
13408 449723 282518 223569 147960 450406 -9439 16556 327896 293059 124981 -44396 145602
13396 109473 288268 291376 20005 337634 90175 113250 256392 156916 246982 70306 45260
13385 45260 404808 478213 339832 160814 124376 -11095 127987 235876 287404 165638
13375 165638 109865 393143 -96866 44723 164956 247658 123778 427996 310605 -249472
13364 24779 534538 264770 124220 331920 189528 273990 207061 199396 31483 110317 476052
13353 476052 563693 207221 121727 149771 606137 37656 71929 491487 411986 325767 104378
13341 353157 292304 95714 337029 165971 123078 -10084 407725 107250 -164542 358016
13330 139724 272805 -8701 106917 290488 116921 145337 317267 -140920 227134 704851
13320 704851 409547 568471 74111 95207 345353 409545 433598 205400 465862 133068
13309 187420 179056 65100 100636 239334 295225 171893 345790 -181641 399972 -65224 190617
13297 435630 -14790 193637 7624 329422 -44794 -112496 105698 -90155 280262 89216 342251
13286 342251 41926 -64399 118640 -84209 108683 68114 399311 58584 33768 11536 99291
13275 99291 333517 135957 420897 68501 53871 299153 363575 103689 141625 79233 35769
13263 57584 161918 -9944 -4863 171697 -16877 -268276 52175 -83534 -83718 19734 64869 95954
13251 95954 -16689 253230 49491 9007 257667 525541 80416 239624 -124993 315495 -534967
13239 228107 -187004 275541 26589 282965 227841 52892 89018 143443 160815 37739 14103
13227 48726 59310 206621 280931 175612 195814 133897 -79851 139 116739 185850 184511 15911
13214 100831 64575 372644 450343 378341 46529 290102 -47437 174338 367349 204953
13204 204953 -49062 -14055 103747 76018 195511 389954 196367 184321 305761 326230
13194 326230 171103 221696 169388 365953 -143686 -28586 202322 44681 362616 6555 423522
13183 423522 77445 218289 147099 -142198 335089 424593 371665 191946 270954 118541
13172 -90770 46495 117325 229714 -127438 24648 107592 35054 -1445 -30444 127039 21851
13160 396295 230244 -215543 78612 98858 298602 274956 288374 -28452 -21036 224588 221171
13149 221171 219665 67912 251364 338596 207216 322259 390135 200941 127112 278345 240173
13138 240173 -65245 399151 215904 275080 469265 -22067 13187 -36145 -192424 -21219 129327
13126 56874 115037 -234303 128266 -105829 69408 233697 602032 170356 -135009 -88993
13116 -88993 30737 223452 187636 -12744 99778 432162 114122 214412 235502 69231 -97088
13104 -112719 -64075 224313 -326331 328858 -305316 453668 312445 196772 -80559 89378
13093 98821 -79023 -61052 353016 119339 312767 49095 -197511 -179719 -112027 77056 -84603
13081 -303100 -40633 14493 81693 96007 -425796 161442 186609 -31744 208214 214814 163084
13070 163084 486744 130488 -15639 431388 197555 160149 93076 103320 210126 255133
13060 255133 191389 167752 238432 61510 -12517 -44698 -336846 -293452 -261609 -8034 374335
13048 264094 11228 229111 72513 13898 253205 153115 70821 356078 -30252 208505
13037 141009 -47612 85972 134720 76203 23214 -19079 36234 217633 237393 35220 245167
13026 245167 277492 269089 79441 5903 -109766 280467 -170824 -7385 -323215 -325844 95931
13014 112526 82308 -96425 133178 88822 144695 -97638 652 190470 174375 35914 183932
13003 183932 -126244 -167895 171852 248538 38432 36673 242381 49481 -243014 110449 293694
12992 293694 -76129 -133130 46533 -222356 -73834 125446 127730 -105521 -28925 124115 230687
12981 230687 147245 81357 244757 -206980 53254 -42162 -256594 318636 -333193 149870
12970 -149855 153137 24245 334973 3994 256941 -221822 402681 -21736 215313 -39429
12959 -55846 303000 69049 236403 195707 -34510 -50207 -157794 370554 -178538 -96011 -380250
12948 -380250 188101 -56854 -322175 -62720 203774 115975 103382 253729 263010 216299 40479
12936 -238636 -134723 165594 -149716 -152990 -75445 -199145 -323633 -268637 -364494 189917
12925 114258 -373291 12922 67418 -47971 -32184 238402 -95194 505028 -8561 448924 23453
12913 70528 -76802 -112424 71692 -127192 -229491 205180 33632 -74500 20029 87545 -265672
12901 -151469 277104 -223452 84730 -223862 21765 63788 3943 16980 -24509 -61793 192363
12889 39393 -13549 194322 -346371 136561 308467 471617 -11220 107352 80218 223879
12879 223879 61873 55780 62944 80887 -88668 93998 193931 -31197 417280 -228161 160949
12867 641109 -19787 233340 -235881 49608 -248590 241960 90856 -111556 130622 170906
12857 170906 82379 33749 -33782 25053 -22013 157168 223845 155881 87690 156645 -62016
12845 47920 -77565 236930 209370 -197057 -93341 -11092 -93021 46552 -14874 55812 167818
12834 167818 -133784 153324 14506 -245363 303415 8353 22489 -111981 -60092 -6228 -9881
12823 -9881 -175111 238855 171443 361662 187014 140673 161832 -246984 54231 95202 352017
12812 352017 92174 -178754 -270765 -40348 67573 -251287 -34540 243181 -32099 -210075 -197836
12801 -197836 34338 -362606 222650 -324569 -31266 6545 51225 118267 127257 -113354 186706
12789 42073 -14605 -161297 -167324 115071 -93457 113291 -341496 -272303 108830 24935 20958
12778 20958 438553 71156 38583 98081 196751 75013 245512 204608 93839 -21511 14333
12766 -236784 238931 116012 -111886 -30790 112409 -337604 142261 -185156 -17137 -247919
12756 -247919 -341927 58889 38362 77039 -77894 102009 -14818 49572 -83423 111493 294880
12745 294880 299148 348449 -82260 26055 -21993 -28435 184762 130280 193524 170087 30920 -86177
12732 141158 -362992 76803 222261 21498 294538 368999 175692 115869 -30175 205279
12721 58269 -199523 -44224 348844 188995 364502 -189673 27000 -19020 181972 38666
12710 205407 338105 216794 458335 296602 -47554 8071 78772 194308 -192117 378206
12699 -63222 76028 267051 279662 369477 68641 407584 169816 195141 175683 59688 157878
12688 157878 -28471 242739 -177688 -208844 50149 188442 223617 230327 50142 213428 97058
12676 206579 341277 -119084 -23453 330 5166 262637 12286 -39873 261062 29576 -4497
12664 113947 235403 249134 250366 453165 344487 -227099 380078 232540 -41830 -65064
12654 -65064 -286722 -299175 223405 194424 172073 79110 11877 201107 -146880 -133508 169442
12642 -308437 -216966 -135207 431380 -219905 124302 93320 -143903 168953 134560 312832
12632 312832 102649 470375 74886 104961 449332 -60193 -174327 219250 -4992 333894
12621 176099 125080 -168222 5540 67507 -311229 46585 23592 -98899 169323 -457067 -56933
12609 -285872 -38684 -29862 121028 109992 -188087 7451 149510 127610 20859 -142759 139036
12597 -163044 -58110 12825 238271 78510 76053 340155 87013 -231433 234957 -49579 -258827
12586 -258827 -36033 139600 -221594 298685 219497 -89415 43175 102012 72631 -218327 -150760
12575 -150760 -34552 -48377 -187978 -8717 48358 148888 186855 -26158 -127946 451493 157120
12563 -153886 101148 46371 -471242 -133510 71136 212518 -284561 359910 8684 82736
12553 82736 157013 -134737 -84709 -43979 -35353 29665 -73350 282435 -40135 132884 177252
12542 177252 -211143 174587 -227910 81818 55416 -236340 49962 82874 23864 -90544 -435077
12531 -435077 -207936 63404 -28595 134371 181393 189235 -228089 -351703 158362 295463
12521 295463 120797 249499 172170 118098 -169654 -280365 -32903 80117 78068 106966 -111836
12509 -30594 320781 -99094 -5796 303193 -51263 -290732 100621 -91257 122829 -148038 36447
12497 -55130 59213 -147969 101778 334958 156343 -265687 232158 27502 87061 225247
12487 225247 5912 -262624 240723 52565 3034 -121440 -77396 -105952 -265891 -4692 85719
12475 76576 -16002 -184834 -91420 -68614 -100031 -14178 243683 80114 -248426 235619 -98203
12463 -221739 294625 -94482 84153 -70163 41669 85293 71170 -285563 -65240 -110044 277870
12451 112681 -21168 -101466 -10182 119550 -223189 -117488 -83794 -128985 -62919 -133131 96736
12439 70532 -65219 47771 -48387 -26845 -91446 -72867 399082 155948 -34636 48831 196565
12428 196565 -170930 42600 227707 167003 -138871 299742 44538 -145322 240684 147544
12418 147544 265737 250034 -11722 -238157 56881 -670 -35932 103929 -34322 -72492 204949
12406 -243578 290832 121594 -21936 -55047 -363063 172276 282243 -76058 -8470 128159
12395 38840 -136216 -227760 311694 -61047 147106 284067 40514 -5600 34462 185448 135009
12384 135009 -396578 -299095 117504 -74079 -208907 -58137 110478 98177 -213825 301385
12373 -52365 117355 -66250 -102052 159106 -290167 78105 -8399 -59418 184328 -198253 163240
12361 -211662 -23429 96588 -278272 19253 -66982 106488 173330 -128412 62666 -126946 -289131
12350 -289131 276379 83122 37716 -219652 31134 -14671 -28264 -359227 214058 -340682
12339 299377 29557 63948 -141009 -282631 -100608 29522 -54988 -95506 153501 186033 99672
12328 99672 5521 -313365 96004 106328 236235 -84246 -302270 131491 22100 180133 -83130
12316 140940 69509 -244873 13233 236075 -230528 82303 24923 10850 89257 -267216 -226133
12305 -226133 3829 72558 -178602 -12452 -152412 42059 -7213 -316436 330092 204361 32111
12293 345774 79839 51396 -76151 -14813 -58855 -22351 -68758 234960 332067 -23698 151997
12281 -205248 7977 -65120 31283 206939 153049 320283 88920 -30253 217806 233890 78258
12269 217751 129601 186399 -11875 194221 300270 314198 -101253 329613 166910 -68926
12258 328355 451048 -120193 -41232 163565 93801 11295 3323 64984 240073 175153 25682
12246 -5099 260288 215209 288752 -145729 -109861 118226 1306 -343862 -40941 -51567 81428
12234 132732 173559 242104 -119430 233912 229269 323985 -181861 492401 373584 -53621 40143
12222 434000 4311 -27974 289977 192364 60108 390174 59333 74790 -44685 111579 73911
12211 73911 -160560 -222470 -15216 466592 208003 -210298 79033 414342 322256 255042 135260
12200 135260 71906 247953 206783 52482 -46809 283751 555180 167229 -4373 284404 419563
12189 419563 -416184 199525 203232 59782 -41802 -121050 20572 249717 15965 41975 25488
12178 25488 189913 64066 394573 309720 -77157 155541 150151 356521 353575 37855 194720
12167 194720 322757 68451 -300222 247070 144557 15138 178757 54425 201394 -287966
12156 136125 -182434 -373034 10403 -45404 -38727 -261609 193978 242213 650208 126451
12145 -101393 48076 357565 21403 316671 -10506 -18723 -267213 -76789 195854 -445705 263276
12133 10102 -34271 183128 -317921 118238 209769 -47301 3693 -167209 20945 70965 116779
12122 116779 205387 123541 421827 54852 53028 -11535 -42539 -275389 65547 154201 -226073
12110 -374257 -154805 -91655 24692 -231309 329851 50627 267819 3525 135233 -82389 -100720
12099 -100720 79994 139383 68491 14298 32005 -69414 -123333 150759 2074 -459299 158132
12087 -69566 25747 -287364 -151124 -135876 -331470 -76491 -90056 184410 77320 113580 -99999
12075 168527 -294844 31519 -13611 70350 -330151 132576 138132 -49148 28875 31183 -23623
12063 405722 1497683 1712677 351482 78916 52600 76906 -284326 77181 34756 130135
12053 130135 -124193 -93740 -147362 186249 46060 36585 81170 -205312 -503448 -103013 212724
12041 17797 -75458 145886 -99287 -3038 224217 91652 78988 -151511 109196 -272401 49550
12029 -202896 275346 -376683 -53941 -226481 99859 43571 -10017 14685 -77653 248318 60704
12017 47932 -213168 20992 130528 172745 -11253 51072 318997 308091 -38805 151858 137694
12006 137694 -199259 -29473 -363496 -106340 58918 -6076 117658 109439 63957 233444 -123450
11994 -138213 -233243 31878 119709 336351 152431 146528 -153388 -5967 63841 -141255 -7479
11982 -20120 22822 275869 207153 -190252 -39483 -659417 -287609 51642 -306753 289278
11971 -330063 268110 -84674 153299 -194343 -81615 -32892 -112002 -75667 -71345 6030 -476684
11959 146980 -217058 26965 145774 123710 60212 -289092 29576 -89966 -9160 -135967 -97015
11948 -97015 122059 145435 84351 68430 -120599 -17684 106466 62801 -81553 157288 -15925
11936 -39274 56734 53644 42427 58385 -149434 330509 186195 212695 87146 -6468 20711
11924 19301 65242 -173633 9641 255322 -212693 -101774 56942 -200875 -41404 49646 -106886
11912 -48109 -163515 57823 -15994 61646 298463 19850 50616 146313 -169199 -126777 168740
11900 74207 -176362 -60001 -98608 -28854 268627 186735 -15249 -245494 -20052 28157 178741
11889 178741 -167896 40887 -121692 34724 -77985 194029 97967 11845 -175406 -10553 95410
11877 -138905 -67115 -287213 -201105 -24109 -11656 -290613 72759 -155827 -3203 -465720 68469
11865 -86843 222112 130430 -108746 -230196 -173972 -224354 -61825 -203874 133573 -55387 -391587
11854 -391587 132219 -192651 -12867 106741 -17562 298526 64927 -169763 363955 231131
11844 231131 -208298 181708 367128 -114387 -82092 -108611 -151070 -5621 -73031 -15278 -160156
11833 -160156 256413 -197681 362480 -4586 143777 -64876 -5196 -105570 -406572 -244542
11823 -244542 -300541 -3879 101551 22986 121492 133458 -141031 27050 -77503 139036 -4595
11811 -174995 59060 18642 -137402 -96131 -111624 -139823 -157575 258936 245053 -177182 -123545
11800 -123545 69884 64961 -279407 -102706 -99628 -148451 138491 -47257 -103508 -48132 -451788
11789 -451788 -541389 -402684 123274 -284602 -39159 -60243 19122 -195746 -185561 -337703
11779 -337703 -345120 268189 -68536 205396 140460 59105 253414 -53186 -39673 174585 171099
11768 171099 -158499 173337 222026 76258 70882 7121 -120400 -34579 264179 -32252 146826
11756 -35360 42512 -290493 -291263 -206920 72315 128192 -209343 264090 -9719 -198194 200539
11744 269024 -316749 471220 -23966 -247700 210944 -312425 -123152 284304 390169 124648
11733 -118617 -96516 98034 -2532 -336833 72958 -116566 -343868 67917 96912 74354 100070
11722 100070 63567 -201663 221668 -39049 -110432 201915 149817 244889 -159594 -51242 -63432
11711 -63432 -72723 -39705 75151 -254010 -95705 -198802 -67684 -126999 103529 210642 -322928
11699 313652 247954 206371 -60335 12289 -11862 -195620 7003 169632 216271 24184 188391
11688 188391 243712 253709 200232 10551 284632 113576 -8725 176034 -36512 7176 -252881
11676 198296 -222348 123368 -118101 -234893 113159 29196 254194 147545 -240923 -104669
11665 -113679 293725 19445 -5191 90929 37526 -11306 12138 -192534 -211021 19247 291020
11654 291020 135820 -108954 -86657 12751 -210937 -44259 116019 11425 32416 -34445 76811
11642 29508 -109793 -24446 141168 -242663 102461 -148117 186284 84451 -34531 575234
11631 114513 12352 39478 47745 -125806 142608 56405 -420747 -293828 199186 106594 -55591
11619 -152938 -96138 -60883 65832 114984 267936 -185504 -113799 -195898 -188223 -40382 -188760
11608 -188760 46932 7443 -130017 -3198 188255 -169192 -192780 -159759 -231954 66336 78866
11597 78866 127835 204731 -182499 -473810 144422 41727 190921 198269 20370 242681 47927
11585 17702 451796 37508 131320 -57075 80998 -81044 10928 125011 -107477 -51 154845
11573 -190372 132711 -70719 -3487 102625 -75068 21176 454885 -132093 293792 6866 158725
11562 158725 132552 37393 132036 -397378 115181 -280500 217809 -128522 -618 151515 171681
11551 171681 269099 81717 115743 -184455 193029 467698 4588 185598 368429 10196 269249
11540 269249 147770 -19430 21327 151697 240751 264774 -345172 109807 8007 146212 369398
11529 369398 107578 148059 172544 -25941 146870 208132 63644 275807 -35737 40346 -7802
11517 250459 354498 -100624 345754 111164 -4588 134891 21297 -163924 -234318 -24085
11506 219617 -10223 273773 286038 -65070 93113 32335 -103376 -14188 57052 250411 245667
11495 245667 148555 97885 198944 129730 -42635 -170153 -47175 966 13323 130524 266964
11484 266964 16967 426334 -926 -10480 161928 38834 21364 195142 268832 78909 87048 288722
11472 288722 73433 151794 357311 -93885 57734 -198154 187195 307406 -291491 -1323 19868
11460 311142 210411 24344 183544 -12296 -115812 192082 164788 378552 202182 81256
11449 106577 438377 -45434 124778 64455 -6219 95524 351792 -196119 25529 -237501 69671
11437 28083 69927 -75743 359869 58818 -854 16037 19101 45160 113720 75766 53760 -112768
11424 -1289 -340736 99133 9605 96391 -88414 7227 310215 22657 25050 23533 -45528 -54439
11412 -54439 99151 -46299 13220 32447 129078 -13564 -52757 12073 196671 -377940 93164
11400 243753 195719 394807 -287340 123292 -368043 99448 228928 188290 162163 -16588
11389 -79273 -260636 -47961 126757 -129830 -109866 67352 99256 196424 -36639 216023 411858
11378 411858 -50394 264013 -242065 -33791 -62202 90219 -85324 185212 261044 -21233 139607
11366 -40430 -287182 -125783 107854 96146 -314739 -234209 72232 -66211 95601 -89509 -63042
11355 -63042 -95878 121138 -55849 98299 -72799 51954 130682 -48642 -136849 -86770 52183
11343 -62988 235521 -146234 -240773 265334 -98920 97185 8889 -242987 -248399 -93771 72769
11331 47923 -139253 -164517 32081 -176619 -337541 296615 -117028 -23610 -645 -127462 -93322
11320 -93322 -84688 -177668 -235758 126512 -191146 -32794 -2384 -282770 -199739 -39643 99245
11308 -113420 -177551 -47141 98542 107425 164348 -57799 -131285 133162 -132366 25115 12690
11297 12690 45282 -152249 40504 -105614 -240654 277298 -223523 -46309 113455 394931
11287 394931 260489 -233932 -33308 104454 -343878 -153343 93604 23579 -88724 216038
11276 -106282 181227 -4858 -133484 214027 -334307 -373527 -31416 59352 -198859 21547 101233
11265 101233 20939 -173496 -84808 -82741 -140414 -385008 -363805 -32038 -277113 9290 238803
11254 238803 141772 -164663 27446 -191432 -95628 109628 1386 53135 2729 -44350 106619
11242 -145978 191733 312153 -5820 -50408 1048 -126389 -158242 131203 -185429 135001 -162641
11230 -113051 -20294 -1924 57232 -56077 32946 -287919 -24980 -265056 -18308 -26185 -60619
11219 -60619 101974 170837 2498 226770 62518 315963 -58227 444315 275301 220065 66978
11207 -16885 290482 -221668 -66796 76395 233292 -233168 -19838 -91751 -25955 -122006 -23879
11195 289802 3357 -552779 80851 -91240 195605 183290 -297103 102170 -208007 353859
11184 165672 -133039 39912 -35632 -127212 -260020 -88088 -5313 -120009 -199150 -238432 220521
11172 -89979 234074 78065 115700 293604 31294 -78427 -80266 -320546 -48892 -81607 164566
11160 181720 168220 -55871 -194969 5025 114525 1558 -123763 -250694 -214366 77972 77240
11149 77240 -41240 -69852 34381 -19805 -66803 10104 -176338 26959 151115 -99648 -64488
11138 -64488 -244109 -132329 -48086 -36473 173376 -282468 41697 -406 200110 117489 7741
11126 218311 -139321 249821 -404330 -104162 -240165 -66097 32617 27309 -21823 160513
11115 -295508 -187550 -11315 321722 -188696 118941 284367 -214063 110727 258328 326038
11105 326038 -15872 490329 117941 134014 160048 3671 -100522 300134 203753 59598 67683
11094 67683 162162 -209299 -3429 40058 -150689 395694 358229 197208 130949 326505 206287
11083 206287 78120 43457 543672 187354 286502 131768 558838 370988 372736 16442 522625
11072 522625 294477 424290 335954 213626 443294 660358 371561 490118 623496 374662
11062 374662 657207 466494 419330 655544 571720 809738 645364 499527 644813 522341
11052 522341 638498 940116 902899 729814 1302330 691439 650215 1129500 593078 576377
11042 576377 921033 698637 784824 890797 748080 916991 889643 954336 829616 470749
11032 470749 887949 726321 886946 743283 892345 1352686 893126 630524 721209 938125
11022 938125 737056 1053118 961943 594906 777096 628946 550973 827304 728500 540713
11012 540713 597251 703686 676783 743402 727944 723725 542332 419853 717321 687370 601948
11001 601948 770580 847822 414373 830023 745577 909513 378805 628406 549245 806829
10991 806829 1035765 1012987 768120 643002 1149100 770821 992720 1208835 1236300 1164494
10981 1164494 1316954 1405365 1619041 1797692 1994313 2402872 2912029 2819130 3000554 3327437
10971 3327437 3337204 2987265 2640047 2337072 1898462 2059139 1914129 1892781 1664134 1574822
10961 1574822 1506339 1596951 1104913 1038385 1746063 1227666 1374842 1198155 933503 736008
10951 736008 715958 700695 466309 223564 612020 132031 166420 456661 -62543 278505
10940 224592 171393 443397 164655 136165 -71426 53192 28030 132667 -136738 -175941 291287
10928 -49609 -48643 20139 270671 -134655 93680 151926 -229082 84027 313870 -66471 -245059
10917 -245059 -13895 95790 -121491 259402 102994 -133171 67313 -114327 59955 336962
10907 336962 275770 -12539 -46224 -384506 -99039 -52316 -186030 -49625 -70082 -79493 -375774
10896 -375774 -411182 -305442 -136892 -85342 56023 -258376 8448 -202911 132747 -154595
10885 -110255 -128520 -53800 51368 99883 152392 -25765 -173375 76777 -30113 -56069 390635
10873 132597 185791 -92292 -77122 165355 -215617 93007 -236331 -74218 176415 187728 263675
10862 263675 41805 13491 -319472 160031 -124515 -39094 22545 46202 -39605 -226639 -45315
10850 332983 131219 -81362 -268025 -175416 -98487 -46410 -320810 285496 82527 135019 91956
10839 91956 76243 -151485 -188206 89567 -258556 106244 36671 160199 -244019 -203407 -362693
10828 -362693 -131676 128722 112225 21057 41050 17146 -129904 -31091 131662 143083 -101004
10816 -251781 -60116 185204 -94671 -134901 -270054 -101414 -242362 177307 -167552 -217348
10806 -217348 -54376 -182050 -291949 -73839 -55202 -221282 -156495 -12789 -157538 -217656 44523
10794 168608 97192 -328711 -214995 177193 250533 170347 10816 31053 -91614 -1009 129827
10782 -233120 64217 -362356 -88427 -82605 -381925 114601 -10650 946 -379540 110473 -453279
10770 -42968 -50254 199618 -171992 -426454 -51262 123128 312355 264787 40738 78652 -17205
10758 -293186 -83005 -236808 -448566 243692 80128 -158718 -11222 -43326 51129 -239098
10747 206306 -148259 89524 239294 127212 259711 -373156 -52621 -399974 -82180 192243
10736 -91377 -111948 -170875 299975 102724 -76258 -27342 -187516 -41864 -69569 26666 -76418
10724 240524 -311020 -121200 -59936 319107 -146967 -172321 195979 -98743 -27348 -240973
10714 -240973 -200648 36647 -278179 239133 -36545 135999 -191346 -114486 204182 -253345
10703 -66854 42111 -55549 -74118 168675 -66240 -4928 169907 -290014 -68227 141197 -124205
10691 96370 46680 -144375 81862 -137106 219079 44228 -249846 43541 19312 212707 -103901
10679 253384 -263789 -138031 -81052 254245 -29270 249528 -233483 67152 -167800 -337301
10669 -337301 -173429 -14848 430659 -79397 20964 -31997 44733 -117527 -61573 -171495 106983
10657 179988 -2672 -176366 119282 -53309 -107811 -106552 42824 -367943 344299 -197292 354773
10645 -262714 -146126 -272856 -212672 165399 -203828 -48340 -61177 25260 -391131 190846
10634 -223902 -10337 -86036 -106815 -71694 -288896 105126 -145125 50917 -187584 -80156 133933
10622 -121374 -175914 300133 241150 98206 142766 -354231 159651 -306268 -138014 194909
10611 -356100 76151 24481 -274838 -157815 67892 279826 -248988 82184 -199198 176003
10600 -103466 -74095 -289362 -96300 -67404 -121866 -251697 66634 -129736 -15560 35922 -184111
10588 163136 -153941 177540 -60879 -349812 102218 -14045 153517 -85608 79407 38341
10577 64385 160623 -113246 51811 -233713 -252211 -17054 -374654 -72788 -146007 -463850 -287631
10566 -287631 198113 -156563 -210901 184932 -331550 272264 -267234 105702 49170 207481
10556 207481 -57892 -147315 -268892 -182386 -11653 -159541 -128197 -59634 -86823 -86143 -114967
10545 -114967 29329 -32217 6621 354236 -143662 -240034 260856 -116797 77070 -16573 71537
10533 86864 -268928 -253438 195341 -378728 -17153 -129705 23348 -58218 31754 -290648 106705
10521 -69283 -131737 -203554 -194909 -65342 -325164 -68604 89576 -56910 143409 -316686 79833
10509 319469 135037 43326 -96434 32112 182016 -81093 -132179 -55722 -227897 138561 -59137
10497 231659 66312 110322 -331848 7505 -18616 -302469 -81358 73101 40813 -96667 191270
10485 184977 183595 267728 210953 539361 525120 43525 -10899 240309 166168 -82606 -72624
10474 -72624 88909 414757 76582 -4205 -25250 37875 -200881 -129210 132231 184256 -241800
10462 -113626 121334 390214 49942 11583 87660 -136081 -171823 -26987 -229432 121772
10451 38153 102329 47549 -14909 -63631 45625 -147706 -1241 -66678 -64269 -243782 -262813 -215315
10439 -215315 58183 106888 -89822 -103540 -91388 210134 -16350 -38017 26508 100142 71403
10428 71403 129071 -191465 106463 39076 76411 138827 -124546 -295664 -350671 26985 -24191
10416 5422 166003 -265752 -107638 148493 -23710 -195699 -20778 -104925 -288003 -149423
10406 -149423 -245288 90805 -285032 350466 13055 171251 -378618 -55943 -39419 216288
10395 -63213 148111 107264 153743 33089 -286133 164319 239379 -9504 -193843 -158761 116019
10383 182735 -88916 256083 232182 399428 182220 135473 478450 319103 105977 193925
10373 193925 150141 155237 486939 155998 187824 495179 596100 630181 504102 497932 448676
10362 448676 196758 232376 237407 277172 166365 501290 292686 656948 700722 385518
10352 385518 635158 773844 553161 409427 255136 276294 415681 544183 439835 318109
10342 318109 196743 291970 490920 -173186 694345 193001 396062 182589 291530 -219932
10331 -71482 -62495 98559 -60901 418039 67739 390551 20718 74272 501603 -81775 181640
10319 98105 -155710 149825 104483 -282619 -201868 -160987 -10410 -62190 -170703 -259137 78005
10307 -30415 119445 141774 43962 17141 -216953 -354859 -53628 -101741 -1029 -79239 248362
10295 -84035 130677 51863 304696 -262617 -43696 375532 -172294 72551 247594 -163320
10284 157069 -64416 -151141 77262 -5472 212341 -99437 85700 13650 -86663 162060 -38761
10272 258706 121529 186928 -304588 -151407 242804 -170721 173323 129118 607402 261974
10261 272052 415505 236221 355002 -114008 199333 238501 -85185 -44812 -34027 72168
10250 142418 147093 -213525 -210774 103667 9808 -70721 7984 -190435 -309232 27473 215160
10239 215160 -100012 -83757 -268837 -136879 -260534 39879 -267370 -144392 -119295 102138
10228 262100 99426 -129476 -293152 248372 129568 -259171 -415853 -189341 -77094 29188
10217 -378875 -269652 -256011 -141661 13728 93947 -204030 -343123 144875 63647 -170356
10206 -426185 -246736 -245641 -262575 -816 -131097 -155960 -86642 -13945 -94148 324820 -182081
10194 261712 -267303 -107091 17262 -89367 -157558 178210 -123646 -84534 -64810 89408 -96744
10182 -349583 -158652 -49148 196685 -30716 -106646 106914 -177006 -66560 90411 -166700
10171 -250753 -587969 -74655 24040 -155363 104943 -264440 331646 -20145 108143 218326
10161 218326 -156195 -154200 -128069 -97848 -64018 29646 -87262 43797 -133477 63436 -29190
10149 361026 -525069 -44617 -106881 -92625 -52740 -311511 -279837 137043 10689 -37666 -194363
10138 -194363 -66170 -43908 186763 108794 305713 -48331 106093 -238026 -354826 78332
10127 -196320 84846 289350 78842 227904 28784 -11302 -121966 113704 -285887 -114519
10116 -163811 -313577 125011 37539 -210687 -139492 -38648 -23499 -131262 -74661 82858 -294472
10104 -140413 205761 68576 -79077 -83643 -59305 3747 -101888 -209676 270634 -2577 -124051
10093 -124051 -343100 -112421 -208167 158922 -93807 191852 63036 -370823 -153333 33639
10082 -219580 -119323 -152899 99976 100471 -6072 -351371 -107770 -10781 55801 -20734 -87149
10071 -87149 164860 -208563 113719 109761 152994 146591 -109351 170090 87195 131693 183081
10060 183081 -200223 30508 101657 7320 -163751 64603 122192 -103119 -76177 65964 -286984
10048 -123472 68931 -74941 9792 -105989 -86644 -96743 -104065 303732 22192 58705 -113056
10036 125473 -302901 -422639 -109029 -248652 118087 -52241 -717182 -137606 -27990 -123363
10026 -123363 20900 -189841 -286488 -350307 -177947 -277873 -111263 188192 -21536 399 -292218
10014 242121 221247 367260 -90857 67888 -41731 -101581 -15189 -116537 34063 -130200 19074
10002 67356 -31316 348726 37869 -11600 249964 -315420 181314 -159435 -161901 153624 121915
9991 121915 280099 121436 9630 -5961 158921 -333597 6692 -10659 61253 16634 -133069
9979 326840 -146318 19241 -82101 -287365 -386587 473290 -139194 -262395 234295 182696
9969 182696 -155391 -252229 102593 -202683 -299239 -120598 164617 197689 97467 -77965 -32894
9957 95672 -177646 129149 132798 -146781 -436024 127646 -74248 -181415 14588 -437515 -118137
9945 -392330 -106092 -23061 -227054 -44295 -190246 254092 -29183 -204118 -234980 -196414 13505
9933 -201790 -259106 217929 -170195 -123667 -180504 -26655 -37815 -430041 85846 -290798 107435
9921 -212459 108291 -232504 -104819 -207358 150781 89464 56319 46646 26920 -65426 5509
9909 -182340 190834 -20713 -104257 171557 -22648 275916 -229542 63533 -264116 -198068 -250347
9898 -250347 109708 -241011 -280090 254083 208660 41833 -104568 -345406 185149 49262
9887 -126018 -4452 -177014 -249430 -224193 -72141 -313321 -47451 48110 39470 41076 106149 -248064
9874 437526 -171032 -421854 77900 -298271 -22570 -298772 -354242 110499 205155 64325 -253681
9862 121316 -31889 1615 -100069 -44381 323118 40253 -245864 -41377 65269 -83073 -91313
9851 -91313 90742 -118946 130562 -202606 -4775 -145263 -117409 124891 -53829 11015 -265532
9839 120828 -30984 -149888 -20697 120981 89045 48687 -81716 -58092 137000 -52717 -240875
9828 -240875 -86262 -83689 70630 93122 36528 32089 -440354 -122515 -205557 -194489 -35668 75215
9815 -89346 24184 -354697 -230234 -205911 -41060 24432 232776 -366707 -380112 -1507 41749
9803 27265 241088 -156957 37061 129565 -297013 -139156 -319492 -22150 -181974 -292371
9793 -292371 -52168 -248319 -355326 -165299 -72503 -352218 -33641 235473 -12736 -123618
9783 -123618 196118 -146998 -8863 392162 111231 -114934 -50239 122841 -63367 69913 106976
9772 106976 44709 263550 -51992 -80512 -9710 148523 -89397 -181619 -96993 243378 4831
9760 -170681 22062 173326 -104609 -51183 138977 153706 114157 -150638 85332 -71596 -130896
9749 -130896 424093 361025 31593 -62001 -206069 -96192 109914 -90982 249268 -65712 -387459
9738 -387459 81272 -4553 256465 31481 -255821 -609807 -98088 -41463 -230836 335205 -91889
9726 -331034 -296222 -19143 -225132 89805 346723 5700 8432 27444 -78259 157698 -51937
9714 158706 -309178 168265 218127 29446 -234823 -91410 -98530 46552 -9252 -110190 -234153
9703 -234153 -97035 -206628 -117931 -33651 -317363 -130742 17703 204988 -75101 -51607 139774
9691 -34158 -163759 -240125 319568 66385 -83086 -62537 -164943 -211491 -284222 -142721 362675
9679 -27830 -92030 -198599 53274 -109506 -117573 -3789 -229627 -62895 90665 -306229 123984
9667 -106211 -44922 -219247 -345732 -18590 -214992 34442 -139319 -191298 -109725 179530 89238
9655 -165437 -590477 -193592 -269950 -45862 -198752 -178702 -57543 8863 63591 138136 -89065
9643 -159412 161109 -34807 239844 -161192 127291 308554 -262062 269534 -103351 -152224
9633 -152224 47007 -78281 -126344 -165973 87499 -320898 199151 89528 -129430 45949 36520
9622 36520 -355035 -68332 165650 -48524 -54282 -92859 47713 -94082 -189645 -31855 -270095
9611 -270095 -19077 255246 -215558 -324087 34205 -414108 -398064 45506 -138390 -73274 201395
9599 50820 68123 -238793 -103521 217660 -46966 190928 -437971 -153000 148082 94442
9589 94442 -262079 -105686 -120365 220685 -63912 106397 74025 -461498 -380543 -229816 -26088
9577 -118226 -130610 -101369 23473 -239914 -421070 7775 -83483 -8545 -263768 -171794 -103334
9566 -103334 16736 -85749 59148 -407608 131905 -33534 -1307 38928 -95753 158768 -122560
9554 161140 -373927 12618 145923 93853 -197486 -25624 -125653 93433 591 187210 211492
9543 211492 -138450 -85602 -127655 233988 137195 -107089 -320715 146339 48905 18569 76830
9532 76830 99364 -395145 148077 -48836 -398335 -37638 -193467 -344879 34057 113360 -207540
9520 112400 228316 -159681 -150288 119076 -62178 -291490 -133533 -33414 -17258 -205694 113568
9508 290957 -144757 -94415 -8182 196526 -42585 -123299 8192 -382063 -150155 -69103 27367
9496 -69788 -105074 -430435 -53131 149722 -85213 -147654 -292185 -225313 -65078 6714 -433613
9484 114299 217377 -81249 -10928 -138975 -15835 -3243 -174284 -48114 307863 -100768 -175761
9473 -175761 34278 -147707 10905 86485 -184639 -360363 -82207 -107016 145412 247830 -426656
9461 208030 -146204 -64743 -270439 -219828 36928 -132653 213249 63630 -240088 -218253 -42193
9449 -203327 -126184 -99314 -73738 -35335 153067 34198 -265707 117689 -34556 -173314 -119997
9438 -119997 -14161 -252317 18440 -163110 181728 113478 433695 13207 -30532 -41150 -372513
9427 -372513 146410 -29857 -24244 113008 -81315 99468 -367643 -383627 -135656 74315 51063
9416 51063 -67769 -244634 184759 -79703 -356547 -154504 -3037 323840 -73978 44029 201570
9405 201570 68965 -224738 -534794 44771 168080 -31860 231765 250598 -5645 -101490 156172
9393 83008 -35777 -146780 -167774 -290379 96487 -202659 94025 -15607 155339 155025 -134007
9381 114922 -91775 53144 -227039 -222412 -318378 161369 -77645 181099 -158565 -155745 -331950
9370 -331950 184030 55776 -135560 -154955 -309121 -161819 290099 38895 -399823 -19492
9359 -208753 -300510 -64994 -11896 -261345 -164376 -519107 -302286 -199548 -157738 66559 -331469
9347 150279 -239080 -266223 81048 -123736 -259917 -79238 26373 15899 -121315 -342248 -31970
9335 -79028 151451 -113441 -62367 -92314 -11211 -268235 83520 -67329 -224233 104421 -69630
9323 155598 198708 82899 223261 93038 -143069 -161857 30045 123544 -228590 147821 61431
9311 318701 -17524 320079 134105 -365053 -47142 23603 -93649 89524 -127808 -18685 249764
9299 -251084 -163932 23229 8180 197691 -433829 110248 9855 -145672 -86654 -11378 20648
9287 -324288 18862 -290461 -97377 -441868 -23113 -22127 169958 -367015 72445 -200225 330447
9275 175752 47997 215205 282265 -161375 -178465 -330666 -45087 -208131 60682 -15313 -268523
9264 -268523 -21063 66216 -108142 -159267 168127 -176312 -135624 -165089 -334326 69151 -236029
9252 165727 -306418 -190994 329144 -144234 182720 23419 -29711 309902 -147275 213649
9241 -402169 -107047 -211725 180156 -12147 -42911 169902 78385 -78266 247435 -195490
9230 51965 -142874 89381 -138589 8611 -71362 11297 315183 -32087 -218567 -437306 279932
9218 60287 -329909 235985 65879 -179254 -323934 -183410 140485 -208517 2472 -119112
9207 16852 326137 -309579 -187387 -71505 167754 61070 -214619 238194 -356122 318577
9196 -193204 -213696 9010 -121744 -43006 -745 -315604 64519 -88816 -268714 -138027 162326
9184 -367502 -167523 140541 -40971 20606 -89345 -301064 -313771 -6294 181855 -301783 75529
9172 145398 -352775 79868 -182619 149525 -246988 -194226 -12386 -83250 413810 3430 108392
9161 108392 94368 -20618 -390646 270284 -102033 -63837 201476 -65017 -44573 -240048 -363824
9150 -363824 -131177 -53889 252155 28864 44387 -405539 346577 -11801 -2037 -221782 115511
9138 -334296 -234040 -179543 -165346 -265396 72827 -224443 135049 183098 -86767 -180143 34219
9126 -99586 154266 76785 -61197 -311596 -132434 -48864 44369 -156342 -98424 60939 -201015
9114 -282154 146486 -37460 -156987 -144009 -270092 -90977 106115 -132377 109353 -265139
9103 261269 -196952 -492707 -313962 -142859 89400 -138092 -216550 72772 -54836 -72096 72265
9091 56527 100108 34277 323481 43900 178304 121292 59721 -148146 -44466 175531 -256133
9079 -30399 -142340 -221957 -86662 -14196 -73773 55004 39765 -16055 -154316 39537 107057
9068 107057 -116122 122135 -214110 52659 165504 -69157 78094 61239 -341633 89752 99401
9057 99401 13361 -250674 85318 -151131 -79139 -202531 -312369 -352671 -493429 -248659 -216250
9046 -216250 -78649 -366589 -210931 -274157 -133534 168949 35004 -59561 -82745 -167108 140999
9034 -210460 -123317 88631 -117572 -511031 211540 51111 -316455 -187928 -473262 77582
9023 -154806 -86242 -85371 -323678 115186 -74456 -371110 -131926 43181 -99118 348838 41383
9011 339726 -105922 -98466 -123622 -116884 10626 -115272 -142414 131250 250399 134417 240954
9000 240954 -243058 155162 -202212 171851 -226896 164949 -261220 383208 -113606 7076
8989 233202 254028 -66182 -116657 -143824 -75696 191439 19678 -10017 112484 -85339 221354
8977 13108 -415095 278753 -108851 -171375 21322 -23983 -132739 163662 157835 -135303 -93582
8966 -93582 -140221 27392 -17294 -122514 -181464 -102464 -37126 -218008 -152808 34392 -5500 227345
8953 25082 -107162 -272516 -91397 4713 -330192 -129253 -239283 -246588 13571 -75700 -78842
8942 -78842 126445 122368 -85782 129769 -294581 -142335 190164 372564 135939 -167929
8931 -34750 19752 -27664 -67428 -74163 -74648 248070 508605 1127573 4376256 9338467 2191538
8919 638768 153920 497481 -236376 86304 201161 -25295 34540 137704 76237 -133855
8908 393859 301407 -195716 111872 -315402 -27014 144615 -47917 116235 414126 80104
8897 -99050 -517 236585 -374991 -353969 16623 -157654 -312292 -3760 4964 -486109 9395 -209691
8884 72677 82266 225635 -78736 260247 80159 115997 -379778 -135158 32339 7119 187766
8873 187766 -106901 200318 -84953 63674 155966 39330 66293 12360 -111638 11897 -86681
8861 -125844 -238468 282828 67752 9646 70861 -11481 98752 194282 -86197 73837 -30820
8849 -113315 -430593 -338410 -332271 -170780 -342182 -79879 -357573 -94429 196555 182426 -327268
8837 -98837 -288770 140859 -175800 -33651 -251088 134031 -74945 8385 255700 -289360 32221
8825 56537 -211850 25180 -84864 -50679 -84781 -332894 -58836 -163019 75917 -110287 -250064
8814 -250064 -316577 -25061 -301600 -153938 -135786 -119243 -166449 320598 -49850 41185 -331967
8802 182545 43167 -319079 -83547 -87704 -258952 -268987 82922 84580 10577 -329076 -66418
8790 -218236 132385 152258 -67602 12554 -106718 -162991 79726 -35721 94016 -49176 8813
8778 -127464 -205486 183795 199915 -235202 -172952 26763 -124825 -67310 200767 -84497 79441
8766 182258 103188 257761 -492590 147533 503036 52006 -180309 -223825 -261327 96624 -139067
8754 -93000 -225969 -82452 -100776 -402013 -161054 287282 271885 -154321 339320 -107094
8743 -159189 53002 -342247 -149368 -241 19827 -93292 -130577 -158876 139130 -177493 -37014
8731 -205984 -187263 -56772 150150 109232 -262963 11653 -52999 -12495 -165858 -287030 -29466
8719 -60988 73521 -4163 24314 82259 332916 91767 -38441 45312 189058 -82536 194264
8707 -70795 -406254 -230171 -5063 -85386 -8170 -267693 -122798 -99354 2394 2813 71773 -199727
8694 -99915 -113320 337625 -209379 -18953 74660 -184994 -107569 55453 140912 -237268 -225206
8683 -225206 -23065 317343 17949 -7179 175598 -371286 -210790 -153713 212947 -111150 -342263
8672 -342263 -79515 29250 -86831 -378771 168673 -432447 -271491 -163699 -275479 -400089
8662 -400089 261506 -709992 -256848 209922 -481869 326715 -154565 -36121 50910 30663
8652 30663 -231786 183858 -200137 -585712 79835 357300 -328455 281240 -19320 31263
8641 -334600 -108390 297612 126566 -106116 -124176 -209432 -118774 -35472 -237749 -239715 107982
8629 -115542 294087 66552 75984 -226608 -57647 -145225 98114 -397858 -78672 -150731 -255331
8618 -255331 -97460 -102442 29654 -103350 -96155 480325 105137 381642 -277825 65963 -21714
8606 -268529 -12600 -81017 -155795 -247921 286468 -242024 -54016 89291 -231712 8994 114259
8595 114259 146258 -113317 -149527 28928 -89998 -156339 -175374 105284 -28826 119388 -59909
8583 8085 189311 -242142 -238508 -312525 -36404 -39313 123965 96734 148746 -203409 -119742 -20887
8570 -15058 41559 -228892 -402123 106453 -263089 -356037 -29827 -169709 55096 39000 26766
8559 26766 143475 -97415 143104 -29433 10378 -157855 39454 320709 -7785 38033 -2097
8547 -42168 -143544 53579 113389 -128846 190759 -346671 -96384 82363 139944 -96953 -227230
8536 -227230 105482 -352900 -445553 13952 -67133 -15326 -228659 124407 218307 131021 200006
8525 200006 254782 -70382 -66177 422209 77102 119662 11247 102201 264879 44935 74769
8514 74769 -258704 -166371 88380 -47747 12008 -17392 -171784 70 -154235 43777 5136 133796
8502 133796 -143435 186598 -369188 -124730 -151312 -143052 -100376 -43771 168811 -242259 42565
8490 36975 -180642 -184905 -261205 100805 -49486 -36846 124036 303285 -426739 -318327 44157
8478 -89128 63038 23810 -496436 -167595 -177575 216541 -51905 -145638 5714 65781 -238421
8466 -352104 155829 -384126 -41018 4617 -90586 86428 -74897 182211 106674 -123062 -122712
8455 -122712 54243 294494 -204286 -328699 -86413 166269 189859 -115425 -22606 19390 -218983
8443 -116738 229107 -98846 -50246 -43913 81101 -99123 -160662 -109575 96852 35664 -142547
8431 218753 -215275 248497 -2418 32863 -48696 257345 -68787 -186898 -390563 14867 84438
8420 84438 65024 4010 -121785 -178314 110591 -249123 -43238 -195776 169355 46065 -192691
8408 -359327 -495758 -199352 -145869 160906 186580 279366 -168966 -40677 271608 -943 -115070
8397 -115070 93567 -24495 -181995 -30378 -225734 323873 -35721 315361 71767 -350169 28014
8385 -127463 -73834 -28446 39363 -312343 -200946 -203549 306567 133941 74420 -128832 -163861
8374 -163861 136082 -225017 -138365 -284872 53289 -106301 49279 -4982 25204 20979 -538148
8362 51631 -36804 -32181 -63776 123157 -56957 141013 -76846 -33624 285765 -51558 -141933
8351 -141933 229767 -221564 -114577 19759 47352 -56463 94021 -96631 -158983 -199276 140678
8339 -130799 -119583 -244029 -425985 246601 94660 -83855 -21647 -136511 11202 -119837 64847
8327 97745 -64132 206456 -41393 242067 136147 83698 3613 -17579 -169211 -460318 165908
8315 -70318 -256553 -69289 -323158 -97497 152198 -137859 12772 282650 -126629 -3150 211752
8303 -269616 -1345 -139719 139644 182189 -83310 -239234 184834 -407494 -89662 41123 -67932
8291 -259354 -40749 288385 7598 317390 -205701 130996 45827 131047 147824 -334310 -88476
8279 -99185 -106061 -156035 -42906 231628 -303171 91459 -58987 -199916 -101142 -116947 -353196
8268 -353196 313064 46656 215066 -101489 -262020 -396215 53491 50312 -167759 -339197
8258 -339197 -390558 -110147 213031 92153 -165039 -176166 116244 -16541 39659 -117944 -149336
8247 -149336 -209959 -183480 187590 -61295 -49609 -51214 235771 -145231 -143883 24361 68996
8236 68996 49304 116025 273097 -8089 79596 -359372 -6 81395 5024 -132077 -241115 -4019
8223 -82405 -104557 -272020 66446 -123816 -143645 -112954 75397 -18773 -148488 85424 -358500
8211 -58228 -54666 81811 136047 -168468 -245632 177475 190747 174042 79558 -86592 115322
8199 234313 -191355 -335442 107418 -166790 45849 -140890 -9458 17160 -248267 60819 143287
8188 143287 -162839 28551 -91680 101139 116814 228915 -275261 -141874 19900 284861
8178 284861 220918 101727 53685 -154947 -13688 169447 -52041 19696 -280099 -87500 -183569
8167 -183569 -107878 128083 -211970 -338108 -426886 -230300 -384088 -126653 283497 -130775
8156 -60704 39851 -102234 152800 -34846 -120668 -5537 274673 225264 -295037 -115901 294791
8144 145599 -230370 -199380 -83213 118641 -76155 85537 -132161 -17104 -77636 114841 -169444
8132 -28436 -144989 -89316 -165972 -43075 137693 -189117 -168694 213483 55365 -158974 -15720
8120 -60916 -333061 45593 -235870 -208163 -129500 -177631 -38295 115757 -224327 83952 -210820
8108 -180403 64147 137467 35640 302442 -516271 333048 223465 -217041 299737 43082
8097 -41424 243236 -169757 -136321 41354 -136326 68747 206818 -266999 -229587 -169793 -167751
8086 -167751 -176068 -151915 25797 49989 33659 -185454 -25375 -30779 -149071 -168833 -176296 78517
8073 -360651 -158793 -49348 366734 -108298 -450761 259583 -162445 -284687 298280 -29879
8062 34143 159262 -179499 197168 2205 47108 -343341 -82734 -289647 137475 -320222 150504
8050 -133560 -61526 -41034 -236178 -205856 -163910 -176862 36421 17344 100840 -60586 -312732
8039 -312732 18257 -157697 129573 187178 -241424 -320754 -72353 -176965 -15385 -175143 -138212
8028 -138212 25320 154765 -227470 -257097 46291 211396 58516 -400182 -92749 145202 89013
8017 89013 54753 -159848 171813 349757 -266732 -138725 -119646 -151758 123390 141153 -329374
8005 33208 99666 -64419 52167 195425 -62680 -235511 -7635 95745 -51557 -3046 124549 -157721
7992 336572 -261414 -141727 -117427 80587 47598 63111 -64198 -135983 20829 -48073 141764
7980 -35412 4699 62591 -176846 80681 31193 108482 26925 -51485 -230525 -124607 189498
7968 244330 -30013 -78605 -345210 -102451 -109240 -245247 -136709 -30767 -118960 -289049 -188001
7957 -188001 -38914 -97563 -188839 -154153 -266087 121172 -97562 120368 -170575 174493 -11798
7945 -217428 72079 13184 -38071 184220 -76794 226178 -82398 -34391 212582 79373 -55580
7933 181473 38854 98672 -214605 176454 31170 -179586 81572 -212481 -134824 -63472 -502046
7922 -502046 -33214 -401220 312287 74055 83346 -134611 20954 -347454 21243 -277048 64489
7910 75054 -53147 -167230 -116151 -28982 -133678 118817 171399 -183198 -149989 7409 -265798
7898 31429 328449 928 -66315 -203176 -127238 56165 124759 11615 -28639 -227482 -318890 231250
7885 -6326 -174660 264064 170089 -153474 -129067 411981 -75701 -178458 110722 -502721 6983
7873 -81260 135716 39527 169938 -81815 -168335 72810 -144608 43093 71941 -313485 -35710
7861 -75160 56908 107339 -14091 77942 203956 59361 -213929 37554 -121912 -180001 -78347
7849 -16139 145715 -213264 -364168 11627 -266149 46159 -137325 -91796 -73173 109196 -274196
7837 56812 188871 109062 -72211 333711 190520 -20351 -47924 -124475 399432 -231922 -144758
7826 -144758 -173065 177886 30650 20865 295381 -336177 205171 32035 852 54605 112360
7815 112360 200066 -105661 92404 -185742 1790 123590 -140755 18673 -32303 86154 66675
7804 66675 -36807 405710 -360199 151037 76830 -144049 -357970 97473 -35694 -297478 -95770
7792 89829 -182763 -135445 -156077 -18822 -13661 -69011 32899 -118426 51414 105683 298744
7781 298744 -55022 -40230 -120265 208749 -45953 145486 18818 54233 -240335 -148822 359497
7769 -428848 222305 -28540 -355633 -466887 -218915 205052 181454 309836 -260014 -415133
7759 -415133 -68836 -164252 -111985 27580 115453 -224072 1562 7878 -117860 447385 88145
7747 -447707 -238187 -104036 78641 -36029 -91898 59578 -191509 81188 -49562 101005 187252
7736 187252 -33596 20967 166701 154421 87708 -107229 -112930 499567 -48070 194763 -53155
7724 225587 -71884 97257 43240 -579456 -94057 65759 -61160 -192190 -264747 152553 24457
7712 169547 109035 -47086 272832 -37653 10023 121297 -154615 11772 -22553 118518 125494
7701 125494 -268628 -185358 -252998 -305787 65438 20158 324210 29261 -257993 -184631 192314
7689 -173047 -341480 247085 91078 147896 112803 -26880 -139479 89709 -181185 57612 132813
7678 132813 -95704 -544535 72056 174195 115576 -109882 -370276 -163912 276153 218823
7668 218823 -381861 40194 27485 179406 -264118 -284135 -100574 157395 57426 44369 223
7656 10277 -122392 -46481 178705 -162091 11549 -104013 -83679 -82499 156747 84898 -160058
7644 132909 32391 -151311 3975 -115872 25246 68092 40369 342950 -195331 -267867 87409
7632 -393716 51197 83138 -102091 -159210 -215382 420907 -159643 -22454 79308 -45950 7049
7620 -17496 66186 -150991 -108975 -224239 -306533 -206107 -17129 69365 -5604 -40285 -128512
7609 -128512 -19026 -215648 -142926 -95076 -163667 267722 -69183 329514 -40924 -15003 -267937
7598 -267937 180892 -22900 38156 -137764 -6837 114464 24693 182639 -285686 294877 -196154
7586 -141386 19301 -258740 8606 120191 -221098 70694 -35028 -13535 7508 -505292 -42144
7574 63676 -141113 144522 176927 -229743 -224547 170205 25894 -96150 16346 132574 -349424
7562 228489 87632 432950 274946 -152686 -365921 -141303 145985 -79262 -171288 -273792
7552 -273792 141500 269357 -267086 -169527 -279498 -110927 162729 37300 -151815 -345002
7542 -345002 -266524 -352632 -72600 -71282 89224 8476 -236063 193336 -127695 -112899 -225274
7531 -225274 -86853 -449362 -367724 201827 68973 -338818 -148334 -2972 -130276 -4359 -153644
7520 -153644 -480869 334887 185872 -221158 -73075 -85864 135245 66324 -67185 27142 -106449
7508 -77469 -164027 -57298 299960 -70229 -239623 -143246 191671 -161480 -82902 -231362 227398
7496 22381 200484 -100372 -3345 -342862 108979 -240625 -24654 361174 -114283 48298 -61937
7484 -524415 -129587 30568 219734 -5458 -63582 38974 4856 -105369 -246757 52267 -105663
7472 142873 -146234 39276 56227 280908 -95655 -132617 281712 -342384 -22141 86641 -8372
7460 -389154 -292887 159209 295168 409844 176920 181687 156412 35215 111044 -23103 -13811
7449 -13811 -11549 -105506 -29421 102668 -266537 -49827 74853 -10888 -287421 86534 -40746
7437 -171835 62501 -278007 17929 209112 -147715 229644 -105243 -281542 -373388 -172567
7426 -122155 -341858 -114550 -359797 -170229 100735 146990 -239432 -1796 -208938 -3995 -712
7414 -76522 39858 286609 -230263 261151 239288 -17830 -123389 176382 -265099 99411 14251
7402 -141984 -249828 99043 -134375 79670 -223561 -86489 -82607 -493689 -76803 2713 -41479
7390 -99650 -256140 99413 98340 69430 -175399 -68165 26598 -70921 29499 381310 -102038
7378 145369 63195 164880 150092 -192556 -66933 -202099 -99235 200947 -166016 -28053 187884
7366 -251025 234 16308 -111143 -42615 -156087 49934 -52755 124588 -152372 -195158 24021
7354 -91273 -70819 9094 -150637 218033 -156832 -242107 -104272 3119 60465 -12292 -150223
7343 -150223 -282074 -52953 276311 -90622 59516 -180470 -449038 -36202 -148128 271540
7332 -249785 31870 62143 -172794 47185 -229237 65234 -55131 -125010 25415 -39880 52095
7320 269647 -251992 44507 165723 -141701 46820 -158991 71901 -235054 -97687 -77440 -112191
7309 -112191 88897 13999 -230753 -15062 -17826 117531 114461 100781 -71650 56117 -20798 99677
7296 -570902 214778 -53920 -154374 155423 -93723 -24775 -138640 -170106 24870 85849 -132279
7284 35296 -208655 43974 291452 -23432 -16948 -199799 169673 66626 34888 -211183 140841
7272 59007 151637 -75596 -48195 237190 -353795 -111307 -76560 7438 119257 116020 -103104
7260 270425 152582 73602 -15861 -99790 1216 -381420 123465 88886 -81613 -186587 -28056
7248 72720 182717 45484 -447515 -92476 -30908 -157059 303326 -317990 199836 287898 -163127
7236 -262793 -148312 -51998 35782 -161673 -101805 -123401 -55505 -239972 347328 49462 10270
7224 67378 -83869 129784 201498 -55849 184866 -278060 40430 254847 496643 82865 83035
7213 83035 -225122 -38563 -249640 -134402 -171400 408795 -57784 154509 179633 -294010 -293149
7202 -293149 -17175 -33435 -54570 122403 -16003 -223320 56137 98971 189259 12929 -238224
7190 -20216 59428 256779 -362957 2189 -58377 219177 30783 19828 -4696 47668 281397
7179 281397 219565 25548 -66426 -201838 -286146 -137571 303362 57051 -179 -3237 53778 35052
7167 35052 -31264 -206956 193842 -285225 75493 304715 89153 65085 296111 -220118 -16703
7155 119227 119518 -232462 -161493 -33391 -78916 -44801 -374532 -89187 374577 3516 -218810
7143 -18259 46819 -118856 -228028 -264804 -332299 -52891 60108 -153781 -107714 45628 -345553
7131 -187542 186133 -144070 299660 -14387 -169231 91148 62643 115162 -61127 -97863 6533
7119 67189 -91162 -183382 -280315 149410 172688 -23950 -152773 318578 153693 -70933 -5136
7107 65454 -122218 -47109 27199 -16801 35478 401181 -33246 136494 -72993 -131843 -114007
7096 -114007 -261589 -95701 -255404 37380 -159360 -206321 33935 -62245 -209494 -83285 161500
7084 77462 24994 -140317 -95872 -338181 52938 198629 259895 -199650 -152347 84329 -80560
7072 -312698 -370037 98612 39415 -93064 4076 131988 -269327 -128346 -14194 124221 120924
7061 120924 -84652 -45045 -62355 656120 -111175 -70924 458390 -94246 -269324 265835 12188
7049 116796 275728 169136 -29726 134557 -171335 -103363 -47174 140829 107059 172128 -157273
7037 -322420 -165430 -323523 -40653 89372 -154139 30034 -328075 -398614 -147498 -346522
7027 -346522 276511 -148127 -182535 157555 152056 -201071 -12435 -105049 -167229 73367 65750
7016 65750 -256844 -58425 70545 -74759 -21416 157516 -312816 -98820 -158783 -26690 -104198
7005 -104198 -107301 -251034 1619 200809 81551 -56697 -93792 -81896 -168695 -305700 -41747
6993 129915 72133 320355 -195451 -56583 -166955 65464 -25436 -63970 -272205 -76408 344842
6981 -74997 -117301 57112 -279753 68546 -65364 12154 85049 -226608 57576 106220 262331
6970 262331 -6127 144031 -98061 182144 -224214 -390533 116051 38879 -201747 -145229 -164736
6959 -164736 -17920 32354 412234 73182 -70978 -313684 -281646 11973 -198917 109463 -180524
6947 66736 166427 186304 58446 -94316 220243 83717 271508 -273061 -31483 279455 -179178
6935 -37368 65748 -293045 -153244 -303640 -152334 -250168 -110668 111713 -508431 -299873
6925 -299873 -280049 139500 135819 -48453 299250 100473 134304 -342942 -293079 101937 -171133
6913 114829 1209 25147 -71530 506488 -85977 75600 -67466 32588 21387 241913 -106480
6901 101861 -67510 47676 -230897 -383714 -28793 65223 29415 81121 -182306 53407 81735
6890 81735 -38046 147367 109854 -257874 40814 122379 80085 -23511 -400895 153264 254290
6879 254290 -156277 65954 -11457 160962 253073 329194 61603 277045 341760 -60846 207351
6867 80253 102297 -110197 38558 333660 -204746 118542 -114966 84408 -2740 220231 5317
6855 -92400 152601 -252096 -167642 -152188 -91198 138151 -282587 -370585 -52195 1276 -53161
6843 58619 -77053 433859 -204849 -300742 -293833 -171135 119334 72769 -75238 50522 160304
6832 160304 76590 71800 108809 226394 -105829 -147034 -94722 -226090 140829 92285 87227
6821 87227 -53110 3893 24836 -143154 122691 6386 -197434 -77878 -42804 -231626 62594
6809 -150796 54495 -108910 20563 -254407 196097 101906 105485 -124184 -182853 105636 246035
6798 246035 237069 -144231 122114 -229508 213687 149437 122063 176400 -132127 146996 -61643
6786 -113206 -255970 90978 209441 -77530 -381593 -99 147869 -14244 243936 179657 -124343
6774 -101827 -103946 -34059 145436 288995 -454205 73342 99483 -215624 259975 27217 364901
6763 364901 332519 -324878 -74505 -95853 -146414 20389 -36440 -189343 -163474 70166 -211733
6751 95873 -34243 119552 91464 -361961 213148 -148573 12181 -304469 -74755 303215 -191138
6739 451687 186112 20948 -246003 -18592 96283 -262378 181206 -115916 -36673 144632
6728 256319 -158086 -162494 -417226 -191700 208950 12276 82723 -292570 102848 122598 -28981
6716 -38592 -368243 -59315 -148473 -379118 -44622 -292891 -61533 -71938 6253 30193 81944
6705 81944 -158713 -52719 -288918 226160 219294 -152111 -88651 36541 38755 -310274 -178488
6694 -178488 -217564 -125358 80850 43225 349478 -432096 -88005 60223 60782 -137881 -292075
6683 -292075 -300525 -39883 252013 -96192 -238040 -198120 115127 225551 9496 -197742 -26626
6671 180635 -37035 -170859 127908 211694 77814 -216492 61626 -94637 190294 28392 -74807
6659 -56298 82132 67838 -191168 40036 -54544 -49689 -294124 -99459 340740 -137832 -226675
6648 -226675 143153 143687 -55344 38469 74977 33671 -90478 -13493 109549 -202571 -312709
6637 -312709 -227778 -2170 -283228 -43909 77793 55871 -28376 236275 -64675 176080 244313
6626 244313 -114754 14092 -34400 -125915 -8344 108016 -112039 46983 -38003 101666 -80398
6614 7594 -9197 -92414 -213976 28920 166448 -42989 -358986 81079 -259688 -190220 -30044
6602 -132700 165834 -20477 -188284 -413193 -12694 -219051 67210 -46850 -26390 -4557 87987
6590 154192 -210094 -255164 229950 -4274 35114 328811 -8406 321878 -209081 57818 -125888
6578 -288354 -30293 292228 -73630 -158633 -192888 80599 46872 114793 -35073 176657 -77398
6566 78075 -64989 -155718 -160476 19013 -32342 -318743 -258528 -186338 24713 205323 -177555
6554 214971 -252871 156417 101483 132789 123296 377322 -66487 271022 95173 142535 43975
6542 46802 144649 192359 -208314 394095 -250674 -32428 339721 65299 57792 -63887 271297
6530 286220 -245847 124779 343054 -228182 -63397 87385 -74056 -224744 329471 -27097
6519 338267 27547 227881 46084 -373413 -25843 193768 -104192 163075 120884 234776
6509 234776 -302101 174149 -136427 8443 -69846 137793 -14530 69422 110870 -6096 68541
6497 -89170 187700 183701 -154882 -168401 -158465 -38587 -140964 -274072 131437 245116 -326987
6485 -31685 55775 -102269 -366170 -79728 -110967 71195 -17378 -128843 -118815 -33548 17667
6473 -90556 -165506 -71890 399265 101482 122977 139647 -178931 -214348 131100 -151006 458077
6461 -83554 80951 61598 206824 173463 21962 132685 62701 -50688 -210511 158710 62952
6449 -95867 99000 193045 -60769 -90181 130879 -65920 -45197 90801 47584 119108 -90434 31284
6436 174381 -136355 -226071 -47307 161929 -178303 -107849 260312 54143 -128414 139789
6425 -153849 -89217 146814 -169731 -155456 135740 25984 70477 -59310 -308094 -169403 49934
6413 290196 28570 267559 -56138 -178848 128458 -1214 -31850 36444 141878 170244 256372
6402 256372 -12363 -359903 -352790 -252604 -390014 39150 80860 -140391 -348523 4499 -59899
6390 -41373 44244 -24971 217875 -17063 -159263 -40026 -23281 -32829 414056 -132830 -177098
6379 -177098 -225855 121309 -42847 -101577 423910 132936 37181 -335323 61139 55730 106853
6368 106853 -5983 -166162 349931 -112345 254939 265183 -67591 32252 90031 -51572 2518
6356 33487 -222330 -90215 -94825 62639 -298534 -150321 298445 -224385 41932 -243264 -162304
6345 -162304 -89295 -402159 -91045 -255263 10833 303395 -102438 397299 38773 180010
6335 180010 -113910 137175 12599 51299 -485877 -206669 -255060 190734 69542 -6410 182811
6323 -242426 21255 -434622 34665 60814 68742 80375 270340 -33522 -11248 -335163 95291
6311 -64089 242003 77820 180200 139409 79397 173297 4084 196284 96672 -12229 6927 -132556
6298 30141 192630 -37742 13863 -134312 -130777 -340445 -108419 217646 38219 159086 -210971
6286 -46011 107219 16669 -139120 -518717 -155624 48876 -309327 -240234 18969 45986 4447
6274 148648 -263450 86818 113900 -169745 -236783 344287 107994 -340181 -18415 -22455 -102348
6263 -102348 -155959 -30463 -104397 34900 -173267 -8283 -105182 -215544 -52150 20064 -289028
6251 41659 -68496 -5815 252369 263119 227162 -169384 118215 3313 -68552 32163 -350622
6239 -24805 -156539 -116061 335823 74658 89543 123253 190528 -83849 -326805 25287 -21164
6227 -207217 187411 324256 122528 -42258 246390 191246 105777 -85693 -56260 -5909 -113879
6216 -113879 -190832 138674 -21596 -252145 -34591 -320308 27225 -87569 229859 12213 -37316
6204 -196694 60679 89606 52366 145223 211408 131422 237227 -187985 -340035 -112581 -109196
6193 -109196 -158517 -103213 -73539 146779 5610 -97771 -27403 164459 -109550 -66219 214554
6181 11148 169546 -55880 58824 10050 -44223 -49831 219558 -201911 10323 -46040 -94225
6170 -94225 212429 142479 -268158 -182886 106509 229202 -37413 -582728 -236193 -100918
6159 -2642 389511 164080 -274482 226558 8574 215590 -243360 94913 84208 -243386 -164700
6148 -164700 114713 43013 1823 18353 -63651 109248 307961 12892 71037 -336262 13037
6136 22067 134516 -148138 98587 -15713 9511 -357517 317575 -99824 -58864 -119848 -373173
6125 -373173 40859 -91611 131666 -281696 197532 124794 -179997 -235781 -12647 -32579 -17492
6114 -17492 276853 -316037 -339015 113722 108916 3088 -169088 229992 122687 20371 157810
6103 157810 -7886 118711 -100914 -151662 -162007 -116463 80285 -180729 50616 147268 51159
6091 -18695 156800 92216 -67345 25280 94991 210300 -57660 -93213 314833 194200 337142
6080 337142 169833 -183731 -45149 -346942 15830 259497 123823 36978 -44761 -279354
6070 -279354 -103645 81188 36687 -318981 299178 -62191 154184 41816 61326 -89629 79635
6058 -67751 17761 -46372 -55287 -97156 205141 207972 -163060 -193872 207466 -60274 7281 -178947
6045 267646 -251308 212137 -158189 -64523 -162740 -65855 -94347 -94452 -97943 -13579 -51195 29038
6032 276172 115413 -110839 -107896 108438 -29945 -171070 97449 147804 -81655 6644 185092
6021 185092 -93079 -323871 -385897 -171556 -90409 -164586 -99821 -176638 14477 -304134 204024
6009 -243925 -108586 105460 239214 -145174 49364 42266 343150 -147436 -60169 37874 22697
5998 22697 -137391 98559 415005 -201159 156454 116568 -26672 -263020 85598 -190389 92567
5986 -269741 -140844 -51963 -41810 55984 -187611 172684 57294 92411 653062 22201 -268642
5974 -291577 -87711 -52617 31078 -50214 -175138 -90451 1745 -47990 -38375 -146076 -177 -14108
5962 -14108 108675 -117295 -20436 -102174 -8026 -35648 81735 -124283 -64393 242529 316341
5951 316341 -14229 233840 112860 -314257 48030 211278 25507 267682 -144093 199537
5940 -125271 167150 349944 196 -192874 200441 53279 -109007 86043 50098 -8991 214454
5928 73018 140085 -105286 469203 315511 154278 -101544 -177750 151679 -30137 -200456
5918 -200456 203357 -77518 31747 114696 -326377 -2683 -227023 20218 103984 -424466 22871
5906 21577 -134243 23785 -5594 -105811 -190036 -246120 -129046 84254 98941 75314 199288
5895 199288 312383 -177139 161277 -151962 -177468 103635 70685 100124 49369 -205731
5884 -26425 -108316 -220564 -224824 -188237 -279930 107837 -256196 71443 208221 15895 94741
5873 94741 -174870 220200 269816 26616 -30210 -179186 66053 -11522 161564 -7657 -257595
5862 -257595 -93576 -264273 109568 -176499 -45875 -169189 141371 -5755 58899 92413 274607
5851 274607 -37427 30827 239582 2747 -217095 -10762 -273276 50728 -230596 44984 63932
5840 63932 97464 -22017 -251355 -64893 -363772 51950 -264039 -204930 41950 52437 -245873
5828 -49449 -158933 -167511 -176002 145526 64979 90003 45425 10276 -42424 -227090 -39682 114903
5815 -514 179597 -269213 208358 236877 195983 150604 -36014 -8399 -53866 -72470 207960 123565
5803 123565 94212 -127989 61257 -309639 61607 219966 353773 7968 161088 -98137 11692
5791 154406 -221110 -229131 364458 -131524 -90615 112903 -87449 -212427 -173241 -3483 137367
5779 167224 -24631 -54900 475981 -219507 163192 -115578 218020 -34338 192287 29702
5768 35380 -205536 -127919 160318 183433 149273 334480 253418 -349682 -12707 158467 219381
5757 219381 43668 -229691 -116191 -38861 -225276 -77294 65302 -27870 88949 -103678 226808
5745 137613 120102 151091 -333631 96879 -358526 66020 -386797 -340453 195758 -88810 307686
5733 -225059 -6108 46863 -516997 -137042 321905 331244 -101235 -30736 -40879 -189844 100092
5721 345737 221423 153642 65686 68041 -143586 40531 144194 71320 -35939 -25090 -19115
5710 -19115 98833 -28922 -146289 -189947 296330 -124185 277154 59001 -48252 122376 -1514
5698 -155791 -13451 -48307 170705 58645 251999 -265630 105028 -53954 274473 225412 21317
5686 325001 205153 -112837 -162698 192071 -15507 -342953 -394927 -83143 267516 31979 -155526
5674 108479 130370 120961 -50896 85271 -22246 172197 84510 138044 -71029 38273 38336 67588
5662 67588 -134084 -13600 -128039 186352 -220619 -110481 -208633 -127112 -32392 -73455 -79083
5651 -79083 -50666 -163600 40539 53715 79879 140466 -61060 -202873 131992 -5182 -87691
5640 -87691 87794 -227227 -26187 -40586 -44215 9433 -3750 -253706 -124636 174920 140880 -116097
5627 92976 -156749 -50744 194809 13136 -117575 -327152 -121743 -254115 339040 -157797
5616 82225 -43842 46751 -90602 108844 -233905 -229805 29973 255189 137996 -211755 122684
5604 75334 314959 110855 103973 31716 -211948 83413 -65414 65421 49590 -5298 -13559 -17313
5592 -17313 -308662 -162117 -85921 463653 -32560 79568 62552 278953 -24969 -128149 -25984
5580 -36973 -282434 -269061 -7383 202441 -281741 -126835 -138870 140261 -120708 205273 95557
5568 89979 330047 278085 127216 29258 154725 295868 -576667 -6659 -77391 -217898 63288
5556 -15042 62182 -36568 16279 159161 56204 190430 -266319 201047 46849 255490 -265438
5544 -75201 -92041 -282040 253340 299878 121776 18603 46411 -208559 -152604 -64859 -110716
5533 -110716 -278561 -21441 217648 -54642 -102467 -84352 -192764 -209024 194141 4402 -201265
5521 -174747 -70872 41741 -206091 -95659 -318285 -318953 22359 218557 -173740 26681 -187079
5509 356359 175367 204014 -6738 162744 331841 -66576 302199 -7197 268003 -77152 -27992
5497 -161443 -71085 6398 -153243 -147044 -154872 39150 38071 -124878 -96211 -116949 8852 33664
5485 33664 -206477 -181746 -250688 57291 -145508 -159801 330978 278582 -9674 203773 129853
5474 129853 54666 -392008 64896 -27227 34417 83169 311032 451787 -70533 207858 -152185
5462 -157368 -254889 -218900 -53696 -97628 -298184 -105087 -11431 -261883 -333302 -160093 6152
5450 -256806 -116730 -220867 225331 81661 -208155 -47396 -263252 -20312 92850 -18412 -59745
5439 -59745 -165873 214634 -115336 -114408 -255250 213257 23583 223238 11229 16307 385648
5428 385648 18502 378256 -93646 -114314 11914 42746 195989 -188023 -82258 63524 304506
5417 304506 57094 -19776 233896 -155016 -153967 14745 -179530 -122823 -300654 13846 -63055
5405 238431 -100728 220821 -77734 161013 -243397 -128738 -247991 -117207 189057 -57934
5394 168871 282829 273297 -99902 100686 -196649 -203800 -114998 -27294 182534 -254143 -277123
5383 -277123 -230085 174503 15228 218560 -179709 -37883 -85756 349212 154589 104630 -138140
5371 102357 -230012 -313284 812 -293592 -4074 263278 -125800 40784 -307102 -269856 130921
5359 251593 211696 -102196 103418 25126 -248871 91420 -69815 -32995 -301622 -444708 -34976
5347 155751 191478 143984 -41722 -370061 64564 -42722 -100460 -40823 130246 320646 348572
5336 348572 151890 336730 65182 -11639 19742 16234 167044 200403 -227679 -144285 94248
5324 -166424 106894 124727 -216218 16483 2698 267856 169280 -35804 -15073 -58714 125595
5312 142269 -282211 -118853 248770 240901 -36586 -63732 163958 -215925 340802 -48403 -268704
5301 -268704 372605 11847 69026 -225634 54696 -57815 -399829 -519728 -205344 -92967 276628
5289 -162862 -33918 -72751 340867 -289528 -301951 317412 5386 30639 19395 -343068 109195
5277 216419 220339 193572 -52544 -21083 -13090 -59306 400631 -319828 43294 139632 23261 -18029
5264 220474 148070 -35375 -70453 -29643 -124308 125986 110383 6588 -236242 35038 308083
5253 308083 126378 -308623 342229 -123311 -160321 -25222 -38048 93530 -561030 203487
5242 -189543 49270 -104858 -365345 81558 73874 -301222 136281 -77113 50186 -291893 -54743
5230 -150252 -30674 107005 -152071 22972 -9201 58513 54217 62513 384882 -102589 -263705
5219 -263705 50880 78288 30187 80242 -154375 187282 174485 53833 -2394 137369 88288
5208 88288 -51218 -168648 -105840 -259237 -14267 -146988 53986 -142278 157641 92352 21973
5196 -200852 -374746 88231 64366 -60946 13209 -135092 -45822 -211725 240846 230921 -6935
5184 49031 3221 -208143 -289343 89250 -94462 -170733 -75430 -35804 -260323 -104382 -240170
5173 -240170 302879 170475 -93002 -111079 -49317 -61652 185577 -44980 -67260 31408 -38807
5161 -115817 304551 120671 159096 -162814 -72783 49684 -23019 115699 -60465 -67803 126432
5149 -42639 298729 79539 -213850 -10408 -202949 -259047 206778 -116017 33582 87300 96337
5138 96337 188064 -37437 22298 -152784 106222 -14013 -38798 -169813 96367 82999 86920
5127 86920 -167636 -149790 -131600 120812 55893 347736 405022 -16166 -210480 -286381 225053
5115 227105 -159872 287580 -40369 95469 32142 -29524 -27945 105602 244118 277900 87630
5103 -146980 295235 -104957 -76760 -210495 48158 -200334 213076 -192300 -395190 66945
5092 190466 -21487 -45110 -143048 -104398 26335 21827 -38714 272395 439908 21605 117124
5081 117124 140767 45958 130586 136729 202662 272001 -153032 492682 298516 -153785 28827
5069 -422402 -199829 -127148 221903 -303020 999 -126415 -127056 82182 -31783 -27608 -246534 -320792
5057 -320792 -345896 107465 -46452 -41310 82789 -196736 -188494 47585 40856 15380 31931 -41499
5044 -32522 173995 84462 82566 85755 47103 -222029 107331 210377 122542 -174756 155045
5032 -295891 -145176 22097 -52070 381540 -249391 -130964 -39687 106978 158970 188192 -159934
5020 -151517 -172645 339152 140307 243694 -119623 -59545 70487 -61699 28243 -9035 92629
5008 -236287 141347 241603 233254 -121936 -92162 103752 -162340 -306160 118527 -134228
4997 202254 -109750 -4693 -141123 -345176 -127260 275373 5384 -188070 -281990 -401060 387284
4985 39133 35521 -158466 209681 -109537 -158290 70461 216504 -58003 -12061 229086 207475
4974 207475 42749 236771 -52000 -130036 7057 -262676 180864 156903 -82153 339862 -141698
4962 -43362 125791 -72383 196525 256947 8798 5150 154764 68053 -48977 280744 -38189
4950 -59139 -313554 154854 -52189 290803 -355823 -358199 -235452 -79754 -130815 -124738 -134278
4939 -134278 -246187 19075 -162819 87315 29651 248156 56829 -183350 76052 -92529 -34215
4927 -285870 -96094 8505 190747 20824 65605 -76152 35203 -108861 -156207 -128217 -102287
4916 -102287 392760 136820 -86037 132184 100089 -39291 -20665 -159789 27163 -147248 -155574
4905 -155574 -82290 -262527 -63098 28431 54331 -43827 233847 -92497 169960 -173848 -129928
4894 -129928 -79922 -242657 171045 23790 -439854 345552 -37804 21292 -292900 -49731 -289746
4883 -289746 532109 83480 52934 -32090 95751 -149028 -298714 -948 77240 -97612 -146956
4872 -146956 152433 843 -14298 -12832 60201 164115 -130764 67779 -129075 501801 43771
4860 -59831 40972 -82134 -24910 36244 -140108 -275781 474509 -23815 -105199 -356238 2623
4848 148891 -273990 240091 -249269 -384369 -174447 -337502 61225 -32645 -4601 55774 5302
4836 244327 -74474 45317 32264 -343358 191871 -31811 300814 -59410 179581 -120100 263126
4824 210658 -196322 -7799 161547 241068 173290 -145495 71122 -288959 74303 -51720 -69598
4813 -69598 135336 -103085 52533 192750 -51729 -58920 -5777 76052 53328 403780 89147
4801 289192 47068 -295065 64446 -112429 -81691 -138094 76176 -258235 -39954 205130 -220257
4789 -554738 -173532 263308 -111769 432786 -54824 58953 140731 21784 -27431 -3606 -103513
4778 -103513 343739 35381 327334 66035 -56354 -8090 -87248 408468 -182480 58627 -173498
4766 -82644 -36057 46633 -56331 -86009 150047 115512 -42614 362367 186546 5826 -162383
4754 131617 -112549 378466 -424107 -44237 109510 65892 54540 18602 81746 -212302 -23048
4742 -85132 -86711 -176794 -314456 -45409 -46474 56439 217017 20319 -152611 -421170 261059
4730 -170198 162743 666179 -250633 248868 -23096 -151605 -2183 46768 277295 -103347
4719 -34349 -76574 66913 106657 9688 140734 139023 -216512 -16738 194308 11244 44935 -20359
4706 -34553 116339 -173189 234099 182206 -176535 -60521 79024 35345 -41444 -270781 -148399
4695 -148399 -1711 25005 53792 172825 6706 -8862 -75069 297049 -57293 176003 -21274 -21945
4683 -21945 53634 17418 81908 143978 41433 -130071 -103625 186109 42357 -896 135190 39440
4670 65666 41682 -421902 352477 -50285 189315 228121 -203021 129108 -103410 -178181 -146417
4659 -146417 71158 -209124 359738 -187848 122298 162107 -93435 46112 56285 85997 -118461
4647 162753 -5440 -138096 -125912 779 272478 101034 -405332 -387752 9733 23261 -229835
4635 -190206 -64899 -53610 -153958 65684 56878 124424 116697 143396 49172 -174727 67587 35130
4623 35130 163088 -18266 230815 -168234 48063 140141 184951 39220 -17241 -161055 433770
4611 177188 332678 -236589 -221343 215257 -61763 332056 514860 -74441 104022 75264
4601 75264 24226 56067 -233319 287306 296236 -201368 158840 -114225 241052 -359330 -188970
4590 -188970 -228918 -169500 113939 22524 -292894 91033 340706 187793 197611 -18797 27746
4578 -167335 99849 -69385 -8386 94623 -144234 -91647 -170327 -47489 -42513 -30165 65963 -39006
4565 -22861 -140829 -115196 -21630 84448 -93021 272188 29103 -125083 -87881 -99393 -343633
4554 -343633 -50742 -22224 -247016 20582 -92000 -22522 -163617 243583 196028 -40752 78057
4542 -17706 -323533 66456 -212140 -64423 134439 -54405 -828 -135850 32398 -346714 69856
4530 -3650 162287 -12314 44915 77392 -33621 -102533 237024 -28332 -80230 -260424 61727
4518 151226 -142327 63929 7878 -182590 20007 -235759 159948 128793 -381995 -302675 182552
4506 47431 143861 -20805 -96352 247515 47716 68660 45900 124358 118152 -150129 181492
$$ [...]
##END NTUPLES=NMR SPECTRUM
##END=
