
##TITLE=AC1370_2394_7221551_PFWnt8R9C4
##JCAMPDX= 6.0         $$ Bruker NMR JCAMP-DX V2.0
##DATA TYPE= NMR SPECTRUM
##DATA CLASS= NTUPLES
##ORIGIN= BRUKER
##OWNER= Administrator
$$ 1.72 TOPSPIN		Version 2.1
$$ 2012-12-13 20:46:33.632 -0500  Administrator@X
$$ Compression mode = diff/dup
##.OBSERVE FREQUENCY= 400.02188249412
##.OBSERVE NUCLEUS= ^1H
##.ACQUISITION MODE= SIMULTANEOUS (DQD)
##.ACQUISITION SCHEME= undefined
##.AVERAGES= 64
##.DIGITISER RES= 22
##SPECTROMETER/DATA SYSTEM= spect
##.PULSE SEQUENCE= noesygpps1d.comp
##.SOLVENT NAME= COFFEE_meoh
##.SHIFT REFERENCE= INTERNAL, COFFEE_meoh, 1, 14.96037
##AUDIT TRAIL= $$ (NUMBER, WHEN, WHO, WHERE, PROCESS, VERSION, WHAT)
$$ ##TITLE= Audit trail, TOPSPIN		Version 2.1
$$ ##JCAMPDX= 5.01
$$ ##ORIGIN= Bruker BioSpin GmbH
$$ ##OWNER= Administrator
$$ $$ E:\/data/COFFEE/nmr/AC1370_2394_7221551_PFWnt8R9C4/12/pdata/1/auditp.txt
$$ ##AUDIT TRAIL=  $$ (NUMBER, WHEN, WHO, WHERE, PROCESS, VERSION, WHAT)
(   1,<2012-12-13 20:46:27.711 -0500>,<Administrator>,<X>,<go>,<TOPSPIN 2.1>,
      <created by zg
	started at 2012-12-13 20:34:57.617 -0500,
	POWCHK enabled, PULCHK disabled,
       configuration hash MD5:
       86 BA 57 50 F2 9D 5C 9B 26 00 A9 28 5F 66 2E 89
       data hash MD5: 64K
       38 55 97 15 38 FF 83 AC 94 9E 11 4C 8A D8 03 64>)
(   2,<2012-12-13 20:46:30.789 -0500>,<Administrator>,<X>,<proc1d>,<TOPSPIN 2.1>,
      <Start of raw data processing
       efp LB = 0.3 FT_mod = 6 PKNL = 1 PHC0 = 0 PHC1 = 0 SI = 128K 
       data hash MD5: 128K
       00 6D 90 85 09 63 3D 90 1E 26 2A B3 8C 1D 74 52>)
(   3,<2012-12-13 20:46:31.882 -0500>,<Administrator>,<X>,<proc1d>,<TOPSPIN 2.1>,
      <pk PHC0 = -76.03088 PHC1 = 0 
       data hash MD5: 128K
       69 5B F4 AC 07 48 4D 1B FE 01 B6 A8 6A 01 AB 7F>)
(   4,<2012-12-13 20:46:32.554 -0500>,<Administrator>,<X>,<proc1d>,<TOPSPIN 2.1>,
      <abs ABSG = 1 
       data hash MD5: 128K
       24 AA 46 E6 F5 3C 84 E8 58 F2 A6 52 26 EA 2A 61>)
(   5,<2012-12-13 20:46:32.726 -0500>,<Administrator>,<X>,<proc1d>,<TOPSPIN 2.1>,
      <abs ABSG = 2 
       data hash MD5: 128K
       33 F8 BB 40 34 9D 8B F4 B5 D3 2E 46 11 45 63 73>)
(   6,<2012-12-13 20:46:32.914 -0500>,<Administrator>,<X>,<proc1d>,<TOPSPIN 2.1>,
      <abs ABSG = 3 
       data hash MD5: 128K
       F0 4B 1D 56 70 DC 9E 86 72 6A CA 17 E0 79 81 09>)
(   7,<2012-12-13 20:46:33.086 -0500>,<Administrator>,<X>,<proc1d>,<TOPSPIN 2.1>,
      <abs ABSG = 4 
       data hash MD5: 128K
       E7 C6 74 FC 5C C0 BC 8A 8A DF A2 5F 82 B7 CF 95>)
(   8,<2012-12-13 20:46:33.273 -0500>,<Administrator>,<X>,<proc1d>,<TOPSPIN 2.1>,
      <abs ABSG = 5 
       data hash MD5: 128K
       2E E1 3A 31 A3 19 AA 61 1D 10 85 0C 69 13 32 BE>)
$$ ##END=
$$ 
$$ $$ hash MD5
$$ $$ 6F 79 5F A0 97 08 4B 4A FB E2 82 33 02 9A C0 FD
##$RELAX= 
##$RELAX= 
##$RELAX= 
##$RELAX= 
##$RELAX= 
##$RELAX= 
##$RELAX= 
##$RELAX= 
##$RELAX= 
$$ Bruker specific parameters
$$ --------------------------
##$DU= <E:\>
##$EXPNO= 12
$$ [...]
##$TP07= 0
##$TPNAME0= <>
##$TPNAME1= <>
##$TPNAME2= <>
##$TPNAME3= <>
##$TPNAME4= <>
##$TPNAME5= <>
##$TPNAME6= <>
##$TPNAME7= <>
##$TPOAL= (0..7)
0.5 0.5 0.5 0.5 0.5 0.5 0.5 0.5
##$TPOFFS= (0..7)
0 0 0 0 0 0 0 0
##$TUNHIN= 0
##$TUNHOUT= 0
##$TUNXOUT= 0
##$USERA1= <user>
##$USERA2= <user>
##$USERA3= <user>
##$USERA4= <user>
##$USERA5= <user>
##$V9= 5
##$VALIST= <valist>
##$VCLIST= <CCCCCCCCCCCCCCC>
##$VD= 0
##$VDLIST= <DDDDDDDDDDDDDDD>
##$VPLIST= <PPPPPPPPPPPPPPP>
##$VTLIST= <TTTTTTTTTTTTTTT>
##$WBST= 1024
##$WBSW= 4
##$XGAIN= (0..3)
0 0 0 0
##$XL= 0
##$YL= 0
##$YMAX_a= 5971101
##$YMIN_a= -12296016
##$ZGOPTNS= <>
##$ZL1= 120
##$ZL2= 120
##$ZL3= 120
##$ZL4= 120
##$ABSF1= 14.96037
##$ABSF2= -5.597812
##$ABSG= 5
##$ABSL= 3
##$ALPHA= 0
##$AQORDER= 0
##$ASSFAC= 0
##$ASSFACI= 0
##$ASSFACX= 0
##$ASSWID= 0
##$AUNMP= <proc_prof1d_extract.lims>
##$AXLEFT= 0
##$AXNAME= <>
##$AXNUC= <1H>
##$AXRIGHT= 0
##$AXTYPE= 0
##$AXUNIT= <>
##$AZFE= 0.1
##$AZFW= 0.1
##$BCFW= 0
##$BC_mod= 0
##$BYTORDP= 0
##$COROFFS= 0
##$CY= 15
##$DATMOD= 1
##$DC= 0
##$DFILT= <>
##$DTYPP= 0
##$F1P= 0
##$F2P= 0
##$FCOR= 0.5
##$FTSIZE= 131072
##$FT_mod= 6
##$GAMMA= 0
##$GB= 0
##$INTBC= 1
##$INTSCL= 1
##$ISEN= 128
##$LB= 0.3
##$LEV0= 0
##$LPBIN= 0
##$MAXI= 10000
##$MC2= 0
##$MEAN= 0
##$ME_mod= 0
##$MI= 0
##$NCOEF= 0
##$NC_proc= -2
##$NLEV= 6
##$NOISF1= 0
##$NOISF2= 0
##$NSP= 0
##$NTH_PI= 0
##$NZP= 0
##$OFFSET= 14.96037
##$PC= 1
##$PHC0= -76.03088
##$PHC1= 0
##$PH_mod= 1
##$PKNL= yes
##$PPARMOD= 0
##$PPDIAG= 0
##$PPIPTYP= 0
##$PPMPNUM= 2147483647
##$PPRESOL= 1
##$PSCAL= 4
##$PSIGN= 0
##$PYNMP= <proc.py>
##$REVERSE= no
##$SF= 400.020009887701
##$SI= 131072
##$SIGF1= 0
##$SIGF2= 0
##$SINO= 400
##$SIOLD= 131072
##$SPECTYP= <>
##$SREGLST= <1H.CDCl3>
##$SSB= 0
##$STSI= 131072
##$STSR= 0
##$SW_p= 8223.68421052631
##$SYMM= 0
##$S_DEV= 0
##$TDeff= 65536
##$TDoff= 0
##$TI= <>
##$TILT= no
##$TM1= 0
##$TM2= 0
##$TOPLEV= 0
##$USERP1= <user>
##$USERP2= <user>
##$USERP3= <user>
##$USERP4= <user>
##$USERP5= <user>
##$WDW= 1
##$XDIM= 131072
##$YMAX_p= 409065368
##$YMIN_p= -12529
##$CURPLOT= <Network HP LaserJet P1505>
##$CURPRIN= <$Network HP LaserJet P1505>
##$DFORMAT= <normdp>
##$LAYOUT= <+/1D_H.xwp>
##$LFORMAT= <normlp>
##$PFORMAT= <normpl>
##$SURQMSG= 1
$$ End of Bruker specific parameters
$$ ---------------------------------
##NTUPLES= NMR SPECTRUM
##VAR_NAME=  FREQUENCY,     SPECTRUM/REAL,   SPECTRUM/IMAG
##SYMBOL=    X,             R,               I
##VAR_TYPE=  INDEPENDENT,   DEPENDENT,       DEPENDENT
##VAR_FORM=  AFFN,          ASDF,            ASDF
##VAR_DIM=   131072,        131072,          131072
##UNITS=     HZ,            ARBITRARY UNITS, ARBITRARY UNITS
##FACTOR=    0.0627417313425164, 1,          1
##FIRST=     8223.62146879497, 1886,         -60930
##LAST=      0,             4425,            -60872
##MIN=       0,             -12529,          0
##MAX=       8223.62146879497, 409065368,    0
$$ Real data points
##PAGE= N=1
##DATA TABLE= (X++(R..R)), XYDATA
$$ [...]
61768C91755j561j586j068j97M59Q62J596K921M302N080N183M988M864M949N127
61753D27674N093M734M327M157M093L863L520L152K407R00r96k412k990l094l106
61738D51322l075l052l159l188k712j665m46O49J588K232K358K148K098K347K556
61723D50001K541K562K865L389M016M610M811M348L676L629M228M445L475J694
61709E00290J6j164j989k606l114l776m748n737o279o225n677m694l389k137j339
61694D47432j076j183j554k143k727k991k780k167j371p49o68j181j933k546k951
61679D19412l247l361l096k439j652j132j193j828k577k787k248j368o73k98j31
61664C91382j13j35J00O55R81N28l18m64M70J602J938J654J633K139K671K976
$$ y = [391755, 390194, 388608, 387540, 387343, 387802, 388664, 390260, 393181, 397483, 402563, 407746, 412734, 417598, 422547, 427674, 432767, 437501, 441828, 445985, 450078, 453941, 457461, 460613, 463020, 463920, 462924, 460512, 457522, 454428, 451322, 448247, 445195, 442036, 438848, 436136, 434471, 434025, 434674, 436262, 438494, 440852, 443000, 445098, 447445, 450001, 452542, 455104, 457969, 461358, 465374, 469984, 474795, 479143, 482819, 486448, 490676, 495121, 498596, 500290, 500306, 499142, 497153, 494547, 491433, 487657, 482909, 477172, 470893, 464668, 458991, 454297, 450908, 448771, 447432, 446356, 445173, 443619, 441476, 438749, 435758, 432978, 430811, 429440, 428691, 428023, 426842, 424909, 422363, 419412, 416165, 412804, 409708, 407269, 405617, 404485, 403292, 401464, 398887, 396100, 393852, 392484, 391811, 391513, 391382, 391269, 391134, 391234, 391889, 392870, 393398, 393080, 392616, 393086, 394688, 396626, 398280, 399913, 402052, 404723, 407699]
61648D07699L393M010M279L967L763M389N521O332O711P058P083N843L173K38
61634D73459j772k824l605m482n374o114o524o437o083n980o105n673m243k538
61620D05705j569j280p61M85K101L524M407M542L867K612J013r80l313n431o828
61605D08094p679q384q735q281p310o704o801p097p026o440n383m070l056k689
61591C18439k482j755q69q28j655k205j915j605k040k703k749k358k248k424k330
61576B88273j896j597j612j658j659j867k315k604k398j843j385j330j573j746
61562B62790j664j588j782j889j256N0J105J240P76L14j01o17r24o06J60Q56J328
61545B58192J659J565O89o12j434j411r99o14q6P76J625J989J913J832J944K047
$$ y = [407699, 411092, 415102, 419381, 423348, 427111, 431500, 437021, 443353, 450064, 457122, 464205, 470048, 473221, 473459, 471687, 468863, 465258, 460776, 455402, 449288, 442764, 436327, 430244, 424264, 418159, 412486, 408243, 405705, 404136, 402856, 402095, 402580, 404681, 408205, 412612, 417154, 421021, 423633, 424646, 423666, 420353, 414922, 408094, 400415, 392031, 383296, 375015, 367705, 361001, 354200, 347103, 340077, 333637, 328254, 324184, 321128, 318439, 315957, 314202, 313333, 312505, 310850, 308645, 306730, 305125, 303085, 300382, 297633, 295275, 293027, 290603, 288273, 286377, 284780, 283168, 281510, 279851, 277984, 275669, 273065, 270667, 268824, 267439, 266109, 264536, 262790, 261126, 259538, 257756, 255867, 254611, 254661, 255766, 257006, 257782, 258096, 257995, 257378, 256454, 255848, 256008, 256864, 258192, 259851, 261416, 262105, 261493, 260059, 258648, 257649, 257035, 256949, 257725, 259350, 261339, 263252, 265084, 267028, 269075]
61529B69075J959J781J612J208J45j576l276m207m364m350m438m172l172j929
61515B44296j278j327j387j008n36n07q53j083r52o86n05k39L86J102J084r7j619
61498B34791k023q40P36J209N08j60P1P94J085N72m09j243j330l90J087J961J487
61481B37906J96o57m68K38O55N78L06P2r7k01k54l34l94j76M21R99J056P03N38
61462B41087P87R89P07J77p1P0L05L83K28k15q22j105o54K20O85L64k07k68K96
61443B42956R33J154J028J057J657K803M084N037N436N362N129N098N352N523
61429B92609N131M114K806J465J78p21p12J56J073J436J602K181L013L478L487
61414C21296L441L352K788J707O40j14p68j505k181k767l465m204m570m460m350
$$ y = [269075, 271034, 272815, 274427, 275635, 275780, 274204, 270928, 266721, 262357, 258007, 253569, 249397, 246225, 244296, 243018, 241691, 240304, 239296, 238760, 238253, 237400, 236317, 235365, 234679, 234174, 233935, 234321, 235423, 236507, 236410, 234791, 232768, 231928, 232664, 233873, 234381, 234221, 234292, 235086, 236171, 236743, 236334, 235091, 233761, 233371, 234458, 236419, 237906, 238102, 237445, 236977, 237215, 237870, 238448, 238754, 238826, 238729, 238528, 238274, 237940, 237546, 237370, 237791, 238790, 239846, 240549, 241087, 241874, 242863, 243570, 243747, 243676, 243746, 244051, 244434, 244662, 244447, 243625, 242520, 241866, 242086, 242771, 243135, 242928, 242660, 242956, 243889, 245043, 246071, 247128, 248785, 251588, 255672, 260709, 266145, 271507, 276636, 281734, 287086, 292609, 297740, 301854, 304660, 306125, 306303, 305582, 304870, 305026, 306099, 307535, 309137, 311318, 314331, 317809, 321296, 324737, 328089, 330877, 332584, 333224, 333110, 332342, 330837, 328656, 325889, 322424, 318220, 313650, 309190, 304840]
61399C04840m603n035n289n206m637l459k063j251j269j410j001l10J0n5KL40
61383B69604O78Q95J146J352J089K38o48q87m42J10M03P63J636K691L021K401
61367B84050J735J926K688L113K963K622K124J291O83J317L125M791N439N607
61353C23474O036O546O818P316Q536J0006J0952J1429J1851J1883J0832Q898P045
61340D41622N771M895M453M804N772O536O607O179N429M158K359M98j077k472
61326D95534l765m722n266n716o222o410o041n546n444n492m962l639k117j062
61312D29130n72l96l72m04k30L84J285K080K815M034N913P608P989O871N010K958
61296D74103N65k262m894o516o950o616n971n323m854m480l884l020k285j979
$$ y = [304840, 300237, 295202, 289913, 284707, 280070, 276611, 274548, 273297, 272028, 270618, 269617, 269307, 269317, 269262, 269264, 269604, 270282, 271177, 272323, 273675, 274764, 275002, 274354, 273467, 273025, 273135, 273538, 274301, 275937, 278628, 281649, 284050, 285785, 287711, 290399, 293512, 296475, 299097, 301221, 302512, 303195, 304512, 307637, 312428, 317867, 323474, 329510, 336056, 342874, 350190, 358726, 368732, 379684, 391113, 402964, 414847, 425679, 434577, 441622, 447393, 452288, 456741, 461545, 467317, 473853, 480460, 486639, 492068, 496226, 498585, 499083, 498006, 495534, 491769, 487047, 481781, 476065, 469843, 463433, 457392, 451846, 446402, 440910, 435948, 432309, 430192, 429130, 428558, 428162, 427790, 427386, 427156, 427540, 428825, 430905, 433720, 437754, 443667, 451275, 459264, 466135, 471145, 474103, 474668, 472406, 467512, 460996, 454046, 447430, 441459, 436136, 431282, 426802, 422918, 419898, 417613, 415634]
61282D15634j844j465p91k1P52J419J786J984K565L810N263O357P144P811Q025
61267D58429P427O519O231O692P173P274P450Q241R604J1195J2771J4101J4863
61254E77970J4839J3955J2184R737P364N930N579N642N407M633L344J566o21l051
61240F64478n560p825r274r574r252r234r815j0494j0841j0960j0958j0567r603
61227E40521q308o981n663m446l646l352l197k931k828l107l313k836j799q64
61213D87250k62M25J406K205K339K010J702J308K63j362k506k190p47O02J287
61198D93730K055L901O722R474J1428J2925J4795J7195J9199J9546J7858J4964
61186F43792J2016R462P249N675N377O311P440P847P611P233O660N509L889K364
$$ y = [415634, 413790, 412325, 411534, 411513, 412265, 413684, 415470, 417454, 420019, 423829, 429092, 435449, 442593, 450404, 458429, 465856, 472375, 478606, 485298, 492471, 499745, 507195, 515436, 525040, 536235, 549006, 563107, 577970, 592809, 606764, 618948, 628685, 636049, 641979, 647558, 653200, 658607, 663240, 666584, 668150, 667529, 664478, 658918, 651093, 641819, 632245, 622993, 613759, 603944, 593450, 582609, 571649, 560691, 550124, 540521, 532213, 525232, 519569, 515123, 511477, 508125, 504928, 501997, 499169, 496062, 492749, 489913, 488114, 487250, 486988, 487413, 488819, 491024, 493363, 495373, 497075, 498383, 498646, 497284, 494778, 492588, 491841, 492443, 493730, 495785, 499686, 506408, 515882, 527310, 540235, 555030, 572225, 591424, 610970, 628828, 643792, 655808, 665270, 672519, 678194, 683571, 689882, 697322, 705169, 712780, 720013, 726673, 732182, 736071, 738435]
61172G38435J186J52r06j914k793l527m017m319m867o017p440q458q999r708j0966
61157F65842j2194j2413j1388r967r226r284r121p761n488l446k158j153k49l23
61143E71671k157n134p944j0156j2175j3954j4752j4233j2925j1410r728p874
61131D49229o247n176m375l240j613p2P28R80J807L982O702Q361Q725R382J1544
61116D80717J4352J6259J7256J8463K0089K1228K1513K1545K1675K1579K1216
61105F95892K1019K0907K0245J9053J8091J7311J5369J1330O009R67l072o298
61093H36823q959j1161j3028j4578j5778j6851j8055j9049j9218j8808j8864j9727
61081F42747k0494k0388j9726j9033j8074j6541j4907j3794j3019j2068j0963
$$ y = [738435, 739621, 739773, 738867, 736953, 734160, 730633, 726616, 722297, 717430, 711413, 703973, 695515, 686516, 676808, 665842, 653648, 641235, 629847, 619880, 610654, 601370, 592249, 584488, 579000, 575554, 573396, 572243, 571994, 571671, 569514, 564380, 556436, 546280, 534105, 520151, 505399, 491166, 478241, 466831, 457103, 449229, 442982, 437806, 433431, 430191, 428578, 428506, 429234, 430214, 432021, 436003, 442705, 451066, 459791, 469173, 480717, 495069, 511328, 528584, 547047, 567136, 588364, 609877, 631422, 653097, 674676, 695892, 716911, 737818, 758063, 777116, 795207, 812518, 827887, 839217, 845226, 846193, 843121, 836823, 827864, 816703, 803675, 789097, 773319, 756468, 738413, 719364, 700146, 681338, 662474, 642747, 622253, 601865, 582139, 563106, 545032, 528491, 513584, 499790, 486771, 474703, 463740]
61070D63740j0062r419q934q683q502p823o512n339m970m980m495l365k014o18
61056C78024Q53K149K955L294L221K599J773J789L158M950O011O628P921R979
61042D35304J1696J2398J2622J3151J4129J5292J6366J7056J7220J7169J7423
61031E99826J8169J9237K0427K1423K1857K2051K3220K6108K9873L3306L6890
61020H72387M2436N0732O0955P2723Q7424J06964J32470J64874K04221K44760
61010B039946K70352K59332K00133J04978O369o3174q9651p8080l9979J3170O4172
60999B687568Q6985N9783j5889j12457j95188k43622k56956k45105k19118j87666
60989A358335j56607j28769j04697q4359o7829n4753m4316l5968k9454k4192j9494
$$ y = [463740, 453678, 444259, 435325, 426642, 418140, 410317, 403805, 398466, 393496, 388516, 384021, 380656, 378642, 378024, 378877, 381026, 383981, 387275, 390496, 393095, 394868, 396657, 399815, 404765, 410776, 417404, 425325, 435304, 447000, 459398, 472020, 485171, 499300, 514592, 530958, 548014, 565234, 582403, 599826, 617995, 637232, 657659, 679082, 700939, 722990, 746210, 772318, 802191, 835497, 872387, 914823, 965555, 1026510, 1099233, 1186657, 1293621, 1426091, 1590965, 1795186, 2039946, 2310298, 2569630, 2769763, 2874741, 2881110, 2817936, 2728285, 2650205, 2610226, 2623396, 2687568, 2774553, 2834336, 2818447, 2705990, 2510802, 2267180, 2010224, 1765119, 1546001, 1358335, 1201728, 1072959, 968262, 883903, 816074, 761321, 717005, 681037, 651583, 627391, 607897]
60978F07897j5472j2901j2023j2065j2134j1927j1485j0831j0114r546r001q137
60966D72261p109o601o893p463p744p845q066q220p858o901n571m013k438j357
60952C84182j096j224j076o64m76l33O67K774M811N337M281K910K358K624K900
60937D07975K478J331K6r15j621k627l988n015n234n172n628o464o825o401n786
60922C56134n475n175m421l343k446j941j634j268p63j89L17P47J311K126K895
60907C36875L193L128L289M029N084N965O408O337N803N099M641M632M997N525
60893D05005N715M762K308p78l094m185m700n128n325n465o250p621q256p248
60879C59740n500m548m593m727m543m411m260l303j280Q93K013J743P36rJ02Q49
$$ y = [607897, 592425, 579524, 567501, 555436, 543302, 531375, 519890, 509059, 498945, 489399, 480398, 472261, 465152, 458551, 451658, 444195, 436451, 428606, 420540, 412320, 404462, 397561, 391990, 387977, 385539, 384182, 383086, 381862, 380786, 380122, 379646, 379313, 379980, 382754, 387565, 392902, 397183, 400093, 402451, 405075, 407975, 410453, 411784, 411810, 410895, 409274, 406647, 402659, 397644, 392410, 387238, 381610, 375146, 368321, 361920, 356134, 350659, 345484, 341063, 337720, 335274, 333333, 331699, 330431, 329668, 329479, 329796, 330543, 331854, 333980, 336875, 340068, 343196, 346485, 350514, 355598, 361563, 367971, 374308, 380111, 385210, 389851, 394483, 399480, 405005, 410720, 415482, 417790, 417012, 413918, 409733, 405033, 399905, 394580, 389115, 382865, 375244, 366988, 359740, 354240, 349692, 345099, 340372, 335829, 331418, 327158, 323855, 322575, 323468, 325481, 327224, 327960, 327951, 328053, 328902]
60863C28902J520J866K417L540M631M835M317M032M432N068N459N630N706N695
60849C88050N746O125O653O708N927M673L639L303L661M147L919K629R35j88o17
60834D45310j052j924k901l594m066m559n067n496n869o140o157n958n832n942
60820C80753o138o215o151n936n470m709l764k790j894j097l39M03Q60O87P8j99
60804C38079K52Q89J026Q67J145K027L056L977M865N582N836N837O131O744P156
60789C93469P192P296P755Q394R086R952J0872J1513J2027J2962J4283J5344J6079
60776E36224J7291J9323K1298K2410K3155K4421K5946K6702K6413K5848K5703
60765G94734K6092K6986K8296K9380K9201K7335K4357K1027J7506J3509Q862L659
$$ y = [328902, 330422, 332288, 334705, 338245, 342876, 347711, 352028, 356060, 360492, 365560, 371019, 376649, 382355, 388050, 393796, 399921, 406574, 413282, 419209, 423882, 427521, 430824, 434485, 438632, 442551, 445180, 446115, 445927, 445310, 444258, 442334, 439433, 435839, 431773, 427214, 422147, 416651, 410782, 404642, 398485, 392527, 386695, 380753, 374615, 368400, 362249, 356313, 350843, 346134, 342370, 339580, 337686, 336589, 336250, 336653, 337513, 338200, 338278, 338079, 338331, 339220, 340246, 341113, 342258, 344285, 347341, 351318, 356183, 361765, 367601, 373438, 379569, 386313, 393469, 400661, 407957, 415712, 424106, 433192, 443144, 454016, 465529, 477556, 490518, 504801, 520145, 536224, 553515, 572838, 594136, 616546, 639701, 664122, 690068, 716770, 743183, 769031, 794734, 820826, 847812, 876108, 905488, 934689, 962024, 986381, 1007408, 1024914, 1038423, 1047285, 1050944]
60753A050944j919p650j3258j8450k2912k6365k8794l0537l1797l2172l1172k9263
60741G76655k7912k8088k9061k9215k7950k6140k4678k3285k1249j8782j6852
60730E03443j5765j4794j3339j1785j0667r659q023n879m295m001m458m458l390
60717C92930j792o90m95o36l09N38J288J572J561J305M19j095k414k834k750l043
60701C83555l850m638n156n611o005o117o017n949n748n201m792n220o067n982
60687C07202m468k601j627j578j778j956k241k579k764k771k630k227j536p60
60673B75686jQ06J441J405P01P3O7L21K53n6k02k21l50k97M35J622K406K371J968
60654B88428J764J818J991K460L524N023O275O661O233N629N408N476N283M499
$$ y = [1050944, 1049025, 1041375, 1028117, 1009667, 986755, 960390, 931596, 901059, 869262, 837090, 805918, 776655, 748743, 720655, 691594, 662379, 634429, 608289, 583611, 560326, 539077, 520295, 503443, 487678, 472884, 459545, 447760, 437093, 427434, 419411, 413532, 409237, 405236, 400778, 396320, 392930, 391138, 390448, 389953, 389317, 389008, 389546, 390834, 392406, 393967, 395272, 395691, 394596, 392182, 389348, 386598, 383555, 379705, 375067, 369911, 364300, 358295, 352178, 346161, 340212, 334464, 329263, 324471, 319251, 313184, 307202, 302734, 300133, 298506, 296928, 295150, 293194, 290953, 288374, 285610, 282839, 280209, 277982, 276446, 275686, 275685, 276491, 277932, 279337, 280038, 280111, 280178, 280499, 280752, 280696, 280494, 280273, 279923, 279626, 280061, 281683, 284089, 286460, 288428, 290192, 292010, 294001, 296461, 299985, 305008, 311283, 317944, 324177, 329806, 335214, 340690, 345973, 350472]
60640C50472L329K176J272P09O49J185K046K556K054N29j173k059k028j957k513
60625C57247l248l290k681k319k687l288l487l271l007k905k991l161l122k677
60611C15113k234k471l264l593k875j812j419j665j720j241p07n44n88n26m19
60596B90035m52m72j14N70R06L22q25j490j167m74k85o41r04o50J21J323K662
60579B88465L456L357L137L893N496O715O970O956P320P710P603P111O391N085
60565C69665L007P34j164k886m698o106o482n985n080l642j392J129K957L948
60551C44005M804N976P267Q481R680J0793J1495J1617J1099R617O828L121m47
60538D44336l107m958o441p602p997p151n098k607q21l66q29j234j003l24K02
$$ y = [350472, 353801, 355977, 357249, 357958, 358607, 359792, 361838, 364394, 366448, 366977, 365804, 363745, 361717, 359760, 357247, 353999, 350709, 348028, 345709, 343022, 339734, 336247, 332976, 329969, 327064, 324073, 320912, 317790, 315113, 312879, 310408, 307144, 303551, 300676, 298864, 297445, 295780, 294060, 292819, 292112, 291568, 290980, 290454, 290035, 289583, 289111, 288997, 289567, 290473, 290795, 289970, 288480, 287313, 286839, 286554, 285913, 285009, 284359, 284480, 285803, 288465, 291921, 295278, 298415, 302308, 307804, 314519, 321489, 328445, 335765, 343475, 351078, 358189, 364580, 369665, 372672, 373406, 372242, 369356, 364658, 358552, 352070, 346085, 341005, 337363, 335971, 337100, 340057, 344005, 348809, 354785, 362052, 370533, 380213, 391006, 402501, 414118, 425217, 434834, 441662, 444783, 444336, 441229, 436271, 429830, 422228, 414231, 407080, 401982, 399375, 398554, 398188, 397359, 396125, 395122, 394798, 395000]
60523C95000J32m12p56l39N77J181J271J536K443L441L848M052N019O919R011
60508D32923J0855J2823J5266J7865K0140K2219K4691K7841L1185L3706L4427
60497F83941L2860K8935K2680J4185L949p005j7464k6362l2883l6691l8148l7925
60485E90072l6286l3130k8846k4467k0733j7541j4648j2307j0748r598q455p530
60473C65783p112o844o188n249m522m078l694l500l760m244m411m072l310k054
60459C02745m68N48J45j246k272k244j704j357j248j101q14l48K95Q23Q14L16
60443B92884j46k51j93k16k76k64k34l21p00j507k489k927k373j318o69o48p19
60426B77633n05j59J15L13L94K93K40N20R02R32P55J017J786K285J939J142O17
$$ y = [395000, 395132, 394720, 393964, 393625, 394202, 395383, 396654, 398190, 400633, 404074, 407922, 411974, 416993, 423912, 432923, 443778, 456601, 471867, 489732, 509872, 532091, 556782, 584623, 615808, 649514, 683941, 716801, 745736, 768416, 782601, 786550, 779545, 762081, 735719, 702836, 666145, 627997, 590072, 553786, 520656, 491810, 467343, 446610, 429069, 414421, 402114, 391366, 381768, 373313, 365783, 358671, 351827, 345639, 340390, 335868, 331790, 328096, 324596, 320836, 316592, 312181, 308109, 304799, 302745, 302277, 302825, 302970, 301724, 299452, 297208, 295504, 294147, 292899, 291798, 290984, 290636, 290931, 291754, 292568, 292884, 292738, 292487, 292294, 292078, 291802, 291538, 291304, 290983, 290283, 288776, 286287, 283360, 280987, 279669, 279000, 278352, 277633, 277128, 276969, 277084, 277397, 277791, 278084, 278324, 278844, 279746, 280678, 281433, 282450, 284236, 286521, 288460, 289602, 290219]
60409B90219N00L68q2o83r81o46J38P41P92P02J095J861K313K200J998K118K399
60392C05052K569K658K699K482J961J545J703K404L166L507L293K787K409K266
60378C40501K016J397P24N06P15Q56P44O73Q62J136J247J122P08K5n75o02j4O86
60360C52727R82Q13N04M79R65J737K293K528K917L698M282L984L043K180J468
60345C84600M22r80k176k917l441l747l492k741j991j391p19j91l47r41r37l8
60329C58973P64O31J3l57o74j440k239k122r35N05J432J739J731J820K366L348
60313C65555M301M931N655P134R400J1824J3772J4908J4993J3869J1682Q833N629
60300D92486K117j664n424q634j0834j1952j2303j2209j1678j0600r125p568o134
$$ y = [290219, 290719, 291087, 291005, 290322, 289341, 288695, 288833, 289574, 290366, 291068, 292163, 294024, 296337, 298537, 300535, 302653, 305052, 307621, 310279, 312978, 315460, 317421, 318966, 320669, 323073, 326239, 329746, 333039, 335826, 338235, 340501, 342517, 343914, 344638, 345144, 345859, 346715, 347459, 348132, 348994, 350130, 351377, 352499, 353207, 353232, 352657, 352055, 352041, 352727, 353709, 354522, 355026, 355505, 356470, 358207, 360500, 363028, 365945, 369643, 373925, 377909, 380952, 383132, 384600, 385022, 384042, 381866, 378949, 375508, 371761, 368269, 365528, 363537, 362146, 361427, 361236, 360889, 359948, 359011, 358973, 359737, 360368, 360381, 360024, 359350, 357910, 355671, 353549, 352614, 353119, 354551, 356290, 358021, 359841, 362207, 365555, 369856, 374787, 380442, 387576, 396976, 408800, 422572, 437480, 452473, 466342, 478024, 486857, 492486, 494603, 492939, 487515, 478881, 468047, 456095, 443792, 431583, 419905, 409305, 400180, 392612, 386478]
60287C86478m926m124l709l235k332j360r94j185j169n85Jl4n44r60j034r59r71
60270C58358j187j627k195k776l310l647l409k437j239n39m43m61k66O6M85R27
60254C36300R66K31p62r90l05K95nq99j533j397m39R83K036K089J594J502J763
60237C41429J358J71m80K29J316J477Q83N03N42O42R61J742K334J923J004Q40
60221C56874J587K164K023J845K144K411K092J642J848K689L473L807L886L945
60207C92430L974L971M152M650N137N024M204L421L548M530N373N300M526L719
60193D53959L151K724K485K606K978L105K490J008r37k529l087k671j998j711
60179D61573j921k480l231l891m106l878l532l167k530j658j064j026j203j252
$$ y = [386478, 381552, 377428, 373719, 370484, 368152, 366792, 365798, 364613, 363444, 362859, 362860, 362826, 362282, 361322, 360288, 359329, 358358, 357171, 355544, 353349, 350573, 347263, 343616, 340207, 337770, 336531, 335992, 335549, 335088, 334822, 334888, 335373, 336300, 337266, 337497, 336735, 335745, 335440, 335735, 335730, 334831, 333298, 331901, 331462, 332445, 334481, 336570, 338164, 339666, 341429, 342787, 342958, 342478, 342707, 344023, 345500, 346383, 346886, 347428, 348070, 349031, 350773, 353107, 355030, 356034, 356874, 358461, 360625, 362648, 364493, 366637, 369048, 371140, 372782, 374630, 377319, 380792, 384599, 388485, 392430, 396404, 400375, 404527, 409177, 414314, 419338, 423542, 426963, 430511, 435041, 440414, 445714, 450240, 453959, 457110, 459834, 462319, 464925, 467903, 471008, 473498, 474506, 473569, 471040, 467953, 465282, 463284, 461573, 459652, 457172, 453941, 450050, 445944, 442066, 438534, 435367, 432837, 431179, 430115, 429089, 427886, 426634]
60165D26634j346j670j921j741j186m48M38J211J304O56J54O05J698K466K437
60150D29291J805R09R6k84k85l48m44K13J970L869M767M819M915N164N051M697
60134D66205M776N136M749L240J509M92J53O1J55N06Q79R61P05K03m13q04o68
60117D87845k34r5l78n77l38M7J58Kk09m33o07m53J49P74Q27K87k32j73L40O90
60097D87390N54K60K42L36k8q85j505j297n21J86N82P93R14J076J542K225K501
60080D94365K023J426J551K195K390J792J035O89N37J02o98j705k848m048n154
60065D93652o104o944p554p583o781n297l699k808l227m697o052o201n146l767
60051D17792k779k204j702j033k23L95M77J93J89P38J329J480J591K350L609M529
$$ y = [426634, 425288, 423618, 421697, 419956, 418770, 418322, 418760, 419971, 421275, 421931, 422085, 422690, 424388, 426854, 429291, 431096, 432005, 432101, 431817, 431532, 431184, 430740, 430953, 432923, 436792, 441559, 446378, 451293, 456457, 461508, 466205, 470981, 476117, 480866, 484106, 485615, 486107, 486260, 486321, 486476, 486982, 487861, 488822, 489527, 489730, 489317, 488513, 487845, 487611, 487516, 487138, 486561, 486223, 486270, 486428, 486430, 486221, 485788, 485181, 484728, 484877, 485651, 486478, 486765, 486533, 486360, 486700, 487390, 487944, 488204, 488446, 488782, 488754, 487869, 486364, 485067, 484546, 484732, 485314, 486107, 487021, 488097, 489639, 491864, 494365, 496388, 497814, 499365, 501560, 503950, 505742, 506777, 507466, 508003, 508105, 507407, 505702, 502854, 498806, 493652, 487548, 480604, 473050, 465467, 458686, 453389, 449690, 446882, 443655, 438958, 432906, 426705, 421559, 417792, 415013, 412809, 411107, 410074, 409851, 410246, 410723, 410916, 411105, 411843, 413172, 414652, 416243, 418593, 422202, 426731]
60035D26731M690M370L870L221K544K006J404M01q52j837k459l091l851m446m772
60020D27929n116n651o214o621o798o637o227o018o235o249n300l682k434j860
60006C52887j316n32j23m56q73o21K35J188K006K540K499J904J255P54l3j190
59990C60124j746p74J141K363K079J131R36K066L866N105M949L675K436K169K669
59975C92189K991K547J606P43K08o1o7K33O48P69M97K56L84M71j99j454k115j437
59957C98209j27N84N00M03O91R27O61J8o64j218j537j597j633j836j854j182l3
59940C90312P91R75R10P09j47j769l226l574l008k414k102j681r48k67J5qn5m2
59922C74471QK81J087K362L407L501K810K307K569L050L033K785L110L977M577
$$ y = [426731, 431421, 435791, 439661, 442882, 445426, 447432, 448836, 449237, 448385, 446548, 444089, 440998, 437147, 432701, 427929, 422813, 417162, 410948, 404327, 397529, 390892, 384665, 378647, 372412, 366163, 360863, 357181, 354747, 352887, 351571, 351039, 350916, 350460, 349587, 348966, 349201, 350389, 352395, 354935, 357434, 359338, 360593, 361347, 361314, 360124, 358378, 357604, 358745, 361108, 363187, 364318, 365254, 367320, 371186, 376291, 381240, 384915, 387351, 389520, 392189, 395180, 397727, 399333, 400076, 400284, 400223, 400156, 400389, 401037, 401806, 402303, 402559, 402943, 403414, 403215, 401761, 399646, 398209, 398082, 398666, 399166, 399569, 400260, 401187, 401848, 401866, 401202, 399984, 398447, 396850, 395217, 393381, 391527, 390345, 390312, 391103, 392078, 392988, 393697, 393550, 391781, 388555, 384981, 381973, 379559, 377457, 375776, 374828, 374561, 374576, 374568, 374513, 374471, 374479, 374760, 375847, 378209, 381616, 385117, 387927, 390234, 392803, 395853, 398886, 401671, 404781, 408758, 413335]
59907D13335M588M531M642M415L617K943K990L280K966K061J239P69L42k30q18
59892D50670j414k169k953l297k958k148j147RJ281K355K882K943L030L505M219
59877D54808M777N081N284N224M353K510M57q12j117j091j282j735k353l069l550
59862D67485l314k370j421j190j723k512l016l053k849k794k961k941k448j887
59848D33006j937k594l162l196k980k939l061l099l003k880k727k380j682o80
59834C96686K09N00L23N29J674L140L836L572L078K775K293J349L36k43l97m65
59818D19195o86j181j876k425k486k158j737j167l25L21Q4p79j131m67L58K60
59802D03800p59j846k334k189j772j584j880k380k546k248j783j349r70r27j552
$$ y = [413335, 417923, 422454, 427096, 431511, 435128, 438071, 441061, 444341, 447307, 449368, 450607, 451376, 451718, 451488, 450670, 449256, 447087, 444134, 440837, 437879, 435731, 434584, 434593, 435874, 438229, 441111, 444054, 447084, 450589, 454808, 459585, 464666, 469950, 475174, 479527, 482037, 482494, 481682, 480565, 479474, 478192, 476457, 474104, 471035, 467485, 464171, 461801, 460380, 459190, 457467, 454955, 451939, 448886, 446037, 443243, 440282, 437341, 434893, 433006, 431069, 428475, 425313, 422117, 419137, 416198, 413137, 410038, 407035, 404155, 401428, 399048, 397366, 396686, 396895, 397395, 397718, 398247, 399921, 403061, 406897, 410469, 413547, 416322, 418615, 419964, 420300, 420057, 419660, 419195, 418509, 417328, 415452, 413027, 410541, 408383, 406646, 405479, 405154, 405475, 405559, 404780, 403649, 403182, 403540, 403800, 403041, 401195, 398861, 396672, 394900, 393316, 391436, 389056, 386510, 384262, 382479, 381130, 380160, 379233, 377681]
59787C77681k505k970k716k306k070j631p58OK8n98j268j483r92R3J186J636J491
59770C62824J327J348J283J181J419J835J800J416J578K506L247L165K864L012
59756C90805L234L049K921L476M357M831M853M701M225L392K923L311L759L182
59742D43019J912J240J549K103K492L065L750L672K422Q65J13J77J83l41q49n56
59726D64816M46J118P09k53o54l34k16p95j387j310r80j166j705j815j269n52
59710D54653m7L25P79J408K155K711K762K534K632L082L194K793K776L797N084
59695D90638N420M772L988L347K401J079l6n76p81r49j080j051p28k0Q28J202
59679E08454Q16J30l02n99j183k108l234m575n884o356n530m173l476l619l800
$$ y = [377681, 375176, 372206, 369490, 367184, 365114, 363483, 362725, 362731, 362759, 362161, 360893, 359410, 358418, 358511, 359697, 361333, 362824, 364151, 365499, 366782, 367963, 369382, 371217, 373017, 374433, 376011, 378517, 381764, 384929, 387793, 390805, 394039, 397088, 400009, 403485, 407842, 412673, 417526, 422227, 426452, 429844, 432767, 436078, 439837, 443019, 444931, 446171, 447720, 449823, 452315, 455380, 459130, 462802, 465224, 466089, 466202, 466379, 466562, 466221, 465372, 464816, 465262, 466380, 467089, 466836, 466182, 465848, 465632, 464837, 463450, 462140, 461160, 459994, 458289, 456474, 455205, 454653, 454606, 454931, 455710, 457118, 459273, 461984, 464746, 467280, 469912, 472994, 476188, 478981, 481757, 485554, 490638, 496058, 500830, 504818, 508165, 510566, 511645, 511609, 511033, 510252, 509303, 508223, 507172, 506444, 506424, 507252, 508454, 509270, 509400, 509098, 508499, 507316, 505208, 501974, 497399, 491515, 485159, 479629, 475456, 471980, 468361, 464561]
59664D64561l410k544j577q43n46m15J52J194J868J657J270J628K512L116L390
59649D72013L775M074L697K785K051J598R24l2q31j409k114k915l495l954m551
59634D71616m924m573l917l823m146l894k826j837j575j772k029k268k241j666
59620D30125j111j681l415m934n092m270l519l246l183l043k658j886p64M45J419
59605C93187J803J320L40jR40K273K562J692P99N04M05K20K19L40K5o82j038q11
59587D04097o11o73m95j22n75k263l976m371l647k899k527k109j470j022j176
59572C76161j981l106l892l698k565j259m59k21k55k83n7M27P10M22M9L71J194
59555C61558J556J324J481K498L534L749L506L529L751L728L620M008N144O961
$$ y = [464561, 461151, 458607, 457030, 456187, 455641, 455226, 455378, 456572, 458440, 460097, 461367, 462995, 465507, 468623, 472013, 475788, 479862, 483559, 486344, 488395, 489993, 490917, 490885, 490054, 488645, 486531, 483616, 480121, 476167, 471616, 466692, 462119, 458202, 454379, 450233, 446339, 443513, 441676, 440101, 438329, 436300, 434032, 431791, 430125, 429014, 427333, 423918, 418984, 413892, 409622, 406103, 402857, 399674, 396631, 393973, 392087, 391323, 391768, 393187, 394990, 396310, 396650, 396649, 397589, 399862, 402424, 404116, 404915, 405419, 405824, 406044, 406263, 406603, 406628, 405946, 404908, 404097, 403486, 402813, 402318, 402196, 401621, 399358, 395382, 391011, 387364, 384465, 381938, 379829, 378359, 377337, 376161, 374180, 371074, 367182, 363484, 360919, 359660, 359201, 358980, 358725, 358442, 358385, 358812, 359522, 359944, 359993, 360364, 361558, 363114, 364438, 365919, 368417, 371951, 375700, 379206, 382735, 386486, 390214, 393834, 397842, 402986, 409947]
59541D09947R394J2383J5903K0028K4028K5335K0911J0673j333j0182j3953j3852
59529E09282j1638q389n074k560p47J171L323M828N072M550M140M007L622K533
59515E14120R11o93k013l390n205p095q206q289q008p963q013p869p755p914p976
59500D24642p404o244m910l560k241j293j041j208j226r37n27K5R25K024K789
59485C99814K840K247J395P78P37J173J686K156K910M032M943N076M718M619M881
59470D44005M670L195O41j900l323l368k574j471m7J777L419M084L866L749M411
59455D61134N589O780P869Q759R147R062R104R573R918R464Q226O514M228J166
59441E66533k287n339p516q783r216q984q390p656o833o099n715n456m694l345
$$ y = [409947, 419341, 431724, 447627, 467655, 491683, 517018, 537929, 548602, 547269, 537087, 523134, 509282, 497644, 489255, 484181, 481621, 480874, 482045, 485368, 490196, 495268, 499818, 503958, 507965, 511587, 514120, 515031, 514338, 512325, 508935, 503730, 496635, 488429, 480140, 472132, 464169, 456156, 448287, 440532, 432618, 424642, 417238, 410994, 406084, 402524, 400283, 398990, 397949, 396741, 395515, 394578, 394051, 394076, 395001, 397025, 399814, 402654, 404901, 406296, 407074, 407811, 408984, 410670, 412826, 415736, 419768, 424711, 429787, 434505, 439124, 444005, 448675, 451870, 452511, 450611, 447288, 443920, 441346, 439875, 439828, 441605, 445024, 449108, 452974, 456723, 461134, 466723, 473503, 481372, 490131, 499278, 508340, 517444, 527017, 536935, 546399, 554625, 561139, 565367, 566533, 564246, 558907, 551391, 542608, 533392, 524408, 516018, 508362, 501529, 495430, 489715, 484259, 479565, 476220]
59427D76220k187j784j655j018K80K122M721P968J0803J2329J3224J4995J8032
59414E54050K1538K5317K9956L4395L4717K7046J1914n209j8074k3962k4085k0935
59402F46668j6165j0448l953L306J0395J4219J0749r18j6211k8211l3203l2354
59390E43874k8595k3760j8846j4893j2217r986p625n816n162m864l813k250j171
59377D04876p26l14K23O17R79J528J787J206K82j1K77L16Q5N02J820L087L493
59360D20027L269K906K493K202K617L903N318O149O620P353Q390R381J0384J1755
59346E02767J3350J4551J5180J5812J6814J7581J7233J5862J4453J3482J2216
59335F69301R818O640L749J511o36l113n643p863r749j1235j2048j2175j1932
$$ y = [476220, 474033, 472249, 470594, 469576, 469856, 471978, 476699, 484667, 495470, 507799, 521023, 536018, 554050, 575588, 600905, 630861, 665256, 699973, 727019, 738933, 733724, 715650, 691688, 667603, 646668, 630503, 620055, 616102, 619408, 629803, 644022, 654771, 653853, 637642, 609431, 576228, 543874, 515279, 491519, 472673, 457780, 445563, 435577, 427952, 422136, 416974, 412110, 408297, 406047, 404876, 404150, 403836, 404059, 404676, 405655, 407183, 408970, 410176, 410458, 410447, 410724, 411040, 411125, 411627, 413447, 416534, 420027, 423296, 426202, 428695, 430897, 433514, 437417, 442735, 448884, 455504, 462857, 471247, 480628, 491012, 502767, 516117, 530668, 545848, 561660, 578474, 596055, 613288, 629150, 643603, 657085, 669301, 679119, 685759, 689508, 691019, 690383, 687270, 681627, 673764, 664015, 652780, 640732, 628557, 616625]
59322F16625j1338j0052q171o448n417m870m528m537m935n301n403n534n764n589
59308E28738m838m234m348m682m506m003l743l580l021k298k141k636l119l131
59294D78458k837k547k358k153j651o45N00J069R86R63J299J332P05K64Q01J716
59278D75902K059K218L281N138O609P295Q011R281J0670J1733J2602J3353J3665
59265E81817J3367J2614J1372R444P100M963L149J175j158l509n587p442r080
59252F18225j0382j1383j2084j2051j0911r095p508o477n754n251n002m484l010
59239E14833q62Q20J459J542J592J564J436J550J965K182J893J376Q35r6j779
59224E30310l895n659o524o485o048n908o368p067p520p761q006q009p384o417
$$ y = [616625, 605287, 595235, 587064, 580616, 575199, 570329, 565801, 561264, 556329, 551028, 545625, 540091, 534327, 528738, 523900, 519666, 515318, 510636, 506130, 502127, 498384, 494804, 491783, 489485, 487344, 484708, 481589, 478458, 475621, 473074, 470716, 468563, 466912, 466267, 466767, 467836, 468822, 469785, 471084, 472416, 473121, 473385, 474186, 475902, 477961, 480179, 483460, 488598, 495207, 502502, 510513, 519794, 530464, 542197, 554799, 568152, 581817, 595184, 607798, 619170, 628614, 635714, 640677, 643826, 645001, 643843, 640334, 634747, 627305, 618225, 607843, 596460, 584376, 572325, 561414, 552319, 544811, 538334, 532580, 527329, 522327, 517843, 514833, 513971, 514791, 516250, 517792, 519384, 520948, 522384, 523934, 525899, 528081, 529974, 531350, 532185, 532089, 530310, 526415, 520756, 514232, 507747, 501699, 495791, 489423, 482356, 474836, 467075, 459069, 451060, 443676, 437259]
59210D37259n845n798n631m789l361j839q28q16j588k043j305J83J282J688J940
59195D08509K237K215J956K150L061M173M967N275M849L531K034J561K347L399
59181D52264L904M081M382M769N124N551N879N636M829M118L901L960M197M909
59167E17504O013O872P298P892Q931R702R471Q503P473O528N426M151K842J488
59153F10094L0j522l287n341p258q433q920r282r537r156q253p706p707p357o277
59138E10088n498n849o510o208n130m369m056l270j697j34P26J084J445J984K758
59123D75364L908N336O581P285P597P977Q682R596J0425J1089J1806J2722J3544
59110E91912J3837J3669J3569J3766J3842J3326J2254J1053J0086R431Q750P468
$$ y = [437259, 431414, 425616, 419985, 415196, 411835, 409996, 409168, 408352, 406764, 404721, 403416, 403599, 404881, 406569, 408509, 410746, 412961, 414917, 417067, 420128, 424301, 429268, 434543, 439392, 442923, 444957, 446518, 448865, 452264, 456168, 460249, 464631, 469400, 474524, 480075, 485954, 491590, 496419, 500537, 504438, 508398, 512595, 517504, 523517, 530389, 537687, 545579, 554510, 564212, 573683, 582186, 589659, 596187, 601613, 605764, 608606, 610094, 610124, 608602, 605315, 599974, 592716, 584283, 575363, 566081, 556544, 547388, 539135, 531429, 523722, 516365, 510088, 504590, 498741, 492231, 486023, 480893, 476524, 472468, 469198, 467501, 467367, 468093, 469177, 470622, 472606, 475364, 479272, 484608, 491189, 498474, 506071, 514048, 522730, 532326, 542751, 553840, 565646, 578368, 591912, 605749, 619418, 632987, 646753, 660595, 673921, 686175, 697228, 707314, 716745, 725495, 732963]
59098G32963N410L275J971J393M47j515l824n273n373m613l888l829m301m474
59084G08369l791k907l084m640o660q315r620j0730j1357j1412j1417j1696j1763
59071F00977j1125j0121r347q733p844o718n772n168m851m936n487o112o298o006
59057E02459n487m775l794k797k162j871j640j468j607k024k287k067j499r88
59043D67993p87p67n35K11J300K213K549K345J965J787J974K348K604K746L115
59028D91061L830M491M770M969N532O406P448R006J1353J3789J5282J5868J6477
59015F10282J7362J7670J6635J4257J0704O138J435j986l643m478n373o031n818
59002F67154m889l791k579j067N19J713K388K707K822K846K804K392J298j56j291
$$ y = [732963, 738373, 741648, 743619, 745012, 745459, 743944, 740120, 734847, 729474, 724861, 720973, 717144, 712843, 708369, 704578, 701671, 698587, 693947, 687287, 678972, 669352, 658622, 647265, 635853, 624436, 612740, 600977, 589852, 579731, 570384, 561651, 553807, 547089, 541317, 536149, 531298, 526362, 520875, 514763, 508465, 502459, 496972, 492197, 488403, 485606, 483444, 481573, 479933, 478465, 476858, 474834, 472547, 470480, 468981, 467993, 467206, 466439, 465904, 466115, 467415, 469628, 472177, 474522, 476487, 478274, 480248, 482596, 485200, 487946, 491061, 494891, 499382, 504152, 509121, 514653, 521059, 528507, 537513, 548866, 562655, 577937, 593805, 610282, 627644, 645314, 661949, 676206, 686910, 693048, 694483, 692497, 688854, 684376, 679003, 672972, 667154, 662265, 658474, 655895, 654828, 655347, 657060, 659448, 662155, 664977, 667823, 670627, 673019, 674317, 674161, 672870]
58987F72870k092l243m961o596p656q404r069r343r031q466p832o856n527m316
58973E79478l268j798J40J632K145K349K941L610L926M323N274O309O799P009
58959F20869P394P582P036O143N556M948L550J406r04l416o439r392j1176j1667
58945F21490j1671j1422j0218p819n300l959l976m481m684m644n013o074p139
58932E35090p185o164n112m719m345l084j194J51L07l39j068j488j579j562j650
58917D96059j707j354n95j3k1k61j14N46J405K163K763L373M365N860P312Q071
58901E27852Q350Q895R643R679Q647P258O059M832L649L386M460O129P742R674
58887F26255J2204J4522J5879J6803J8089J9341J9556J8520J6640J4048J0900
$$ y = [672870, 670778, 667535, 662574, 655978, 648322, 639918, 630849, 621506, 612475, 604009, 596177, 589321, 583794, 579478, 576210, 574412, 574552, 576184, 578329, 580678, 583619, 587229, 591155, 595478, 600752, 607061, 613860, 620869, 628263, 635845, 642881, 649024, 654580, 659528, 663078, 664484, 663580, 660164, 653725, 644333, 633157, 621490, 609819, 598397, 588179, 580360, 575060, 571101, 567125, 562644, 557960, 553316, 548303, 542229, 535090, 527905, 521741, 516629, 511910, 507565, 504481, 503287, 503438, 503745, 503406, 502338, 500850, 499271, 497709, 496059, 494352, 492998, 492403, 492390, 492369, 492108, 491994, 492540, 493945, 496108, 498871, 502244, 506609, 512469, 519781, 527852, 536202, 545097, 554740, 564419, 573066, 580324, 586383, 591215, 594864, 598250, 602710, 608839, 616581, 626255, 638459, 652981, 668860, 685663, 703752, 723093, 742649, 761169, 777809, 791857, 802757]
58876H02757P889N429K946j36l393o361r592j3485j6820j7902j6816j5183j4024
58863G05309j3054j1848j0424q858p319o418o531p059p243p307p857q627q925
58850E93839q896r194r685r620q826p687o271m542l068k407k169j820j875l026
58836E14753m545n024m454m077m358m577m364m133l950l376k555k146k023j445
58822D63726n48l33r11j117l08P60J197J048O83K33L5O45J964L118L506L235K447
58805D79380J113l08j005q33l88L1O36J263J305P04R2k32n66r13q42l61l8j7R6
58786D79117L30L28L69J369L506N797P330Q013Q016P336O263N323M538L494K236
58771E43365J196K20j279l101m259m424m299m386m425m300m393m745m889m742
$$ y = [802757, 810646, 816075, 819021, 818885, 815492, 809131, 799539, 786054, 769234, 751332, 734516, 719333, 705309, 692255, 680407, 669983, 661125, 653806, 647388, 640857, 633798, 626555, 619248, 611391, 602764, 593839, 584943, 575749, 566064, 556444, 547618, 539931, 533660, 529118, 526050, 523643, 521474, 519654, 517779, 514753, 510208, 505184, 500730, 496653, 492295, 487718, 483354, 479221, 475271, 471895, 469340, 467194, 465171, 463726, 463178, 462845, 461934, 460817, 460509, 461269, 462466, 463514, 464197, 464430, 464465, 465110, 467074, 470192, 473698, 476933, 479380, 480493, 480185, 479180, 478347, 477959, 477990, 478626, 479889, 481194, 481898, 481990, 481758, 481192, 480279, 479437, 479076, 479038, 479021, 479117, 479447, 479775, 480144, 481513, 485019, 490816, 498146, 506159, 514175, 521511, 527774, 533097, 537635, 541129, 543365, 544561, 544781, 543502, 540401, 536142, 531718, 527419, 523033, 518608, 514308, 509915, 505170, 500281, 495539]
58757D95539m655m319k894o32R19R56M74P40J644K380K752L030L235L316L443
58742E05928L567L345K940L193M387N515N505M655M236M991O536P966Q627Q529
58728E79920Q214Q159Q313Q426Q520Q527P802N771K933N00r24j579j713j343o27
58713F40899L27J839L963N730O134N631N438N629N191L816K191N03j769m457o630
58698F74435q202j0169j2798j4999j5973j6172j6148j5749j4962j4263j3541j1962
58686E09497r518p489o696o478o038n618n604n550m923l935k978k041j208q15
58672D40606o70r3R18J567J687K115L214M300M987N823O996P675P388O788O297
58657D99598N206K964L56j518k449k651k097j000r8K43K90J1r74k155k312j490
$$ y = [495539, 490884, 486565, 483671, 483039, 483958, 484914, 485388, 486128, 487772, 490152, 492904, 495934, 499169, 502485, 505928, 509495, 512840, 515780, 518973, 523360, 528875, 534380, 539035, 543271, 548262, 554798, 562764, 571391, 579920, 588134, 596293, 604606, 613032, 621552, 630079, 637881, 643652, 646585, 647085, 646161, 644582, 642869, 641526, 640899, 641226, 643065, 647028, 652758, 658892, 664523, 669961, 675590, 680781, 684597, 686788, 687291, 685522, 681065, 674435, 666233, 656064, 643266, 628267, 612294, 596122, 579974, 564225, 549263, 535000, 521459, 509497, 499979, 492490, 485794, 479316, 473278, 467660, 462056, 456506, 451583, 447648, 444670, 442629, 441421, 440606, 439936, 439843, 440761, 442328, 444015, 446130, 449344, 453644, 458631, 464454, 471450, 479125, 486513, 493301, 499598, 504804, 507768, 508124, 506606, 504157, 501506, 499409, 498409, 498311, 498554, 498844, 498855, 497881, 495726, 493414, 491924]
58641D91924j224k078k659j986j192j562k431k520k018j736j312J7J655K278J749
58626D76905J039N93M6q05j716k404k550j818m53P87J805L387N709P700Q636R185
58610E06046R987J0400R658Q145O467M411J982K77j6J03m75j153q60j14k00j032
58594E53626j575j779k436l460l880l385k522j575l75R35K159L720O006Q274R353
58579E63086R202Q839Q931R333R668R519Q491O857N696N644O004N884N492N525
58565F68171O020O873Q583J1384J4326J6512J8508K1206K3890K4960K4180K2762
58553H67375K1352J9343J6210J2309Q267M485J365q20k327l625m804n795o902
58540I26433q515j0564j2702j4752j6559j7894j8837j9749k0534k0560j9611j8081
$$ y = [491924, 490700, 488622, 485963, 483977, 482785, 481223, 478792, 476272, 474254, 472518, 471206, 471223, 472878, 475156, 476905, 477944, 478537, 478583, 477778, 476062, 473658, 471108, 469290, 468837, 469624, 471429, 474816, 480525, 488225, 496861, 506046, 516033, 526433, 536091, 544236, 550703, 555114, 557096, 557373, 557357, 557460, 556985, 555832, 554972, 554858, 554658, 553626, 552051, 550272, 547836, 544376, 540496, 537111, 534589, 533014, 532639, 533574, 535733, 539453, 545459, 553733, 563086, 572288, 581127, 590058, 599391, 609059, 618578, 627069, 633926, 639622, 645266, 651270, 657154, 662646, 668171, 674191, 681064, 689647, 701031, 715357, 731869, 750377, 771583, 795473, 820433, 844613, 867375, 888727, 908070, 924280, 936589, 944856, 949341, 950706, 949886, 947559, 943934, 939130, 933335, 926433, 917918, 907354, 894652, 879900, 863341, 845447, 826610, 806861, 786327, 765767, 746156, 728075]
58528G28075j6061j3262j0178p987o838n620l989l009l043k671r43Q94J311P03
58514F57382L13K90L60J114K938M787N552N642N755N221L281Q47p45j699k754
58499F88284l374k891k370l233m791n316m802m612m891m578l559k737k169j113
58485F37848L27J330J969K956M097M716N271O792R015J0802J2059J3524J4950
58472G25656J5224J4163J2451J0169P027L642R00j589m618p439q582q215p726
58459G51063p321o070m094k500j251P06L100M417M519N052O649P772P016M899
58445G73957K595L70j989m283o153p436p985p788p277o746n757l962k030p40K86
58430G15062J763L293M027M213M721N599O516P915J0189J2331J2982J2387J1734
$$ y = [728075, 712014, 698752, 688574, 680587, 673749, 668129, 664140, 661131, 658088, 655417, 654474, 655368, 656679, 657382, 657695, 657985, 658345, 659459, 662397, 667184, 672736, 678378, 684133, 689354, 692635, 693482, 692737, 691038, 688284, 684910, 682019, 679649, 676416, 671625, 666309, 661507, 656895, 652004, 647426, 643867, 641130, 638961, 637848, 638175, 639505, 641474, 644430, 648527, 653243, 658514, 665306, 674321, 685123, 697182, 710706, 725656, 740880, 755043, 767494, 777663, 784690, 788332, 789232, 787643, 783025, 775586, 767004, 758789, 751063, 743742, 737672, 733578, 731078, 729827, 730533, 733633, 738050, 742569, 747621, 754270, 762042, 769058, 773957, 776552, 776922, 774933, 770650, 764497, 757061, 749076, 741288, 734011, 727265, 721508, 717546, 715516, 714776, 715062, 716825, 720118, 724145, 728358, 733079, 738678, 745194, 753109, 763298, 775629, 788611, 800998, 812732]
58417H12732J1180J0081Q492O824M681J753r01k144k570l384m379m905n608p107
58403H24745q043o921m927m309m738m076k038k75P68K116L658M144L774M027M889
58388H12794M893L903L187K723J182j288k881l035k894k778j727J60J493K024
58374H17756K838L923L997L048K639L383M337N103O252P576Q215Q498R463J0727
58360H97755J1204J1418J2587J3919J3695J2608J2817J3988J3674J1525R629Q556
58348A043375O673L875K411L233M699N565O339P112P083O777P719R556J0481J0699
58334A135597J2204J4936J6615J6702J6975J7782J7397J5612J4215J3371J1273
58323A302679Q099O380O655O584N178M129M080L607K779L648O190P787P845Q760
$$ y = [812732, 823912, 833993, 842485, 849309, 853990, 855743, 854842, 852698, 850128, 846744, 842365, 837460, 831852, 824745, 816702, 809781, 804854, 800545, 795807, 791731, 789693, 789418, 790186, 792302, 795960, 800104, 803878, 807905, 812794, 817687, 821590, 824777, 827500, 828682, 827394, 824513, 821478, 818584, 815806, 814079, 814239, 815732, 817756, 820594, 824517, 828514, 831562, 834201, 837584, 841921, 847024, 853276, 860852, 869067, 877565, 887028, 897755, 908959, 920377, 932964, 946883, 960578, 973186, 986003, 999991, 1013665, 1025190, 1034819, 1043375, 1050048, 1053923, 1056334, 1059567, 1064266, 1069831, 1076170, 1083282, 1090365, 1097142, 1104861, 1114417, 1124898, 1135597, 1147801, 1162737, 1179352, 1196054, 1213029, 1230811, 1248208, 1263820, 1278035, 1291406, 1302679, 1310778, 1317158, 1323813, 1330397, 1335575, 1339704, 1343784, 1347391, 1350170, 1353818, 1360008, 1367795, 1375640, 1384400]
58309A384400J1222J2861J2816J3338J5417J7055J7467J8723K1557K3715K4084
58298A572655K4346K5072K4506K2704K2380K3917K4149K1921K0206K0862K1895
58287A824613K1993K2977K5579K7468K7666K8310K9994L0181K8457K8258L0941
58276B126437L3263L3251L3444L5670L7794L8442L9820M2908M5105M5492M7161
58265B558787N1489N5461N7549O0566O5732O9769P1130P3022P6925P9364P8724
58254C298518P8882Q2105Q4794Q4466Q4455Q7401R0628R2398R6052J03263J09938
58243D292900J13705J18540J27143J35801J41971J49545J61113J72504J80705
58234E593927J89720K02778K16474K28407K42602K61405K80519K98096L19622
$$ y = [1384400, 1395622, 1408483, 1421299, 1434637, 1450054, 1467109, 1484576, 1503299, 1524856, 1548571, 1572655, 1597001, 1622073, 1646579, 1669283, 1691663, 1715580, 1739729, 1761650, 1781856, 1802718, 1824613, 1846606, 1869583, 1895162, 1922630, 1950296, 1978606, 2008600, 2038781, 2067238, 2095496, 2126437, 2159700, 2192951, 2226395, 2262065, 2299859, 2338301, 2378121, 2421029, 2466134, 2511626, 2558787, 2610276, 2665737, 2723286, 2783852, 2849584, 2919353, 2990483, 3063505, 3140430, 3219794, 3298518, 3377400, 3459505, 3544299, 3628765, 3713220, 3800621, 3891249, 3983647, 4079699, 4182962, 4292900, 4406605, 4525145, 4652288, 4788089, 4930060, 5079605, 5240718, 5413222, 5593927, 5783647, 5986425, 6202899, 6431306, 6673908, 6935313, 7215832, 7513928, 7833550]
58225G833550L47464L75434M00454M29126M65356N02886N38326N79688O32841
58216A2105125O91954P53262Q25297R14658J015341J124015J251612J407256J586320
58207B1674840J788340K030204K327025K678668L090749L583365M153588M753793
58199D6080572N344312N959232O695133P648795Q889019J0465186J2407968J4739966
58191A18230183J7519431K0850840K4808790K9335263L4124587L8371993M0471678
58184C23712765L8220426K9952747J5999892r01208j6880587k8906020l5877779
58177C25320236l8327044l7484386l4606467l0729277k6594176k2634915j9057587
58170A15886384j5952436j3338961j1170668r373001p889476o677750n684889
$$ y = [7833550, 8181014, 8556448, 8956902, 9386028, 9851384, 10354270, 10892596, 11472284, 12105125, 12797079, 13550341, 14375638, 15290296, 16305637, 17429652, 18681264, 20088520, 21674840, 23463180, 25493384, 27820409, 30499077, 33589826, 37173191, 41326779, 46080572, 51424884, 57384116, 64079249, 71728044, 80617063, 91082249, 103490217, 118230183, 135749614, 156600454, 181409244, 210744507, 244869094, 283241087, 323712765, 361933191, 391885938, 407885830, 406984622, 390104035, 361198015, 325320236, 286993192, 249508806, 214902339, 184173062, 157578886, 134943971, 115886384, 99933948, 86594987, 75424319, 66051318, 58161842, 51484092, 45799203]
58163D5799203m858355m169839l604049l135105k734878k393183k109048j870781
58155B0923965j662109j479070j324107j191080j070906r64440q75667p99107
58147A1557479p26777o60742o06427n60050n14499m71377m35809m05067l73314
58138F803417l42410l17498k96697k75008k53859k37401k23684k08440j93427
58129D454993j82470j73334j61854j50078j42200j36283j27930j18522j12024
58120C150298j07051r9758r1491q6143q2837p8323p3836p2502p2546o9833o5026
58109B250952o1769n9996n7132n3821n2532n2355n0809m8771m8400m8301m5981
58098A671085m2885m1883m1997m0659l8841l8762l8822l6098l1838k9237k7775
$$ y = [45799203, 40940848, 36771009, 33166960, 30031855, 27296977, 24903794, 22794746, 20923965, 19261856, 17782786, 16458679, 15267599, 14196693, 13232253, 12356586, 11557479, 10830702, 10169960, 9563533, 9003483, 8488984, 8017607, 7581798, 7176731, 6803417, 6461007, 6143509, 5846812, 5571804, 5317945, 5080544, 4856860, 4648420, 4454993, 4272523, 4099189, 3937335, 3787257, 3645057, 3508774, 3380844, 3262322, 3150298, 3043247, 2943489, 2851998, 2765855, 2683018, 2604695, 2530859, 2458357, 2385811, 2315978, 2250952, 2189183, 2129187, 2072055, 2018234, 1965702, 1913347, 1862538, 1813767, 1765367, 1717066, 1671085, 1628200, 1586317, 1544320, 1503661, 1464820, 1426058, 1387236, 1351138, 1319300, 1290063, 1262288]
58087A262288k4903k1454k0147k0385j9608j8285j8665j9942j9508j7768j7187
58076A044436j7761j7711j7331j7935j8470j7235j5533j5562j6301j5581j4335
58065H60681j4584j5037j3242j0457r719j0579j0290q930q665r298r059q704j0141
58052G21976j2160j2113j0826j1077j2183j1061p996o361o905p154o464o806q323
58039F02547q698p430o605o828o423n184m953n975o299n514n453o640p399p118
58025E12028p111p699p581o664o356o621n801l905k950l506l886l381l339m304
58011D38924m934m531m067l980l385k191j629k023k217j683j185j016o44l28r59
57996D04152k148k474j717r08m17l2n26k692n182n760m509l298k557j258K62N42
$$ y = [1262288, 1237385, 1215931, 1195784, 1175399, 1155791, 1137506, 1118841, 1098899, 1079391, 1061623, 1044436, 1026675, 1008964, 991633, 973698, 955228, 937993, 922460, 906898, 890597, 875016, 860681, 846097, 831060, 817818, 807361, 797642, 787063, 776773, 767843, 759178, 749880, 740821, 732117, 721976, 709816, 697703, 686877, 675800, 663617, 652556, 644560, 638199, 631294, 624140, 617676, 610870, 602547, 593849, 586419, 579814, 572986, 566563, 561379, 556426, 550451, 544152, 538638, 533185, 526545, 519146, 512028, 504917, 497218, 489637, 482973, 476617, 469996, 464195, 460290, 457340, 453834, 449948, 446567, 443228, 438924, 433990, 429459, 425392, 421412, 418027, 415836, 414207, 412184, 409967, 408284, 407099, 406083, 405439, 405111, 404152, 402004, 399530, 397813, 396905, 396488, 396456, 395930, 393238, 388056, 382296, 377787, 374489, 371932, 370674, 370936, 371478]
57980C71478q9P4P81K0k178l333k431j239j073j121p32o05q37l57Q21J288Q80
57963C61347J172K606L558L116K411K332K256J843J829K187J729L46m95k56j01
57948C85880n16m78K74N17j12l23K85L41o04q19R37L545N476O632P247O996O361
57931D21639O755Q127Q427O635M266K578N30k947o598q622r268r912j0775j1141
57917C99694j0798r956q675p387o894p043o559n020l565k969k489j461m24K59
57903C26713J222K457K553Q01j452k715l162l328k725j169k0m25j493j703j071
57888C14483m82k0O21R47M04m89j009j498k501l537l883l891m255m719m683m405
57872B81083m436m448l824k894k559k964l474l602l226k314j078L2R27J951L098
$$ y = [371478, 371389, 371463, 372244, 372264, 370086, 366753, 364322, 363083, 362010, 360889, 360157, 359552, 358715, 358358, 359179, 360467, 361347, 362519, 365125, 368683, 371799, 374210, 376542, 378798, 380641, 382470, 384657, 386386, 386732, 386237, 385981, 385880, 385364, 384886, 385160, 385677, 385565, 385242, 385527, 385868, 385264, 384445, 385382, 388927, 394403, 401035, 408282, 415278, 421639, 428394, 436521, 444948, 451583, 455849, 458427, 458957, 456010, 449412, 440790, 431522, 421610, 410835, 399694, 388896, 378940, 370265, 362878, 355984, 348941, 342382, 337362, 333797, 330828, 328339, 326878, 326454, 326713, 327935, 330392, 332945, 333746, 332294, 329579, 326417, 323089, 320364, 319195, 319175, 318750, 317257, 315554, 314483, 314001, 313981, 314602, 315549, 315953, 315464, 314455, 312957, 310456, 306919, 303036, 299145, 294890, 290171, 285488, 281083, 276647, 272199, 268375, 265481, 262922, 259958, 256484, 252882, 249656, 247342, 246264, 246296, 247223, 249174, 252272]
57857B52272L845M178M748N667O126N737N153M799M129K826J604J026N83k17r24
57842C01552j179j573k553l460l682l708m063m064k896j116%K17L36R39J900K861
57826B79511L461L438K961K505K153J634J100R95J057N59l78r69j451k974n351
57811B88251o724o282n551n926o590o240n334n010m959m182k974k478k754k791
57797B20456k075j043k25J21o2l33P5J178K075K344K600L113L148K501K266L055
57781B39194L831L794L985N440P072P213O243N737N806N238L797K420J397R7j569
57766B99695k963m001n233o688p776q321q577q472p835p117o768o238m745k714
57752B12247j364j076j228j352j421j303r84r32j361j615j298j261k238l220k703
$$ y = [252272, 256117, 260295, 265043, 270710, 276836, 282573, 287726, 292525, 296654, 299480, 301084, 302110, 302693, 302476, 301552, 300373, 298800, 296247, 292787, 289105, 285397, 281334, 277270, 274374, 273258, 273258, 273475, 273811, 274750, 276650, 279511, 282972, 286410, 289371, 291876, 294029, 295663, 296763, 297758, 298815, 299374, 298996, 298027, 296576, 293602, 288251, 281527, 275245, 269694, 263768, 257178, 250938, 245604, 240594, 235635, 231453, 228479, 226001, 223247, 220456, 218381, 217338, 217113, 217234, 217172, 216839, 216914, 218092, 220167, 222511, 225111, 228224, 231372, 233873, 236139, 239194, 243025, 246819, 250804, 256244, 263316, 270529, 276772, 282509, 288315, 293553, 297350, 299770, 301167, 301264, 299695, 296732, 292731, 287498, 280810, 273034, 264713, 256136, 247664, 239829, 232712, 225944, 219706, 214961, 212247, 210883, 209807, 208579, 207227, 205806, 204503, 203519, 202587, 201226, 199611, 198313, 197052, 194814, 191594, 188891]
57737A88891j047J7j46o84j080j646k319k554k506k887l579l808l684m014m478
57722A54476l686j395Q41J833K182K925L991M773N163N274M902M055L346L204
57708A91884L145K424J090m3k47N25J740K764L337L646L917M209M528M638L720
57693B31277J107k346m599m810m333m562m923m184k660j548q28M33K250L833N219
57678B09326P108R277J0940J2479J5131J8971K2957K7122L2948M1322N1545O2202
57666E21328P0846P2605O1966L7847N874k5358m9471o3836o8495o5510n8299m9854
57654C89643m1588l4215k8542k4590k1077j7047j3204j0638r104p669o285n465
57642A70219m976m105k880j936j415r66o44q13j352j729j744j512r17J28J078
$$ y = [188891, 187844, 187861, 187715, 187031, 185951, 184305, 181986, 179432, 176926, 174039, 170460, 166652, 162968, 158954, 154476, 150790, 149395, 150236, 152069, 154251, 157176, 161167, 165940, 171103, 176377, 181279, 185334, 188680, 191884, 195029, 197453, 198543, 198500, 198253, 198778, 200518, 203282, 206619, 210265, 214182, 218391, 222919, 227557, 231277, 232384, 230038, 225439, 220629, 216296, 211734, 206811, 202627, 199967, 198419, 197591, 198024, 200274, 204107, 209326, 216434, 225711, 236651, 249130, 264261, 283232, 306189, 333311, 366259, 407581, 459126, 521328, 592174, 664779, 726745, 764592, 770466, 745108, 695637, 631801, 563306, 497796, 439497, 389643, 348055, 313840, 285298, 260708, 239631, 222584, 209380, 198742, 189638, 181969, 175684, 170219, 165243, 161138, 158258, 156322, 154907, 153941, 153297, 152484, 151132, 149403, 147659, 146147, 145230, 145358, 146436]
57627A46436J208N99Qj91k81m74o30o92q77j267j717k193k741l106k823j849o89
57610A28721J72P03J041J144R76P97R67J494J902J716R92L10J67M77P45O44K36
57593A43204l11r18j465j771j800j782j933k143k076j597j034q47j041j061m99
57578A22926L38Q87J148J513J837J472M64j54K14P13K19j023j799j581r31m45
57562A25798j89j54m18p76q28n66l04j19J91N90Q09P81N66M7p92j475j536j233
57544A20392j135j236j218j228j502j462l28J442K427K113J397J060P96J61m52
57529A21227l72M85J703K770L212K941K589K762K963K206P34k3M71J048O85n1
57513A45350k56k67q77j717j678o10M95Q82P25M33J21j03K4N23Q83N37m56j338
$$ y = [146436, 147644, 148243, 148251, 148060, 147779, 147305, 146675, 145983, 145106, 143839, 142122, 139929, 137188, 134082, 131259, 129410, 128721, 128893, 129596, 130637, 131781, 132757, 133554, 134521, 136015, 137917, 139633, 140625, 140935, 141102, 141579, 142324, 142968, 143204, 142893, 141975, 140510, 138739, 136939, 135157, 133224, 131081, 129005, 127408, 126374, 125527, 124486, 123425, 122926, 123264, 124151, 125299, 126812, 128649, 130121, 130585, 130431, 130645, 131358, 131577, 130554, 128755, 127174, 126243, 125798, 125609, 125455, 125037, 124261, 123433, 122867, 122563, 122444, 122635, 123225, 124034, 124815, 125381, 125428, 124636, 123161, 121625, 120392, 119257, 118021, 116803, 115575, 114073, 112611, 112283, 113725, 116152, 118265, 119662, 120722, 121518, 121679, 121227, 120855, 121340, 123043, 125813, 129025, 131966, 134555, 137317, 140280, 142486, 143220, 143197, 143668, 144716, 145401, 145350, 145094, 144827, 143950, 142233, 140555, 139945, 140440, 141322, 142047, 142480, 142601, 142498, 142522, 143045, 143928, 144465, 144009, 142671]
57495A42671j435j036j140k051k708k049o70j24p09j077l39O34O64Rj72M68J236
57478A32172J507J265O87j11r50j629k107k371k284j791j178q09p82q62p00r4
57462A19963O94R95M82k75m72j65o0l30m01j4L80M99O84J110J328R77L45j76n46
57443A25018o68j43J057K268K866K844K435J750J126J052J410J453Q61J69j80
57428A43318m01o20m05L80J111J378J605K083K257J699R83P31N72p2q44j067r26
57411A51782r56r01j32J119J971K103J867J405O02j89l32J93P58R24P31L16j37
57394A61124k08L96J327J938K003J678J143O87Q12J670K716L374L618L494K683
57379A88455J279K60L44Q60P18qm09k87k63n30o34l62L7M97J163J816K121K224
$$ y = [142671, 141236, 140200, 139060, 137009, 134301, 132252, 131582, 131458, 130749, 129672, 129333, 129967, 130631, 130640, 130468, 130936, 132172, 133679, 134944, 135631, 135520, 134570, 132941, 130834, 128463, 126179, 124388, 123210, 122401, 121619, 120757, 120057, 119963, 120657, 121652, 122134, 121859, 121387, 121222, 121162, 120832, 120431, 120417, 120797, 121296, 121980, 123090, 124418, 125395, 125740, 125564, 125018, 124350, 124207, 125264, 127532, 130398, 133242, 135677, 137427, 138553, 139605, 141015, 142468, 143329, 143498, 143318, 142917, 142297, 141892, 142272, 143383, 144761, 146366, 148449, 150706, 152405, 153388, 154119, 154691, 154619, 153775, 152708, 151782, 150826, 149925, 149793, 150912, 152883, 154986, 156853, 158258, 158860, 158671, 158339, 158532, 159290, 160214, 160945, 161261, 161124, 160916, 161312, 162639, 164577, 166580, 168258, 169401, 170088, 170900, 172570, 175286, 178660, 182278, 185772, 188455, 189734, 189994, 190338, 191198, 191916, 191908, 191499, 191212, 190949, 190419, 189785, 189423, 189460, 189957, 191120, 192936, 195057, 197281]
57361A97281K341K088J167L79P53J825K103J279O63J162K112K562K540K431K115
57346B22801J403O21J06k34l74J71J507K699K670J462J45l03L12J442K252K218
57330B38898J605J162J212J378J294J145J242J457J412J012N20K28J90K27J91
57315B53173K40O97J462J858J467Q32Q35J566K354K757K903K964K901K795K848
57300B81652L014L090L132L223L030K205J193Q08J067J274J252J516K030J893
57286C10379P55l67l61O17J728K697L729M648N020M924M953N459O354P491Q752
57271C66778R837J0434J0617J0776J1124J1544J1829J1840J1502J0942J0567J0726
57259D98516J1285J1730J1647J0971R787Q283O895O214O435O982O962O168N360
$$ y = [197281, 199622, 201710, 202877, 203256, 204009, 205834, 207937, 209216, 209879, 211041, 213153, 215715, 218255, 220686, 222801, 224204, 224825, 224931, 224697, 224323, 224494, 226001, 228700, 231370, 232832, 232977, 232674, 232986, 234428, 236680, 238898, 240503, 241665, 242877, 244255, 245549, 246694, 247936, 249393, 250805, 251817, 252337, 252565, 252755, 252982, 253173, 253413, 254110, 255572, 257430, 258897, 259729, 260564, 262130, 264484, 267241, 270144, 273108, 276009, 278804, 281652, 284666, 287756, 290888, 294111, 297141, 299346, 300539, 301347, 302414, 303688, 304940, 306456, 308486, 310379, 311134, 310767, 310406, 311023, 312751, 315448, 319177, 323825, 328845, 333769, 338722, 344181, 350535, 358026, 366778, 376615, 387049, 397666, 408442, 419566, 431110, 442939, 454779, 466281, 477223, 487790, 498516, 509801, 521531, 533178, 544149, 553936, 562219, 569114, 575328, 581763, 588745, 595707, 601875, 607235]
57246F07235N372O138O930P454Q122R149R964R929R210Q505Q183Q153Q342Q726
57232G21412R016Q876Q485Q417Q962R783J0354J0435J0201J0072J0384J1025J1532
57219H48954J1676J1673J1719J1720J1726J2140J3051J3842J3998J3914J4384
57208I88797J5596J7122J8459J9070J8499J7171J6451J7040J7861J7578J6610
57197A180254J6384J7026J7394J7267J7799J9472K1125K1659K1464K1400K1436
57186A392680K1084K0397J9816J9549J9621J9993K0343K0365K0445K1224K2273
57175A617790K2305K1053J9779J9349J9026J8011J7037J7257J8357J9020J8779
57164A827763J8279J8002J7859J7814J8034J8411J8646J8682J8528J7983J7136
$$ y = [607235, 612607, 618745, 625675, 633129, 641251, 650400, 660364, 670293, 679503, 688008, 696191, 704344, 712686, 721412, 730428, 739304, 747789, 756206, 765168, 774951, 785305, 795740, 805941, 816013, 826397, 837422, 848954, 860630, 872303, 884022, 895742, 907468, 919608, 932659, 946501, 960499, 974413, 988797, 1004393, 1021515, 1039974, 1059044, 1077543, 1094714, 1111165, 1128205, 1146066, 1163644, 1180254, 1196638, 1213664, 1231058, 1248325, 1266124, 1285596, 1306721, 1328380, 1349844, 1371244, 1392680, 1413764, 1434161, 1453977, 1473526, 1493147, 1513140, 1533483, 1553848, 1574293, 1595517, 1617790, 1640095, 1661148, 1680927, 1700276, 1719302, 1737313, 1754350, 1771607, 1789964, 1808984, 1827763, 1846042, 1864044, 1881903, 1899717, 1917751, 1936162, 1954808, 1973490, 1992018, 2010001, 2027137]
57153B027137J6691J7079J7620J7440J6853J6880J7592J8025J7793J7769J8894
57142B219773K1083K3614K5964K7884K9245L0219L1258L2534L3735L4600L5423
57131B545332L6671L8257L9595M0304M0635M1097M1833M2631M3596M5432M8699
57120C004082N2939N7072O0669O4324O8680P3713P9371Q6310R5305J06213J18138
57109C866816J30582J43986J59162J76784J97465K22025K51423K86714L29120
57100E764077L80059M41079N13870O00327P02370Q21652R59389J116216J291756
57091A2590795J483983J688828J900358K111162K312307K492617K638239K733613
57083B9951902K763741K716122K581307K353080K029571J614984J120881N66895
$$ y = [2027137, 2043828, 2060907, 2078527, 2095967, 2112820, 2129700, 2147292, 2165317, 2183110, 2200879, 2219773, 2240856, 2264470, 2290434, 2318318, 2347563, 2377782, 2409040, 2441574, 2475309, 2509909, 2545332, 2582003, 2620260, 2659855, 2700159, 2740794, 2781891, 2823724, 2866355, 2909951, 2955383, 3004082, 3057021, 3114093, 3174762, 3239086, 3307766, 3381479, 3460850, 3547160, 3642465, 3748678, 3866816, 3997398, 4141384, 4300546, 4477330, 4674795, 4896820, 5148243, 5434957, 5764077, 6144136, 6585215, 7099085, 7699412, 8401782, 9223434, 10182823, 11299039, 12590795, 14074778, 15763606, 17663964, 19775126, 22087433, 24580050, 27218289, 29951902, 32715643, 35431765, 38013072, 40366152, 42395723, 44010707, 45131588, 45698483]
57075D5698483j9285o04415j155613j646800k061143k389013k625413k769623
57067C2427178k825797k802493k711437k566652k383499k177096j960900j746100
57059A3253204j541182j351303j178517j023187q85295p64610o60350n71238m95604
57050D781918m31414l76687l30071k90554k56734k27247k02070j82346j68364
57041B316431j58422j50151j42193j34085j25487j16317j07003r7830q8552p9274
57031A117117p0949o4222n8414n2526m6678m1689l7709l4255l1229k8871k6955
57020F23620k4890k2582k0440j8697j7374j6661j6598j6568j5854j4498j3066
57009D26392j1849j0889j0410j0443j0314r389q144p595p882q232q260q365q807
$$ y = [45698483, 45679198, 45074783, 43919170, 42272370, 40211227, 37822214, 35196801, 32427178, 29601381, 26798888, 24087451, 21520799, 19137300, 16960204, 14999304, 13253204, 11712022, 10360719, 9182202, 8159015, 7273720, 6509110, 5848760, 5277522, 4781918, 4350504, 3973817, 3643746, 3353192, 3096458, 2869211, 2667141, 2484795, 2316431, 2158009, 2007858, 1865665, 1731580, 1606093, 1489776, 1382773, 1284943, 1196391, 1117117, 1046168, 981946, 923532, 871006, 824328, 782639, 744930, 710675, 679446, 650575, 623620, 598730, 576148, 555708, 537011, 519637, 502976, 486378, 469810, 453956, 439458, 426392, 414543, 403654, 393244, 382801, 372487, 363098, 354954, 347359, 339477, 331245, 322985, 314620, 305813]
56996C05813r153q841p730o086m365l012j965o39J200K868L778M566O399R242
56982B92075J1626J2043R939N564k54o214j1136j4571j6464j6638j5248j3271
56970B37451j1569r770p063l812j230M08K042M296O798R236J1877J4783J7511
56957B70958J9943K2321K3954K2857J7532Q722j032r217j4568j7186j7878j7242
56945C09164j5372j2643j0228q918p810n354j637J653L718N668Q660J2327J5836
56932B95064J9313K3171K6770K8620K7325K1862J1918r30j3161k1688k6137k8107
56920C64020k8678k7696k5140k1881j8747j5765j2736r985q100p170o635n811
56908A75676m514l136k161j576r25P0J119J729J794J732K126L150M302M825M668
$$ y = [305813, 296660, 287819, 280089, 274003, 269638, 266626, 264661, 264022, 265222, 268090, 271868, 276434, 282833, 292075, 303701, 315744, 325683, 331247, 330993, 324779, 313643, 299072, 282608, 265970, 250722, 237451, 225882, 216112, 209049, 205237, 204007, 204415, 206457, 210753, 217551, 226787, 238664, 253447, 270958, 290901, 313222, 337176, 360033, 377565, 386287, 385255, 376038, 361470, 344284, 326406, 309164, 293792, 281149, 270921, 262003, 254193, 248839, 247202, 248855, 252573, 258241, 266901, 279228, 295064, 314377, 337548, 364318, 392938, 420263, 442125, 454043, 453113, 439952, 418264, 392127, 364020, 335342, 307646, 282506, 260625, 241878, 226113, 213377, 203392, 195292, 188122, 181487, 175676, 171162, 168026, 165865, 164289, 163364, 163434, 164553, 166282, 168076, 169808, 171934, 175084, 179386, 184211, 188879]
56893A88879M754N893P712R323J0791J3044J6305J9547K1722K2564K1716J8185
56881C60435J1552L137m889j1173j5327j7012j6026j3094r641o500l499l02L040
56868B80701O541J0554J5171J9867K4209K8640L4113M0982M8590N5617O0266O0041
56856F85292N2384L6539J5032p208k5525l7550m3197m3632m0471l5210k8701k1235
56844E06518j3258n504J801R233J7196K5239L2993M1175N0806O1850P3395Q4498
56832H85942R3377R5837Q6425O2534K7318j1596m6098p0858q4390q8191q4844
56821H65456p6600o5390n3386m2485l3148k4551j6043p731L53Q718J7683K6976
56809E99852L6391M6198N6229O4814O8797O4549M9650K4860n072l3421n5059o8199
$$ y = [188879, 193633, 199526, 207238, 216561, 227352, 240396, 256701, 276248, 297970, 320534, 342250, 360435, 371987, 375124, 370235, 359062, 343735, 326723, 310697, 297603, 287962, 281462, 277963, 277661, 280701, 287242, 297796, 312967, 332834, 357043, 385683, 419796, 460778, 509368, 564985, 625251, 685292, 737676, 774215, 789247, 782039, 756514, 718964, 675767, 632135, 591664, 556454, 527753, 506518, 493260, 487756, 489557, 498790, 515986, 541225, 574218, 615393, 666199, 728049, 801444, 885942, 979319, 1075156, 1161581, 1224115, 1251433, 1239837, 1193739, 1122881, 1038491, 950300, 865456, 788856, 723466, 670080, 627595, 594447, 569896, 553853, 546122, 546475, 555193, 572876, 599852, 636243, 682441, 738670, 803484, 872281, 936830, 986480, 1011340, 1006268, 972847, 917788, 849589]
56797H49589p3391p2057o6172n7999m9254m0777l3099k6488k0396j3925p199j263
56785C87569L678Q837J5107K1886K8139L3355L6525L5388K8120J5347l06j6014
56773E97631k9437l8667m2985m3434m1655l8400l3901k9034k4973k1934j9181
56762B34030j6180j2995r876p239n736n529n803n668n264n138n052m370l312k751
56748A39117k874l013k795k510k330j990j378p96n08n62r08j229q94K36J265J247
56732A20078M46j41k90n60j048j212r11n77k41M68J256J210L13j81M67J333J203
56715A21613K82l83n71q95j408j328l27P69R95M96K35P32J539J989J951J680J292
56698A28661Q14N19P41J301J596J360R50P42O89O08M98L71J91Q7K43L71r4j024
$$ y = [849589, 776198, 704141, 637969, 579970, 530716, 489939, 456840, 430352, 409956, 396031, 388832, 387569, 391247, 400084, 415191, 437077, 465216, 498571, 535096, 570484, 598604, 613951, 613645, 597631, 568194, 529527, 486542, 443108, 401453, 363053, 329152, 300118, 275145, 253211, 234030, 217850, 204855, 194979, 187740, 182004, 176475, 170672, 165004, 159740, 154602, 149550, 145180, 141868, 139117, 136243, 133230, 130435, 127925, 125595, 123605, 122227, 121431, 120923, 120361, 119453, 118224, 117330, 117566, 118831, 120078, 120524, 120383, 120093, 119533, 118485, 117273, 116362, 115785, 115544, 116012, 117268, 118478, 118791, 118610, 119077, 120410, 121613, 121895, 121512, 120941, 120046, 118638, 117310, 116983, 117752, 118747, 119243, 119478, 120210, 121749, 123738, 125689, 127369, 128661, 129475, 129994, 130735, 132036, 133632, 134992, 135942, 136684, 137373, 137981, 138479, 138850, 139041, 139128, 139371, 139742, 139648, 138624]
56680A38624j526j232r71j558k543k887k364j553q75m42n10j198j956k111j805
56665A15093j644j600j134k72K83K37P8K44N62O83N05N1n22p83m29J68L85L27
56647A12232O98J706K759L353L580L568L173K500K119K310K627K564K205J847
56633A47241J420P82K36K12O08Q65O74K21j92m87o57n91k24L02P32R45R32N84
56615A53603k82j577k794l399l294k731j984j336j144j459j712j298m16K04L30
56600A30711L90N70N59K85J97M47N62K71k2k4j45p65j508j808j639j203m66M26
56582A26838Q72O67N73J343K549L114K643J629P07L05O54J527K309K771L249L749
56566A55499L707L202L419M900O314O245N501O059Q100R602Q899O303L166N46
$$ y = [138624, 137098, 135866, 134895, 133337, 130794, 127907, 125543, 123990, 123115, 122673, 122163, 120965, 119009, 116898, 115093, 113449, 111849, 110715, 110443, 110726, 110963, 111041, 111285, 111847, 112530, 113035, 113086, 112564, 111781, 111352, 111520, 111905, 112232, 112930, 114636, 117395, 120748, 124328, 127896, 131069, 133569, 135688, 137998, 140625, 143189, 145394, 147241, 148661, 149443, 149679, 149891, 150499, 151364, 152038, 152259, 152067, 151580, 150923, 150332, 150108, 150410, 151142, 152087, 153019, 153603, 153321, 151744, 148950, 145551, 142257, 139526, 137542, 136206, 135062, 133603, 131891, 130593, 130177, 130381, 130711, 131101, 131671, 132230, 132515, 132712, 133159, 133721, 133992, 133970, 133946, 133801, 133036, 131528, 129720, 128081, 126878, 126412, 126838, 127710, 128377, 128950, 130293, 132842, 135956, 138599, 140228, 140935, 141240, 141894, 143421, 145730, 148501, 151750, 155499, 159206, 162408, 165827, 170727, 177041, 183286, 188787, 194846, 202946, 212548, 221447, 227750, 230916, 231462]
56552B31462r31j117o29l51m30m06k98p07j766k765l058k644j857j078p54j058
56536B11613j569j885k254k980l524l132k088j359j199j117j082j577k467k896
56522A82484k472j620p51mK18m24j331j485r79q14j162j079k61K73j80r00r76
56505A68537o46o40r91j247j247j032n21J95O55O38N03N91P24N97K58p0k36o6
56487A66002M70Q99N99k65p62l40N89J341J703J764J556J155P40L98K24M67J168
56470A77708J713J434N63J8K24P79J175J258J006N29K09K84M52M01M18P99J086
56453A90056P29J33K7K14K9l06o0N06M11l61p52l25J91J80j98o81j086q83J81
56434A88005J116O70o73j186m13L19P6n74r51j193j312p98K49R74J098J189J293
$$ y = [231462, 230531, 229414, 228785, 228434, 228004, 227598, 227300, 226593, 224827, 222062, 219004, 216360, 214503, 213425, 212671, 211613, 210044, 208159, 205905, 202925, 199401, 196269, 194181, 192822, 191623, 190506, 189424, 187847, 185380, 182484, 180012, 178392, 177641, 177637, 177855, 177431, 176100, 174615, 173636, 172822, 171660, 170581, 170320, 170593, 170413, 169513, 168537, 167891, 167251, 166260, 165013, 163766, 162734, 162213, 162408, 163063, 163701, 164204, 164795, 165519, 166116, 166374, 166304, 166068, 166002, 166472, 167371, 167970, 167705, 166943, 166603, 167192, 168533, 170236, 172000, 173556, 174711, 175451, 175849, 176073, 176540, 177708, 179421, 180855, 181418, 181436, 181660, 182439, 183614, 184872, 185878, 186407, 186616, 186900, 187352, 187753, 188171, 188970, 190056, 190785, 190918, 190945, 191159, 191188, 190882, 190822, 191328, 191739, 191378, 190626, 190301, 190492, 190672, 190474, 189793, 188707, 187824, 188005, 189121, 189791, 189118, 187932, 187519, 187838, 187914, 187340, 186389, 185196, 183884, 183086, 183335, 184309, 185407, 186596, 187889]
56417A87889Q03m8j76M71P25L79P41K275L551L443K678K188J610N95o1J88M34
56400B07685q4o14l12J49j53p87r27q75j186j290l81J050J895J943J634J001N9
56383B08807n13j73O37J244J596J623Q06o67j445p36M82J062J369K211L144L277
56367B22724K836K584K421J860J178R31J042J307K005K863K529M14j823k137p25
56352B40009N42O82K26m4K76J337K581K751J424n4k75M29R42J198J715K181J984
56335B57904J505J521J847J855J703J816J849J436J230J908K818K948K453J940
56321B84733J134k40j130m82P92R02k50j250j406j167p60p5M18J78j85L43J543
56304B83098K411K769L100L285K947K571K764K967K334J327Q78P15J86kJ133K653
$$ y = [187889, 188692, 188644, 188468, 188939, 189664, 190043, 190784, 193059, 196610, 200053, 202731, 204919, 206529, 207124, 207063, 207251, 207685, 207601, 206987, 206675, 206824, 206671, 205884, 204957, 204082, 202896, 201606, 201225, 202275, 204170, 206113, 207747, 208748, 208807, 208294, 208121, 208758, 210002, 211598, 213221, 214027, 213360, 211915, 211179, 211661, 212723, 214092, 216303, 219447, 222724, 225560, 228144, 230565, 232425, 233603, 234534, 235576, 236883, 238888, 241751, 244280, 244694, 242871, 240734, 240009, 240551, 241233, 241459, 241415, 241691, 243028, 245609, 248360, 249784, 249730, 249455, 249884, 250826, 252024, 253739, 255920, 257904, 259409, 260930, 262777, 264632, 266335, 268151, 270000, 271436, 272666, 274574, 277392, 280340, 282793, 284733, 285867, 285627, 284497, 284015, 284807, 285709, 285459, 284209, 282803, 281636, 280876, 280801, 281219, 281397, 281212, 281555, 283098, 285509, 288278, 291378, 294663, 297610, 300181, 302945, 305912, 308246, 309573, 310451, 311166, 311352, 311350, 312483, 315136]
56288C15136K778J752J432K170K448J680J169J831K933L641M073M262L766K873
56274C51944K882M397O418P500P074N486L768L239M329N907O691O989P897R354
56260D33875J0387J0903J1669J2769J3690J4693J6536J8954K0929K2400K4192
56249F10997K6498K8869L1500L4920L8585M1394M3356M5141M6307M5833M4110
56238A037510M2416M0566L7111L1892K6229K0433J3347M840l337r887j5358k0478
56226A205284k4831k7957l0346l2525l4287l5373l5900l5772l4683l2954l1336
56215H49320k9936k8327k6579k5044k3373k1052j8656j7099j6079j4674j3144
56204F15357j2349j1812j0303q148o910o829o550n440m257l472k826k568l195
$$ y = [315136, 317914, 319666, 321098, 323268, 325716, 327396, 328565, 330396, 333329, 336970, 341043, 345305, 349071, 351944, 354826, 359223, 365641, 373141, 380215, 385701, 389469, 392708, 397037, 402944, 409635, 416624, 424521, 433875, 444262, 455165, 466834, 479603, 493293, 507986, 524522, 543476, 564405, 586805, 610997, 637495, 666364, 697864, 732784, 771369, 812763, 856119, 901260, 947567, 993400, 1037510, 1079926, 1120492, 1157603, 1189495, 1215724, 1236157, 1249504, 1254344, 1251007, 1241120, 1225762, 1205284, 1180453, 1152496, 1122150, 1089625, 1055338, 1019965, 984065, 948293, 913610, 880656, 849320, 819384, 791057, 764478, 739434, 716061, 695009, 676353, 659254, 643175, 628501, 615357, 603008, 591196, 580893, 572745, 565835, 559006, 552456, 547016, 542759, 539287, 536461, 533893, 530698]
56191E30698l867l057q86R81J784K073J942J007J9K03J006Q28J2M74K292L493
56175E39002L543M112N686O393N369M485N308O697O977O469O379O843P467Q384
56161F23114R595J0529J1051J1772J2875J3990J5288J7125J8628J8679J8398K0266
56149H01310K4626K9402L3636L8698M5573N3632O2770P4020Q7112J00066J12020
56138A462865J23588J33270J36504J30123J15706R7317P8427O2274N2371N0002
56128B442447N2489N5272N4453M7047L1615J0422j0936k7533l7728m1949m1948
56117B533651m2082m7996o1706p9810r7635j12832j23785j27855j23785j13853
56107A602312j01493q8288p4731o1901n0584m0362l1093k3712j8471j4189j0268
$$ y = [530698, 526831, 523774, 522888, 523869, 525653, 527726, 529668, 530675, 530694, 530897, 531903, 532731, 532743, 533217, 535509, 539002, 542545, 546657, 552343, 558736, 564105, 568590, 573898, 580595, 587572, 594041, 600420, 607263, 614730, 623114, 632709, 643238, 654289, 666061, 678936, 692926, 708214, 725339, 743967, 762646, 781044, 801310, 825936, 855338, 888974, 927672, 973245, 1026877, 1089647, 1163667, 1250779, 1350845, 1462865, 1586453, 1719723, 1856227, 1986350, 2102056, 2199373, 2277800, 2340074, 2392445, 2442447, 2494936, 2550208, 2604661, 2651708, 2683323, 2693745, 2682809, 2655276, 2617548, 2575599, 2533651, 2491569, 2443573, 2381867, 2302057, 2204422, 2091590, 1967805, 1839950, 1716165, 1602312, 1500819, 1412531, 1337800, 1275899, 1225315, 1184953, 1153860, 1130148, 1111677, 1097488, 1087220]
56096A087220p513o026m407k102k37P57J984L676M596M716N651P430P887O509
56082A110141N661O599P538P262P263Q432R034Q082P483Q582R720R544R663J1568
56068A226572J3869J5058J6130J8012J9262J8826J8325J9175K0168K0224K0635
56057A426256K2301K3720K4073K5139K7680K9203K7953K5970K5422K5242K4119
56046A707078K3539K4805K6215K6240K6324K7695K8676K8078K7864K9445L0787
56035B006746L0338L0162L2009L4017L4644L5985L9611M3031M4062M4774M7327
56024B422706M9826N0400N1311N4780N8675O0602O2351O5941O9370P0779P2606
56013C089347P7056Q1720Q4391Q7696R3996J00363J03868J07145J13183J19410
$$ y = [1087220, 1079707, 1073681, 1069274, 1067172, 1066935, 1067692, 1069676, 1073352, 1077948, 1082664, 1088315, 1095745, 1103632, 1110141, 1115802, 1122401, 1129939, 1137201, 1144464, 1152896, 1161930, 1170012, 1177495, 1186077, 1195797, 1205341, 1215004, 1226572, 1240441, 1255499, 1271629, 1289641, 1308903, 1327729, 1346054, 1365229, 1385397, 1405621, 1426256, 1448557, 1472277, 1496350, 1521489, 1549169, 1578372, 1606325, 1632295, 1657717, 1682959, 1707078, 1730617, 1755422, 1781637, 1807877, 1834201, 1861896, 1890572, 1918650, 1946514, 1975959, 2006746, 2037084, 2067246, 2099255, 2133272, 2167916, 2203901, 2243512, 2286543, 2330605, 2375379, 2422706, 2472532, 2522932, 2574243, 2629023, 2687698, 2748300, 2810651, 2876592, 2945962, 3016741, 3089347, 3166403, 3248123, 3332514, 3420210, 3514206, 3614569, 3718437, 3825582, 3938765, 4058175]
56003D058175J22762J25869J32139J39442J44877J50974J60711J71273J79366
55994E385588J87815K00163K13813K25484K38101K55106K73504K90065L08551
55985G578190L32900L59372L83823M10323M43906M81419N18764N60157O10440
55976A1679294O65750P22151P85693Q62989R50392J044413J153702J287791J443815
55967B0595990J618607J823735K073156K367114K705536L105906L589436M162197
55959D2041677M830558N621955O568521P686454Q997592J0554666J2418732J4636038
55951A13356193J7272541K0441652K4241474K8650665L3426838L7886103M0573033
55944C15848499L9319699L2227737J9173000K496433j3991260k6972806l4961343
$$ y = [4058175, 4180937, 4306806, 4438945, 4578387, 4723264, 4874238, 5034949, 5206222, 5385588, 5573403, 5773566, 5987379, 6212863, 6450964, 6706070, 6979574, 7269639, 7578190, 7911090, 8270462, 8654285, 9064608, 9508514, 9989933, 10508697, 11068854, 11679294, 12345044, 13067195, 13852888, 14715877, 15666269, 16710682, 17864384, 19152175, 20595990, 22214597, 24038332, 26111488, 28478602, 31184138, 34290044, 37879480, 42041677, 46872235, 52494190, 59062711, 66749165, 75746757, 86301423, 98720155, 113356193, 130628734, 151070386, 175311860, 203962525, 237389363, 275275466, 315848499, 355168198, 387395935, 406568935, 409065368, 395074108, 368101302, 333139959]
55937C33139959l8232772l7942052l5370358l1609701k7467385k3437772j9764265
55930A19315654j6553529j3837265j1580470r711063q167690o906086n874921
55923D6684630n019197m304714l714651l225989k810734k455327k157769j908572
55915B1087677j692135j502964j343305j207846j085928r75739q81841q01666
55907A1596253p27730o60104o03787n56551n11453m68750m33663m04875l76346
55898F852994l48186l25077l05988k85701k64686k47661k34000k18901k02523
55889D420271j89115j78549j67135j55425j46856j40098j30853j19974j12031
55880C080235j06850j00210r1876q5553q1647p7390p3384p2944p5282p5968p3895
$$ y = [333139959, 294907187, 256965135, 221594777, 189985076, 162517691, 139079919, 119315654, 102762125, 88924860, 77344390, 67633327, 59465637, 52559551, 46684630, 41665433, 37360719, 33646068, 30420079, 27609345, 25154018, 22996249, 21087677, 19395542, 17892578, 16549273, 15341427, 14255499, 13279760, 12397919, 11596253, 10868523, 10208419, 9604632, 9048081, 8536628, 8067878, 7634215, 7229340, 6852994, 6504808, 6179731, 5873743, 5588042, 5323356, 5075695, 4841695, 4622794, 4420271, 4231156, 4052607, 3885472, 3730047, 3583191, 3443093, 3312240, 3192266, 3080235, 2973385, 2873175, 2781299, 2695746, 2614099, 2536709, 2463325, 2390381, 2315099, 2239131, 2165236]
55869B165236p1617o9374o5020n9428n5792n3794n0296m5583m3158m3473m3409
55858A564292m1922m0889m0358l8217l4748l2668l2435l1945l0842l0748l1413
55847A178107l0966k9737k9647l0236k9404k7533k6617k6050k3662k0312j8821
55836H85122j8834j7357j4162j2006j1557j0733r209r023j0312j0692r446q387
55824G43404q136p394o330o907r271j1331j2374j3682j5231j5309j3825j2681
55812F10933j2373j1496r924r239r527r020p311n904n130l670j563o56j387j947
55798E21786j194J12J384K829L769K999J172M70J610L452N383P583Q985P754L930
55783E72024q25n847j1316j5938j7768j7274j6644j6180j4257j0754p416m839
$$ y = [2165236, 2093619, 2024245, 1959225, 1899797, 1844005, 1790211, 1739915, 1694332, 1651174, 1607701, 1564292, 1522370, 1481481, 1441123, 1402906, 1368158, 1335490, 1303055, 1271110, 1240268, 1209520, 1178107, 1147141, 1117404, 1087757, 1057521, 1028117, 1000584, 973967, 947917, 924255, 903943, 885122, 866288, 848931, 834769, 822763, 811206, 800473, 791264, 782241, 771929, 761237, 751791, 743404, 735268, 727874, 721544, 714637, 705366, 694035, 681661, 667979, 652748, 637439, 623614, 610933, 598560, 587064, 577140, 567901, 558374, 549354, 542043, 536139, 531009, 527339, 525776, 525120, 523733, 521786, 520592, 520704, 522088, 524917, 528686, 531685, 532857, 533327, 534937, 538389, 543772, 551355, 560340, 568094, 572024, 571199, 565352, 554036, 538098, 520330, 503056, 486412, 470232, 455975, 445221, 437805, 432966]
55771D32966k230l47j319n080q901j1010j1853j1610r531o276l949l031k027n09
55757C55293K30k3P9O19J2j977l698m698o380q841j0098r404q452q223p535n803
55741B81101m466m302m027k916k324l160m153m077l547l263k576j122L3J58l4
55726B41325j35j013k973m774n507n771o020n638m461l438k918k084p44K59J004
55711A97112K666M916N554L773J587Q73J127J266J431J660R66r27k718l725m944
55696B10617o744p650o815n612n265m874l487k098j849j999j547j149j535j601
55682A58392j75J737K413J994J764J868J638J250J248J199L96p44j398j683j994
55667A67905j910j041j39Rj17J78L57l24j207j121k11M79O20N49K61k79l95M57
$$ y = [432966, 430736, 430389, 429070, 423990, 415089, 404079, 392226, 380616, 371085, 364809, 360860, 357829, 355802, 355293, 355523, 355500, 355579, 356198, 356210, 354233, 350535, 345837, 339457, 330616, 320518, 311114, 302662, 294439, 286904, 281101, 276635, 272333, 268306, 265390, 263066, 259906, 255753, 251676, 248129, 244866, 242290, 241168, 241201, 241359, 241325, 241190, 240177, 237204, 232430, 226923, 221152, 215132, 209494, 205033, 201595, 198677, 196593, 195849, 196108, 197112, 199778, 204694, 210248, 214021, 215608, 216481, 217608, 218874, 220305, 221965, 222931, 222004, 219286, 215561, 210617, 203873, 196223, 189408, 183796, 178531, 173657, 170170, 168072, 166223, 164224, 162677, 161528, 159993, 158392, 158217, 159954, 162367, 164361, 166125, 167993, 169631, 170881, 172129, 173328, 173724, 172980, 171582, 169899, 167905, 165995, 164954, 164815, 164824, 164707, 164885, 165242, 164918, 163711, 162590, 162379, 162858, 163478, 164027, 164288, 164009, 163614, 164071]
55649A64071J640K179K128K101K031J465N95j4k91m04k78j18p03k271l816m370
55633A63945m280m360m592m539m367m378m248l614k835k290j670p72k91q87k068
55618A18754k851k947k546j709p50m06q18j091p10m81j179k204k610k606k872
55603I2974l128k610j392j51Q53J583J619P51k78o75o16o07m20K49P75M46k11
55586H9162j12P34J409J657K099K981L760M027M103M572N735P496R438J1064J2105
55571A60230J2310J1042P847L564j36k587m607o780q453r033r059r106q753p634
55557A28845o491o099o002n428m666m367m225l549k526j810j335p11k60n33j180
55542G9663j337q81l70p8R5J39J08L67R23J107N76P1L29R73J275J318J463J441
$$ y = [164071, 165711, 167890, 170018, 172119, 174150, 175615, 176210, 176196, 175905, 175501, 175223, 175105, 174402, 172131, 168315, 163945, 159665, 155305, 150713, 146174, 141807, 137429, 133181, 129567, 126732, 124442, 122772, 122000, 121709, 120822, 118754, 115903, 112956, 110410, 108701, 107951, 107545, 106727, 105636, 104926, 104445, 103266, 101062, 98452, 95846, 92974, 89846, 87236, 85844, 85693, 86546, 88129, 89748, 90499, 90221, 89546, 88930, 88323, 87903, 88152, 88927, 89373, 89162, 89050, 89784, 91193, 92850, 94949, 97930, 101690, 105717, 109820, 114392, 120127, 127623, 137061, 148125, 160230, 172540, 183582, 191429, 194993, 194857, 192270, 187663, 180883, 172430, 163397, 154338, 145232, 136479, 128845, 122354, 116255, 110253, 104825, 100159, 95792, 91567, 88018, 85492, 83682, 82347, 81636, 81376, 80843, 79663, 78326, 77445, 77075, 76997, 77092, 77231, 77339, 77706, 78629, 79736, 80312, 80383, 80712, 81685, 82960, 84278, 85741, 87182]
55524H7182R72N70P17Q78M11k12k18Q8rk54J1M91M74K81O86J302J010k02j280
55505I2898j861k581l590m146l859l246k753k248j686j423j591j891k085k155
55491E7783j993j533j019o76l54Jl3o19j092r34o94j003j311p12N15J384J823
55474D9533K447L057K757J516L55j13j67ON76J261J309N61l84j127j708j908j328
55457E6643k77L88M28M62Q74J330J416J020Q4j251k230k064r48J87Q43J130R87
55440E9022J82r27j582j584j286p67M8O19K06r23j660j520j022n93p5O13J198
55423D9949J526J573J027j83j140p81N79J603J714J395P66o09k358l189k638j709
55407D7525j219p24L09J401J899J991K063J871J039j30r74j172p24J63Q99R21
$$ y = [87182, 88154, 88724, 89441, 90319, 90730, 90518, 90300, 90388, 90379, 90125, 90136, 90627, 91101, 91382, 92068, 93370, 94380, 94178, 92898, 91037, 88456, 84866, 80720, 76861, 73615, 70862, 68614, 66928, 65505, 63914, 62023, 59938, 57783, 55790, 54257, 53238, 52562, 52208, 52209, 52176, 51557, 50465, 49531, 48837, 47834, 46523, 45811, 46326, 47710, 49533, 51980, 55037, 57794, 59310, 59665, 59552, 59385, 59391, 59967, 61228, 62537, 63098, 62714, 61587, 59879, 57971, 56643, 56366, 56754, 57182, 57644, 58518, 59848, 61264, 62284, 62368, 61117, 58887, 56823, 55875, 56062, 56905, 58035, 59022, 59204, 58277, 56695, 55111, 53825, 53058, 53106, 53725, 53931, 53008, 51348, 49828, 48806, 48213, 48138, 48751, 49949, 51475, 53048, 54075, 53892, 52752, 51971, 52550, 54153, 55867, 57262, 58028, 57419, 55061, 51872, 49234, 47525, 46306, 45582, 45891, 47292, 49191, 51182, 53245, 55116, 56155, 56025, 55051, 53879, 53155, 53318, 54217, 55138]
55391E5138N60P77J687K198J611O57L71O55P08K97j44k88j47K02N79O42K14m70
55373F5247j019j140o48L02R87P21j98p83o87n27p94j254j642k020k096j208M61
55356E3702J594J338M55J06K78K14j83l45r9K01L80N27N25Q2p18j400j616j375
55338E3666r02n55n75o97l39N37J147R20L17J26L57M62K89J55J25l0k47j54K78
55319E4880O46P42P92R19Q42L71j62k49J09M00K30j94l39j0M41O15N76N93N76
55300F1778J47o54j191r62k44K64K80Q8K0R0J75K49K88J20l86r09q18J11J195
55281E9641J443O62l21o64l46R9L44M48N72P85R43O43l11j241j044K98J273P04
55263F3928n62p55L43J163O41m78r32o54m84q18j211j061k64P16J152N95o54j684
$$ y = [55138, 55698, 56475, 58162, 60360, 61971, 62628, 62999, 63654, 64362, 64659, 64515, 64227, 64080, 64282, 64861, 65503, 65717, 65247, 64228, 63088, 62440, 62742, 63729, 64450, 64252, 63469, 62782, 62255, 61461, 60207, 58565, 56545, 54449, 53241, 53702, 55296, 56634, 57089, 57195, 57473, 57687, 57504, 57159, 57060, 57261, 57641, 58168, 58693, 58775, 58057, 56657, 55041, 53666, 52764, 52209, 51634, 50937, 50598, 51135, 52282, 53202, 53519, 53645, 54002, 54464, 54753, 54908, 55033, 55003, 54756, 54602, 54880, 55526, 56268, 57060, 57979, 58821, 59192, 59030, 58781, 58890, 59290, 59520, 59326, 58987, 58977, 59418, 60033, 60609, 61202, 61778, 61925, 61271, 60080, 59118, 58874, 59138, 59418, 59506, 59526, 59616, 59791, 60040, 60328, 60448, 60062, 59153, 58335, 58446, 59641, 61084, 61746, 61425, 60761, 60415, 60514, 60858, 61306, 61878, 62663, 63606, 64249, 63938, 62697, 61653, 61951, 63224, 63928, 63366, 62611, 62954, 64117, 64758, 64280, 63348, 62694, 62210, 61392, 60181, 59120, 58856, 59572, 60724, 61319, 60665, 58981]
55245E8981j765r11K38R72R79M98L4j04R9O52J498K099J664K53r23r19k71m9k32
55226F2793k9N70O90M6o10o87m26j33K77O72N29k11p99o97k61j1J09L22M66L63
55206F2973K33K69K77J68K81P01P48j92j603k206j417L1Q91O28k27p70o87l90
55188E9708k20J18R29J703J584N34n71j031q76l44M20R98Q27k3p42p87m46k09
55170F1572o0K05N42Q10R78R37N06j77o49p29o11l21L63J214J478Q70J04K0O01
55151F7653J171J278R59M56m2m70q65j142j077p62p65j288j517o11Q27J318N12
55134F5635l93m50m6J72L93R75J560J583J067M17r9k80%L83K12n05j034j034q94
55115F7662p09n5Q16P47n08j418o84Q08J293O34J79N59J049J022Q38J018J454
$$ y = [58981, 57216, 56305, 56543, 57515, 58494, 58992, 59026, 58922, 59021, 59673, 61171, 63270, 64934, 65187, 64264, 63345, 63074, 63025, 62793, 62764, 63334, 64024, 64070, 63460, 62773, 62347, 62214, 62491, 63163, 63692, 63481, 62682, 61985, 61724, 61713, 61822, 62144, 62610, 62973, 63206, 63475, 63752, 63920, 64201, 64902, 65650, 65458, 63855, 61649, 60232, 60263, 61154, 61782, 61555, 60785, 60098, 59708, 59488, 59606, 60535, 62238, 63822, 64356, 63785, 62754, 61878, 61534, 61954, 62952, 63779, 63756, 63014, 62227, 61781, 61572, 61512, 61717, 62259, 63069, 64047, 64984, 65490, 65313, 64664, 63935, 63324, 63003, 63366, 64580, 66058, 66928, 67032, 67052, 67653, 68824, 70102, 71061, 71517, 71475, 71005, 70140, 68998, 67921, 67159, 66394, 65106, 63589, 62978, 63805, 65123, 65635, 65242, 64792, 64746, 64918, 65311, 66286, 67846, 69429, 70496, 70913, 70814, 70534, 70534, 70917, 71129, 70624, 69590, 68556, 67662, 66953, 66898, 67714, 68461, 67953, 66535, 65851, 66659, 67952, 68586, 68765, 69324, 70373, 71395, 72233, 73251, 74705]
55098G4705J625J169J50q40j011k43N85N93n1n18l96Q0N09N46o5j104j869j921
55080G1944j497q69L6R72J093Q4j106j482j210q96m37L24N58m37j620j249N46
55063F4754J799J431N05M04J077J644J667J169K25q27j356j146o37j23O06J489
55047G2681J791J001l35j274j530j380r73l35J86K14j7J34P54J127O47l23q88
55030G1480o74j03M00R60J699K072J412P0p16l04N48P21O4p06j027r00o03m51
55012G3942o76j137j320r84n26l44j90L57J087J406J208R25Q28Q23Q56J018J197
54995G8470J131Q72Q24J196J732J950J582P80N0j86r7k55p77j051o30O3L27J90
54977H6171K08N03O20L21j5O8N16Q68Q31O37P18R58O34n48j684j633o63j53o12
$$ y = [74705, 76330, 77499, 77649, 76809, 75798, 75555, 76140, 76733, 76682, 76164, 75768, 75848, 76357, 76903, 76838, 75734, 73865, 71944, 70447, 69578, 69614, 70586, 71679, 71763, 70657, 69175, 67965, 67069, 66632, 66956, 67514, 67077, 65457, 64208, 64754, 66553, 67984, 68489, 68893, 69970, 71614, 73281, 74450, 74675, 73848, 72492, 71346, 70709, 70586, 71192, 72681, 74472, 75473, 75138, 73864, 72334, 70954, 69981, 69646, 69832, 70046, 70029, 70163, 70917, 72044, 72691, 72368, 71480, 70806, 70703, 71103, 72063, 73762, 75834, 77246, 77316, 76600, 76296, 76844, 77565, 77629, 76923, 75896, 74996, 74393, 73942, 73266, 72129, 70809, 69825, 69299, 68955, 68765, 69122, 70209, 71615, 72823, 73748, 74576, 75399, 76255, 77273, 78470, 79601, 80473, 81297, 82493, 84225, 86175, 87757, 88537, 88587, 88401, 88304, 88049, 87272, 86221, 85591, 85654, 85981, 86171, 86379, 86882, 87502, 87823, 87808, 87876, 88392, 89260, 90091, 90728, 91446, 92404, 93038, 92490, 90806, 89173, 88510, 88357, 87745]
54958H7745j057p27j89j43k13J52M91J92k57rO85Q70L90j02k58j60L01J098J470
54939I0279P95k73n64q9J47k35p03r25r41m72O46J488R74k43l15J164K588K741
54921I6062K282K265K610K892L410M538N824O659P085P260O791N406L660K217
54907A58961R65n60k312l904n201o182o637o472o003n543n045m393l699l023k261
54892I8691j488r38m61L11J126J156K17q04j161j088r47l97Q64K165K599K259
54876A02104K082K605L519M275M619M716N020N858O839P087O225M689K852N23
54862A63013k191m272m832m303l905m206m850n453n932o077n544m459l520l243
54848A00226l378l238k466j412p40o93q14n19J39O03N20Kp24j384j489p74J90
$$ y = [87745, 86688, 85961, 85772, 85629, 85416, 85568, 86059, 86251, 85994, 85985, 86670, 87540, 87930, 87828, 87570, 87410, 87711, 88809, 90279, 91074, 90801, 90237, 90148, 90295, 90060, 89357, 88432, 87491, 87019, 87665, 89153, 90127, 89884, 89569, 90733, 93321, 96062, 98344, 100609, 103219, 106111, 109521, 114059, 119883, 126542, 133627, 140887, 147678, 153084, 156744, 158961, 159926, 159366, 157054, 153150, 147949, 141767, 135130, 128658, 122655, 117112, 112067, 107674, 103975, 100952, 98691, 97203, 96265, 95804, 96115, 97241, 98397, 98614, 97810, 96649, 95561, 94614, 94217, 95081, 97246, 99845, 102104, 104186, 106791, 110310, 114585, 119204, 123920, 128940, 134798, 141637, 148724, 154949, 159638, 162490, 163013, 160822, 156550, 151718, 147415, 143510, 139304, 134454, 129001, 123069, 116992, 111448, 106989, 103469, 100226, 96848, 93610, 91144, 89732, 88992, 88299, 87485, 86966, 87105, 87708, 88228, 88230, 87506, 86122, 84633, 83859, 84049]
54831H4049M94J42P9Q00J737K196K102J478J88j301j859j117j56j9k55Q3P61P98
54813I0200Q8n67q13r80j060n54M90J249J181N96Jm29n74k59K60L70j14o73r10
54794H7502j048j311j347q10o0L09L95Q18J601J939J292K60j77J02M04M24O23
54777I0916J258J717J375O30L78P85J289J596J925K311K513K668L249M129M535
54762A21274M253M077M689N702O285O110N294M038K786K050J529O7k788n785p282
54747A52299p113o362n730n051m166l368k927k801k836k786k248j169j95J0k84
54732A05273k26M53J180J383J021L23m06p19l47M18J025J383J865K687L719M835
54716A23867N966O822P062O715O075N118L459R98j719l829m767m707m517n051
$$ y = [84049, 84543, 84685, 84764, 85564, 87301, 89497, 91599, 93077, 93265, 91964, 90105, 88988, 88832, 88813, 88558, 88641, 89402, 90200, 90288, 89721, 88908, 87928, 86868, 86314, 86804, 88053, 89234, 89830, 89831, 89402, 88828, 88569, 88829, 89199, 89085, 88412, 87502, 86454, 85143, 83796, 82986, 82926, 83235, 83630, 84448, 86049, 87988, 89280, 89540, 89363, 89465, 89869, 90293, 90916, 92174, 93891, 95266, 95896, 96274, 97059, 98348, 99944, 101869, 104180, 106693, 109361, 112610, 116739, 121274, 125527, 129604, 134293, 139995, 146280, 152390, 157684, 161722, 164508, 166558, 168087, 168154, 165366, 159581, 152299, 145186, 138824, 133094, 128043, 123877, 120509, 117582, 114781, 111945, 109159, 106911, 105742, 105547, 105557, 105273, 105047, 105500, 106680, 108063, 109084, 109407, 109001, 108282, 107935, 108353, 109378, 110761, 112626, 115313, 119032, 123867, 129833, 136655, 143717, 150432, 156507, 161625, 165084, 166082, 164363, 160534, 155767, 151060, 146543, 141492]
54702A41492o142o622n715m042k840k525k593k615k552k306j653p49m6L01M66
54687A01859M24j5p00j189j391j537j588j236n97k44l59m19RO31Q56N02j36o31
54669I4239p23m92l42n62q75q21m56k73m09m61j88R0N4q5J09O73J218J372J069
54650I3137N88L37N42J043J428J281M16q85j817j665p53k29n56q23o0J285K033
54633I5302J966J796J759J348M80j94l50l66m20j47L89M43k29p90o22l43p84j602
54615I7636j784j094j76M65Q02Q47O32N24Q20J084O19m19j069q78m96o37j007
54598I5869p84J05P90N97o7k45L81J152J302P67Jo27r33p13L3P93J030R25J108
54579A01484J584J619Q42j53o25n33k05K72Q33J059O57K6k17j06j57n44r60j165
$$ y = [141492, 135350, 128728, 123013, 118971, 116131, 113606, 111013, 108398, 105846, 103540, 101887, 101138, 101092, 101393, 101859, 102283, 102268, 101568, 100379, 98988, 97451, 95863, 94627, 94030, 93786, 93427, 93008, 93017, 93648, 94504, 95006, 94870, 94239, 93516, 93024, 92682, 92120, 91245, 90424, 89968, 89695, 89286, 88825, 88637, 88727, 88781, 88696, 88805, 89478, 90696, 92068, 93137, 93725, 94062, 94604, 95647, 97075, 98356, 98772, 97887, 96070, 94405, 93652, 93423, 92867, 92044, 91984, 93269, 95302, 97268, 99064, 100823, 102171, 102651, 102457, 102107, 101741, 101321, 101174, 101563, 102006, 101777, 100987, 100365, 100022, 99238, 97636, 95852, 94758, 94582, 95047, 95849, 96696, 97328, 97852, 98672, 99756, 100375, 99956, 98887, 98009, 97513, 96876, 95869, 95085, 95190, 95980, 96577, 96510, 96265, 96646, 97798, 99100, 99867, 99868, 99241, 98308, 97595, 97628, 98421, 99451, 100376, 101484, 103068, 104687, 105529, 105376, 104751, 104218, 104013, 104285, 105118, 106177, 106834, 106860, 106643, 106537, 106380, 105836, 104876, 103711]
54561A03711j158q65k53L26L87M1j42J6J00q1l5O65J612J978J399K66p11r30j58
54542A06168J164K056J874J066O57R99J414J214O22L71O31P96L01o80j437j462
54526A15754r37n02o12j048j155o35J23O39J001J534J976J598K25j319k049j758
54510A12835q61J78R75J124N42k38n94n32n12p12q52o91l12J48O37J020J113R55
54492A14223P23M23q3o76r48o56J2O67J027R96O95M59N33P86R46J064J422K044
54474A23657K560K640K294J695J017M49R6j46l73l45K30J143J786J840J504J013
54458A41060L49m58j132j445j404j026l13M03N02k62j343j878j515o46jol84m25
54440A30076J55P71P06Q6l91m82n03m82j20K71k36j753k967k627j064M26J176
$$ y = [103711, 102553, 101688, 101435, 101761, 102148, 102189, 102047, 102063, 102163, 102082, 102047, 102712, 104324, 106302, 107701, 107967, 107256, 106326, 106168, 107332, 109388, 111262, 112328, 112985, 113984, 115398, 116612, 117234, 117605, 118236, 119032, 119333, 118653, 117216, 115754, 114817, 114315, 113703, 112655, 111500, 110865, 110988, 111627, 112628, 114162, 116138, 117736, 117961, 116642, 114593, 112835, 111974, 112152, 113127, 114251, 114793, 114555, 113961, 113429, 112917, 112205, 111353, 110662, 110350, 110498, 111135, 112155, 113268, 114223, 114946, 115369, 115286, 114610, 113662, 113006, 113018, 113685, 114712, 115708, 116403, 116862, 117395, 118181, 119127, 120191, 121613, 123657, 126217, 128857, 131151, 132846, 133863, 134312, 134408, 134262, 133889, 133544, 133774, 134917, 136703, 138543, 140047, 141060, 141409, 140951, 139819, 138374, 136970, 135944, 135631, 136034, 136536, 136274, 134931, 133053, 131538, 130892, 130891, 130885, 130501, 130076, 130231, 131002, 131708, 131794, 131403, 130921, 130418, 129936, 129816, 130087, 129851, 128098, 125131, 122504, 121440, 121866, 123042]
54423A23042J313Q61k30j280j143L18J781J922Q66j53l08J64N60N87M36L21K14
54406A29271J04J79N12P42M27l03p74n55J22P92J300J699J919J795J292N85jj16
54388A38990J89K70m42j532j905j177j41L71M32M37L10p5k88M1L79K2o92p97k57
54369A34135q8p57j392r58L66J484J575P18l54p61j17J019J543R27k73j174j545
54352A34348j743j974j979j500p51l03m91j003j112m73M55R07O43K6n84j150j628
54335A21688j692j106j49N68P19N84P27J408K285K748K600K230K010J758J078
54320A37456N6p55j047j101j296j562j495r04j14K49j59r60j373j114p19p16q34
54303A23612n05J10L19M8l2K90K85n52j531j689j129p42q04p05p4N66N53Nl58
$$ y = [123042, 124355, 125216, 124986, 123706, 122563, 122881, 124662, 126584, 127450, 127297, 126989, 127153, 127713, 128300, 128736, 129057, 129271, 129375, 129554, 130066, 130808, 131235, 130932, 130158, 129603, 129725, 130517, 131817, 133516, 135435, 137230, 138522, 139107, 139106, 138990, 139179, 139449, 139007, 137475, 135570, 134393, 134252, 134623, 135055, 135492, 135802, 135727, 135439, 135480, 135859, 135881, 135189, 134392, 134135, 134047, 133290, 131898, 130940, 131306, 132790, 134365, 135083, 134729, 133968, 133851, 134870, 136413, 137340, 137067, 135893, 134348, 132605, 130631, 128652, 127152, 126401, 126098, 125607, 124604, 123492, 123019, 123474, 124381, 125024, 125050, 124466, 123316, 121688, 119996, 118890, 118741, 119309, 120028, 120612, 121339, 122747, 125032, 127780, 130380, 132610, 134620, 136378, 137456, 137512, 136757, 135710, 134609, 133313, 131751, 130256, 129352, 129238, 129487, 129328, 128368, 126995, 125881, 125162, 124446, 123612, 123107, 123217, 123536, 123584, 123552, 123842, 124127, 123575, 122044, 120355, 119226, 118484, 117680, 116975, 116901, 117467, 118020, 118025, 117667]
54284A17667n1P33J415J522J012K40l57n94n83n65o47o84l84L17R93J056N03N7
54266A21650L43J107J592J473J051O81M14K49K69M30N16M75M86N95N76K67j87
54249A31987n81q32q55n16J3K25j38p17j011r50p63n42l41m12q60j200q26O1N40
54230A22282J09o88r68m64L76R94J130Q93N88M76N75P35P94N81l1p86r69k16P86
54211A26197R35J32o45q18q96j412j858j449l67M74O24M08K83M55R36J399J219
54194A25617K80n30l04N76Q87K07p18j219j351j231p12j14k42j182j824j306k86
54177A16548K5m26p25n17m06q16j277j130l53N11R03N69l08j092j153n28O9Q9
54159A09983k50k97J99Q79J258J218R52O81N19N02N54M59J14k33k17K9p7p34j249
$$ y = [117667, 117616, 118349, 119764, 121286, 122298, 122538, 122181, 121587, 121004, 120439, 119792, 119108, 118724, 119041, 120034, 121090, 121593, 121650, 121993, 123100, 124692, 126165, 127216, 127897, 128311, 128560, 128829, 129259, 129775, 130250, 130736, 131331, 131907, 132174, 131987, 131406, 130574, 129719, 129203, 129216, 129441, 129303, 128586, 127575, 126625, 125862, 125320, 124979, 124567, 123707, 122507, 121681, 121742, 122282, 122391, 121703, 120735, 120271, 120647, 121641, 122771, 123664, 124252, 124728, 125303, 126038, 126832, 127413, 127382, 126596, 125627, 125411, 126197, 127132, 127264, 126619, 125801, 124905, 123493, 121635, 120186, 119819, 120293, 120917, 121325, 121608, 122063, 122999, 124398, 125617, 125897, 125367, 125063, 125639, 126526, 126733, 126015, 124796, 123445, 122214, 121502, 121388, 121146, 119964, 118140, 116834, 116548, 116573, 116147, 115422, 114905, 114499, 113683, 112406, 111276, 110923, 111434, 112337, 112906, 112598, 111506, 110353, 109825, 109894, 109983, 109733, 109436, 109635, 110514, 111772, 112990, 113942, 114623, 115142, 115644, 116198, 116657, 116771, 116538, 116321, 116350, 116273, 115539, 114290]
54140A14290q49K87J262J607J600J487J089L29l91o88o62n38k75J44M06K45j04
54123A19239k13mK86N15O70O55L78q0n04p04m89J97J025J390J041L45k68p06r28
54104A21845p02m2N12N05J80K3rk54o09o68m43m06p23r86p86j84M54Q00P07L86
54084A19600L30P79J277J166M48k13l67k05r2p0j2Q0R3kr8L0N47J234J458Q03
54064A26786l72j312j671j579j061L2J416K279K057J039j1n55n20j40K14L24L70
54047A27296O76J200J558J651J844K325K644K342J730J569J985K154J320j18r51
54032A49225n39M43Q54M94K19O81J426J516P75n3k78nJ54j49o46p85l77J75M37
54013A53567O64J561L225M817N579N774O186P056P935Q262P497N030Q41l847p273
$$ y = [114290, 113441, 113728, 114990, 116597, 118197, 119684, 120773, 121102, 120711, 120023, 119361, 118823, 118548, 118692, 119098, 119343, 119239, 119026, 119022, 119308, 119823, 120493, 121148, 121526, 121446, 120942, 120238, 119749, 119946, 120971, 122361, 123402, 123747, 123479, 122773, 121845, 121143, 121101, 121613, 122118, 122298, 122321, 122312, 122058, 121449, 120781, 120338, 119932, 119209, 118223, 117437, 117253, 117707, 118507, 119214, 119600, 119930, 120709, 121986, 123152, 123600, 123387, 123020, 122815, 122723, 122653, 122641, 122721, 122814, 122812, 122714, 122744, 123291, 124525, 125983, 126786, 126414, 125102, 123431, 121852, 120791, 120823, 122239, 124518, 126575, 127614, 127603, 127048, 126528, 126388, 126602, 126926, 127296, 127972, 129172, 130730, 132381, 134225, 136550, 139194, 141536, 143266, 144835, 146820, 148974, 150294, 150176, 149225, 148686, 149129, 149983, 150477, 150696, 151377, 152803, 154319, 155094, 155041, 154763, 154758, 154912, 154763, 154117, 153332, 152955, 153130, 153567, 154231, 155792, 159017, 163834, 169413, 175187, 181373, 188429, 196364, 204626, 212123, 217153, 217994, 214147, 206874]
53998B06874q701q747q216p340o238n297m655l898k756j626j052r90j087j264
53984A45007j619j879j572p08J01L42J38m3l9j58o11j060j003n12j35nM07J322
53966A37973J991J645O61N3M7J6l17n34m83n89r40r07j18R14J593K009K423K568
53948A48005K107J310P22N01N16Q24J510K352L021L396L385K926K428K739M028
53933A79770N261N351M428L392K584J730Q18J06n74j659k933l574l263k535j882
53918A87020j223n06j31l82r35j341j605j950k322k463k281j884j473j318j568
53903A65638j884j657q04o7j49p94j159q92l92j39k29n97j240j968k320k008j259
53886A48080m79K37R54J446J327O62K7k05k26l23l54q8L26N24M56L02J03j79l09
$$ y = [206874, 198173, 189426, 181210, 173870, 167632, 162335, 157680, 153782, 151026, 149400, 148348, 147358, 146271, 145007, 143388, 141509, 139937, 139229, 139330, 139672, 139810, 139767, 139728, 139570, 138959, 137899, 136896, 136384, 136249, 136244, 136651, 137973, 139964, 141609, 142270, 142323, 142370, 142386, 142069, 141535, 141052, 140463, 139523, 138616, 138498, 139412, 141005, 143014, 145437, 148005, 150112, 151422, 152144, 152645, 153161, 153985, 155495, 157847, 160868, 164264, 167649, 170575, 173003, 175742, 179770, 185031, 190382, 194810, 198202, 200786, 202516, 203334, 203440, 202866, 201207, 198274, 194700, 191437, 188902, 187020, 185797, 185291, 185160, 184778, 183843, 182502, 180897, 178947, 176625, 174162, 171881, 169997, 168524, 167206, 165638, 163754, 162097, 161293, 161226, 161077, 160283, 159124, 158232, 157840, 157701, 157472, 156875, 155635, 153667, 151347, 149339, 148080, 147601, 147838, 148792, 150238, 151565, 152227, 152254, 152049, 151823, 151500, 151146, 151058, 151384, 151908, 152364, 152666, 152769, 152590, 152281]
53867A52281j1N85J129J592K041K113J474P17R13K030K830K683K559L447M791
53852A81174N458N651O635Q878J1649J4324J6752J8059J6347J0583K195n926j1784
53839B79995j5179j6655j6337j4093j0380o476l670k255j471m84Q52K198L260
53826A99305L759L253J567o55k383l285l887m650n349n552n148m236k915j500
53812A68324o04n83j001j048m16M27Q36O58L02K38M58N59L23L9O6K55J84j62l66
53793A68489k15L9J70L09N63O87M56J56K42O93R21M51n12j298j441j060n59j25
53775A67966K76M67R3p11j135o95m9j64q64j016k34N37M29j55l03J29O60J124
53757A66355J588J664Q15o22j511j246l84K32M58O18P05L76l95j097j196o34J97
$$ y = [152281, 152270, 152855, 153984, 155576, 157617, 159730, 161204, 161921, 162834, 164864, 167694, 170377, 172936, 176383, 181174, 186632, 192283, 198918, 207796, 219445, 233769, 250521, 268580, 284927, 295510, 297705, 291779, 279995, 264816, 248161, 231824, 217731, 207351, 200875, 197205, 194950, 193479, 192995, 193847, 196045, 199305, 203064, 206317, 207884, 207229, 204846, 201561, 197674, 193024, 187675, 182123, 176975, 172739, 169824, 168324, 167720, 167137, 166136, 165088, 164672, 165099, 165935, 166593, 166895, 167133, 167591, 168150, 168473, 168512, 168578, 168833, 169017, 168855, 168489, 168274, 168313, 168483, 168792, 169355, 170042, 170498, 170654, 170896, 171589, 172510, 172961, 172449, 171151, 169710, 168650, 168091, 167966, 168242, 168709, 168802, 168091, 166956, 166261, 166212, 166048, 165184, 164168, 163934, 164471, 164900, 164745, 164442, 164571, 165231, 166355, 167943, 169607, 170422, 169800, 168289, 167043, 166659, 166891, 167349, 167967, 168672, 169048, 168653, 167556, 166360, 165726, 165923]
53740A65923Q66J218J370J510J701J832J717J276P23N21R81J834K390K235J620
53725A87717J086Q46P74Q10J075J595K167K574K740K656K330J851J357Q97M92
53710B10967L47Q57K146L707M656M416L257K126J844K401L026L059K612K275K344
53695B50040K674L088L540L796L452K500J431N04o87k357l690l600k258j058q51
53680B56524j010n98J52K56n23j377j509r05rP59J078Q50L90J51J04j55o53r15
53662B52610p40n82p94j081j037p77n24l8Q76J671J579P14m7k21o1K00O91J318
53644B53757J598J382J188J375J511J045J77m42n38k78K58J133K122K739K806
53629B69833K587K371K247K269K548K982L232L125K943L109L615L971L788L262
$$ y = [165923, 166789, 168007, 169377, 170887, 172588, 174420, 176137, 177413, 178136, 178657, 179638, 181472, 183862, 186097, 187717, 188803, 189649, 190423, 191233, 192308, 193903, 196070, 198644, 201384, 204040, 206370, 208221, 209578, 210475, 210967, 211314, 212171, 214317, 218024, 222680, 227096, 230353, 232479, 234323, 236724, 239750, 242809, 245421, 247696, 250040, 252714, 255802, 259342, 263138, 266590, 269090, 270521, 271025, 270338, 267981, 264291, 260691, 258433, 257375, 256524, 255514, 254916, 255068, 255324, 254801, 253424, 251915, 251010, 251001, 251760, 252838, 253688, 254078, 254229, 254333, 254178, 253525, 252610, 251870, 251288, 250494, 249413, 248376, 247599, 247075, 247037, 247913, 249584, 251163, 251877, 251830, 251609, 251548, 251748, 252439, 253757, 255355, 256737, 257925, 259300, 260811, 261856, 262033, 261591, 261053, 260775, 261033, 262166, 264288, 267027, 269833, 272420, 274791, 277038, 279307, 281855, 284837, 288069, 291194, 294137, 297246, 300861, 304832, 308620, 311882]
53615C11882K971L186L630L944M104M205M025L300K373K031K530L161L084K315
53601C56741J555J273J343J370J118O01J4l95n68o63q03r51j097j311j468j258
53585C55501p43n41j099k038k601k520k023j238k75L51Q0q35j439j202m68K96
53569C39206J076J868K370K488K660L193L759M004M245M918N575N181L372R49
53555C84864r72j909k087k038k206k579k559j488N29K521L580L669L431L398L606
53540C89760L901M316N009N951O890P688Q492R452J0354J0902J1219J1760J2591
53527D98285J3236J3384J3403J3806J4662J5817J7361J9285K1032K2078K2745
53516F85094K3728K4923K5522K5369K5324K5958K6702K6851K6680K6899K7431
$$ y = [311882, 314853, 318039, 321669, 325613, 329717, 333922, 337947, 341247, 343620, 345651, 348181, 351342, 354426, 356741, 358296, 359569, 360912, 362282, 363400, 364001, 364015, 363620, 363052, 362389, 361586, 360635, 359538, 358227, 356759, 355501, 354758, 354217, 353118, 351080, 348479, 345959, 343936, 342698, 342423, 342774, 342854, 342019, 340580, 339378, 338910, 339206, 340282, 342150, 344520, 347008, 349668, 352861, 356620, 360624, 364869, 369787, 375362, 380543, 383915, 384864, 383892, 381983, 379896, 377858, 375652, 373073, 370514, 369026, 369555, 372076, 375656, 379325, 382756, 386154, 389760, 393661, 397977, 402986, 408937, 415827, 423515, 432007, 441459, 451813, 462715, 473934, 485694, 498285, 511521, 524905, 538308, 552114, 566776, 582593, 599954, 619239, 640271, 662349, 685094, 708822, 733745, 759267, 784636, 809960, 835918, 862620, 889471, 916151, 943050, 970481]
53505I70481K7568K7106K6555K6264K5981K5482K5063K5159K5721K6123K5574
53494A257077K3697K1016J8764J7843J7910J7884J7354J7044J7689J8915J9735
53483A464928J9800J9657J9613J8982J6809J3180R291O202L857J610p75l161n771
53470A584222r064j2688j5367j6301j6147j6066j6328j6528j6851j8024k0095
53459A410763k2163k3587k4703k5893k6696k6438k5285k4123k3575k3580k3691
53448A141029k3354k2119k0020j7713j5778j4015j1814r195o915n549m857m261
53436I85439l479k453j019R08L007M816O336P996R990J1956J3535J4965J6735
53423A068732J8814K0594K1715K2515K3489K4600K5472K6119K7049K8677L0900
$$ y = [970481, 998049, 1025155, 1051710, 1077974, 1103955, 1129437, 1154500, 1179659, 1205380, 1231503, 1257077, 1280774, 1301790, 1320554, 1338397, 1356307, 1374191, 1391545, 1408589, 1426278, 1445193, 1464928, 1484728, 1504385, 1523998, 1542980, 1559789, 1572969, 1582260, 1588462, 1592319, 1593929, 1593154, 1589993, 1584222, 1575158, 1562470, 1547103, 1530802, 1514655, 1498589, 1482261, 1465733, 1448882, 1430858, 1410763, 1388600, 1365013, 1340310, 1314417, 1287721, 1261283, 1235998, 1211875, 1188300, 1164720, 1141029, 1117675, 1095556, 1075536, 1057823, 1042045, 1028030, 1016216, 1007021, 1000106, 994557, 989700, 985439, 981960, 979507, 978488, 979396, 982403, 987219, 993555, 1001551, 1011541, 1023497, 1037032, 1051997, 1068732, 1087546, 1108140, 1129855, 1152370, 1175859, 1200459, 1225931, 1252050, 1279099, 1307776, 1338676]
53412A338676L3317L5591L7577L9374M1337M3814M6756M9740N2454N4909N7180
53401A830725N9136O0614O1619O2276O2739O3172O3638O3920O3704O2965O1889
53390B516397O0355N7934N4574N0938M7735M5031M2483L9929L7313L4309L0565
53379C017563K6387K2595J9618J6893J3269P808K51q978j9097k9381l9366m8576
53367B978986n6195o1331o3712o4076o3816o4117o5218o6277o6105o4226o1243
53356B282670n8080n5175n2612n0736n0053n0534n1484n2286n2887n3287n2951
53345A702585n1201m8132m4668m1610l8863l5819l2274k8677k5485k2637j9777
53334A313442j6828j4187j2469j2170j3302j5190j6805j7527j7470j6837j5393
$$ y = [1338676, 1371993, 1407584, 1445161, 1484535, 1525872, 1569686, 1616442, 1666182, 1718636, 1773545, 1830725, 1889861, 1950475, 2012094, 2074370, 2137109, 2200281, 2263919, 2327839, 2391543, 2454508, 2516397, 2576752, 2634686, 2689260, 2740198, 2787933, 2832964, 2875447, 2915376, 2952689, 2986998, 3017563, 3043950, 3066545, 3086163, 3103056, 3116325, 3124133, 3124384, 3115406, 3096309, 3066928, 3027562, 2978986, 2922791, 2861460, 2797748, 2733672, 2669856, 2605739, 2540521, 2474244, 2408139, 2343913, 2282670, 2224590, 2169415, 2116803, 2066067, 2016014, 1965480, 1913996, 1861710, 1808823, 1755536, 1702585, 1651384, 1603252, 1558584, 1516974, 1478111, 1442292, 1410018, 1381341, 1355856, 1333219, 1313442, 1296614, 1282427, 1269958, 1257788, 1244486, 1229296, 1212491, 1194964, 1177494, 1160657, 1145264]
53323A145264j3012j0432q687p790o725m863k642o55J082K549L290L217L231M188
53309A108015N793P291Q874J1336J4535J7305J9077K0589K2638K4962K6798K8013
53297A315226K9089L0317L1501L2258L2265L1372K9750K7903K6297K5039K3946
53286A634963K2795K1453J9831J7827J5255J1950P998L770l39m056p054r033j0361
53273A724999j2236j5619k0117k4452k7898l0608l2687l3802l4001l4090l4707
53262A424782l5530l5891l5730l5434l5023l4083l2455l0566k8989k8023k7675
53251A065383k7823k8285k8830k9221k9309k9166k9012k8859k8330k7139k5553
53240G53856k4018k2325j9728j6104j2526j0259r435r158q719q234q091q232q227
$$ y = [1145264, 1132252, 1121820, 1113133, 1105343, 1098618, 1093755, 1091113, 1090458, 1091540, 1094089, 1097379, 1100596, 1103827, 1108015, 1113808, 1121099, 1129973, 1141309, 1155844, 1173149, 1192226, 1212815, 1235453, 1260415, 1287213, 1315226, 1344315, 1374632, 1406133, 1438391, 1470656, 1502028, 1531778, 1559681, 1585978, 1611017, 1634963, 1657758, 1679211, 1699042, 1716869, 1732124, 1744074, 1752072, 1755842, 1755503, 1751447, 1744393, 1735360, 1724999, 1712763, 1697144, 1677027, 1652575, 1624677, 1594069, 1561382, 1527580, 1493579, 1459489, 1424782, 1389252, 1353361, 1317631, 1282197, 1247174, 1213091, 1180636, 1150070, 1121081, 1093058, 1065383, 1037560, 1009275, 980445, 951224, 921915, 892749, 863737, 834878, 806548, 779409, 753856, 729838, 707513, 687785, 671681, 659155, 648896, 639461, 630303, 621584, 613350, 605259, 597027, 588800]
53227E88800p956p941q860j0755j2839j4151j4384j3881j3091j2184j1223j0350
53215D51185r702r270q929q484p771o843o018n637n816o458p341q037q090p534
53201C45255p001o948p061o793o154n423m512l297k321k271k834k988k450j938
53187B83264j874j825j578j712k559l393l392k800k400k398k468k503k581k506
53173B49275k046j426r92o69j96K95M58K12l07j048j792k001j463p97p30j078
53157B35695j083m87L03R56J399J343M19j102k317k633k322k002j919j833j379
53142B23038m12Q36J940K670K986K684J512j16j102q93j83Q8mJ22L03j04r21j264
53124B31180r39p18j000j210q77m06l00l79l11l06o41j052j184j203j374j402
$$ y = [588800, 580844, 572903, 564043, 553288, 540449, 526298, 511914, 498033, 484942, 472758, 461535, 451185, 441483, 432213, 423284, 414800, 407029, 400186, 394168, 388531, 382715, 376257, 368916, 360879, 352789, 345255, 338254, 331306, 324245, 317452, 311298, 305875, 301363, 298066, 295745, 293474, 290640, 287652, 285202, 283264, 281390, 279565, 277987, 276275, 273716, 270323, 266931, 264131, 261731, 259333, 256865, 254362, 251781, 249275, 247229, 245803, 244811, 244142, 243946, 244241, 244699, 244911, 244604, 243556, 241764, 239763, 238300, 237503, 236773, 235695, 234612, 234125, 234428, 235384, 236783, 238126, 238545, 237443, 235126, 232493, 230171, 228169, 226250, 224417, 223038, 222626, 223462, 225402, 228072, 231058, 233742, 235254, 235138, 234036, 233143, 232960, 233048, 233044, 233166, 233469, 233365, 232444, 231180, 230241, 229523, 228523, 227313, 226436, 226030, 225730, 225351, 225040, 224734, 224093, 223041, 221857, 220654, 219280, 217878]
53108B17878r50m12m85j070j361j010n33m70p56j117j512j808j588p60l9j65q12
53091B03030r19j32P64R86P36O02N78K93r7j1O40J293J576J682J818J821J490
53074B16150P95l51j873k974k634j042K23N0q22r88l07J93k6m81n86k83K98R91
53056B06333J379J143P29R59J819K222J321m10j688j696p68P4O5o31j222j336
53040B08293j405j799k018j366r3P93P74K10l94q24r62q13q06j297j817j490l42
53023A94644N68N44O2p5K54O78R57J064J038J096J382J543R91k22j318j817j938
53006A99451j860j288j62Q78J241J053O55O8n64o05K57J266J467R84O78P91P29
52989B05039J71m15n52m31n02p52p53k85L66P51P89Q40J211J690J795J362O96
$$ y = [217878, 216928, 216516, 216031, 214961, 213600, 212590, 212057, 211587, 210831, 209714, 208202, 206394, 204806, 204046, 204007, 203842, 203030, 202111, 201979, 202743, 203729, 204465, 205067, 205645, 205938, 205841, 205830, 206470, 207763, 209339, 211021, 212839, 214660, 216150, 216945, 216594, 214721, 211747, 209113, 208071, 208294, 208344, 207522, 206534, 206227, 206420, 206394, 205913, 205327, 205044, 205342, 206333, 207712, 208855, 209584, 210543, 212362, 214584, 215905, 215495, 213807, 212111, 211343, 211417, 211482, 210851, 209629, 208293, 206888, 205089, 203071, 201705, 201612, 202405, 203179, 203389, 202995, 202171, 201209, 200396, 199590, 198293, 196476, 194986, 194644, 195212, 195756, 195818, 195743, 195997, 196675, 197632, 198696, 199734, 200830, 202212, 203755, 204746, 204524, 203206, 201389, 199451, 197591, 196303, 196141, 197019, 198260, 199313, 199968, 200036, 199472, 198867, 199124, 200390, 201857, 202841, 203519, 204310, 205039, 205210, 204795, 204243, 203812, 203310, 202558, 201805, 201520, 201886, 202637, 203426, 204266, 205477, 207167, 208962, 210324, 211020]
52972B11020J84M4M32J324K233K486J996J428J372J699J931J868J615J265Q40
52957B31737L20m12j371k210k450k191k068k346k501k085j520j533k070k279j575
52942B05446m41M1o53j741j823n08R00Q68m27j355r67n4K01k64o71n63o9M99Q60
52923A99279Q77P90R11R42K13j068j683j038j00k2n18n10J57O49M38j94p85j068
52905A97270r13n34n21j073j495j100k69J38L9j2R7K9j49m5K32J69j77k38P9K60
52885A91787J76L14Q20J130Q04J34l33l86r2L82P89R63R98R82P36K90J72O81J246
52866B01593J283J271J987L025L218K327J139L8j214k306k446j893j853k509k655
52851B01005j891j526k350k999j977q3P32J34n67o52o58r76j234j245j322j431
$$ y = [211020, 211204, 211248, 211680, 213004, 215237, 217723, 219719, 221147, 222519, 224218, 226149, 228017, 229632, 230897, 231737, 232057, 231645, 230274, 228064, 225614, 223423, 221355, 219009, 216508, 214423, 212903, 211370, 209300, 207021, 205446, 205005, 205046, 204393, 202652, 200829, 200321, 201221, 202089, 201662, 200307, 199340, 199286, 199487, 199223, 198552, 197989, 197920, 198419, 199279, 200156, 200946, 201857, 202799, 203012, 201944, 200261, 199223, 199123, 199101, 198583, 198073, 198230, 198879, 199317, 199123, 198338, 197270, 196357, 195823, 195302, 194229, 192734, 191634, 191365, 191503, 191542, 191530, 191627, 191656, 191507, 191462, 191694, 191863, 191686, 191448, 191527, 191787, 191963, 192277, 193097, 194227, 195031, 195165, 194832, 194446, 194354, 194736, 195525, 196488, 197486, 198468, 199204, 199494, 199666, 200347, 201593, 202876, 204147, 206134, 209159, 212377, 214704, 215843, 215881, 214667, 212361, 209915, 208022, 206169, 203660, 201005, 199114, 197588, 195238, 192239, 190262, 190179, 190911, 191045, 190478, 189826, 189168, 188192, 186958, 185713, 184391, 182960]
52835A82960r80J48J187J434J079P84Q65J084R80K78q30j834k444k764k770k097
52819A77080p17N97J119J107J216J377J016K27k24JN13J129K202L719M761M329
52803A99452K383k13k453l736m043l815l466k950k026q42O4L34L0o22j242j185
52787A75670j18J229J543M60q67j084r8J004J184L19q45j320p43K90R17J030J178
52770A79749J436J197K97l72o0N86K60j212k533k468j108M15J080P04r3m94k54
52753A77130J16Q1j48Q8R15J674J816J538J406J514J430Q51Q7j97L86J519K368
52736A92574K238J155j27o68o2J227K137J895P54k41l85j1O2m30j039j306j194
52719A96579q48l78K3J04r1k19j40j22l47n94p23j029j712k243j883p38L31Q53
$$ y = [182960, 181980, 182128, 183315, 184749, 185828, 186612, 187477, 188561, 189541, 189819, 188989, 187155, 184711, 181947, 179177, 177080, 176363, 176960, 178079, 179186, 180402, 181779, 182795, 183022, 182798, 182799, 183312, 184441, 186643, 190362, 195123, 199452, 201835, 201622, 199169, 195433, 191390, 187575, 184109, 181159, 179133, 178291, 178355, 178689, 178719, 178097, 176855, 175670, 175552, 176781, 178324, 178784, 177917, 176833, 176735, 177739, 178923, 179242, 178397, 177077, 176334, 176624, 177541, 178571, 179749, 181185, 182382, 182679, 182307, 182247, 182833, 183093, 181881, 179348, 176880, 175772, 176187, 177267, 177971, 177878, 177384, 177130, 177246, 177327, 177179, 177267, 178182, 179856, 181672, 183210, 184616, 186130, 187560, 188411, 188498, 188301, 188687, 190206, 192574, 194812, 195967, 195840, 195172, 195110, 196337, 198474, 200369, 201123, 200882, 200497, 200486, 200548, 200118, 199079, 197773, 196579, 195731, 195353, 195376, 195480, 195389, 195170, 195030, 194908, 194561, 193967, 193244, 192215, 190503, 188260, 186377, 185639, 185970, 186823]
52701A86823J165J530J492O14n60r81m07L32M67K46M32J252K135K488K306J897
52685B01231J295L00q70j454r93n3L43J3k16K37Q00N64m02j130j072p09p26j070
52667A96088j122n55L51J104J509J680J725J513R47M40P94K189L522L283J279
52652B14747r97j983j607r38p17q37r93j160j263j025m45j7j34m90m70OM61N79
52634B02717N98Q62J303J532J320Q23M95P95J778K804K870J594k26j369j459j165
52618B15272j083r81m74N2j75j106j641r39N22J495J386O84J81J17K22K46J70
52601B13948P3L0J85O39J182J375J036O04O37J032J037K23q98j450j196o07j08
52584B17742K87N40L67k48p15m21M21R32N82k36p61o86l22j25k16l15o1N42R96
$$ y = [186823, 187988, 189518, 191010, 191624, 191064, 190083, 189676, 190008, 190475, 190721, 191153, 192405, 194540, 197028, 199334, 201231, 202526, 202826, 201956, 200502, 199509, 199456, 199799, 199812, 199596, 199833, 200633, 201197, 200795, 199665, 198593, 197884, 197158, 196088, 194966, 194411, 194762, 195866, 197375, 199055, 200780, 202293, 203240, 203680, 204474, 206663, 210185, 213468, 214747, 213750, 211767, 210160, 209222, 208505, 207668, 206675, 205515, 204252, 203227, 202782, 202765, 202631, 202141, 201671, 201677, 202138, 202717, 203315, 204177, 205480, 207012, 208332, 209155, 209650, 210445, 212223, 215027, 217897, 219491, 219265, 217896, 216437, 215272, 214189, 213208, 212734, 212786, 212611, 211505, 209864, 208925, 209447, 210942, 212328, 213012, 213193, 213310, 213532, 213778, 213948, 214021, 214051, 214236, 214875, 216057, 217432, 218468, 219072, 219709, 220741, 221778, 222001, 221103, 219653, 218457, 217850, 217742, 218029, 218569, 218936, 218688, 217973, 217552, 217973, 218905, 219487, 219251, 218490, 217804, 217482, 217357, 217141, 216826, 216765, 217307, 218303]
52565B18303P18k58j190j365q46k66m6p1j19k09l69l90p7M65R82J334J352P76
52547B18724k94j142j148o96o97j214j246j84J141J445N59n31r81p93l69L2K93
52530B12899L28J23k60p70j260j397r97l71o6k30n51o83m82P8Q32J385J538J654
52512B11770K138K670K580K024K032L089M319M523L552K183J030J49n05r07j139
52497B39508j376j665k010k512l102l336k920k248j968k008j685p65K16Q10J223
52482B16162J678J845J448R91J146J659J657J013N79Q19J101P95L38M49Q45O56
52466B33181q1m33m3M15N18P88J590K260K146J733J811K022J357j41j283j434
52450B44406j301j774k786l584l601k742j390l41k13p20j008q09o20o70m76K22
$$ y = [218303, 219021, 218763, 217573, 216208, 215362, 215096, 215050, 214979, 214860, 214651, 214282, 213892, 213815, 214280, 215262, 216596, 217948, 218724, 218430, 217288, 216140, 215444, 214747, 213533, 212287, 212103, 213244, 214689, 215248, 214717, 213736, 212943, 212574, 212606, 212899, 213227, 213350, 213090, 212320, 211060, 209663, 208666, 208295, 208229, 207999, 207448, 206765, 206283, 206361, 207193, 208578, 210116, 211770, 213908, 216578, 219158, 221182, 223214, 226303, 230622, 235145, 238697, 240880, 241910, 242059, 241554, 240647, 239508, 238132, 236467, 234457, 231945, 228843, 225507, 222587, 220339, 218371, 216363, 214678, 213913, 214129, 214939, 216162, 217840, 219685, 221133, 222124, 223270, 224929, 226586, 227599, 228178, 228997, 230098, 230893, 231231, 231680, 232525, 233181, 233100, 232667, 232624, 233039, 233557, 234345, 235935, 238195, 240341, 242074, 243885, 245907, 247264, 247123, 245840, 244406, 243105, 241331, 238545, 234961, 231360, 228618, 227228, 226887, 226674, 225954, 224946, 224137, 223517, 222847, 222371, 222593]
52434B22593Q14P15K69J68M07M66J75j51k70k04l9J29K20M11J069K181L234L934
52416B36121M643N720O946Q084R458J1323J2967J3094J0977O840J464m028q326
52403C15283j0647j1177j0452q648o080l859l011l097k733j453k04J68l2j03J01
52388B54056M23Q93J524J984J993J721J564J718K137K605K780K550K359K792L749
52373B84848M471M506M222M226M697N447O209O631O392N542M469L464K590J949
52359C49663J636J514J474J902L214M949O043O163O047O428P365Q759J0635J2501
52345D28293J3453J3482J3849J5441J7492J8741J9103J9286J9388J9063J8664
52334F16255J8985J9900K0416K0111J9617J9444J9294J8809J8194J7689J7057
$$ y = [222593, 223407, 224122, 224391, 224559, 224966, 225432, 225607, 225456, 225186, 224982, 224943, 225072, 225292, 225703, 226772, 228953, 232187, 236121, 240764, 246484, 253430, 261514, 270972, 282295, 295262, 308356, 319333, 326173, 327637, 323609, 315283, 304636, 293459, 283007, 274359, 268279, 264420, 261409, 258312, 255579, 254126, 253922, 254090, 254058, 253955, 254056, 254479, 255372, 256896, 258880, 260873, 262594, 264158, 265876, 268013, 270618, 273398, 275948, 278307, 281099, 284848, 289319, 293825, 298047, 302273, 306970, 312417, 318626, 325257, 331649, 337191, 341660, 345124, 347714, 349663, 351299, 352813, 354287, 356189, 359403, 364352, 370395, 376558, 382605, 389033, 396398, 405157, 415792, 428293, 441746, 455228, 469077, 484518, 502010, 520751, 539854, 559140, 578528, 597591, 616255, 635240, 655140, 675556, 695667, 715284, 734728, 754022, 772831, 791025, 808714, 825771]
52323H25771J6035J4785J3491J1914R818P445N211L137J025r98k570l691m893
52310H96480o620q590r938j0060r226q232p541o965o239n437m590l291j177J297
52296H09871L196M192M901N954P221Q153Q579Q858R360J0078J0755J1313J2013
52283I14444J3140J4517J5528J5718J5147J4016J2341J0268Q420P371O881O089
52271A053880M497K297j84k904n811q591j0824j2177j2461j1865j1147j1123j1849
52258I61738j2644j2975j2852j2331j1246r686q235p273o456n280l898k940k717
52245H53205k988l384l715l928l923l525k520r92M13R34N97L17Q42J942K915L470
52229H39660L716L696L490L464L841M191M011L692M164N553O872P228O800O309
$$ y = [825771, 841806, 856591, 870082, 881996, 891814, 899259, 904470, 907607, 908632, 907634, 905064, 901373, 896480, 889860, 881270, 871332, 861272, 852046, 843814, 836273, 829308, 823069, 817632, 813042, 809751, 808574, 809871, 813067, 817259, 822160, 828114, 835335, 843488, 852067, 860925, 870285, 880363, 891118, 902431, 914444, 927584, 942101, 957629, 973347, 988494, 1002510, 1014851, 1025119, 1033539, 1040910, 1047791, 1053880, 1058377, 1060674, 1060490, 1057586, 1051775, 1043184, 1032360, 1020183, 1007722, 995857, 984710, 973587, 961738, 949094, 936119, 923267, 910936, 899690, 890004, 881769, 874496, 868040, 862760, 858862, 855922, 853205, 850217, 846833, 843118, 839190, 835267, 831742, 829222, 828230, 828643, 829577, 830174, 830491, 831333, 833275, 836190, 839660, 843376, 847072, 850562, 854026, 857867, 862058, 866069, 869761, 873925, 879478, 886350, 893578, 900378, 906687]
52215I06687O135O215O356O201N377M104L301L513L986L482J953P06P31J520J926
52200I62193J648J244J016O12j21o81o42m24o86j278j364o39K28N64N34P04J051
52183I63959R42l2j509k696l062k846k891l808n165n795n111l772k709j913p69
52168I22823O63J545J522J334J908L284M768N743O053N950N983O628P673Q251
52154I84128P823O861O305O563P381Q420R485J0386J1076J1905J3276J4973J6244
52141A114826J6634J6380J5903J5268J4387J3492J3041J3160J3396J3152J2278
52130A271917J1265J0823J1202J1967J2428J2326J2042J2112J2535J2579J1446
52119A402642R183O751M946L448J339j488m027n509o417p760r727j1601j2782
$$ y = [906687, 912822, 919037, 925393, 931594, 936971, 941075, 944376, 947889, 951875, 955357, 957310, 958016, 958747, 960267, 962193, 963841, 965085, 966101, 966713, 966592, 965911, 965269, 964845, 964159, 962881, 961517, 960878, 961106, 961670, 962204, 962908, 963959, 964901, 964869, 963360, 960664, 957602, 954756, 951865, 948057, 942892, 937097, 931986, 928214, 925505, 923592, 922823, 923486, 925031, 926553, 927887, 929795, 933079, 937847, 943590, 949643, 955593, 961576, 968204, 975877, 984128, 991951, 998812, 1005117, 1011680, 1019061, 1027481, 1036966, 1047352, 1058428, 1070333, 1083609, 1098582, 1114826, 1131460, 1147840, 1163743, 1179011, 1193398, 1206890, 1219931, 1233091, 1246487, 1259639, 1271917, 1283182, 1294005, 1305207, 1317174, 1329602, 1341928, 1353970, 1366082, 1378617, 1391196, 1402642, 1411825, 1418576, 1423522, 1426970, 1428309, 1426821, 1422794, 1417285, 1410868, 1403108, 1393381, 1381780, 1368998]
52106A368998j3299j3403j3234j2775j1835j0037p301m186j364J169L856O705
52094A293294R297J1538J3637J5336J5990J5649J5195J5035J4460J2902J1092
52083A443425J0231J0581J1502J2421J3024J2943J2123J1167J0481R371O936L619
52071A567824Q16j052k901n265p454q974j0639j3446j7058k0310k2705k4502k5742
52058A408592k6144k5863k5447k4999k4113k2746k1475k0725k0294j9862j9352
52047A157572j8559j6961j4458j1903j0415j0220j0484j0226r084p404n869m961
52035A027028m500l719k053Q7J635J974J511J037Q03L10j034l266n792p830q987
52020I97204r541j0127j1068j1999j2226j1558j0748j0971j2732j5308j7394j8367
$$ y = [1368998, 1355699, 1342296, 1329062, 1316287, 1304452, 1294415, 1287114, 1282928, 1281564, 1282733, 1286589, 1293294, 1302591, 1314129, 1327766, 1343102, 1359092, 1374741, 1389936, 1404971, 1419431, 1432333, 1443425, 1453656, 1464237, 1475739, 1488160, 1501184, 1514127, 1526250, 1537417, 1547898, 1557269, 1564205, 1567824, 1568640, 1567588, 1564687, 1559422, 1551968, 1542994, 1532355, 1518909, 1501851, 1481541, 1458836, 1434334, 1408592, 1382448, 1356585, 1331138, 1306139, 1282026, 1259280, 1237805, 1217080, 1196786, 1176924, 1157572, 1139013, 1122052, 1107594, 1095691, 1085276, 1075056, 1064572, 1054346, 1045262, 1037858, 1031989, 1027028, 1022528, 1018809, 1016756, 1016843, 1018478, 1020452, 1021963, 1023000, 1023803, 1024113, 1023079, 1019813, 1014021, 1006191, 997204, 987663, 977536, 966468, 954469, 942243, 930685, 919937, 908966, 896234, 880926, 863532, 845165]
52008H45165j8662j8923j9109j8746j7734j6373j4739j2760j1004j0576j1719
51997F74820j3080j3060j1620j0068r288q937q337p320n963m251k454j309j311
51984E77822k079k828l277l764m688o103p711q966r423r248r159r534r877r492
51970D81673q453p391o497n276l331r21J359L102M203M759N003N124N076M719
51956D83149M150L671L328K748J521m01k594m411n382n540n276m763l705j883
51942D64612K71K169L875N935Q336J0255J1017J0835J0242R244P424M709J596
51929E50520j364l982o309q380j0151j1617j2729j3238j2835j1670j0611j0534
51917D37100j1237j1480j0427q643p276o545n738m489l262k478j838q31N98K163
$$ y = [845165, 826503, 807580, 788471, 769725, 751991, 735618, 720879, 708119, 697115, 686539, 674820, 661740, 648680, 637060, 626992, 617704, 608767, 600430, 593110, 587147, 582896, 580442, 579133, 577822, 575743, 572915, 569638, 565874, 561186, 555083, 547372, 538406, 528983, 519735, 510576, 501042, 491165, 481673, 473220, 465829, 459332, 454056, 450725, 449804, 451163, 454265, 458468, 463227, 468230, 473354, 478430, 483149, 487299, 490970, 494298, 497046, 498567, 498166, 495572, 491161, 485779, 480239, 474963, 470200, 466495, 464612, 464883, 467052, 470927, 476862, 485198, 495453, 506470, 517305, 527547, 536791, 544215, 548924, 550520, 549156, 545174, 538865, 530485, 520334, 508717, 495988, 482750, 469915, 458245, 447634, 437100, 425863, 414383, 403956, 395313, 388037, 381492, 375754, 371265, 368003, 365525, 363687, 362856, 363454, 365617]
51903C65617L644M883N775O461P282Q296R146R547R531Q978P423M631J135k068
51889D50281m224n062m797m074l502k926j492J253M733Q114J1220J4249J7075
51876D80848J9451K1453K2881K2453J8550J1151K438m807r184j1098j1773j2237
51864E50126j2927j3824j4741j5499j5869j5545j4293j2094r143n866k912p31
51852D16682R00K488L815L915K439M84o45j077j930l514m847n056m431l858l829
51837D01536m278m863n125m739l847k871j933q54K42Q80R59R39J088J016L40o96
51821C77794j613k373l163l783l792l116k175j401q71l20P15K540M808O520O849
51806C76619N881M344K729R56j075l093m648n555n887n708n008l916k876k433
$$ y = [365617, 369261, 374144, 379919, 386380, 393662, 401958, 411104, 420651, 430182, 439160, 446583, 451214, 452349, 450281, 446057, 440995, 436198, 432124, 428622, 425696, 424204, 425457, 430190, 438304, 449524, 463773, 480848, 500299, 521752, 544633, 567086, 585636, 596787, 599225, 594418, 585234, 574136, 562363, 550126, 537199, 523375, 508634, 493135, 477266, 461721, 447428, 435334, 426191, 420325, 417413, 416682, 417582, 420070, 423885, 427800, 430239, 430723, 430078, 429001, 427071, 423557, 418710, 413654, 409223, 405365, 401536, 397258, 392395, 387270, 382531, 378684, 375813, 373880, 373026, 373268, 374148, 375107, 376046, 377134, 378150, 378490, 377794, 376181, 373808, 370645, 366862, 363070, 359954, 357779, 356378, 355507, 355187, 355902, 358442, 363250, 369770, 376619, 382500, 386844, 389573, 390529, 389454, 386361, 381713, 376158, 370271, 364563, 359555, 355639, 352763, 350330]
51792C50330k763l516m092m046l230j797k58P46J017J027J267J555J334O07Rq0
51776C38110K2j34n24q48r34o71J18J408K843M147N385O622P587Q016Q081Q129
51760C87357Q153P803O796M997K317j099m626p402q932r350r182q923q693q143
51746C51073o879m985l015j298L58K203M109N907P689R356J0227R687Q123O682
51732C99237O166O534P361Q226Q633Q092O447L884O05l086o453q591r155q404
51718D19496o569l775p98Q46J69k190m559n775n758m982l859k619j214P36L471
51703C82620O365Q008P283M390P17k153l298k658p63J648L958N745O602N932L250
51688D27646j178o059r703j1062j0225q097n823m413m325n006n055l391l63K566
$$ y = [350330, 347567, 344051, 339959, 335913, 332683, 330886, 330628, 331374, 332391, 333418, 334685, 336240, 337574, 338181, 338190, 338110, 338132, 337998, 337474, 336626, 335692, 335021, 335139, 336547, 339390, 343537, 348922, 355544, 363131, 371147, 379228, 387357, 395510, 403313, 410109, 415106, 417423, 416324, 411698, 404296, 395364, 386014, 376832, 367909, 359216, 351073, 344194, 339209, 336194, 334896, 335254, 337457, 341566, 347473, 355162, 364518, 374745, 384432, 392555, 399237, 405403, 411937, 419298, 427524, 436157, 444249, 450696, 454580, 455185, 452099, 445646, 437055, 427900, 419496, 412927, 409152, 408354, 409200, 409369, 407179, 402620, 396845, 391087, 386105, 382246, 379627, 378413, 379149, 382620, 388985, 396993, 404276, 408666, 409383, 407230, 403932, 401274, 400511, 402159, 406117, 411862, 418464, 424396, 427646, 426468, 420409, 410706, 399644, 389419, 381322, 375499, 371086, 366761, 361755, 356700, 353309, 352946, 355512]
51674C55512M377N528P251J0010J2930J4767J5035J3983J1715P992L085j743n210
51661D55232p229q459q764p118l454K50J583R6k647n034o530p049o414m884l446
51646C86133k911l133l509l887m506n360o099o449o356n858n100m330l629k834
51632C22172j992j509j574j687j320p96q81j567j962j488n38K79R21J523J785
51617C11366J431R65J258K357L332L459L050K778K684K307J628J246J574K320
51603C41755L014L732M959O811Q657R433Q288N100P39l286n787o661o556n929
51589C64269m766l193j796r21j17J277L163M753N583N986O660Q093J0513J3804
51575D13308J7225J9568K0135J9528J9208K0092K1636K2249K0499J6100J0186
$$ y = [355512, 359889, 365417, 372668, 382678, 395608, 410375, 425410, 439393, 451108, 459100, 462185, 460442, 455232, 448003, 439544, 430780, 423662, 420208, 420458, 422041, 422137, 419490, 414456, 407926, 400877, 394463, 389579, 386133, 383222, 380089, 376580, 372693, 368187, 362827, 356728, 350279, 343923, 338065, 332965, 328635, 325006, 322172, 320180, 318671, 317097, 315410, 314090, 313294, 312413, 310846, 308884, 307396, 306858, 307137, 308058, 309581, 311366, 312797, 313762, 315020, 317377, 320709, 324168, 327218, 329996, 332680, 334987, 336615, 337861, 339435, 341755, 344769, 348501, 353460, 360271, 368928, 378361, 386649, 391749, 392488, 389202, 383415, 376754, 370198, 364269, 359503, 356310, 354514, 353593, 353476, 354753, 357916, 362669, 368252, 374238, 380898, 388991, 399504, 413308, 430533, 450101, 470236, 489764, 508972, 529064, 550700, 572949, 593448, 609548, 619734]
51564F19734M901K495M210R572J6808K4226L1309L8214M4239M7296M5396L8516
51552I26916K8722J8487R180R19o803j4494k2144k8947l3901l6917l8942m0661
51540G61415m1504m0535l7945l4963l2312k9548k6158k2567j9585j7308j5165
51529D43825j2862j0713r067p866o873n976n121m217l319k736k770l308l839l883
51515C61275l428k895k609k339j577l13P28R30N69L36K50l36j515k303j852o33
51499C44288J59J68R1M40Q44P52J88n31j336k201k758k664k166j876k011k250
51483C29137k264k017j617j213j101j423j762j420l11Q15J295J388J863K976M191
51468C28537M806M535L490J977L31j156k274k850k713j856o61J94J61p69j991
$$ y = [619734, 624635, 627130, 631340, 640912, 657720, 681946, 713255, 751469, 795708, 843004, 888400, 926916, 955638, 974125, 983305, 984224, 977421, 962927, 940783, 911836, 877935, 841018, 802076, 761415, 719911, 679376, 641431, 606468, 574156, 544608, 518450, 495883, 476298, 458990, 443825, 430963, 420250, 411183, 403317, 396444, 390468, 385347, 381130, 377811, 375075, 372305, 368997, 365158, 361275, 357847, 354952, 352343, 350004, 348427, 348114, 348842, 349772, 350341, 350677, 350927, 350591, 349076, 346773, 344921, 344288, 344447, 344615, 344706, 345146, 345990, 346742, 346930, 346399, 345063, 342862, 340104, 337440, 335274, 333398, 331387, 329137, 326873, 324856, 323239, 322026, 320925, 319502, 317740, 316320, 316009, 316824, 318119, 319507, 321370, 324346, 328537, 333343, 337878, 341368, 343345, 343676, 342520, 340246, 337396, 334683, 332827, 332166, 332360, 332521, 331752, 329761]
51453C29761k717k622k098j725j529r38N23K815N729R230J3092J6413J7923J6797
51439D00654J3162Q005K939l73j126J55K215L897M233K354j765o572r905j0990
51425D06883j0828j0436r631q015o177n037m423l351j565J03R07R70P85O07N53
51410C51345P16Q56M70n15j489j858j669j249o38K05R58J196J073J214J940K930
51394C55485L756M425N182O050O849P594Q543R839J1380J3223J5873J9793K4668
51381D92660K9597L4191L9089M4955N1133N5728N7046N4784M9939M4000L8140
51370I91262L2624K6657J9065R409j656j3059k4007l3958m2375m8986n3941n7283
51358H03752n8465n6842n2661m7157m1538l6200l1038k6112k1722j7979j4675
$$ y = [329761, 327044, 324422, 322324, 320599, 319070, 318132, 318655, 321470, 327199, 336429, 349521, 365934, 383857, 400654, 413816, 421821, 424760, 424387, 423261, 423416, 425631, 429528, 433761, 436115, 434350, 427778, 417873, 406883, 396055, 385619, 375988, 367973, 361796, 356759, 352336, 348985, 347420, 347523, 348430, 349400, 350185, 350792, 351345, 352061, 352917, 353387, 352872, 351383, 349525, 347856, 346607, 345969, 346174, 347132, 348328, 349401, 350615, 352555, 355485, 359241, 363666, 368848, 374898, 381747, 389341, 397884, 407723, 419103, 432326, 448199, 467992, 492660, 522257, 556448, 595537, 640492, 691625, 747353, 804399, 859183, 909122, 953122, 991262, 1023886, 1050543, 1069608, 1079017, 1077361, 1064302, 1040295, 1006337, 963962, 914976, 861035, 803752, 745287, 688445, 635784, 588627, 547089, 510889, 479851, 453739, 432017, 414038, 399363]
51347C99363j1641r054p270o397o111n914n512m927m380m043l891l721l397l071
51333C20034k946k814k101o42Q70J607J518J137O42j80j072j349j063j215k181
51318C10245k755j674L59J385P15l68n57q2J47o3l47o81j272j845j830j203n29
51301B99645j87p3k4r1k29k12NQ5k98r81j437j248m21O19J389J682J659J563J529
51282C02975J750K527L789M746M546L342K275K175K672K885K596K280K207K089
51268C42854J654J119Q65R38J012O96l29k128m264n782n854m551k825j743j690
51253C19972k311k969l199k855k096j235o16l80l27j25K50L53j96j049j355q26
51237C01036j90k67q03q08N0R76J174Q92R01J332J558J161M89J44K27L70L07K43
$$ y = [399363, 387722, 378668, 371398, 365001, 358890, 352976, 347464, 342537, 338157, 334114, 330223, 326502, 323105, 320034, 317088, 314274, 312173, 311531, 312401, 314008, 315526, 316663, 317305, 317125, 316053, 314704, 313641, 312426, 310245, 307490, 305816, 306175, 307560, 308275, 307907, 307350, 307268, 307415, 307352, 307005, 306324, 305052, 303207, 301377, 300174, 299645, 299458, 299385, 299361, 299270, 299041, 298829, 298834, 298919, 298621, 297640, 296203, 294955, 294534, 295153, 296542, 298224, 299883, 301446, 302975, 304725, 307252, 311041, 315787, 320333, 323675, 325950, 328125, 330797, 333682, 336278, 338558, 340765, 342854, 344508, 345627, 346492, 347430, 348442, 349138, 348809, 346681, 342417, 336635, 330781, 326230, 323405, 321662, 319972, 317661, 314692, 311493, 308638, 306542, 305307, 304691, 304311, 303984, 303859, 304109, 304462, 304266, 303217, 301862, 301036, 300846, 300579, 299776, 298968, 299018, 299994, 301168, 302060, 302961, 304293, 305851, 307012, 307501, 307645, 307872, 308242, 308549, 308792]
51219C08792O06J506K482K911K703K449K784L706M613M875M193K709R91k38p20
51204C44362r05j322j850k021j830j722j808j752j508j518j887k007j477q12o89
51189C21254q98p68k66O7J62N89J529K362K506K204K083K298K440K095J269M04
51173C39330K6K23M90L31o2j85j16m52j174j400o15M30O86R6o90j442k377l286
51155C29813l542l036k373j937j455o83Q3M87O40P69P86N98M67O42Q58P76O22
51138C23515R51J697K047J407K01n72m72o3j87r05j362q25L70J173J128Q62J153
51121C30118J919K475K515K380K396K457K331K033J741J565J532J618J682J495
51107C58257J005M48J47J78L51M40L85L01L41N40Q30J156J526J919K275K593K911
$$ y = [308792, 309398, 310904, 313386, 316297, 319000, 321449, 324233, 327939, 332552, 337427, 341620, 344329, 345320, 345082, 344362, 343457, 342135, 340285, 338264, 336434, 334712, 332904, 331152, 329644, 328126, 326239, 324232, 322755, 321943, 321254, 320356, 319588, 319322, 319389, 319551, 320140, 321669, 324031, 326537, 328741, 330824, 333122, 335562, 337657, 338926, 339330, 339356, 339579, 340069, 340400, 340338, 340153, 340037, 339585, 338411, 337011, 336396, 336826, 337512, 337608, 336918, 335476, 333099, 329813, 326271, 323235, 320862, 318925, 317470, 316787, 316870, 317357, 317997, 318766, 319552, 320150, 320617, 321259, 322117, 322893, 323515, 324466, 326163, 328210, 329617, 329818, 329246, 328774, 328711, 328524, 327619, 326257, 325432, 325802, 326975, 328103, 328965, 330118, 332037, 334512, 337027, 339407, 341803, 344260, 346591, 348624, 350365, 351930, 353462, 355080, 356762, 358257, 359262, 359710, 359857, 360035, 360386, 360826, 361211, 361512, 361853, 362393, 363223, 364379, 365905, 367824, 370099, 372692, 375603]
51090C75603L149L159L003L011L254L219K347Q94k02m02j58k72r46j695k037j915
51074C90012j514r37j54Q16J797K527K924L258M008N436P327R275J1078J2633
51060D48486J3408J2389Q983M110O0j065J097N189R325J2158J3168J2757J2153
51047E52218J2436J3203J2627R464M789J060l54j21L87M96o7j954n864j1442j7095
51032E69783k1062k2519k1780j9741j7264j4829j2529j0269p962n686l684k114
51020D10344p54Q76K851M492N047M682M444N099O293P017O679N638M856N065O131
51005D78760P217P688P788Q179R040J0070J1183J2617J4325J5904J7221J8439
50993F18431J9269J9010J7837J7159J8055J9913K1289K1455K0317J7510J2969
$$ y = [375603, 378752, 381911, 384914, 387925, 391179, 394398, 396745, 397639, 397437, 397035, 396877, 396605, 395659, 393964, 391927, 390012, 388498, 387561, 387407, 388223, 390020, 392547, 395471, 398729, 402737, 408173, 415500, 424775, 435853, 448486, 461894, 474283, 483266, 487376, 487436, 486371, 487468, 492657, 501982, 514140, 527308, 540065, 552218, 564654, 577857, 590484, 599948, 604737, 605797, 605443, 605322, 605709, 606205, 606138, 604184, 598320, 586878, 569783, 548721, 526202, 504422, 484681, 467417, 452588, 440059, 429790, 421828, 416142, 412458, 410344, 409590, 410466, 413317, 417809, 422856, 427538, 431982, 437081, 443374, 450391, 457070, 462708, 467564, 472629, 478760, 485977, 493665, 501453, 509632, 518672, 528742, 539925, 552542, 566867, 582771, 599992, 618431, 637700, 656710, 674547, 691706, 709761, 729674, 750963, 772418, 792735, 810245, 823214]
50982H23214Q119N027M071L605K408J312J818M033O958J0174J4165J9208K4846
50969I28958L0526L6078M1458M6514N1190N5585N9720O3461O6671O9203P0751
50958A520115P0991O9802O7086O2540N6116M8637M1402L4919K8528K1613J4799
50947B036548R541O679N622M710K115l185j0627j8177k3676k6225k6193k4304
50935A932828k1325j8567j7633j9186k2346k5788k9042l2414l6132m0143m4421
50924A625831m8783n2514n4855n5791n5862n5250n3660n1012m7625m3635l9008
50913A067836l4273l0475k7959k5827k3053j9694j6548j4067j2156j0697r615
50902H43472q641p500o285n241m359l517k877k688k797k720k223j551j136j223
$$ y = [823214, 831333, 836360, 840431, 844036, 846444, 847756, 849574, 853607, 860565, 870739, 884904, 904112, 928958, 959484, 995562, 1037020, 1083534, 1134724, 1190309, 1250029, 1313490, 1380161, 1449364, 1520115, 1591106, 1660908, 1727994, 1790534, 1846650, 1895287, 1936689, 1971608, 2000136, 2021749, 2036548, 2046089, 2052768, 2058390, 2063100, 2065215, 2062030, 2051403, 2033226, 2009550, 1983325, 1957132, 1932828, 1911503, 1892936, 1875303, 1856117, 1833771, 1807983, 1778941, 1746527, 1710395, 1670252, 1625831, 1577048, 1524534, 1469679, 1413888, 1358026, 1302776, 1249116, 1198104, 1150479, 1106844, 1067836, 1033563, 1003088, 975129, 949302, 926249, 906555, 890007, 875940, 863784, 853087, 843472, 834831, 827331, 821046, 815805, 811446, 807929, 805052, 802364, 799567, 796847, 794624, 793073, 791937, 790714]
50888G90714j640j803j175J00J368K406L608M976N608M922L787L602M586N914
50874H26973P242Q886J0619J1588J1846J2786J5372J8712K1232K2627K3887K5756
50862A017526K8101L0695L3859L8021M3118M8718N4629O1149O8632P6916Q5440
50851A586804R4043J03238J13295J23350J32082J39187J45456J51282J55931J58566
50841B903234J59108J57424J52363J42476J27424J08095Q5722O1620L7522J5167
50831C950155m641k1980l6715m8027n5179n8071n6876n1702m3117l2562k1744
50820C519541j1838l730J295J793k727j1399k2852l6195n0943o6411q1627r5790
50808C139117j08406j18928j26599j30823j31504j28892j23301j15201j05343
$$ y = [790714, 789074, 787271, 786096, 786196, 787564, 789970, 793578, 798554, 804162, 809084, 812871, 816473, 821059, 826973, 834215, 843101, 853720, 865308, 877154, 889940, 905312, 924024, 945256, 967883, 991770, 1017526, 1045627, 1076322, 1110181, 1148202, 1191320, 1240038, 1294667, 1355816, 1424448, 1501364, 1586804, 1680847, 1784085, 1897380, 2020730, 2152812, 2291999, 2437455, 2588737, 2744668, 2903234, 3062342, 3219766, 3372129, 3514605, 3642029, 3750124, 3835846, 3897466, 3934988, 3950155, 3945514, 3923534, 3886819, 3838792, 3783613, 3725542, 3668666, 3616964, 3573847, 3541285, 3519541, 3507703, 3503973, 3505268, 3507061, 3504334, 3492935, 3470083, 3433888, 3382945, 3316534, 3234907, 3139117, 3030711, 2911783, 2785184, 2654361, 2522857, 2393965, 2270664, 2155463, 2050120]
50799B050120r4482q3016p1022n8611m6094l3928k2652j2763m447K439P969J1886
50787A645399J3987J4573J4096J2619R989O517K964j36k815n289p669j0060j2453
50774A681722j4586j6346j8369k1620k6169l0995l5165l8666m1658m3592m3784
50763A350772m2468m0579l8568l6082l2810k9147k5811k3090k0689j8092j4972
50752A028464j1331p453l834j010Q51K411M856Q719J3112J6664J9219K1996K5995
50739A118659L0937L6052M1214M6792N2831N9018O5079P0720P5507P9316Q2649
50728A758774Q5851Q8347Q9285Q8749Q7564Q5882Q2763P7227O9028N8106M4047
50717B615623K6732P287j2106k9290m2836n2043n6635n6728n2892m6125l7629
$$ y = [2050120, 1955638, 1872622, 1801600, 1742989, 1696895, 1662967, 1640315, 1627552, 1623105, 1625544, 1633513, 1645399, 1659386, 1673959, 1688055, 1700674, 1710663, 1717180, 1720144, 1720008, 1717193, 1711904, 1704235, 1694175, 1681722, 1667136, 1650790, 1632421, 1610801, 1584632, 1553637, 1518472, 1479806, 1438148, 1394556, 1350772, 1308304, 1267725, 1229157, 1193075, 1160265, 1131118, 1105307, 1082217, 1061528, 1043436, 1028464, 1017133, 1009680, 1005846, 1004836, 1005687, 1008098, 1012954, 1021673, 1034785, 1051449, 1070668, 1092664, 1118659, 1149596, 1185648, 1226862, 1273654, 1326485, 1385503, 1450582, 1521302, 1596809, 1676125, 1758774, 1844625, 1932972, 2022257, 2111006, 2198570, 2284452, 2367215, 2444442, 2513470, 2571576, 2615623, 2642355, 2649642, 2637536, 2608246, 2565410, 2513367, 2456732, 2400004, 2347112, 2300987, 2263358]
50706B263358k8397j9081j0217k503L441P414R416R024N421j771j1823k3371l5289
50693B165622m6855n7194o5082o9562p0593o8844o4903n8919n0967m1505l1263
50682A539935k0877j0754j044Q481J8355K8812L9330M9046N7572O5053P1403P5829
50670A921141P7257P5039O9376O1319N2379M3680L5483K7782K1221J6796J4507
50659B415980J2991J0831P744M204M42l658p986j2145j5766j8558k0110k0017
50647B353952j8173j4815j0376n234N44P151J4408K1273K6481K9684L1447L2266
50635B468608L2348L2257L2746L3911L5607L8575M2959M4674L5629J0513k6605
50624B781222o4119r1412j04679j05721r8075q5200p0220n5264m1064k7749j5593
$$ y = [2263358, 2234961, 2215880, 2205663, 2203160, 2206601, 2214015, 2223431, 2232455, 2237876, 2236105, 2224282, 2200911, 2165622, 2118767, 2061573, 1996491, 1926929, 1856336, 1787492, 1722589, 1663670, 1612703, 1571198, 1539935, 1519058, 1508304, 1507260, 1515741, 1534096, 1562908, 1602238, 1651284, 1708856, 1773909, 1845312, 1921141, 1998398, 2073437, 2142813, 2204132, 2256511, 2300191, 2335674, 2363456, 2384677, 2401473, 2415980, 2428971, 2439802, 2447546, 2451750, 2452192, 2448534, 2440548, 2428403, 2412637, 2394079, 2373969, 2353952, 2335779, 2320964, 2310588, 2305354, 2305898, 2313049, 2327457, 2348730, 2375211, 2404895, 2436342, 2468608, 2500956, 2533213, 2565959, 2599870, 2635477, 2674052, 2717011, 2761685, 2797314, 2807827, 2781222, 2717103, 2625691, 2521012, 2415291, 2317216, 2232016, 2161796, 2106532, 2065468, 2037719, 2022126]
50613B022126m826M478J1898J6709J8784J8732J6759J2155M451n574j6584k7838
50601B071270l9054m9666n8855o5998p0648p2461p1674o9347o6588o3673o0205
50590A383101n5900n0829m5176l9193l3365k8270k4235k1173j8620j5906j2606
50579A037828q890n274k014Q88L189M498M904M972N004M941N119O313Q661J1304
50565A081443J3601J6076J9480K3549K7454L1170L5443M0542M5861N0831N5588
50554A441038O0388O4771O7605O7871O5356O0671N4716M8184M1668L6084L2503
50543B040855L1407L2443L5043L8922M3734M8723N3149N6828N9969O2776O5577
50532B569426O9036P3777P9837Q6728R3808J00388J05821J09832J12451J13287
$$ y = [2022126, 2017300, 2021778, 2033676, 2050385, 2069169, 2087901, 2104660, 2116815, 2121266, 2115692, 2099108, 2071270, 2032216, 1982550, 1923695, 1857697, 1787049, 1714588, 1642914, 1573567, 1506979, 1443306, 1383101, 1327201, 1276372, 1231196, 1192003, 1158638, 1130368, 1106133, 1084960, 1066340, 1050434, 1037828, 1028938, 1023664, 1021650, 1022538, 1025727, 1030225, 1035129, 1040101, 1045105, 1050046, 1055165, 1061478, 1070139, 1081443, 1095044, 1111120, 1130600, 1154149, 1181603, 1212773, 1248216, 1288758, 1334619, 1385450, 1441038, 1501426, 1566197, 1633802, 1701673, 1767029, 1827700, 1882416, 1930600, 1972268, 2008352, 2040855, 2072262, 2104705, 2139748, 2178670, 2222404, 2271127, 2324276, 2381104, 2441073, 2503849, 2569426, 2638462, 2712239, 2792076, 2878804, 2972612, 3073000, 3178821, 3288653, 3401104, 3514391]
50522C514391J11299J05783R7231Q6604P3912N8294L9448J8332l739k6025m8139
50511D027391o9397q8802j05467j18742j28071j32978j33193j28708j19745j06807
50501B895481r0670p2283n2620l2506j2521O895K5117M1120N3693O1809O4679
50490B888194O1472N1327L3985J0535j6572m4417p0500r2816j09671j20164j24998
50479B466375j26052j24705j20953j14636j06859r9288r2400q5430p8035p0977
50469A447040o4956n9744n4873n0335m6035m1370l6056l0816k6554k3164j9882
50458I93255j6468j3415j1109r331p619n724l743k071j041m00N22J921L164L652
50444I31593L564L366L086K641K482L168M585O232Q108J0643J3845J7156K0203
$$ y = [3514391, 3625690, 3731473, 3828704, 3915308, 3989220, 4047514, 4086962, 4105294, 4101555, 4075530, 4027391, 3957994, 3869192, 3763725, 3644983, 3516912, 3383934, 3250741, 3122033, 3002288, 2895481, 2804811, 2732528, 2679908, 2647402, 2634881, 2641776, 2666893, 2708013, 2761706, 2823515, 2888194, 2949666, 3000993, 3034978, 3045513, 3028941, 2984524, 2914024, 2821208, 2711537, 2591373, 2466375, 2340323, 2215618, 2094665, 1980029, 1873170, 1773882, 1681482, 1596052, 1518017, 1447040, 1382084, 1322340, 1267467, 1217132, 1171097, 1129727, 1093671, 1062855, 1036301, 1013137, 993255, 976787, 963372, 952263, 942932, 935313, 929589, 925846, 923775, 922734, 922334, 922856, 924777, 927941, 931593, 935157, 938523, 941609, 944250, 946732, 949900, 954485, 960717, 968825, 979468, 993313, 1010469, 1030672]
50431A030672K3078K5851K8300L0249L1737L2762L3185L3017L2575L2224L2229
50420A365879L2842L4342L6960M0793M5662N1001N6171O0919O5245O8799P0976
50409A929589P1766P1792P1093O8660O3836N7492N0943M4158L6010K6036J4822
50398B506197K742j0583k5304m0619n5278o8176p8331q4989q8045q7981q5129
50387A884504p9488p1328o1488n0903m0147k9464j8814p988K826J2579K0064K5044
50375A585397K8041K8974K6820K0787J1299m69j3309k6035l7421m6662n3512n7843
50363A466067n9500n8832n6865n4586n2296m9866m7133m3887l9974l5717l1780
50352I35631k8390k5111k1702j8607j6218j4121j1708r142p166o028n215m206
$$ y = [1030672, 1053750, 1079601, 1107901, 1138150, 1169887, 1202649, 1235834, 1268851, 1301426, 1333650, 1365879, 1398721, 1433063, 1470023, 1510816, 1556478, 1607479, 1663650, 1724569, 1789814, 1858613, 1929589, 2001355, 2073147, 2144240, 2212900, 2276736, 2334228, 2385171, 2429329, 2465339, 2491375, 2506197, 2508939, 2498356, 2473052, 2432433, 2377155, 2308979, 2230648, 2145659, 2057614, 1969633, 1884504, 1805016, 1733688, 1672200, 1621297, 1581150, 1551686, 1532872, 1524884, 1527710, 1540289, 1560353, 1585397, 1613438, 1642412, 1669232, 1690019, 1701318, 1700849, 1687540, 1661505, 1624084, 1577422, 1523910, 1466067, 1406567, 1347735, 1290870, 1236284, 1183988, 1134122, 1086989, 1043102, 1003128, 967411, 935631, 907241, 882130, 860428, 841821, 825603, 811482, 799774, 790632, 783466, 777438, 772223, 768017]
50340G68017l068k177j719j594j635j761j889j894j685j395j250j248j140q92
50326G44670q54j187j405r19J96J422K606L975N479O711P595Q595J0138J2292
50312G99314J4957J7926K0822K3492K6341K9601L2424L3459L2317K9516K4944
50301A085113J7728Q151j331p928j0847j1252j0576r635q841q367q213q548r712
50288A015742j1565j3203j3839j3531j2754j1679j0382r091p671n424j922K561
50276I07242P982J4733K1635K4654J9776P578o380j6325k0529k0805j9312j6973
50264I03276j4055j0798p322l652o3K905M903N941O197N853N168M430L742K949
50250I09474J887O11o54j811l035m488o009p188p807q014q066q044p955p836p644
$$ y = [768017, 764949, 762772, 761053, 759459, 757824, 756063, 754174, 752280, 750595, 749200, 747950, 746702, 745562, 744670, 743816, 742629, 741224, 740305, 740501, 741923, 744529, 748504, 753983, 760694, 768289, 776884, 787022, 799314, 814271, 832197, 853019, 876511, 902852, 932453, 964877, 998336, 1030653, 1060169, 1085113, 1102841, 1110992, 1109661, 1101733, 1090886, 1079634, 1069058, 1059423, 1050582, 1042215, 1034002, 1025454, 1015742, 1004177, 990974, 977135, 963604, 950850, 939171, 928789, 919698, 912027, 906603, 904681, 907242, 915224, 929957, 951592, 976246, 996022, 1003600, 997220, 980895, 960366, 939561, 920249, 903276, 889221, 878423, 871101, 867449, 867386, 870291, 875194, 881135, 887332, 893185, 898353, 902783, 906525, 909474, 911361, 911972, 911318, 909507, 906472, 901984, 895975, 888787, 880980, 872966, 864900, 856856, 848901, 841065, 833421]
50235H33421p128o001m226k129k01J287K639M530P260J0449J3819J7913K3432
50222H95065L0035L6635M2846M9209N5779O1511O5407O7330O7086O3808N7235
50211A491946M8905M1034L4754L0306K8143K8495L0150L0991K9583K5124J6235
50200A835666J622j7679l8120n6346p1062q1977q8330q9473q5986p9330p0949
50189A158036o2191n4252m7169l9658l0927k2252j5921j3109j3649j7118k2681
50178H19109k8176l0988l0369k7777k4665k1069j6783j2673r710p565n312l058
50166F00964j653r95O3J932L608M217M344N050O347P489Q352R480J0943J2030
50152F72171J2215J1722J0909R779Q237O336M063J434r78k253k227j751j472q40
$$ y = [833421, 826293, 820292, 816066, 813937, 813736, 815023, 817662, 822192, 829452, 839901, 853720, 871633, 895065, 925100, 961735, 1004581, 1053790, 1109569, 1171080, 1236487, 1303817, 1370903, 1434711, 1491946, 1540851, 1581885, 1616639, 1646945, 1675088, 1703583, 1733733, 1764724, 1794307, 1819431, 1835666, 1837288, 1819609, 1781489, 1725143, 1654081, 1572104, 1483774, 1394301, 1308315, 1228985, 1158036, 1095845, 1041593, 994424, 954766, 923839, 901587, 885666, 872557, 858908, 841790, 819109, 790933, 759945, 729576, 701799, 677134, 656065, 639282, 626609, 616899, 609334, 604022, 600964, 599311, 598316, 598379, 600311, 603919, 608136, 612480, 617530, 623877, 631366, 639718, 649198, 660141, 672171, 684386, 696108, 707017, 716796, 725033, 731369, 735432, 736866, 735888, 733635, 731408, 729657, 728185, 727345]
50138G27345R94L855O690Q751R983J0539J0552J0275R805Q794O996M989L777L735
50124H27080M482N582O794P749Q217Q655R789J1592J3394J5098J7470K1012K5336
50111I82250K9924L4811M0092M5520N1091N7516O5540P5282Q6489R8826J11230
50100A678571J21681J28318J30532J28410J21816J11081R8280Q6745P8926P5251
50090B759611P4934P6798P9024P8816P3188O0162L9342J1945j9346n1035q0028
50079C103411j04486j23661j37290j45424j48570j47612j43432j36810j28499
50070A887627j19059j08593r6882q3997p0693n8117m7206l8420l1849k7272k4145
50059A181394k1841k0099j8981j8316j7464j5946j4029j2262j0701r124p915p952
$$ y = [727345, 728339, 732194, 738884, 747635, 757618, 768157, 778709, 788984, 798789, 807583, 814579, 819568, 823345, 827080, 831562, 837144, 843938, 851687, 859904, 868559, 878348, 889940, 903334, 918432, 935902, 956914, 982250, 1012174, 1046985, 1087077, 1132597, 1183688, 1241204, 1306744, 1382026, 1468515, 1567341, 1678571, 1800252, 1928570, 2059102, 2187512, 2309328, 2420409, 2518689, 2605434, 2684360, 2759611, 2834545, 2911343, 2990367, 3069183, 3142371, 3202533, 3241875, 3253820, 3234474, 3183439, 3103411, 2998925, 2875264, 2737974, 2592550, 2443980, 2296368, 2152936, 2016126, 1887627, 1768568, 1659975, 1563093, 1479096, 1408403, 1350286, 1303080, 1264660, 1232811, 1205539, 1181394, 1159553, 1139454, 1120473, 1102157, 1084693, 1068747, 1054718, 1042456, 1031755, 1022631, 1014716, 1006764]
50047A006764r396j1188j2079j1827j1077j0612j1004j2463j4374j5392j4625
50036H72727j2549j0312q437o813n573m973m570l531j936p92m45K2J230K257J878
50021H18183L59j016j823k676l671l909l069k344k955m354m877l991l004l367
50007G77486m922o232o282n364m314l263j444J785N976R868J2649J4694J6854
49994H07491J9256K1129K1786K1476K1096K1362K2507K4646K8037L2731L8164
49983A079681M3446M8180N2794N7718O2247O4655O3700N9674N3817M6974L9529
49972A672415L2439K7505K6168K8341L2610L6985L9098L6365K6988J1083r528
49961A960469l2494n5516p6093r1689j00767j03424j00808r4221q4934p4342o3653
$$ y = [1006764, 997368, 986180, 974101, 962274, 951197, 940585, 929581, 917118, 902744, 887352, 872727, 860178, 849866, 841429, 834616, 829043, 824070, 819500, 815969, 814033, 813241, 812796, 812818, 814048, 816305, 818183, 818542, 817526, 815703, 813027, 809356, 805447, 802378, 800034, 797079, 792725, 787848, 783857, 780853, 777486, 772564, 766332, 760050, 754686, 750372, 747109, 745665, 747450, 753426, 763294, 775943, 790637, 807491, 826747, 847876, 869662, 891138, 912234, 933596, 956103, 980749, 1008786, 1041517, 1079681, 1123127, 1171307, 1224101, 1281819, 1344066, 1408721, 1472421, 1532095, 1585912, 1632886, 1672415, 1704854, 1732359, 1758527, 1786868, 1819478, 1856463, 1895561, 1931926, 1958914, 1969997, 1960469, 1927975, 1872459, 1796366, 1704677, 1603910, 1500486, 1399678, 1305457, 1220523, 1146181, 1082528]
49950A082528n3436m3741l4734k6940k0893j6704j4053j2541j1928j1933j1909
49939H23716j1083r422q043q279j0374j3529j7106k1014k4691k6578k5456k1981
49927F26160j8159j5255j2968j0556q096o186m905l635j840K88J980K612K194
49914E51634J300N89M55J030K184L471M276M339M053M042M567N555O976Q816J0840
49899F14127J2665J4019J4555J3633J0977P451M551K818J472k16j866k815l356
49886F88015m393o247q546j1078j3917j6660j8402j8699j8013j6899j5349j3280
49874E26532j1201r763q904p918o351m425k579r46N57J906K921L533L912M282
49860D91556M685N024N317N801O628P620Q515R408J0663J2353J3983J4815J4325
$$ y = [1082528, 1029092, 985351, 950617, 923677, 902784, 886080, 872027, 859486, 847558, 835625, 823716, 812633, 803211, 795168, 786889, 776515, 762986, 745880, 724866, 700175, 673597, 648141, 626160, 608001, 592746, 579778, 569222, 561126, 554940, 550035, 546400, 544560, 544848, 546828, 549440, 551634, 552934, 553523, 553978, 555008, 557192, 560663, 564939, 569278, 573331, 577373, 581940, 587495, 594471, 603287, 614127, 626792, 640811, 655366, 668999, 679976, 687427, 691978, 694796, 696268, 696052, 694186, 691371, 688015, 683622, 677375, 668829, 657751, 643834, 627174, 608772, 590073, 572060, 555161, 539812, 526532, 515331, 505568, 496664, 488746, 482395, 477970, 475391, 474445, 475002, 476908, 479829, 483362, 487274, 491556, 496241, 501265, 506582, 512383, 519011, 526631, 535146, 544554, 555217, 567570, 581553, 596368, 610693]
49847F10693J2353R146N446K322N69K06M42J43j527m501p708r889j0608j0364
$$ y = [610693, 623046, 632192, 637638, 639960, 640529, 640735, 641177, 641320, 639793, 635292, 627584, 617695, 607087, 596723]
$$ [...]
##END NTUPLES=NMR SPECTRUM
##END=
