
##TITLE=AC1370_2394_7221551_PFWnt8R9C4
##JCAMPDX= 6.0         $$ Bruker NMR JCAMP-DX V2.0
##DATA TYPE= NMR SPECTRUM
##DATA CLASS= NTUPLES
##ORIGIN= BRUKER
##OWNER= Administrator
$$ 1.72 TOPSPIN		Version 2.1
$$ 2012-12-13 23:34:10.612 -0500  Administrator@X
$$ Compression mode = diff/dup
##.OBSERVE FREQUENCY= 400.02188249412
##.OBSERVE NUCLEUS= ^1H
##.ACQUISITION MODE= SIMULTANEOUS (DQD)
##.ACQUISITION SCHEME= undefined
##.AVERAGES= 8
##.DIGITISER RES= 22
##SPECTROMETER/DATA SYSTEM= spect
##.PULSE SEQUENCE= zg30
##.SOLVENT NAME= COFFEE_meoh
##.SHIFT REFERENCE= INTERNAL, COFFEE_meoh, 1, 14.98509
##AUDIT TRAIL= $$ (NUMBER, WHEN, WHO, WHERE, PROCESS, VERSION, WHAT)
$$ ##TITLE= Audit trail, TOPSPIN		Version 2.1
$$ ##JCAMPDX= 5.01
$$ ##ORIGIN= Bruker BioSpin GmbH
$$ ##OWNER= Administrator
$$ $$ E:\/data/COFFEE/nmr/AC1370_2394_7221551_PFWnt8R9C4/20/pdata/1/auditp.txt
$$ ##AUDIT TRAIL=  $$ (NUMBER, WHEN, WHO, WHERE, PROCESS, VERSION, WHAT)
(   1,<2012-12-13 23:34:02.471 -0500>,<Administrator>,<X>,<go>,<TOPSPIN 2.1>,
      <created by zg
	started at 2012-12-13 23:32:55.862 -0500,
	POWCHK enabled, PULCHK disabled,
       configuration hash MD5:
       86 BA 57 50 F2 9D 5C 9B 26 00 A9 28 5F 66 2E 89
       data hash MD5: 64K
       B5 F1 C6 AB 57 FE 7C 84 16 82 C7 08 44 29 84 A6>)
(   2,<2012-12-13 23:34:05.627 -0500>,<Administrator>,<X>,<proc1d>,<TOPSPIN 2.1>,
      <Start of raw data processing
       efp LB = 0 FT_mod = 6 PKNL = 1 PHC0 = 0 PHC1 = 0 SI = 32K 
       data hash MD5: 32K
       99 7E 33 A2 79 E8 4F EB 79 DC 71 52 45 50 FC E4>)
(   3,<2012-12-13 23:34:06.112 -0500>,<Administrator>,<X>,<proc1d>,<TOPSPIN 2.1>,
      <pk PHC0 = 99.36584 PHC1 = 0 
       data hash MD5: 32K
       AA DA E3 52 7A 41 15 3A A8 A2 88 D7 6B 0F C9 49>)
(   4,<2012-12-13 23:34:06.346 -0500>,<Administrator>,<X>,<proc1d>,<TOPSPIN 2.1>,
      <abs ABSG = 1 
       data hash MD5: 32K
       BE 20 08 DA D4 AA D5 69 DB 13 9B B1 00 B1 9D CC>)
(   5,<2012-12-13 23:34:06.487 -0500>,<Administrator>,<X>,<proc1d>,<TOPSPIN 2.1>,
      <abs ABSG = 2 
       data hash MD5: 32K
       3A 93 9A 1F 08 BB AE 90 E2 1A 01 9E 87 B6 8E 85>)
(   6,<2012-12-13 23:34:06.627 -0500>,<Administrator>,<X>,<proc1d>,<TOPSPIN 2.1>,
      <abs ABSG = 3 
       data hash MD5: 32K
       AF E5 10 CF AD 46 68 17 65 D6 AE 60 E8 6C 49 E9>)
(   7,<2012-12-13 23:34:06.783 -0500>,<Administrator>,<X>,<proc1d>,<TOPSPIN 2.1>,
      <abs ABSG = 4 
       data hash MD5: 32K
       B7 A8 AB E7 BC 78 EB 2D D3 46 4B BC 53 2D 44 C2>)
(   8,<2012-12-13 23:34:06.924 -0500>,<Administrator>,<X>,<proc1d>,<TOPSPIN 2.1>,
      <abs ABSG = 5 
       data hash MD5: 32K
       F7 F3 97 2D 20 79 BB B4 D3 D0 55 88 67 BC 7F F0>)
$$ ##END=
$$ 
$$ $$ hash MD5
$$ $$ 9F EF FE 17 60 19 70 E5 9C E0 87 50 D5 05 22 E0
##$RELAX= 
##$RELAX= 
##$RELAX= 
##$RELAX= 
##$RELAX= 
##$RELAX= 
##$RELAX= 
##$RELAX= 
$$ Bruker specific parameters
$$ --------------------------
##$DU= <E:\>
##$EXPNO= 20
##$NAME= <AC1370_2394_7221551_PFWnt8R9C4>
$$ [...]
150 150 150 150 150 150 150 150
##$TP07= 0
##$TPNAME0= <>
##$TPNAME1= <>
##$TPNAME2= <>
##$TPNAME3= <>
##$TPNAME4= <>
##$TPNAME5= <>
##$TPNAME6= <>
##$TPNAME7= <>
##$TPOAL= (0..7)
0.5 0.5 0.5 0.5 0.5 0.5 0.5 0.5
##$TPOFFS= (0..7)
0 0 0 0 0 0 0 0
##$TUNHIN= 0
##$TUNHOUT= 0
##$TUNXOUT= 0
##$USERA1= <user>
##$USERA2= <user>
##$USERA3= <user>
##$USERA4= <user>
##$USERA5= <user>
##$V9= 5
##$VALIST= <valist>
##$VCLIST= <CCCCCCCCCCCCCCC>
##$VD= 0
##$VDLIST= <DDDDDDDDDDDDDDD>
##$VPLIST= <PPPPPPPPPPPPPPP>
##$VTLIST= <TTTTTTTTTTTTTTT>
##$WBST= 1024
##$WBSW= 4
##$XGAIN= (0..3)
0 0 0 0
##$XL= 0
##$YL= 0
##$YMAX_a= 619455
##$YMIN_a= -529185
##$ZGOPTNS= <>
##$ZL1= 120
##$ZL2= 120
##$ZL3= 120
##$ZL4= 120
##$ABSF1= 14.98509
##$ABSF2= -5.573092
##$ABSG= 5
##$ABSL= 3
##$ALPHA= 0
##$AQORDER= 0
##$ASSFAC= 0
##$ASSFACI= 0
##$ASSFACX= 0
##$ASSWID= 0
##$AUNMP= <proc_prof1d_extract_pilot.lims>
##$AXLEFT= 0
##$AXNAME= <>
##$AXNUC= <1H>
##$AXRIGHT= 0
##$AXTYPE= 0
##$AXUNIT= <>
##$AZFE= 0.1
##$AZFW= 0.1
##$BCFW= 0
##$BC_mod= 0
##$BYTORDP= 0
##$COROFFS= 0
##$CY= 15
##$DATMOD= 1
##$DC= 0
##$DFILT= <>
##$DTYPP= 0
##$F1P= 0
##$F2P= 0
##$FCOR= 0.5
##$FTSIZE= 32768
##$FT_mod= 6
##$GAMMA= 0
##$GB= 0
##$INTBC= 1
##$INTSCL= 1
##$ISEN= 128
##$LB= 0
##$LEV0= 0
##$LPBIN= 0
##$MAXI= 10000
##$MC2= 0
##$MEAN= 0
##$ME_mod= 0
##$MI= 0
##$NCOEF= 0
##$NC_proc= -8
##$NLEV= 6
##$NOISF1= 0
##$NOISF2= 0
##$NSP= 0
##$NTH_PI= 0
##$NZP= 0
##$OFFSET= 14.98509
##$PC= 1
##$PHC0= 99.36584
##$PHC1= 0
##$PH_mod= 1
##$PKNL= yes
##$PPARMOD= 0
##$PPDIAG= 0
##$PPIPTYP= 0
##$PPMPNUM= 2147483647
##$PPRESOL= 1
##$PSCAL= 4
##$PSIGN= 0
##$PYNMP= <proc.py>
##$REVERSE= no
##$SF= 400.02
##$SI= 32768
##$SIGF1= 0
##$SIGF2= 0
##$SINO= 400
##$SIOLD= 32768
##$SPECTYP= <>
##$SREGLST= <1H.CDCl3>
##$SSB= 0
##$STSI= 32768
##$STSR= 0
##$SW_p= 8223.68421052631
##$SYMM= 0
##$S_DEV= 0
##$TDeff= 65536
##$TDoff= 0
##$TI= <>
##$TILT= no
##$TM1= 0
##$TM2= 0
##$TOPLEV= 0
##$USERP1= <user>
##$USERP2= <user>
##$USERP3= <user>
##$USERP4= <user>
##$USERP5= <user>
##$WDW= 1
##$XDIM= 32768
##$YMAX_p= 468242565
##$YMIN_p= -748678
##$CURPLOT= <Network HP LaserJet P1505>
##$CURPRIN= <$Network HP LaserJet P1505>
##$DFORMAT= <normdp>
##$LAYOUT= <+/1D_H.xwp>
##$LFORMAT= <normlp>
##$PFORMAT= <normpl>
##$SURQMSG= 1
$$ End of Bruker specific parameters
$$ ---------------------------------
##NTUPLES= NMR SPECTRUM
##VAR_NAME=  FREQUENCY,     SPECTRUM/REAL,   SPECTRUM/IMAG
##SYMBOL=    X,             R,               I
##VAR_TYPE=  INDEPENDENT,   DEPENDENT,       DEPENDENT
##VAR_FORM=  AFFN,          ASDF,            ASDF
##VAR_DIM=   32768,         32768,           32768
##UNITS=     HZ,            ARBITRARY UNITS, ARBITRARY UNITS
##FACTOR=    0.250966925370066, 1,           1
##FIRST=     8223.43324360094, 342400,       -151816
##LAST=      0,             94315,           -168059
##MIN=       0,             -748678,         0
##MAX=       8223.43324360094, 468242565,    0
$$ Real data points
##PAGE= N=1
##DATA TABLE= (X++(R..R)), XYDATA
$$ [...]
19549c06631A31609a69879G6962J05266g1429o078n147B07991p0669a22311n2236
19538a74547e6746l89896G9377c453j8202l07320P2748C19282a75776k48070K03607
19527b20239C571b28263A82522b87672a09411C8670a43878a9473m3889j70901
19517b34263R9535A51311i2572l23F6861B8768Q3053J03825b90625N5129G6159
19505I9020b7955B8557a24659j58692H4779e4059b4273l9953j13636j78040A65113
19493a2084p655k41180b5341A07845a03935J1575k8838A30906A7013b47525B3670
19481F1732A1687a98425j23054a18579A610K10442L6105g3120I4757N1908b12446
19469D5186B0549F221b14540n8792a2308H1644a97502K7854A90821M9725c7404
$$ y = [-306631, 131609, -169879, 76962, 182228, -71429, -77507, -82654, 207991, 137322, -122311, -174547, -56746, -446642, 79377, -3453, -21655, -328975, -256227, 319282, -175776, -423846, -220239, 3571, -228263, 182522, -287672, -109411, 38670, -143878, -19473, -63362, -234263, -134728, 151311, -92572, -92895, 66861, 28768, 111821, 215646, -290625, -235496, 76159, 99020, -27955, 28557, -124659, -283351, 84779, -54059, -24273, -64226, -177862, -355902, 165113, -12084, -19739, -260919, -25341, 107845, -103935, -92360, -121198, 130906, 17013, -247525, 23670, 61732, 11687, -198425, -321479, -118579, 1610, 212052, 248157, -73120, 94757, 146665, -212446, 45186, 20549, 6221, -214540, -273332, -12308, 81644, -197502, -169648, 190821, 240546, -37404]
19457a43315j11366g1719k0098o2693n1226A35823K9659l2440a0535j46660j56306
19446c13501H2184b942C60541I428K56555A09555a40950I4202N0919h1465A20306
19434A67835a4459k1073j34766E5294a85384P3251j89269C12078e1199m3304B13267
19422f8198j15386c5093k21540H6004h5775j06235j02285L3309f2045B18289c25013
19410a7194n5935B53550h0727B9716c36922D0095b4474l91499i816q9528j63776
19399b63120O7107b648j05615M4975c0692A75010E7975e6826a8363B19434b1121
19387B8832a74861g2665G4591J32836d9716D7553K1402k064J7382b63560B02577
19375a91235P1080k36574a75086A03395f864k88o6041l8914A48801J90246A14796
$$ y = [-143315, -254681, -71719, -91817, -154510, -205736, 135823, 165482, 133042, -10535, -157195, -313501, 82184, -2942, 360541, 9428, 265983, 109555, -140950, 94202, 145121, -81465, 120306, 167835, -14459, -35532, -170298, 55294, -185384, -112133, -301402, 312078, -51199, -94503, 213267, -68198, -183584, -35093, -256633, 86004, -85775, -192010, -294295, -260986, -62045, 218289, -325013, -17194, -73129, 253550, -80727, 29716, -336922, 40095, -24474, -415973, -9816, -99344, -263120, -196013, -2648, -108263, -63288, -30692, 175010, 57975, -56826, -18363, 219434, -21121, 28832, -174861, -72665, 74591, 207427, -49716, 47553, 68955, 66891, 84273, -263560, 202577, -191235, -120155, -356729, -175086, 103395, -6864, -7152, -73193, -112107, 148801, 339047, 114796]
19363a75929G368e6025m83078K34907e6459j47269A99318c68468R8702l7877A95945
19351b65847e1443j38470R2132j9254H2835b59919A30496m9687a12941B3987J03165
19340A27152b25772G0555b67138I2650a37646b198p6724L2518D1810a86858A04288
19328b55556j0600o4981g4201j51004A54087c43709a63876q4112A56478G681b79634
19316B02627i1513a7186B66244d1077G7995J39737a6820j35560D8177a75887A13671
19304A11170k3578a24341q5513B57112a2908k80762A15775a85161j22315j13604
19294d21080C06978i4534B59659a36389b2200B028N678J26273c21134B53661a52926
19282a85275k04595g5498A19632d474k66392G1140g7464B3634b02004c9613l05297
$$ y = [-175929, 7368, -56025, -539103, -304196, -56459, -203728, 199318, -368468, -269766, -307643, 195945, -265847, -51443, -189913, -97781, -117035, 82835, -259919, 130496, 80809, -112941, 23987, 127152, -225772, 70555, -267138, 92650, -137646, -2198, -78922, -46404, 41810, -186858, 104288, -255556, -266156, -331137, -74201, -225205, 154087, -343709, -163876, -247988, 156478, 7681, -279634, 202627, -91513, -17186, 266244, -41077, 77995, 217732, -16820, -152380, 48177, -175887, 113671, 111170, 87592, -124341, -209854, 257112, -12908, -293670, 115775, -185161, -307476, -421080, 306978, -94534, 259659, -136389, -22200, 2028, 7706, 133979, -321134, 253661, -152926, -185275, -389870, -75498, 119632, -4474, -270866, 71140, -77464, 23634, -202004, -39613, -344910]
19271c44910b355C4984J91097a12144B0966a5526j4322D009b27092a2396j12000
19260a24396H3411a77235d6033C2594d06042J89693g2965k78361a18549q6125
19250b04674m3775a19570n7983O6468j21528H7485L2815p461k7562a33965d5793
19238c2099A68193b95156D6283d1024r9133C8783g4072B44266A00994i4089M6591
19227d7498q1103B24474a16132O958b2184n17830a44382j42003J04014g1241I5009
19215B48704b65313B4939a12325h339k08191l9797k7156Q5361P7250k5997N072
19204a41797C22060b56504E5990a13308o0249P7087B689a46560A01414g4797I5659
19192e5922H3473J30919A4945o637J02060J750f5331j8077L4657F9895g7824C3840
$$ y = [-344910, -2355, 34984, 226081, -112144, 20966, -15526, -29848, 4009, -227092, -12396, -124396, 83411, -177235, -46033, 32594, -406042, -216349, -72965, -351326, -118549, -204674, -248449, -119570, -177553, -111085, -232613, 87485, 120300, 112839, 85277, -133965, -45793, -32099, 168193, -295156, 46283, -41024, -140157, 38783, -74072, 244266, 100994, -94089, -47498, -128601, 224474, -116132, -109174, -22184, -540014, -144382, -286385, -182371, -71241, 95009, 248704, -265313, 24939, -112325, -8339, -216530, -256327, -283483, -198122, -120872, -146869, -141797, 322060, -256504, 55990, -113308, -173557, -96470, 2689, -146560, 101414, -74797, 95659, -55922, 83473, 214392, 14945, 8308, 110368, 112118, -65331, -83408, -48751, 69895, -77824, 33840]
19179f3175j4398k17033A41088J35204b88194g9473b3729j34895N6206A15146
19168A00184a18014M5021b9454N414j21763L6463A67067m2071a51946D24047a5972
19156a13945A26419L1168f7499D9110a29131l9850K874g6834b3686A78006i0858
19144A23559b27780H4454C3359g8666r2276C94436h5292k58443A87302a93622
19133a76938a4930j30941p1664j42557E5869f2177j02694p6049m8735A61093g2497
19121B53786h9082a7848j55718o3796k30659C1728c45783g1709B31534A04964
19110g4521j1477r2508N0820a3562F4790b64475A23569P4517b84870c7602j23066
19099a60668J3255A23663c27783a7668A20876c49879J41782d4071m1849j11174
$$ y = [-63175, -77573, -294606, 141088, 276292, -288194, -79473, -23729, -158624, -102418, 115146, 100184, -118014, -72993, -29454, -24040, -145803, -109340, 167067, 124996, -151946, 424047, -15972, -113945, 126419, 157587, -67499, 49110, -129131, -168981, -166107, -76834, -23686, 178006, -90858, 123559, -227780, 84454, 33359, -78666, -170942, 394436, -85292, -343735, 187302, -193622, -176938, -14930, -145871, -217535, -360092, 55869, -62177, -164871, -240920, -289655, 161093, -72497, 253786, -89082, -17848, -173566, -237362, -468021, 31728, -345783, -71709, 231534, 104964, -74521, -85998, -178506, -127686, -13562, 64790, -264475, 123569, 198086, -284870, -37602, -160668, -147413, 123663, -327783, -17668, 120876, -349879, -208097, -44071, -85920, -197094]
19089a97094P5758q2786c4070P526L656j68516B24845b8034B05314a19319p4330
19078a93649o0758h9016K8319q7718f2732B52354j22090c71913g1591j57323K6683
19067b02231q6213e5214A34875O123C0929e7752A43646c47688A7287a54658A74098
19055G5871b50149E6090a97599O2565B5722b10196L4729N6793p7950C6812c6971
19043c3208B29397a59561e0217j62085A56605B21P1047R6477b29895H6873f6260
19031G4857L9401a15739o1151f7058l6639A38921d2039F9463L7297Q7155b18701
19019A4446a0952j60272n26988I3278a30580L7897B35090J35158a65469C46017
19008A33514a9071B18815b49558h3790B205M4282a24585B8279J06890h2281k66621
$$ y = [-197094, -121336, -204122, -34070, -26544, -22888, -191404, 224845, -28034, 205314, -119319, -193649, -254407, -89016, -60697, -148415, -62732, 252354, 130264, -371913, -71591, -228914, -202231, -288444, -55214, 134875, 140998, 30929, -57752, 143646, -347688, 17287, -154658, 174098, 75871, -250149, 56090, -197599, -135034, 25722, -210196, -175467, -118674, -196624, 36812, -36971, -33208, 229397, -159561, -50217, -212302, 156605, 221, 71268, 167745, -229895, 86873, -66260, 74857, 114258, -115739, -176890, -67058, -103697, 138921, -42039, 69463, 106760, 193915, -218701, 14446, -10952, -171224, -698212, 93278, -130580, -92683, 235090, 370248, -165469, 346017, 133514, -19071, 218815, -249558, -83790, 2205, 46487, -124585, 28279, 135169, -82281, -348902]
18997c48902f2811A53848F2593c03591J2363E20819i0222K5178k22999i8150B35456
18985a3726D4072e9688o0900C8471G398a71316O8896A88459G9452a54500m0194
18974a94694c7408m1396B98630a58166j1451E2601d1923C9251K8632A4604a25774
18962h0909K5466B18160b24340I8980C6238K9726e1909A02040a85323I3354b24581
18950A25539b458A03980a77640j21874h817F1172c38347g8160B9072J65482b44228
18938B3058c157j69793o1723G096g6053I6300c6611A92793H5281c06976J10519
18927a96457L9240g2727l04138a11431j32431R9918B78778a28096B12721a26759
18916c23982J32706F4922L1157b20600N0288A41241f6435C99e1142j62461J3723
$$ y = [-348902, -62811, 153848, 62593, -303591, -291228, 520819, -90222, -65044, -288043, -98150, 235456, -13726, 44072, -59688, -120588, 38471, 7398, -171316, -102420, 188459, 79452, -154500, -194694, -37408, -78804, 298630, -158166, -169617, 52601, -41923, 39251, 67883, 14604, -125774, -80909, -55443, 218160, -224340, 98980, 36238, 65964, -51909, 102040, -185323, 93354, -224581, 125539, -2458, 103980, -177640, -299514, -8817, 61172, -338347, -78160, 29072, 194554, -244228, 23058, -3157, -172950, -234673, 7096, -76053, 96300, -36611, 192793, 85281, -306976, -196457, -157217, -72727, -376865, -111431, -243862, -143944, 278778, -128096, 212721, -126759, -323982, -191276, 64922, 96079, -220600, -170312, 141241, -66435, 399, -51142, -213603, -199880]
18905a99880B44183G3497e0943B23636a24059I0015b1757k69454A29593c09624
18894e246j51005A74153e0947A08478A3103a20106K5413r578r8959g6020k77143
18883c53163J36228B77700n5557a07223F4993b58909A57587o5257B8008a70174
18872f05469a33234D14394b2970j50298a316o6180A13303e49733K64529j62124
18862d47328A25810b648l75251a33987A71003h6701I7700a47463j7516f0318A3068
18850b89299I2892a9880B73482e5132j90022Q4525m1064g625D5752b36344E6779
18838A60207l8488c35669e8822A18231e2346l3907m4800b3859j95957N0187g2591
18826d03721b1479j17438j73891j0672K0144J42785F0489a94714A17332b30975
$$ y = [-199880, 244183, 73497, -50943, 223636, -124059, 90015, -21757, -291211, 129593, -309624, -5246, -156251, 174153, -50947, 108478, 13103, -120106, -94693, -104271, -203230, -76020, -353163, -216935, 277700, 222143, -107223, 64993, -258909, 157587, 92330, 28008, -170174, -605469, -133234, 414394, -22970, -173268, -1316, -67496, 113303, -549733, -285204, -447328, 125810, -2648, -377899, -133987, 171003, -86701, 97700, -147463, -164979, -60318, 13068, -289299, 92892, -19880, 273482, -55132, -245154, -160629, -201693, -7625, 45752, -236344, 56779, 160207, 121719, -335669, -58822, 118231, -52346, -86253, -131053, -23859, -219816, -169629, -72591, -403721, -21479, -138917, -312808, -323480, -303336, -160551, 60489, -194714, 117332, -230975]
18815a39726G8833J92872J48661j61820d4316C35N3199N95101c3829l9314m3450
18804a16593A20465b11095R4984C9856a48080B70622j25331b11803I2283N5055
18794A47338A7785b90992N6384a9782H317b62646e2409D3706a6087k90340H4083
18782a69830c5302p2014A04109a69016B34231G7895a08211q2929L6972a063j90567
18771a91630A80330q2326a08486b4435B80423g7325n5538k5511j34496B37665
18760i4420r6515A36822b23916B63863a57810m8816C9969M1744a29041M7296J2363
18749f9382B10435o1405M4632c5147k1078q5417J8832j74664A56865g0517K5521
18738d4996j08053n1145a768A81118H3700a81990j25993a13892A29648M0519c1251
$$ y = [-139726, 78833, 271705, 420366, 258546, -44316, 335, 53534, 648635, -33829, -73143, -116593, 120465, -211095, -116111, 39856, -148080, 270622, 145291, -211803, 92283, 147338, 17785, -290992, -234608, -19782, 8317, -262646, -52409, 43706, -16087, -306427, 84083, -169830, -35302, -107316, 104109, -169016, 234231, 77895, -108211, -191140, -154168, -1063, -191630, 180330, 98004, -108486, -24435, 280423, -77325, -132863, -158374, -292870, 237665, -94420, -190935, 136822, -223916, 263863, -157810, -206626, 39969, 81713, -129041, -81745, -69382, 210435, 149030, 193662, -35147, -56225, -141642, -122810, -297474, 156865, -70517, -44996, -153049, -204194, -1768, 181118, 83700, -181990, -307983, -113892, 129648, 170167, -31251]
18726f8116j14260E2835M7755p701a98784A45605N9280N5233h9501R557C94760
18714b01912e7488A27230a92234A71253a58141d9557E1879a83504l66835B08692
18703F7016i7554B6952K30018A04347M6461c84696a03727l5548K752j06021P2063
18692a70481P8782E9465a17401j50864N4309A85570b45833R89j19536j3170h743
18680a3005C02277F1370b01467j57325D7072O4048h2289A97838q2534b98492E134
18668a31120j74519A19663a88558A16091a78251j96283D3166f6235p8986n7068
18658b02289r6891J18068C0783A1793P8292c70878g744j61592j98499A66596j5850
18647A50746a16205J3000K2561m63178A90448a79589J7394B18626a20667n6565
$$ y = [-68116, -182376, 52835, 100590, 92889, -198784, 145605, 204885, 260118, -89501, -79944, 394760, -201912, -57488, 127230, -192234, 171253, -158141, -49557, 51879, -183504, -550339, 208692, 67016, -97554, 26952, 256970, 104347, 150808, -384696, -103727, -139275, -136523, -242544, -170481, -91699, 59465, -117401, -268265, -213956, 185570, -245833, -244844, -364380, -377550, -8743, -13005, 302277, 61370, -201467, -358792, 47072, 111120, -82289, 197838, 115304, -298492, 5134, -131120, -305639, 119663, -188558, 116091, -178251, -374534, 43166, -66235, -145221, -202289, -299180, -181112, 30783, 11793, 90085, -370878, -7744, -169336, -367835, 166596, 150746, -116205, -103205, -80644, -543822, 190448, -179589, -162195, 218626, -120667, -177232]
18637a77232q0104G0829a86787B63306I0098c49002A56442b69149C4143L4397
18627F8540h4981M073J173k18601C8482a62784c2360k06073I0159a74940A2895
18615A4198b11225c4823F1212l055b11665e9275A09648a00738j24751f7359n8219
18604a25578j33872C35107g8333C79626G1802a25098B6989i9296q1371D1000a67229
18592a94139M7948A03227c0250A21622E744a2983m57316f2768m7706j60245P784
18581b62935a04161A03439b0969k11777Q2703R258A19805b19986g8354K1358j84601
18570b41597E7307f1920m9255B4686b33047B1126b16615d572B13802J95555A02673
18558B8637c3849A4518a48755l8885A62295a34751E3746h6602B435b05418C5361
$$ y = [-177232, -257336, 70829, -186787, 263306, 90098, -349002, 156442, -269149, 34143, 68540, -84981, -80908, -79735, -298336, 38482, -162784, -32360, -238433, 90159, -174940, 12895, 14198, -211225, -34823, 61212, 58157, -211665, -59275, 109648, -100738, -225489, -67359, -125578, -259450, 335107, -78333, 379626, 71802, -125098, 26989, -99296, -180667, 41000, -167229, -194139, -146191, 103227, -30250, 121622, 5744, -12983, -470299, -62768, -110474, -270719, -262935, -104161, 103439, -20969, -232746, -150043, -140785, 119805, -219986, -78354, -56996, -241597, 57307, -61920, -111175, 24686, -233047, 21126, -216615, -4572, 213802, 409357, 102673, 28637, -33849, 14518, -148755, -187640, 162295, -134751, 53746, -86602, 2435, -205418, 35361]
18546a26556k37981a09297E9614K43679G057a47870J5215C09966c25340H5720
18535E6746b93249J08343A624h0073j60144d292k1728m9531D4752b66341J05294
18524a61047B31569A8700J88286a59584A3744L1779a04045A58713f5853j38395
18514b04248e9079I3364a27200k26046B6937g844r6457A28178d25931K07359b8811
18502b07187c2494j47530A36710j5712a77236L8374J350B18428i9251q2508e1058
18490f0974m1596A09679K7286N5335a53989B74093b98215J11331M5718j10859
18480b52025P5583n561b356l0175B19601C3331J86899D5993g0661A06845a33585
18468a4526j04049j39892B83251A31523A1353c63388d8467H1721Q4137p4930a19018
$$ y = [-126556, -364537, -109297, 59614, 303293, 7057, -147870, -132655, 309966, -325340, 85720, 56746, -293249, -184906, 1624, -80073, -240217, -4292, -26020, -75551, 44752, -266341, -161047, 231569, 18700, 206986, -159584, 13744, 45523, -104045, 158713, -65853, -204248, -59079, 93364, -127200, -353246, 26937, -7844, -104301, 128178, -425931, -218572, -28811, -207187, -32494, -180024, 136710, 120998, -177236, -138862, -137512, 218428, -99251, -181759, -51058, -60974, -102570, 109679, 136965, 192300, -153989, 274093, -298215, -186884, -141166, -252025, -176442, -182003, -2356, -32531, 219601, 33331, 220230, 45993, -70661, 106845, -133585, -14526, -118575, -258467, 283251, 131523, 11353, -363388, -48467, 81721, 165858, 90928, -119018]
18456a84532A13241a19188j50457A45478a10071q5130E0604K8275c01137N748
18446b95389C9682d70078A32983g9333j41703C65611b55854B5128K30920a8010
18435G0653c22539B8419H527b13129A00785a48187c8463q2947f0542j88212M8909
18424a99845K3726K0255e9002D521a95642K533l83969c532A09309b59938d2603
18412G0368K55881j01954b03159F7170g0881I9109O0619n1546C9258a89409o7554
18401b56963C3981J09454b43440i9845j85522A25765P1449B1835a98114G7172
18390d3518j30040k29055J81597j68298B17908b86103A9702J9301d7880k9958
18380g7838c1625k12155a0311k28778H3352r822a1376j16717A45003J3916b6966
$$ y = [-184532, 113241, -119188, -269645, 145478, -110071, -195201, 50604, 78879, -301137, -295389, 39682, -470078, 132983, -79333, -221036, 365611, -255854, 25128, 256048, -18010, 70653, -322539, 28419, 8527, -213129, 100785, -148187, -38463, -121410, -60542, -248754, -199845, -176119, -155864, -59002, 4521, -195642, -193109, -577078, -3532, 109309, -259938, -42603, 70368, 326249, 224295, -203159, 67170, -70881, 99109, 159728, 108182, 39258, -189409, -256963, 33981, 143435, -243440, -99845, -285367, 125765, 197214, 21835, -198114, 77172, -43518, -173558, -402613, -221016, -389314, 217908, -286103, 19702, 39003, -47880, -77838, -31625, -243780, -10311, -239089, 83352, 73530, -11376, -128093, 145003, 158919, -26966]
18368G2320g4683E0394f3005C64896J8099a64337j36746i311l8651C9722d60114
18356e39746A83476H339c3371j79692A03805A7024g6201B06700a90629b7647I8151
18344b57811b0505j29699B32610F0237b40086J13842r7075c2639m76784A8623
18333d5257A00603K5394J59c76660h6584G5466c94408a46864D3236K16379a69909
18321b59102A5607h2557B39753b16676Q3461C8495b3109A57140a34994D0695a94114
18309A4700J06198h9715H6734J41567a18969A26371F0527a20362k65403A15088
18298a00798k0210A3572b7463r8537F6567L6489a50022A51533h2595j97863K6723
18287b53735B74482E3925c02674L9343L1034C2726b14474B01754b81092F7099
$$ y = [72320, -74683, 50394, -63005, 364896, 382995, -164337, -301083, -9311, -47962, 39722, -460114, -539746, 183476, 8339, -33371, -213063, 103805, 17024, -76201, 206700, -190629, -27647, 98151, -257811, -20505, -150204, 232610, 60237, -240086, -126244, -223319, -32639, -509423, 18623, -45257, 100603, 125997, 126156, -376660, -86584, 75466, -394408, -146864, 43236, 259615, -169909, -259102, 15607, -82557, 239753, -216676, -133215, 38495, -23109, 157140, -134994, 40695, -194114, 14700, 120898, -89715, 86734, 228301, -118969, 126371, 60527, -120362, -385765, 115088, -100798, -121008, 13572, -27463, -126000, 66567, 103056, -150022, 151533, -82595, -280458, -253735, 274482, 53925, -302674, -263331, -232297, 32726, -214474, 201754, -281092, 67099]
18276a34107G364a61684C28910a9211j73830k9402A72823d0339E0248J03089b5316
18264A94602A8847f701j65497L248e5569D83a10255m5328j53994A74975j0947
18253A64028a37786O4983A54125g5291B69868j18569B5419J12985b1784j22297
18243a44081a9652k82925O4109b5966j45074k2367L4488A55784J26523a84675
18232a69608F0498J9304b02892d7638l2892c5244m8354j9841M4900E4168P0490
18221A24658a67603e7581m11921D9837O0340J36158a54819K0488l9151A72402
18210A04588a96841A20681a24644A66894a67862j05835I4802b41864A37540K7451
18200A64991H0575h2207q278k84055G49c4952m4169A99073a99223q5157A85724
$$ y = [-134107, 7364, -161684, 328910, -19211, -193041, -222443, 172823, -40339, 50248, 153337, -25316, 194602, 18847, -6701, -172198, -168950, -55569, 483, -110255, -155583, -309577, 174975, 164028, -137786, -72803, 154125, -75291, 269868, 151299, 25419, 138404, -21784, -144081, -19652, -302577, -238468, -25966, -171040, -193407, -158919, 155784, 282307, -184675, -169608, 60498, 79802, -202892, -47638, -80530, -35244, -83598, -103439, -58539, 54168, 124658, -167603, -57581, -469502, 49837, 110177, 246335, -154819, -134331, -173482, 172402, 104588, -196841, 120681, -124644, 166894, -167862, -273697, 94802, -241864, 137540, 164991, 80575, -82207, -90485, -374540, 749, -34952, -79121, 199073, -199223, -284380, 185724]
18188b18441a02468D2737O8499a33976A22476d37308a0072k76165O9182h6824
18177b11873d8607q7355d3316B8127a68697K7542A5628f6778A53650a50290M7355
18166a02935H5643B4599b50598K7264L9605A66430p0080P0816J28192c74320D9063
18154g1362l6324N0901j41065A54576a11530B12599c8571j22280e1815A36806
18143B603J72943H6781J8218m4294P4330l5789l5697A0598i9149m7142A94043
18131A20036g6187j8349A79263c6166j71217B09156b00440i8208j86509p9418
18121c64135A08870J71114j7962G1288b19015b2802H8760f0734H3518a5095j53993
18110a69088D742b5359p1957D5140f8573o2217K8550a6033r2278H5945a22942
$$ y = [-218441, -102468, 42737, 111236, -133976, 122476, -437308, -10072, -286237, -217055, -86824, -211873, -48607, -135962, -43316, 28127, -168697, -141155, 15628, -66778, 153650, -150290, -102935, 85643, 24599, -250598, -223334, -183729, 166430, 96350, 167166, 295358, -374320, 49063, -71362, -107686, -56785, -197850, 154576, -111530, 212599, -38571, -160851, -51815, 136806, 2603, 175546, 86781, 104999, 60705, 135035, 99246, 63549, 10598, -99149, -146291, 194043, 120036, -76187, -94536, 179263, -36166, -207383, 209156, -200440, -98208, -284717, -364135, 108870, 279984, 262022, 71288, -219015, -22802, 88760, -60734, 83518, -15095, -169088, 4742, -25359, -97316, 45140, -68573, -130790, -102240, -16033, -108311, 85945, -122942]
18098A67458h2740L8775A51126J31388b1209q0902A04561K06775a01680A55770
18087b95766i0921D2108b18718A25502L9555a2028l1997l5397l8472G0723L84902
18076D55625c68203A48462b36531A61456b61584k3897h5627E301a47350N3353
18066i3997j27221j58471g0369A91647a72509G0663h8098A02987B3172a62276
18055C1302Q7274C7295b13593F0452M9310a62410b5604G0310a77500C10801d7760
18043B31554R1196b53814l8373d8656C00771b63528B33107G721f8004L3942m5924
18032g9986F986P7403l5290N9305i2031F6746c17624g1222B67095a65818p7593
18021b43411E3560a94970A09689h2918a9109j34712j83373J64574J1454j8773
$$ y = [167458, -82740, -43965, 151126, 282514, -21209, -102111, 104561, 311336, -101680, 155770, -295766, -90921, 42108, -218718, 125502, 165057, -12028, -44025, -79422, -117894, 70723, 455625, -368203, 148462, -236531, 161456, -261584, -285481, -85627, 5301, -147350, -93997, -221218, -379689, -70369, 191647, -172509, 70663, -88098, 102987, 23172, -162276, 31302, 118576, 37295, -213593, 60452, 109762, -162410, -25604, 70310, -177500, 310801, -47760, 231554, 322750, -253814, -292187, -48656, 300771, -263528, 233107, 7721, -68004, -34062, -79986, 6986, 84389, 49099, 108404, -92031, 66746, -317624, -71222, 267095, -165818, -243411, 53560, -194970, 109689, -82918, -19109, -153821, -337194, -172620, -161166, -179939]
18011a79939c7855l0169l69912a50826f0717A76311a02627a8788p7984o1490N4801
18000a03461k9028D3390O5604o83d1602F1241a35074B32561d4112r5423A45530
17988c07151E3683c5185o1114H8803B480J05147a61154h0552b3553k8230j99966
17977b51749A71265c24051J2626l32052B5651b18139A00994L33201h1216B91893
17966B50321I3560i2319J9108A03958b4866A1986K12472H1795i0448A66530Q5573
17955B52103b83400J28179H1265B3942c33992m9481a34643M6224J1370A39404
17944b14016Q1115e5898I4138J46386e7030G4454C4798J35984B1645a15164M5516
17933f9648j13624B75115b18695D784K26675b41921R6771B11736a42040l9688
$$ y = [-179939, -37855, -68024, -437936, -150826, -60717, 176311, -102627, -18788, -96772, -158262, -103461, -132489, 43390, 108994, 108311, -41602, 61241, -135074, 232561, -44112, -139535, 145530, -307151, 53683, -35185, -96299, 88803, 2480, 107627, -161154, -80552, -23553, -51783, -251749, 171265, -324051, -311425, -643477, 25651, -218139, 100994, 434195, -81216, 291893, 250321, 93560, -92319, -73211, 103958, -24866, 11986, 224458, 81795, -90448, 166530, 252103, -283400, -155221, 81265, 23942, -333992, -383473, -134643, -88419, -77049, 139404, -214016, -132901, -55898, 94138, 240524, -57030, 74454, 34798, 170782, 21645, -115164, -69648, -183272, 275115, -218695, 4784, 231459, -241921, -145150, 211736, -142040, -181728]
17923a81728c8754A00378k0185b5031o852n8545D9687a27026k0103C19171a93725
17911H8809a0817j7174n6465A08442g7332D8868J22379f1147q1555D8115K1155
17900F9270J3186a28584A10926d00985E3494b30706k33421A5540i7537j84984
17890b82521A38340b73464A56127O20K43537j94200b09871B07449g9885A79229
17879I3622a68109L8568A40412h7298n135p981c6725o6418A27639d487A82905
17867b06179f0293B84109j8439a01804M0589p9941j2920B131b2128k66779Q1552
17856b07355E5058j3358d6264o9235G2573J27770b63821e4239B08885R2808n8058
17845B43635J22382b09847O6819A68736J5723J5590q5482c40950A8882d02931
$$ y = [-181728, -38754, 100378, 80193, -25031, -31883, -90428, 49687, -127026, -147129, 319171, -193725, 88809, -10817, -27991, -84456, 108442, -77332, 48868, 171247, -61147, -142702, 48115, 69270, 82456, -128584, 110926, -400985, 53494, -230706, -464127, 15540, -97537, -282521, 138340, -273464, 156127, 156747, 400284, 206084, -209871, 207449, -79885, 179229, 93622, -168109, -129541, 140412, -87298, -92433, -100414, -36725, -103143, 127639, -4487, 182905, -206179, -60293, 284109, 265670, -101804, -61215, -141156, -154076, 2131, -22128, -288907, -207355, 55058, 41700, -46264, -115499, 72573, 200343, -263821, -54239, 208885, 301693, 243635, 366017, -209847, -143028, 168736, 184459, 200049, 114567, -340950, 18882, -402931]
17834A2524L232c80917b6058j88051N5924C4304f8729B23999f3197k0160H5271
17822g4196j26545A17520b35438P7132j43993i5839a6475l08596C2405a07519
17811b61635a22631r499d7205K3573A58885E6088K7850e2321q7451F8169b0559
17799A21374a17736G3921K74426a55280L9435A24381C6456J45300a67325K6243
17789a41082B05312h9176P557B4788d8602n3725I2678l8748a00859D75957a92202
17777E78026a71776O9428I0878K55633a02765C0610K50483o9538l9478n2742i1636
17765a4213A78784b17803I8675J02006a24145A98660i3444A83402n6255i9312
17754A26317B7529f4794k01190A93764a83239P9083l6494B08333C368L62227A10227
$$ y = [12524, 15756, -380917, -26058, -214109, -158185, 34304, -68729, 223999, -63197, -83357, 85271, -74196, -200741, 117520, -235438, -158306, -302299, -95839, -16475, -325071, 32405, -107519, -261635, -122631, -132130, -47205, -23632, 158885, 56088, 83938, -52321, -139772, 68169, -20559, 121374, -117736, 73921, 348347, -155280, -115845, 124381, 36456, 181756, -167325, -141082, 205312, -89176, -81619, 24788, -48602, -102327, 92678, 53930, -100859, 475957, -192202, 578026, -171776, -102348, 90878, 346511, -102765, 30610, 281093, 211555, 172077, 119335, -91636, -14213, 178784, -217803, 98675, 200681, -124145, 198660, -93444, 183402, 127147, -99312, 126317, 27529, -64794, -265984, 193764, -183239, -104156, -140650, 208333, 3368, 365595, 110227]
17742A11309c6988A53454B2704a2549p6593A23548f3982A33097J47762F8465b52400
17730B2058J19677a2864A4640J65670B1909J01025f2802n6142b3785C400a45562
17718A9320P3421N66144A55779G0218J79495a08081d3774k30744d492n8165E1437
17706A70500A9526b51922G7688C7495a71287F6636b25188B74860D7509J36868
17696A84377m7015i3439d171B57502a87805P6127B43676Q1016f5062j57847G0441
17684A38409a2845l09608A82379p0983a13218A83277b27746a12069C23730b1712
17673f1288l06155p149j47198a31617E8498b84172a11776B50017a3672r1868j7164
17662a22704A39669M6634K09174a43764B55986p2769J63263n1449e5677A05168
$$ y = [111309, -36988, 153454, 22704, -12549, -89142, 123548, -63982, 133097, 280859, 68465, -252400, 22058, 141735, -12864, 14640, 180310, 21909, 122934, -62802, -118944, -23785, 3400, -145562, 19320, 92741, 658885, 155779, 70218, 249713, -108081, -43774, -274518, -4492, -62657, 51437, 170500, 19526, -251922, 77688, 37495, -171287, 66636, -225188, 274860, 47509, 184377, 137362, -93439, -4171, 257502, -187805, -111678, 243676, 324692, -65062, -222909, 70441, 138409, -12845, -322453, 182379, 111396, -113218, 183277, -227746, -112069, 323730, -21712, -61288, -367443, -374592, -521790, -131617, 58498, -284172, -111776, 250017, -13672, -105540, -122704, 139669, 186303, 395477, -143764, 255986, 183217, 346480, 295031, -55677, 105168]
17651g6866A84273h3006D3c68280e9362j18215h6682m7679l0549B4025J11373
17640A35398O322E0255e8516A49871c2756q0300B7674b7990k09365J01920A75504
17628c65092a79561A58514l966f035B95888a83675C37059C696a88469h7227c514
17616C19967D2541P6831D3391h7709o3175C01734b09921g400k09288R5244C6227
17604A8971N6247c56294D6471a29969E7198A5239Q7603l649b13226B53705f3648
17592A40407P6235c6192A09002b55710C9624a5653J566E50558b50944j3935h7386
17580e8948A78574o4217J21029k3562K8518b37728A04736D6624r127P9670J23489
17569B40656q1878R7443h5082l1085G7516f8963j15282B9662f7539b4613A30721
$$ y = [-76866, 184273, -83006, 43, -368280, -59362, -177577, -86682, -134361, -164910, 24025, 135398, 141720, 50255, -58516, 149871, -32756, -113056, 27674, -27990, -237355, -135435, 175504, -365092, -179561, 158514, 154548, -6035, 295888, -183675, 337059, 3696, -188469, -87227, -3514, 319967, 42541, 119372, 43391, -87709, -150884, 301734, -209921, -7400, -216688, -121444, 36227, 18971, 75218, -356294, 46471, -129969, 57198, 15239, 102842, 99193, -213226, 253705, -63648, 140407, 216642, -36192, 109002, -255710, 39624, -15653, -14087, 550558, -250944, -264879, -87386, -58948, 178574, 114357, 235386, 211824, 240342, -237728, 104736, 46624, 37497, 117167, 240656, 158778, 256221, -85082, -116167, 77516, -68963, -184245, 29662, -67539, -24613, 130721]
17557D62928G8666o53a26262Q883D29224H877L6134i7442D28429C1664J18255
17546A49919b79230B09546b56899n7368J52967P3908j40704F5752i0603j20694
17536b11297B49718C9818K10378e2146a459H797O5923J96990p9534a92160C60254
17524E446K02394I0004a10920C76615D1080a97045B47439B4320c60560B58478
17513h2985a8503D14219b26960p4559B04386e0513F8707l317P2407J11465G4595
17501H0300J05209e5159G930d3811r1231A97534b09559q3734f9273B39039m6301
17490A92738R7754a67670l7587L6594A62143L16322j03838C3447J82358H1966
17479A5359J68439c37057A70254a16893B87801a78173A42502K45594F1130A2876
$$ y = [462928, 78666, 78013, -126262, -117379, 429224, 8877, 45011, -97442, 428429, 31664, 149919, -279230, 209546, -256899, -314267, -161300, -87392, -228096, 65752, -90603, -211297, 249718, 39818, 250196, -52146, -1459, 8797, 74720, 271710, 192176, -192160, 360254, 5446, 207840, 90004, -110920, 376615, 41080, -197045, 247439, 24320, -360560, 258478, -82985, -18503, 414219, -226960, -301519, 204386, -50513, 68707, 65390, 137797, 249262, 74595, 80300, 185509, -55159, 7930, -43811, -135042, 197534, -209559, -293293, -69273, 239039, 192738, 290492, -167670, -205257, -168663, 162143, 478465, 374627, 33447, 215805, 81966, 15359, 183798, -337057, 170254, -116893, 287801, -178173, 142502, 388096, 61130, 12876]
17468C06116I4272A6188J73908o698n6048A9189L09618A06874b87602h3348q2238
17457a65586G3359K9692K4189K43738q682r123F8460R3793K8258M49448C09567
17445A65999a70649H3548M13269C8597K8369J93236f4009B33761J36423n6818
17435C13366Q6249j66771Q3365l3880M138c9494r4802K7045B24760j5557p8532
17424A30671c68390D85777j74877o0155n6662K58935j81221N4990F8654K05486
17414B74140A21606M8680M2527B4195L67964A79406h0422A4399K76617C5554a33424
17402A57916k9881M5915i8209K5663B12999a24808I0387A6253J555M09454j23572
17391C03690h5070B1789J9496L3106L03201l5196l5904a04545j17932h0331D37401
$$ y = [306116, 94272, 16188, 190096, 183398, 127350, 19189, 328807, 106874, -287602, -83348, -165586, 73359, 103051, 127240, 370978, 362296, 353173, 68460, 162253, 190511, 639959, 309567, 165999, -170649, 83548, 496817, 38597, 66966, 260202, -64009, 233761, 370184, 313366, 399615, 232844, 316209, 282329, 286467, -39494, -134296, -107251, 224760, 209203, 130671, -368390, 485777, 310900, 250745, 194083, 453018, 271797, 326787, 68654, 274140, 121606, 170286, 212813, 24195, 392159, 179406, -80422, 14399, 291016, 35554, -133424, 157916, 128035, 173950, -98209, -72546, 212999, -124808, 90387, 16253, 17808, 427262, 303690, -85070, 21789, 41285, 74391, 377592, 342396, 306492, -104545, -222477, -80331, 437401]
17379a19373A78120C8777K80578a28979B8188M7541M04357I5677J79539r4641
17369A80575d3922j07888A92836n3578c9649A56352j2665d1748D91234A28173
17358C34018E6093R4375L8773H1745a35902C7483P9227Q9209d7929B47076P1447
17347C18523f060B83147p9422a21662B72909o2086j02250C2597L31641q4440d8958
17335C9182a4634A11234b285A38223m1141J45768E8091p616j4759a28340k18552
17324c46892C3722J6481L6796a6164B5232J5931J7976L8757D6716K27975L4701
17313C09392B2358J43844G840a13391A64343e5921A71933a886B02622e3581D0038
17301C5595O286J54741J72077j27497F7072L01531A42158B4947J28281p3540g1741
$$ y = [-119373, 178120, 38777, 319355, -128979, 28188, 75729, 480086, 95677, 275216, 180575, -43922, -151810, 192836, 139258, -39649, 156352, 143687, -41748, 491234, 128173, 334018, 56093, 150468, 189241, 81745, -135902, 37483, 116710, 205919, -47929, 247076, 318523, -6060, 283147, 203725, -121662, 272909, 210823, 108573, 32597, 364238, 279798, -48958, 39182, -14634, 111234, -2285, 138223, 97082, 242850, 58091, 50475, 35716, -128340, -346892, 33722, 50203, 86999, -16164, 25232, 41163, 59139, 97896, 46716, 274691, 309392, 22358, 166202, 7840, -113391, 164343, -55921, 171933, -1886, 202622, -53581, 40038, 35595, 41881, 196622, 368699, 241202, 67072, 368603, 142158, 24947, 153228, 79688, -71741]
17289D54621k02090h2434B2390K7855K41393H1743K12362q7605J02866Q6698I9583
17277i048A85032I1568B1975J42780N8906a4045A78531J29079q6080K6099j13307
17266A34322A792J43320r811J7073o1561K88054D5350M19325F5195K61721M7297
17255C74213D4441L6234A4468L15184j06653c0232B9285P8672i2079a0A19569
17243A67949L05148A763J19378B71N5758L41567Q109p4853I9892N1082O5355F519
17230B26449p2815K11607C7041J75219R5857J30762I1267g7396H4242a25980A16487
17218D60623k8645A17954m9009K34673k2228g8894G6099J3819J41922b06277I1256
17206B08790l8219q2838J96630m60A28384D7765K59865o569I3243K25099A8941
$$ y = [454621, 252531, -82434, 22390, 50245, 291638, 81743, 294105, 206500, 309366, 396064, 99583, -9048, 185032, 91568, 21975, 164755, 223661, -14045, 178531, 307610, 221530, 247629, 134322, 1792, 145112, 135301, 152374, 90813, 378867, 45350, 464675, 65195, 326916, 374213, 44441, 80675, 14468, 329652, 222999, -30232, 29285, 107957, -92079, -10, 119569, 167949, 473097, 1763, 121141, 271, 56029, 397596, 405705, 330852, 99892, 150974, 216329, 6519, 226449, 153634, 365241, 37041, 212260, 308117, 438879, 91267, -77396, 84242, -125980, 116487, 460623, 431978, 117954, 68945, 303618, 281390, -78894, 76099, 89918, 231840, -206277, 91256, 208790, 170571, 87733, 284363, 283903, 128384, 47765, 307630, 301061, 93243, 318342, 18941]
17194A6763J28536n1707L38427j47418H1173h664B37431a3612A72311c6693B73574
17182B88435O0785A20737N7794G4218J16311P6594A4134c3296A39828B8741J91305
17171B20046K40849A30904K51372j45786B9772L76293j07716i4312A70120A5200
17160C54044A45004J83349b0636D00194A62562A6473J08608R166o203L26057o0732
17149C93369j08447K34873A96772J03322A47031q899O1500K47295P7724B53424
17138D67224A17146E3660J60600E1155K50280A42649K4030K96092k10830L42868
17128E94809A29911K7559N79008k17869A68965k1393R2243N4088M0571j55473
17118A79001L98062r651j50340A79779J93551j9696k8681F2328M25496A94269
$$ y = [16763, 145299, 93592, 432019, 284601, 81173, -8664, 237431, -13612, 172311, -36693, 273574, 288435, 349220, 120737, 178531, 74218, 190529, 267123, 14134, -33296, 139828, 28741, 220046, 460895, 130904, 382276, 236490, 29772, 406065, 298349, -94312, 170120, 15200, 354044, 145004, 328353, -20636, 400194, 162562, 16473, 125081, 134247, 128044, 454101, 393369, 284922, 519795, 196772, 300094, 147031, 138132, 199632, 446927, 524651, 253424, 467224, 117146, 53660, 214260, 51155, 301435, 142649, 166679, 462771, 251941, 594809, 129911, 157470, 736478, 518609, 168965, 147572, 239815, 293903, 334474, 179001, 577063, 567412, 417072, 179779, 373330, 353634, 324953, 62328, 487824, 194269]
17107E45202A05121Q5122N6119K51402A52177L05956g8534A34008M70701k26333
17097C78376A04444L31155j99707J15734j2019K09588K02536C3584N03529j51129
17087C85984j35480L995J04874j5406m336o3127j37048L08983J45145Q8290k85203
17076C96671J79161B13889L59169k37818n9741K05355L09820l17207D9505N55968
17066F05473j61855j27881L6835j09509r3774K68551q7014j14981J43894Q5362
17056D45101N5604p5527K82615l38448n9454K48542k09260j14169J51507q8705
17046B97806J35888J56928H8610N07220l1105J21841k78617J58869B62092R8791
17036C60883R3625j1234m4608K41313k6071r9657m397q5572j76988K59365P7459
$$ y = [545202, 105121, 190243, 246362, 497764, 152177, 458133, -78534, 134008, 604709, 378376, 104444, 435599, 235892, 351626, 339607, 549195, 751731, 33584, 537113, 385984, 250504, 254499, 359373, 343967, 339631, 276504, 139456, 448439, 593584, 681874, 396671, 575832, 213889, 573058, 335240, 275499, 480854, 790674, 473467, 49505, 605473, 443618, 315737, 352572, 243063, 149289, 417840, 330826, 215845, 359739, 445101, 500705, 425178, 707793, 369345, 309891, 558433, 349173, 235004, 386511, 297806, 433694, 590622, 88610, 595830, 564725, 686566, 407949, 566818, 262092, 360883, 454508, 443274, 398666, 639979, 613908, 514251, 509854, 424282, 247294, 506659, 584118]
17025E84118M9071j26561k04519L20441J6642l04579O45336j89235n1522B85025
17014C92567M57965l37722Q7224j06032n6625J75609J40051j15502L34282l85663
17004E86154R3828j35520O3119k6641P9966j66869M21336m54830N5951L71361
16994H87855l97433N4261j06535K11803B67513M94608k03272K9241R6881K53292
16984I38263N7474j81517C18338L22818k8820q1535L40156K78670K15492o34709
16974G30410R6101j90045o5598P8191P379M4606J53642k32682L18868k49455K56668
16963I48085l92926L36027k71013P5940L17506j18621R1438j3252j43024K52318
16953A082478l15714J22639K18052l8675j93368k28303J25843J35744k99135M52424
$$ y = [584118, 633189, 506628, 302109, 622550, 639192, 334613, 979949, 790714, 739192, 285025, 392567, 850532, 512810, 600034, 494002, 437377, 612986, 753037, 637535, 971817, 586154, 679982, 544462, 607581, 580940, 660906, 494037, 915373, 460543, 516494, 887855, 490422, 544683, 438148, 649951, 267513, 762121, 558849, 588090, 684971, 938263, 995737, 814220, 318338, 641156, 612336, 530801, 870957, 1149627, 1365119, 730410, 826511, 636466, 570868, 649059, 656438, 701044, 854686, 622004, 940872, 691417, 948085, 555159, 891186, 620173, 696113, 1013619, 894998, 986436, 973184, 830160, 1082478, 766764, 889403, 1107455, 1068780, 875412, 647109, 772952, 908696, 609561, 1061985]
16943A061985j26401J01297J27981r931J6147l28962l2132K52620j80603K59758
16933A141759j17433J30824j94600N0513j159J53101P7447k25096K08828j95908
16923A028276Q6117R4739K48630n45305J56759N5436q5001J52050J10011K99085
16913A600797k8434k90737K35523r6748J73102l59888L08961k7957Q9842k29681
16903A374780K82345J7678j14796O4439r8002o4450M2573J89208l30316N95958
16893A959417j72651m4096l3184Q2111l15907J92242K87506m26562N24171l28384
16883A724663J09844p7309J68842n2181j39686M56772m67614N24755l1563k86227
16873A930296K34628L14046l31842j85726L33595k6733j21831K66066p2822n1138
$$ y = [1061985, 935584, 1036881, 1164862, 1154931, 1171078, 842116, 809984, 1062604, 882001, 1141759, 1024326, 1155150, 960550, 1011063, 1009904, 1163005, 1240452, 1015356, 1224184, 1028276, 1114393, 1209132, 1457762, 912457, 1069216, 1124652, 1039651, 1191701, 1301712, 1600797, 1572363, 1281626, 1517149, 1420401, 1593503, 1233615, 1542576, 1514619, 1604461, 1374780, 1657125, 1674803, 1560007, 1624446, 1526444, 1461994, 1504567, 1693775, 1363459, 1959417, 1786766, 1742670, 1709486, 1791597, 1475690, 1667932, 1955438, 1528876, 2053047, 1724663, 1834507, 1757198, 1926040, 1873859, 1734173, 2190945, 1723331, 2248086, 2216523, 1930296, 2164924, 2478970, 2147128, 1961402, 2294997, 2268264, 2146433, 2412499, 2339677, 2288539]
16863B288539L03027m93136L86210j16543J26293J3245J09503k37489K47985J37061
16853B764695k63002K49784O3870r2769q9042R2696N01010j56191K44982k16294
16843C099739o384k6160M89826j37537j8940K44837j57961q0893J33671K51099
16833C791297J35081n7732j02087L37746j07137L10654j27414M23172m39038K05799
16823D370341J9812J87602K98113Q7748P9079k35654L67398K27265l0763J1425
16813E382366J7070M0724L68811k974J49452L48815P7608l8994M26258j48155
16803F620981L20987o2018L93881k83544L43656O01057K65594M1790J2766K28473
16793H483623M63904o2289J68956N23937K9165J07918N63496K33484P1516L76165
$$ y = [2288539, 2591566, 2098430, 2484640, 2368097, 2494390, 2507635, 2617138, 2379649, 2627634, 2764695, 2501693, 2751477, 2815347, 2722578, 2633536, 2726232, 3227242, 3071051, 3316033, 3099739, 3093355, 3067195, 3557021, 3419484, 3400544, 3645381, 3487420, 3406527, 3540198, 3791297, 3926378, 3868646, 3766559, 4104305, 3997168, 4307822, 4180408, 4603580, 4164542, 4370341, 4390153, 4577755, 4875868, 4963616, 5042695, 4807041, 5174439, 5401704, 5370941, 5382366, 5399436, 5440160, 5808971, 5805997, 5955449, 6304264, 6381872, 6342878, 6769136, 6620981, 6941968, 6879950, 7273831, 6990287, 7333943, 7935000, 8200594, 8242384, 8255150, 8483623, 8947527, 8885238, 9054194, 9578131, 9607296, 9715214, 10278710, 10512194, 10583710, 10959875]
16783A0959875L60517K12123M44735O05418L98724O8037O01407Q79203O8251J9221
16773A4617511O86827L39276R09830N50298K83883J237984O10207N59361Q24329
16764B0619506M82900Q81561J095488R76693Q72145P67476J558891P50967J471296
16755B9476923J524043J311658J188132J728136J653150J591626K070648K312064
16747D2856380J850081K678174K600398K677358K866192L071287L711778L376569
16739F5688217L986231L940675M722859M711449M835798N229576O043196O125353
16731A05283354O635609O290124P058542P146549P156480O901216P031070P272734
16723A60775678O209753N607824M713503L934573K864412J788200M29757r09288
$$ y = [10959875, 11320392, 11532515, 11977250, 12582668, 12981392, 13049429, 13650836, 14530039, 14598290, 14617511, 15304338, 15643614, 16553444, 17103742, 17387625, 18625609, 19235816, 19795177, 20619506, 21102406, 21983967, 23079455, 24056148, 24928293, 25695769, 27254660, 28005627, 29476923, 31000966, 32312624, 33500756, 35228892, 36882042, 38473668, 40544316, 42856380, 44706461, 47384635, 49985033, 52662391, 55528583, 58599870, 62311648, 65688217, 69674448, 73615123, 78337982, 83049431, 87885229, 93114805, 99158001, 105283354, 111918963, 118209087, 125267629, 132414178, 139570658, 146471874, 153502944, 160775678, 166985431, 172593255, 177306758, 181241331, 184105743, 185893943, 186323700, 185414412]
16715A85414412k009839l261057m607610n150678o244389o671606o585503p206862
16707A43676868p137972p453926o868092p062538o446915o255328o013703n740856
16699I0697538n159566n267522m519975m250150m285078l404196l285635l663719
16691E6861697l153422l061414k582884k265473k535825k136773k289301j523396
16683C7313209j573112j910503j468088j262937j391792j507577j175017j230969
16675B5793214o90391j291452p50249j123854o56834n06422j436269r0891j248975
16666A7997877m48115p35076m58226q15457j00315l93016p36866l89086n19655
16657A3402065l65207p22741j52005l92498m83247j08263l93670k2592p63397
$$ y = [185414412, 183404573, 180143516, 175535906, 170385228, 164140839, 157469233, 150883730, 143676868, 136538896, 129084970, 122216878, 115154340, 108707425, 102452097, 96438394, 90697538, 85537972, 80270450, 75750475, 71500325, 67215247, 63811051, 60525416, 56861697, 53708275, 50646861, 48063977, 45798504, 43262679, 41125906, 38836605, 37313209, 35740097, 33829594, 32361506, 31098569, 29706777, 28199200, 27024183, 25793214, 25102823, 23811371, 23061122, 21937268, 21280434, 20774012, 19337743, 19246852, 17997877, 17549762, 16814686, 16356460, 15541003, 15440688, 15047672, 14310806, 13921720, 13402065, 13036858, 12314117, 12162112, 11769614, 11286367, 11178104, 10784434, 10761842, 9998445]
16648I998445K61303o43651m31629j72627L953l8080o03370j40386l40430l5952
16638G857576m29363J01348k52248j96867j30175q1606k28880P7399n67324p9885
16628F069975r1685k63303k89071K27770j81332j07200l4144l00052k10990O7169
16618D887137m8377o1617j17465L25617l91494k38886k7038j12506k02783k3813
16608C988775m527j76745M1624J77509n84492N32320n57525r1389J1911J09202
16598C446663j83583N2801k14131L45170m56838Q7005j11027k55951L81461k61075
16588B830495L273m627J11795p853m47395K93256j69666k56166L80641l78217
16578B355536N3066N7088l23213J33177M01480o16667J94067m1168M87448m52199
$$ y = [9998445, 10259748, 9616097, 9184468, 9011841, 9015794, 8977714, 8374344, 8233958, 7893528, 7857576, 7428213, 7529561, 7277313, 7080446, 6950271, 6868665, 6639785, 6717184, 6149860, 6069975, 5978290, 5714987, 5425916, 5653686, 5472354, 5365154, 5331010, 5030958, 4819968, 4887137, 4838760, 4777143, 4659678, 4985295, 4593801, 4354915, 4327877, 4215371, 4012588, 3988775, 3984248, 3807503, 3849127, 4026636, 3442144, 3974464, 3416939, 3325550, 3337461, 3446663, 3263080, 3315881, 3101750, 3446920, 2990082, 3077087, 2966060, 2710109, 3091570, 2830495, 2833768, 2829141, 2940936, 2933083, 2485688, 2778944, 2609278, 2353112, 2733753, 2355536, 2408602, 2465690, 2142477, 2275654, 2677134, 2060467, 2254534, 2213366, 2700814, 2248615]
16568B248615j8793k88214O1198J3340K01875n5709l07060l0595L94086Q2470
16558B301213n70034j46791M18771p6809j06461p2679K50178l08912p8980O9397
16548A678893J90813l82770K43919k59531k8676K40911k5168p8458j76903J73950
16538A576980K7250j17912l54233M72297j74439K17088j21915q8403j7963l9123
16528A379627l25389L56193j21866k14436L07391L0010m33578j35809J01084K74738
16518A217965K1517j00867J96371j64751Q8015j74640P7994m2616P9480k74256
16508I24212P216K49016j67897L31867m95103J87943q8221J4081n4782j27042
16498G81290k620L73908j05621L48785n25452J66636l3867k26535R8269j09052
$$ y = [2248615, 2229822, 1941608, 2002806, 2016146, 2218021, 2162312, 1855252, 1824657, 2218743, 2301213, 1731179, 1584388, 2003159, 1926350, 1819889, 1747210, 1997388, 1688476, 1609496, 1678893, 1869706, 1486936, 1730855, 1471324, 1442648, 1683559, 1658391, 1579933, 1403030, 1576980, 1604230, 1486318, 1132085, 1604382, 1429943, 1647031, 1525116, 1436713, 1418750, 1379627, 1054238, 1410431, 1288565, 1074129, 1381520, 1411530, 977952, 842143, 943227, 1217965, 1239482, 1138615, 1334986, 1170235, 1258250, 1083610, 1161604, 1118988, 1198468, 924212, 931428, 1180444, 1012547, 1344414, 849311, 1037254, 949033, 963114, 908332, 781290, 778670, 1152578, 1046957, 1395742, 870290, 1036926, 1003059, 776524, 874793, 765741]
16488G65741J74337k41764J84124j3908j91223M61382k14032J6000o6101j99618
16478F74938J58186j34196J11295K0466q3934j36515J01940K00016J79515k11154
16468H80557l07594J30136M6100j39712J57546j49159J79605A20886N55523M3877
16458G20286m5975J69817k46544Q1221K44386j83104K7845j40791M1034m7004
16448F21171l01266K84663o7371J40403q1519k1006M3884N055K94395l91315n5190
16437D71904J6549K80895j87578O8243N8694L8804l07873J93982Q1422o1154R0258
16426G44146B04790N54822l57247J94873j80860K68622j50937M0585k84622J8057
16416C08083J82147j11868j39464M14132k93742J85075L7287k60758j08250p9009
$$ y = [765741, 940078, 698314, 882438, 868530, 677307, 1138689, 924657, 940657, 874556, 674938, 833124, 698928, 810223, 830689, 746755, 610240, 712180, 912196, 1091711, 880557, 572963, 703099, 749199, 609487, 767033, 617874, 797479, 120886, 676409, 720286, 674311, 844128, 597584, 678805, 923191, 740087, 767932, 627141, 668175, 621171, 319905, 604568, 537197, 677600, 596081, 575075, 618959, 624014, 918409, 527094, 471904, 488453, 769348, 581770, 650013, 708707, 747511, 439638, 633620, 715042, 653888, 744146, 204790, 759612, 402365, 597238, 416378, 685000, 534063, 574648, 290026, 308083, 490230, 378362, 238898, 653030, 359288, 544363, 581650, 320892, 212642, 133633]
16406A33633K95370j31062J71550J36286j2891j45453Q0291j67374j33367K14973
16396D41956K9784j9576A82706N10689M419j86965p587F2472M20046j22817A53886
16384C99085j50828Q7949K34374j95370k5732L851p5862j31585J30259n9277G7064
16372C83952K68616B87879J48824M1347j87966J72612A59245J60765n2154r302
16362B58554o419C9377O48912l37508K18082B14860n251K58953K93548j81435
16352E80675j96845k0303j01289J09586m0266L588K65341N8895A35266B7511L24934
16341C52445j42948K29620J5393j66060O9478l0318j12193J74195A21942M15735
16331E37677G5835K82369P1345A87957J317p5023j9764K22096D1183h058D62487
$$ y = [133633, 429003, 297941, 469491, 605777, 592886, 447433, 527724, 360350, 226983, 441956, 471740, 452164, 182706, 693395, 697814, 510849, 503262, 62472, 482518, 359701, 153886, 399085, 248257, 336206, 570580, 375210, 349478, 353329, 277467, 145882, 276141, 216864, 77064, 383952, 652568, 287879, 436703, 478050, 290084, 462696, 159245, 320010, 267856, 258554, 252135, 39377, 688289, 350781, 568863, 214860, 209609, 468562, 762110, 580675, 383830, 363527, 262238, 371824, 331558, 335146, 600487, 659382, 135266, 27511, 352445, 209497, 439117, 454510, 288450, 357928, 327610, 215417, 389612, 121942, 537677, 75835, 358204, 429549, 187957, 189274, 114251, 94487, 316583, 41183, -8058, 462487]
16319B71184i9196A34019J37504e0247B96504j9972M6112j10858J68249q5844
16309B94191q2595j03152L95843H6688K26989l8400p6276J72031j75098O6780
16299B62714p0964J12571I6588C2254J72845n2885m5656K27788A07415J55906
16289B63321j04206J94848n2049P214D0173J16226a54939H57866B12518L03907
16279E16425B44593l0086d4117A21354J55654o4950b26936d6958A42158K53101
16269C95259A55862b7991F53640E3818K72057d446j2772C09512k1245k3066I6270
16257D22640j62142J14361G057i2872C84284j05280j04990L0536g858k6521I156
16245a1354A91615L44745k27966a04282A75116K3443M8910h0190j13708a7935
$$ y = [271184, -99196, 134019, 271523, -50247, 296504, 276532, 322644, 211786, 380035, 294191, 211596, 108444, 504287, 86688, 313677, 275277, 199001, 371032, 195934, 262714, 191750, 304321, 96588, 32254, 205099, 152214, 106558, 334346, 107415, 263321, 159115, 353963, 301914, 309128, 40173, 156399, -154939, 857866, 212518, 516425, 244593, 214507, -44117, 121354, 277008, 212058, -226936, -46958, 142158, 395259, 155862, -27991, 653640, 53818, 325875, -4446, -17218, 309512, 288267, 265201, 96270, 422640, 260498, 374859, 7057, -92872, 384284, 279004, 174014, 204550, -7858, -34379, 9156, -11354, 191615, 536360, 308394, -104282, 175116, 198559, 247469, -80190, -193898, -17935]
16234a45612C25837a58129A41723K62111e7271C36625Q1864I8797R7726J21229
16224C17752O3537A56284J76038j59782M40128B17607b9794A27629a05322A02504
16213a99937D43065B0842a43442B30376J59331A23246b9700k90459a44950B58586
16202D61434B04803D2506J12837J05270A00056A5786b36653a08910B73613A12676
16191B79722A18690R3131p9018j8747b07338g978H7309J78443A02642c5937F8074
16179A65920n3815o789J2442e857C07102G7380J94043b716C94024m5643G4375
16167d194m6189B07670B5917e6451E7179a04640A51635b35145A34567n2918M4678
16156A26327Q9232b46556e0218A62478a00426I8631K23958A05613M7733i451l4849
$$ y = [-145612, 325837, -158129, 141723, 403834, -57271, 336625, 418489, 98797, 196523, 317752, 381289, 156284, 332322, 172540, 612668, 217607, -29794, 127629, -105322, 102504, -199937, 443065, 20842, -143442, 230376, 389707, 123246, -29700, -320159, -144950, 258586, 461434, 204803, 42506, 155343, 260613, 100056, 15786, -236653, -108910, 273613, 112676, 279722, 118690, 211821, 132803, 114056, -207338, -7978, 87309, 265752, 102642, -35937, 68074, 165920, 112105, 105316, 117758, -5857, 307102, 77380, 271423, -2716, 394024, 348381, 74375, -4194, -50383, 207670, 25917, -56451, 57179, -104640, 151635, -235145, 134567, 81649, 126327, 215559, -246556, -50218, 162478, -100426, 98631, 322589, 105613, 153346, -9451, -44300]
16145d4300C5110R325a47498A75670L82966A32172K57349j70163e4518n2481F9359
16133A81416e0132J6715A66848B1427g958B31407O0325B7784k536K49754c6409
16121b52612A10624J1381e9796B14574r867a26400C6937J29586g0164G5562J22970
16110A98532K39474g8948C1218a20372A3095R2549i1242A65051M52474A64238
16099A78595J20645a01238h417j42683K0976l94O0864E4063K27287j17284J8886
16088A82952a58889k03949a9071D34232A05230m9951L681c8950A57063i6242G6932
16076B66893b4989A53004b36278a12151I0961M6937b33856A39482J3556g7893
16065e0150e928k37248P1479H5424c16294O9258C8745d2084n1455g354B45456
$$ y = [-44300, 35110, 44435, -147498, 175670, 558636, 132172, 389521, 219358, -54518, -106999, 69359, 181416, -50132, -33417, 166848, 21427, -7958, 231407, 291732, 27784, 25248, 275002, -36409, -252612, 110624, 122005, -59796, 214574, 204707, -126400, 36937, 166523, -70164, 75562, 198532, 438006, -78948, 31218, -120372, 13095, 105644, -91242, 165051, 617525, 164238, 178595, 299240, -101238, -8417, -151100, -130124, -130518, -69654, 54063, 281350, 164066, 182952, -158889, -362838, -19071, 434232, 105230, 55279, 58960, -38950, 157063, -96242, 76932, 266893, -24989, 153004, -236278, -112151, 90961, 137898, -233856, 139482, 153038, -77893, -50150, -5928, -243176, -171697, 85424, -316294, -247036, 38745, -42084, -93539, -7354, 245456]
16053F0290b58057F7079R6790a15187E3822O9720O673c78015C93777a9056A68975
16041c14804o7864b1837F2422q389J24414M1536c26282A95935h2545A11319J45655
16030B56974b7823k60260d0150B61109b28413A90689b46231A86733B4895i1825
16019A20640J0176m5032a35994B06569j1802a5156j43011J9185A56953a02233
16008d3616D0796j8783b65221A10041d86203a23804j01622G6902a56561G5649
15997a40118C18995K9839a3108k13884A48016m6630a82877c6979o0211j51930
15987b49120A30912K4094k7345l3305J85313L23251p5295G3261J1800b43790C65324
15975a26968B01184e0090o706I6206b94927O1171B59714j5094a31977j02204C7521
$$ y = [60290, -258057, 67079, 163869, -115187, 53822, 123542, 130215, -378015, 393777, -19056, 168975, -314804, -382668, -21837, 62422, 54033, 178447, 219983, -326282, 195935, -82545, 111319, 256974, -27823, -288083, -40150, 261109, -228413, 190689, -246231, 186733, 24895, -91825, 120640, 130816, 85784, -135994, 206569, 194767, -15156, -158167, -138982, 156953, -102233, -43616, 40796, 22013, -265221, 110041, -486203, -123804, -225426, 76902, -156561, 75649, -140118, 318995, 348834, -13108, -226992, 148016, 101386, -182877, -36979, -97190, -249120, 130912, 155006, 127661, 94356, 279669, 602920, 527625, 73261, 85061, -243790, 365324, -126968, 201184, -50090, -56796, 96206, -294927, -233756, 259714, 244620, -131977, -234181, 37521]
15963a71223F4308J78534E225d5619B8420L01586a64494A32714k6461J19466D6428
15951a76431f2599B14588c13626A46009c5993q782l4942l02416a75405n2753H1416
15939b26963e2305A56728a31481A34479c33805B29946r7743c51024A44322a16198
15928B11887j9686b6985F9600J33498a33185O4330j08191H7211l6002A0953a592
15916g6598j81322j23030J3123A30133a55055B11190c2370H3900a81028A7579
15905b36387d0166L369A22900f1553k72129B10475a35123C16614D0554j4112K3287
15894D9729A7722b61417a03405A01277b36477f8539A30363h240r2283j16704f1957
15882c0547l91385J38307M5621A66762g9448I7850J15689J49511B1441b5070j97544
$$ y = [-171223, 64308, 242842, 5225, -45619, 28420, 330006, -164494, 132714, 106253, 225719, 46428, -176431, -62599, 214588, -313626, 146009, -35993, -44775, -79717, -382133, -175405, -228158, 81416, -226963, -52305, 156728, -131481, 134479, -333805, 229946, 132203, -351024, 144322, -116198, 211887, 192201, -26985, 69600, 203098, -133185, -68855, -177046, 87211, 51209, 10953, -1592, -76598, -257920, -380950, -367827, 130133, -155055, 211190, -32370, 83900, -181028, 17579, -236387, -40166, -36797, 122900, -61553, -333682, 210475, -135123, 316614, 40554, 26442, 49729, 17722, -261417, -103405, 101277, -236477, -68539, 130363, -8240, -100523, -217227, -61957, -30547, -421932, -283625, -238004, 166762, -79448, 97850, 213539, 363050, 21441, -25070, -222614]
15871b22614M4599B8997c86691B35954c36254C4659b1965B1575a27920M8853k28389
15860c07456a17935e2614B43740j04126C049a971B30991E9003b8871H6438a57251
15848a76542B5973J36683b379k22881e7522k49129J41121g5423B7472b35801C7571
15836B9523b97201c843q5826A95423b15086J3077k9235R467B95501b04011C5783
15824e7796k55371A68795e8381j00206N0082b3839l44924B53816b67410F0775
15813b52153b6674A31151n251L8816c49673E8590d55066C55561k9506A05131a76213
15801A79136i9593k12008a13227R263D22626b51969R3572D4170J95303h9775B53847
15789B1163K479d1327k61892A44014J03348a92987J6082A61210a9904c439F7450
$$ y = [-222614, -178015, 28997, -386691, 235954, -336254, 34659, -21965, 21575, -127920, -79067, -307456, -117935, -52614, 243740, 139614, 3049, -1971, 230991, 59003, -28871, 86438, -157251, -176542, 25973, 162656, -2379, -225260, -57522, -306651, -165530, -75423, 27472, -235801, 37571, 29523, -297201, -3843, -89669, 195423, -215086, -202009, -231244, -221777, 295501, -204011, 35783, -57796, -313167, 168795, -58381, -158587, -108505, -23839, -368763, 253816, -267410, 60775, -252153, -26674, 131151, 125900, 164716, -349673, 58590, -455066, 355561, 326055, 105131, -176213, 179136, -99593, -311601, -113227, -103964, 422626, -251969, -158397, 44170, 239473, -89775, 253847, 21163, 23642, -41327, -303219, 144014, 247362, -192987, -176905, 161210, -19904, -3439, 67450]
15777c04440p4695C22756e289l3242H2737a27068k68696P912i101k6382A66353
15765f692k8971j72402I1916K08677a15354I0267a06325H3510a80504a0785A34712
15753F8567J08122p8117k9439b12408e0563C2558K29914a25886j18811i1687o0498
15742a52185d6483B60524H7978c66506A9871c5348A24334a73789H5540b35686
15731a52738k00024e762j1308j91176h3256o721k2808K7375j93472l7024a00651
15719B9968O2108J51731c957j8897F2436b24748R6812A04708J93244n5421j17802
15708A24729L5150R6093b59299q3513a15796I1337c78592d8858k39657a4010B54997
15696A86272a84269j44559O6460h9930C0691K81063k2696A2678b99590R8630k57062
$$ y = [-304440, -379135, 322756, -5289, -38531, 82737, -127068, -395764, -387852, -9101, -35483, 166353, -6692, -35663, -208065, 91916, 300593, -115354, 90267, -106325, 83510, -180504, -10785, 134712, 68567, 176689, 98572, 69133, -212408, -50563, 32558, 262472, -125886, -244697, -91687, -152185, -46483, 260524, 87978, -366506, 19871, -35348, 124334, -173789, 85540, -235686, -152738, -352762, -5762, -17070, -208246, -83256, -89977, -112785, -85410, -278882, -315906, -100651, 29968, 92076, 243807, -3957, -22854, 62436, -224748, -127936, 104708, 297952, 242531, 124729, 159879, 255972, -259299, -342812, -115796, 91337, -378592, -48858, -288515, -14010, 254997, 186272, -184269, -328828, -262368, -89930, 30691, 311754, 289058, 12678, -299590, -200960, -458022]
15685d58022a31361B37184a35000B78580a25943B442P446f6735B6216e5601B38353
15673a50480D7345f3798l9433A65763m9995B9983g1303r9667C15533a68891K0986
15662a47905k01066i6368B03926n7667a959k07545H0845C3498a26373b0175A18354
15650a0184k10630C41584G029c31515A12439K69379a69480I0425d6652G0144a15690
15638e6918r8143j6703G1053C511i8867M7161k64521M2297G9782N0372a68824
15626D61449H0502b19566E9273a76230o5727r4845a58390D0777a33311B69706
15615a7220D3290c1285r3821A77456D9487N9056a1397E1792g1639j26811B50835
15603b42831R6883o9717B8279b15769A2503J76082r2169J68284q9142a38034J1394
$$ y = [-458022, -131361, 237184, -135000, 278580, -125943, 2442, 9888, -66735, 26216, -55601, 238353, -150480, 47345, -63798, -103231, 165763, 115768, 29983, -71303, -170970, 315533, -168891, -147905, -348971, -96368, 203926, 146259, -1959, -209504, 80845, 33498, -126373, -20175, 118354, -10184, -220814, 341584, 7029, -331515, 112439, 381818, -169480, 90425, -46652, 70144, -115690, -56918, -155061, -171764, 71053, 3511, -98867, -51706, -316227, -273930, 79782, 130154, -168824, 461449, 80502, -219566, 59273, -176230, -241957, -336802, -158390, 40777, -133311, 269706, -17220, 43290, -31285, -125106, 177456, 49487, 108543, -11397, 51792, -71639, -198450, 250835, -242831, -145948, -215665, 28279, -215769, 12503, 188585, 96416, 264700, 175558, -138034, -126640]
15592a26640d1333a6374k86174K5351A63314a98135f7781m6067d9977A13580a03362
15580A44352b51068e1394l05487j3571D8019i8989H341J76843b67392A03541j8459
15569H5082a37182i282m8927b2773l2454a181k6551j70986r0784A65185b41268
15557B1382J79577J00360a56157j82280A13172g665C2895a51994G3251a7781j11551
15546a29332F8968N959J74079G3245K66074e2721o4784c2086r3792d5675D7633
15534D6506P5456J51222a21156A41287B4768a11896q2760d2767A5951b9107B6342
15522E4065b74184D7885C994L07021b00153A25101M298b62283A29220a69252A60122
15510d4663a7204j33366E4065J48928e8110j28956J0954C02005d8566J2273k32385
$$ y = [-126640, -41333, -16374, -302548, -277197, 163314, -198135, -67781, -113848, -49977, 113580, -103362, 144352, -251068, -51394, -356881, -370452, 48019, -98989, 8341, 185184, -267392, 103541, 85082, -137182, -9282, -58209, -22773, -55227, -1181, -27732, -198718, -289502, 165185, -241268, 21382, 200959, 301319, -156157, -338437, 113172, -7665, 32895, -151994, 73251, -17781, -129332, 68968, 74927, 249006, 73245, 339319, -52721, -117505, -32086, -125878, -45675, 47633, 46506, 121962, 273184, -121156, 141287, 24768, -111896, -194656, -42767, 15951, -29107, 26342, 54065, -274184, 47885, 3994, 311015, -200153, 125101, 129399, -262283, 129220, -169252, 160122, -44663, -17204, -150570, 54065, 202993, -58110, -187066, -176112, 302005, -48566, -36293, -268678]
15499b68678A04427i865H5030a95682D7356a29978J3993F5322j5966h5866J5942
15488f9924A45388a36777n0383P5900b5422l2699A97926I5387c7617Q616C8385
15476B22791E7241c841F5744C0400J88028f032k33924g182j17445M9019A05247
15464b06273D6002J68082m0666G9097k237b30969o7280D07799e5033B38903A11962
15452B08437d27286A48445e8420E1972K23297K7342a94448A38920j0182m198J22797
15441B47337c2180k02520N3250g0254a7190r0049K9837A245g0989B17194a90428
15429F5374c94756H6969k7309b87445a5405l00560h8824o044J8258B35715G5887
15417g2343j7705k1285B553J49379l6227M1326l5410J92b3517A27876e78843h805
$$ y = [-268678, 104427, -9865, 85030, -195682, 47356, -129978, -115985, 65322, 49356, -85866, -69924, 145388, -136777, -187160, -111260, -25422, -58121, 197926, 95387, -37617, -29001, 38385, 222791, 57241, -3841, 65744, 30400, 218428, -6032, -239956, -7182, -124627, -75608, 105247, -206273, 46002, 214084, 173418, 79097, 76860, -230969, -298249, 407799, -55033, 238903, 111962, 208437, -427286, 148445, -58420, 51972, 275269, 302611, -194448, 138920, 128738, 124540, 247337, -32180, -234700, -181450, -70254, -17190, -107239, -77402, 1245, -70989, 217194, -190428, 65374, -394756, 86969, 59660, -287445, -15405, -315965, -88824, -94868, -76610, 235715, 75887, -72343, -90048, -111333, 2553, 151932, 115705, 157031, 121621, 121813, -23517, 127876, -578843, -8805]
15404a94601f9564q1487O477k7808j71400J39378B6607c5379A22745H416a21890
15392A39031N2656J58523F6892a24145G0117B250J91090b6439k69143H0179J74110
15381B54289h7627C71856d4580k74529D3580a89912E1807K15348g1514C37100
15370A06174L2688a45654M3104A04589J35590b05253B19652a23977D6020d59248
15359g4565o0588c7617A00914O6164b14507j09769I2578N3281a17354d7588K3625
15348b3963j5663j03687a3657E0135K15790A01286b37664b9042E1344K09763a28470
15336E2717b7617A91468a59440F4601f1388G0416P088k7252a7701j96428B21812
15324b8699B2059J6485J94612r6940a2319j72179C03804b6374A02994a08546B09493
$$ y = [-194601, -69564, -151051, -144574, -172382, -343782, -204404, 26607, -35379, 122745, 8416, -121890, 139031, 191687, 350210, 66892, -124145, 70117, 2250, 193340, -26439, -295582, 80179, 254289, -87627, 371856, -44580, -319109, 43580, -189912, 51807, 267155, -71514, 337100, 106174, 138862, -145654, -102550, 104589, 240179, -205253, 219652, -123977, 46020, -459248, -74565, -135153, -37617, 100914, 167078, -214507, -324276, 92578, 145859, -117354, -47588, -23963, -39626, -143313, -13657, 50135, 265925, 101286, -237664, -29042, 51344, 261107, -128470, 52717, -27617, 191468, -159440, 64601, -61388, 70416, 77504, 50252, -17701, -214129, 221812, -28699, 22059, 38544, 233156, 136216, -12319, -184498, 303804, -26374, 102994, -108546, 209493]
15312B61002j1354a86002Q5712C6027J67599J42089c06476B30294c0885j51233
15302a82118A50700b8400E5660a86580C015J59808E9221b40399B55716I7323i9615
15290A500P874a5670E9799k2605b4178E2071K25213a90815M7092I766g1495b1697
15277a99544A06884J89894j31912b9451j32678A67710J036b7792n9097C82h8729
15265c3840B43947J95777C0894P2597b52592B10649a85490A10816h856A18213
15254C2053J73670D4707J80990i7418C58818B8820J02329d1966K09j95219B00070
15242B59476A25600B1927L16746j32565b65919E7541a20461J3696A8031J4741
15232C2772a5260k86835h588G264d307D82583A47044C9954J24253a5181l4370
$$ y = [261002, 249648, -186002, -100290, 36027, 203626, 345715, -306476, 230294, -30885, -182118, 150700, -28400, 55660, -186580, 3015, 162823, 59221, -240399, 255716, 97323, -99615, 1500, 9374, -15670, 59799, 37194, -24178, 52071, 277284, -190815, -143723, 9766, -71495, -21697, -199544, 106884, 296778, 164866, -29451, -162129, 167710, 168746, -27792, -86889, 382, -88729, -33840, 243947, 439724, 30894, 103491, -252592, 210649, -185490, 110816, -8856, 118213, 32053, 205723, 44707, 225697, -97418, 358818, 28820, 131149, -41966, -41757, -236976, 200070, 259476, 125600, 21927, 338673, 206108, -265919, 57541, -120461, -106765, 18031, 32772, -15260, -302095, -8588, 7264, -4307, 482583, 147044, 39954, 164207, -15181, -49551]
15221d9551j15083C19815j58478n8646A1949L08113p220C2886b35728B5329i2216
15209B27362r7723A4549c56878C1452h4249j31973B22505a31947B91981h1404
15198F5510B7485J28163i5622c3950A14771a7534k2416D79833j40310C3017J51389
15187A84406i8442K3003j41229B92438A42844h6176A2457K20892a26696I9672
15176F7686L5300K01449a30756A5436b70992C27274G2305N5570E4559h9020B92421
15164C06289j29707g3058F6419J477J61770l9888c1090A57525J72399b24847H3250
15152a50413B985J62047N3562J6853b12563A75634b1999B98277A23226J33874
15142B57100K06156d3094B80481l4872i8977A33244o4037a24658B40513k4708
$$ y = [-49551, -164634, 319815, 161337, 102691, 11949, 320062, 312842, 32886, -235728, 25329, -92216, 227362, 129639, 14549, -356878, 31452, -84249, -216222, 222505, -131947, 291981, -81404, 65510, 27485, 155648, -95622, -33950, 114771, -17534, -39950, 479833, 339523, 33017, 184406, -98442, -75439, -216668, 292438, 142844, -86176, 12457, 233349, -126696, 99672, 67686, 102986, 304435, -130756, 15436, -270992, 327274, 72305, 127875, 54559, -89020, 292421, 306289, 176582, -73058, 66419, 67896, 229666, 189778, -31090, 157525, 329924, -224847, 83250, -150413, 2985, 165032, 218594, 235447, -212563, 175634, -21999, 298277, 123226, 257100, 463256, -43094, 280481, 245609, -98977, 133244, 69207, -124658, 240513, 215805]
15132B15805e7080j1226A17807J18349F3111M42716b04860H9235J94999C4701
15121A65802a06917J8803B53597d7668j00012B81998j16482j7109J04824c1262
15110D6814L50749j22519P0557B4717J48233J83M15769a46869B91923F9538b37458
15098A64856L7862a7501G874L32945a65168B47633F3064P5002n6339J31026a83737
15086C54368F8325Q4696C8001a23972B3405R4763J92647K74814e5664p0384K6248
15075i9800B926J30213K19715a09200J7950B07152A02717P5495J1830K88619j16800
15064C61861e1408k05039E15290e3542E86867F4328B2957M55240A59944K08565
15054C68509O5728F0491g2689C84814f6301D23422b7039A90489l599J21140A48590
$$ y = [215805, -57080, -68306, 117807, 236156, 63111, 505827, -204860, 89235, 284234, 34701, 165802, -106917, -88114, 253597, -47668, -147680, 281998, 165516, 148407, 253231, -31262, 46814, 397563, 275044, 345601, 24717, 172950, 173133, 588902, -146869, 291923, 69538, -237458, 164856, 202718, -17501, 7874, 340819, -165168, 247633, 63064, 138066, 81727, 212753, -183737, 354368, 68325, 153021, 38001, -123972, 23405, 118168, 310815, 585629, -55664, -126048, -99800, 2926, 133139, 352854, -109200, -91250, 207152, 102717, 178212, 190042, 478661, 361861, -51408, -256447, 515290, -53542, 586867, 64328, 22957, 478197, 159944, 368509, 434237, 60491, -72689, 384814, -66301, 423422, -27039, 190489, 186890, 308030, 148590]
15042a6280B10287a25406E19840A85223p0028L12614a03499D59730A97903d03536
15031d8101C11670L1996o3679A6783K74749H1023b1985A93416K7683D0461N4329
15020I4790L4666b40697D89191A01658O21906C10672E5067a20419M2194B33085
15009A70275O5811k0029C0473K8860c1490A13086J90708K295o3949H549K72140
14998B80689J92421N5476B08264l59L02285A84286F716K71541l6950j19075K83104
14987D05336c6623E48072A04801N0036K62342j22942p2099N5704k2719J31011
14977C86134j39819A00872C5006O7682e5183B37238K38636E5347J85949R7983
14967C39279a45620c7137c413B53520a4290A50010N4054E9260K33099J60528j16129
$$ y = [-16280, 210287, -125406, 519840, 185223, 115195, 427809, -103499, 459730, 197903, -403536, -48101, 311670, 343666, 279987, 16783, 291532, 81023, -21985, 193416, 221099, 40461, 94790, 129456, -240697, 489191, 101658, 723564, 310672, 55067, -120419, -78225, 233085, 170275, 236086, 216057, 30473, 59333, -31490, 113086, 303794, 306089, 242140, 8549, 280689, 473110, 528586, 208264, 207905, 510190, 184286, 6716, 278257, 241307, 122232, 405336, -36623, 548072, 104801, 154837, 417179, 294237, 222138, 277842, 255123, 386134, 246315, 100872, 35006, 102688, -55183, 237238, 475874, 55347, 241296, 339279, -145620, -37137, -3413, 253520, -14290, 150010, 204064, 59260, 292359, 452887, 336758]
14956C36758A07016K03247a1238B23773J04548A52241B8350K05992o2431p0931
14946A00980K37731K20174A83761J18473j01435b3143D77975j43851j36762J28871
14936C26233L26838B51014J26976j47525l5019n6124J81056a14826C73532d6918
14925F1876J17866R2516A04483K67615j66143j8862J40358J1927j630A58215J33374
14914B91589A02192j1652J88932J04650j89441J77486K6377q4886j39953J67160
14904C40865A59051J77792R4217j21228r8921J70617j82138J55730j07904P1591
14894C18807g019B85177O7104F2809M33730o4412k03158Q790n6843o7593N559
14883A18882J1718K4802K04615R5641A72374P0992H1710K61331c0194C84577N9916
$$ y = [336758, 107016, 310263, -11238, 223773, 328321, 152241, 28350, 234342, 171911, 100980, 338711, 558885, 183761, 302234, 200799, -23143, 477975, 334124, 197362, 326233, 653071, 251014, 377990, 230465, 195446, 139322, 320378, -114826, 373532, -46918, 61876, 179742, 272258, 104483, 372098, 205955, 187093, 327451, 339378, 337748, 158215, 291589, 102192, 90540, 279472, 384122, 194681, 372167, 398544, 313658, 173705, 340865, 159051, 336843, 431060, 309832, 210911, 381528, 199390, 355120, 247216, 318807, -7019, 285177, 352281, 62809, 496539, 432127, 228969, 237759, 180916, 113323, 118882, 130600, 155402, 360017, 455658, 172374, 243366, 81710, 343041, -30194, 384577, 444493]
14872D44493j44847J07286j05178J8695n0998g614A8026Q3785K91625r4525K92785
14861E91696A45548N18838B64526J08922A85075K22391r9192q939j30462J94384
14851C63257A32312L41702k5504j47859j16041j0253L25218k00240l8599L03932
14841E64668A07667L96891B17233L49195B53458I7533P4993J65622q9757R9844
14831C48235G7826J03931M13644j09755j12889N2337o5634K50893r5489j59324
14821C55540M5178j46245J71083J35181L1960A91822L11267k10608K50345o7061
14811D75765j03354A61626K47530M85560m40910J00027A23365J46204N6669J09034
14801D35272q442M1420J14218j06268K34649m651k33750P6418k5875M8555p1440
$$ y = [444493, 299646, 406932, 301754, 320449, 269451, -7614, 18026, 101811, 393436, 298911, 591696, 145548, 664386, 264526, 373448, 185075, 407466, 308274, 299335, 168873, 363257, 132312, 474014, 448510, 300651, 184610, 174357, 499575, 299335, 260736, 564668, 107667, 504558, 217233, 566428, 253458, 97533, 172526, 338148, 248391, 348235, 77826, 181757, 595401, 485646, 372757, 425094, 359460, 610353, 514864, 355540, 400718, 254473, 425556, 560737, 592697, 191822, 503089, 292481, 542826, 475765, 372411, 161626, 409156, 894716, 453806, 553833, 123365, 269569, 326238, 435272, 426830, 468250, 582468, 476200, 710849, 706198, 472448, 548866, 522991, 571546, 500106]
14790E00106j75352L27285j96316r4755M6671P1001j05558J4335K20553K5319
14780F33289k40198J59637o8653K1683j84300J68205M4043q6847M4882J44813
14770F36554k9771B22342K41183m8225K65961j02689A56399K00125N15380B36301
14759H79802m10386Q192j03423L52637l8766k68169O39078l36413l9257B56182
14748E02311O2150Q6476r8419J71239p2891K02829k15772L9212j12838n9664l8862
14737D65771J04456L60911l53502j10191M17842l86345O12567m09272j42947p9209
14727D80081q0452K69413k4420k43350M17871q2815L66485l21215J20501j24443
14717G77656k48977J86301j19462k53206K23026p8854J12935J34543J32225l08439
$$ y = [500106, 324754, 652039, 455723, 360968, 407639, 478640, 373082, 387417, 607970, 633289, 393091, 552728, 484075, 505758, 321458, 489663, 533706, 446859, 491741, 636554, 606783, 222342, 463525, 415300, 681261, 578572, 156399, 356524, 871904, 236301, 879802, 469416, 477608, 374185, 726822, 688056, 419887, 1058965, 722552, 683295, 256182, 502311, 564461, 650937, 552518, 723757, 650866, 853695, 637923, 677135, 564297, 504633, 465771, 570227, 931138, 577636, 467445, 885287, 498942, 1111509, 702237, 559290, 480081, 399629, 669042, 644622, 401272, 819143, 736328, 1102813, 781598, 902099, 777656, 528679, 714980, 595518, 342312, 565338, 486484, 599419, 733962, 866187, 557748]
14707E57748J52910J11635m1886J27525l52825j29670M39678l2440k07493n1735
14697E73447j2637K32884j22645j48791K71856n6811J14797k94644J70270k93887
14687D33839K15438K88232Q49k92257K4167L16666l46183J43472n1567J72564
14677I05220p4865K03928k42060J76517p4996J06212k69599O6033j15812J31691
14667H12269J88446o2253k51916N8685J21914J62868j68207L89697k59040K45521
14657A237984n317k51531K9174M17066l42845J8958j12673o434p6308L53143j86691
14646A074526N7727k63406K99170j34830K56655k41932J57823J05027l05866k4194
14636I80700J03480k00898K69328k34155J88190m5411j45270L44636n4772j0484
$$ y = [557748, 710658, 822293, 780407, 907932, 555107, 425437, 865115, 832675, 625182, 573447, 560810, 793694, 671049, 522258, 794114, 737303, 852100, 557456, 727726, 433839, 649277, 937509, 938358, 646101, 670268, 986934, 640751, 784223, 732656, 905220, 830355, 1034283, 792223, 968740, 893744, 999956, 730357, 796390, 680578, 812269, 1000715, 938462, 686546, 745231, 867145, 1030013, 861806, 1251503, 992463, 1237984, 1232667, 981136, 1010310, 1427376, 1084531, 1103489, 990816, 984382, 908074, 1261217, 1074526, 1132253, 868847, 1168017, 1033187, 1289842, 1047910, 1205733, 1310760, 1004894, 980700, 1084180, 883282, 1152610, 918455, 1106645, 1061234, 915964, 1260600, 1205828, 1195344]
14626A195344P6247k3516j59090K30621q9993K92196l86265J64526n4810q861
14616A236399Q0954j44332J86367O3957N7787j5406l70886L62318j74395J06852
14606A389615J34170o8170j95466j63219K82212K06733l28824K26066j00526J86520
14596A569111r5689n126L8642J49451J51331l40333p5319P6426J74069J09184
14586A751747k43210J55188J38386l00877K58162n2558J6916K2274j22675J17387
14576A740740Q5490j27947K03323M4349q3311M9134L35598l61755l62787J24328
14566A647162K99797N7064L44502j84171J90162M9651k45414K82177Q9711j63768
14556B366873O05925l36361K58795N82046N13700M25737J000689K229162L491557
$$ y = [1195344, 1271591, 1248075, 1088985, 1319606, 1229613, 1521809, 1135544, 1300070, 1245260, 1236399, 1317353, 1173021, 1359388, 1423345, 1481132, 1465726, 1094840, 1457158, 1282763, 1389615, 1523785, 1455615, 1260149, 1096930, 1379142, 1585875, 1257051, 1483117, 1382591, 1569111, 1473422, 1468296, 1506938, 1656389, 1807720, 1467387, 1392068, 1468494, 1642563, 1751747, 1508537, 1663725, 1802111, 1501234, 1759396, 1706838, 1723754, 1746028, 1623353, 1740740, 1826230, 1698283, 1901606, 1945955, 1862644, 1911778, 2247376, 1885621, 1522834, 1647162, 1946959, 2004023, 2348525, 2164354, 2354516, 2404167, 2158753, 2440930, 2530641, 2366873, 2972798, 2636437, 2895232, 3477278, 3990978, 4416715, 5417404, 7646566, 11138123]
14547A1138123Q193385J5148186P993731A9108044G606017C726724p82300p51433
14539B192991l42499k50102L90236L4139j32503M1120p0173N2271r4819L10727
14529B131388n00567M97992M587k42893J43577j66376K32584J47813N8284k43898
14519B062491L77349L84j0230j18878o8032R682l4192J80768j65819N54622l67048
14508B421097l19505O33993j32139J27156K18901l66579M62607l64672j76657
14499B504202J83423L3080L49382m43092L88841l5390j50379L14430j1374k01443
14489B931680K76673j00131L5648J43993K07260q7067j7007J96229J38541o17025
14479C108794L19002k4879o5117L7600K15223r4353R2796K74573j31078J61742
$$ y = [11138123, 19331508, 34479694, 42473425, 19108044, 7606017, 3726724, 2944424, 2192991, 1850492, 1600390, 1990626, 2024765, 1892262, 1933382, 1863209, 1915480, 1820661, 2131388, 1630821, 2128813, 2133400, 1890507, 2034084, 1867708, 2100292, 2248105, 2306389, 2062491, 2439840, 2440224, 2429994, 2311116, 2243084, 2252766, 2218574, 2399342, 2233523, 2788145, 2421097, 2101592, 2735585, 2603446, 2730602, 2949503, 2582924, 3045531, 2680859, 2504202, 2687625, 2720705, 3070087, 2626995, 3015836, 2980446, 2830067, 3144497, 3133123, 2931680, 3208353, 3108222, 3143870, 3287863, 3495123, 3408056, 3391049, 3587278, 3725819, 3108794, 3427796, 3402917, 3337800, 3375400, 3590623, 3496270, 3589066, 3863639, 3732561, 3894303]
14469C894303J52613r8824J46879j75633J32700Q9717J25463J15158J60305k11129
14459D331552k75549j0442K98016Q1257K76311m00267N57371r0392J7996L4780
14449D820633p1907L76970j25705k410K45933k26052J52669L47295j17460k83518
14439E116448J13603J00968K30587J93808m6800L72891n7665j18272P6324K59378
14429F241270r8979L87580k58136J1270O74926l04819K61622k23912R4145K43277
14419G028244j54328K51140L28080J82761p0554J52855k94673M65247K3990q183
14409G904579M82433Q4473l9863M7148J68421L183K71274l53618N74579m1570
14399I101039O11574J28701m05476R24544j65717K19864O4163M90550n5825J5542
$$ y = [3894303, 4046916, 3948092, 4094971, 3919338, 4052038, 4141755, 4267218, 4382376, 4542681, 4331552, 4056003, 4045561, 4343577, 4424834, 4701145, 4300878, 4858249, 4767857, 4785853, 4820633, 4748726, 5125696, 4999991, 4997581, 5243514, 5017462, 5170131, 5517426, 5399966, 5116448, 5230051, 5331019, 5561606, 5755414, 5708614, 6081505, 6023840, 5905568, 5981892, 6241270, 6142291, 6529871, 6271735, 6283005, 6957931, 6653112, 6914734, 6690822, 6784967, 7028244, 6873916, 7125056, 7453136, 7635897, 7565343, 7718198, 7423525, 7888772, 7912762, 7904579, 8387012, 8471485, 8431622, 8478770, 8647191, 8650374, 8921648, 8568030, 9142609, 9101039, 9712613, 9841314, 9435838, 10360382, 10194665, 10414529, 10478692, 10969242, 10913417, 10928959]
14389A0928959J24091K59774O2236K91895K69410M59905j91828N27951q1209N06955
14379A3158139N7794P30202j49425J61984M43579L0529O5536N12119N06812L06074
14369A5823343K53147J32980O17456K79333N65958K45022N13044o9679P98542
14360A9159146K63124M47020Q58413L53148r259Q27746N66080O41656K35650O03905
14350B3946629N00863P35751N33615N38307O82077J052128N04394P97482L97478
14341B9688724J113590P82663R90634J122821O73281J082085J080731Q90692J204069
14332C8629290J189100J070689J224206J541974J126827J717991J443651J708638
14324D9652366J792102J558310K053087K091185J847759K187716K126951K259530
$$ y = [10928959, 11053050, 11312824, 11375060, 11666955, 11936365, 12396270, 12204442, 12732393, 12651184, 13158139, 13215933, 13946135, 13796710, 13958694, 14402273, 14432802, 14498338, 15010457, 15517269, 15823343, 16076490, 16209470, 16826926, 17106259, 17672217, 17917239, 18430283, 18360604, 19159146, 19422270, 19869290, 20727703, 21080851, 21071592, 21899338, 22465418, 23107074, 23342724, 23946629, 24447492, 25183243, 25716858, 26255165, 26937242, 27989370, 28493764, 29291246, 29688724, 30802314, 31584977, 32575611, 33698432, 34371713, 35453798, 36534529, 37425221, 38629290, 39818390, 40889079, 42113285, 43655259, 44782086, 46500077, 47943728, 49652366, 51444468, 53002778, 55055865, 57147050, 58994809, 61182525, 63309476, 65569006]
14316F5569006K515749K526103K613138K867165L391277L327530M079988L201168
14308I0091124M084766L755663M713712M731471M941394N128990N697811N947375
14300A29092306O603532O933055P299659P334455Q304092Q597106R402607R617014
14292A93183826J0986853J0666949J2126173J2195651J3563044J3498812J4379622
14285B80600930J5037316J5561717J5993886J6447804J6592055J6526385J6096357
14278C92856450J5585235J5011914J3560901J2112663R464953O405377K076819
14271D67074312o9568J237821l53422l071244l975636o909685j0617437j2252827
14263D31062314j4379217j5368981j6386528j6513692j6423496j6813021j5958510
$$ y = [65569006, 68084755, 70610858, 73223996, 76091161, 79482438, 82809968, 86889956, 90091124, 94175890, 97931553, 102645265, 107376736, 112318130, 117447120, 123144931, 129092306, 135695838, 142628893, 149928552, 157263007, 165567099, 174164205, 183566812, 193183826, 204170679, 214837628, 226963801, 239159452, 252722496, 266221308, 280600930, 295638246, 311199963, 327193849, 343641653, 360233708, 376760093, 392856450, 408441685, 423453599, 437014500, 449127163, 458592116, 464997493, 467074312, 467004744, 468242565, 467889143, 464817899, 460842263, 453932578, 443315141, 431062314, 416683097, 401314116, 384927588, 368413896, 351990400, 335177379, 319218869]
14256C19218869j6202038j5386616j4577207j4362937j3322905j3220073j2121172
14249B20025921j1248099j0961805r868402r879368q676158q284508p990834p530482
14241A45586265p051571o764147o094012n473757n282010n296038m781211m366734
14233A00476785m737735l868727l273946l580187l404500l188956l455845k931334
14225G2035555k705296k891846k211738k629814j545925k499837k041163j629195
14217E3880741j728487j511877j582998j663884j283239j550341j476845j556587
14209D1526483j046334j071089n82500p60916j407506j607824o14083j051257
14201C3384974r96406m17269j162228q03366r76876n15789q46672p39167k13341
$$ y = [319218869, 303016831, 287630215, 273053008, 258690071, 245367166, 232147093, 220025921, 208777822, 197816017, 187947615, 178068247, 169392089, 161107581, 153116747, 145586265, 138534694, 131770547, 125676535, 120202778, 114920768, 109624730, 104843519, 100476785, 95739050, 91870323, 88596377, 85016190, 81611690, 78422734, 74966889, 72035555, 69330259, 66438413, 64226675, 61596861, 60050936, 57551099, 55509936, 53880741, 52152254, 50640377, 49057379, 47393495, 46110256, 44559915, 43083070, 41526483, 40480149, 39409060, 38826560, 38065644, 36658138, 35050314, 34436231, 33384974, 32388568, 31971299, 30809071, 30005705, 29028829, 28513040, 27666368, 26927201, 26713860]
14192B6713860r13398q96225k86816p48219p10582n21267k59333o89229o36148
14183B1052643n82213j16234Q12r37887l12277n44170l01634m50937m66070j58532
14173A7183501k73053m6233p87714l05729J14489p46276n13988L069k94408k40371
14163A4093287j56260m69635j36660n8333l84730l16629R0484n38284j34957k9607
14153A1958676j77065j63931l50445l19647j76429k14179n868k52512k92593J02150
14143A0108157j84307m96693M52203j65858j16016m20790j24607j26760p4622
14134H850707l4607k73845j35314P1710n16801R1596p095l48177l92580J43585
14124G449179L01758n71553J90443j53268Q2129j32812n01968L27547j6339m99267
$$ y = [26713860, 25800462, 24904237, 24617421, 23869202, 23158620, 22637353, 22378020, 21688791, 21052643, 20470430, 20354196, 20355008, 19417121, 19104844, 18560674, 18259040, 17808103, 17342033, 17183501, 16910448, 16864215, 16076501, 15770772, 15885261, 15138985, 14624997, 14628066, 14333658, 14093287, 13937027, 13467392, 13330732, 13272399, 12887669, 12571040, 12661524, 12123240, 11988283, 11958676, 11781611, 11617680, 11267235, 10947588, 10771159, 10556980, 10551112, 10298600, 10006007, 10108157, 9923850, 9427157, 9879360, 9713502, 9597486, 9176696, 9052089, 8925329, 8850707, 8816100, 8542255, 8406941, 8478651, 7961850, 8053446, 8046351, 7698174, 7305594, 7449179, 7750937, 7179384, 7369827, 7216559, 7298688, 7165876, 6663908, 6991455, 6975116, 6475849]
14114F475849J72339j57715j52296m33689J80428J35711m885j85697J42082k28676
14104E943451m19064K90650k22208J06397R5511m60310K28018n70359K94270j75254
14094E111102l29656L63768j85031J22975j60226l5418q4314K1385q1519j75671
14084D567395R1743m0805j82883k72402L07628J32959m05907J93362j78643k1706
14074D190741K3536p0652n4710m3673m28250L50374L2233j14234l8214N9918Q2604
14063C989673j34147l32220M02510l25556L0661p9080k31145L69373l86004n5010
14053C249055P5039l71679Q58285q81284N17355K1809n64281M33108j3147l72446
14043B951814N3469L4497O252L2037l28350L11622k94456K18324j9903J53131
$$ y = [6475849, 6648188, 6490473, 6338177, 5904488, 6084916, 6220627, 6215742, 6030045, 6172127, 5943451, 5524387, 5815037, 5592829, 5699226, 5794737, 5334427, 5562445, 4992086, 5286356, 5111102, 4781446, 5145214, 4960183, 5083158, 4922932, 4887514, 4803200, 4824585, 4743066, 4567395, 4659138, 4618333, 4435450, 4163048, 4470676, 4603635, 4197728, 4391090, 4212447, 4190741, 4214277, 4143625, 4088915, 4045242, 3616992, 3967366, 3999599, 3885365, 3847151, 3907069, 3989673, 3855526, 3523306, 3925816, 3600260, 3630921, 3551841, 3320696, 3690069, 3304065, 3249055, 3324094, 2952415, 3810700, 2929416, 3446771, 3468580, 2904299, 3337407, 3324260, 2951814, 3005283, 3039780, 3046032, 3078069, 2749719, 3061341, 2766885, 2985209, 2965306, 3118437]
14033C118437m52224M52996n09670J14089r5342K77430l30247q4513K64624J66473
14023B922053k32478k48624l39299N65356n3481k12185p96K41081l29036Q764
14013B321355j79975m6045L02422l01584L48943j24890K4959k56829J65237N9771
14003B313364l40254J21030k26697L69709l44965k00369M34402l66294K92584
13994B052510k32908J78503J28384J04976M25055J016694L011460P465161J4933935
13985B9083770J5128181j9099283A2276411m747669k060617j423515k82443j51021
13977C611146o65695k60182J19190k16304P1379l66928q35j1733p981k20471j09915
13966A941671j0107K70717j40357k434N8761m20350L75068K9190m25690J86887
$$ y = [3118437, 2666213, 3119209, 2609539, 2723628, 2628286, 2905716, 2575469, 2490956, 2755580, 2922053, 2689575, 2440951, 2101652, 2667008, 2613527, 2401342, 2400546, 2641627, 2312591, 2321355, 2141380, 2095335, 2397757, 2096173, 2445116, 2320226, 2345185, 2088356, 2253593, 2313364, 1973110, 2094140, 1867443, 2237152, 1892187, 1691818, 2126220, 1759926, 2052510, 1819602, 1998105, 2126489, 2231465, 2656520, 3673214, 6684674, 14149835, 29083770, 44211951, 25112668, 12276411, 7528742, 5468125, 4044610, 3762167, 3611146, 2945451, 2685269, 2804459, 2588155, 2659534, 2292606, 2291771, 2280038, 2272057, 2051586, 1941671, 1931564, 2202281, 2061924, 2059490, 2118251, 1697901, 2072969, 2102159, 1676469, 1863356]
13956A863356M84003n20748q0748j14956J95989O988p3787l9612K07618r8187
13946A829916k56682o142J95429n37518P12796l51183l25275L45515K37939m11465
13936A433330K27132k19799K92408k69671K95059k47840O2308j40604k42759J14468
13926A304032J86537j3417J48824m1107n87741M41324N0046j76978J23489j38710
13916A296299o34583N18037o5643K54319L07548k87858M5005m6314j89362J27128
13906A324576j60506k27264K33768j12265J31747J32928l56784K68835J13755
13897A348790k84827N296j1130m0764K09392k33337M33193l13658P6372J93161
13887A382488n40304L76458j27509Q6340m39637K55219m3182Q4090l55178J75315
$$ y = [1863356, 2347359, 1826611, 1745863, 1630907, 1826896, 1833884, 1760097, 1720485, 1928103, 1829916, 1573234, 1567092, 1762521, 1225003, 1937799, 1586616, 1261341, 1606856, 1844795, 1433330, 1660462, 1440663, 1733071, 1463400, 1758459, 1510619, 1572927, 1432323, 1189564, 1304032, 1490569, 1477152, 1625976, 1584869, 997128, 1438452, 1488498, 1311520, 1435009, 1296299, 661716, 1179753, 1114110, 1368429, 1675977, 1388119, 1433124, 1386810, 1197448, 1324576, 1164070, 936806, 1170574, 1058309, 1190056, 1322984, 966200, 1235035, 1348790, 1063963, 1069259, 1058129, 1017365, 1226757, 993420, 1426613, 1112955, 1189327, 1382488, 842184, 1218642, 1091133, 1177473, 737836, 993055, 949873, 1033963, 678785, 854100]
13877H54100M74476p2946J10748n47894K74239L2166l22168L80359l45172J07008
13867I44916J25866m95220L26368k16643J99307K52582J67577k89555k3335l1645
13857I60218K1891D11930L31246M16484l52241L67650k05582n6057q8751J45914
13847I70593J00271j44405k0502j28587k42165K78631M77852n79271L61106k31683
13837H41840m7400K1475J58968k5422p3142J25194j34770l09141J59870J60696
13827H78168J72569k25226O3902m16472L10828j10544j8969j5935l453M76050
13817A110918k98991Q1490k86437K70441m3009C24846M08454l29866K1000M64106
13807H88540j83679K45724k51837j74080J10208k7020J40345J76984r8555k78351
$$ y = [854100, 1328576, 1255630, 1366378, 818484, 1092723, 1124889, 802721, 1183080, 837908, 944916, 1070782, 575562, 901930, 685287, 884594, 1137176, 1304753, 1015198, 991863, 960218, 982109, 411930, 743176, 1159660, 807419, 1175069, 969487, 913430, 824679, 970593, 1070864, 926459, 905957, 777370, 535205, 813836, 1291688, 712417, 1073523, 841840, 794440, 815915, 974883, 949461, 876319, 1001513, 866743, 557602, 717472, 878168, 1050737, 825511, 889413, 472941, 783769, 673225, 654256, 638321, 634868, 1110918, 811927, 893417, 606980, 877421, 834412, 324846, 733300, 403434, 424434, 888540, 704861, 950585, 698748, 524668, 634876, 607856, 748201, 925185, 826630, 548279]
13797E48279m7571J78602m3797K0335J61763m9225m0883j06236J64671l22477
13787D63461L50102q5471M1790k3785P1518p9823J32158j94594j91632J53681
13777F37405k365p0985r2954J79682K54420l36443o0382q6724K22604R7655O7569
13766H09482j66254M3733l23164Q433K92528J34279k17703J3162K31437l89353
13756D36580p7139K76948j44765l2160J58990N6962K92463k93046k02950M5140
13746E17023K27700k47835L47595j26841p0852P4149k70057Q4401l045K5855L26369
13735H84462k19687P962j68545B01393K69733Q5293j0931m9375j70254J17878
13725D43737N7827L13457k80261o4889L89461l26544O3273j28915M7274R0415
$$ y = [548279, 500708, 679310, 635513, 655848, 817611, 768386, 727503, 621267, 785938, 463461, 813563, 728092, 769882, 746097, 817615, 737792, 869950, 675356, 483724, 637405, 635040, 564055, 471101, 650783, 905203, 568760, 508378, 421654, 644258, 741913, 809482, 643228, 686961, 363797, 372230, 664758, 799037, 581334, 594496, 825933, 436580, 359441, 636389, 491624, 459464, 618454, 675416, 967879, 674833, 471883, 517023, 744723, 496888, 844483, 717642, 646790, 720939, 450882, 535283, 532238, 558093, 884462, 664775, 672737, 504192, 201393, 471126, 556419, 545488, 496113, 325859, 443737, 501564, 815021, 534760, 469871, 859332, 532788, 596061, 467146, 514420, 604835]
13715F04835k91265J68626n1445k05551l4489M05463J48379C64250R3525j40418
13705C17357J23042L30789l81481O6902m5376J40175j77694J00011J37139k70744
13695C40120O7652c213C29640J45863m3259o0886k6296L37937C20708J31386j31550
13684C20544M6601R1361K78991l50020j28283K27046Q7950A12412M52965F1319
13673D65972K39937j00037k29445J65680A28795P6000J83752j75199M2669G9508
13662G22346k18230k5143r0508L3381R1408b05798D09259J32544k69660J94902
13652D67045p0357L0564Q9161j59065N9980j97588K07172j73028J69989j50307
13642B73566r3977M12484j73818j24040K96458o4437j68221M2106A79430J64012
$$ y = [604835, 313570, 482196, 430751, 225200, 190711, 596174, 744553, 364250, 457775, 317357, 440399, 771188, 389707, 456609, 411233, 551408, 373714, 473725, 610864, 340120, 407772, -3213, 329640, 475503, 432244, 371358, 345062, 682999, 320708, 452094, 320544, 367145, 458506, 737497, 387477, 259194, 486240, 574190, 112412, 565377, 61319, 465972, 705909, 605872, 376427, 542107, 128795, 204795, 388547, 213348, 256017, 79508, 722346, 504116, 478973, 388465, 421846, 513254, -205798, 409259, 541803, 272143, 467045, 396688, 427252, 516413, 357348, 417328, 219740, 426912, 253884, 423873, 273566, 179589, 592073, 418255, 294215, 590673, 526236, 358015, 400121, 179430, 343442]
13632C43442j66706F0994N52148j23921L57918B76305M64442B54404Q4204c3441
13621C12141J24654j82967n4538G5104R6871K25431Q29A13498K82382J42786j83370
13610C55296O5482R7164j80220j24634M4230L68443j47302L4969N1354B45014
13599A90878L05957p6632A26497N36667G7033b57070B45732J59065r4297R1432
13589D01932K58549k56371R5701K0256A6521M59746j98505J99329J24588k12506
13579C89173L5599j85351j11659L12861M9544a88456D95879A90853J71637M4332
13569D06822I4320l0177K94863d6580B22407L35391B40502l7588M1707K83053
13559E27674r8556a55529B55302I9827P0284n1030J74427R7970J8105j90049l9419
$$ y = [343442, 176736, 60994, 613142, 489221, 847139, 276305, 740747, 254404, 338608, -33441, 312141, 436795, 253828, 199290, 75104, 171975, 397406, 398235, 113498, 395880, 538666, 355296, 420778, 517942, 337722, 213088, 257318, 625761, 478459, 513428, 564782, 245014, 190878, 496835, 420203, 126497, 663164, 77033, -257070, 245732, 404797, 310500, 401932, 660481, 404110, 499811, 520067, 16521, 476267, 277762, 477091, 601679, 389173, 424772, 239421, 127762, 440623, 490167, -188456, 495879, 190853, 362490, 406822, 94320, 64143, 359006, -46580, 222407, 557798, 240502, 202914, 244621, 527674, 429118, -155529, 255302, 99827, 170111, 119081, 293508, 391478, 409583, 219534, 180115]
13548A80115n4921K45523j08870J15928j15606J8914k9441j5360L68809b2198
13537A28692b3992E05717J10341B02388k1659J9943I4774K90592j34815K37626
13527D88177f1023C98484J02666j45300A74373o7284J29862n3333c7308A65594
13516B40930L44657A15283J40572e5894B34975A0554a25173F09989A27988M31233
13506E59221e8247C44723J62003a7912E54423I0427R4406n5781K22583k9760I1847
13494D16864R3151k30306K61572B15942n2190L20371A42292J35553J1697o756
13484B82786J36278F7971L48734A18858J90559j5607P7688J8526b32217E28778
13473B01610g9928r3355A8832J8614P5487R6337J34525j57563n0002a30524C62575
$$ y = [180115, 125194, 370717, 261847, 377775, 262169, 281083, 251642, 236282, 605091, -22198, 128692, -23992, 505717, 616058, 202388, 180729, 200672, 94774, 385366, 250551, 488177, -61023, 398484, 501150, 355850, 174373, 107089, 236951, 183618, -37308, 165594, 240930, 585587, 115283, 255855, -55894, 234975, 10554, -125173, 609989, 127988, 559221, -58247, 344723, 506726, -17912, 554423, 90427, 184833, 129052, 351635, 321875, 91847, 416864, 510015, 279709, 541281, 215942, 163752, 484123, 142292, 277845, 289542, 282786, 419064, 67971, 416705, 118858, 309417, 293810, 371498, 390024, -232217, 528778, 201610, -79928, -173283, 18832, 37446, 112933, 209270, 343795, 186232, 136230, -130524, 362575]
13461E37437F3073f7495D96975k36650J35293l5777j51316b17097B35951R9405
13451C35356q7278a1094B2717O6565J05319P863d3522A11877J7559a57653A46766
13439A68572C6266L5141a02576A2502N37363k21753j4363j56586a25067A81577
13428b4550A12102n124j1645R5724a55399j72229B98076J50400j78583l8089L8265
13417B70069p6907M73467A35301o5715a64674D35671j71020j30123K83819r8794
13407C19553j42541f1916C33424q4215F0207J8876j5734K05856R4748a94552B59551
13395d0192D63630k13163b9623C22037A46490m9456O5079G9869O1791O6940a487
13383A01238J50613j07568R0634J13830a09809B27868J50740l6964j65590M4203
$$ y = [537437, 63073, -67495, 496975, 260325, 395618, 359841, 208525, -217097, 235951, 335356, 248078, -11094, 22717, 89282, 194601, 202464, -43522, 111877, 129436, -157653, 146766, 168572, 36266, 71407, -102576, 12502, 549865, 328112, 313749, 157163, -125067, 181577, -24550, 112102, 106978, 95333, 191057, -155399, -327628, 298076, 448476, 269893, 231804, 270069, 193162, 666629, 135301, 69586, -164674, 435671, 264651, 134528, 418347, 319553, 177012, -61916, 333424, 249209, 60207, 79083, 63349, 269205, 363953, -194552, 259551, -40192, 463630, 250467, -29623, 322037, 146490, 97034, 162113, 79869, 141660, 208600, -1487, 101238, 251851, 144283, 234917, 348747, -109809, 227868, 378608, 341644, 176054, 220257]
13373B20257J32588O6779j63628f4437A60023K6992D4021M1224a40006A15873
13362d2316G0412M2317Q2977H9432J73024P6515D6071M78560k02189A8111M28883
13351D46994K0149B31095j5877m4459L79782B73173L4046N813I5380J14152Q2508
13340B92040j11759L1303G1197g3640A94288K2555J20004j16594N2425m5043q5493
13329A42142p944n6464B9228a10994A70483a3086j70882f1646F59042k64185b4802
13317D61124A51788E7383a2093B32362k2001L6138J77754b46486B00998P1065
13307B72063g9149A7834J30208M16647C9021K70212j45217d48059C58786l0804
13297C27982b1908A73355P1186m5398f3943A99415F7090a1038B63220a27432F435
$$ y = [220257, 352845, 419624, 255996, -64437, 160023, 187015, 44021, 85245, -140006, 115873, -42316, 70412, 112729, 195706, 89432, 262456, 338971, 46071, 524631, 322442, 18111, 446994, 467143, 231095, 215218, 170759, 550541, 273173, 307219, 313032, 95380, 209532, 292040, 180281, 211584, 71197, -73640, 194288, 216843, 336847, 220253, 272678, 227635, 142142, 134198, 77734, 29228, -110994, 170483, -13086, -183968, -61646, 659042, 394857, -24802, 461124, 151788, 57383, -12093, 232362, 210361, 246499, 424253, -246486, 200998, 272063, -79149, 17834, 148042, 564689, 39021, 309233, 164016, -448059, 358786, 327982, -21908, 173355, 244541, 199143, -63943, 199415, 67090, -11038, 263220, -127432, 6435]
13285E2025a76045A30150L6241Q4070J39644c11128A77873H2272O0490D8202M4430
13274I2632D0783L90532k12066k4844E8760L6996J62155d71283H8879A7314f9922
13262C22244A4145a8302n3779B42503A03842q855h1374B98184a70879h2252G4311
13250A91567g6550A75046b96225a44999C4114a2790B60404j11843k6268d2573
13239A28469L5240k1642P2808a50064j68925B94688b24693G47J02258d6545H803
13227B0188L51095A12061C9111j2972K4970J42382o1119R6323b41321f0016G3987
13215B34348a26593A20951a8390B3564K41186a64367m2270B50549I9279i6650
13204D19070G3101O384K6707a33093H8058d0762j73770l4881B49414a62996d5627
$$ y = [52025, -176045, 130150, 166391, 250461, 390105, -311128, 177873, 82272, 142762, 48202, 92632, 40783, 431315, 219249, 194405, 58760, 95756, 257911, -471283, 88879, 17314, -69922, 322244, 14145, -18302, -72081, 242503, 103842, 94987, -81374, 298184, -170879, -82252, 74311, 191567, -76550, 175046, -296225, -144999, 34114, -12790, 260404, 148561, 122293, -42573, 128469, 163709, 142067, 214875, -150064, -318989, 294688, -224693, 747, 103005, -46545, 8803, 20188, 371283, 112061, 39111, 26139, 51109, 193491, 132372, 228695, -241321, -60016, 73987, 234348, -126593, 120951, -18390, 23564, 264750, -164367, -206637, 250549, 99279, -96650, 419070, 73101, 79485, 106192, -133093, 88058, -40762, -214532, -249413, 249414, -162996, -45627]
13192A82195J09683J33372j51729b0041B82894P3616a2045D69904H7011J18948
13182B05959J36529m2047j49228A2051P8465a07142A86889R4590b9071j27836
13172a56907I1833c2951A39846j9178j6002K6075a6047I7746a47950H5823c6995
13160G0948a82112B35802O0299K05155C6402K957K3345J7692k3229d4778B76254
13148B03595L16474B37496c5235C9649g4748d838B06088p9062l8550L8701M3251
13137A70428a71684D9132R753J20789g314B13310d438j36465d7726C14604D8172
13125b04380A85230a9494o8900B67077F4177a11113I6448h4161D70938a89191
13114B80936a03559d7939E0448b17226D0091a14368A43515o4614a44738A6070
$$ y = [182195, 291878, 425250, 273521, -20041, 282894, 356510, -12045, 469904, 87011, 205959, 342488, 300441, 151213, 12051, 90516, -107142, 186889, 281479, -29071, -156907, 91833, -32951, 139846, 120668, 104666, 130741, -16047, 97746, -147950, 85823, -36995, 70948, -182112, 235802, 296101, 501256, 36402, 39359, 62704, 80396, 57167, -44778, 276254, 203595, 520069, 237496, -35235, 39649, -74748, -4838, 206088, 127026, 88476, 127177, 170428, -171684, 49132, 58885, 179674, -7314, 213310, -4438, -140903, -47726, 314604, 48172, -204380, 185230, -19494, -88394, 267077, 64177, -111113, 96448, -84161, 470938, -189191, 280936, -103559, -47939, 50448, -217226, 40091, -114368, 143515, 78901, -144738, 16070]
13103H6645k9314P9320d9713i206E265L97622j26217a18339B72079j27037N9239
13092B04281d3566A66200P692J33614b51855i3351b8717O56r2445r7363f249j17866
13080a24115P698A97272G03a37500I2913c5131B29175a05869a9280B04598R3560
13069B98158q9607a28268B19789H0311M7135b12498A32670c07272C17535f1193
13058A72923J22248C2358a7420A7117b01748C57449P4543j70344f2978l9433O96
13047a01715C7312J3338d2641A29164a05543A44468m4804N7485K957a34159E4469
13035E4604b63411G3028C2047L4273M1359P6249I1375a87839C46799C7728i2209
13023A23344C4975i6538H3193K12807A19465O507N4221K39080j62496m7691L03271
$$ y = [86645, 57331, 136651, -49713, -9206, 5265, 402887, 276670, -118339, 272079, 145042, 204281, -43566, 166200, 173892, 307506, -251855, -93351, -28717, -28061, -120506, -217869, -6249, -124115, -116417, 197272, 703, -137500, 92913, -35131, 229175, -105869, -19280, 204598, 298158, 208551, -128268, 219789, 80311, 127446, -212498, 132670, -307272, 317535, -61193, 172923, 295171, 32358, -17420, 17117, -201748, 357449, 431992, 261648, -62978, -102411, -101715, 37312, 50650, -42641, 129164, -105543, 144468, 99664, 157149, 160106, -134159, 54469, 54604, -263411, 73028, 32047, 66320, 107679, 183928, 91375, -187839, 346799, 37728, -92209, 123344, 34975, -96538, 83193, 296000, 119465, 125972, 180193, 419273, 256777, 209086, 512357]
13012E12357G7300A2452a55280A98376J71415b02527E0333J08690M8264F0725
13001a73760H5086l633C8965N033R1111c42276C65032f8986k93564B04508e796
12989D7132g7398c220B68553A28499a0917D68128j70130E5117L21557j55456A10153
12977A60272f8352b1415B36631b16920A05748N6490E5424c68324J34721D816b35935
12965a25077I3611R6193b62696E11974e0429n1619E5083c2187B68353A20589E890
12953C719Q7668a10624B7794R2114N9149G1212J49633P3941I2972A7530K31333
12942B48863A1257k158j521b35492A31100a03327F612d3131G9193K48409c4684
12930G0614B1742a08671A64516D1576R6737K2052b30593A61809c5444I3210C3562
$$ y = [512357, 77300, 12452, -155280, 198376, 369791, -202527, 50333, 159023, 207287, 60725, -173760, 85086, 81453, 38965, 43998, 135109, -342276, 365032, -68986, -362550, 204508, -5796, 47132, -77398, -3220, 268553, 128499, -10917, 468128, 297998, 55117, 376674, 221218, 110153, 160272, -68352, -21415, 236631, -216920, 105748, 162238, 55424, -368324, -233603, 4816, -235935, -125077, 93611, 189804, -262696, 511974, -50429, -102048, 55083, -32187, 268353, 120589, 5890, 3719, 91387, -110624, 27794, 119908, 179057, 71212, 220845, 294786, 92972, 17530, 248863, 11257, 9099, 7578, -235492, 131100, -103327, 6612, -43131, 79193, 327602, -34684, 70614, 21742, -108671, 164516, 41576, 138313, 160365, -230593, 161809, -35444, 93210, 33562]
12918f5514n6216c9570A67865a25720D6484L2782g6128m9060A13516j9279M05084
12907D99321b16559J5121b3449I5805j1036b6098B10375C7787M7918N348f837
12895D3662d8855r1791A42298b00037A58909c6276I0158a80229A5366Q7430e2854
12883f4480A54322e5579B08068r4652Q8452a16205C1080M9214Q2746b51626B21125
12871a474m5061B05460g5531n4451c9881k05471C9167K18109f0024j52053B09825
12859h39H1750J43601D6006f0545a4341k64848A95460c01255B10482j8868j7719
12848A73895K51217A92320H0985O1839j4347m1321J05443g3082C1436K47885E1343
12836c4875C2220J21484i624p8856C09505A7323M8417c21487a20011F8309b58110
$$ y = [-65514, -121730, -39570, 167865, -125720, 46484, 79266, -76128, -125188, 113516, 94237, 499321, -216559, -201438, -23449, 95805, 84769, -26098, 210375, 37787, 85705, 91053, -6837, 43662, -48855, -140646, 142298, -200037, 158909, -36276, 90158, -180229, 15366, 102796, -52854, -64480, 154322, -55579, 208068, 113416, 201868, -116205, 31080, 80294, 163040, -251626, 221125, -1474, -46535, 205460, -75531, -129982, -39881, -245352, 39167, 257276, -60024, -212077, 209825, -839, 81750, 225351, 46006, -60545, -14341, -279189, 195460, -301255, 210482, 191614, 173895, 425112, 192320, 80985, 142824, 128477, 87156, 192599, -73082, 31436, 279321, 51343, -34875, 32220, 153704, -9624, -88480, 309505, 17323, 65740, -321487, -120011, 68309, -258110]
12824C41297h3725m006A6418f5746A67677b32057i4312B29414e9002K2155b985
12812a44665B00746a21279j10392I6082c16350a13988e637k72831A78858g7586
12801a13251A44329k313A9148d0748o5236j55354E2124A0253j555a10731d469
12789g2208A19743J16417b42067A47240b0866G2764R4579a18180H2609a68936
12778e7924q2979b9517g440C4730c67989a30960A68453J19763j32472d0581D4067
12766a22369A10344d3803B28819a90424A94275K6182p2129J40687j9291b78783
12755b66660O1474C80818f8122A83942b4967H9185J22047H1933j5671c7286j66873
12744b04159A86407C6421h761A01283b25488a1123j25994C4187Q2340b7140k72031
$$ y = [341297, -83725, -87731, 16418, -65746, 167677, -232057, -94312, 229414, -59002, -36847, -2985, -144665, 200746, -121279, -231671, 96082, -316350, -113988, -5637, -278468, 178858, -77586, -113251, 144329, 142016, 19148, -40748, -105984, -261338, 52124, 10253, 8698, -110731, -4469, -72208, 119743, 236160, -242067, 147240, -20866, 72764, 167343, -118180, 82609, -168936, -57924, -140903, -29517, -7440, 34730, -367989, -130960, 168453, 288216, 155744, -40581, 44067, -122369, 110344, -43803, 228819, -190424, 194275, 220457, 148328, 289015, 269724, -278783, -266660, -205186, 380818, -68122, 183942, -24967, 89185, 211232, 81933, 66262, -37286, -204159, 186407, 36421, -8761, 101283, -225488, -11123, -137117, 34187, 116527, -27140, -299171]
12733b99171a30768A6279f708D09961m3000d9867B63013r2801n8630a47773j98547
12722c46320A93324K8309c50088J33101i1244C7087J57654g8524G6271a35572
12711C46306I5608K00183j39079M32346G5886J35869J43667b49047C863i8720
12700A38818K9247a06250A895L28656F2837k181c80128A62908Q6946H5896D1099
12688A16814C5061o250c06376A6489J1727J12954M3231a71502D22696k07617F0194
12676b07614b487B18752A7083J87476l6552p3726K43732J37827i4208B75774J34180
12665D09954d8409B57666p3566N0366A04285i2643B78031G2821J17533F1049M3942
12654A04991c3438D8859O70089a25404B7279J11591J22350E2264K774b24125A26044
$$ y = [-299171, -130768, 16279, -6708, 409961, 366961, -49867, 263013, 170212, 111582, -147773, -346320, 193324, 221633, -350088, -216987, -91244, 37087, 194741, -78524, 76271, -135572, 346306, 95608, 295791, 156712, 589058, 75886, 211755, 355422, -249047, 3863, -98720, 138818, 168065, -106250, 1895, 330551, 62837, 60656, -380128, 162908, 249854, 85896, 41099, 116814, 35061, 28811, -306376, 16489, 28216, 141170, 184401, -171502, 422696, 215079, 60194, -207614, -2487, 218752, 17083, 204559, 168007, 94281, 338013, 475840, -94208, 275774, 409954, -48409, 257666, 184100, 234466, 104285, -92643, 278031, 72821, 190354, 61049, 104991, -33438, 48859, 718948, -125404, 27279, 138870, 261220, 52264, 55038, -224125, 126044]
12642h1347C6994J74379b01472M6022A51217B4501a82357F1125J02933N9782b26704
12630I4086J99922L7334a08929A43655a29507e1726C71181E866N8553J77940j2319
12619B30040H3170K85780b0589A77221l4351h381A16821i1395l00542A33047F4245
12607H441R4610a8972A58649i5443A29455O0543D3904a15925C7841J46138m9514
12596A34465a48093a1698n007A16307b31045C25640b56679C94408A06994R1445
12586A98439o9142C6364K05122g6061j07233I2879g0754K8505j07804I1893a80974
12574b81210a19148j4173E9440a29517A5368g2443l2686A63405A7566a23197j66705
12563b89902O8838A7943L4900Q421g0786r0365f0376N962A16607c3564H6729e2673
$$ y = [-81347, 36994, 211373, -201472, -155450, 151217, 24501, -182357, 61125, 164058, 223840, -226704, 94086, 294008, 331342, -108929, 143655, -129507, -51726, 371181, 5866, 64419, 242359, 230040, 83170, 368950, -20589, 177221, 142870, -8381, 116821, -91395, -391937, 133047, 64245, 8441, 103051, -18972, 158649, -95443, 129455, 189998, 43904, -115925, 37841, 183979, 134465, -148093, -11698, -16705, 116307, -231045, 325640, -256679, 394408, 106994, 198439, 129297, 36364, 241486, -76061, -183294, 92879, -70754, -42249, -150053, 91893, -180974, -281210, -119148, -133321, 59440, -129517, 15368, -72443, -105129, 163405, 17566, -123197, -289902, -221064, 17943, 52843, 61264, -70786, -161151, -60376, -54414, 116607, -33564, 86729, -52673]
12550d3333B10487L2166B7376e01521a00488G3838a4342j30056F908J22780a32071
12538f0473d317H5877a15828B17758c73402a04864j77472I7113a13594A40371
12527c73732A30117N9558o5494b76547J34078a758C048J04186h716G4124L57278
12516D31402j69006o7022b0920A85440P278d7545l52266g2545B21549q2717J42982
12505B81814j24329L7312j1560D2873d811A82652a20506C33481b82020e9832F9868
12493C9665b83060b6136B95920j15476J92445A49435p4176B7163a88057i3283
12482b01157H2273J6885J00034H7074a24989A01288C6784J1735K81535A14019
12471d9880l5573l43827D6180g0140r1048C2062b38878A24256k7007a85505A52749
$$ y = [-43333, 210487, 242653, 27376, -501521, -100488, 73838, -14342, -144398, 6908, 129688, -132071, -60473, -4317, 85877, -115828, 217758, -373402, -104864, -282336, 97113, -113594, 140371, -373732, 130117, 189675, 124181, -276547, -142469, -1758, 3048, 107234, -8716, 74124, 431402, 262396, 195374, -20920, 185440, 192718, -47545, -399811, -72545, 221549, 138832, 281814, 157485, 194797, 183237, 42873, -4811, 182652, -120506, 333481, -282020, -59832, 69868, 39665, -283060, -26136, 295920, 180444, 372889, 149435, 75259, 27163, -188057, -93283, -201157, 82273, 99158, 199192, 87074, -124989, 101288, 36784, 48519, 330054, 114019, -49880, -85453, -429280, 46180, -70140, -161188, 32062, -238878, 124256, 97249, -185505, 152749]
12459a57128B78759a34051G543J20617a32005h084B43740b43010C20250A4649
12448a48276c2205D5616K48190H9851K78421b19813j7583d3035C37242F6007K27835
12437B93842D8855J15786b57912J4182F1622i4095b4044B73347k8472c3888k33727
12426b67615c8603b230A33072J364a98622D8290j0423K35015r3933c31892D3438
12414c68060a25351B60528n8476a58080l4841P8436A9923L14501D7732C84b52206
12402a67329m2267j69688f2053b1322j05626j46025A3917R9598i1561P921j71017
12391b54657a12053h922B49227M8373A23729M9297d87198A6376i6756k61368h8663
12379h8798B09050b22053A66566d4373a5757B4093d2440k7081I0054O628I065
$$ y = [-157128, 278759, -134051, 7543, 128160, -132005, -8084, 243740, -243010, 320250, 14649, -148276, -32205, 45616, 293806, 89851, 368272, -219813, -237396, -43035, 337242, 66007, 293842, 48855, 164641, -257912, -243730, 61622, -94095, -24044, 273347, 244875, -33888, -267615, -38603, -2230, 133072, 134436, -198622, 48290, 37867, 272882, 178949, -331892, 43438, -368060, -125351, 260528, 202052, -158080, -192921, -114485, 19923, 334424, 47732, 384, -252206, -167329, -209596, -379284, -62053, -21322, -126948, -272973, 13917, 113515, -91561, -83640, -254657, -112053, -8922, 249227, 297600, 123729, 173026, -487198, 16376, -96756, -358124, -88663, -88798, 209050, -222053, 166566, -44373, -15757, 24093, -42440, -69521, 90054, 96682, 9065]
12367a90120j7203b3518p4436j72815B49405b6213H4948l8798f4434j16536j58087
12356c39057a19331h766q7523L663D04557A18124b04733q6825E73J5798h9056
12344A6912b32743E640L86289b92803f5449b8369A05840a43410B53402d0681A59004
12332c08458I1522b9866C4344h9207r8363A51943i7049c5749g512l31555G0612
12320A58100R9480n3128K30847A65993R874b14752m3345b448A20614a18425D03310
12308b31085C34895j63806b57081B97895c8204A54701c33541A13664M8569b9932
12297B2588j0634J6550J04653a96824B98464D1131L8531A0462K98909c39620A2224
12285B25609a14124B80823F2928K22596j7524A04137r324L9377i698E973L4885
$$ y = [-190120, -207323, -23518, -97954, -270769, 249405, -26213, 84948, 46150, -64434, -180970, -339057, -119331, -8766, -96289, -92626, 404557, 118124, -204733, -291558, 573, 16371, -89056, 16912, -232743, 5640, 391929, -292803, -65449, -28369, 105840, -143410, 253402, -40681, 159004, -308458, 91522, -29866, 34344, -89207, -187570, 151943, -97049, -35749, -7512, -339067, 70612, 158100, 257580, 204452, 435299, 165993, 175867, -214752, -258097, -2448, 120614, -118425, 403310, -231085, 334895, 171089, -257081, 297895, -38204, 154701, -333541, 113664, 162233, -29932, 22588, 11954, 28504, 133157, -196824, 298464, 41131, 79662, 10462, 309371, -339620, 12224, 225609, -114124, 280823, 62928, 285524, 268000, 104137, 94813, 134190, -9698, 5973, 40858]
12274D0858K7868a5141p5376B12026J1403h8661m0199C2349a30910A97014D8789
12262H2366a88384D1560J48422a71960J2714A65594b4068A80098c3743B25546
12251A55204p2528K7617K74844A40289j0483N4497g1150C57527c9629A28513b08432
12239a15472A86534D6361a08549C13392r8387n2660p1795L57610a30555A9247
12228F9027a16106B31029j701i5887A65733L19833q4523A84851e4510C10962b77352
12216a11114G6534J69750q2114a64300e6144F4208J58310i6186B91654A38762
12205B67460m4842K6181L59959j78868A00386j6939e6807D89069n5953K1994B22679
12193A73950J07584K4567A28193J07330I6088K328k5811b11334G7470M91547A0349
$$ y = [40858, 68726, -15141, -90517, 212026, 223429, -88661, -128860, 32349, -130910, 197014, 48789, 82366, -188384, 41560, 189982, -171960, -159246, 165594, -24068, 180098, -33743, 225546, 155204, 82676, 110293, 385137, 140289, 129806, 184303, -71150, 357527, -39629, 128513, -208432, -115472, 186534, 46361, -108549, 313392, 215005, 162345, 90550, 448160, -130555, 19247, 69027, -116106, 231029, 229328, -95887, 165733, 485566, 401043, 184851, -54510, 310962, -277352, -111114, 76534, 246284, 164170, -164300, -56144, 64208, 222518, -96186, 291654, 138762, 267460, 222618, 248799, 608758, 429890, 100386, 83447, -56807, 489069, 433116, 455110, 222679, 173950, 281534, 306101, 128193, 235523, 96088, 98416, 72605, -211334, 77470, 569017, 10349]
12181g6284a9662k9511j16695E1716J72564N6864d5081C17196o8446a91058H452
12169D727b05789B73496B0222c9626A72923J32538b4151A68971a31885j18110
12159b49995H7115h8390P710k8349B27349b38666p7639f7694A2538a31312d982
12147A95307q9730b11231A82780o7556f9156F4965M6863b45145A60474Q2031H3259
12135D94852b72140E9587k5920L22768b07305i4121F7463O2392a97781D6839J34440
12124A81279f1622j94997B8284a02237L0077B40452j00603a58474n6600A69954
12113a79660M1247d7884D3611l155L4357c11035A31062a19151M8822A35338d3135
12101i0977j20163A03477M3223E7661k936a28624A20133p312J09891c79481i7642
$$ y = [-76284, -19662, -49173, -165868, 51716, 224280, 281144, -45081, 317196, 248750, -191058, 8452, 4727, -205789, 273496, 20222, -39626, 172923, 305461, -24151, 168971, -131885, -249995, 87115, -88390, -80680, -109029, 227349, -238666, -316305, -67694, 12538, -131312, -4982, 195307, 105577, -211231, 182780, 115224, -69156, 64965, 111828, -245145, 160474, 242505, 83259, 494852, -272140, 59587, 33667, 356435, -207305, -94121, 67463, 129855, -197781, 46839, 181279, -61622, -256619, 28284, -102237, -72160, 240452, 139849, -158474, -215074, 169954, -179660, -138413, -47884, 43611, 40456, 74813, -311035, 131062, -119151, -70329, 135338, -43135, -90977, -211140, 103477, 146700, 57661, 54725, -128624, 120133, 112821, 222712, -379481, -97642]
12089F4622Q5886P1846j09114d70710A34230b3641C7288j4665J21291a22547M9668
12078g2879A22181a94871P7346d9565B01702F7366a55696D9547B4380b80043f6070
12066f0681A36030K37493O21246J134195I68082A82822e6656k9736a4554d892
12055A77602l9894A1995a67731A37574I402O3633b86626G3635g0829j71398d7082
12043A97072N2560P0167a47410B76924a06370j60031f2219k31456d2379l1319
12033g3698c2428j06919A22198a38584p3992h9942l3335E8488a70246D8524i4444
12021g7994P78l1706j2102K3748l3627E5853J60355F9648L3243g607H7048n276
12009H1772a12274B9173b78801B15376K48664b24147l9683P214d2190q642k2363
$$ y = [64622, 150508, 222354, 113240, -470710, 134230, -23641, 37288, 22623, 143914, -122547, -72879, 122181, -194871, -117525, -49565, 201702, 67366, -155696, 49547, 24380, -280043, -66070, -60681, 136030, 373523, 994769, 2128964, 968082, 182822, -56656, -86392, -14554, -4892, 177602, 137708, 11995, -167731, 137574, 9402, 73035, -286626, 73635, -70829, -242227, -47082, 197072, 249632, 319799, -147410, 276924, -106370, -266401, -62219, -293675, -42379, -73698, -32428, -139347, 122198, -138584, -212576, -89942, -123277, 58488, -170246, 48524, -94444, -77994, -77216, -108922, -121024, -97276, -130903, 55853, 216208, 69648, 102891, -7607, 87048, 81772, -112274, 29173, -278801, 215376, 464040, -224147, -263830, -256616, -42190, -50832, -73195]
11998g3195j14428L197G232b2060j75851d647k80004D85130b36238A8076h6863
11986A81353a18955K6173G087i9100J3762k6416i05k64031H0389a67194h3327
11974g4255n2476B6140P322a69014j46731O9370C35325a91231H2078a10916H4024
11962A10566f1066I241L5363R3682i9412D2462b65808R4979D7984a8475B5418
11950B28129n2189a05216G813K3284c07006B14169a28450j34617B2944a56286
11939C38675F8687K3759a64964B05433O268L30406A08051a63003P8680A48144
11928b82903Q3279B87969P305b25310P7411o399A30827J34588b2288B24516D7324
11916i3133H1796B1398L79821j39950A12284A5837a63319j78417A21464b72161
$$ y = [-73195, -187623, -184426, 7232, -22060, -197911, -4647, -284651, 485130, -236238, 18076, -86863, 181353, -118955, -92782, 7087, -99100, -85338, -111754, -905, -264936, 80389, -167194, -83327, -74255, -126731, 26140, 33462, -169014, -315745, -246375, 335325, -191231, 82078, -110916, 84024, 110566, -61066, 9241, 44604, 138286, -99412, 42462, -265808, -170829, 47984, -18475, 25418, 228129, 175940, -105216, 7813, 31097, -307006, 214169, -128450, -263067, 22944, -156286, 338675, 68687, 92446, -164964, 205433, 211701, 542107, 108051, -163003, -84323, 148144, -282903, -199624, 287969, 295274, -225310, -147899, -154298, 130827, 265415, -22288, 224516, 47324, -93133, 81796, 21398, 401219, 261269, 112284, 15837, -163319, -341736, 121464, -272161]
11905c62414A55055J23895a20100N3612j18928p4035f8416B11262d18463B85314
11894g3229D6061i7332j69728m3918j9074N1646F7485J46695f5658a2022k91523
11883c03545G9610B51a51717n9231B88436B0611q327b0167A22211i7851B70234
11871f2415B41967e35048I1596a52031J3464C44J62264a71482c38k86402R0686
11860a96054j81556J30350F8781N1619n8481c95956E8302A6590J45792J47698
11850C10080g2175j32005J0896O6903j61373g7721k2060B4348J53784b01961c5787
11838b6418m29222K04805a18083j6404B0869a826A6094K74487G1432J57205D1869
11826D7421b12849F8013a30812J0644m9372m25864g0684B33244b91247Q6988N2414
$$ y = [-362414, 155055, 278950, -120100, -66488, -185416, -259451, -68416, 211262, -418463, 285314, -73229, 46061, -97332, -267060, -310978, -330052, -278406, 67485, 214180, -65658, -12022, -303545, 79610, 251, -151717, -210948, 288436, 20611, 12284, -20167, 122211, -97851, 270234, -62415, 241967, -535048, 91596, -152031, -138567, 344, 162608, -171482, -338, -286740, -196054, -377610, -247260, 68781, 120400, 61919, -395956, 58302, 16590, 162382, 310080, -72175, -204180, -193284, -126381, -287754, -77721, -99781, 24348, 178132, -201961, -35787, -26418, -455640, -250835, -118083, -134487, 20869, -1826, 16094, 290581, 71432, 228637, 41869, 47421, -212849, 68013, -130812, -120168, -169540, -595404, -70684, 233244, -291247, -204259, -151845]
11815a51845k22037a48175B85395j17306a32654f5303k16380H2480A9330d2470
11804B4251a51041A7141a02129A83544a30848D6078a84833J4695B95294e1980
11793a78502j62424b9820q9804A77944N2526b22576E801b46171H9L652J18295
11782A22036A0070Q8880b4563l34433A9193b1564C13164d52878f8665E6353J26183
11771A82536H0999J36282b10715d1504l29398f5546H9515d5002A17798P8560A8201
11759A44910D8131M0632b03706B5723d58272e7196j35528A46639a29863B55354
11748A08786N2824n31a00055c1226j2570B13921b97373P3318G2112d4912j06371
11737a51283k65635F4707d16384A36165l4537a57795A1422f2912C84496L6546
$$ y = [-151845, -373882, -148175, 285395, 168089, -132654, -65303, -281683, 82480, 19330, -42470, 24251, -151041, 17141, -102129, 183544, -130848, 46078, -184833, -170138, 295294, -51980, -178502, -340926, -29820, -119624, 177944, 230470, -222576, 5801, -246171, 89, 3741, 122036, 10070, 98950, -24563, -358996, 19193, -21564, 313164, -452878, -68665, 56353, 182536, 80999, 217281, -210715, -41504, -370902, -65546, 89515, -45002, 117798, 196358, 18201, 144910, 48131, 88763, -203706, 25723, -458272, -57196, -192724, 146639, -129863, 255354, 108786, 161610, 161079, -100055, -31226, -43796, 213921, -297373, -224055, 72112, -44912, -151283, -416918, 64707, -416384, 136165, 101628, -157795, 11422, -62912, 384496, 421042]
11727D21042B3195b15683A77910a07935D176c02447E0870R2921k9682c8769j33058
11716a71827M8003C0813b814B56458d962B6529j1977i8411H4304J45028I0495
11704a82545C35760G6054c50323A61981F0188H912R2267h1083k7722A27161J07249
11693B34410d8453j55008j0066h8181k90194A44262g735B76762A06631K30177
11683C36808d9828C131a74634e1928A26084f3919D84123D084J32217b62959B31131
11671i2830L0326K7586q3128C20010c6683k68569P5236Q4043a3764j4991F6313
11659a03243n9326G8440a66698B401R225O2691E739b92180e4594A69200J24287
11648B93487r2638E2546F280b4638j76866O0909j0044A22347K48537j74671f4119
$$ y = [421042, 23195, -215683, 177910, -107935, 4176, -302447, 50870, 143791, 114109, -38769, -171827, -123824, 30813, -2814, 256458, -4962, 26529, 14552, -98411, 84304, 229332, 90495, -182545, 335760, 76054, -350323, 161981, 60188, 8912, 101179, -81083, -108805, 127161, 234410, -48453, -203461, -213527, -88181, -378375, 144262, -7735, 276762, 106631, 336808, -49828, 3131, -174634, -51928, 126084, -63919, 484123, 4084, 136301, -262959, 231131, -92830, -62504, -34918, -118046, 320010, -36683, -305252, -230016, -145973, -13764, -28755, 66313, -103243, -162569, 78440, -166698, 2401, 11626, 74317, 5739, -292180, -54594, 169200, 293487, 200849, 52546, 6280, -24638, -201504, -140595, -150639, 122347, 370884, 196213, -64119]
11636G1996L9947K02251G6774J01951J8931a5322p2894E4482Q8151j3646g7949
11624B35534b36506A89105r2493I690d8921b0013H1800g1713E1684h0840j8558
11613i9398M60C7765c6244C13673c4026a2726B12559F2263J92693b37811c5686
11601D6068b25072A67488L0895B2329c933A18376J46799J9658a11343a1593A04580
11589A17945D6809g9678A61488K08453A64445c4133j30235A76462O6650e9421
11578I6600J68416J07487j38998J0880b00547G7317K0966J77128r8437E7428k1800
11567C5628j492b15319N5356B7583P9659k51b44659j6396I4708P8374K5051b80433
11554h5742B73128j06416p678a5707m12482J83532A12897N816M1225n4525K63714
$$ y = [71996, 111943, 314194, 76774, 178725, 197656, -15322, -88216, 54482, 142633, 128987, -77949, 235534, -236506, 189105, 96612, 9690, -48921, -20013, 81800, -71713, 51684, -80840, -99398, -98938, 37765, -36244, 313673, -34026, -12726, 212559, 62263, 254956, -237811, -35686, 46068, -225072, 167488, 198383, 22329, -3933, 118376, 265175, 284833, -111343, -11593, 104580, 117945, 46809, -79678, 161488, 369941, 164445, -34133, -164368, 176462, 243112, -59421, 96600, 265016, 372503, 233505, 244385, -200547, 77317, 98283, 275411, 176974, 57428, 35628, 34136, -215319, -159963, 27583, 107242, 106991, -244659, -261055, 94708, 173082, 198133, -280433, -85742, 273128, 166712, 159034, -15707, -428189, -244657, 112897, 118713, 159938, 105413, 369127]
11543C69127n8918b75924J23536B5980c61336a49502A86963K89511f5047B17036
11532B14132h0306C43247a64740B02339p2392B1318M0943J06085K42563A33709
11521A56579m6539J69934n7345A08076b07453B25641a017A11077N9571C095L18933
11510C22028j31913d5162A44901J06464a08602C72539a15227B29937I6092D3538
11499G5897L18515A85427f4772G8923R5845O8391O0061A29758c51595C53174l7754
11488C15420B6803g0097A15091K40602N1574A75454J18248K7344j16191a3510
11477D3247J72521C8500L61361I3586J08853a43773E41136j54123A29325A0270
11466a69951j90552J59630H2612J72494a00556A00035P8488e1517B93278F5745
$$ y = [369127, 310209, -275924, -152388, 25980, -361336, -149502, 186963, 476474, -65047, 217036, 214132, -80306, 343247, -164740, 202339, 129947, 21318, 62261, 168346, 410909, 133709, 156579, 110040, 279974, 222629, 108076, -207453, 225641, -1017, 111077, 170648, 3095, 322028, 190115, -45162, 144901, 251365, -108602, 372539, -115227, 229937, 96092, 43538, 75897, 394412, 185427, -64772, 78923, 174768, 243159, 303220, 129758, -351595, 353174, 315420, 26803, -70097, 115091, 355693, 407267, 175454, 293702, 321046, 204855, -13510, 43247, 215768, 38500, 399861, 93586, 202439, -143773, 541136, 387013, 129325, 10270, -169951, -360503, -200873, 82612, 255106, -100556, 100035, 178523, -51517, 293278, 65745]
11455B27592j09621m211N6504P8947H1775B6590a60665B25431F2848a22096D07927
11443a38511A18321b06791B82817J36946a96678G7663a45201A95319H0063H034
11432B03502H1023J12124e406D4683m295b02954q6531a26631m29312C34362d23766
11420A91910b24115g2428B13941d8783j88078I3479A2417k350h062A72132N746
11409A77878Q6499M2479D3247M7070g4386A94188D0471a01776E6857R1508B5109
11397A0302J39429l8230k9000q603i0623j05009e9784b8268j68203d3593j4420
11386e8013B79824Q8318b9190k05363a9330B08415l3542a41493C3773N4476b6090
11374H8964b66502B02895c323k05240B8586c59331J72397B53368h857C2201b28726
$$ y = [227592, 117971, 113760, 170264, 249211, 81775, 26590, -160665, 225431, 62848, -122096, 407927, -138511, 118321, -206791, 282817, 419763, -196678, 77663, -145201, 195319, 80063, 8034, 203502, 81023, 193147, -5406, 44683, 40388, -202954, -289485, -126631, -555943, 334362, -423766, 191910, -224115, -72428, 213941, -48783, -236861, 93479, 12417, 10067, -8062, 172132, 177878, 264377, 306856, 43247, 90317, -74386, 194188, 40471, -101776, 56857, 148365, 25109, 10302, 149731, 111501, 82501, 73898, -90623, -195632, -59784, -28268, -196471, -43593, -58013, 279824, 368142, -29190, -234553, -19330, 208415, 174873, -141493, 33773, 88249, -26090, 88964, -266502, 202895, -3323, -208563, 28586, -359331, -186934, 253368, -8857, 32201, -228726]
11362F5115k5723c44648C06887b29879d5348C08362G5665h794j66899Q0187A70796
11350b59966O4166I4026b8956A70227a80189d0559C13257d6261A11219j1867i372
11338C407K16140n8591G2944c4307r1745a7585j92029C08009B6614Q8072c41342
11326A78961a7159j276H3199i155A3080b29200A36405a30778N6299A7137c0658
11314A95002A9501K4042J61272H6342k496a19573k6490H835K7890a48744g0760
11302c32695a838o8318l8277A11284M1355a00982m0432Q073D7291b49131C23453
11290B38325a78941j66617f7512a1791A12561b40940A38033a37294B72262H0751
11279a33571d7698l9271k8893F4361a28189F4154b73420G3577J5890d4566k5787
$$ y = [65115, 39392, -344648, 306887, -229879, -45348, 308362, 75665, -8794, -175693, -95506, 170796, -259966, -195800, 94026, -28956, 170227, -180189, -40559, 313257, -46261, 111219, 99352, -9372, 3407, 219547, 160956, 72944, -34307, -126052, -17585, -209614, 308009, 26614, 114686, -341342, 178961, -17159, -18435, 83199, -9155, 13080, -229200, 136405, -130778, -74479, 17137, -30658, 195002, 19501, 43543, 204815, 86342, 83846, -119573, -146063, 8835, 36725, -148744, -70760, -332695, -1838, -70156, -108433, 111284, 152639, -100982, -141414, -133341, 47291, -249131, 323453, 238325, -178941, -345558, -67512, -11791, 112561, -240940, 138033, -137294, 272262, 80751, -133571, -47698, -86969, -115862, 64361, -128189, 64154, -273420, 73577, 89467, -44566, -70353]
11268g0353K9803F3758K339b54546C24944d37542e158F4979b19082H9505b2648
11256A25937J35244k0388b04015k7539B5034O902l754i6603j18777D3629a4428
11244A15584K5585D9279K07238j05797h0577l15444B20604a81770b3197B42063
11233b24892b6170k81280a9771f679j72888Q0563k13467g3080A59277p1717a34672
11221c47847e5404j75233C8255m857b95091B93755p4650e6716A88487a7146A38665
11209H7023J4646g9494l6859A0775J99848b39779i7890j91250J34308O2949O335
11198h5548k1922l1382A59029e2008j69920J07622j09363k60769B1587J610a44756
11186G1863H632a03265K5589k38117a21896l64592a74561g4664j07228D9631c6228
$$ y = [-70353, -40550, 63758, 66097, -254546, 324944, -437542, -5158, 64979, -219082, 89505, -22648, 125937, 261181, 240793, -204015, -231554, 25034, 31936, 28182, -96603, -215380, 43629, -14428, 115584, 141169, 49279, 256517, 150720, -80577, -396021, 220604, -181770, -23197, 242063, -224892, -26170, -307450, -19771, -6679, -179567, -99004, -312471, -73080, 159277, 87560, -134672, -347847, -55404, -230637, 38255, 33398, -295091, 293755, 219105, -56716, 188487, -17146, 138665, 87023, 101669, -79494, -116353, 10775, 210623, -239779, -97890, -289140, -154832, -91883, -85548, -107470, -138852, 159029, -52008, -221928, -114306, -223669, -484438, 21587, 23197, -144756, 71863, 8632, -103265, -77676, -315793, -121896, -486488, -174561, -74664, -181892, 49631, -36228]
11174F539a82672A18952f7119j57476A60935R6233n3013c18809J40017E9591e200
11162A50375I909K57675e6225B88608M6830b57182j28290E2236C619c18245I9451
11150D5490N4174a75818D4948J50965P5773r1274J0833o8197d07549A77828h4388
11138A55098l8295A8796b84996c2527k8222K6395m5486C7965K71754G316L91762
11127C99078n4236G9473Q2114J95916h3995K007A5557J06642a03011p6903B2845
11115D3869Q2185J70341M0257G3044h0748D56704k15048k5175a20690C08382I5621
11103B0705f654H0602J66543E3230L40967J18926B38021j0712J38057E7141K91233
11092C48374A14441B7703J70483H9415E887J31651M7953A4812K60893j34135Q3863
$$ y = [6539, -182672, 118952, -67119, -224595, 160935, 257168, 204155, -318809, -178792, 59591, -5200, 150375, 9909, 267584, -56225, 288608, 335438, -257182, -385472, 52236, 3619, -318245, 99451, 45490, 99664, -175818, 44948, 195913, 271686, 180412, 191245, 123048, -407549, 177828, -84388, 155098, 116803, 18796, -284996, -32527, -60749, -34354, -79840, 37965, 309719, 7316, 399078, 344842, 79473, 161587, 357503, -83995, -81988, 15557, 122199, -103011, -179914, 22845, 43869, 126054, 296395, 336652, 73044, -80748, 456704, 241656, 216481, -120690, 308382, 95621, 20705, -6654, 80602, 247145, 53230, 394197, 513123, 238021, 227309, 365366, 57141, 348374, 114441, 27703, 198186, 89415, 5887, 137538, 185491, 14812, 275705, 141570, 225433]
11081B25433J36940B5026J85044G6326E366K87116j19739L9437m2875K37880Q7458
11070D94643A50688L28256j70491M0914F4183L5030N98856B29050M07734A22207
11059B75782L97825K2926J08537C52801k6317N12870k46368J91511J35714j63894
11049G56317J79588p3378j81118j03747J2191J24761k12653M14278m8992j50116
11039G17131k3325P8859J44284k33866n4824j12463M33556j16080K27647l21563
11029G39356k91202K40336k3615M45440k78990j42728j01477J19915J377j53401
11019E55011J35529K48932l02857m149j58656O4071J89135j03503K49001l29865
11009E42649j1530j326K72119j83994P5945j00725J40638j61591J70418j20270
$$ y = [225433, 362373, 25026, 210070, 76326, 5366, 292482, 172743, 212180, 169305, 407185, 494643, 150688, 478944, 308453, 349367, 64183, 99213, 698069, 229050, 636784, 122207, 275782, 673607, 696533, 805070, 352801, 326484, 839354, 592986, 784497, 920211, 756317, 935905, 862527, 681409, 577662, 589853, 714614, 501961, 916239, 867247, 717131, 693806, 772665, 916949, 683083, 628259, 515796, 949352, 833272, 1060919, 739356, 448154, 688490, 664875, 1110315, 831325, 688597, 587120, 707035, 708412, 555011, 690540, 939472, 636615, 632466, 473810, 537881, 727016, 623513, 872514, 542649, 531119, 529793, 801912, 617918, 693863, 593138, 733776, 572185, 742603, 622333]
10999F22333L21771k2739p8002k43884J01932l08334M14497l1212k97519K78947
10989G57790k48902K95486q0181O5247P9667L60731J67699q3533j04673K90918
10979A500249m9241L43333K65811Q8297K00433M60144m4965M39880n91085K55249
10969B868105m96930J56953k60562k71223k61797k16675j2403N7410o0150l13940
10959A188788N26997m05762K65410m022K7038o33317l5847j25801J01050m28829
10949D75705r5987q1242j20908K07527K08410k56271k7121J66731j98738l2327
10939B45779n0038c0521C64522A81054q8052a91407A02507L5865a30478C52345
10928B19603a35971r6285n2595a18502m1342A36266J05596E6856K8918k1424K5050
$$ y = [622333, 944104, 921365, 843363, 599479, 701411, 393077, 807574, 776362, 478843, 757790, 508888, 804374, 724193, 789440, 869107, 1229838, 1397537, 1314004, 1209331, 1500249, 1451008, 1794341, 2060152, 2148449, 2348882, 2809026, 2764061, 3203941, 2612856, 2868105, 2371175, 2528128, 2267566, 1996343, 1734546, 1517871, 1505468, 1562878, 1502728, 1188788, 1715785, 1310023, 1575433, 1571411, 1598449, 965132, 929285, 803484, 904534, 475705, 379718, 298476, 177568, 385095, 593505, 337234, 310113, 476844, 278106, 245779, 195741, -30521, 364522, 181054, 93002, -191407, 102507, 138372, -130478, 352345, 219603, -135971, -232256, -284851, -118502, -159844, 136266, 241862, 56856, 85774, 64350, 89400]
10917H9400l1322b41612B20514Q9380A4897K34239G3553J13197a23392K3892C60380
10905b01174C2023L47721a37649A99418a84938D7952k0800J72697b39827H7814
10894a199B39844L1714D5488g8073j27771h2752L1939D5476O1620m1231L9841
10883A05706i6647c7050k4816D8053i8117A68993f8681J4759A33426j1218D921
10871b02723A03872C7494b9913j89250A59938b19014e9866K8453n8866a872m3615
10860d5487C55949h9297F9832b97698a27012n1691j6919K8624E5482R1618e5582
10848a83960b3591p8222F7065J40724R8193c246j6436B28748b33769a5702j09027
10837a24729A14182E899g2240e682B40068i1125H1415b07985B28721a84917j1722
$$ y = [89400, 58078, -241612, 220514, 309894, 14897, 249136, 73553, 186750, -123392, -99500, 360380, -201174, 32023, 379744, -137649, 199418, -184938, 47952, 27152, 199849, -239827, 87814, -1199, 239844, 271558, 45488, -78073, -205844, -82752, -50813, 45476, 107096, 65865, 105706, -96647, -37050, -61866, 48053, -98117, 168993, -68681, -53922, 133426, 122208, 4921, -202723, 103872, 37494, -29913, -219163, 159938, -219014, -59866, -31413, -90279, -1872, -45487, 355949, -89297, 69832, -297698, -127012, -178703, -195622, -166998, 55482, 147100, -55582, -183960, -23591, -101813, 67065, 207789, 305982, -3246, -19682, 228748, -233769, -15702, -124729, 114182, 5899, -72240, -5682, 240068, -91125, 81415, -207985, 228721, -184917, -196639]
10826a96639R4135M4477j55303f8613n2891c7891A55713n123I986a04957m3567
10815a48524M977K1473N3389q0171B16904b42678q2411B6717P4807m1814a9974
10803a54995k01582a46888B38965h993A04220c0729c324j66490E3237c10279J29795
10792a80484e6666C36620C854J9362e0448B8052O0860d22449a76548I4201a41824
10780b37373a15257a3081B25124a17901p1151C3793J8247a43539A48838J44604
10770B93442E3131a42493B926b23405O1807k8461p1494R221G0395C4271a42429
10758a38959j27905B53211a12529d6226C32440c7818k33323A15923f4081j73534
10748b37615l0579A42980C8559K21872a13734E9017P3732B9533J7636j8666J25368
$$ y = [-196639, -102504, -58027, -213330, -68613, -121504, -37891, 155713, 150590, 9986, -104957, -148524, -143547, -122074, -68685, -148856, 216904, -242678, -325089, 26717, 101524, 59710, -19974, -154995, -356577, -146888, 238965, -8993, 104220, -30729, -3324, -169814, 53237, -310279, -180484, -56666, 336620, 3854, 23216, -50448, 28052, 88912, -422449, -176548, 94201, -141824, -237373, -115257, -13081, 225124, -117901, -189052, 33793, 52040, -143539, 148838, 293442, 53131, -142493, 2926, -223405, -161598, -190059, -261553, -252332, 70395, 34271, -142429, -138959, -266864, 253211, -112529, -46226, 332440, -37818, -271141, 115923, -64081, -237615, -268194, 142980, 38559, 260431, -113734, 59017, 132749, 29533, 47169, 28503, 153871]
10737A53871b13912a2524C86683A2276J95884p3839C6392a83455G246L2400b33708
10725b16683a03268j6467D2397d6776H9425C2739c67184A32363a96220B13859
10714b6020j50947d6706j26356K3994F3491i702k89681a06734a8713m7778k6015
10703i2506b4363k24515k7828J31096B09200M5583a04999A96481l7611c02230
10692C3353M9215e7824I763a02451L5921j7950C0094Q2364E1655a56298a6100
10680A44787j2294o1320J6569a78059C13805f4732k53701A42380b993k04492j58703
10669c66188A3336K3092d5628J5770G0463J31041e8723j51656O8398K4193k789
10658a20577K1279k6035d3780l90013B60689G4718c10031e8138j15620q3527A27627
$$ y = [153871, -213912, -12524, 386683, 12276, 208160, 134321, 36392, -183455, 7246, 39646, -233708, -216683, -103268, -119735, 42397, -46776, 89425, 32739, -367184, 132363, -196220, 213859, -26020, -176967, -46706, -173062, -149068, 63491, -9702, -299383, -106734, -18713, -66491, -92506, -24363, -248878, -276706, -145610, 209200, 254783, -104999, 196481, 158870, -302230, 33353, 82568, -57824, 9763, -102451, -66530, -84480, 30094, 112458, 51655, -156298, -16100, 144787, 132493, 71173, 87742, -178059, 313805, -64732, -318433, 142380, -2993, -207485, -366188, 13336, 36428, -45628, -29858, 70463, 201504, -58723, -210379, -141981, -117788, -120577, -99298, -125333, -43780, -433793, 260689, 74718, -310031, -58138, -173758, -257285, 127627]
10646c70380J45931G4149b01594E2825b45824f7858e016k01756J03176I0325J65159
10635B55484d7771E7631c192j87567B93048H1483g7145D3089b19572c8991A01511
10623a18275B85573b2273C20608a31472B31041a09868C7916a97735J753h1172
10612B7123a23028M7561j31671a1295j08976r4758g578A70695A7867J18686c5097
10600E5559a3241p807m5275m1417j5280j90240r4873g7144A46784d7691j70961
10589b18652g04l8435k34097h6559m9655A28755i9549B5557b07451b7187F1651
10577g1602J3399A95156A5118a69356a7622D8579N5472b08083B69767J23278A15593
10565a64254g2236A0090c44801f9075j56747E5620a97379r450o6261C64470A61589
$$ y = [-370380, -224449, 74149, -201594, 52825, -245824, -67858, -5016, -206772, -103596, 90325, 255484, -47771, 57631, -3192, -190759, 293048, 81483, -77145, 43089, -219572, -38991, 101511, -118275, 285573, -22273, 320608, -131472, 231041, -109868, 37916, -197735, -195982, -81172, 27123, -123028, -75467, -207138, -11295, -120271, -215029, -7578, 170695, 17867, 136553, -35097, 55559, -13241, -21048, -66323, -107740, -123020, -313260, -408133, -77144, 146784, -47691, -218652, -704, -39139, -273236, -86559, -136214, 128755, -99549, 25557, -207451, -27187, 61651, -71602, -58203, 195156, 15118, -169356, -17622, 48579, 104051, -208083, 269767, 393045, 115593, -164254, -72236, 10090, -344801, -69075, -225822, 55620, -197379, -206829, -273090, 364470, 161589]
10553b54821a12219r4880A57521b27790C60505e8140A4102a20727D1938a58057
10542c11012g0736j81175g9192A72912B820a2745j35422B26723b88139n6981B7467
10530A77359f4335f9j23329c2137A14990f7834A11023D5636D135f1144I0303C9287
10517g1537H6574R8319c31917J16112F4159b35809C8628E1g934C0290K03640o7733
10505A66197k9990B7375g6442j32181h0076A97691p4423J0996b5961A20854k0355
10494A00499a97053A84290b31524A73751K5387n2113a08338B21852P3810L38278
10484F33940k38764j88618J74538o3241c05156e623k1805j53533Q6219F9521b68795
10472D3350h042j87483d2759j80424A4001E784L2119A7271J13831b970A70128
$$ y = [-254821, -112219, -207099, 157521, -227790, 360505, -58140, 14102, -120727, 41938, -158057, -311012, -70736, -251911, -79192, 172912, 2820, -12745, -148167, 226723, -288139, -345120, 27467, 177359, -64335, -69, -123398, -32137, 114990, -67834, 111023, 45636, 4135, -61144, 90303, 39287, -71537, 86574, 184893, -331917, -215805, 64159, -235809, 38628, 51, -7934, 30290, 233930, 166197, 136207, 27375, -76442, -208623, -80076, 197691, 123268, 134264, -25961, 120854, 100499, -197053, 184290, -231524, 173751, 199138, 147025, -108338, 221852, 295662, 633940, 395176, 206558, 381096, 317855, -305156, -5623, -27428, -180961, -94742, 69521, -268795, 43350, -8042, -195525, -42759, -223183, 14001, 5784, 37903, 17271, 131102, -2970, 170128]
10460a37599f8209l0725E4359L06273c27682i6958G8073e7550a6009A71017m660
10449A66357c43603A10434K88968A552M05028b80629A57543a09215J018I4318
10438C98968a49530e9436H7670K22257b66339J03556I4078a09677A51290n6072
10428I5218h2918A93639b53806N8020A64906a6915B34583F2258K23043e8103j91807
10417b49910i7603A77606b493I8831f8114A9160K27599b44767A85230b41966F1793
10405f3715A15800a93402B07905l8561a39739e8353J3666C80821j20183A23048
10394G6680J61054p2922i7697a6002B38375A08816l6018i2089C8623J44145M3241
10383B26009H1929J11236b0065B7722J55624Q4914q2362p3164L21204A77174J11979
$$ y = [-137599, -68209, -98934, 54359, 360632, -327682, -96958, 78073, -57550, -16009, 171017, 166357, -343603, 110434, 399402, 1552, 406580, -280629, 157543, -109215, -108197, 94318, 398968, -149530, -59436, 87670, 309927, -266339, -162783, 94078, -109677, 151290, 95218, -82918, 193639, -253806, -195786, 164906, -16915, 234583, 62258, 285301, -58103, -249910, -97603, 177606, -2493, 98831, -68114, 19160, 246759, -244767, 185230, -241966, 61793, -63715, 115800, -193402, 207905, 169344, -139739, -58353, -44687, 380821, 260638, 123048, 76680, 237734, 164812, -97697, -16002, 238375, 108816, 72798, -92089, 38623, 182768, 226009, 81929, 193165, -20065, 27722, 183346, 268260, 185898, 112734, 433938, 177174, 289153]
10372B89153E717M14129j87794J28133k8734p8785J16791J5133J61636j95182
10362C51044k2281j05012Q9404a5167o8567D14016M455k5327o3618A32526K40847
10351C73373K97061o2086r3399m0348j28966A41024K14071K78655k85456j7485
10341C30809A8683K79299n3022r2669L7575a60105B19959i9237E7109K0399K57656
10330C35164j43691A4931a0155k03347A62962N9057C3042K97220e953j0824A30855
10318B83135a04153E16666k51452J06441A53746D4545h476m52908E7991m801j3991
10307C9199H924j840K13070a510k58389A96103q1269L94826a0170j0222E00202
10295A73718P329c9144A10728l1255c55393a35144M9993F8224K8939b21911a05795
$$ y = [289153, 5717, 419846, 232052, 360185, 331451, 252666, 369457, 384590, 546226, 351044, 328763, 223751, 313155, -15167, -83734, 414016, 418471, 393144, 329526, 132526, 373373, 670434, 608348, 514949, 474601, 345635, 141024, 355095, 633750, 348294, 330809, 18683, 297982, 244960, 152291, 189866, -160105, 219959, -99237, 57109, 77508, 335164, 191473, 14931, -10155, -213502, 162962, 222019, 33042, 330262, -5953, -16777, 130855, 283135, -104153, 516666, 265214, 371655, 153746, 44545, -8476, -461384, 57991, 53190, 39199, 8924, 7084, 220154, -1510, -259899, 196103, 114834, 509660, -10170, -20392, 500202, 173718, 181047, -39144, 110728, 79473, -355393, -135144, -85151, 68224, 97163, -221911, -105795]
10283b36265k23748B94524H4889c82665C23250E5594h5007H1274L6534J6728N7220
10272A91756a78197F301K73275D1326R226J44948l0672B7165K56262l4859R4219
10261C42787N3139q1467j6170a26558e755A6688b06810h9625F7129Q5140A2380
10249b71611B58974A18393g0176A09577c60311A41057D0740e0332j37100b6972
10238a23823b5976k44153c4741F7661c50411A54113g8042n4844j12620A6403c0313
10226H4589a89158J1224k8445e5153j46955A30230J4919a62572j2684A4072N3120
10215F7192K6884b76318a29131O0426A29798c7755B1543L8828A1887d31289E7824
10203b1802m71489A42255a25612l3266a3597A74255h5627j32536f5128o1635j03757
$$ y = [-236265, -460013, 294524, 84889, -382665, 323250, 55594, -85007, 81274, 117808, 134536, 191756, -178197, 6301, 279576, 41326, 50552, 195500, 164828, 27165, 283427, 248568, 342787, 395926, 314459, 298289, -126558, -5755, 16688, -206810, -89625, 67129, 152269, 12380, -271611, 258974, 118393, -70176, 109577, -360311, 141057, 40740, -50332, -187432, -26972, -123823, -25976, -270129, -34741, 67661, -350411, 154113, -78042, -132886, -245506, 16403, -30313, 84589, -189158, -177934, -206379, -55153, -202108, 130230, 145149, -162572, -175256, 14072, 67192, 94076, -276318, -129131, -68705, 129798, -37755, 21543, 60371, 11887, -431289, 57824, -21802, -493291, 142255, -125612, -158878, -13597, 174255, -85627, -218163, -65128, -126763, -230520]
10192b30520I5176e73A39760i3922l5448N6869l9052L7918l40995K06296a9934
10180h2787B7397J1518a06510A2213K2969c8725b491C03255a3955j6386B73957
10168b47760G2679c06645J37659P740j33396A15931a72676B06421M8504g8902
10157G5016a76586j71999a35007F1844a86286R1198E4044g0475f649j60154F6096
10145A6738J31932e0837B3608a64901g0530J8685B07270N4827C6698d24948A40515
10133a04811l45079J64407Q5675L3542k9280a1473j79170e8157l5336B87510r1410
10122A96100b83584J17655M0661i377B61766b15171K898D51448d2516n3660A54813
10110A87511c13498J39756A56480k0322f9625A7307c82684A7816L4089a24556
$$ y = [-230520, 95176, -573, 139760, -93922, -129370, -72501, -111553, -73635, -414630, -208334, -19934, -82787, 27397, 38915, -106510, 12213, 35182, -38725, -2491, 303255, -13955, -30341, 273957, -247760, 72679, -306645, -168986, -161246, -294642, 115931, -172676, 206421, 254925, -78902, 75016, -176586, -348585, -135007, 61844, -186286, -95088, 54044, -70475, -6649, -166803, 66096, 16738, 148670, -50837, 23608, -164901, -70530, -51845, 207270, 262097, 36698, -424948, 140515, -104811, -449890, -285483, -199808, -166266, -195546, -11473, -190643, -58157, -93493, 287510, 196100, -283584, -165929, -125268, -9377, 261766, -215171, -212273, 451448, -42516, -96176, 154813, 187511, -313498, -173742, 156480, 136158, -69625, 17307, -382684, 17816, 51905, -124556]
10099B00870e58863a37372B5837K18443c02326A35145O8181a57757j26318g0137
10088e1231m07859b08492N5884E1854J47923E2475a29733C482b05780J01325r5566
10077b00021R3760d2729B42183a90749j2879K8905B6545g6959B17780h5026B1352
10065b38548B17045G4425e2166k84598b024F19d04662B3755L56140A39223n963
10054A33260J9521E3224J89935b87508Q1746P4933o3478j88480i989j83386k2916
10043b16291I8155a50330r3723B60750A449f6238l7909F9238a92430A19083a29048
10031I9334J16171b64194a14918d7702k31285P9280f4734j29978E8433a58887
10020a61104n87574b41554a5979j23563a2048G0417a43094d5662I6462C4361e6182
$$ y = [200870, -558863, -137372, 25837, 244280, -302326, 135145, 203326, -157757, -284075, -70137, -51231, -459090, -208492, -152608, 51854, 199777, 52475, -129733, 3482, -205780, -104455, -200021, -106261, -42729, 242183, -190749, -203628, -174723, 26545, -76959, 217780, -85026, 21352, -238548, 217045, 74425, -52166, -336764, -2024, 619, -404662, 23755, 379895, 139223, 133260, 152781, 53224, 243159, -287508, -205762, -130829, -194307, -382787, -9989, -193375, -216291, 98155, -150330, -244053, 260750, 1449, -66238, -104147, 69238, -192430, 119083, -129048, 99334, 215505, -264194, -114918, -47702, -278987, -199707, -64734, -194712, 58433, -158887, -161104, -748678, -241554, -15979, -139542, -12048, 70417, -143094, -45662, 96462, 34361, -56182]
10008c94694e3695D7808a55910k5667A09086D3489B733b435p8157L1618E9905
9996A20281M8094b87848A34812M33504q4135k3032i6261A31781c31055I0007a87100
9984A32072b40858B0796h5068L4990j96725D9649A6700K44341a12630A56551f8920
9972a02072j54104d1078A57775g1822j24979A00962J0823c26022D4241f9148C25071
9960A96129b67583c6259a4496j2028j46415J2330A32855b22540F0633a80596C5427
9948E418i3525A0197h3999C12327H8369b57143B3322O2734g4996j40443A13523
9936a9129l11512a53615o3874k39062a34198B32613a73594N8169C52367a46861
9925E3020c68364k3753a0531j78764g3138b5185G8947R5191k7149a06747c41o4469
$$ y = [-394694, -53695, 47808, -155910, -181577, 109086, 43489, 2733, -2435, -80592, -48974, 59905, 120281, 168375, -287848, 134812, 568316, 484181, 461149, -96261, 131781, -331055, 90007, -187100, 132072, -240858, 20796, -85068, -50078, -246803, 49649, 16700, 261041, -112630, 156551, -68920, -102072, -256176, -41078, 157775, -71822, -196801, 100962, 111785, -326022, 44241, -69148, 325071, 196129, -267583, -36259, -14496, -26524, -172939, -160609, 132855, -222540, 60633, -180596, 35427, 5418, -93525, 10197, -83999, 312327, 88369, -257143, 23322, 86056, -74996, -215439, 113523, -19129, -330641, -153615, -217489, -456551, -134198, 232613, -173594, -115425, 352367, -146861, 53020, -368364, -392117, -10531, -189295, -73138, -25185, 78947, 174138, 146989, -106747, -341, -64810]
9913f4810o5211r5063l6805E6745b05574B25100a72319d0977A71740a40246e5754
9901d35387a10567F8903a86366P7352B84056D3415A0099d51746I6828b32566d874
9889b11830g0342j39509A62923h3121B63435c16375o4835d3710j91785o599A65783
9877c6682j06326E4038a99909P6299j84929a13739d0352p7642B57769A25380i8386
9865B12403b22182D7316K41765J27991a53674b4278j62609P1900H9966Q216e8333
9853i0890K6536k75110A5060J38546i6809j38289a10095k737m4744J282K8228
9842a28066a3193A78344g1262r2830B0096a21455k97016h4427A40234a13823m78002
9831e91825a47013j78854J37272k32098J91769C6666K519b35704J15519c2933
$$ y = [-64810, -130021, -225084, -261889, 56745, -205574, 225100, -172319, -40977, 171740, -140246, -55754, -435387, -110567, 68903, -186366, -109014, 284056, 43415, 10099, -451746, 96828, -232566, -4874, -211830, -70342, -209851, 162923, -83121, 263435, -316375, -381210, -43710, -235495, -242094, 165783, -36682, -143008, 54038, -199909, -123610, -308539, -113739, -40352, -117994, 257769, 125380, -98386, 212403, -222182, 47316, 289081, 417072, -153674, -24278, -186887, -114987, 89966, 98182, -58333, -90890, -64354, -339464, 15060, 153606, -96809, -235098, -110095, -112832, -157576, -156294, -128066, -13193, 178344, -71262, -164092, 20096, -121455, -418471, -84427, 140234, -113823, -591825, -147013, -325867, -188595, -420693, -228924, 36666, 39185, -235704, -120185, -32933]
9820B91328I1850a94816j14471A45826N3182n1860D0276b78345D3501d6540B01746
9808B3935d79233a9495A48225d29218G8242a87855Q3015n5097A43418C3392J68713
9797B02105J31869A0876J35791l2922J3890b3980A46298i4393p3501k41504A58444
9785A23183J81996c51270B43289H1692a50088P1699j43212j00947R6864j06533
9775c32217L2147H1198a84340B99103a01386d0150C0137a69764j23395i4006l15238
9764d09244i1870L9464B87057a84922f0717p4828A4487a73G038e5188A42329h6079
9751c8925A23580G8a53689k4359O6833A38351c89350a47055C37779f2885j29235
9740a92120Q3911A54509D4369K44744a13997m0447o320j4662b5540I0031g7890
$$ y = [291328, 91850, -194816, -309287, 145826, 199008, 147148, 40276, -278345, 43501, -46540, 201746, 23935, -479233, -19495, 148225, -429218, 78242, -187855, -104840, -159937, 143418, 33392, 202105, 333974, 10876, 146667, 113745, 127635, -23980, 146298, -94393, -167894, -409398, 158444, 123183, 305179, -351270, 243289, 81692, -150088, -78389, -221601, -322548, -225684, -332217, -300070, 81198, -184340, 299103, -101386, -40150, 30137, -169764, -293159, -94006, -409244, -91870, -52406, 287057, -184922, -60717, -135545, 14487, -173, 7038, -55188, 142329, -86079, -38925, 123580, 78, -153689, -178048, -111215, 138351, -389350, -147055, 337779, -62885, -192120, -108209, 154509, 44369, 289113, -113997, -154444, -160764, -175426, -25540, 90031, -77890]
9728d8561I657i8203j99005M4659r2731Q38F7018Q4799h4670A59997a74605G4923
9715a51935g3829A531L2917a31072c1023l9797k65768i2502a1865b831A60736
9703b3731G4052c90992H0794C1947d8501A66869g7707L4430j28805f2664r7396
9692a60060K6195M3110j3590I4736a39758I7209a00258A06961K05536e022l54723
9681c59745N4376J02325A74741b02536k41062E8572h2105A88877d7362A50490
9670A53610b3353g35k1819j68652d7609D7051a16588C2475b7087c22D3355J56974
9658B00329I400d0968q9439J5232A2769b15858N7903p6074C9686a36395E2645
9646a22832c3741A26098a81555c4732q7399A57983a40331m0426d1665p0450l8653
$$ y = [-48561, 9657, -98203, -297208, -252549, -345280, -344442, 67018, 151817, -84670, 159997, -174605, 74923, -151935, -73829, 1531, 34448, -131072, -31023, -70820, -336588, -92502, -11865, -2831, 160736, -23731, 74052, -390992, 80794, 31947, -48501, 166869, -77707, -43277, -172082, -62664, -160060, -133865, -90755, -104345, 94736, -139758, 97209, -100258, 106961, 312497, -5022, -359745, -305369, -203044, 174741, -202536, -443598, 58572, -82105, 188877, -47362, 150490, 153610, -23353, -735, -22554, -191206, -47609, 47051, -116588, 32475, -27087, -322, 43355, 200329, 9400, -40968, -130407, -115175, 12769, -215858, -157955, -234029, 39686, -136395, 52645, -122832, -33741, 126098, -181555, -34732, -122131, 157983, -140331, -180757, -41665, -112115, -150768]
9635a50768p6800B75844b37308F4675c5843j15177k71517a50198k20809J75362
9625a95645O1441B50740f2922m54893J29574a10655r4630E0242P8304R1347i2086
9613b33580c5505k50993p545a12661B25241D9123b83799B2897a05393A98756a12972
9601a74149F0361K1062c68722D8089c12690C8701K8959A5763a9298A53467k2133
9590A31334C1056J8821m368J7234f15l01224C13829E2385L416d7015o6091k13422
9578c26528A7781c32623a57941B43928a62928k02024h1060G9888K3153c1356F2289
9566a03238D7261J36622K00550a58173A12191c17376p0690a78094g8962O039j5695
9555h8618B11573b43796b3644C9369f5034J3733C9634a9737j94690l4261L4137
$$ y = [-150768, -227568, 275844, -237308, 64675, -35843, -151020, -422537, -150198, -371007, -195645, -134204, 250740, -62922, -517815, -388241, -110655, -205285, 50242, 128546, 219893, -92086, -233580, -35505, -286498, -294043, -112661, 225241, 49123, -283799, 22897, -105393, 198756, -112972, -174149, 60361, 81423, -368722, 48089, -312690, 38701, 67660, 15763, -19298, 153467, 131334, 31056, 49877, 45509, 62743, -615, -301839, 313829, 52385, 55801, -47015, -113106, -326528, 17781, -332623, -157941, 243928, -162928, -364952, -81060, 79888, 103041, -31356, 62289, -103238, 47261, 183883, 384433, -158173, 112191, -317376, -388066, -178094, -78962, -72923, -88618, 211573, -243796, -23644, 39369, -65034, -51301, 39634, -19737, -214427, -248688, -214551]
9544b14551j90607B0494J2909P9508b77835J22149D1808b00502I7929g2414A21161
9532e6313k30417A11431J13120D9658k0949I527d15810a79924E0269j5957J21742
9521A56054d2624k60131a22945e8432l4077l18848a7492C9403R821b75946p4067
9510c50013A9859c86682B37944J53B3435b74257a07136j1596N5773k25286B03123
9498i3323k2612E1520a48825e5041k18410h2057c4446k10972a253A85028K02273
9487C87301f4296m295c2883g470l05830J14518M530d6230k34527q0514a72804
9475B48215b16833O8661C3427L03988a5048j64118B50621i2037k8015b4679l55661
9464c80340D0861a86507K6493A51744J15948e0548E9664g7345a6712k64138F9600
$$ y = [-214551, -405158, 20494, 33403, 112911, -277835, -155686, 41808, -200502, 97929, -72414, 121161, -56313, -286730, 111431, 224551, 49658, 28709, 9527, -415810, -179924, 50269, 34312, 156054, -42624, -302755, -122945, -58432, -92509, -411357, -17492, 39403, 49224, -275946, -350013, 19859, -386682, 237944, 238097, 23435, -274257, -107136, -118732, -62959, -288245, 203123, -93323, -115935, 51520, -148825, -55041, -273451, -82057, -34446, -245418, -1253, 185028, 387301, -64296, -68591, -32883, -7470, -313300, -198782, -194252, -46230, -280757, -361271, -172804, 248215, -216833, -148172, 33427, 337415, -15048, -179166, 250621, -92037, -120052, -24679, -380340, 40861, -186507, -160014, 151744, 267692, -50548, 59664, -77345, -16712, -280850, 69600]
9452a44019b5704p147G82O696a06534j01789C07735e4528l24132J57482O0434
9441a60744F5171R855P320J18650a22504A29295D9484j3142b88433m8459A36660
9429i7296l2112d2404A27450a15868j97968G3524L5568b68270a27168N478j58266
9418b79956A30729c4600L213l8998K5757C06790a17824j2705N7327k26731F5040
9406B80984j11594B3064c9508B02031E881a59623E6778b9192B27618A12056b08406
9394a69974g1085J6172r8418l6327A8893c779F9710i1500B16426E4314b33494
9382A3037b72251h5308k2057p5210A862b49115E5407b63074A8286c18105a22253
9370c0282I9523c486B37443a26884A60171a77725B02150e6598j33754p0476J25546
$$ y = [-144019, -25704, -32851, 782, 7478, -106534, -208323, 307735, -54528, -378660, -221178, -160744, 65171, 75026, 82346, 200996, -122504, 129295, 49484, 36342, -288433, -336892, 136660, -97296, -129408, -42404, 127450, -115868, -313836, 73524, 109092, -268270, -127168, -121690, -279956, 130729, -34600, -31387, -70385, -44628, 306790, -117824, -130529, -73202, -299933, 65040, 280984, 169390, 23064, -39508, 202031, 5881, -159623, 56778, -29192, 227618, 112056, -208406, -169974, -71085, -54913, -153331, -189658, 18893, -3779, 69710, -91500, 216426, 54314, -233494, 13037, -272251, -85308, -107365, -182575, 1862, -249115, 55407, -263074, 18286, -318105, -122253, -30282, 99523, -3486, 237443, -126884, 160171, -177725, 202150, -56598, -190352, -260828, -135282]
9359a35282e1336B889J12778b46112R2536P2188l08042Q5762J26625k17972A45843
9347a03835L6817A85197a13868c1034I0891b91794B03203q0221a97278b277B804
9335a35948o2679A46736a37240C57089G2294a5322l5660A54396h6856K4589j89833
9324b52100b0334a239k84799d8891A09148a71963e9037n59326F315J45276b1764
9312a17420E1329P7815a910A64716c2738j12723A90924d100A71315F2038a80493
9300B16697F1003a9942A91559d01657A49380L8141l5721d08236B2666h1844c8930
9288a95876Q7695j22390B2568M13689k06210a23666K350C7543N6835c7692J2251
9277b5441A45027f9883c3173k78514a09091j10024a05134K7094q8224B9941a13861
$$ y = [-135282, -51336, 2889, 115667, -246112, -153576, -81388, -389430, -303668, -177043, -395015, 145843, -103835, -67018, 185197, -113868, -31034, 90891, -291794, 203203, 122982, -197278, -2277, 2804, -135948, -198627, 146736, -137240, 357089, 72294, -15322, -50982, 154396, -86856, -62267, -252100, -20334, -1239, -286038, -48891, 109148, -171963, -59037, -618363, 6315, 151591, -21764, -117420, 51329, 129144, -1910, 164716, -32738, -145461, 190924, -4100, 171315, 62038, -180493, 216697, 61003, -19942, 191559, -401657, 149380, 187521, 151800, -408236, 22666, -81844, -38930, -195876, -108181, -230571, 22568, 436257, 230047, -123666, -121316, 37543, 94378, -37692, -25441, 145027, -69883, -33173, -311687, -109091, -219115, -105134, -78040, -166264, 29941, -113861]
9265a96185A95882b33160I7431b2734q0078h529A49818a84730O9361F7069a01723
9253d09043a72171k40158B76440a62426A9467g8322A04679c8739l20617a65486
9242a72831f2587n171k64965c159E8299a49531A71624D4110a57338C0288a90585
9230b5069k4239B03226a42395j31159a5671m9866n4666j9416N2090B44159g5961
9218h7652B0954Q0875D9083a77781A27929J1647M6205c79871A79427i9681j70445
9207b70126f5854p9954G2822J25965e55576J74399F0092J90684E8109J7587i9328
9195g974B26720b7574o2506F0871d02773J95831A130J37872B8785a15275j73669
9184b88944m0050F7192N8039b46791O6236G9747J19246p2561e3352k86546B53957
$$ y = [-196185, 195882, -233160, 97431, -22734, -102812, -8529, 149818, -184730, -115369, 67069, -101723, -409043, -172171, -412329, 276440, -162426, 19467, -78322, 104679, -38739, -359356, -165486, -172831, -62587, -67758, -332723, -3159, 58299, -149531, 171624, 44110, -157338, 30288, -190585, -25069, -49308, 203226, -142395, -273554, -15671, -65537, -120203, -139619, -87529, 244159, -75961, -87652, 20954, 101829, 49083, -177781, 127929, 139576, 185781, -379871, 179427, -99681, -270126, -65854, -145808, 72822, 198787, -555576, -381177, 60092, 250776, 58109, 75696, -99328, -7974, 226720, -27574, -90080, 60871, -402773, -206942, 1130, 139002, 28785, -115275, -288944, -328994, 67192, 125231, -246791, -180555, 79747, 198993, 126432, -53352, -339898, 253957]
9172d10374J8003B20779j01816a54296I0452a59340e8093B05d39887a33609l01097
9161d34706A83524e7451o0520L555A20426e6955j33130a3696k3284n3238n3163
9150a43381c031k53830n1856R8407g7079B71817j25227C3632b98422A9474b51411
9138B19669m5944a34378c5579i019j63232A16904L08126C181J44293a69595M9568
9127a20027M0682c619l06357c6130j47235b9712C59986d2341j26566A7300J46308
9116A63608c910p210j55582d3983j09468e0884j92213F1242J39120A9111a32393
9104c1016B68225d3175k94946e3539r4537n157L3550k12859C5282d1374k7856
9093f9230k99258C32038c29670L6730J32877A78210i3207a3628p6500A40308E2744
$$ y = [-410374, -392371, 220779, 118963, -154296, 90452, -159340, -58093, 205, -439887, -133609, -434706, 183524, -57451, -117971, -114416, 120426, -56955, -190085, -13696, -36980, -90218, -143381, -3031, -256861, -308717, -210310, -77079, 271817, 146590, 33632, -298422, 19474, -251411, 219669, 173725, -134378, -35579, -9019, -172251, 116904, 425030, 3181, 147474, -169595, -120027, -79345, -3619, -309976, -36130, -183365, -29712, 359986, -42341, -168907, 17300, 163608, -3910, -11120, -166702, -43983, -153451, -50884, -243097, 61242, 200362, 19111, -132393, -31016, 268225, -43175, -338121, -53539, -148076, -153233, -119683, -332542, 35282, -41374, -69230, -368488, 332038, -329670, -292940, -160063, 178210, -93207, -13628, -90128, 140308, 52744]
9081B07205D2056b41697C781a2764j82945A06506A277a2970D5377a71021F2760
9069c62661f4683G9362J97630A7437J71142a5020A57248a58769I4237J10636o1852
9058A43021b63929f9052c2111B05264g3378j25810E1929K69218j57715e9143j25935
9047a85078j2241O3498A4561p97a9905E524a39793B25340b3746k01067h9430M2848
9035d6582J4076A44479k5405n8761i6441i130B1851M8537B3491Q8615d07871g6533
9022a7064D5634g8615E7486f9633r5997j48761J02050g0917D1383b11441A08695
9010A6036b90959a970o7029J3082l3247n5082l8111H1169a88623Q7023A7136b49437
8997I8060a12033B69218a04510j11526A46345D7056h9252I942a88391B4427d6791
$$ y = [207205, 42056, -241697, 3781, -12764, -195709, 106506, 1277, -12970, 45377, -171021, 62760, -362661, -64683, 79362, 276992, 17437, 188579, -15020, 157248, -158769, 94237, 204873, 143021, -263929, -69052, -32111, 205264, -73378, -199188, 51929, 321147, 163432, -59143, -185078, -197319, -133821, 14561, 13764, -19905, 5524, -139793, 225340, -23746, -224813, -89430, -46582, -32506, 144479, 119074, 60313, -96441, -9130, 21851, 70388, 23491, 112106, -407871, -76533, -17064, 45634, -78615, 57486, -69633, -165630, -314391, -212341, -70917, 41383, -211441, 108695, 16036, -290959, -1970, -68999, -55917, -89164, -144246, -182357, 81169, -188623, -101600, 17136, -249437, 98060, -112033, 269218, -104510, -216036, 146345, 47056, -89252, 9942, -188391, 24427, -46791]
8985a04778F1124a91410j23976f8106B8178N934J37370D9293N8783d2860k7699
8974g0559n8482f0256E5976a5768k79050L8832d6808j90515a07349D9054a44555
8962B09756J08012D6029c65182B39773h9935C15001b15993K856h6301j34145h7040
8950c48683c0343j53003B03554b19153D5015J27218i6076A70243h8122i139H2174
8938A70400O2034b88985k0114A54991b00170n8094i2461A00794k1803K49629A07003
8926a60489A77007N82786L94938K418040N379735A982850F27524B56049m6901
8917B09148f2932D3564A2390P0369O2793a53061A16066j5490d3151B15883g4186
8905i9726j01401i6211a7665l8159a403A57069l9518O1676G8372b80616d6831
$$ y = [-104778, 61124, -191410, -315386, -68106, 28178, 34112, 171482, 49293, 108076, -42860, -70559, -129041, -60256, 55976, -15768, -294818, -255986, -46808, -237323, -107349, 49054, -144555, 209756, 317768, 46029, -365182, 239773, -89935, 315001, -215993, -213137, -86301, -220446, -87040, -348683, -30343, -183346, 203554, -219153, 45015, 172233, -96076, 170243, -88122, -9139, 82174, 170400, 232434, -288985, -309099, 154991, -200170, -258264, -92461, 100794, 78991, 328620, 107003, -160489, 177007, 759793, 1154731, 3572771, 8952506, 1982850, 627524, 256049, 209148, -62932, 43564, 12390, 82759, 145552, -153061, 116066, 100576, -43151, 215883, -74186, -99726, -201127, -96211, -17665, -55824, -1403, 157069, 117551, 179227, 78372, -280616, -46831]
8893D2585P7298L051c12787B2254d19097A59429a2512o9522o0202O7048p700b8938
8880a84455Q2405C10922l8848a04948j27215I3455c7516k320B5587M0634d259
8868d4184j24013Q2408M0052n1932L7224m6230C3648K05132b65197D1572a79645
8856a00698o7673p0723B18841b04444j15006P7169e7521j78890A0172a35791A00618
8844B705L2097a76272H3134a94474g3003F886b23026G8296J33524k6775i0425
$$ y = [42585, 119883, 122934, -312787, 22254, -419097, 159429, -12512, -82034, -142236, -75188, -82888, -28938, -184455, -102050, 310922, 272074, -104948, -232163, 93455, -37516, -39836, 25587, 66221, -4259, -44184, -168197, -85789, -45737, -97669, -60445, -106675, 33648, 238780, -265197, 41572, -179645, -100698, -168371, -239094, 218841, -204444, -319450, -242281, -57521, -236411, 10172, -135791, 100618, 2705, 34802, -176272, 83134, -194474, -73003, 6886, -223026, 78296, 211820, 185045, -90425]
$$ [...]
##END NTUPLES=NMR SPECTRUM
##END=
