
##TITLE=AC1370_2394_7221551_PFWnt8R9C4
##JCAMPDX= 6.0         $$ Bruker NMR JCAMP-DX V2.0
##DATA TYPE= NMR SPECTRUM
##DATA CLASS= NTUPLES
##ORIGIN= BRUKER
##OWNER= Administrator
$$ 1.72 TOPSPIN		Version 2.1
$$ 2012-12-17 14:47:52.934 -0500  Administrator@X
$$ Compression mode = diff/dup
##.OBSERVE FREQUENCY= 400.02188249412
##.OBSERVE NUCLEUS= ^1H
##.ACQUISITION MODE= SIMULTANEOUS (DQD)
##.ACQUISITION SCHEME= undefined
##.AVERAGES= 8
##.DIGITISER RES= 22
##SPECTROMETER/DATA SYSTEM= spect
##.PULSE SEQUENCE= zg30
##.SOLVENT NAME= COFFEE_meoh
##.SHIFT REFERENCE= INTERNAL, COFFEE_meoh, 1, 14.98509
##AUDIT TRAIL= $$ (NUMBER, WHEN, WHO, WHERE, PROCESS, VERSION, WHAT)
$$ ##TITLE= Audit trail, TOPSPIN		Version 2.1
$$ ##JCAMPDX= 5.01
$$ ##ORIGIN= Bruker BioSpin GmbH
$$ ##OWNER= Administrator
$$ $$ E:\/data/COFFEE/nmr/AC1370_2394_7221551_PFWnt8R9C4/30/pdata/1/auditp.txt
$$ ##AUDIT TRAIL=  $$ (NUMBER, WHEN, WHO, WHERE, PROCESS, VERSION, WHAT)
(   1,<2012-12-17 14:47:44.981 -0500>,<Administrator>,<X>,<go>,<TOPSPIN 2.1>,
      <created by zg
	started at 2012-12-17 14:46:38.949 -0500,
	POWCHK enabled, PULCHK disabled,
       configuration hash MD5:
       86 BA 57 50 F2 9D 5C 9B 26 00 A9 28 5F 66 2E 89
       data hash MD5: 64K
       98 79 B3 40 65 EA 94 BC A8 7F 7B F8 27 68 59 48>)
(   2,<2012-12-17 14:47:48.027 -0500>,<Administrator>,<X>,<proc1d>,<TOPSPIN 2.1>,
      <Start of raw data processing
       efp LB = 0 FT_mod = 6 PKNL = 1 PHC0 = 0 PHC1 = 0 SI = 32K 
       data hash MD5: 32K
       9A CD C1 65 9B 70 23 CF F5 2D 66 A4 1B 93 5D E7>)
(   3,<2012-12-17 14:47:48.465 -0500>,<Administrator>,<X>,<proc1d>,<TOPSPIN 2.1>,
      <pk PHC0 = 95.27893 PHC1 = 0 
       data hash MD5: 32K
       84 12 97 72 B5 EE DF 00 29 E1 34 A2 D4 C0 C6 63>)
(   4,<2012-12-17 14:47:48.684 -0500>,<Administrator>,<X>,<proc1d>,<TOPSPIN 2.1>,
      <abs ABSG = 1 
       data hash MD5: 32K
       76 4B D5 E3 9F 75 7A 52 DA 4B D8 7D 59 AD F8 2A>)
(   5,<2012-12-17 14:47:48.840 -0500>,<Administrator>,<X>,<proc1d>,<TOPSPIN 2.1>,
      <abs ABSG = 2 
       data hash MD5: 32K
       FC 7D 02 94 6B 3E 68 7D 4C 99 DD 51 7E A1 A0 21>)
(   6,<2012-12-17 14:47:48.965 -0500>,<Administrator>,<X>,<proc1d>,<TOPSPIN 2.1>,
      <abs ABSG = 3 
       data hash MD5: 32K
       B5 5E 8B 47 FC C3 19 1A 51 4A C4 EA C9 49 14 6A>)
(   7,<2012-12-17 14:47:49.106 -0500>,<Administrator>,<X>,<proc1d>,<TOPSPIN 2.1>,
      <abs ABSG = 4 
       data hash MD5: 32K
       B6 9C 6E B9 74 9C 5B 5D 74 CB 00 AD F2 67 65 A3>)
(   8,<2012-12-17 14:47:49.262 -0500>,<Administrator>,<X>,<proc1d>,<TOPSPIN 2.1>,
      <abs ABSG = 5 
       data hash MD5: 32K
       92 8B 55 05 4B 3D 0F 2B 48 5E C4 62 E8 FC 1C 7A>)
$$ ##END=
$$ 
$$ $$ hash MD5
$$ $$ 79 0E 6C 64 1E E9 D9 BE 40 13 0A 28 4F 87 94 69
##$RELAX= 
##$RELAX= 
##$RELAX= 
##$RELAX= 
##$RELAX= 
##$RELAX= 
##$RELAX= 
$$ Bruker specific parameters
$$ --------------------------
##$DU= <E:\>
##$EXPNO= 30
##$NAME= <AC1370_2394_7221551_PFWnt8R9C4>
##$PROCNO= 1
$$ [...]
150 150 150 150 150 150 150 150
##$TP07= 0
##$TPNAME0= <>
##$TPNAME1= <>
##$TPNAME2= <>
##$TPNAME3= <>
##$TPNAME4= <>
##$TPNAME5= <>
##$TPNAME6= <>
##$TPNAME7= <>
##$TPOAL= (0..7)
0.5 0.5 0.5 0.5 0.5 0.5 0.5 0.5
##$TPOFFS= (0..7)
0 0 0 0 0 0 0 0
##$TUNHIN= 0
##$TUNHOUT= 0
##$TUNXOUT= 0
##$USERA1= <user>
##$USERA2= <user>
##$USERA3= <user>
##$USERA4= <user>
##$USERA5= <user>
##$V9= 5
##$VALIST= <valist>
##$VCLIST= <CCCCCCCCCCCCCCC>
##$VD= 0
##$VDLIST= <DDDDDDDDDDDDDDD>
##$VPLIST= <PPPPPPPPPPPPPPP>
##$VTLIST= <TTTTTTTTTTTTTTT>
##$WBST= 2048
##$WBSW= 25
##$XGAIN= (0..3)
0 0 0 0
##$XL= 0
##$YL= 0
##$YMAX_a= 628215
##$YMIN_a= -534516
##$ZGOPTNS= <>
##$ZL1= 120
##$ZL2= 120
##$ZL3= 120
##$ZL4= 120
##$ABSF1= 14.98509
##$ABSF2= -5.573092
##$ABSG= 5
##$ABSL= 3
##$ALPHA= 0
##$AQORDER= 0
##$ASSFAC= 0
##$ASSFACI= 0
##$ASSFACX= 0
##$ASSWID= 0
##$AUNMP= <proc_prof1d_extract_pilot.lims>
##$AXLEFT= 0
##$AXNAME= <>
##$AXNUC= <1H>
##$AXRIGHT= 0
##$AXTYPE= 0
##$AXUNIT= <>
##$AZFE= 0.1
##$AZFW= 0.1
##$BCFW= 0
##$BC_mod= 0
##$BYTORDP= 0
##$COROFFS= 0
##$CY= 15
##$DATMOD= 1
##$DC= 0
##$DFILT= <>
##$DTYPP= 0
##$F1P= 0
##$F2P= 0
##$FCOR= 0.5
##$FTSIZE= 32768
##$FT_mod= 6
##$GAMMA= 0
##$GB= 0
##$INTBC= 1
##$INTSCL= 1
##$ISEN= 128
##$LB= 0
##$LEV0= 0
##$LPBIN= 0
##$MAXI= 10000
##$MC2= 0
##$MEAN= 0
##$ME_mod= 0
##$MI= 0
##$NCOEF= 0
##$NC_proc= -8
##$NLEV= 6
##$NOISF1= 0
##$NOISF2= 0
##$NSP= 0
##$NTH_PI= 0
##$NZP= 0
##$OFFSET= 14.98509
##$PC= 1
##$PHC0= 95.27893
##$PHC1= 0
##$PH_mod= 1
##$PKNL= yes
##$PPARMOD= 0
##$PPDIAG= 0
##$PPIPTYP= 0
##$PPMPNUM= 2147483647
##$PPRESOL= 1
##$PSCAL= 4
##$PSIGN= 0
##$PYNMP= <proc.py>
##$REVERSE= no
##$SF= 400.02
##$SI= 32768
##$SIGF1= 0
##$SIGF2= 0
##$SINO= 400
##$SIOLD= 32768
##$SPECTYP= <>
##$SREGLST= <1H.CDCl3>
##$SSB= 0
##$STSI= 32768
##$STSR= 0
##$SW_p= 8223.68421052631
##$SYMM= 0
##$S_DEV= 0
##$TDeff= 65536
##$TDoff= 0
##$TI= <>
##$TILT= no
##$TM1= 0
##$TM2= 0
##$TOPLEV= 0
##$USERP1= <user>
##$USERP2= <user>
##$USERP3= <user>
##$USERP4= <user>
##$USERP5= <user>
##$WDW= 1
##$XDIM= 32768
##$YMAX_p= 476264970
##$YMIN_p= -735265
##$CURPLOT= <Network HP LaserJet P1505>
##$CURPRIN= <$Network HP LaserJet P1505>
##$DFORMAT= <normdp>
##$LAYOUT= <+/1D_H.xwp>
##$LFORMAT= <normlp>
##$PFORMAT= <normpl>
##$SURQMSG= 1
$$ End of Bruker specific parameters
$$ ---------------------------------
##NTUPLES= NMR SPECTRUM
##VAR_NAME=  FREQUENCY,     SPECTRUM/REAL,   SPECTRUM/IMAG
##SYMBOL=    X,             R,               I
##VAR_TYPE=  INDEPENDENT,   DEPENDENT,       DEPENDENT
##VAR_FORM=  AFFN,          ASDF,            ASDF
##VAR_DIM=   32768,         32768,           32768
##UNITS=     HZ,            ARBITRARY UNITS, ARBITRARY UNITS
##FACTOR=    0.250966925370066, 1,           1
##FIRST=     8223.43324360094, -78262,       -241291
##LAST=      0,             -14940,          -97556
##MIN=       0,             -735265,         0
##MAX=       8223.43324360094, 476264970,    0
$$ Real data points
##PAGE= N=1
##DATA TABLE= (X++(R..R)), XYDATA
$$ [...]
$$ plain form
19559 -78677 -75476 134895 14074 -42588 203004 127018 -253661 -154152 -235136 -119168 -248993
19548 -248993 -264065 -224013 -11815 220218 -36734 495 247367 -122318 -353563 195024 434446
19537 434446 -164519 27948 -96817 260387 -159466 205966 -142413 -226654 -50074 11302
19526 126515 387195 -148998 -117385 -591039 -69413 -18630 -12848 -55257 -156048 -255537 -125787
19514 -195578 -116116 391729 -22885 -397167 -116227 21533 6901 14201 86233 -139460 -172206
19503 -172206 -179864 114794 285314 -164397 147977 -6810 319095 27033 -43706 -151368 -158081
19492 -158081 -224864 175972 -86822 301723 -142090 -352333 266324 52182 29125 -64188
19481 -293521 -212949 82911 -34236 -54012 -127579 182644 -222154 -346341 -228632 -159366 -133598
$$ packed form
19559g8677L201A34895A4074d2588B03004p5986b53661R9509q0984J15968j29825
19548b48993j5072M0052a1815B20218c6734D95K46872a22318k31245A95024K39422
19537D34446a64519B7948i6817B60387a59466B05966a42413q4241e0074A1302
19526A26515K60680a48998L1613m73654f9413a8630N782m2409j00791r9489a25787
19514a95578P9462C91729b2885l74282a16227B1533F901P300P2032a39460l2746
19503a72206p658A14794J70520a64397A47977f810C19095B7033d3706j07662o713
19492a58081o6783A75972h6822C01723a42090k10243B66324E2182k3057f4188
19481b93521Q0572H2911c4236j9776p3567A82644b22154j24187J17709O9266K5768
$$ plain form
19470 -133598 -98852 -188801 315756 -289351 -71642 -222154 96560 -430269 -344057 39274 -41176
19458 382226 -32987 -224388 -136052 54172 139336 79373 -205377 45700 -165754 -133196 -178300
19447 -178300 -10651 -26662 -327148 -137436 -368838 -287286 -504555 67338 -292883 -296087 41969
19435 -160922 198774 -54898 -235277 145991 -531375 173966 55186 305187 -128638 60107
19424 73331 400281 -33405 -375158 226130 -354969 -188198 -293379 17252 275690 -389822
19413 -341062 52003 -226586 -153994 35323 -13588 18013 396615 36203 231392 -128894 32855
19401 -294054 213904 -411472 87389 -132903 -187007 339538 -50445 -296038 -276405 150685
19390 -196696 -153777 -321769 -19546 -28655 206202 -138817 68157 -175538 -272760 59886 147922
$$ packed form
19470a33598L4746q9949C15756b89351g1642j50512I6560d30269Q6212C9274d1176
19458C82226c2987j91401Q8336E4172Q5164n9963b05377D5700a65754L2558m5104
19447a78300a0651j6011l00486a37436k31402Q1552k17269F7338b92883l204D1969
19435a60922A98774e4898j80379A45991e31375A73966E5186K50001a28638F0107
19424G3331L26950c3405l41753B26130c54969J66771j05181A7252K58438c89822
19413c41062E2003b26586P2592C5323a3588A8013L78602C6203J95189a28894C2855
19401b94054B13904d11472H7389a32903n4104C39538e0445k45593J9633A50685
19390a96696M2919j67992a9546r109B06202a38817F8157a75538r7222E9886Q8036
$$ plain form
19379 147922 380621 -55303 343757 -52157 55014 -381537 60225 -287859 -86662 -62352 -118343
19368 -118343 -96878 -84700 -543582 -293048 391989 -192555 -60951 -257824 -241489 -112559
19357 134009 -102078 -218874 110176 -324559 -267827 -42899 18753 -178510 288262 -208394
19346 -187780 113991 -325935 83615 134003 -6961 -159457 129791 28048 -136699 -502540
19336 -502540 156223 87005 83 90410 -273922 -88002 -429833 -281225 -205935 120270 -13868
19324 -123772 297562 -66266 -143132 -230828 144734 -218148 -198193 -77428 255569 -12622 -29243
19313 -29243 -39462 -33097 -344985 -198105 -143861 -278873 -217757 200673 71692 -21031 -85365
19302 -85365 -132771 125179 -307545 -82684 64542 -257480 -45026 22084 333668 17054 80085
$$ packed form
19379A47922K32699e5303C43757e2157E5014c81537F0225b87859h6662K4310n5991
19368a18343K1465J2178m58882K50534C91989a92555f0951j96873J6335a12559
19357A34009a02078j16796A10176c24559N6732d2899A8753a78510B88262b08394
19346a87780A13991c25935H3615N0388f961j52496A29791B8048a36699l65841
19336e02540A56223o9218H3R0327b73922h8002l41831J48608P5290A20270a3868
19324a23772B97562f6266p6866q7696A44734b18148J9955g7428B55569a2622j6621
19313b9243j0219O365l11888J46880N4244j35012O1116B00673G1692b1031o4334
19302h5365m7406A25179c07545h2684F4542b57480d5026B2084L11584A7054O3031
$$ plain form
19291 80085 -187777 -76651 -44 41067 -194636 3059 -92198 28877 -97828 -30496 -158825 -196338
19279 -196338 -15708 -192852 63235 -39949 -280578 77279 -310767 -181461 -62406 -377543
19269 -377543 -185332 -389310 78916 -17575 -21583 196240 -135156 70161 -143218 -378569
19259 -378569 -211719 252282 -55374 302679 -54056 25823 -251075 -219585 -62183 -67197 -449249
19248 -449249 -226172 246606 -447490 -105176 -111832 -247616 98125 -39699 -80399 82840 439334
19237 439334 101672 -71309 -298927 -289683 -93224 -264549 -196486 234877 -75692 -286174 7066
19225 -115263 472109 25620 -476546 134499 257310 -9753 -59666 -127270 -72910 -304962 -129079
19213 -281324 -315246 42805 -255364 -184626 45745 -269971 12277 31642 42586 -4392 -315158
$$ packed form
19291H0085a87777g6651d4D1067a94636C059i2198B8877i7828c0496j28329l7513
19279a96338a5708j77144F3235c9949k40629G7279c10767J29306f2406l15137
19269c77543a85332k03978G8916a7575m008A96240a35156G0161a43218k35351
19259c78569J66850B52282e5374C02679e4056B5823b51075L1490f2183n014l82052
19248d49249K23077B46606d47490a05176o656j35784I8125c9699m0700H2840L56494
19237D39334A01672g1309k27618R244i3224j71325O8063B34877g5692k10482G066
19225a15263D72109B5620d76546A34499J22811i753m9913o7604N4360k32052a29079
19213b81324l3922D2805b55364P0738D5745b69971A2277J9365J0944d392l10766
$$ plain form
19202 -315158 209633 -223439 152941 15091 -167036 136215 61423 12416 -129585 -180636
19192 -180636 -146815 141423 -120875 -151659 111267 91054 -104931 -166143 -89336 -40507 89531
19180 -11425 -51586 -132993 -55596 -302249 -36535 13574 -65609 317124 -11867 140155 -138998
19168 -213740 342116 -61909 -125760 -83224 367183 -21894 -27701 4890 -152309 -34028 -75532
19157 -75532 -83963 -26732 -152306 113854 33436 65006 120576 -236414 -96341 145175 55759
19145 -631552 -339652 -131108 -288034 88588 17443 103773 34255 156142 -27604 164011
19134 -44978 -68643 -355053 -111057 -88062 -136402 250172 -64594 -98447 -75079 285295 -71791
19122 -125477 -262880 -192255 41110 -49510 -101028 359840 -198582 -162534 -69048 -136929 116230
$$ packed form
19202c15158B09633b23439A52941A5091a67036A36215F1423A2416a29585n1051
19192a80636L3821A41423a20875l0784A11267k0213a04931o1212P6807d0507H9531
19180a1425m0161q1407e5596k46653c6535A3574f5609C17124a1867A40155a38998
19168b13740C42116f1909o3851M2536C67183b1894n807D890a52309c4028m1504
19157g5532q431b6732j25574A13854C3436L1570N5570b36414i6341A45175E5759
19145f31552K91900a31108j56926H8588A7443Q6330C4255J21887b7604A64011
19134d4978k3665k86410a11057K2995m8340B50172f4594l3853K3368B85295g1791
19122a25477j37403P0625D1110d9510n1518C59840a98582L6048f9048o7881A16230
$$ plain form
19110 -45689 -15862 -165145 212123 19967 -249113 72346 145195 212664 -165602 -253160 100109
19098 -60676 -252311 295806 -250137 -300773 -123518 76632 -12380 -48023 -111153 -238565 -271992
19087 -271992 33115 -135338 -125185 24594 104342 -342011 61071 31845 58889 19817 5535
19075 -144781 -118792 206985 -91690 -216806 -241056 -151703 425835 112098 -374096 -245340
19065 -245340 30079 -9803 -150811 -401751 -289453 -258440 -148601 -68598 246221 -71259 -217308
19054 -217308 43972 67347 68562 -251431 -361194 201866 -361772 71625 142804 -5653 292576
19042 61157 -97366 10322 -96761 -6748 66695 -195325 6682 -35080 -243691 -129891 36425
19030 100710 39275 211526 45499 -175219 111654 191922 50892 28299 184893 -413494
$$ packed form
19110d5689a5862j49283B12123A9967b49113G2346P2849O7469a65602q7558A00109
19098f0676j91635B95806b50137n0636a23518G6632a2380l5643o3130j27412l3427
19087b71992C3115a35338J0153B4594P9748c42011F1071k9226K7044A9817E535
19075a44781K5989B06985i1690j25116k4250Q9353D25835A12098c74096J28756
19065b45340C0079i803j41008k50940J12298L1013J09839f8598B46221g1259j46049
19054b17308D3972K3375J215b51431j09763B01866c61772G1625P1179e653B92576
19042F1157i7366A0322i6761f748F6695a95325F682c5080k08611J13800C6425
19030A00710C9275J72251D5499a75219A11654Q0268E0892k2593J56594d13494
$$ plain form
19019 122895 -44034 -138874 -89394 96259 17713 36976 124661 108359 -74050 21256 -232675
19007 -270863 288581 -173425 -357983 81392 -91012 76273 58670 -29910 210873 117945 174318
18996 174318 -217505 -26604 120372 43771 -258914 124901 -144028 -61940 -189760 323733
18985 92029 -274926 66937 194869 -100333 70647 -309210 -196389 -10497 -164740 130124
18974 -151250 -458678 -57124 -301570 -8859 240334 -214738 64769 -132936 -99230 -318811
18964 -318811 163918 274202 -231210 232940 -282723 -185476 -11572 -64726 -301081 135146
18953 36206 45260 273938 328685 -20444 -303188 -74116 -133024 -63533 -14859 -309887 -632 20909
18940 120491 -217052 195927 138779 -129410 206582 -50637 -208937 -191147 15718 101092
$$ packed form
19019A22895d4034r4840M9480I6259A7713J9263Q7685j6302g4050B1256b32675
19007b70863B88581a73425j84558H1392i1012G6273j7603b9910B10873r2928N6373
18996A74318b17505b6604A20372D3771b58914A24901a44028f1940j27820C23733
18985I2029b74926F6937J27932a00333G0647c09210J12821a0497j54243A30124
18974a51250l07428e7124k44446h859B40334b14738F4769a32936L3706k19581
18964c18811A63918J10284b31210B32940b82723R7247a1572n3154k36355A35146
18953C6206R054K28678N4747b0444k82744g4116n8908f3533a4859k95028f32B0909
18940A20491b17052A95927n7148a29410B06582e0637j58300J7790A5718Q5374
$$ plain form
18930 101092 -139719 -76759 55021 -282561 118205 38849 56544 -363708 174987 -255445
18919 -168736 67609 185104 15613 -6549 41037 -375501 -82630 -334957 -229182 76745 -450714
18907 -174588 -178606 109048 -5050 -65719 -37974 198395 -281005 -221070 149046 -231701 280710
18895 -125838 9899 -157940 -330883 173341 -167578 -37650 -203686 118364 384987 -457734
18884 149348 -8878 -153756 123537 220777 -638113 -111784 -39844 -3809 -380018 989 -71758
18872 -183310 260102 299960 95211 201305 40121 180972 -277628 -241802 -40687 30790 291339
18861 291339 178260 35644 -13305 57550 77414 -203614 -199478 -256720 -194146 -6803 -128497
18850 -128497 -36257 -197336 -148047 -46471 124194 -2690 121646 -17810 232571 246936 -144510
$$ packed form
18930A01092a39719O2960E5021b82561A18205C8849J7695c63708A74987b55445
18919a68736F7609J17495A5613f549D1037c75501h2630k52327J05775G6745d50714
18907a74588m018A09048e050o0669K7745A98395b81005N9935A49046b31701B80710
18895a25838I899a57940j72943A73341a67578c7650j66036A18364K66623d57734
18884A49348h878j44878A23537R7240f38113a11784c9844c809l76209I89g1758
18872a83310B60102L9858I5211J06094D0121J40851b77628L5826d0687C0790K60549
18861B91339j13079C5644a3305E7550J9864b03614M136n7242O2574f803j21694
18850a28497c6257j61079M9289d6471A24194b690A21646a7810B32571J4365a44510
$$ plain form
18838 -172516 -18648 -383482 -359553 154896 -21376 69726 -163717 -261104 90132 279406 41808
18826 -375858 3506 -277509 192918 -288443 68836 -61749 164464 -57557 -38258 67189 553084
18815 553084 325282 -33015 -113096 -219006 263553 51478 -990 -174116 -137422 -191283 -122866
18804 -122866 -268590 121691 186068 106220 229510 -18191 61944 81208 193839 -109964
18793 -98344 -151683 -250686 -49978 129274 103094 74330 175013 -100066 -200913 -384806 -122404
18781 -95631 -32711 136884 170632 10834 116542 -607011 54972 -138847 11851 -7497 147052
18769 -229671 -66414 -36671 -186810 -145242 -26277 -36383 -21130 -139278 -104730 -98649 10647
18757 20163 337005 -171005 -165454 42186 49257 108657 -180488 -317088 123876 -288019 221728
$$ packed form
18838a72516a8648l64834K3929A54896b1376F9726a63717r7387I0132J89274D1808
18826c75858C506b77509A92918b88443F8836f1749A64464e7557J9299F7189M85895
18815E53084k27802c3015q0081j05910B63553E1478i90j73126L6694n3861O8417
18804a22866j45724A21691O4377p9848J23290a8191F1944J9264J12631a09964
18793i8344n3339r9003d9978A29274k6180k8764J00683a00066j00847j83893a22404
18781i5631c2711A36884L3748A0834J05708f07011E4972a38847A1851g497A47052
18769b29671f6414K9743j50139M1568b6277j0106J5253j18148L4548O081A0647
18757B0163L16842a71005N551D2186P071N9400a80488j36600A23876b88019B21728
$$ plain form
18745 193260 -16224 -148524 197576 -119996 -65383 226325 277883 86642 -158585 429182
18734 -43390 -93466 -268426 -130804 -100888 -68215 -271801 126454 16408 -76166 -25822 -147854
18723 -147854 578 -65837 309540 -227523 264087 -223082 -82119 260271 244500 -77179 109913
18711 -41973 -12051 -106325 272811 161914 -358327 360162 -100838 -99580 77339 355904 -289253
18699 -16007 -54398 -221057 -512031 187575 -123496 19227 -187727 407700 -94095 -127273
18689 -127273 -78886 -146299 -368873 -119473 141536 314619 -107054 -272416 175616 -75197
18678 -154345 -163594 -16758 448708 -157384 290302 80422 13456 2180 23079 -530368 60496
18666 59778 -128119 -71387 -110099 -329412 90042 86145 -316454 29488 -155378 113399 -231162
$$ packed form
18745A93260a6224j32300A97576a19996N4613B26325N1558H6642a58585D29182
18734d3390n0076j74960a30804K9916L2673k03586A26454A6408g6166b5822j22032
18723a47854E78f5837C09540b27523B64087b23082h2119B60271j5771g7179A09913
18711d1973a2051r4274B72811j10897c58327C60162a00838J258G7339K78565b89253
18699a6007l8391j66659k90974A87575a23496A9227a87727D07700i4095l3178
18689a27273M8387o7413k22574a19473A41536J73083a07054j65362A75616g5197
18678a54345r249a6758D48708a57384B90302H0422A3456B180K0899e30368F0496
18666E9778a28119N6732l8712k19313I0042l897c16454B9488a55378A13399b31162
$$ plain form
18654 93984 -176421 24272 -257360 -155786 -191865 185528 -200433 89304 -242882 -189507
18644 -189507 -53514 -249341 133344 158829 -133350 241520 -293990 -32606 12902 -6849 71226
18632 38005 377614 130182 -144711 -132698 103648 -154893 -44640 -274346 -217756 58401
18621 302010 211025 -310353 161808 -363303 -192287 -160346 -239594 143917 -461581 -147278
18610 17670 -125 134261 -294315 -50741 -128422 152928 -211240 56780 270546 287725 -176539
18598 76960 -158298 -137374 -54013 1293 -34921 133021 -355561 63677 -28799 88046 236126
18587 236126 32865 -36123 -156670 -216167 104782 -78124 183123 -196450 67035 170905
18577 170905 -79105 295486 -211721 -221834 -124374 -32604 195783 -28780 54933 -46212 -100926
$$ packed form
18654I3984a76421B4272b57360J01574l6079A85528b00433H9304b42882N3375
18644a89507e3514j95827A33344K5485a33350B41520b93990c2606A2902f849G1226
18632C8005L39609A30182a44711J2013A03648a54893d4640k29706N6590E8401
18621C02010r0985c10353A61808c63303J71016L1941p9248A43917d61581a47278
18610A7670a25A34261b94315e0741p7681A52928b11240E6780K13766J7179a76539
18598G6960a58298K0924e4013A293c4921A33021c55561F3677b8799H8046J48080
18587B36126C2865c6123j20547n9497A04782g8124A83123a96450F7035J03870
18577A70905g9105B95486b11721j0113R7460c2604A95783b8780E4933d6212n4714
$$ plain form
18566 -100926 -85606 143165 -235151 21454 -109915 46836 -81955 182986 -24731 244543
18555 -98017 -153937 -15387 71317 -170286 226073 -218417 -16915 -322656 -53398 -12044 268383
18543 268235 12789 71441 -152248 -430187 -300225 254903 95503 98719 -157517 -141322 109530
18531 -240454 158374 -38031 -448372 31621 -55789 231147 306751 -209033 -197180 -21881 3645
18519 -236204 -22361 131840 138399 11131 -146830 -83512 -60735 12856 -199238 5274 -15461
18507 -6896 -110904 76712 -102827 -87718 -50076 -273952 173630 70086 -162239 117498 -62732
18495 -60444 -29267 221237 -373321 -92017 -313919 -224137 -62644 -253986 99644 -165008 -223295
18484 -223295 52287 -141310 -37007 -230380 -454250 297721 64037 -59414 -153992 -16097 15823
$$ packed form
18566a00926J5320A43165b35151B1454a09915D6836h1955A82986b4731B44543
18555i8017n5920a5387G1317a70286B26073b18417a6915l05741e3398a2044B68383
18543B68235A2789N8652a52248k77939J29962B54903I5503L216a57517J6195A09530
18531b40454A58374c8031m10341C1621e5789B31147P5604b09033J1853b1881C645
18519b36204b2361A31840O559A1131a46830O3318K2777A2856a99238E274a5461
18507f896j04008G6712a02827J5109L7642k23876A73630G0086a62239A17498f2732
18495f0444b9267B21237c73321i2017k21902Q9782f2644j91342I9644a65008n8287
18484b23295E2287a41310c7007j93373k23870B97721F4037e9414r4578a6097A5823
$$ plain form
18472 -56811 142694 116244 -13310 -175982 195875 -61561 70428 -23041 61366 88916 -85927
18460 135187 -113996 -168787 -158354 -211318 158279 91630 211805 -159008 245190 55680
18449 267165 -60908 -62107 57223 -136132 212258 164218 -99672 -103994 -161032 9614 -175678
18437 -253837 -490872 -53036 341578 -259604 21714 -111209 -252869 36565 8680 107930 -13693
18425 -183778 -86767 72603 -303484 -45700 59294 1599 -191795 -302378 15980 -180272 -222439
18414 -222439 -183335 -32236 -39293 -198056 -17686 -56349 -190421 -69719 398155 -835 -245624
18403 -245624 -179625 64239 -56575 107887 -248428 155984 -311244 -137863 80332 30327
18392 56391 41262 -265844 -74225 -200441 221317 -101070 35466 -198505 224843 -51041
$$ packed form
18472e6811A42694k6450a3310j62672A95875f1561G0428b3041F1366K7550h5927
18460A35187a13996n4791J0433n2964A58279o6649J20175a59008B45190E5680
18449B67165f0908j199E7223a36132B12258m8040i9672m322n7038I614a75678
18437b53837k37035e3036C41578b59604B1714a11209j41660C6565H680R9250a3693
18425a83778h6767G2603c03484d5700E9294A599a91795j10583A5980a80272m2167
18414b22439L9104c2236p057j58763a7686l8663j34072f9719C98155h35k44789
18403b45624O5999F4239e6575A07887b48428A55984c11244a37863H0332C0327
18392E6391j5129b65844g4225j26216B21317a01070C5466a98505B24843e1041
$$ plain form
18381 122383 -41618 -219662 162207 -112726 67897 -234665 -149557 135793 40777 -20452
18370 251435 -316655 -154379 -53030 -71015 370820 642 146309 74584 49726 -99409 -161579
18359 -161579 -125860 240021 7520 150991 -91091 -85742 196243 133921 20124 -44572 -251727
18348 -251727 58714 -79728 302433 -278873 -143318 -147966 150774 134089 -11463 17368 23675
18337 23675 -405293 184478 -320949 332219 -148857 -186855 139040 -244279 -176308 -321215
18327 -321215 -187810 73572 -94893 -490744 -60116 -138510 -118398 28386 -34666 -472547 -186756
18315 40738 -151445 297140 86393 -296911 59817 69635 -205139 443401 -21551 95502 14475
18303 -232238 60302 -219932 151 82181 -263 -40266 133211 354642 36912 -43781 246541
$$ packed form
18381A22383d1618j78044A62207a12726F7897b34665Q5108A35793D0777b0452
18370B51435c16655a54379e3030j7985C70820F42J45667p1725k4858i9409o2170
18359a61579L5719B40021G520J43471i1091N349A96243o2322B0124d4572k07155
18348b51727E8714g9728C02433b78873J35555m648A50774j6685a1463A7368O307
18337B3675d05293A84478c20949C32219a48857l7998A39040b44279O7971j44907
18327c21215J33405G3572i4893l95851f0116p8394K0112B8386c4666m37881a86756
18315D0738a51445B97140H6393b96911E9817R818b05139D43401b1551I5502A4475
18303b32238F0302b19932A51Q2030b63m0003A33211K21431C6912d3781B46541
$$ plain form
18291 28514 -43796 -123622 86056 101872 -186265 15993 -177231 64580 -100937 -343859 -156291
18279 112566 -409578 -113744 -67790 70414 221174 38651 -308066 -203124 41715 63228
18269 63228 42402 229790 3040 100474 382447 -70893 -39449 -154298 -33344 -85192 116016
18257 263279 -4983 53033 -89803 -129407 42145 126534 135762 198521 -234114 -17158 -45468 -118120
18245 -118120 -289306 -144089 -320948 -463682 146752 -13922 -24069 -525609 -100233 -137471
18235 -137471 26916 -48013 -170115 -81533 226794 470957 38242 -60939 6351 -198359 -401323
18224 -401323 -132271 -201097 -180352 79680 211660 148003 -289244 121981 350472 49403
18213 14627 -129713 193610 -412052 190646 -245095 -44911 -338090 222498 163633 -17885
$$ packed form
18291B8514d3796p9826H6056J5816a86265A5993a77231F4580a00937k42922a56291
18279A12566d09578a13744M5954G0414J50760C8651c08066J04942D1715K1513
18269F3228k0826J87388C040R7434K81973g0893L1444j14849c3344n1848A16016
18257B63279d983E3033h9803l9604D2145Q4389R228O2759b34114a7158k8310p2652
18245a18120j71186a44089j76859j42734A46752a3922j0147n01540a00233l7238
18235a37471B6916d8013j22102h1533B26794K44163C8242f0939F351a98359k02964
18224d01323a32271o8826K0745G9680J31980o3657b89244A21981K28491D9403
18213A4627a29713A93610d12052A90646b45095d4911k93179B22498n8865a7885
$$ plain form
18202 -23548 5623 -227837 267861 10205 65506 95263 180059 -197017 -184387 96645 -5250
18190 -144435 11542 172467 169581 76632 -410712 86810 8228 113241 -140598 -191802 109534
18178 148571 103205 -11551 -132199 -214556 96752 -15213 142044 48268 -150830 -74198 -132769
18167 -132769 -195969 -59614 -13231 -264389 -285592 -43381 113792 171909 223780 -158444 29930
18155 -262922 256102 -33730 -121328 -145298 381298 40162 12073 -42577 -347109 281988 -601925
18143 -127351 -259459 185861 134245 -28673 171961 -191230 223709 112369 -7930 -143364
18133 -143364 -100792 54585 -455481 -296158 -294144 -381681 41182 290576 -146356 -298171 110973
18121 -99640 -116318 26507 -196893 193099 47239 337452 63272 -29650 104733 554103 81459
$$ packed form
18202b3548E623b27837B67861A0205N5301K9757Q4796a97017J2630I6645e250
18190a44435A1542J60925k886G6632d10712H6810H228J05013a40598n1204A09534
18178A48571m5366a1551j20648q2357I6752a5213A42044D8268a50830g4198n8571
18167a32769o3200e9614a3231k51158k1203d3381A13792N8117N1871a58444B9930
18155b62922B56102c3730q7598k3970C81298D0162A2073d2577l04532B81988f01925
18143a27351j32108A85861n1616b8673A71961a91230B23709j11340g930j35434
18133a43364M2572E4585d55481J59323K014q7537D1182K49394a46356j51815A10973
18121i9640j6678B6507a96893A93099D7239K90213F3272b9650A04733M49370H1459
$$ plain form
18109 -225744 120366 90469 -263220 -107505 271888 79252 -96198 -39646 -167469 47074
18098 32241 -93854 -244729 177976 -77558 265423 39609 234288 175862 -190569 -359205
18088 -359205 -30484 103084 -192139 -93649 -400418 -172572 305002 204929 68497 130542
18078 130542 5650 -226439 -86370 -101897 -176917 -120488 228371 -103855 248086 52857 1212
18066 -243065 -41380 -14930 61321 70048 -299261 148273 -160745 260553 -40989 112293 235351
18055 235351 124442 -52124 -159881 132166 -92475 -9626 165081 5012 23392 120261 -146629
18043 -23285 -211623 329412 -33520 -110556 -45014 -50904 256083 -253303 -161504 285247 -12786
18031 182204 -244767 -46705 -178119 73977 24688 -19732 -263645 -106156 51169 -218835
$$ packed form
18109b25744A20366k9897b63220a07505B71888G9252i6198c9646j27823D7074
18098C2241i3854j50875A77976g7558B65423C9609J94679n8426a90569j68636
18088c59205c0484A03084a92139i3649l06769a72572C05002j00073F8497O2045
18078A30542E650b26439h6370j5527p5020N6429B28371a03855B48086E2857A212
18066b43065d1380a4930F1321Q727b99261A48273a60745B60553d0989A12293J23058
18055B35351j10909e2124j07757A32166i2475i626A65081E012J8380R6869a46629
18043b3285j88338C29412c3520p7036d5014n890B56083b53303R1799B85247a2786
18031A82204b44767d6705j31414G3977B4688a9732k43913a06156E1169b18835
$$ plain form
18020 164882 -34167 -67129 -262841 -63074 -189496 -169095 -228548 -119770 -328787 -119999
18009 -109939 -38883 -287238 82170 -559085 -15901 -147338 179061 -211842 37093 232888
17999 232888 109165 -104418 -41309 227785 62236 -133414 -122749 -322999 -19952 -210656
17989 -210656 15355 205136 -296333 -274229 -71236 40132 -60111 181724 163912 169718 74456
17977 387253 -347462 -183655 -90022 -110888 -219084 16048 297071 -135831 -224662 -97225
17966 -69337 -169954 -50993 -37239 -111050 27601 -149438 45803 -142063 217555 4100 -165584
17954 82466 9494 58985 -30760 147806 100317 117339 -409835 53041 -12455 118317 -64661
17942 66742 787 -298983 233652 14269 149218 -51815 205456 -149995 9997 -153899 6837
$$ packed form
18020A64882c4167l2962j95712f3074j26422K0401n9453J08778k09017a19999
18009a09939c8883k48355H2170e59085a5901j31437A79061b11842C7093J95795
17999B32888A09165a04418d1309B27785F2236a33414J0665k00250a9952j90704
17989b10656A5355J89781b96333K2104g1236D0132f0111A81724j7812N806G4456
17977C87253c47462J63807i0022k0866j08196A6048K81023a35831q8831i7225
17966f9337j00617e0993J3754p3811B7601a49438D5803a42063B17555D100a65584
17954H2466I494M9491c0760A47806m7489J7022d09835E3041a2455A18317f4661
17942F6742G87b98983B33652A4269J34949e1815B05456a49995I997a53899F837
$$ plain form
17930 -79472 -39073 -86946 187242 207865 102947 -81696 -132149 -15980 2153 73050 137395
17919 137395 -367686 -198820 183887 39114 -107890 192828 -212285 -168769 337939 113318
17908 194803 -41569 -278164 -331940 -27625 -60203 30554 263226 -184168 3746 -356205 483814
17896 -252493 -114378 -68942 -164941 51635 -147130 -172363 -102849 15940 54651 -141298 18202
17884 -227198 -89388 107892 148146 36722 43194 37670 -92471 209899 -398369 -212211 -25909
17872 -142810 76690 -56931 -38074 299641 259897 5312 149576 48446 64607 1191 183146
17861 183146 43290 -162304 -151525 317303 -102239 -227239 38836 295789 -154415 -107561
17851 -107561 -135998 -328101 -30769 -29922 -73262 124102 -385248 -204062 83238 -236093 -123849
$$ packed form
17930g9472c9073m7873A87242K0623A02947h1696n0453a5980B153P0897O4345
17919A37395c67686J68866A83887C9114a07890A92828b12285M3516C37939A13318
17908A94803d1569k36595n3776b7625l2578C0554K32672a84168C746c56205D83814
17896b52493a14378M5436r5999E1635a47130k5233O9514A5940L8711a41298A8202
17884b27198h9388A07892M0254C6722O472n524i2471B09899c98369J86158b5909
17872a42810G6690e6931J8857B99641l9744E312J44264D8446J6161A191J81955
17861A83146D3290a62304J0779C17303a02239j25000C8836K56953a54415M6854
17851a07561k8437j92103c0769Q47m3340A24102c85248J81186H3238b36093J12244
$$ plain form
17840 -123849 281267 -245105 -62454 -221931 -81070 42366 79159 -132068 -11518 62910 -132713
17828 -10468 231057 97336 108663 -11325 186803 179957 -89449 404904 -36913 -31508 -91508
17817 -91508 135540 11105 -11459 157233 -153681 -58952 251944 -217505 78575 113722 -489544
17805 56501 -35849 -215124 -138851 33511 86943 222964 173960 6904 40478 8297 192210
17794 192210 -135919 -172692 -19607 -84463 80503 -494606 254966 71526 77327 282837 2504
17782 -1996 190744 40030 -213679 -145070 -113395 -39034 -23729 -155660 47123 59576 316155
17771 316155 -45714 -105495 122833 -306946 -402683 55443 261366 232378 -206297 -73097 6487
17759 -177638 -94698 435982 -84513 151577 -262967 37193 -169270 147887 -278963 -29755
$$ packed form
17840a23849B81267b45105f2454j59477h1070D2366L6793a32068a1518F2910a32713
17828a0468B31057I7336J1327a1325A86803o846h9449D04904c6913N405o0000
17817i1508A35540A1105a1459A57233a53681e8952B51944b17505G8575L5147d89544
17805E6501c5849j79275P6273C3511N3432J36021m9004F904L3574H297J83913
17794A92210a35919l6773a9607o4856H0503d94606B54966G1526N801K05510B504
17782a996A90744D0030b13679O8609L1675c9034J5305j31931D7123J2453K56579
17771C16155d5714n9781A22833c06946r5737E5443K05923k8988b06297g3097F487
17759a77638Q2940D35982h4513A51577b62967C7193a69270A47887b78963b9755
$$ plain form
17748 -236199 -346918 97446 53337 350947 -245354 -84746 -242495 -1119 -259141 -86719 83464
17736 77692 -169433 -119001 -68659 -285851 -135983 247721 115510 481190 -37274 271219
17725 18191 170405 299703 -145971 535070 86566 10896 88082 88753 12291 109678 89771
17714 89771 151864 226658 4034 -93166 -15072 203976 -78535 251012 -15763 187234 129412
17703 129412 -140563 -45886 137170 14143 490662 40717 70837 -112393 -15966 -183490
17693 -183490 89197 63675 -52408 -8523 -35591 183734 48706 -290365 -368199 -103494 -94843
17682 -94843 150207 277112 53307 258556 145666 -55133 384510 -32674 70251 96372 -45116
17670 -93801 -176556 -77939 162859 2294 -15566 -156987 -13303 -213271 -38195 -41615 21745
$$ packed form
17748b36199j10719I7446m4109K97610b45354h4746j57749a119k58022h6719H3464
17736G7692a69433N0432N0342k17192a35983B47721A15510L65680c7274B71219
17725A8191J52214J29298a45971E35070H6566A0896P7186O71A2291R7387j9907
17714H9771O2093P4794D034i3166a5072B03976g8535B51012a5763A87234n7822
17703A29412a40563d5886A37170A4143M76519D0717L0120a12393a5966j67524
17693a83490H9197k5522e2408h523k7068A83734D8706b90365p7834a03494Q651
17682i4843A50207J26905E3307K05249j12890e5133C84510c2674G0251K6121d5116
17670i3801q2755g7939A62859B294a5566j41421a3303j99968c8195l420B1745
$$ plain form
17658 260704 -203974 -194026 72925 303671 -229247 97365 287031 -52908 52201 -308854 103836
17646 -223064 -312791 -268685 499252 219887 295276 322136 -138488 -7866 -318982 421745 -17037
17634 -103748 -88919 171992 -283920 75601 -75288 -12218 49263 21780 -181981 128444 -168344
17622 72099 -117279 73010 28809 -152050 177711 194467 -436321 -49608 -31690 -216279 -82634
17610 65838 91465 501408 -119527 49735 94170 45874 286662 21419 -298493 24134 272624
17599 272624 243980 43391 23870 -162482 33321 85943 -99325 -92713 62213 -22872 159066
17587 93793 -231907 -90951 -190969 -44206 -43717 99854 320487 47201 -133827 15400 57273
17576 57273 211195 194369 205407 107744 270474 -180717 -166129 -444155 128318 39358 -318147
$$ packed form
17658B60704b03974R948G2925K30746b29247I7365J89666e2908E2201c08854A03836
17646b23064q9727M4106D99252B19887P5389K6860a38488g866l11116D21745a7037
17634a03748J4829A71992b83920G5601g5288a2218D9263B1780a81981A28444a68344
17622G2099a17279G3010B8809a52050A77711J6756d36321d9608J7918j84589h2634
17610F5838K5627M09943a19527D9735M4435D5874K40788B1419b98493B4134K48490
17599B72624k8644D3391j9521a62482C3321N2622i9325O612F2213b2872A59066
17587I3793b31907i0951j00018d4206M89I9854K20633D7201a33827A5400M1873
17576E7273J53922j6826J1038r7663J62730a80717J4588k78026A28318C9358c18147
$$ plain form
17564 -125614 -265496 106965 112834 -5659 50903 -147863 386185 -46699 149942 -181151 215105
17552 825 -85547 13541 -143983 -44878 -31048 101727 28789 -65230 32154 143189 140914 -92766
17539 -34600 227901 169443 -107453 -63413 307059 116147 444758 -104874 408388 -105488
17528 21899 73034 -152103 -202698 60823 -175192 57524 29093 32389 345986 -60280 347699
17516 -164868 255421 32865 190184 96386 65430 189631 -65392 -84382 -73773 192176 -24883
17504 -145894 -164368 -261238 291190 199121 37308 49722 -45881 -73235 301865 205408 204080
17493 204080 56423 112492 -185969 -37115 90354 90669 255278 127920 113680 26191 221796
17482 221796 205734 31744 153970 199159 204593 42354 339491 179785 192900 -65028 263672
$$ packed form
17564a25614j39882A06965N869e659E0903a47863C86185d6699A49942a81151B15105
17552H25h5547A3541a43983d4878J3830A01727B8789f5230C2154J11035k275i2766
17539c4600B27901n8458a07453M4040C07059A16147L28611a04874D08388a05488
17528B1899N1135a52103n0595F0823a75192E7524k8431L296L13597f0280C47699
17516a64868B55421C2865J57319r3798l0956J24201f5392j8990J0609A92176b4883
17504a45894j8474r6870B91190r2069C7308J2414d5881k7354C01865r6457j328
17493B04080E6423N6069a85969c7115I0354L15J64609j27358j4240B6191J95605
17482B21796j6062C1744J22226M5189N434D2354K97137j59706J3115f5028B63672
$$ plain form
17470 187719 -24569 74970 21993 152880 200620 147960 12253 344900 178195 -34612 68165
17458 697 247651 141168 315500 117987 603977 559910 181096 147581 470145 732150
17448 732150 428217 390221 300138 301945 140414 77140 403178 540998 483295 46256 438798
17437 438798 126017 394625 308791 192418 402073 111553 375844 199004 139419 383165
17427 383165 162441 -48423 382483 6098 268349 22035 306882 229837 308286 464372 440662
17416 440662 114523 268543 207653 38916 64918 161646 161253 -167423 -71173 -129404 141333
17404 -209337 233481 -138128 195973 -133509 235991 20131 114550 147289 -23286 286145
17393 184562 71209 -5649 129713 -37733 -143336 22241 83017 233959 -16296 84100 333254
$$ packed form
17470A87719b4569G4970B1993J30887M7740n2660A2253L32647j66705c4612F8165
17458F97K46954j06483J74332A17987M85990m4067A81096l3515L22564K62005
17448G32150l03933l7996r0083J807A40414o3274L26038J37820n7703D6256L92542
17437D38798A26017K68608q5834j16373K09655A11553K64291j76840n9585K43746
17427C83165A62441d8423C82483F098K62251B2035K84847p7045P8449J56086k3710
17416D40662A14523J54020o0890C8916K6002R6728l93a67423g1173n8231A41333
17404b09337B33481a38128A95973a33509B35991B0131R4419L2739b3286B86145
17393A84562G1209e649A29713c7733j05603B2241O0776J50942a6296H4100K49154
$$ plain form
17382 333254 -58351 53101 426541 330947 -47399 166847 380871 27473 155843 189792 367487
17371 367487 112715 58443 23286 184660 482840 -107646 99661 223877 207929 -77004
17360 106205 219540 62943 -66307 173377 1263 257072 231966 321623 151424 224117 118302
17349 118302 -239173 -178015 285225 -78944 232802 219599 -116447 -449347 277025 25663
17338 108404 8315 215482 133873 108376 52252 -30439 -236543 -16938 351944 54140 -197124
17326 205439 111090 45834 459302 -177842 170783 -387 211623 -33744 32614 190213 299769
17315 299769 175617 256204 -75855 473608 105253 278219 340335 57054 136731 292889
17305 292889 63780 153664 -65868 261086 356501 205514 -349215 355481 -243389 74905
$$ packed form
17382C33254e8351E3101L73440r5594d7399A66847K14024B7473J28370L3949J77695
17371C67487A12715n4272B3286J61374K98180a07646I9661J24216j5948g7004
17360A06205J13335F2943f6307A73377A263K55809k5106Q9657A51424P2693j05815
17349A18302b39173O1158B85225g8944B32802j3203a16447l32900B77025B5663
17338A08404H315K07167q1609k5497E2252c0439k06104a6938C51944E4140a97124
17326B05439r4349D5834M13468a77842A70783c87B11623c3744C2614J57599J09556
17315B99769j24152Q0587g5855D73608A05253J72966O2116E7054P9677J56158
17305B92889F3780Q9884f5868B61086R5415j50987c49215C55481b43389G4905
$$ plain form
17294 -74485 10912 255881 347710 -60054 373232 197555 131921 -187669 124248 295468
17284 295468 261561 169130 177280 -177259 44818 355658 211859 136188 319553 107315 -237680
17272 246216 105269 113518 259014 -24970 259636 83737 46209 126434 288117 316626 144428
17260 141223 304353 115121 313354 174017 197843 129980 364065 -83172 -109631 -116991 265491
17248 30642 281283 234784 246662 26293 91174 -237098 431694 289633 -259631 -226036 -64844
17236 -76340 87739 194207 -79664 189097 343087 114243 -84686 78945 143374 -63012 6679
17224 80580 -80211 156454 -100982 38653 91003 317408 314703 280175 115495 193956 348999
17213 348999 -73399 81207 169745 -76249 109960 407993 21632 328954 209738 200692 -189315
$$ packed form
17294g4485A0912K44969R1829f0054C73232j75677o5634a87669A24248J71220
17284B95468l3907r2431Q150a77259D4818L10840j43799p5671J83365A07315b37680
17272B46216A05269Q249J45496b4970B59636H3737l7528Q0225J61683K8509A44428
17260A41223J63130A15121J98233j39337K3826o7863K34085h3172k6459p360B65491
17248C0642K50641m6499J1878B6293O4881b37098D31694j42061b59631L3595f4844
17236g6340H7739J06468g9664A89097J53990A14243h4686G8945O4429f3012F679
17224H0580h0211A56454a00982C8653N2350K26405k705l4528A15495P8461J55043
17213C48999g3399H1207Q8538g6249A09960K98033B1632L07322j19216r046a89315
$$ plain form
17201 201154 271459 167687 174588 22318 -11438 286636 149263 173519 51057 -80707 520707
17189 223099 135323 416732 133101 -9838 69614 1041 217500 78036 139245 442517 113946
17177 303922 156938 121762 16503 -137881 324020 471955 20096 4326 183573 -116420
17166 243046 531426 33937 270056 148970 82692 38606 -24661 99357 33157 364930 130990
17154 67142 398883 364736 220350 -30712 626162 -22641 338202 162418 27080 2481 340722
17143 340722 732564 53519 74140 -313281 -250691 351718 178480 189095 178766 238912 141348
17132 141348 -218749 -206971 169238 155106 234376 141670 -24079 341244 317740 -63967 674197
17120 128592 320061 275379 576753 320504 357018 344226 146832 135735 399587 389250
$$ packed form
17201B01154P0305j03772O901B2318a1438B86636j37373K4256E1057h0707E20707
17189B23099q7776K81409A33101i838F9614A041K16459G8036O1209L03272A13946
17177C03922j46984l5176A6503a37881C24020J47935B0096D326J79247a16420
17166B43046K88380C3937K36119j21086o6278C8606b4661I9357C3157L31773A30990
17154F7142L31741l4147j44386c0712F26162b2641C38202A62418B7080B481L38241
17143C40722L91842E3519K0621c13281O2590C51718j73238J0615j0329O0146r7564
17132A41348b18749J1778A69238j4132P9270r2706b4079C41244k3504f3967F74197
17120A28592J91469m4682L01374k56249L6514j2792A46832j1097K63852j0337
$$ plain form
17110 389250 117189 4888 381333 130851 485346 67400 57709 545169 337599 445082
17100 445082 107046 250481 194697 559339 140285 331499 520706 298696 447631 645448
17090 645448 202139 737235 574354 338118 243785 233162 362429 345657 417553 124745
17079 199545 171758 431795 380417 30620 304871 363571 397745 546653 414132 192421
17068 427851 416763 358815 298758 599162 330128 336927 404330 690486 324572 149705 271198
17057 271198 158108 399093 699060 252828 406934 464282 90825 122142 561941 507385
17047 507385 347187 537967 630075 388171 379743 713688 528670 451277 506513 314063
17037 314063 523046 710558 519587 380476 611498 457979 713987 406037 587450 482741
$$ packed form
17110C89250A17189D888L76445A30851L54495F7400r691M87460k07570J07483
17100D45082A07046J43435n5784L64642A40285J91214J89207k22010J48935J97817
17090F45448B02139N35096j62881k36236r4333j0623J29267j6772P1896A24745
17079A99545k7787K60037n1378C0620K74251N8700L4174J48908j32521A92421
17068D27851j1088n7948o0057L00404k69034O799O7403K86156C24572A49705J21493
17057B71198j13090K40985K99967B52828J54106N7348I0825L1317M39799n4556
17047E07385j60198J90780R2108k41904q428L33945j85018p7393N5236j92450
17037C14063K08983J87512j90971j39111K31022j53519K56008l07950J81413j04709
$$ plain form
17027 482741 457264 545492 165177 852015 249452 316086 541162 452923 694018 343413
17016 281757 549069 609418 443230 323523 428959 627483 369150 600506 506831 233225
17005 760797 810875 722868 706319 761934 687676 578276 729002 784106 695749 773481 683306
16994 683306 512780 499618 934095 605356 990747 356890 408707 156717 676612 391392
16984 391392 1049109 693110 673991 771182 765105 727931 398697 512654 646263 736640 713336
16973 713336 734685 645813 425561 794138 434238 924710 687052 459078 986782 942213
16963 942213 865677 920561 805722 766890 938512 760479 908072 1029808 905822 929565
16953 929565 1048998 1099750 849030 1150681 1013189 1057473 918490 1024182 628748 1083200
$$ packed form
17027D82741k5477Q8228A65177O86838B49452O6634K25076q8239K41095C43413
17016B81757K67312O0349j66188j19707J05436J98524k58333K31356r3675B33225
17005G60797N0078q8007j6549N5615p4258j09400J50726N5104q8357P7732r0175
16994F83306j70526j3162M34477l28739L85391C56890N1817A56717N19895k85220
16984C91392O57717l55999j9119R7191o077l7174l29234J13957J33609R0377k3304
16973G13336K1349q8872k20252L68577l59900M90472k37658k27974N27704m4569
16963I42213p6536N4884j14839l8832J71622j78033J47593J21736j23986K3743
16953I29565J19433N0752k50720L01651j37492M4284j38983J05692l95434M54452
$$ plain form
16943 1083200 846735 817323 775027 886274 868807 702941 1282619 1099721 1089913 1001428
16933 1001428 1057658 991536 1322793 767607 1131704 748840 1174659 871890 1212085 1232826
16923 1232826 1122063 1133166 1197862 1201385 1176102 1120620 1346467 1236009 1177110 1314227 1269994
16912 1269994 1185747 1175219 1177802 1431780 1262393 1109743 969067 1248170 1329050 1357356
16902 1357356 1232140 1265979 1224699 1337354 1330297 1397561 1562814 1731048 1378189 1475388
16892 1475388 1670001 1563409 1381159 1523443 1525032 1768929 1722729 1530925 1666859 1835761
16882 1835761 1772624 1604411 1650414 1846495 1966923 1977092 1781089 1859956 2120200 1623450
16872 1623450 1921558 1811024 1796987 2263288 1988614 2246587 2382419 2544492 2647751 2414409
$$ packed form
16943A083200k36465k9412m2296J11247j7467j65866N79678j82898r808q8485
16933A001428N6230o6122L31257n55186L64097l82864M25819l02769L40195K0741
16923A232826j10763J1103O4696L523k5283n5482K25847j10458n8899J37117m4233
16912A269994q4247j0528K583K53978j69387j52650j40676K79103Q0880K8306
16902A357356j25216L3839m1280J12655p057O7264J65253J68234l52859R7199
16892A475388J94613j06592j82250J42284J589K43897m6200j91804J35934J68902
16882A835761o3137j68213M6003J96081J20428J0169j96003P8867K60244m96750
16872A623450K98108j10534j4037M66301k74674K57973J35832J62073J03259k33342
$$ plain form
16862 2414409 2191045 2521150 2224669 2558578 2704887 2707776 2516946 2620074 2451925 2891887
16852 2891887 2712935 2523336 2860191 2600593 2814177 2762421 2944244 2833645 3224209 3038638
16842 3038638 3009604 3590652 3237935 3150477 3494865 3460814 3256762 3286839 3759056 3651269
16832 3651269 3724125 3378058 3899951 3679122 3660537 4224141 4351645 4094356 4455008 4373799
16822 4373799 4279132 4318195 4773480 4758355 4760903 4949919 4799666 5017383 5256747 5178687
16812 5178687 5111789 5345175 5532300 5727885 5686373 6007081 6166591 6282440 6289056 6414969
16802 6414969 6467565 7029178 6795071 7285099 7322440 7332155 7743043 7634324 7955721 7927000
16792 7927000 8311365 8780696 8591836 9183913 9468568 9554852 9949573 10064138 10370634 10587944
$$ packed form
16862B414409k23364L30105k96481L33909J46309K889j90830J03128j68149M39962
16852B891887j78952j89599L36855k59598K13584n1756J81823j10599L90564j85571
16842C038638k9034N81048l52717q7458L44388l4051k04052L0077M72217j07787
16832C651269P2856l46067N21893k20829j8585N63604J27504k57289L60652q1209
16822D373799r4667L9063M55285j5125K548J89016j50253K17717K39364p8060
16812E178687o6898K33386J87125J95585m1512L20708J59510J15849O616J25913
16802F414969N2596N61613k34107M90028L7341R715M10888j08719L21397k8721
16792G927000L84365M69331j88860N92077K84655Q6284L94721J14565L06496K17310
$$ plain form
16782 10587944 11062428 11254987 11670585 12128505 12537517 12758215 13161614 13743540 13935208
16773 13935208 14629104 15108752 15511541 16133028 17172352 17028341 18005026 19032305 19386280
16764 19386280 20283403 21116863 22235935 22227101 23615136 24872045 25617769 26651748 27997376
16755 27997376 29415032 30477386 32096132 33510213 35538123 36968004 39266149 41038365
16747 41038365 42983711 45569542 48053346 50965788 54078462 56769123 60412756 63903316
16739 63903316 67677097 71834615 76512407 81515662 86889240 92586788 98691176 105069359
16731 105069359 111525883 119011354 126762204 134495993 142430329 150747850 159436355 167176408
16723 167176408 174828356 182140301 188307742 193912935 197879082 200949324 202096652 201692578
$$ packed form
16782A0587944M74484J92559M15598M57920M09012K20698M03399N81926J91668
16773A3935208O93896M79648M02789O21487J039324j44011R76685J027279L53975
16764A9386280Q97123Q33460J119072q834J388035J256909P45724J033979J345628
16755B7997376J417656J062354J618746J414081K027910J429881K298145J772216
16747D1038365J945346K585831K483804K912442L112674K690661L643633L490560
16739F3903316L773781M157518M677792N003255N373578N697548O104388O378183
16731A05069359O456524P485471P750850P733789P934336Q317521Q688505P740053
16723A67176408P651948P311945O167441N605193L966147L070242J147328m04074
$$ plain form
16715 201692578 199913180 196624476 191861103 185930931 179056842 172006567 163927559 155763723
16707 155763723 147167566 139059858 130509735 123088029 115821953 108916988 101765378 95233669
16699 95233669 89647110 84256084 79026933 74127365 70110691 65936355 62129564 58555068
16691 58555068 55305036 51909212 49101702 46551102 44246783 41990303 39726526 37762962
16683 37762962 35954184 34378930 32733470 30903476 29774480 28367869 27305751 26308225
16675 26308225 24849085 23858008 22716211 22018169 20992659 20167272 19505324 18749986 17889743
16666 17889743 17233133 17071799 16129368 15565956 15115646 14555480 13966629 13822848 12992019
16657 12992019 12968127 12507188 11885123 11739192 11339001 11046577 10515979 9849230 9623534
$$ packed form
16715B01692578j779398l288704m763373n930172o874089p050275q079008q163836
16707A55763723q596157q107708q550123p421706p266076o904965p151610o531709
16699I5233669n586559n391026n229151m899568m016674m174336l806791l574496
16691E8555068l250032l395824k807510k550600k304319k256480k263777j963564
16683C7762962j808778j575254j645460j829994j128996j406611j062118r97526
16675B6308225j459140r91077j141797o98042j025510q25387o61948p55338q60243
16666A7889743o56610j61334r42431n63412m50310n60166n88851j43781q30829
16657A2992019k3892m60939o22065j45931m00191k92424n30598o66749k25696
$$ plain form
16648 9623534 9897938 9317279 9177207 9112494 8722421 8154780 8303455 7892369 7873818 7581527
16638 7581527 7545703 7396296 7121712 7040078 6732328 6627669 6347442 5866270 6339503 6027425
16628 6027425 5665850 5669026 5631923 5588680 5277226 5416416 4880598 4905464 4820866 4805596 4352106
16617 4352106 4765671 4246962 4359486 4169037 4175126 4142266 4086780 3919998 3665350 4187317
16607 4187317 3428811 3365516 3597985 3547698 3502290 3503034 3453659 3211926 2825231 3115843 3015332
16596 3015332 3086747 3093543 2729502 2890707 2896030 2565633 2809350 2674889 2514227 2232208
16586 2232208 2611805 2595222 2507020 2226907 2710101 2365751 2330060 2627792 2423417 2128920
16576 2128920 2085419 2199702 2165742 2128423 2013603 1993935 2343426 1701509 2455042 1747530
$$ packed form
16648I623534K74404n80659j40072o4713l90073n67641J48675m11086j8551k92291
16638G581527l5824j49407k74584q1634l07750j04659k80227m81172M73233l12078
16628F027425l61575L176l7103m3243l11454J39190n35818K4866q4598j5270m53490
16617D352106M13565n18709J12524j90449O089l2860n5486j66782k54648N21967
16607D187317p58506o3295K32469n0287m5408P44m9375k41733l86695K90612j00511
16596C015332P1415O796l64041J61205N323l30397K43717j34461j60662k82019
16586B232208L79597j6583q8202k80113M83194l44350l5691K97732k04375k94497
16576B128920m3501J14283l3960l7319j14820j9668L49491o41917P53533p07512
$$ plain form
16566 1747530 2031460 1928071 1952410 1795604 1831445 1874373 1833514 1545156 1958151 1447375
16556 1447375 1573862 1488033 1577675 1751467 1516786 1529051 1527294 1539191 1141429 1406095
16546 1406095 1384703 1284837 1131466 1420118 1038596 1434941 1271807 1516830 1120194 1112796
16536 1112796 1417619 1124981 1067422 1326424 1517662 1456475 980921 1393128 941630 1286289
16526 1286289 1109282 1193779 1436211 1277310 1388460 1127773 1143621 1508834 701004 892181
16516 892181 757456 1160847 709068 898560 1100574 760432 1074878 1089279 1223967 959226
16506 959226 975636 989218 713224 753082 1029255 1031409 818654 644488 821623 866623 966842
16495 966842 558855 628356 668248 862800 358626 1024320 1031736 836299 871172 450707
$$ packed form
16566A747530K83930j03389K4339j56806L5841M2928m0859k88358M12995n10776
16556A447375J26487q5829Q9642J73792k34681J2265j757J1897l97762K64666
16546A406095k1392r9866j53371K88652l81522L96345j63134K45023l96636p398
16536A112796L04823k92638n7559K59002J91238o1187m75554M12207m51498L44659
16526A286289j77007Q4497K42432j58901J11150k60687J5848L65213G01004J91177
16516H92181j34725M03391m51779J89492K02014l40142L14446J4401J34688k64741
16506I59226J6410J3582k75994L9858K76173K154k12755j74166J77135M5000J00219
16495I66842m07987O9501L9892J94552C58626O65694P416j95437L4873m20465
$$ plain form
16485 450707 525322 1013549 957153 391645 573704 534148 449453 642198 1102015 804547
16475 804547 594199 743114 860288 881249 676470 836435 1008020 632658 480878 663690
16465 663690 505142 796577 880329 912040 746996 207296 593103 568139 692312 366866
16455 366866 920403 565909 465722 781705 765909 795748 657266 617666 704026 509448
16445 509448 669978 680290 664875 440948 804135 406802 350091 640420 554766 533157
16435 533157 525389 421518 473057 328381 707690 457027 335880 464130 734319 394817
16425 394817 383301 498235 459433 686932 480971 364682 461475 357913 345501 308375
16415 308375 455166 520924 337223 488015 519201 639782 442657 481077 202334 492718
$$ packed form
16485D50707P4615M88227n6396C91645J82059l9556q4695J92745M59817k97468
16475H04547k10348J48915J17174K0961k04779J59965J71585l75362j51780J82812
16465F63690j58548K91435Q3752L1711j65044B07296L85807k4964J24173l25446
16455C66866N53537l54494j00187L15983j5796K9839j38482l9600Q6360j94578
16445E09448J60530J0312j5415k23927L63187l97333n6711K90329q5654k1609
16435E33157p768j03871N1539j44676L79309k50663j21147J28250K70189l39502
16425C94817j1516J14934l8802K27499k05961j16289R6793j03562j2412l7126
16415C08375J46791O5758j83701J50792L1186J20581j97125L8420B02334K90384
$$ plain form
16405 492718 328806 856301 195971 625001 509475 358916 465330 430392 570946 213115
16394 605847 590657 483860 93020 548357 620863 268052 311010 606800 370166 159808
16383 271811 304030 369909 446424 482682 -108367 443828 292687 521018 415123 218994
16373 218994 591101 362057 282333 573998 219037 515380 573518 191144 335416 535890
16363 535890 -36327 389493 -1353 128018 398686 95443 -25590 231060 183594 608495 498450
16352 498450 245863 383911 156283 495138 465581 483690 150084 132043 426098 407053
16342 407053 229762 181039 88762 475782 513683 456955 207880 507333 212587 174581
16332 174581 81430 344314 386311 291400 129908 424781 269301 244480 -85742 273929
$$ packed form
16405D92718j63912N27495A95971M29030j15526j50559J06414l4938J40554B13115
16394F05847j5190j06797I3020M55337P2506B68052M2958K95790k36634A59808
16383B71811L2219O5879P6515L6258a08367D43828j51141K28331j05895j96129
16373B18994L72107k29044p9724K91665B19037K96343N8138A91144J44272K00474
16363E35890c6327C89493a353A28018K70668I5443b5590B31060m7466M24901j10045
16352D98450B45863J38048A56283L38855k9557J8109A50084j8041K94055j9045
16342D07053j77291m8723H8762L87020L7901n6728B07880K99453B12587l8006
16332A74581H1430K62884M1997r4911A29908K94873j55480k4821h5742B73929
$$ plain form
16321 450761 113079 271700 327221 131846 405170 636538 318768 86319 267121 230096
16311 230096 150744 141818 272108 -64170 115771 -41119 195547 624950 203946 229741 39083
16299 528013 397597 -17672 237703 303014 -130504 249870 340855 71686 213492 301453
16289 301453 258715 381743 205992 78983 -45377 488873 148459 343183 157337 354889
16279 354889 -112438 272631 163821 531507 106512 -20341 -55940 238882 423354 127672
16268 418838 423354 292248 376013 81991 239415 34533 -66490 314686 86441 -73515 142254
16256 170197 -258294 56000 300922 95881 -45225 336602 316313 -104991 48491 310251
16246 310251 169130 405449 220214 310978 118677 135528 204223 167980 -54701 -115928 202159
$$ packed form
16321D50761A13079J58621N5521A31846K73324K31368l17770H6319J80802l7025
16311B30096p9352q926J30290f4170A15771d1119A95547M29403B03946K5795C9083
16299E28013j30416a7672B37703O5311a30504B49870R0985G1686J41806Q7961
16289C01453m2738J23028j75751G8983d5377D88873A48459J94724A57337J97552
16279C54889a12438B72631j08810L67686A06512b0341l5599B38882J84472A27672
16268D18838M516j31106Q3765H1991J57424C4533f6490C14686H6441g3515A42254
16256A70197b58294E6000K44922I5881d5225C36602k0289a04991D8491K61760
16246C10251j41121K36319j85235R0764A18677J6851O8695l6243e4701o1227B02159
$$ plain form
16234 -99940 116592 67304 186498 118321 40014 122994 119213 360650 3296 -112584 386492
16222 167711 282236 212716 104140 -17343 -75903 225388 303585 151490 404258 165702
16211 -171351 308187 63514 -58550 17532 280365 169147 219805 317832 120141 284929
16201 284929 183166 275772 148925 274247 112557 36010 128371 161972 248159 -36420 92183
16189 -301880 -4227 52194 -27474 367482 -45528 192528 -100933 -31982 304866 285443 208381
16178 208381 292955 133486 248551 -78520 251957 -97462 50942 500513 -126046 7458 193340
16167 193340 -639 -313832 74063 -82849 409291 204992 -140241 59021 -240602 82699 93086
16156 93086 202595 65242 150693 -69673 -220516 72589 -97686 -65316 106667 293660 80859
$$ packed form
16234i9940A16592m9288J19194o8177D0014Q2980l781K41437C296a12584C86492
16222A67711J14525o9520A04140a7343n8560B25388P8197A51490K52768A65702
16211a71351C08187F3514e8550A7532K62833j11218N0658R8027A20141J64788
16201B84929j01763R2606j26847J25322A12557C6010R2361L3601Q6187c6420I2183
16189c01880d227E2194b7474C67482d5528A92528a00933c1982C04866j9423p7062
16178B08381Q4574A33486J15065g8520B51957i7462E0942M49571a26046G458J85882
16167A93340f39l13193G4063h2849D09291k04299a40241E9021b40602H2699J0387
16156I3086J09509F5242Q5451f9673j50843G2589i7686L2370A06667J86993H0859
$$ plain form
16144 311168 130063 -42364 -100926 336162 89462 -52464 248463 -30484 60914 112448 117661
16133 117661 159313 -64576 216124 -51831 310824 21294 -33492 -28078 -202909 23560 -232276
16121 -16029 405768 71282 -31764 32744 -682 173391 159375 211822 -1331 30642 -1939 112444
16108 -112581 -194283 -139379 13925 361100 17117 218721 109685 308037 255708 -248129
16097 321467 95939 297846 229164 -60670 -117617 -26421 -318860 -133443 -144685 -75486 246730
16085 166023 292203 -82543 172385 214679 102530 -55510 174998 42515 -30038 79953 -164889
16073 16760 179920 248381 21657 213029 145710 -54000 -62537 13474 309858 -224879 119589
16061 -308455 69005 44007 -84077 -130744 156917 -209040 -154866 -53446 299066 314456 -103639
$$ packed form
16144C11168A30063d2364n8562C36162H9462e2464B48463c0484F0914N1534N213
16133A17661M1652f4576B16124e1831C10824B1294c3492N414j74831B3560b32276
16121a6029D05768G1282c1764C2744f82A73391j4016N2447a331C0642a939A12444
16108a12581q1702N4904A3925L47175A7117K01604j09036J98352n2329b48129
16097C21467I5939K01907o8682f0670n6947b6421k92439a33443j1242O9199B46730
16085A66023J26180h2543A72385M2294A02530e5510A74998D2515c0038G9953a64889
16073A6760J63160O8461B1657J91372o7319e4000q537A3474K96384b24879A19589
16061c08455F9005k4998h4077m6667A56917b09040N4174e3446B99066J5390a03639
$$ plain form
16049 457491 -137994 -46960 -23942 -80063 206588 -28693 -121273 -29059 -50858 -212620 -131837
16038 -131837 -298384 -63436 -103177 158039 100221 191378 46102 279515 -89813 -108845 259733
16026 -41435 165346 -60529 -56512 190966 127839 -19271 -100870 -371746 241445 233512 77686
16014 -275383 -159708 27620 -220838 -112986 84646 -1027 -96313 -29697 105908 -74973 -132498
16003 -132498 -351513 190210 -241821 -142833 174018 -20695 -311835 -79643 -92143 291874
15992 181943 -90398 -140276 -292831 342975 -47247 -56532 -8680 -64907 -63084 194817 285593
15981 285593 470104 333517 10767 -34087 231774 -89826 -158998 -149351 -278606 84056 -54921
15969 -168254 -429487 -262982 173140 -47330 87266 216720 -50756 237680 -171624 -40331
$$ packed form
16049D57491a37994d6960K3018n6121B06588b8693r2580b9059k1799j61762Q0783
16038a31837j66547f3436l9741A58039n7818R1157D6102K33413h9813j9032B59733
16026d1435A65346f0529M017A90966o3127a9271q1599k70876B41445p933G7686
16014b75383J15675B7620b20838J07852H4646a027r5286b9697A05908g4973n7525
16003a32498k19015A90210b41821R8988A74018b0695k91140g9643j2500B91874
15992A81943i0398m9878j52555C42975d7247r285h680n6227J823A94817R0776
15981B85593J84511j36587A0767c4087B31774h9826o9172R647j29255H4056e4921
15969a68254k61233J66505A73140d7330H7266J29454e0756B37680a71624d0331
$$ plain form
15958 -105012 -257538 -244699 -117208 -415634 23743 -329158 184884 184541 -19841 106576 -152772
15946 -96006 264107 -225676 -46128 330086 -12953 -119502 -297026 -184177 25222 -107383
15935 -801 -34605 -13912 116646 -69656 -323013 -422626 194773 -175670 183611 -164767 -69523
15923 149290 -217084 182622 -38799 83608 -314282 -254474 -204597 -219357 119503 -461087
15912 -265902 -156664 -112973 163266 -366221 -47911 -118636 139992 284689 133207 -219410
15901 -62151 -180120 376342 405807 -92123 -215802 41216 -102571 533145 -57470 -197578
15891 -197578 226181 -369946 -189490 -28491 171703 -240995 91161 -22938 -359559 38869
15880 58534 20392 -128563 251998 -190275 65499 94659 -4905 209297 255633 176722 147059
$$ packed form
15958a05012j52526J2839a17208k98426B3743c29158A84884l43a9841A06576a52772
15946i6006B64107b25676d6128C30086a2953j06549j77524J12849B5222a07383
15935h01l3804a3912A16646f9656k53357r9613A94773a75670A83611a64767f9523
15923A49290b17084A82622c8799H3608c14282N9808M9877j4760A19503d61087
15912b65902J09238M3691A63266c66221d7911p0725A39992J44697A33207b19410
15901f2151j17969C76342K9465i2123j23679D1216a02571E33145e7470j40108
15891a97578B26181c69946J80456b8491A71703b40995I1161b2938l36621C8869
15880E8534B0392a28563B51998a90275F5499K9160d905B09297M6336p8911k9663
$$ plain form
15869 147059 -138968 -342303 190717 -117200 -29066 99569 -405199 -35952 321853 -179772
15858 145121 41371 -289647 -102032 -104854 110693 277294 -186074 -29333 -154140 -83081
15848 -83081 -253637 -68715 12272 62064 -94624 -192197 -146671 -91605 -97083 -192965 96663 -36510
15835 -113477 -92169 224213 -240267 95027 132504 -298389 -118112 -75898 -31275 -24256 -162380
15824 -162380 -298130 -384344 337308 67510 -157538 -181413 9525 56147 -206944 28920 -10124
15812 61885 34456 -133764 127213 -79242 209725 192395 -144834 -50625 -5383 87483 -21430
15800 407322 34757 -282660 40665 -1230 441528 56819 -291662 152742 23067 -119189 368762
15788 56900 163726 -286146 78590 -69206 -233721 -158378 269197 121807 -233251 131296
$$ packed form
15869A47059a38968k03335A90717a17200b9066I9569d05199c5952C21853a79772
15858A45121D1371b89647a02032k822A10693J66601a86074b9333j24807P1059
15848h3081j70556f8715A2272M9792i4624r7573M5526N5066n478r5882I6663c6510
15835a13477K1308B24213b40267I5027L7477b98389a18112M2214c1275P019j38124
15824a62380j35750q6214C37308F7510a57538k3875I525M6622b06944B8920a0124
15812F1885k7429a33764A27213g9242B09725j7330a44834e0625e383H7483b1430
15800D07322C4757b82660D0665a230D41528E6819b91662A52742B3067a19189C68762
15788E6900J06826b86146G8590f9206j64515P5343B69197A21807b33251A31296
$$ plain form
15777 80258 -255320 97553 136055 -307190 -7052 222564 -30517 -186974 -95917 62231 -211418
15765 -21875 -150504 200737 -75787 163931 -16423 -91202 133119 -51900 -101989 280594 -72387
15753 -149339 78303 -180364 19553 105524 35181 -113617 -84946 27551 -238699 -150225 -73441
15741 -29543 -30496 61750 -141970 -333973 12393 58267 -95355 100156 19444 -453374 -216731
15729 -478969 -420479 139247 -140050 -170498 -110209 181176 -236671 -260938 -50805 -147622 -176743
15718 -176743 13472 145040 228600 142151 163460 -50613 -147095 -90067 31755 48196 -56861
15706 -7879 9592 -88237 -299860 -134439 -63245 -239680 -79501 418236 -75467 -36555 13076
15694 -376845 282011 -146701 133691 -95246 55762 -106455 -78897 -92386 -185258 173805
$$ packed form
15777H0258b55320I7553L8502c07190g052B22564c0517j56457R1057F2231b11418
15765b1875j28629B00737g5787A63931a6423p4779A33119e1900n0089B80594g2387
15753a49339G8303a80364A9553Q5971C5181a13617K8671B7551b38699Q8474g3441
15741b9543r53F1750a41970j92003A2393M5874i5355A00156A9444d53374b16731
15729d78969N8490A39247a40050l0448O0289A81176b36671k4267e0805r6817k9121
15718a76743A3472J31568Q3560q6449K1309e0613r6482N7028C1755J6441e6861
15706g879I592h8237k11623a34439f3245j76435g9501D18236g5467c6555A3076
15694c76845B82011a46701A33691i5246E5762a06455K7558j3489r2872A73805
$$ plain form
15683 -218798 122269 187948 -129381 12605 22165 12 80091 145622 111761 -17786 -77504 106809
15670 -32758 52350 188236 30240 -327060 -18752 241640 457295 -102533 -243586 -112335
15659 264805 -91040 -39405 -363631 149367 13665 282678 -238431 -146057 -162851 -12061 -312132
15648 -312132 130858 -107635 -45469 -157408 8442 273423 -147692 133284 -302504 -235793
15638 -235793 -386541 -12170 238666 330305 14128 128702 99259 266226 2214 -213674 -184766
15627 -184766 -104589 -105499 34860 53050 -262634 -288287 -87435 40924 5475 134516 101397 -117777
15614 34706 132459 -196233 49499 43599 -368341 -167087 -169837 -292912 -40879 -278014 -10930
15602 -349361 -33086 306953 453344 -5078 131658 80476 -6183 6178 64179 -85423 -343334
$$ packed form
15683b18798A22269O5679a29381A2605R560A2Q0079O5531l3861a7786n9718A06809
15670c2758E2350J35886C0240c27060a8752B41640K15655a02533j41053a12335
15659B64805i1040c9405l24226A49367A3665K69013b38431R2374j6794a2061l00071
15648c12132A30858a07635d5469j11939H442K64981a47692A33284c02504O6711
15638b35793j50748a2170B38666R1639A4128J14574k9443J66967B214b13674K8908
15627a84766Q0177r10C4860J8190b62634k5653h7435D0924E475J29041l3119a17777
15614C4706R7753a96233D9499n900c68341a67087k750j23075d0879k37135a0930
15602c49361c3086C06953J46391e078A31658n1182f183F178N8001h5423k57911
$$ plain form
15591 -343334 -259275 -243534 -51082 105371 -191530 81200 102905 319049 -88152 -3860 344089
15579 166385 14249 -190074 31240 -184169 -70803 23386 -284990 115860 -54385 -186726
15569 -186726 244938 -167973 145401 -71162 -144591 17732 -233304 122122 403506 105023
15558 203085 15058 -212711 -87658 475339 -228601 -372168 -131919 -388578 -116870 -91383
15548 -91383 28889 129824 50257 31114 -322387 57626 -141682 -305333 252811 68676 -136811
15536 -277850 405939 -210139 -59447 158376 -104870 -492802 266345 -465817 348461 -57707
15525 3800 70139 -128914 172911 2349 -437134 196846 -178529 5876 -104328 -183180 -215861
15514 -215861 182462 -23421 -121765 74736 -23900 -382024 262784 96207 -147185 -227816 -142613
$$ packed form
15591c43334Q4059J5741e1082A05371a91530H1200K1705K16144h8152c860C44089
15579A66385A4249a90074C1240a84169g0803B3386b84990A15860e4385j32341
15569a86726B44938a67973A45401g1162p3429A7732b33304A22122K81384A05023
15558B03085A5058b12711h7658D75339b28601j43567a31919k56659a16870K5487
15548i1383B8889J00935E0257j9143c22387E7626a41682j63651B52811F8676a36811
15536b77850D05939b10139e9447A58376a04870l87932B66345d65817C48461e7707
15525C800O6339a28914A72911B349d37134A96846a78529E876a04328p8852l2681
15514b15861A82462b3421r8344G4736b3900l58124B62784I6207a47185q0631Q5203
$$ plain form
15503 -142613 -65158 -270872 -227776 -138372 -37814 -67325 -93443 468255 -99858 -13972 -229694
15492 -229694 206237 282259 -99913 -126858 178348 -91942 64990 -358440 -238683 -102807
15481 -289287 164502 10839 -9450 -150247 285407 -99985 56445 -99080 -155681 26043 258940
15470 258940 43391 -16789 443281 353921 -110944 304284 27857 -400516 -81622 83030 -134942
15458 -35849 146647 -72399 290941 -387072 134382 128626 -189050 166712 -42633 -352184
15448 -352184 -189066 287151 -80209 104095 -276524 -111009 183303 324558 183063 -104939
15437 -35142 -332580 172737 -196583 48210 -176109 -8481 -199166 -40100 308745 323782 253209
15426 253209 156024 110795 135059 229935 -304016 -163076 11495 180524 124918 170481 -176652
$$ packed form
15503a42613f5158k05714M3096Q9404c7814k9511k6118D68255i9858a3972k15722
15492b29694B06237P6022i9913k6945A78348i1942F4990c58440J19757a02807
15481b89287A64502A0839i450j40797B85407i9985E6445i9080n6601B6043K32897
15470B58940D3391a6789D43281q9360a10944C04284B7857d00516h1622H3030a34942
15458c5849A46647g2399B90941c87072A34382n756a89050A66712d2633l09551
15448c52184J63118B87151h0209A04095b76524a11009A83303J41255j41495a04939
15437c5142k97438A72737a96583D8210a76109h481j90685d0100C08745J5037p0573
15426B53209r7185m5229K4264R4876c04016J40940A1495J69029n5606M5563a76652
$$ plain form
15414 100375 132073 -38893 158422 -77930 313523 80465 -38220 -145529 146963 -64475 -28170
15402 -67103 196290 -20985 -83751 -49510 -51163 -66184 212088 5411 -72065 -1418 136075 100941
15390 100941 170185 209348 383062 84944 -166981 -44653 -53738 217334 -42739 161362 150078
15379 150078 -131257 -139208 72035 85191 42889 -261466 139454 -27237 -135213 -106320 -315849
15368 -315849 47455 120927 200494 -55464 -265013 110769 -101008 -456808 88897 193822
15358 193822 -102374 34512 -46913 -89242 25586 -205148 -262905 393790 157570 -199353
15347 -126864 -54765 22883 -46516 121526 -33713 -76760 -64729 39370 397097 14634 -88327
15335 -325196 60794 154804 -18079 -312116 325744 30228 79338 -21340 69151 -100075 115715
$$ packed form
15414A00375L1698c8893A58422g7930C13523H0465c8220j07309A46963f4475b8170
15402f7103A96290b0985o2766L4241j653j5021B12088E411g2065a418A36075l5134
15390A00941O9244L9163J73714H4944a66981d4653r085B17334d2739A61362j1284
15379A50078a31257p951G2035J3156m2302b61466A39454b7237j07976K8893k09529
15368c15849D7455P3472P9567e5464k09549A10769a01008l55800H8897J04925
15358A93822a02374C4512d6913m2329B5586b05148n7757C93790A57570a99353
15347a26864e4765B2883d6516A21526c3713m3047J2031C9370L57727A4634h8327
15335c25196F0794R4010a8079k94037C25744C0228M9110b1340F9151a00075A15715
$$ plain form
15323 21356 39499 -101642 -84348 -4167 -1727 345333 181167 -217400 117951 213804 88108
15311 31838 202218 434523 184391 12287 -188769 260708 58901 -216149 90046 293640
15301 293640 329430 -217933 -92298 90943 -247769 459838 93553 92361 -196447 78662 20897
15289 97434 335301 151426 -32594 381730 105327 344830 -99530 -388974 326184 -173425
15278 -25952 50767 421251 -109636 331782 177533 284881 -69778 -190124 78675 -338465
15267 187688 129063 -142007 387 -242920 87807 11477 203060 112032 -75123 -215696 47117
15255 5040 -128179 -31383 290366 194749 331123 266798 450438 -68067 -133458 -28937 188537
15243 -245228 -115793 181250 122472 -25281 -143959 45634 263597 -104154 317981 -179112
$$ packed form
15323B1356J8143a01642J7294d167a727C45333j64166b17400A17951R5853H8108
15311C1838J70380K32305A84391A2287a88769B60708E8901b16149I0046K03594
15301B93640L5790b17933i2298I0943b47769D59838I3553j192a96447G8662B0897
15289I7434K37867A51426c2594C81730A05327K39503i9530k89444C26184a73425
15278b5952E0767L70484a09636C31782j54249J07348f9778j20346G8675c38465
15267A87688n8625a42007C87b42920H7807A1477J91583r1028g5123j40573D7117
15255E040a28179c1383B90366r5617J36374o4325J83640f8067o5391b8937A88537
15243b45228a15793A81250n8778b5281j18678D5634K17963a04154C17981a79112
$$ plain form
15232 -31918 -316035 -74960 -168381 712 228882 -50154 -156593 104666 291467 50398 233085
15221 233085 274005 -346235 -265915 68708 -10696 -127605 -69815 33703 -202351 279321 144269
15210 144269 -73489 96818 -38174 185239 -128998 -122483 204285 34578 -71613 245190 -164323
15198 318081 9488 320420 152160 -93927 491699 223964 76923 -56978 139136 -246859
15187 23282 -223428 321535 -71835 6169 120369 225966 163361 43398 149217 -47407 112125
15175 -76668 46804 34872 -128165 289870 221678 -381256 613067 -262129 58547 -56435 107091
15163 -116945 141725 26305 -259113 -99719 240477 -190247 149352 -133520 -30222 90106
15152 391633 86007 248551 10343 257317 -62058 50626 66363 -78604 208848 161297 134907
$$ packed form
15232c1918k84117g4960r3421G12K28170e0154j06439A04666J86801E0398J82687
15221B33085M0920c46235Q0320F8708a0696j16909N7790C3703b02351B79321j35052
15210A44269g3489I6818c8174A85239a28998O515B04285C4578g1613B45190a64323
15198C18081I488L10932A52160i3927D91699B23964G6923e6978A39136b46859
15187B3282b23428C21535g1835F169J14200J05597o2605D3398J05819d7407A12125
15175g6668D6804j1932a28165B89870o8192c81256F13067b62129E8547e6435A07091
15163a16945A41725B6305b59113i9719B40477a90247A49352a33520c0222I0106
15152C91633H6007J62544A0343K46974f2058E0626J5737g8604B08848m7551k6390
$$ plain form
15141 134907 253814 -60979 55942 182803 57820 -364165 -273134 139467 54650 -763 525850
15129 92813 -321501 -165786 14021 -12504 -75091 150022 167023 -15294 66199 280372 159222
15118 159222 229056 -90467 117291 368745 138089 50712 171974 384307 198962 -35127
15107 -81084 -97887 276768 28286 106115 -235928 -124225 -100304 243772 44623 110631 -38895
15095 -200222 254676 216381 100290 -14961 -177620 51045 64724 69634 254968 155729 -10661
15083 316116 -181824 -219089 105854 207093 -123644 409430 177969 494258 33505 4278
15072 244168 91886 -124961 435481 328695 100499 -333891 15406 198132 76362 -213476
15061 -131876 99071 309444 159326 22012 77807 465347 88388 165541 237527 285376 -28494
$$ packed form
15141A34907J18907f0979E5942J26861E7820c64165R1031A39467E4650g63E25850
15129I2813c21501J55715A4021a2504o2587A50022J7001a5294F6199K14173j21150
15118A59222O9834i0467A17291K51454A38089E0712J21262K12333j85345c5127
15107h1084j6803B76768B8286P7829b35928J11703K3921B43772D4623O6008c8895
15095b00222B54676l8295A00290a4961j62659E1045J3679M910J85334r9239a0661
15083C16116a81824l7265A05854J01239a23644D09430A77969L16289C3505D278
15072B44168I1886a24961D35481j06786A00499c33891A5406J82726G6362b13476
15061a31876I9071K10373j50118B2012N5795L87540H8388P7153P1986M7849b8494
$$ plain form
15049 -43227 -48296 241633 332950 225827 -18274 -344994 339419 305264 -234327 -213281 621708
15037 63415 252910 156462 444478 229837 44573 -127150 19363 173056 172995 222526 85900
15025 63842 13511 44215 214826 76210 489467 381202 156527 81966 94831 189033 -68450
15013 124296 465701 377608 190667 218686 -1712 520305 -212073 140361 402309 -27244
15002 241825 96506 145145 -77879 327692 142496 14587 1844 59744 256755 220777 -142439
14990 292553 508025 153894 198031 59735 247949 123352 157125 65134 241199 288326
14980 288326 -134253 153138 -48892 81438 383318 193353 323508 199678 187274 469243
14970 469243 285427 285900 454984 277406 -94096 410389 102036 108049 161595 517568 383612
$$ packed form
15049d3227n069B41633R1317j07123a8274l26720C39419l4155b34327K1046F21708
15037F3415J89495r6448K88016k14641D4573a27150A9363J53693o1M9531H5900
15025F3842A3511L0704J70611G6210M13257j08265A56527p4561J2865R4202f8450
15013A24296L41405q8093j86941K8019a712E20305b12073A40361K61948b7244
15002B41825I6506M8639g7879C27692A42496A4587A844N7900J97011l5978a42439
14990B92553K15472A53894M4137E9735J88214A23352L3773F5134J76065M7127
14980B88326a34253A53138d8892H1438L01880j89965J30155j23830j2404K81969
14970D69243j83816M73J69084j77578i4096D10389A02036O013N3546L55973j33956
$$ plain form
14959 383612 288370 304435 -174415 391681 -198245 412249 126206 237952 350960 254762
14949 254762 121586 60262 296334 -13150 -44328 379542 301854 163352 -15189 159698
14938 40974 141329 254497 -17909 121317 411181 105680 -55622 254000 116295 402762
14928 402762 167214 257823 -94070 129050 539039 477828 295580 180279 107841 291027
14918 291027 257224 269296 502252 300638 318111 451538 9671 261683 629774 462896
14908 462896 397639 -63795 190636 224279 325003 326060 249959 522432 95152 43655 172394
14897 172394 218193 284656 109841 486842 -18825 304200 229987 219539 186215 518006 338468
14886 338468 277624 256309 494166 459529 669609 319674 392262 398971 449921 277190 399089
$$ packed form
14959C83612r5242J6065a74415C91681a98245D12249A26206J11746J13008r6198
14949B54762A21586F0262K36072a3150l1178C79542p7688j38502a5189A59698
14938D0974J00355J13168a7909A21317K89864A05680e5622B54000A16295K86467
14928D02762A67214R0609i4070A29050M09989o1211j82248j15301p2438J83186
14918B91027l3803J2072K32956k01614J7473J33427I671K52012L68091j66878
14908D62896o5257f3795A90636L3643J00724J057p6101K72473I5152D3655J28739
14897A72394M5799O6463A09841L77001a8825C04200p4213j0448l3324L31791j79538
14886C38468o0844k1315K37857l4637K10080C19674P2588O709N0950j72731J21899
$$ plain form
14875 399089 24010 393302 615462 456904 406437 390505 418457 -107654 200139 516606
14865 516606 281128 581690 25253 298493 346795 70026 519876 413513 359531 307929
14855 307929 434260 240541 -181102 528920 -26841 355362 661635 451171 490827 475055
14845 475055 196442 647095 92982 323601 496238 14494 154882 416896 304203 456344
14835 456344 445362 460411 463759 106939 470180 404104 466653 348851 486564 594972 274498
14823 430694 755240 476949 288835 185407 279497 308209 332708 577201 491345 540006
14813 540006 500247 553066 774992 420683 473523 349708 311217 596537 413869 250465
14803 250465 433191 522843 93271 142524 583005 524635 755348 429875 229120 525727
$$ packed form
14875C99089B4010L69292K22160j58558n0467j5932K7952a07654B00139L16467
14865E16606k35478L00562B5253K73240M8302G0026M49850j06363n3982n1602
14855C07929J26331j93719a81102E28920b6841C55362L06273k10464L9656j5772
14845D75055A96442M50653I2982K30619J72637A4494J40388K62014j12693J52141
14835D56344j0982J5049L348A06939L63241o6076O2549j17802J37713J08408B74498
14823D30694L24546k78291j88114j03428R4090K8712K4499K44493q5856M8661
14813E40006l9759N2819K21926l54309N2840j23815l8491K85320j82668j63404
14803B50465J82726Q9652I3271M9253M40481n8370K30713l25473k00755K96607
$$ plain form
14793 525727 732741 393942 289365 464997 552706 593209 370330 633133 450375 852898
14783 852898 692086 449705 628775 349009 569237 669971 335975 308131 495489 296012
14773 296012 1020070 495762 761616 401902 926409 167279 555106 586485 531429 388880
14763 388880 453246 785339 413458 604983 448023 399613 562722 679686 1039705 160815
14752 343368 241265 562252 730029 692031 938899 750042 601390 793647 589071 720614
14742 720614 654774 512665 598613 577629 792792 814476 758322 937853 660029 795561
14732 795561 602276 766050 577347 663807 451433 565060 793077 514350 603339 477999
14722 477999 804324 457925 744228 495899 697375 603150 918041 1060201 1013653 634317
$$ packed form
14793E25727K07014l38799j04577J75632Q7709M0503k22879K62803j82758M02523
14783H52898j60812k42381J79070k79766K20228J00734l33996k7844J87358j99477
14773B96012P24058D95762K65854l59714N24507A67279L87827L1379n5056j42549
14763C88880O4366L32093l71881J91525j56960m8410J63109J16964L60019A60815
14752C43368j02103L20987J67777l7998K46868j88857j48652J92257k04576J31543
14742G20614o5840j42109Q5948k0984K15163K1684n6154J79531k77824J35532
14732G95561j93285J63774j88703Q6460k12374J13627K28017k78727Q8989j25340
14722D77999L26325l46399K86303k48329K01476r4225L14891J42160m6548l79336
$$ plain form
14712 634317 1105447 666664 477475 951456 366140 458392 864166 877904 781932 765286
14702 765286 671580 971286 707060 1101143 584243 843467 964132 903964 821503 872082
14692 872082 822991 755794 1066454 1013912 901977 900832 891634 604993 588924 837856 894028
14681 894028 1121139 721351 800322 1103193 637378 751058 916046 1036708 721145 1108071
14671 1108071 1250438 705256 1000409 949800 1006966 553989 995873 1037154 692039 883493
14661 883493 957869 910133 1196678 796886 1331873 1034788 918501 943079 951893 965574 753252
14650 753252 1416424 854565 1082866 1076578 1111070 1195541 875457 958647 914592 1026029 1392319
14639 1392319 1075868 1272973 1246961 1209667 792794 1139089 1398997 1069149 1304966 1367925
$$ packed form
14712F34317M71130m38783j89189M73981C66140R2252M05774J3738r5972j6646
14702G65286r3706K99706k64226L94083n16900K59224J20665o0168q2461N0579
14692H72082m9091o7197L10660n2542j11935j145r198k86641j6069K48932N6172
14681H94028K27111l99788P8971L02871m65815J13680J64988J20662l15563L86926
14671A108071J42367n45182K95153n0609N7166m52977M41884M1281l45115J91454
14661H83493P4376m7736K86545l99792N34987k97085j16287K4578Q814J3681k12322
14650G53252O63172n61859K28301o288L4492Q4471l20084Q3190m4055J11437L66290
14639A392319l16451J97105k6012l7294m16873L46295K59908l29848K35817O2959
$$ plain form
14629 1367925 1031360 1343879 1302966 1043599 1215396 1066188 1074788 1474381 1113782 1029045
14619 1029045 924533 1087720 1041564 1361743 1294652 1034612 1292051 1286864 1500026 1551235
14609 1551235 1615261 1457168 1463613 1485327 1520451 1262973 1510966 1289736 1507689 1655570
14599 1655570 1291563 1609057 1449778 1677515 1359059 1292647 1188028 1716784 2030410 1633561
14589 1633561 1847874 1458095 1681624 1802068 1581434 1619902 1888124 1906879 1777769 1601312
14579 1601312 2216565 1815879 2057628 1571937 1679676 1689725 2346100 1736238 1828618 2106188
14569 2106188 1789455 1961460 2177752 2312484 2286474 2468260 2223118 2113493 2512990 2699539
14559 2699539 2818651 2585163 2642555 2829766 3094064 3071238 3507742 3858411 4534978 5624261
$$ packed form
14629A367925l36565L12519m0913k59367J71797j49208Q600L99593l60599q4737
14619A029045j04512J63187m6156L20179o7091k60040K57439n187K13162N1209
14609A551235O4026j58093O445K1714L5124k57478K47993k21230K17953J47881
14599A655570l64007L17494j59279K27737l18456o6412j04619N28756L13626l96849
14589A633561K14313l89779K23529J20444k20634L8468K68222J8755j29110j76457
14579A601312O15253m00686K41749m85691J07739J0049O56375o09862R2380K77570
14569B106188l16733J72005K16292J34732k6010J81786k45142j09625L99497J86549
14559B699539J19112k33488N7392J87211K64298k2826M36504L50669O76567J089283
$$ plain form
14549 5624261 6831594 10520292 17858247 32182796 43832521 22273586 9630443 4874431
14541 4874431 3407275 2550892 2375582 2142583 1872183 1957004 2073675 2270927 2150072
14532 2150072 2013977 1934180 2079601 2122326 2223274 2137742 2248443 2686514 2216171 2398734
14522 2398734 2257039 2260950 2641840 2376976 2616913 2195221 2352446 2574881 2293297 2725793
14512 2725793 2409091 2847909 2748755 2665967 2482537 2805664 2411587 2597446 2822901 2775147
14502 2775147 2879414 2998577 2844208 2865517 2750263 2895432 2953308 3482670 3183319 2968609
14492 2968609 3127721 3371223 3016807 3501980 3408408 3431417 3456710 3309817 3349457 3908280
14482 3908280 3649339 3818788 3618678 3704223 3648594 3521226 3758465 3701693 3933741 3768903
$$ packed form
14549E624261J207333L688698P337955J4324549J1649725k1558935I630443m756012
14541D874431j467156q56383j75310k32999k70400Q4821J16671J97252j20855
14532B150072j36095p9797J45421M2725J00948q5532J10701M38071m70343J82563
14522B398734j41695L911L80890k64864K39937m21692J57225K22435k81584M32496
14512B725793l16702M38818r9154q2788j83430L23127l94077J85859K25455m7754
14502B775147J04267J19163j54369K1309j15254J45169N7876N29362k99351k14710
14492B968609J59112K43502l54416M85173r3572K3009K5293j46893L9640N58823
14482C908280k58941J69449k00110Q5545n5629j27368K37239n6772K32048j64838
$$ plain form
14472 3768903 3697411 3815754 4270374 4344749 3953391 4226956 4017676 3931064 4233159 4154778
14462 4154778 4514459 4354083 4593817 4635592 4687631 4830173 4853987 4482288 4718833 4771522
14452 4771522 5342330 4982604 4938689 4648372 5089046 5335320 5304449 5533262 5571320 5545941
14442 5545941 5655894 5755104 5934159 5808944 5822165 5654829 6003309 5842171 6117115 6046345
14432 6046345 6524441 6605355 6464694 6597562 6538742 6821796 6826419 6631092 6980847 6969631
14422 6969631 7601661 7292459 7373026 7266611 7433884 7844347 7820163 7859507 7993967 8414621
14412 8414621 8346511 8485416 8730667 8574070 8669176 9025556 8925427 9293284 9503810 10009304
14402 10009304 9642452 9805569 10337723 10280583 10308382 10400338 10483307 10668795 10736391 10900940
$$ packed form
14472C768903p1492J18343M54620P4375l91358K73565k09280q6612L02095p8381
14462D154778L59681j60376K39734M1775N2039J42542K3814l71699K36545N2689
14452D771522N70808l59726m3915k90317M40674K46274l0871K28813L8058k5379
14442E545941J09953R9210J79055j25215J3221j67336L48480j61138K74944p0770
14432F046345M78096Q0914j40661J32868n8820K83054M623j95327L49755j1216
14422F969631O32030l09202Q0567j06415J67273M10463k4184L9344J34460M20654
14412H414621o8110J38905K45251j56597R5106L56380j00129L67857K10526N05494
14402A0009304l66852J63117N32154n7140K7799R1956Q2969J85488O7596J64549
$$ plain form
14392 10900940 11153217 11245145 11651689 11871778 12278771 12152177 12265397 12349113 13088289 13142625
14382 13142625 13597586 13766724 14074530 14078183 14263407 14943592 15182787 15324940 15340955 16084682
14372 16084682 16086777 16531124 16834628 17061068 17710941 17797280 18101570 18745928 18930899 19334849
14362 19334849 20264665 20058822 20630125 20912165 21809005 21768516 22714861 23069324 23412077
14353 23412077 24144791 24222471 25350983 25897989 26023312 27065998 27775503 28428122 29449767
14344 29449767 29971055 30711857 31968622 32536460 33417270 34190151 35537961 36133501 37654795
14335 37654795 38723352 39696297 40788220 41837206 43345547 44578831 46236492 47734353
14327 47734353 49304263 50877616 52259020 54326464 56265944 58247033 60289878 62387229
$$ packed form
14392A0900940K52277R1928M06544K20089M06993j26594J13220Q3716P39176N4336
14382A3142625M54961J69138L07806L653J85224O80185K39195J42153J6015P43727
14372A6084682K095M44347L03504K26440O49873Q6339L04290O44358J84971M03950
14362A9334849R29816k05843N71303K82040Q96840m0489R46345L54463L42753
14353B3412077P32714P7680J128512N47006J25323J042686P09505O52619J021645
14344B9449767N21288P40802J256765N67838Q80810P72881J347810N95540J521294
14335C7654795J068557R72945J091923J048986J508341J233284J657661J497861
14327D7734353J569910J573353J381404K067444J939480J981089K042845K097351
$$ plain form
14319 62387229 64710347 67349270 69491539 72595199 75569342 78111963 81677824 84825645
14311 84825645 88166594 92203791 95849099 100185626 104492157 109302775 114389642 119651886
14303 119651886 125128070 131590979 137922900 144387810 152077989 159977850 168043277 176933433
14295 176933433 186104617 195890008 206345890 217520196 228971735 241888820 254893265
14288 254893265 268577871 282907729 297852131 313495528 329179591 345079908 361903245
14281 361903245 378383831 394743548 410148154 424939677 438896670 451258816 461830087
14274 461830087 470261206 475137514 476264970 475127219 474027040 471428596 466629446 459992056
14266 459992056 450373667 439273908 426507432 411671831 396433546 380209664 363505030
$$ packed form
14319F2387229K323118K638923K142269L103660K974143K542621L565861L147821
14311H4825645L340949M037197L645308M336527M306531M810618N086867N262244
14303A19651886N476184O462909O331921O464910P690179P899861Q065427Q890156
14295A76933433R171184R785391J0455882J1174306J1451539J2917085J3004445
14288B54893265J3684606J4329858J4944402J5643397J5684063J5900317J6823337
14281C61903245J6480586J6359717J5404606J4791523J3956993J2362146J0571271
14274D61830087Q431119M876308J127456j137751j100179k598444m799150o637390
14266D59992056r618389j1099759j2766476j4835601j5238285j6223882j6704634
$$ plain form
14259 363505030 346877867 330912624 314773282 298965245 283944750 269444885 255711016
14252 255711016 242276373 230253787 218374903 206882140 196476499 186454601 177331655
14245 177331655 168579237 160598080 153204799 145373668 138601350 132155113 125910022 120413892
14237 120413892 115467515 110083645 105698782 101014087 96864510 92796236 89579101 86076022
14229 86076022 81947493 79027474 76192289 73405247 70613189 67820995 65244347 63267051
14221 63267051 61280228 58985242 56882545 54838844 53364097 51265085 49882012 48354943
14213 48354943 47147044 45560910 43928993 42855298 41530580 40547767 39820499 38782183
14205 38782183 37801411 35930887 34829561 33998711 33304394 32748972 31929578 30796730 29946737
$$ packed form
14259C63505030j6627163j5965243j6139342j5808037j5020495j4499865j3733869
14252B55711016j3434643j2022586j1878884j1492763j0405641j0021898r122946
14245A77331655q752418p981157p393281p831131o772318o446237o245091n496130
14237A20413892m946377n383870m384863m684695m149577m068274l217135l503079
14229H6076022m128529k920019k835185k787042k792058k792194k576648j977296
14221F3267051j986823k294986k102697k043701j474747k099012j383073j527069
14213D8354943j207899j586134j631917j073695j324718r82813p27268j038316
14205C8782183r80772j870524j101326q30850o94317n55422q19394j132848q49993
$$ plain form
14196 29946737 29160370 28359286 27670823 27317972 26586694 25842193 25195539 24543241 23938449
14187 23938449 23790905 22731234 22492460 21567370 21384182 20921758 20859689 20087904 19683550
14178 19683550 19033631 18842489 17949422 17847994 17657646 17167196 16887496 16732444 16393363
14169 16393363 15812519 15440443 15624314 14745059 14383770 14376477 14233726 14069657 13676436 13390626
14159 13390626 13312604 13014247 12577487 12409369 12302823 12163002 11707793 11579683 11607571 11444735
14149 11444735 11085085 11150491 10223269 10213135 10571094 10100428 10205969 9730881 9765620 9591464
14139 9591464 9684111 9724826 8911034 9050886 8821875 8684244 8544907 8512300 8255652 8290221
14129 8290221 8240451 8076382 7810232 7825463 7625541 7651816 7785040 7420510 7611715 7268326
$$ packed form
14196B9946737p86367q01084o88463l52851p31278p44501o46654o52298o04792
14187B3938449j47544j059671k38774r25090j83188m62424o2069p71785m04354
14178A9683550o49919j91142q93067j01428j90348m90450k79700j55052l39081
14169A6393363n80844l72076J83871q79255l61289p293j42751j64069l93221k85810
14159A3390626p8022k98357m36760j68118j06546j39821m55209j28110K7888j62836
14149A1444735l59650O5406r27222j0134L57959m70666J05541m75088L4739j74156
14139I591464R2647M0715q13792J39852k29011j37631j39337l2607k56648L4569
14129H290221m9770j64069k66150J5231j99922K6275J33224l64530J91205l43389
$$ plain form
14119 7268326 7024651 6926518 7006681 6715980 6544306 6683776 6550150 6246504 6746603 6620656
14109 6620656 6143203 6525701 6423196 5944370 5848374 5976776 5672922 5940995 5681598 5334286
14099 5334286 5741129 5322508 5460221 5259256 5319866 5322659 5405583 5537021 5035156 4991493
14089 4991493 4953650 5206345 4743811 4768376 4694398 4413353 4490402 4504991 4495354 4516033 4623681
14078 4623681 4375947 4357668 4136110 4381789 4247278 4452115 4062364 4238056 3741030 3816959
14068 3816959 4103151 3714368 4130913 4030744 3862885 3984680 3614030 3838090 3712025
14059 3712025 3596175 3553219 3611843 3599895 3379320 3284785 3178312 3208538 3356081 3240576
14049 3240576 3452353 3026189 3330482 3373531 3185369 3102232 3188508 3105536 3044358 2997498
$$ packed form
14119G268326k43675r8133Q0163k90701j71674J39470j33626l03646N00099j25947
14109F620656m77453L82498j02505m78826r5996J28402l03854K68073k59397l47312
14099E334286M06843m18621J37713k00965O0610K793Q2924J31438n01865m3663
14089D991493l7843K52695m62534K4565p3978k81045P7049J4589r637K0679J07648
14078D623681k47734j8279k21558K45679j34511K04837l89751J75692m97026P5929
14068C816959K86192l88783M16545j00169j67859J21795l70650K24060j26065
14059C712025j15850m2956N8624j1948k20575r4535j06473L0226J47543j15505
14049C240576K11777m26164L04293M3049j88162q3137Q6276q2972o1178m6860
$$ plain form
14039 2997498 3222671 3047085 3079667 2881448 2897764 2924636 2885943 2809223 2949435 2806046
14029 2806046 2648397 2450639 2543027 2544969 2596129 2442581 2498635 2372889 2380802 2655737 2718459
14018 2718459 2287281 2689624 2302264 2633785 2194549 2578209 2413684 2274828 2274774 2067568
14008 2067568 2334329 2190306 2250403 2287746 2137023 2077032 2144317 2274270 2261885 1934856
13998 1934856 2010980 2169329 1904490 1982100 1873183 1990018 2146822 2191877 2983839 3884786
13988 3884786 6389887 12380953 26384763 43826678 27576999 13882902 8645599 6136263
13980 6136263 4865764 4135689 3732074 3479226 2804824 2874110 2904195 2547181 2591655 2469637
13970 2469637 2289547 2367669 2194599 2495633 2179836 2137931 2062728 2102825 1650757 2291935
$$ packed form
14039B997498K25173j75586L2582j98219J6316K6872l8693p6720J40212j43389
14029B806046j57649j97758R2388J942N1160j53548N6054j25746P913K74935O2722
14018B718459m31178M02343l87360L31521m39236L83660j64525j38856n4k07206
14008B067568K66761j44023O0097L7343j50723n9991O7285J29953j2385l27029
13998A934856P6124J58349k64839P7610j08917J16835J56804M5055P91962R00947
13988C884786K505101N991066J4003810J7441915j6249679j3694097n237303k509336
13980F136263j270499p30075m03615k52848o74402O9286L0085l57014M4474j22018
13970B469637j80090P8122j73070L01034l15797m1905p5203M0097m52068O41178
$$ plain form
13960 2291935 2094848 2299945 1672139 1943705 2249705 2205224 1895812 2001466 1966690 1815094
13950 1815094 1967302 1350364 1487770 1877132 1668219 1850211 1895992 1867846 1744545 1767214
13940 1767214 1926370 1698535 1703867 1474034 1643063 1713586 1771432 1226090 1650541 1591064
13930 1591064 1429326 1502955 1731886 1397335 1656682 1626665 1544432 1073043 1560286 1155342
13920 1155342 1578134 1200007 1364267 1598737 1631088 1128827 967266 1425863 1107965 1063256
13910 1063256 1525804 1442567 1302475 1166584 1266261 1273435 1249617 1455031 1139247 1350379
13900 1350379 941240 1201523 1446475 1354898 1430160 1279680 1212608 1078246 1082704 1154199
13890 1154199 1252339 1416593 1157172 1310207 1035171 1050481 1282877 1345114 793978 962732
$$ packed form
13960B291935j97087K05097o27806K71566L06000m4481l09412J05654l4776j51596
13950A815094J52208o16938J37406L89362k08913J81992M5781k8146j23301K2669
13940A767214J59156k27835N332k29833J69029P0523N7846n45342M24451n9477
13930A591064j61738P3629K28931l34551K59347l0017q2233m71389M87243m04944
13920A155342M22792l78127J64260K34470L2351n02261j61561M58597l17898m4709
13910A063256M62548q3237j40092j35891R9677P174k3818K05414l15784K11132
13900A350379m09139K60283K44952r1577P5262j50480o7072j34362M458P1495
13890A154199R8140J64254k59421J53035k75036J5310K32396O2237n51136J68754
$$ plain form
13880 962732 943012 962013 1008560 1369712 955598 896359 1439573 1101430 1304879 1239531
13870 1239531 1026795 780087 1387266 983708 1283410 854565 1185749 1205398 1024974 1467200
13860 1467200 1168740 741831 1023790 1320706 1151360 986120 918557 686233 994801 990991
13850 990991 663129 911753 763972 1029092 740019 1147851 774260 826199 801194 965866
13840 965866 1168938 931936 1007468 871113 1096625 929701 670453 729384 620962 951412
13830 951412 959788 954053 770957 957592 757675 580206 553225 815567 925877 1238774
13820 1238774 1004607 754992 832319 807106 461897 842001 1103870 855246 758619 816935
13810 816935 791022 767322 669938 785098 929348 795770 808596 718630 753827 830798 1028075
$$ packed form
13880I62732j9720J9001M6547L61152m14114n9239N43214l38143K03449o5348
13870A239531k12736k46708O07179m03558K99702m28845L31184J9649j80424M42226
13860A467200k98460m26909K81959K96916j69346j65240o7563k32324L08568l810
13850I90991l27862K48624j47781K65120k89073M07832l73591N1939k5005J64672
13840I65866K03072k37002P5532j36355K25512j66924k59248N8931j08422L30450
13830I51412Q376n735j83096J86635j99917j77469k6981K62342J10310L12897
13820A238774k34167k49615P7327k5213l45209L80104K61869k48624r6627N8316
13810H16935k5913k3700r7384J15160J44250j33578J2826q9966L5197P6971J97277
$$ plain form
13799 1028075 414004 926932 790034 1157917 1179490 802175 920800 710493 862995 607760
13789 607760 721336 328551 709024 529159 749019 1042681 481996 945852 1094078 852449
13779 852449 791124 616193 247534 841354 538037 1049746 800297 572854 591225 498656
13769 498656 761251 807452 607942 635951 428855 516083 768145 390535 552216 630040
13759 630040 555115 509641 798086 459813 585936 387868 398107 491808 645848 899075
13749 899075 586982 720766 715421 512484 668252 609582 510928 669702 383929 533034
13739 533034 258935 563031 656203 392516 325472 474229 875294 525593 548279 620403
13729 620403 648509 653103 363644 404712 515305 532714 694950 554092 527435 372817 609546
$$ packed form
13799A028075D14004N12928j36898L67883K1573l77315J18625k10307J52502k55235
13789F07760J13576C28551L80473j79865K19860K93662D81996M63856J48226k41629
13779H52449o1325j74931B47534N93820l03317N11709k49449k27443J8371r2569
13769D98656K62595M6201j99510K8009k07096Q7228K52062l77610J61681P7824
13759F30040p4925m5474K88445l38273J26123j98068J0239R3701J54040K53227
13749H99075l12093J33784n345k02937J55768n8670r8654J58774k85773J49105
13739E33034B58935L04096R3172k63687o7044J48757M01065l49701K2686P2124
13729F20403K8106M594k89459M1068J10593J7409J62236j40858k6657j54618K36729
$$ plain form
13718 609546 573160 865285 768576 294531 313461 376131 240424 675166 412658 379077
13708 379077 555799 480644 693722 531837 523860 492978 517878 422512 473017 479680 697523
13697 697523 546185 288143 483557 143448 232282 831949 603166 479985 478799 254782
13687 254782 409981 504456 409702 534542 406204 290030 696778 497122 351691 461585
13677 461585 530838 649029 540553 784332 848710 76316 562993 643414 231011 345343
13667 345343 475539 616532 377719 692532 589883 842706 503947 711548 321120 174089
13657 174089 358761 378718 627137 391180 575928 186169 190341 443164 466914 440004
13647 440004 579772 472892 400339 652232 353854 472369 424631 331344 296155 610488
$$ packed form
13718F09546l6386K92125r6709B94531J8930O2670j35707M34742k62508l3581
13708C79077J76722p5155K13078j61885p977l0882K4900r5366N0505O663K17843
13697F97523j51338k58042J95414A43448Q8834N99667k28783j23181j186k24017
13687B54782J55199R4475r4754J24840j28338j16174M06748j99656j45431J09894
13677D61585O9253J18191j08476K43779O4378G6316M86677Q0421B31011J14332
13667C45343J30196J40993k38813L14813j02649K52823l38759K07601C21120j47031
13657A74089J84672J9957K48419k35957J84748A86169M172K52823K3750k6910
13647D40004J39768j06880p2553K51893k98378J18515m7738r3287l5189L14333
$$ plain form
13637 610488 33983 173287 374790 427634 393449 180877 409267 413401 89116 428903 344751
13626 344751 299541 256838 617804 464136 675209 612174 458198 409720 175085 665942
13616 665942 402436 419890 572542 198117 383384 46240 241232 226473 131089 99426
13606 99426 40732 272143 196596 55926 509701 55720 111250 91330 189175 -112373 293726
13594 460236 387178 85819 501000 637841 215799 280054 231826 277599 318154 525977 277953
13583 277953 297233 459329 396529 275653 -94515 19921 299909 474001 382887 428721 442854
13572 442854 381387 -47946 319607 -24285 742030 491954 382096 401553 326654 426575 439740
13561 439740 405012 487182 366131 520178 526571 361874 498849 108716 713676 126599
$$ packed form
13637F10488C3983J39304K01503N2844l4185A80877K28390M134H9116L39787q4152
13626C44751m5210m2703L60966j53668K11073o3035j53976m8478A75085M90857
13616F65942k63506J7454J52652A98117J85267D6240J94992j4759r5384l1663
13606I9426D0732K31411p5547E5926M53775E5720N5530j9920R7845a12373B93726
13594D60236p3058H5819M15181J36841B15799O4255m8228M5773M0555K07823k48024
13583B77953J9280J62096o2800j20876i4515A9921K79988J74092r1114M5834J4133
13572D42854o1467d7946C19607b4285G42030k50076j09858J9457p4899R9921J3165
13561D39740l4728Q2170j21051J54047O393j64697J36975A08716O04960A26599
$$ plain form
13550 310401 -189767 124248 151950 122041 275689 646662 140618 -2609 248403 214791
13540 214791 317758 545730 9167 68926 303922 299073 494953 316605 319051 456419 249116
13529 249116 546415 325665 343364 -55216 216138 93118 427452 31658 388658 416660
13519 416660 -19893 192471 522033 415978 57644 70067 474494 308493 516124 193460
13508 -4773 199282 -38218 270375 378348 641070 -95963 185891 200138 381778 296829 476349
13497 476349 326876 196876 100471 266153 303133 96532 -197786 239867 16787 339129
13487 339129 165452 157726 441920 263989 181954 126423 598201 143724 397797 531968
13477 531968 64635 24227 142584 559761 479163 385318 -175900 244975 193191 146390 182904
$$ packed form
13550C10401a89767A24248K7702k9909J53648L70973A40618b609B48403l3612
13540B14791J02967K27972I167N9759K34996m849J95880j78348K446J37368k07303
13529B49116K97299k20750J7699e5216B16138I3118L34334C1658L57000K8002
13519D16660a9893A92471L29562j06055E7644J2423M04427j66001K07631A93460
13508d773A99282c8218B70375J07973K62722i5963A85891J4247J81640q4949J79520
13497D76349j49473j30000r6405J65682L6980I6532a97786B39867A6787L22342
13487C39129A65452p726K84194j77931q2035n5531M71778A43724K54073J34171
13477E31968F4635B4227J18357M17177q0598r3845a75900B44975n1784m6801L6514
$$ plain form
13466 182904 592613 -73179 219870 286452 61884 325110 72660 560710 131267 422523
13456 422523 269406 260302 398022 73541 352584 187986 238291 132819 161859 115250 640911
13445 640911 192176 160957 274201 269090 -45100 35297 241498 251367 269414 208790 292914
13434 292914 227917 56889 -103271 372517 243516 8757 296026 384394 173917 516459
13424 516459 295639 257211 333298 177796 202099 125501 237137 573530 206142 217666
13414 217666 200754 233784 -220074 200229 -85045 20366 191929 -112852 397478 -63049
13403 6426 114105 132304 141665 -137910 30231 71829 352825 356747 251270 301557 250858
13392 250858 333437 101952 43163 272984 121815 142075 272129 405442 83805 33224
$$ packed form
13466A82904M09709g3179B19870O6582F1884K63226G2660M88050A31267K91256
13456D22523j53117r104J37720G3541K79043j64598N0305j05472K9040m6609N25661
13445F40911A92176l1219J13244n111d5100C5297K06201R869J8047o0624Q4124
13434B92914o4997E6889a03271C72517j29001H757K87269Q8368A73917L42542
13424E16459k20820l8428P6087j55502K4303p6598J11636L36393B06142J1524
13414B17666j6912L3030b20074B00229h5045B0366J71563a12852C97478f3049
13403F426J07679J8199R361a37910C0231M1598K80996L922j05477N0287n0699
13392B50858Q2579A01952D3163K29821A21815K0260J30054J33313H3805C3224
$$ plain form
13381 112825 279741 197996 335717 120659 392505 -108422 101633 149882 168417 123462
13371 123462 181761 334120 322248 218720 303061 86567 169141 -5026 142358 91495 128466
13360 128466 153212 300424 66693 -71383 242671 140721 94594 208706 726446 166310
13349 33205 448472 427406 583107 611722 230321 378142 233581 183085 276560 2133 237322
13338 237322 207113 119597 240049 74187 307177 25462 304489 348456 257058 199631 432426
13327 432426 314244 287112 -58011 -70786 303371 253633 180097 422331 202895 482853
13317 482853 330956 4267 -36415 -137553 371438 61347 156780 -125199 345579 281890 -93890
13305 53928 -147251 89159 246245 569385 153941 613414 -166289 178273 -247707 183476
$$ packed form
13381A12825J66916q1745J37721A20659K71846a08422A01633M8249J8535m4955
13371A23462N8299J52359j1872j03528Q4341H6567Q2574e026A42358n0863L6971
13360A28466K4746J47212F6693g1383B42671j01950m6127J14112N17740A66310
13349C3205M15267k1066J55701K8615B30321J47821j44561n0496R3475B133K35189
13338B37322l0209q7516J20452G4187K32990B5462K79027M3967r1398n7427K32795
13327D32426j18182k7132e8011j2775C03371m9738p3536K42234B02895K79958
13317D82853j51897D267c6415j01138C71438F1347R5433a25199C45579o3689i3890
13305E3928a47251H9159J57086L23140A53941M59473a66289A78273b47707A83476
$$ plain form
13294 166248 305562 -89844 202143 21699 -79431 -79678 119150 -18549 119861 455772 -72441
13282 396571 -239331 213648 26704 154682 -2226 279740 104016 261487 147119 -15306
13271 -16660 -33346 170203 307837 -275662 166493 270411 264914 167088 185776 354403 220096
13260 220096 -28053 179337 137450 154456 333797 -146772 -8527 154110 149528 -139558 110715
13248 -156298 124964 -10884 -4820 300062 121395 61461 36634 -103667 44937 -168395 302258
13236 328662 301273 323218 350515 110579 280678 320292 -214166 113673 77660 -141757
13225 107834 -138314 177630 -42714 -95448 161644 20972 121787 123855 -55406 118245 -118353
13213 -398345 249453 -8568 -398056 -103062 -93287 202578 253728 5733 184344 130964 99869
$$ packed form
13294A66248J39314h9844B02143B1699g9431k47A19150a8549A19861L35911g2441
13282C96571b39331B13648B6704J27978b226B79740A04016J57471j14368a5306
13271a6660j6686A70203J37634b75662A66493J03918n497r7826J8688J68627j34307
13260B20096b8053A79337m1887J7006J79341a46772h527A54110m582a39558A10715
13248a56298A24964a0884d820C00062A21395n9934k4827a03667D4937a68395C02258
13236C28662k7389K1945K7297A10579J70099L9614b14166A13673l6013a41757
13225A07834a38314A77630d2714n2734A61644B0972J00815K068e5406A18245a18353
13213c98345B49453h568l89488a03062R775B02578N1150E733J78611n3380l1095
$$ plain form
13202 99869 279707 628 502436 36338 -1840 -24511 189195 146473 -248155 117665 216004
13191 216004 493125 152716 366915 -130401 -184290 -56275 155706 260998 400617 593832
13181 593832 74913 198630 -94173 34954 259432 144085 56740 231460 149695 -60772 93218
13169 -86303 143117 183282 119202 28408 200834 29868 -128365 -69630 -126218 62215 233079
13158 233079 -164953 12522 -364601 -129804 21372 -67671 -57977 401169 -127825 287847
13147 81480 -70637 -137794 -31672 367631 174490 164542 137675 33856 200107 -17327 -36956
13136 -36956 -106925 -297875 52593 262256 325505 270537 105361 152243 -93069 -250143 98054
13124 -84659 123047 -206694 -24216 10670 286110 347220 96245 -12556 260429 282033 231179
$$ packed form
13202I9869J79838F28N01808C6338a840k2671A89195m2722b48155A17665R8339
13191B16004K77121A52716K14199a30401n3889e6275A55706J05292J39619J93215
13181E93832G4913J23717i4173C4954K24478j15347E6740J74720q1765f0772I3218
13169h6303A43117M0165o4080B8408J72426B9868a28365N8735n6588F2215J70864
13158B33079a64953A2522c64601a29804B1372f7671R694D01169a27825B87847
13147H1480g0637o7157c1672C67631A74490r948k6867C3856J66251a7327j9629
13136c6956o9969j90950E2593K09663O3249n4968A05361M6882i3069j57074I8054
13124h4659A23047b06694b4216A0670K75440O1110I6245a2556B60429K1604n0854
$$ plain form
13113 231179 315315 -193585 -113236 34192 181129 277105 104979 332366 86298 -227204
13102 36061 31306 -70989 -176723 180434 243498 31826 -156070 -166818 138019 -81324 161263
13090 48662 138721 121999 318014 -115119 -259361 169517 36453 411909 26968 214535
13080 214535 75485 230223 50372 -44549 73930 78700 -147747 231275 37677 -4586 -251609
13069 -251609 254056 -1373 66239 411751 184586 76083 58021 342000 43202 2637 429413
13058 429413 -47496 133654 26736 399079 401337 92157 12082 322287 325573 -3620 165651
13046 175316 139091 -113584 39279 224883 3535 108300 -16298 256520 -68218 94964 366599
13035 366599 204026 346475 210271 -166444 85826 -25610 89723 52323 -57461 219359
$$ packed form
13113B31179Q4136a93585Q0349C4192J46937R5976A04979K27387H6298b27204
13102C6061m755g0989j05734A80434O3064C1826a56070j0748A38019h1324A61263
13090D8662R0059j6722J96015a15119j44242A69517C6453L75456B6968J87567
13080B14535G5485J54738E0372d4549G3930M770a47747B31275C7677d586k47023
13069b51609B54056a373F6239L45512A84586G6083j8062K83979D3202B637M26776
13058D29413d7496A33654B6736L72343K258I2157A2082L10205L286c620A65651
13046A75316l6225a13584C9279J85604C535J04765a6298B56520f8218I4964K71635
13035C66599j62573J42449j36204a66444H5826b5610H9723l7400e7461B19359
$$ plain form
13024 -40951 -114720 369832 208858 194495 255747 -85113 -39846 67863 -134507 318859 646433
13013 646433 -132899 -191982 -99194 -11347 97645 -211510 -222052 -90263 356073 377155 -164106
13001 -18416 408102 -43984 -121930 540506 -113601 -253126 -191295 103950 -256262 -106425
12990 29589 -214079 -46046 88000 -7910 -39482 -51549 66185 171792 -110857 119599 257011
12979 257011 43479 291486 407717 36459 -26750 266744 289519 22234 -383277 -177070
12968 66527 -44947 -244209 199629 83437 116449 -208493 9492 -138288 -52834 -69374 -73481
12957 -73481 72895 7036 -17083 -118863 364988 -114288 284566 117224 -13662 -15238 214495
12945 76832 92708 191211 40839 -118383 437391 -287657 10581 -108632 111955 -24932 -129737
$$ packed form
13024d0951p3769C69832j60974j4363O1252h5113c9846F7863a34507C18859L27574
13013F46433a32899n9083R2788a1347I7645b11510j0542i0263C56073K1082a64106
13001a8416D08102d3984p7946E40506a13601j39525O1831A03950b56262a06425
12990B9589b14079d6046H8000g910l1572j2067F6185J05607a10857A19599J37412
12979B57011D3479K48007J16231C6459b6750B66744K2775B2234c83277a77070
12968F6527d4947j99262A99629H3437L3012b08493I492a38288e2834j6540m107
12957g3481G2895G036a7083j01780C64988a14288B84566A17224a3662j576B14495
12945G6832J5876R8503D0839a18383D37391b87657A0581a08632A11955b4932j04805
$$ plain form
12934 -129737 -247880 -99716 195782 -18628 -219641 174806 6280 1661 -364911 -61088 17713
12922 95462 -16305 87749 174469 -112342 175905 -213928 -33062 -165210 -99851 126465 13400
12910 312002 92170 -38371 -236346 -96288 46995 66222 39090 20027 231511 -98185 -100891
12899 -100891 -24952 -211515 -128374 -175002 159477 146193 -139354 53269 -9309 -147904 143680
12887 -260444 -178491 184341 124635 -34269 24134 -195266 -49442 -162606 338673 375304 434014
12876 434014 44758 330162 -64181 -100278 167346 246640 164807 290318 134605 -332898
12865 -60924 347016 242904 137189 42187 68793 -397335 176450 50386 55401 400527 42737
12853 65561 43749 423788 -40031 -151311 77694 83755 -17243 45239 -298884 -55286 -123899
$$ packed form
12934a29737j18143i9716A95782a8628k01013A74806F280A661c64911f1088A7713
12922I5462a6305H7749Q6720a12342A75905b13928c3062j32148O5359A26465A3400
12910C12002I2170c8371j97975i6288D6995J9227k7132j9063K11484i8185k706
12899a00891b4952j86563Q3141m6628A59477j3284a39354E3269i309j38595A43680
12887b60444Q1953A84341n9706c4269B4134a95266d9442j13164C38673L6631N8710
12876D34014D4758K85404f4181l6097A67346P9294q1833J25511A34605c32898
12865f0924C47016j04112j05715D2187K6606c97335A76450E0386N015L45126D2737
12853F5561k1812L80039d0031j11280G7694O061a7243D5239b98884e5286o8613
$$ plain form
12842 -123899 -395700 164796 293618 157968 164521 -121271 12732 -113931 328655 -343284
12831 -35095 53464 53712 243672 -123776 -258581 -83726 7402 -105085 -100687 130620 119942
12820 119942 79404 -41810 -49098 59464 43883 -278235 272888 247325 309891 183804 -260400
12808 160882 -108200 282326 149617 -70122 310664 49502 98932 31271 66495 -43454 291478
12796 294400 -60905 -143379 265101 246983 -37609 -79079 112522 -231182 -161646 154777 44813
12784 -256714 59847 98515 148468 -257896 115250 208265 190014 -265814 275440 -163800
12773 -235539 -201108 -96159 55042 167823 -155834 85822 83501 -70688 3216 -173803 305358
12761 -131851 25055 -80413 6074 123501 -123297 -27004 -58051 67174 282847 490660 -54339
$$ packed form
12842a23899k71801A64796J28822j35650O553a21271A2732a13931C28655c43284
12831c5095E3464K48J89960a23776j34805h3726G402a05085M398A30620j0678
12820A19942m0538d1810p288E9464j5581b78235B72888k5563O2566j26087b60400
12808A60882a08200B82326j32709g0122C10664D9502M9430C1271L5224d3454B91478
12796B94400f0905q2474B65101j8118c7609m1470A12522b31182O9536A54777D4813
12784b56714E9847L8668M9953b57896A15250R3015j8251b65814B75440a63800
12773b35539L4431i6159E5042J12781a55834H5822k321g0688C216a73803C05358
12761a31851B5055h0413F074J17427a23297b7004l1047F7174K15673K07813e4339
$$ plain form
12749 30190 -41161 -141078 -18426 23644 -59474 112513 350376 178908 -89914 133182 327151
12738 327151 -13155 58854 -212716 111674 51401 -399587 -68441 288882 108735 279387
12728 279387 157099 -88191 -165205 -196508 -74574 -7322 94939 -126781 235948 215826 -377357
12716 250596 116916 125739 -206360 -41840 342710 -133227 236727 189332 273751 229553 62803
12704 105473 97321 282028 262152 182726 -146327 62835 1294 -138217 341841 136571 -83730
12692 -74628 305149 8708 288700 75324 -72230 272443 426670 -85691 147815 -82421 219069
12680 316622 130306 123509 -5457 525776 -180294 369336 -238697 214428 -16029 -239066
12670 -239066 178748 -55733 284035 101484 210810 315082 368917 339545 -62096 45239
$$ packed form
12749C0190d1161r9917a8426B3644e9474A12513K37863j71468h9914A33182J93969
12738C27151a3155E8854b12716A11674E1401c99587f8441B88882A08735J70652
12728B79387j22288h8191p7014l1303g4574g322I4939a26781B35948k0122c77357
12716B50596A16916Q823b06360d1840C42710a33227B36727m7395Q4419m4198F2803
12704A05473q152J84707j9876p9426a46327F2835A294a38217C41841A36571h3730
12692g4628C05149H708K79992G5324g2230B72443J54227h5691A47815h2421B19069
12680C16622A30306o797e457E25776a80294C69336b38697B14428a6029k23037
12670b39066A78748e5733B84035A01484J09326J04272N3835k9372f2096D5239
$$ plain form
12659 83686 112688 47324 126215 564195 110820 446124 104186 115400 -75958 -73580 274114
12647 13417 -205069 50827 263461 29614 215404 492281 329600 183284 -10711 -431041
12637 -431041 -165802 -54743 307210 92712 96949 123295 244678 326598 55194 135226 91217
12626 91217 344099 143970 245756 157738 169355 13071 392904 75824 -112607 139932
12615 -55255 116950 -63605 152500 -30278 347750 -98689 -87978 -87624 -120482 -363034 -28006
12603 82117 -198557 333728 212059 143396 149397 101931 194135 190598 78995 35115 177869
12592 177869 -16272 -111354 126838 -98763 9444 -174467 24640 -226032 170032 26498 -39370
12580 -238459 -1255 59412 154873 -174565 -119725 403613 -119053 -109021 303012 418344 127028
$$ packed form
12659H3686K9002D7324P8891M37980A10820L35304A04186J1214g5958K378B74114
12647A3417b05069E0827K12634B9614J85790K76877j62681j46316a0711m20330
12637d31041a65802e4743C07210I2712M237K6346J21383Q1920E5194Q0032m4009
12626I1217K52882A43970J01786q8018J1617A3071L79833G5824a12607A39932
12615e5255A16950f3605A52500c0278C47750i8689J0711L54l2858k42552b8006
12603H2117a98557C33728j21669o8663O001m7466R2204l537G8995C5115J42754
12592A77869a6272r5082A26838i8763I444a74467B4640b26032A70032B6498c9370
12580b38459a255E9412R5461a74565N4840D03613a19053J0032C03012J15332A27028
$$ plain form
12568 -73022 -305781 -42280 -30870 -118741 -22855 59636 129868 320307 -63605 -22723 -137617
12557 -137617 256825 85783 187324 -140293 -46477 -226005 329904 -95849 492471 -185223
12546 28655 102743 -222769 -95664 161816 129502 -78297 247037 -7083 152979 206544 -200661
12534 36905 272197 8160 147723 -161330 -271 243768 115031 160398 -181020 -185494 -3683
12522 -88701 232849 -71687 283110 128570 -207247 129091 -2965 268663 52198 -223411
12511 55785 -255803 407703 -71868 7905 21647 -320 -65140 155751 53252 128231 -89350 -129411
12499 -129411 -22466 -116020 -3174 -38518 124434 111927 225935 282368 -63702 91602 147747
12488 147747 144417 176474 51232 135122 28820 -29717 -138486 -11771 -211538 147754 7367
$$ packed form
12568g3022k32759d2280J1410q7871b2855E9636P0232J90439f3605b2723j14894
12557a37617B56825H5783J01541a40293d6477j79528C29904i5849D92471a85223
12546B8655P4088b22769i5664A61816l2314g8297B47037g083A52979N3565b00661
12534C6905K35292H160J39563a61330b71B43768A15031M5367a81020m474c683
12522h8701B32849g1687B83110A28570b07247A29091b965B68663E2198b23411
12511E5785b55803D07703g1868G905J3742c20o4820A55751E3252P4979h9350m0061
12499a29411b2466r3554c174l5344A24434j2507J14008N6433f3702I1602N6145
12488A47747l330L2057E1232Q3890B8820b9717j08769a1771j99767A47754G367
$$ plain form
12476 486350 247112 -458679 8133 -75864 -164836 16927 62665 80620 91649 -46754 33794
12464 197345 -221528 -119644 79570 290272 89613 136982 -87208 -69335 5369 -172762 -257608
12453 -257608 -157000 82152 303585 139305 4818 199846 -428530 -254550 87659 44543
12443 44543 83534 -135798 56232 -127748 64393 60001 -542705 -134455 139045 -196551 -34079
12431 182989 139172 -198093 42561 -281064 -225697 162793 198801 -160592 -210766 -109759
12421 -109759 41878 12731 50 -69632 -38068 40783 -200883 244629 -332008 -244780 250406
12409 -39664 -232547 107943 -118544 79937 26509 5770 -72061 417448 252876 39283 149123
12398 149123 283612 200310 -141895 275286 32369 112816 -31501 41378 32940 -35189 -201471
$$ packed form
12476D86350k39238d58679H133g5864q8972A6927M5738J7955J1029d6754C3794
12464A97345b21528J01884G9570K10702H9613M7369h7208J7873E369a72762q4846
12453b57608J00608H2152K21433A39305D818J95028d28530J73980H7659m3116
12443D4543L8991a35798E6232a27748F4393m392e42705a34455A39045a96551c4079
12431A82989m3817a98093D2561b81064N5367A62793L6008a60592n0174J01007
12421a09759D1878A2731E0f9632L1564D0783b00883B44629c32008Q7228B50406
12409c9664j92883A07943a18544G9937B6509E770g2061D17448j64572C9283J09840
12398A49123J34489q3302a41895B75286C2369Q0447c1501D1378q438c5189j66282
$$ plain form
12387 -201471 -44395 -54387 -131427 -164469 -109908 -79668 326724 31163 -240360 -69558 -259262
12376 -259262 362126 155593 30185 3378 224847 -183812 -291484 54484 98834 279647
12366 279647 7106 -237074 -50753 -86535 -34287 -206214 -15785 -349287 147884 -164293 -134674
12355 -134674 36408 136033 -44988 -147502 -105469 112016 366343 -99239 -240736 -146290 -23337
12343 78777 105517 -161629 -123528 124750 -36850 -53213 -100945 57058 -278884 -113839 238397
12331 28614 -245737 -86131 80461 -54798 66471 22662 -132027 -167519 30420 12479 -36849
12319 -161225 325466 -150868 208637 92140 -19292 -55485 127078 35153 -122592 -76761
12309 -76761 319555 154127 -374233 -20201 38200 118074 -162276 333702 -211857 569283
$$ packed form
12387b01471d4395r992p7040l3042N4561L0240C26724C1163b40360f9558j89704
12376b59262C62126A55593C0185C378K21469a83812j07672E4484M4350J80813
12366B79647G106b37074e0753l5782c4287j71927a5785l33502A47884a64293K9619
12355a34674C6408R9625d4988j02514M2033A12016K54327i9239j41497R4446b3337
12343G8777K6740a61629L8101A24750c6850j6363m7732E7058b78884a13839B38397
12331B8614b45737h6131H0461e4798F6471B2662a32027l5492C0420A2479c6849
12319a61225C25466a50868B08637I2140a9292l6193A27078C5153a22592M5831
12309g6761C19555A54127c74233b0201C8200P9874a62276C33702b11857E69283
$$ plain form
12298 124120 52122 4221 -41973 270548 -211153 -147915 121406 110424 188037 -12497 -242858
12287 -242858 74097 113827 113622 70914 76205 -287419 232339 407258 229788 -5821 -7844 18968
12274 -108051 7388 303900 310688 -29955 173481 17211 -114415 -72939 -151680 385587 164352
12262 -121794 -88962 -249459 -147428 -170805 25603 243764 87178 270497 11577 -22580 348241
12250 561323 164454 69529 -131212 261650 205269 381863 123906 151136 142613 286239
12240 286239 332899 194033 -94099 217319 116698 -33908 479221 18096 -95345 -7390 27397
12228 350355 494433 225213 387393 341473 363049 -164718 144020 64963 278908 140461
12218 140461 490897 -105173 204198 134796 278188 111838 -150320 66383 164520 237030
$$ packed form
12298A24120E2122D221d1973B70548b11153O3238A21406j0982P7613a2497k30361
12287b42858G4097L9730k05m2708N291b87419B32339J74919j77470e821k023A8968
12274a08051G388K96512O788b9955A73481A7211a14415M1476p8741C85587A64352
12262a21794L2832j60497J02031k3377B5603K18161H7178J83319A1577b2580C48241
12250E61323A64454F9529a31212B61650n6381J76594A23906K7230q523J43626
12240B86239M6660j38866i4099B17319j00621c3908D79221A8096i5345g390B7397
12228C50355J44078B25213J62180m5920K1576a64718A44020F4963K13945j38447
12218A40461L50436a05173B04198o9402J43392A11838a50320F6383R8137P2510
$$ plain form
12208 237030 -33098 97680 115377 -119404 223941 80084 416436 171469 12971 217754
12198 217754 234535 328251 168592 -34366 77760 37504 258304 59279 -282210 -6315 28376
12186 -73758 46335 -133728 -21864 182530 60520 305965 234321 125585 32417 259095 378759
12175 378759 117732 37390 129409 169866 21608 209518 118742 113645 428428 149697 141633
12164 141633 -177979 411539 12861 90307 -224231 124421 314330 163365 31580 114154
12154 114154 361251 -232258 76014 147112 -15984 313702 91092 185807 -265225 -78849 18670
12142 -186096 -122325 198340 211728 283655 159305 -134028 31535 -376377 -664760 -254726
12131 -5897 -75657 -18632 312891 196708 256623 -24844 6397 189669 -44248 158174 168811
$$ packed form
12208B37030c3098I7680J7697a19404B23941H0084L36352A71469A2971K04783
12198B17754J6781R3716j59659c4366G7760C7504K20800E9279b82210f315B8376
12186g3758D6335a33728b1864A82530F0520K45445p1644j08736C2417K26678J19664
12175C78759A17732C7390R2019M0457B1608J87910r0776n097L14783A49697q064
12164A41633a77979D11539A2861P7446b24231A24421J89909j50965C1580Q2574
12154A14154K47097b32258G6014P1098a5984C13702I1092R4715b65225g8849A8670
12142a86096O3771A98340J3388P1927j24350a34028C1535c76377k88383b54726
12131e897o9760a8632C12891j16183N9915b4844F397J83272d4248A58174J0637
$$ plain form
12120 168811 -237480 69955 184966 84359 -142854 29105 -328439 256923 267064 -165723
12109 85220 59719 -64535 -26169 -130251 -256444 -301436 19875 -360377 -230869 -93850 -73733
12098 -73733 18834 149593 27489 -123934 -62221 -166127 363812 -19214 104618 35269 239215
12087 239215 -331874 -124603 -91990 175041 179665 -116752 -295129 36400 -115570 -79028
12077 -79028 23680 115835 33763 242720 51859 295687 -46833 234952 92592 -55505 189490
12065 173572 373379 520557 1923519 656073 535515 47534 143416 -361629 -190028 277752
12054 167697 96141 -120373 -132903 143564 354197 -36227 -201956 171430 -160876 137138
12043 -135584 62751 -132401 150558 -303867 -208082 -51549 -30548 -323130 -488380 133214
$$ packed form
12120A68811b37480F9955J15011H4359a42854B9105c28439B56923J0141a65723
12109H5220k5501f4535b6169j04082j26193m4992A9875c60377J29508i3850K0117
12098g3733A8834J30759B7489a23934O1713j03906C63812a9214A04618C5269K03946
12087B39215c31874a24603L2613A75041M624a16752j78377C6400a15570L6542
12077g9028B3680R2155C3763K08957E1859K43828d6833B34952I2592e5505A89490
12065A73572J99807J47178J402962F56073j20558D7534R5882c61629J71601B77752
12054A67697p1556a20373j2530A43564K10633c6227j65729A71430a60876A37138
12043a35584F2751a32401A50558c03867R5785e1549K1001k92582j65250A33214
$$ plain form
12032 1079 68419 44009 143568 123265 -85532 -251214 238078 3774 -1134 149098 129374 69860
12020 69860 -251776 -189912 83531 -223985 -326208 6832 2925 83664 -42969 -21523 172870
12008 168243 219576 247592 -190861 -92574 54211 22076 2365 -227557 -104072 -68608 12251
11996 60971 226033 406182 -460040 121864 -283348 -9953 -545199 336979 116232 114464
11986 114464 139674 -131834 112134 -232557 -146750 -137859 29660 -292419 145199 -104418
11975 -418258 111926 157189 -200925 203053 109047 233882 17614 -275992 -345646 -268137
11965 -268137 -32552 194221 114732 188260 145376 -230621 8336 -16291 -49251 -239242 199683
11953 239858 11858 -347407 45428 88602 -166314 135962 44416 -73093 88771 155418 40381
$$ packed form
12032A079O7340k4410R9559k0303h5532j65682B38078C774a134A49098j9724n9514
12020F9860b51776O1864H3531b23985j02223F832B925Q0739d2969K1446A72870
12008A68243N1333K8016a90861i2574E4211B2076B365b27557a04072L5464A2251
11996F0971J65062J80149d60040A21864b83348i953n35246C36979A16232j768
11986A14464K5210a31834A12134b32557Q5807Q891B9660b92419A45199a04418
11975d18258A11926M5263b00925B03053r4006J24835A7614b75992o9654P7509
11965b68137c2552A94221p9489P3528m2884b30621H336a6291l2960j89991A99683
11953B39858A1858c47407D5428M3174a66314A35962D4416g3093H8771O6647D0381
$$ plain form
11941 -342704 12544 -83501 168826 -120781 15426 243643 -390807 -308847 11267 33855 -21345
11929 -157437 -82532 -22137 78436 178893 -62979 -39222 -43538 232585 -16561 -127136 16631
11917 76350 -28911 -896 -106651 237458 -403997 24302 -114485 -153914 -31209 -42749 118484
11905 -303078 89139 88450 254787 -25396 -14169 -138724 -151517 -109556 -63265 257 261761 19434
11892 132568 8448 -94571 73845 69454 -282337 28426 14805 -255360 -361605 77415 -150042
11880 -192620 70745 -103916 -137375 -100804 23073 -170090 263576 -148981 -101366 -166741 -219957
11869 -219957 -22391 351665 493669 -284323 -106388 -7466 104667 -218526 -156138 -327912
11859 -327912 -158707 38863 152790 127305 219297 352482 106491 -199395 -4546 -84553 47869
$$ packed form
11941c42704A2544h3501A68826a20781A5426K28217c90807Q1960A1267K2588b1345
11929a57437P4905b2137G8436J00457f2979K3757m316B32585a6561j10575A6631
11917G6350b8911h96j05755B37458d03997B4302a14485l9429c1209j1540A18484
11905c03078H9139o89J66337b5396J1227j24555j2793M1961M6291B57K61504A9434
11892A32568H448i4571G3845m391b82337B8426j3621b55360j06245G7415a50042
11880a92620G0745a03916l3459L6571B3073a70090B63576a48981M7615o5375n3216
11869b19957b2391C51665J42004b84323a06388g466A04667b18526O2388j71774
11859c27912a58707C8863J13927k5485R1992J33185A06491a99395d546q0007D7869
$$ plain form
11847 -288404 -390974 -27023 6615 -99561 372641 -81409 -164580 95917 -237481 -71140 29468
11835 195416 -3411 213252 -121889 176662 -32047 -29886 160974 -61671 -212691 92736 -100710
11823 -78455 -41045 117597 -91285 -123755 235041 122669 302140 21615 -131717 -47419 183016
11811 404943 -114901 -316525 -91482 18943 392810 228867 215791 19553 -51624 62841 -335866
11799 238345 -125859 224415 62260 -312740 -176300 265475 -124685 -268920 110981 -125648
11788 -46844 60884 19425 -326864 -102317 -46728 -45191 108326 331762 -341926 -57042 -72093
11777 -72093 -130839 -170682 -140452 -316465 -112515 21581 -271060 -266115 313638 -344646 353467
11765 54273 205425 -84620 -128720 -309190 -94979 -317707 -39798 70561 -10430 -269166 190960
$$ packed form
11847b88404j02570b7023F615i9561C72641h1409q3171I5917b37481g1140B9468
11835A95416c411B13252a21889A76662c2047K161A60974f1671j51020I2736a00710
11823g8455L7410A17597i1285l2470B35041j12372J79471B1615a31717d7419A83016
11811D04943a14901k01624i1482A8943L73867j63943j3076A9553e1624F2841c35866
11799B38345a25859B24415F2260c12740J36440B65475a24685j44235A10981a25648
11788d6844F0884A9425c26864a02317d6728J537A08326K23436c41926e7042j5051
11777g2093n8746l9843L0230j76013a12515B1581b71060M945C13638c44646C53467
11765E4273J51152h4620m4100j80470i4979k22728c9798G0561a0430k58736A90960
$$ plain form
11753 -157489 -271180 57418 46593 379284 188654 -93489 -168036 -234301 -11686 222575 -50277
11741 265416 204143 -8908 27974 -319771 89565 -234797 -162390 -25500 -91190 14736 -323422
11729 35419 -67134 105032 -286458 -40873 -213643 126684 -186643 233105 -239609 -155556
11719 -155556 -162634 332579 281526 -38899 -40230 301471 117780 225159 49821 41111 -76394
11707 -104864 -32994 -21994 -412734 451272 59287 175549 -305599 -166204 130874 -194907
11696 -185649 -207143 206291 -156679 73383 8560 76462 -109821 -60350 268144 359302 -476
11684 -103539 257082 13676 -47726 219097 -177033 105574 222029 -912 -4663 52662 -82696
11672 -174625 -41826 92051 273067 -133366 81502 76360 352395 -171819 -86917 -257010 -140102
$$ packed form
11753a57489j13691E7418j0825L32691A88654i3489p4547o6265a1686B22575e0277
11741B65416o1273h908B7974c19771H9565b34797P2407b5500o5690A4736c23422
11729C5419f7134A05032b86458d0873j72770A26684a86643B33105b39609Q4053
11719a55556p078C32579n1053c8899j331C01471A17780J07379D9821q710g6394
11707a04864c2994J1000l90740D51272E9287J16262c05599J39395A30874a94907
11696a85649k1494B06291a56679G3383H560O7902a09821M9471B68144R1158d76
11684a03539B57082A3676d7726B19097a77033A05574J16455i12l751E2662h2696
11672a74625d1826I2051J81016a33366H1502n142K76035a71819Q4902j70093J16908
$$ plain form
11661 -140102 -50892 -100735 226997 114178 148917 159640 -47691 -292617 204288 204784 295295
11650 295295 -36760 306577 108846 114216 -234077 124958 94424 144595 52840 -211942 314406
11638 58257 54933 -154942 59418 23659 44785 -21213 44794 -229686 57795 -216685 61786
11626 533572 286323 -230194 173827 435492 -187112 -53295 104648 -242730 265102 -174413
11615 -145428 315667 29016 87136 -11117 -95768 -327808 -115479 -246593 174117 -210255
11604 176294 115498 113890 -5291 -205279 38865 -17970 113204 10373 62341 -20966 -75771
11593 -75771 -23571 183440 230364 49151 114368 207009 175442 414382 -24028 244904 176971
11582 176971 235025 194642 -122003 183571 29829 78909 -8878 34596 137267 -35574 -282961
$$ packed form
11661a40102e0892m9843B26997j12819L4739J0723d7691k44926B04288M96R0511
11650B95295c6760C06577A08846N370b34077A24958l0534N0171E2840b11942C14406
11638E8257l324a54942E9418B3659K1126b1213D4794b29686E7795b16685F1786
11626E33572k47249b30194A73827K61665a87112e3295A04648b42730B65102a74413
11615a45428C15667B9016N8120a1117q4651k32040a15479j31114A74117b10255
11604A76294o0796j608e291j99988C8865a7970A13204A0373N1968b0966n4805
11593g5771b3571A83440M6924D9151O5217R2641l1567K38940b4028B44904o7933
11582A76971N8054m0383a22003A83571B9829M9080h878C4596J02671c5574k47387
$$ plain form
11571 -282961 -41558 -12443 -29142 174805 276354 -1695 -52689 526746 249021 361202 -8508
11559 207841 -146292 53005 132214 -21794 55412 -96329 -145694 69628 -106851 69424 98518
11548 98518 22402 92578 -234381 101415 266822 -309176 106992 -58702 -116142 -6303 -241397
11537 -241397 -20585 -72268 61664 224687 34611 45104 32225 176059 261181 -22009 88056
11525 10210 370196 284037 286342 -116773 119849 3024 -25791 -242914 -14051 -248336 -100330
11513 302826 148733 238625 159058 53257 -61003 188729 515192 295652 129638 132814 -93642
11501 319936 440697 172700 493067 468815 141163 324821 139671 -48542 -23478 138122
11490 196373 123181 286485 397195 -40834 15772 87317 76192 -183612 161960 136237 15599
$$ packed form
11571b82961d1558a2443j6699A74805J01549a695n0994E26746B49021J12181h508
11559B07841a46292E3005P9209b1794E5412i6329m9365F9628a06851F9424K9094
11548I8518B2402P0176b34381A01415J65407c09176A06992e8702n7440f303k35094
11537b41397b0585n1683F1664J63023C4611J0493j2879J43834Q5122b2009H8056
11525A0210L59986q6159K305a16773A19849C024b5791k17123a4051k34285a00330
11513C02826A48733Q9892p9567E3257f1003A88729L26463k19540A29638L176i3642
11501C19936J20761A72700L20367k4252A41163J83658A39671d8542b3478A38122
11490A96373p3192J63304J10710d0834A5772P1545j1125a83612A61960k5723A5599
$$ plain form
11478 381401 -230575 203504 207616 543 -54055 86637 601152 364125 -71735 266849 492432
11467 492432 245095 -10511 129130 -68871 141012 205373 367128 283417 16593 238234
11457 238234 -65474 189116 161471 107755 243815 346824 -38486 280288 460712 -181825
11446 7772 -43681 21477 -114633 -66388 -49009 -192043 -210419 379360 -369981 -65377 278037
11434 -22469 292356 -241285 274012 -13903 -81173 215850 23267 319583 189900 -84484
11423 -38762 -5319 198422 77098 181009 -116894 -142563 -134005 -282796 583 -57219 180733
11411 -3467 322258 -117499 -80526 -58935 -106577 208224 -41223 168166 410559 -60710 319459
11399 -232455 279803 286463 194085 -194152 56186 -195394 177307 -546635 -28669 155525
$$ packed form
11478C81401b30575B03504M112E43e4055H6637N14515k37027g1735B66849K25583
11467D92432B45095a0511A29130f8871A41012O4361J61755q3711A6593K21641
11457B38234f5474A89116k7645n3716J36060J03009c8486B80288J80424a81825
11446G772d3681B1477a14633M8245J7379j43034j8376C79360c69981f5377B78037
11434b2469B92356b41285B74012a3903o7270B15850B3267K96316j29683h4484
11423c8762e319A98422G7098J03911a16894k5669Q558j48791E83e7219A80733
11411c467C22258a17499L6973K1591m7642B08224d1223A68166K42393f0710C19459
11399b32455B79803O660r2378a94152E6186a95394A77307e46635b8669A55525
$$ plain form
11388 211542 -95887 118358 -222961 -228021 233428 253982 163859 210489 -77958 155803 174102
11377 174102 113136 40329 -68963 223956 -220999 -316127 -5515 116889 -20350 191563 38653
11365 -153186 -214615 180603 -18209 4882 114891 32679 256019 -10628 -43306 268795 -247932
11353 31887 24842 46244 43123 31517 -267113 -58846 104566 -154203 -129151 187296 -112386
11341 43433 117513 -207734 -252342 -66284 28795 -213510 -140303 -76482 93773 -307726 -333215
11330 -333215 -234879 -14544 -65173 -13133 187145 -366742 -70823 -101800 228292 -356983 19820
11318 -27691 172839 -22343 88890 -58021 463 36634 -96263 -93050 -292088 -59784 -223271 -150682
11306 -150682 40780 -11190 -103167 322461 179983 77889 -163347 -385071 57190 6070 -246080
$$ packed form
11388B11542i5887A18358b22961n060B33428K0554r0123M6630g7958A55803J8299
11377A74102o0966D0329f8963B23956b20999r5128e515A16889b0350A91563C8653
11365a53186o1429A80603a8209D882J10009C2679K23340a0628l2678B68795b47932
11353C1887p045K1402l121j1606b67113e8846A04566a54203K5052A87296a12386
11341D3433P4080b07734m4608f6284B8795b13510P3207O3821I3773c07726k5489
11330c33215R8336a4544n0629a3133A87145c66742g0823l0977B28292c56983A9820
11318b7691A72839b2343H8890e8021D63L6171i6263L213j99038e9784j63487P2589
11306a50682D0780a1190r1977C22461j42478G7889a63347k21724E7190F070b46080
$$ plain form
11294 -40292 -277953 366095 -40595 92554 167093 8318 -124082 -231634 -112794 38346 -217338
11282 126744 -116415 -233677 -121845 -306901 327688 192864 227886 -8210 -227368 -372821
11272 -372821 117764 195675 -79251 56048 145106 253435 -151862 -36168 -154551 312549
11261 -79209 24914 -107805 36077 -345270 -190392 270002 212276 -166131 -241087 105742
11250 -64932 7644 -221867 13631 -16810 211080 18147 -155579 14307 -261083 152674 -304361
11238 372462 -119663 -56908 27491 -231068 1985 -136981 -211197 119481 -126587 312684
11227 -436 118923 70945 -400054 211534 -177939 -179406 -17070 -206161 -381726 350461 -216611
11215 -169119 112129 -177977 155736 -50084 -346330 62839 -397698 -24389 -333031 -315538
$$ packed form
11294d0292k37661C66095d0595I2554P4539H318a24082j07552a12794C8346b17338
11282A26744a16415j17262J11832j85056C27688j34824L5022h210k19158j45453
11272c72821A17764P7911g9251E6048Q9058J08329a51862c6168j18383C12549
11261g9209B4914a07805C6077c45270J54878B70002n7726a66131p4956A05742
11250f4932G644b21867A3631a6810B11080A8147a55579A4307b61083A52674c04361
11238C72462a19663e6908B7491b31068A985a36981p4216A19481a26587C12684
11227d36A18923m7978d00054B11534a77939j467a7070j89091j75565C50461b16611
11215a69119A12129a77977A55736e0084k96246F2839c97698b4389l08642J7493
$$ plain form
11205 -315538 -354504 -149022 169675 -288846 -148521 -102178 -114298 51673 100199 16127 -164207
11193 80135 369029 186340 153300 -39632 145414 74071 -349920 4732 -171616 -76424 175934
11181 40777 -187142 185369 27982 301019 -112840 11062 116097 -79320 -253297 26084
11170 349158 90365 311909 -202597 19726 -213424 253270 -185708 -17898 -41326 -85552
11160 -85552 -89024 76140 157579 95061 -53993 35761 -174432 342408 303424 -115425 -132456
11149 -132456 -163348 45826 199126 -8847 169879 48176 -231777 -335613 260460 95431 47326
11137 -76432 158125 19621 -311654 187416 220358 22394 -106680 -49309 12009 193375 341662
11126 341662 41823 -129994 350464 -154284 100356 -355553 -135938 220616 22968 101533
$$ packed form
11205c15538l8966a49022A69675b88846J40325M6343j2120E1673M8526A6127a64207
11193H0135K88894j82689l3040c9632A45414p1343c49920D732a71616g6424A75934
11181D0777a87142A85369B7982K73037a12840A1062J05035g9320j73977B6084
11170C49158I0365K21544b02597A9726b13424B53270a85708a7898k3428m4226
11160h5552l472G6140Q1439o2518e3993C5761a74432C42408l8984a15425j7031
11149a32456l0892D5826J53300h847A69879D8176b31777j03836B60460I5431D7326
11137g6432A58125A9621c11654A87416L2942B2394a06680d9309A2009J81366J48287
11126C41662D1823a29994C50464a54284A00356c55553a35938B20616B2968P8565
$$ plain form
11116 101533 58202 -31104 -161263 106485 184598 346097 20815 139018 145474 -235392 264215
11104 217947 147474 144615 22890 519420 165980 -15154 54688 374167 281402 48054 469720
11093 469720 55451 461185 32328 -69182 196858 112029 -41882 723541 -125400 577068
11082 503274 222661 158166 384098 87496 463872 571503 419653 385618 286938 130337
11071 505485 628432 292934 525273 382347 358536 547903 233254 702661 626726 808047
11061 808047 446573 271479 1009744 449606 780186 1021848 799558 673720 732641 1063030
11051 1063030 744815 1172460 800361 649334 1170909 917754 992345 953181 961382 953693
11041 953693 1051372 1007580 730281 960031 758167 789877 915505 638720 828680 879547
$$ packed form
11116A01533m3331c1104j30159A06485P8113J61499B0815J18203O456b35392B64215
11104B17947p0473k859B2890M96530A65980a5154E4688L19479r2765D8054M21666
11093D69720E5451M05734C2328f9182A96858q4829d1882G23541a25400E77068
11082E03274B22661o4495K25932H7496L76376J07631j51850l4035r8680A30337
11071E05485J22947B92934K32339j42926k3811J89367B33254M69407p5935J81321
11061H08047l61474j75094P38265D49606L30580K41662k22290j25838N8921L30389
11051A063030l18215M27645l72099j51027N21575k53155P4591l9164Q201p689
11041I53693R7679m3792k77299K29750k01864L1710J25628k76785J89960N0867
$$ plain form
11031 879547 532038 1117034 809215 692623 776674 771886 905337 741346 1014915 742468
11021 742468 667756 864247 675713 699813 771678 832561 653432 1161265 876952 706842
11011 706842 750320 944652 584201 616510 740182 545930 551606 767446 1088047 629604
11001 629604 1048147 824227 989827 1160031 722701 901387 783976 1055421 959968 795262
10991 795262 1014967 1000159 715115 877877 925697 1121922 1111998 1312814 1406563 1209419
10981 1209419 1452721 1593460 1824304 2135511 2220037 3026406 2966805 3315501 3583941 3690732
10971 3690732 3317778 3541297 3042406 2486965 2303167 1965852 1860718 1400811 1714139
10962 1714139 1822447 1617232 1680960 1793608 1499169 1435075 1270886 1421623 1135245 1178197
$$ packed form
11031H79547l47509N84996l07819j16592Q4051m788J33451j63991K73569k72447
11021G42468p4712J96491j88534K4100P1865O0883j79129N07833k84313j70110
11011G06842M3478J94332l60451L2309J23672j94252N676K15840L20601m58443
11001F29604M18543k23920J65600J70204m37330J78686j17411K71445r5453j64706
10991G95262K19705j4808k85044J62762M7820J96225r924K00816R3749j97144
10981A209419K43302J40739K30844L11207Q4526Q06369n9601L48696K68440J06791
10971C690732l72954K23519m98891n55441j83798l37315j05134m59907L13328
10962A714139J08308k05215O3728J12648k94439o4094j64189J50737k86378M2952
$$ plain form
10952 1178197 609187 608512 709098 572630 407606 338189 527644 221972 369006 626829
10942 626829 434749 190606 -56658 -12746 170056 218911 105973 97086 -110358 -29827 33467
10930 224040 212220 127147 421731 33259 57190 77659 -225068 81681 -78632 -193875 218310
10918 -62035 35736 18588 268399 72689 -103856 331768 114060 59659 118830 9020 -48719
10906 -150028 316491 -188009 -221794 214113 -267617 -85999 -105354 109126 -218106 195168
10895 -195102 -22613 -50543 -128263 212247 93448 -6453 -90132 -107778 -133196 204756 -87656
10883 66540 -303500 113910 20055 -10900 122912 69460 -225518 -112970 -88565 -60439 116281
10871 367635 -63831 -62224 70764 -233376 511310 -99828 8125 -46497 33109 -18412 -105088
$$ packed form
10952A178197n69010o75J00586j36468j65024o9417J89455B21972J47034K57823
10942F26829j92080A90606e6658a2746A70056M8855A05973q887a10358b9827C3467
10930B24040j1820q5073K94584C3259K3931K0469b25068H1681g8632j15243B18310
10918f2035C5736j7148K49811G2689a03856C31768A14060n4401N9171I020d8719
10906a50028C16491a88009l3785B14113b67617h5999j9355A09126b18106A95168
10895a95102b2613k7930p7720B12247I3448f453q3679j7646k5418B04756h7656
10883F6540c03500A13910B0055a0900A22912n3452b25518J12548K4405K8126A16281
10871C67635f3831J607G0764b33376E11310i9828H125d6497C3109a8412q6676
$$ plain form
10860 -105088 13504 -278273 -177955 221423 115521 -360008 -290321 40578 195466 104486
10850 104486 -141777 67983 23823 -159545 -163446 -68473 -3118 107435 333303 -283944 125020
10838 138468 -29117 -138525 -65535 -140981 74538 57820 -182170 484852 -70366 -465297 132103
10826 -365605 -330898 394061 155080 -104743 72324 133388 -198578 -315388 -86468 135633
10815 -120632 -162472 169851 -52882 68823 72939 24030 -131862 97012 -80990 130966 -167462
10803 89316 -217380 616703 -306622 -175328 56635 -43490 36112 90270 -114363 -314939
10793 -314939 -298986 12358 -160555 361525 -3472 18644 150391 3882 61020 -44047 -256395
10782 -256395 -61157 -28653 -363055 -103771 -143985 -66768 99616 -180537 165651 32963 194119
$$ packed form
10860a05088A3504b78273J00318B21423j05902c60008O9687D0578J54888r0980
10850A04486a41777F7983B3823a59545l901f8473c118A07435K25868b83944A25020
10838A38468b9117j09408f5535p5446G4538j6718a82170D84852g0366l94931A32103
10826c65605L4707C94061A55080a04743G2324O1064a98578j16810h6468A35633
10815a20632m1840A69851e2882F8823M116B4030a31862I7012h0990A30966a67462
10803H9316b17380F16703c06622J31294E6635d3490C6112N4158a14363k00576
10793c14939J5953A2358a60555C61525c472A8644J31747C882N7138d4047k12348
10782b56395f1157b8653l34402a03771m0214f6768I9616a80537A65651C2963J61156
$$ plain form
10771 194119 272697 324292 -303074 -204217 -468534 -175155 92077 -26365 193615 -415750
10760 -147133 -92641 -112240 -38427 -324056 -338276 52777 113031 -91209 -69095 317840 260682
10749 260682 -2990 -110392 224430 -125001 -152232 99908 -111409 -175669 208946 -67993 21936
10737 -111445 -73820 71895 214818 -64893 -279135 -165864 -24913 46942 125400 12932 207322
10726 207322 -175668 -306140 -216415 81609 -201051 -208311 5010 53796 -94003 -27985 -254785
10715 -254785 -43846 -58835 178760 266788 -46015 -330288 429835 -324402 -332038 -54886 -112279
10704 -112279 -145056 -214163 -323017 -135606 -90856 120230 262090 265090 91296 -118727 81079
10692 -220177 -105246 -241696 98956 -240328 -101193 -115425 -170757 -98081 123348 -6241 4968
$$ packed form
10771A94119P8578N1595c03074R8857k64317a75155I2077b6365A93615d15750
10760a47133N4492j9599c8427k85629j4220E2777O0254i1209K2114C17840n7158
10749B60682b990j07402B24430a25001k7231I9908a11409o4260B08946f7993B1936
10737a11445L7625G1895J42923f4893k14242J13271b4913D6942P8458A2932J94390
10726B07322a75668j30472Q9725H1609b01051p260E010M8786i4003b7985k26800
10715b54785d3846j4989A78760Q8028d6015k84273D29835c24402p636e4886n7393
10704a12279l2777o9107j08854a35606M4750A20230J41860L000I1296a18727H1079
10692b20177a05246j36450I8956b40328a01193j4232n5332P2676A23348f241D968
$$ plain form
10680 -124167 69663 71455 -162313 -187785 266778 -256929 -55032 251390 90956 -226931 33100
10668 -40 143893 -168862 236866 -10477 -276816 -119437 -519575 131818 88558 190461 -95581
10656 13690 -33426 -225481 -199975 -69317 -82737 122397 -241754 -124820 -350294 65337 -100168
10644 130640 -269811 135499 57387 249895 -188446 354523 -126236 -56388 126072 -320608
10633 -33766 45651 -409147 -24551 -137850 -13267 -93295 142076 -195018 -5153 197068 -296347
10621 -240525 -131584 120827 -104801 -73524 -10326 -134474 596956 271858 8264 -30605
10610 9276 -289102 -57879 -177141 259103 2458 16291 159037 129173 -110385 31298 -88462
10598 47175 -317658 132012 54102 -279196 106864 -63928 17094 23086 -28249 -87378 -6539
$$ packed form
10680a24167F9663J792a62313k5472B66778b56929e5032B51390I0956b26931C3100
10668d0A43893a68862B36866a0477k66339a19437m00138A31818m3260J01903i5581
10656A3690c3426j92055K5506f9317j3420A22397b41754J16934k25474F5337a00168
10644A30640b69811A35499E7387J92508a88446C54523a26236e6388A26072c20608
10633c3766D5651d09147b4551j13299a3267q0028A42076a95018e153A97068b96347
10621b40525J08941A20827a04801L1277a0326j24148E96956B71858H264c0605
10610I276b89102e7879j19262B59103B458J3833J42746k9864a10385C1298h8462
10598D7175c17658A32012E4102b79196A06864f3928A7094N992b8249n9129f539
$$ plain form
10586 26299 26958 -333301 -14278 -159358 -185219 -201429 -333525 -268331 128212 78837 -260783
10574 -32649 -67911 -38230 -142328 94954 -191337 113593 -471521 149083 57423 -98371 237722
10562 126740 -64321 52801 261188 -134398 -36489 71654 -60686 -73555 5166 33438 15447
10550 78964 240381 88937 -128576 108609 391361 32992 31132 189 -8361 -309168 -119900
10538 -143958 -18315 -218535 166281 -18038 -176698 111938 14840 74973 -145324 -151067 -22224
10526 22199 456469 -13110 160743 76933 -66654 -109842 -127196 149692 -211477 206504 36638
10514 218211 -136311 30433 -24057 -351093 227402 -127838 8264 -69738 -250478 -341271 -32625
10502 -451044 -31495 -79938 -115332 -176565 -378291 27820 195918 145093 231781 -46865 -74538
$$ packed form
10586B6299O59c33301a4278j45080k5861j6210j32096O5194A28212m9375b60783
10574c2649l5262K9681j04098I4954a91337A13593d71521A49083E7423i8371B37722
10562A26740f4321E2801K08387a34398c6489G1654f0686j2869E166K8272A5447
10550G8964J61417H8937a28576A08609K82752C2992j860A89h361l00807a19900
10538a43958a8315k00220A66281a8038j58660A11938A4840O0133a45324n743b2224
10526B2199M34270a3110A60743G6933f6654m3188j7354A49692b11477B06504C6638
10514B18211a36311C0433b4057l27036B27402a27838H264f9738j80740r0793c2625
10502d51044c1495m8443l5394o1233k01726B7820J68098n0825Q6688d6865k7673
$$ plain form
10491 -74538 -29445 -324110 -102450 84848 -22826 310349 390820 380360 385996 180236 -65035
10479 106560 281463 -220848 -12424 82195 -323330 -95971 130206 -166185 -72858 147962
10468 -75063 -75879 154394 -65980 220465 87189 273439 -38005 38325 115893 343553 -99233
10456 -79622 90719 -155156 9362 -85012 -141677 140352 1859 -187975 -146631 35544 -193467
10444 98099 -66150 -47107 124525 93324 265400 313714 118967 69664 57114 -49490 -163759
10433 -163759 78382 432192 -142050 -44486 112679 165109 -221891 9440 130463 120029 35295
10421 216026 150497 -161750 -120275 -216957 -208637 63671 -11421 -90709 9255 -382967 368893
10409 -333357 75742 -171156 -124842 124998 15101 426213 -369721 -253786 -61955 113198
$$ packed form
10491g4538b9445k94665a02450H4848b2826C10349Q0471j0460N636A80236f5035
10479A06560J74903b20848a2424H2195c23330i5971A30206a66185g2858A47962
10468g5063q16A54394f5980B20465H7189J86250c8005C8325P7568K27660i9233
10456g9622I0719a55156I362h5012n6665A40352A859a87975M1344C5544a93467
10444I8099f6150J9043A24525l1201J72076M8314A18967m9303j2550d9490j14269
10433a63759G8382L53810a42050d4486A12679N2430b21891I440J21023j0434C5295
10421B16026o5529a61750M1475r6682Q320F3671a1421p9288I255c82967C68893
10409c33357G5742a71156M6314A24998A5101M11112c69721J15935f1955A13198
$$ plain form
10398 -68259 -101300 -185965 -101153 -189945 170184 91767 440657 439183 -54047 240939 108187
10386 24412 -55841 -129490 -178861 172678 277401 120307 -223462 249782 415407 244911
10376 244911 69550 423584 213417 201409 439114 273047 584043 499447 335816 607094
10366 607094 472316 551054 839570 153188 384323 444108 302320 56578 500715 52362
10355 469449 544868 520646 438929 509382 668110 515953 564511 129753 517288 398464
10345 398464 350351 526247 438835 -193798 14355 -201619 31247 500527 404889 -38189 446488
10333 -121324 170445 35601 171304 232577 13281 499739 365032 8596 137279 328282
10323 328282 576593 270560 10381 533312 -23817 -140688 141361 -20809 52515 -68557
$$ packed form
10398f8259l3041q4665Q4812q8792A70184p8417L48890j474e4047B40939A08187
10386B4412e5841p3649m9371A72678J04723A20307b23462B49782J65625j70496
10376B44911F9550L54034k10167j2008K37705j66067L10996q4596j63631K71278
10366F07094j34778P8738K88516A53188K31135N9785j41788E6578M44137E2362
10355D69449P5419k4222q1717P0453J58728j52157M8558A29753L87535j18824
10345C98464m8113J75896q7412a93798A4355b01619C1247M69280r5638c8189D46488
10333a21324A70445C5601J35703O1273A3281M86458j34707H596J28683J91003
10323C28282K48311B70560A0381N22931b3817j16871A41361b0809E2515f8557
$$ plain form
10312 -221209 -124009 214653 88762 -19495 -214629 -54955 -27315 198585 -5973 327404 144491
10300 34578 261974 339053 35773 22183 -291210 288990 -234542 -251473 -338652 -117089 429879
10288 -275727 -29802 38908 -255475 -45636 -271531 -328430 98529 -114426 -135464 44534 291776
10277 291776 33147 -12241 251523 -55150 95448 -341259 -236459 104819 142889 257344
10267 257344 -238398 559608 -13882 554187 -26259 232032 311557 38482 225446 -116361
10256 324125 -68982 162607 138433 97838 163070 -72310 -33767 -186656 8772 8740 -196709 337987
10243 80535 21094 -27639 56827 26629 22631 -203168 -118039 -162198 -97236 -38788 -88520 -74071
10231 -74071 101307 -203387 104517 -10737 121582 167282 -46015 65846 16130 -133870 -239443
$$ packed form
10312b21209R7200B14653H8762a9495j95134e4955b7315A98585e973C27404A44491
10300C4578K27396P7079C5773j3590b91210B88990b34542j6931q7179a17089D29879
10288b75727b9802C8908b55475d5636k25895n6899I8529a14426k1038D4534K47242
10277B91776C3147a2241B51523e5150I5448c41259J04800A04819L8070J14455
10267B57344b38398E59608a3882E54187b6259B32032P9525C8482J86964a16361
10256C24125f8982A62607k4174m0595O5232g2310c3767j52889H772l2a96709C37987
10243H0535B1094b7639E6827B6629l998b03168Q5129m4159O4962c8788m9732J4449
10231g4071A01307b03387A04517a0737A21582M5700d6015F5846A6130a33870j05573
$$ plain form
10220 -239443 -173701 279246 89985 -12536 186082 -87692 -233077 58221 -221520 -391344
10210 -391344 256946 -150101 15126 13634 -69688 259301 202613 -220703 -204166 26456 -294527
10198 25703 73144 206191 -120662 -33309 -103938 -146408 13963 14477 35440 -577617 -1910 397764
10185 -171960 23418 -235978 -13559 -282674 55937 -275866 2870 -523462 58499 -191239 -131726
10174 -131726 -10308 258131 -242764 346015 -113210 -92752 370083 48685 -101375 -202443
10164 -202443 6792 5465 -48318 276474 -87573 98280 51039 9946 66569 -55474 -158599 -82438
10152 -82438 -335016 131802 117138 -223524 -109007 -93720 60934 107559 175977 179706 39525
10140 -82933 152744 -89288 -72716 166719 -88464 -43165 -335290 -14955 -151620 176196 -62924
$$ packed form
10220b39443O5742B79246H9985a2536A86082h7692j45385E8221b21520j69824
10210c91344B56946a50101A5126j492f9688B59301n6688b20703J6537B6456b94527
10198B5703M7441J33047a20662c3309p0629m2470A3963N14K0963e77617a910C97764
10185a71960B3418b35978a3559k69115E5937b75866B870e23462E8499a91239N9513
10174a31726a0308B58131b42764C46015a13210K0458C70083D8685a01375j01068
10164b02443F792j327d8318B76474h7573I8280m7241I946N6623e5474j03125P6161
10152h2438k52578A31802j4664b23524a09007J5287F0934M6625O8418L729C9525
10140h2933A52744h9288J6572A66719h8464d3165k92125a4955j36665A76196f2924
$$ plain form
10128 -3127 -180387 -354967 -344518 75071 -209054 -461277 -258644 -189694 -117223 -318156 -175743
10117 -175743 54452 109905 56256 -174785 26471 -130942 -234833 -87658 -399498 -94729 130900
10105 139265 -144052 28530 -453019 174637 -137039 -307901 78176 -416925 447464 -291675
10094 -3538 -98193 53916 -89911 -428638 -112390 -82754 -289389 -19801 126344 -489336 59089
10082 -298289 -142554 -19899 -149765 147703 107364 -114064 -72421 173181 -178325 -29394
10071 -79363 -251411 37816 372233 92027 -202289 28244 -139342 221744 13711 -64644 633639
10059 222469 -62878 -161067 -119156 -100664 -160806 -36557 381715 -50578 124393 -85301 -140182
10048 -140182 -57362 -411549 -91460 -24322 105214 256638 -6747 272116 9160 46611 -60214
$$ packed form
10128c127j77260j74580J0449G5071b09054k52223K02633O8950P2471k00933J42413
10117a75743E4452N5453n3649a74785B6471a30942j03891h7658l11840i4729A30900
10105A39265a44052B8530d53019A74637a37039j70862G8176d16925D47464b91675
10094c538r4655E3916h9911l38727a12390K9636k06635a9801A26344d89336E9089
10082b98289a42554a9899j29866A47703m0339a14064M1643A73181a78325b9394
10071g9363j72048C7816L34417I2027b02289B8244a39342B21744A3711f4644F33639
10059B22469f2878r8189M1911J8492o0142c6557C81715e0578A24393h5301n4881
10048a40182e7362l54187i1460b4322A05214J51424f747B72116I160L7451f0214
$$ plain form
10036 -220365 188767 -293422 -187760 128331 -146299 -336602 -94650 -174304 127391 201050
10026 201050 305707 132104 -343203 -102885 37678 -42331 -159085 -292132 229749 -52229
10015 -325071 104413 182961 -152637 205356 90321 334438 -222549 114327 341861 -318712
10004 38831 -607116 -179765 95847 -29555 -178683 -308695 -94871 -170090 382736 -262662
9993 -130960 246241 -37806 -221581 -31553 168058 -221215 40271 23169 -87284 106241 -421808
9981 -368777 -270930 49854 -125443 -235779 235351 -290960 8862 341096 -339121 -467146
9971 -467146 155163 -114685 10545 -77612 -309463 213129 -206430 -30582 230105 9432 140045
9960 140045 -190752 -276044 -59289 -92217 -51310 67842 158807 3316 -279861 48434 -35092
$$ packed form
10036b20365A88767b93422J05662A28331a46299j90303i4650p9654A27391P3659
10026B01050J04657A32104c43203a02885C7678d2331j16754j33047B29749e2229
10015c25071A04413P8548a52637B05356I0321K44117b22549A14327K27534c18712
10004C8831f07116a79765I5847b9555j49128j30012i4871p5219C82736b62662
9993a30960B46241c7806j83775c1553A68058b21215D0271j7102h7284A06241d21808
9981c68777R7847D9854a25443j10336B35351b90960H862L32234c39121j28025
9971d67146A55163a14685A0545g7612k31851B13129b06430c0582B30105I432J30613
9960A40045a90752q5292e9289l2928M0907F7842R0965C316b79861D8434c5092
$$ plain form
9948 184056 167696 -123897 -390145 10441 -342545 -220910 -122843 -108640 -193737 -17712 83646
9936 -201953 -45451 -76219 26655 -72676 70873 -26126 88623 -228135 438603 -13816 -110332
9925 -110332 -126655 -326279 -16904 -303143 85963 -129989 -455 9753 -162272 55489 -94232
9913 -60998 -161252 -237579 184861 -18340 -79474 -113199 145561 -76665 82215 -163415 103227
9901 67106 -42022 178203 -319883 74057 274297 105255 128818 -112291 24195 150146 220507
9890 220507 108295 -135809 -265499 -137997 -281408 -40931 148167 135017 85844 68589
9880 68589 251227 94202 -338265 103940 30310 -81920 213277 -86473 -293812 39744 -212636
9868 34648 13742 -213037 83826 80811 -36710 124611 28605 -198079 -157216 49859 -11290
$$ packed form
9948A84056j6360a23897k66248A0441c42545J21635R8067J4203q5097a7712H3646
9936b01953d5451l0768B6655g2676G0873b6126H8623b28135D38603a3816r6516
9925a10332j6323j99624a6904k86239H5963a29989d55I753a62272E5489i4232
9913f0998j00254p6327A84861a8340o1134l3725A45561g6665H2215a63415A03227
9901F7106d2022A78203c19883G4057K00240A05255K3563a12291B4195J25951P0361
9890B20507A08295a35809j29690J27502j43411d0931A48167j3150m9173j7255
9880F8589J82638I4202c38265A03940C0310h1920B13277h6473k07339C9744b12636
9868C4648A3742b13037H3826l015c6710A24611B8605a98079M0863D9859a1290
$$ plain form
9856 -105390 -151206 -197856 -611271 411327 75392 215243 -263975 153042 -340137 -137196
9845 -25491 -521499 -130969 21754 66672 -93151 -194973 214690 5799 34224 -244074 -37908
9833 -46268 4088 -18974 34823 -63542 -205777 99544 239590 -119559 -289984 -127767 22743
9821 -305891 -298174 232195 -121669 71869 -107677 -12240 -378534 33084 -6165 -104508 -223503
9810 -223503 -109113 232493 -178533 -279316 128623 -37360 -82180 76020 -50148 -104304 294000
9798 -402264 -17990 38075 -555573 37023 584309 80643 -35553 120775 -337201 -370487 -247988
9787 -247988 -157069 409793 -114621 29948 -234449 -178329 -255818 43989 -379793 -2001 -189309
9776 -189309 52962 143399 4217 65569 -64848 92955 146425 -11072 -8540 118763 -205163 56405
$$ packed form
9856a05390m5816m6650m13415D11327G5392J39851b63975A53042c40137a37196
9845b5491m96008a30969B1754M4918i3151j01822B14690E799K8425b44074c7908
9833d6268D088a8974C4823f3542j42235I9544J40046a19559j70425a27767B2743
9821c05891P717B32195a21669G1869a07677a2240l66294C3084f165r8343j18995
9810b23503a09113B32493a78533j00783A28623c7360m4820G6020e0148n4156B94000
9798d02264a7990C8075e55573C7023N47286H0643c5553A20775c37201l3286J22499
9787b47988R0919D09793a14621B9948b34449N6120p7489D3989c79793b001j87308
9776a89309E2962R0437D217O1352f4848I2955N3470a1072K532A18763b05163E6405
$$ plain form
9763 -229603 15221 20769 -277418 -216739 -85011 -172004 273249 -112893 153455 -82582 -238461
9752 -238461 -472234 -37097 -138759 231093 60167 -104018 -3997 -17250 -277802 -9073 -96580
9741 -96580 -12953 170590 -66094 -131916 187665 -130261 85767 -178580 -19727 -86931 141902
9729 -19457 -271614 37064 -117422 122500 71053 272671 -72698 191025 46599 -204222 -17967
9717 61286 96280 -273088 -174952 -67201 -418 -112269 19142 -276866 47866 13611 -341515
9705 -118750 -66213 -263973 -245401 71019 -121070 -201338 -203117 -66878 -89058 110583 -393133
9693 -268563 -419441 -61712 -157988 -203169 107877 243991 243863 -303072 -47021 16269 146422
9682 146422 87087 -305539 -249971 -72802 205577 -83287 -291277 -979 202500 155502 209963
$$ packed form
9763b29603A5221N548b77418O0679h5011q6993B73249a12893A53455h2582j55879
9752b38461k33773c7097j01662B31093F0167a04018c997j3253k60552i073q7507
9741i6580a2953A70590f6094o5822A87665a30261H5767a78580a9727o7204A41902
9729a9457k52157C7064a17422A22500n1447K01618g2698A91025D6599b04222a7967
9717F1286L4994b73088R8136f7201d18j11851A9142b76866D7866A3611c41515
9705a18750N2537j97760J8572G1019a21070q0268j779f6878k2180A10583c93133
9693b68563j50878f1712r6276m5181A07877J36114j28c03072d7021A6269J30153
9682A46422n9335c05539N5568g2802B05577h3287k07990i79B02500m6998N4461
$$ plain form
9671 209963 142466 18370 -16607 -263114 -953 -601663 -182759 1680 -503 -345746 35344 55116
9659 55116 -98284 -235375 -173653 113499 -165301 -146638 310140 -259509 -246422 209946 -197863
9647 90483 -355524 -192210 -31139 130486 44554 -250235 250220 -192245 -276575 -11067 148492
9635 -113674 197837 122303 155664 -179245 167695 57140 147120 -63095 -35233 -393293 -312921
9624 -312921 -312813 81068 66087 -216087 -137860 -254946 94289 23191 -100303 169427 139694
9613 139694 -28871 -10882 -10414 -213405 -272384 -204142 -262424 -139517 -255203 55367 -99989
9601 -321274 -293150 -58372 -280058 -213313 -225295 307950 27963 -249061 -1886 96304 127120
9590 127120 225268 -119892 -48096 51686 -29344 148052 -251375 189386 -92689 132205 440233
$$ packed form
9671B09963o7497A8370a6607k46507i53o00710a82759A680e03l45243C5344J9772
9659E5116i8284j37091O1722A13499a65301J8663C10140b59509J3087B09946a97863
9647I0483c55524J63314c1139A30486D4554b50235B50220a92245q4330a1067A48492
9635a13674A97837p5534L3361a79245A67695E7140Q9980f3095K7862l58060Q0372
9624c12921J08H1068j4981b16087P8227j17086I4289B3191a00303A69427k9733
9613A39694b8871a0882M68k02991n8979O8242n8282J22907j15686E5367i9989
9601c21274K8124e8372k21686O6745j1982C07950B7963b49061a886I6304L0816
9590A27120R8148a19892d8096E1686b9344A48052b51375A89386i2689A32205L08028
$$ plain form
9579 440233 -79736 140903 39447 -20289 -416063 -42503 -344720 -283349 83015 -102535 -220450
9568 -220450 256570 12881 -22869 -307294 23778 -119691 12913 -34565 73820 -126539 -42214
9556 -98376 56127 -3261 171893 -214632 -47482 -177298 -195490 326148 114937 -84508 -28859
9544 188386 13694 -51859 141389 -83751 244871 104492 -182525 310927 -109535 81022
9533 17834 -313344 -87201 63031 99944 153397 25225 114121 -155301 -244702 -101637 -213373
9522 -213373 102730 -360572 1801 -141343 -64664 -68221 -5438 -300848 -12252 -12793 -68007 -708414
9510 -708414 290067 -119409 17838 -135106 -152920 57258 -131588 -133499 414376 71431 -156512
9498 284039 -401308 -73180 -285320 38885 -278794 67745 15211 -180099 -81259 -148513 105323
$$ packed form
9579D40233g9736A40903C9447b0289l95774d2503l02217O1371H3015a02535j17915
9568b20450B56570A2881b2869k84425B3778a19691A2913c4565G3820a26539d2214
9556i8376E6127c261A71893b14632d7482j29816j8192C26148A14937h4508b8859
9544A88386A3694e1859A41389h3751B44871A04492a82525C10927a09535H1022
9533A7834c13344h7201F3031L6913N3453B5225Q8896a55301q9401a01637j11736
9522b13373A02730c60572A801a41343f4664l557e438k95410a2252n41n5214o40407
9510g08414B90067a19409A7838a35106j7814E7258a31588j911D14376G1431a56512
9498B84039d01308g3180k12140C8885b78794F7745A5211a80099h1259o7254A05323
$$ plain form
9486 -45340 -139220 30027 -46143 128548 -44970 -429608 -202157 -59424 -217429 114196 -175570
9474 32608 97394 61449 51341 -88859 -143063 -74622 -212668 34859 37827 -200577 -296691 98365
9461 -100405 146909 53150 -114391 -191995 191837 61443 -95456 -244736 -288625 -457505 -24890
9449 -95054 44787 -199294 -57273 -431108 -94974 -12960 91443 -190030 304183 56928 310900
9438 310900 161207 14320 -74522 -8810 -109175 -376864 178637 -1735 -107117 -26941 -99308
9427 -99308 -9750 -236005 -55699 71681 -25280 140438 21656 47728 -25197 362511 -351111
9415 -157558 -25232 -302252 -78184 -115150 -142909 92570 29586 86030 -26378 -321032 175742
9403 -179524 40515 -299289 -157634 -149874 -76241 -18372 -97210 -323018 -13555 69142 142344
$$ packed form
9486d5340r3880C0027d6143A28548d4970l84638b02157e9424j58005A14196a75570
9474C2608O4786l5945j0108h8859n4204O8441j38046C4859K968b00577r6114I8365
9461a00405A46909E3150a14391p7604A91837F1443i5456j49280m3889j68880b4890
9449i5054D4787a99294e7273l73835i4974a2960I1443a90030C04183E6928K53972
9438C10900j49693A4320g4522h810j00365k67689A78637a735j05382b6941p2367
9427i9308i750k26255e5699G1681b5280A40438B1656K6072b5197C62511c51111
9415a57558b5232k77020g8184l6966k7759I2570B9586N6444b6378k94654A75742
9403a79524D0515b99289J41655P760P3633a8372p8838k25808a3555F9142P3202
$$ plain form
9392 142344 -280212 120847 194037 50031 25094 -183739 103489 45259 -8179 -41809 132046
9380 -24033 2364 -60001 -53422 35308 130640 -22015 -54445 -185982 -459605 -168238 -319631
9369 -319631 -482854 -88412 -475279 25161 111047 -726 1145 67547 290982 250124 401903
9358 401903 -175621 118343 -40803 64454 -132912 166381 -273945 169788 -145434 -216537
9348 -216537 -31240 -432253 106994 -175891 11788 -126319 -259569 172653 214104 -289317
9337 103471 -200716 35045 95507 -76328 -194514 16711 -192832 -228953 -259766 86085 64384
9326 64384 118009 -92829 -323542 -254705 -61093 -214812 -41806 13425 -325894 -34871 -302521
9315 -302521 -125000 -213269 -224303 -182464 -82615 122714 -161726 5345 -6435 498378 -33109
$$ packed form
9392A42344b80212A20847P3190E0031k4937a83739A03489D5259h179l3630A32046
9380b4033B364f0001O579C5308R5332b2015l2430j31537k73623a68238j51393
9369c19631j63223h8412l86867B5161Q5886g26A145O6402K23435m0858J51779
9358D01903a75621A18343d0803F4454a32912A66381b73945A69788a45434p1103
9348b16537c1240m01013A06994a75891A1788a26319j33250A72653M1451b89317
9337A03471b00716C5045O0462g6328j18186A6711a92832l6121l0813H6085k1701
9326F4384N3625i2829k30713O8837f1093j53719d1806A3425c25894c4871k67650
9315c02521a25000q8269j1034M1839h2615A22714a61726E345f435D98378c3109
$$ plain form
9303 -97133 72705 57472 129433 -107165 -64433 -199295 -293765 -210701 -108902 -206254 -26090
9291 112009 -134846 -80878 -74675 -191147 -142093 -107576 -92116 -12121 -231727 307545 156767
9280 156767 232925 132585 -312643 249919 125881 -86019 91907 152261 -161207 288142
9269 52426 -95549 -142563 385774 -241490 182143 -36785 17457 196829 -439739 205749 -230787
9257 -255353 -336839 -72428 -179368 -7872 -142755 -71816 80975 -20530 -101422 -96819 -257884
9246 -257884 -282406 401948 200967 346644 -297159 177418 -139112 88065 -56757 -99145
9236 -99145 98841 56368 237809 -32669 -79710 -124075 422146 -133092 188883 -160957 105890
9224 -330942 174327 188853 -351654 89215 -8237 -73346 -224369 37297 166400 58492 95672
$$ packed form
9303i7133G2705j5233P1961a07165M2732j34862r4470Q3064J01799r7352b6090
9291A12009a34846N3968O203j16472M9054L4517J5460a2121k19606C07545j50778
9280A56767P6158j00340c12643B49919j24038h6019I1907O0354a61207B88142
9269E2426i5549m7014C85774b41490A82143c6785A7457J79372d39739B05749b30787
9257b55353q1486g2428j06940g872j34883P0939H0975b0530q0892M603j61065
9246b57884k4522D01948B00967J45677b97159A77418a39112H8065e6757m2388
9236i9145I8841m2473J81441c2669m7041m4365D22146a33092A88883a60957A05890
9224c30942A74327J4526c51654H9215h237o5109j51023C7297J29103E8492L7180
$$ plain form
9213 95672 -85009 76140 -10006 174946 -140332 43778 -158919 -69706 -265828 -183069 2457
9201 -28784 -138610 20313 -40233 -143527 124962 -65201 -28389 44067 -146337 -160340 -208298
9190 -208298 124531 -323268 -221725 -69017 -102050 143971 -76715 -341020 154166 -234350
9179 -126684 -50846 -92113 -294978 -56372 -232601 25287 -773 133072 -34157 -187623 -8648
9167 173768 -86496 -240907 -63052 179563 -165855 -264893 77255 153446 -258337 -15968 40979
9155 -293743 -66514 -148284 -49843 -245638 -324324 -106313 -84923 1084 -177092 67695 -197013
9143 -189608 -901 144439 -143248 -307887 -97561 144258 -141134 -317439 -17423 -38644 -59539
9132 -59539 94601 -146241 101305 -343000 -274842 -263392 334619 118432 38780 -2193 41136
$$ packed form
9213I5672h5009G6140a0006A74946a40332D3778a58919f9706j96122Q2759B457
9201b8784j09826B0313d0233j03294A24962f5201b8389D4067a46337j4003m7958
9190b08298A24531c23268J01543f9017l3033A43971g6715k64305A54166b34350
9179a26684e0846m1267k02865e6372j76229B5287g73A33072c4157j53466h648
9167A73768h6496j54411f3052A79563a65855r9038G7255P6191b58337a5968D0979
9155b93743f6514q1770d9843j95795p8686a06313K1390A084a77092F7695a97013
9143a89608i01A44439a43248j64639i7561A44258a41134j76305a7423k1221k0895
9132e9539I4601a46241A01305c43000O8158J1450C34619A18432C8780b193D1136
$$ plain form
9120 -34567 227700 -30841 131497 -188454 131484 57198 -244526 35816 -191235 -212336 -123251
9109 -123251 -117124 -177192 -200825 276301 98245 -319926 351053 -71671 103357 -123215 138535
9097 81367 -100292 91376 -343157 105884 86058 64741 -154772 115417 47866 -133307 207179
9085 -69587 -212551 280105 175331 -229158 144960 -18753 -202024 485448 -78143 41769
9074 -30592 -157554 -232602 -48426 127833 -146732 -98486 -189704 -172863 -115371 240217 -536652
9062 -14985 351510 -95640 -56320 169612 -376819 -110623 -100978 167791 -112819 -106800 293026
9050 190813 -1488 -290748 -83675 -217928 -13202 -341486 137884 2281 143035 -21623 3263
9038 -213566 23646 178715 -148317 -504952 -169992 108321 -113370 -59138 -4174 222087
$$ packed form
9120c4567B27700c0841A31497a88454A31484E7198b44526C5816a91235k1101Q9085
9109a23251O127o0068k3633B76301I8245c19926C51053g1671A03357a23215A38535
9097H1367a00292I1376c43157A05884j9826k1317a54772A15417D7866a33307B07179
9085f9587j42964B80105j04774b29158A44960a8753j83271D85448g8143D1769
9074c0592j26962p5048d8426A27833a46732M8246r1218J6841N7492B40217e36652
9062a4985C51510i5640L9320A69612c76819a10623R645A67791a12819O019B93026
9050A90813a488k89260h3675j34253a3202l28284A37884B281J40754b1623C263
9038b13566B3646J55069a48317l56635a69992A08321a13370N4232d174B22087
$$ plain form
9027 -128870 33196 -99778 -338795 253774 -135119 -24720 -216045 -487087 51777 62631 111573
9016 111573 -163254 135095 150865 -73428 -37311 -112126 -219254 -138002 73592 -122715 -170467
9005 -170467 83305 179686 16684 29524 270313 -429919 155579 255152 -8546 -28695 -516420
8994 -516420 28811 227016 -35684 -161321 240939 -61784 166022 33343 -459693 -53503 -60191
8983 -60191 -66397 -456267 -121582 -171749 -106840 162177 124114 -194908 9931 -18254 -136625
8972 -136625 18868 93474 -272030 -152720 43860 73362 137359 7365 169504 119547 112177
8961 112177 -258668 -154510 -85537 -44568 -11860 -55731 -37694 -259364 -298800 114103 -1214
8949 -54948 -3656 302908 -102789 -11089 180882 -218518 -31704 -300450 -204145 41894 76553
$$ packed form
9027a28870C3196i9778k39017B53774a35119b4720j91325k71042E1777J0854M8942
9016A11573a63254A35095J5770g3428L6117p4815j07128Q1252G3592a22715m7752
9005a70467H3305R6381A6684J2840K40789d29919A55579R9573h546k0149m87725
8994e16420B8811J98205c5684j25637B40939f1784A66022C3343d59693e3503o688
8983f0191o206l89870a21582n0167O4909A62177l8063a94908I931a8254j18371
8972a36625A8868P4606b72030J19310D3860K9502O3997G365J62139m9957p370
8961A12177b58668J04158O8973M0969a1860m3871J8037k21670l9436A14103a214
8949e4948c656C02908a02789a1089A80882b18518c1704k68746R6305D1894L4659
$$ plain form
8938 76553 409582 90449 414805 -25066 -279139 -170873 -62184 -25096 -144456 -43298 -227287
8927 -227287 -223583 239607 467949 603435 2251350 5958438 1205064 260496 249128 183491
8917 183491 -300434 23260 -293094 -228183 -144392 125963 208657 176116 90045 -81616 -172197
8906 -172197 190655 -219644 -20275 545 -86749 -168389 -14603 118229 167242 -86405 169536
8894 -108099 135708 -27475 -503640 378360 87902 -369614 113487 -59952 -185396 67225
$$ packed form
8938G6553L33029I0449L24356b5066k54073J08266f2184b5096j19360d3298j83989
8927b27287L704B39607K28342J35486J647915L707088A205064B60496j1368o5637
8917A83491c00434B3260b93094O4911Q3791A25963Q2694l2541q6071h1616r0581
8906a72197A90655b19644b0275E45h6749q1640a4603A18229M9013h6405A69536
8894a08099A35708b7475m76165C78360H7902c69614A13487e9952j25444F7225
$$ [...]
##END NTUPLES=NMR SPECTRUM
##END=
