
##TITLE=AC1370_2394_7221551_PFWnt8R9C4
##JCAMPDX= 6.0         $$ Bruker NMR JCAMP-DX V2.0
##DATA TYPE= NMR SPECTRUM
##DATA CLASS= NTUPLES
##ORIGIN= BRUKER
##OWNER= Administrator
$$ 1.72 TOPSPIN		Version 2.1
$$ 2012-12-17 15:00:54.831 -0500  Administrator@X
$$ Compression mode = diff/dup
##.OBSERVE FREQUENCY= 400.02188249412
##.OBSERVE NUCLEUS= ^1H
##.ACQUISITION MODE= SIMULTANEOUS (DQD)
##.ACQUISITION SCHEME= undefined
##.AVERAGES= 64
##.DIGITISER RES= 22
##SPECTROMETER/DATA SYSTEM= spect
##.PULSE SEQUENCE= noesygpps1d.comp
##.SOLVENT NAME= COFFEE_meoh
##.SHIFT REFERENCE= INTERNAL, COFFEE_meoh, 1, 14.96035
##AUDIT TRAIL= $$ (NUMBER, WHEN, WHO, WHERE, PROCESS, VERSION, WHAT)
$$ ##TITLE= Audit trail, TOPSPIN		Version 2.1
$$ ##JCAMPDX= 5.01
$$ ##ORIGIN= Bruker BioSpin GmbH
$$ ##OWNER= Administrator
$$ $$ E:\/data/COFFEE/nmr/AC1370_2394_7221551_PFWnt8R9C4/32/pdata/1/auditp.txt
$$ ##AUDIT TRAIL=  $$ (NUMBER, WHEN, WHO, WHERE, PROCESS, VERSION, WHAT)
(   1,<2012-12-17 15:00:49.175 -0500>,<Administrator>,<X>,<go>,<TOPSPIN 2.1>,
      <created by zg
	started at 2012-12-17 14:49:19.139 -0500,
	POWCHK enabled, PULCHK disabled,
       configuration hash MD5:
       86 BA 57 50 F2 9D 5C 9B 26 00 A9 28 5F 66 2E 89
       data hash MD5: 64K
       AD 9E D9 72 69 8C 24 54 8B FE 3B DA E2 02 BD EE>)
(   2,<2012-12-17 15:00:52.206 -0500>,<Administrator>,<X>,<proc1d>,<TOPSPIN 2.1>,
      <Start of raw data processing
       efp LB = 0.3 FT_mod = 6 PKNL = 1 PHC0 = 0 PHC1 = 0 SI = 128K 
       data hash MD5: 128K
       4D 36 68 1D 2F 50 DA 25 68 3A DD 60 23 2B F3 4F>)
(   3,<2012-12-17 15:00:53.238 -0500>,<Administrator>,<X>,<proc1d>,<TOPSPIN 2.1>,
      <pk PHC0 = -82.61169 PHC1 = 0 
       data hash MD5: 128K
       A9 E2 B9 15 D5 52 C9 DD A2 97 66 4C 9E 5C A6 4B>)
(   4,<2012-12-17 15:00:53.909 -0500>,<Administrator>,<X>,<proc1d>,<TOPSPIN 2.1>,
      <abs ABSG = 1 
       data hash MD5: 128K
       2E 74 FC E6 30 54 72 D3 87 9E 4C FA B5 67 3E 05>)
(   5,<2012-12-17 15:00:54.066 -0500>,<Administrator>,<X>,<proc1d>,<TOPSPIN 2.1>,
      <abs ABSG = 2 
       data hash MD5: 128K
       98 4E 73 4E 6B A0 4A CF 0E C6 6B 80 22 15 89 98>)
(   6,<2012-12-17 15:00:54.191 -0500>,<Administrator>,<X>,<proc1d>,<TOPSPIN 2.1>,
      <abs ABSG = 3 
       data hash MD5: 128K
       01 9A A9 6C 88 98 66 F4 3B 57 B8 59 D6 C6 12 0C>)
(   7,<2012-12-17 15:00:54.347 -0500>,<Administrator>,<X>,<proc1d>,<TOPSPIN 2.1>,
      <abs ABSG = 4 
       data hash MD5: 128K
       E7 A0 81 50 79 01 C2 74 12 BE 63 46 31 E0 64 DA>)
(   8,<2012-12-17 15:00:54.519 -0500>,<Administrator>,<X>,<proc1d>,<TOPSPIN 2.1>,
      <abs ABSG = 5 
       data hash MD5: 128K
       55 FB DB 75 B5 CA 0E 0C 7F B2 71 59 7C 8F E9 A5>)
$$ ##END=
$$ 
$$ $$ hash MD5
$$ $$ 1E 99 1E F8 89 A1 E5 FE D7 33 65 E8 9D 21 B8 9A
##$RELAX= 
##$RELAX= 
##$RELAX= 
##$RELAX= 
##$RELAX= 
##$RELAX= 
##$RELAX= 
##$RELAX= 
$$ Bruker specific parameters
$$ --------------------------
##$DU= <E:\>
##$EXPNO= 32
$$ [...]
##$TP07= 0
##$TPNAME0= <>
##$TPNAME1= <>
##$TPNAME2= <>
##$TPNAME3= <>
##$TPNAME4= <>
##$TPNAME5= <>
##$TPNAME6= <>
##$TPNAME7= <>
##$TPOAL= (0..7)
0.5 0.5 0.5 0.5 0.5 0.5 0.5 0.5
##$TPOFFS= (0..7)
0 0 0 0 0 0 0 0
##$TUNHIN= 0
##$TUNHOUT= 0
##$TUNXOUT= 0
##$USERA1= <user>
##$USERA2= <user>
##$USERA3= <user>
##$USERA4= <user>
##$USERA5= <user>
##$V9= 5
##$VALIST= <valist>
##$VCLIST= <CCCCCCCCCCCCCCC>
##$VD= 0
##$VDLIST= <DDDDDDDDDDDDDDD>
##$VPLIST= <PPPPPPPPPPPPPPP>
##$VTLIST= <TTTTTTTTTTTTTTT>
##$WBST= 2048
##$WBSW= 25
##$XGAIN= (0..3)
0 0 0 0
##$XL= 0
##$YL= 0
##$YMAX_a= 6215510
##$YMIN_a= -11321434
##$ZGOPTNS= <>
##$ZL1= 120
##$ZL2= 120
##$ZL3= 120
##$ZL4= 120
##$ABSF1= 14.96035
##$ABSF2= -5.597832
##$ABSG= 5
##$ABSL= 3
##$ALPHA= 0
##$AQORDER= 0
##$ASSFAC= 0
##$ASSFACI= 0
##$ASSFACX= 0
##$ASSWID= 0
##$AUNMP= <proc_prof1d_extract.lims>
##$AXLEFT= 0
##$AXNAME= <>
##$AXNUC= <1H>
##$AXRIGHT= 0
##$AXTYPE= 0
##$AXUNIT= <>
##$AZFE= 0.1
##$AZFW= 0.1
##$BCFW= 0
##$BC_mod= 0
##$BYTORDP= 0
##$COROFFS= 0
##$CY= 15
##$DATMOD= 1
##$DC= 0
##$DFILT= <>
##$DTYPP= 0
##$F1P= 0
##$F2P= 0
##$FCOR= 0.5
##$FTSIZE= 131072
##$FT_mod= 6
##$GAMMA= 0
##$GB= 0
##$INTBC= 1
##$INTSCL= 1
##$ISEN= 128
##$LB= 0.3
##$LEV0= 0
##$LPBIN= 0
##$MAXI= 10000
##$MC2= 0
##$MEAN= 0
##$ME_mod= 0
##$MI= 0
##$NCOEF= 0
##$NC_proc= -2
##$NLEV= 6
##$NOISF1= 0
##$NOISF2= 0
##$NSP= 0
##$NTH_PI= 0
##$NZP= 0
##$OFFSET= 14.96035
##$PC= 1
##$PHC0= -82.61169
##$PHC1= 0
##$PH_mod= 1
##$PKNL= yes
##$PPARMOD= 0
##$PPDIAG= 0
##$PPIPTYP= 0
##$PPMPNUM= 2147483647
##$PPRESOL= 1
##$PSCAL= 4
##$PSIGN= 0
##$PYNMP= <proc.py>
##$REVERSE= no
##$SF= 400.020009897014
##$SI= 131072
##$SIGF1= 0
##$SIGF2= 0
##$SINO= 400
##$SIOLD= 131072
##$SPECTYP= <>
##$SREGLST= <1H.CDCl3>
##$SSB= 0
##$STSI= 131072
##$STSR= 0
##$SW_p= 8223.68421052631
##$SYMM= 0
##$S_DEV= 0
##$TDeff= 65536
##$TDoff= 0
##$TI= <>
##$TILT= no
##$TM1= 0
##$TM2= 0
##$TOPLEV= 0
##$USERP1= <user>
##$USERP2= <user>
##$USERP3= <user>
##$USERP4= <user>
##$USERP5= <user>
##$WDW= 1
##$XDIM= 131072
##$YMAX_p= 383822425
##$YMIN_p= -12934
##$CURPLOT= <Network HP LaserJet P1505>
##$CURPRIN= <$Network HP LaserJet P1505>
##$DFORMAT= <normdp>
##$LAYOUT= <+/1D_H.xwp>
##$LFORMAT= <normlp>
##$PFORMAT= <normpl>
##$SURQMSG= 1
$$ End of Bruker specific parameters
$$ ---------------------------------
##NTUPLES= NMR SPECTRUM
##VAR_NAME=  FREQUENCY,     SPECTRUM/REAL,   SPECTRUM/IMAG
##SYMBOL=    X,             R,               I
##VAR_TYPE=  INDEPENDENT,   DEPENDENT,       DEPENDENT
##VAR_FORM=  AFFN,          ASDF,            ASDF
##VAR_DIM=   131072,        131072,          131072
##UNITS=     HZ,            ARBITRARY UNITS, ARBITRARY UNITS
##FACTOR=    0.0627417313425164, 1,          1
##FIRST=     8223.62146879497, -1094,        -58340
##LAST=      0,             1178,            -58329
##MIN=       0,             -12934,          0
##MAX=       8223.62146879497, 383822425,    0
$$ Real data points
##PAGE= N=1
##DATA TABLE= (X++(R..R)), XYDATA
$$ [...]
61851F60902L7844M2302M6517N0464N3761N5952N6991N7128N6467N4785N1554
$$ 660902 698746 741048 787565 838029 891790 947742 1004733 1061861 1118328 1173113 1224667
61840A224667M6123L8237K8392J7502O273m790j4925k3265k9361l3091l3974l1417
$$ 1224667 1270790 1309027 1337419 1354921 1361194 1356404 1341479 1318214 1288853 1255762 1221788 1190371
61828A190371k5747j8319j0226j501P920J7086K4556K9696L2695L3392L0856K4388
$$ 1190371 1164624 1146305 1136079 1134578 1142498 1159584 1184140 1213836 1246531 1279923 1310779 1335167
61816A335167J4569L000q803k0103l0705m0409m8822n5549o0277o2713o2728o0805
$$ 1335167 1349736 1352736 1343933 1323830 1293125 1252716 1203894 1148345 1088068 1025355 962627 901822
61804I01822n7895n4548n0501m5558m0456l6121l2373k8352k4210k1237j9917
$$ 901822 843927 789379 738878 693320 652864 616743 584370 556018 531808 510571 490654
61793D90654j8931j6834j3855j1251r555q445p779p656p675p202o335n704n336
$$ 490654 471723 454889 441034 429783 420228 411783 404004 396348 388673 381471 375136 369432 364096
61780C64096m611l431k462k058j863j721k094l030l606l077j970j326j239r49
$$ 364096 359485 356054 353592 351534 349671 347950 345856 342826 339220 336143 334173 332847 331608 330659
61766C30659j17P18R63O82M59Q12J793K858L226K693J959J930K730L710M263M350
$$ 330659 330542 331260 332223 332905 333364 334176 335969 338827 342053 344746 346705 348635 351365 355075 359338 363688
61750C63688M216L952L367K206M90j250k281k356k035k025k398k644k425j949
$$ 363688 367904 371856 375223 377429 377919 376669 374388 372032 369997 367972 365574 362930 360505 358556
61736C58556j629j594j581j175k33Q60J513J653J805K297K700K530K164K410L306
$$ 358556 356927 355333 353752 352577 352344 353204 354717 356370 358175 360472 363172 365702 367866 370276 373582
61721C73582M001M021L918M345N054N331N121N055N428N725N312M223K946J750
$$ 373582 377583 381604 385522 389867 394921 400252 405373 410428 415856 421581 426893 431116 434062 435812
61707D35812M91r80k568m114n513o535o808o251n315m571m180m000m014m200m182
$$ 435812 436303 435323 432755 428641 423128 416593 409785 403534 398219 393648 389468 385468 381454 377254 373072
61692C73072l585k732k389k694k936k642k228k221k467k595k692k897k876k397
$$ 373072 369487 366755 364366 361672 358736 356094 353866 351645 349178 346583 343891 340994 338118 335721
61678C35721j986k217k728k778k446k251j876n53J269J976R45m93q90m95m56r85
$$ 335721 333735 331518 328790 326012 323566 321315 319439 318886 320155 322131 323076 322583 321693 321198 320742 319757
61662C19757j352j207r57r23q22k04J040K531L601L769L215K555K048J525J192
$$ 319757 318405 317198 316241 315318 314496 314292 315332 317863 321464 325233 328448 331003 333051 334576 335768
61647C35768J809L561N439O396O630P000P619P929P808P624P302O211M209J960
$$ 335768 337577 341138 346577 352973 359603 366603 374222 382151 389959 397583 404885 411096 415305 417265
61633D17265L4j632l183m403n194n912o818p526p429o493n314m466l951l283k059
$$ 417265 417299 415667 412484 408081 402887 396975 390157 382631 375202 368709 363395 358929 354978 351695 349636
61618C49636m90P63J410J913K834L966M579M302L334J853j48k405m312n576o466
$$ 349636 349146 349909 351319 353232 356066 360032 364611 368913 372247 374100 373952 371547 367235 361659 355193
61603C55193p310q043q455q470q072p315o503n984n617m910l803k874k514k426
$$ 355193 347883 339840 331385 322915 314843 307528 301025 295041 289424 284514 280711 277837 275323 272897
61589B72897k202j919j720j379q28o98j631l178m106l823k926k267k078k187k510
$$ 272897 270695 268776 267056 265677 264849 264151 262520 259342 255236 251413 248487 246220 244142 241955 239445
61574B39445k922k972k297j267p27j064j790k252k371k414k300j673o62jr6l92
$$ 239445 236523 233551 231254 229987 229260 228196 226406 224154 221783 219369 217069 215396 214734 214733 214637 214245
61558B14245j36N31P94L35l11o15o21n11j94K84M16j44q93r91l43L30M34J29n0
$$ 214245 214109 214640 215434 215769 215458 214843 214222 213711 213517 213801 214217 214073 213180 212189 211846 212176 212610 212739 212689
61539B12689J92Q38J714K498K775K401J795J650K221L051L395K921J910Q19k23
$$ 212689 212881 213719 215433 217931 220706 223107 224902 226552 228773 231824 235219 238140 240050 240869 240646
61524B40646j356k550l380l378k659k007k187l097l772l392k170r91l05J26M09
$$ 240646 239290 236740 233360 229982 227323 225316 223129 220032 216260 212868 210698 209707 209402 209528 209937
61509B09937P2j134k478k913k347j631j400j500j613j744j850j579p53J44L87
$$ 209937 210009 208875 206397 203484 201137 199506 198106 196606 194993 193249 191399 189820 189067 189211 189598
61494A89598k12j056j278m50R54J838J523M96j75j33N2j26m88o37m12K72J407
$$ 189598 189386 188330 187052 186602 187556 189394 190917 191413 191238 191105 191157 191031 190543 189906 189494 189766 191173
61477A91173K428K457J442M67M23R73J312J266R55J05j303k215j498L29J499J179
$$ 191173 193601 196058 197500 197967 198390 199363 200675 201941 202896 203001 201698 199483 197985 198314 199813 200992
61461B00992J97m62q51j293j450q83M6N54M47K39M13R20J288J111N19J45L94Q30
$$ 200992 201189 200727 199876 198583 197133 196250 196296 196850 197297 197536 197949 198869 200157 201268 201787 201932 202326 203156
61443B03156Q33P09J379K803L622K880J426Q81J759L266M560N384N701N549N279
$$ 203156 203989 204698 206077 208880 212502 215382 216808 217689 219448 222714 227274 232658 238359 243908 249187
61428B49187N249N177M324K481L69j047j362q53j78P4n3J64J229K529K952K395
$$ 249187 254436 259613 263937 266418 266787 265740 264378 263525 263347 263421 263368 263532 264761 267290 270242 272637
61412B72637K001K627L690L956L034J542Q8j275k593l607l988l807l541l614l980
$$ 272637 274638 277265 280955 284911 287945 289487 289575 288300 285707 282100 278112 274305 270764 267150 263170
61397B63170m182l912l453l376l772m070l748k994k406k241k198j892j239l84
$$ 263170 258988 255076 251623 248247 244475 240405 236657 233663 231257 229016 226818 224926 223687 223303
61383B23303M81J157J459J300P64J37j91N6P24J289J344R50N14L80O92J377K166
$$ 223303 223784 224941 226400 227700 228464 228601 228410 228466 229190 230479 231823 232773 233287 233667 234359 235736 237902
61366B37902K723K989L196L393L206K433J645J662K464L172L177K859K966L657
$$ 237902 240625 243614 246810 250203 253409 255842 257487 259149 261613 264785 267962 270821 273787 277444
61352B77444M472M965N104N250N948P469R308J0357R956Q600P351O696O334N977
$$ 277444 281916 286881 291985 297235 303183 310652 319960 330317 340273 348873 356224 362920 369254 375231
61338C75231N818O075O519O739O686O624O627O417N749M718L518K040pk520m772
$$ 375231 381049 387124 393643 400382 407068 413692 420319 426736 432485 437203 440721 442761 442754 440234 435462
61323D35462n963n913n128m347m150m766n850o479n906m434l190k833k861k459
$$ 435462 429499 423586 418458 414111 409961 405195 399345 392866 386960 382526 379336 376503 373642 371183
61309C71183j631j036q84n73M88K099L544M460N091N656N744M638K327k33k189
$$ 371183 369552 368516 367632 367059 367547 369646 373190 377650 382741 388397 394141 398779 401106 400873 398684
61294C98684l768n644p483p996o607m365k653j717r84l37j76n60j073j478j818
$$ 398684 394916 389272 381789 373793 367186 362821 360168 358451 357467 357130 356954 356394 355321 353843 352025
61279C52025j942j536o33M70J730L160M259M413L904L703M181M758N044N395O036
$$ 352025 350083 348547 347914 348384 350114 353274 357533 361946 365850 369553 373734 378492 383536 388931 394967
61264C94967O431O133N550N345N615O230P364R000J0406J0912J0858J0985J1171
$$ 394967 401398 407531 413081 418426 424041 430271 437635 446635 457041 467953 478811 489796 500967
61251E00967J0608R166P717P021O990P201P428P412O644M837K355q6k098l801
$$ 500967 511575 520741 528458 535479 542469 549670 557098 564510 571154 575991 578346 578260 576162 572361
61237E72361n533p420r187j0386j0929j1224j1631j1902j1559j0642r588q440
$$ 572361 566828 559408 550221 539835 528906 517682 506051 494149 482590 471948 462360 453920
61225D53920o731m381k264j458k114l369m272m588m700m849m716l767k031k74
$$ 453920 447189 442808 440544 439086 436972 433603 429331 424743 420043 415194 410478 406711 404680 404406
61211D04406P61J132J405J763J764J058r1j092j570j432p66J37Q37J164J502K456
$$ 404406 405167 406299 407704 409467 411231 412289 412198 411106 409536 408104 407338 407475 408312 409476 410978 413434
61195D13434M223O413Q471J0106J1404J2567J3559J3904J2939J0484P270M578
$$ 413434 417657 424070 432541 442647 454051 466618 480177 494081 507020 517504 524774 529352
61183E29352L313L436M248N086N675O001O115O083N873N209L812J967N51R4J21
$$ 529352 532665 536101 540349 545435 551110 557111 563226 569309 575182 580391 584203 586170 586721 586815 586936
61168E86936j21m82k00O18P41m78j996k468k184k594m137n717o481p057q372j0065
$$ 586936 586815 586333 586133 586751 587492 587014 585018 582550 580366 577772 573635 567918 561437 554380 546008 535943
61152E35943j0857j0192q761p551o854o230n057l144j193n62k115n240q333j0290
$$ 535943 525086 514894 506133 498582 491728 485498 480441 477297 476104 475542 473427 468187 459854 449564
61138D49564j1229j1734j1974j1812j1374j0899j0204q810o703m589l169k410
$$ 449564 438335 426601 414627 402815 391441 380542 370338 361528 354825 350236 347067 344657
61126C44657j770r75k67J61N98J556L088M676N840O682P632Q773R749J0406J1169
$$ 344657 342887 341912 341645 341806 342404 343960 347048 351724 357564 364246 371878 380651 390400 400806 411975
61111D11975J2466J4048J5300J6078J6778J7529J7966J7891J7635J7467J7091
$$ 411975 424441 438489 453789 469867 486645 504174 522140 540031 557666 575133 592224
61100E92224J6085J4432J2233R404O125L100P51j374l737n780o711p008p983r949
$$ 592224 608309 622741 634974 644378 650503 653603 654354 652980 649243 643463 636752 629744 621761 611812
61086F11812j1919j3231j4273j5211j5326j4276j3033j2671j2920j2853j2355
$$ 611812 599893 586662 572389 557178 541852 527576 514543 501872 488952 476099 463744
61075D63744j1999j1909j1675j1222j0874j0700j0432j0021r688r453r001p977
$$ 463744 451745 439836 428161 416939 406065 395365 384933 374912 365224 355771 346770 338793
61063C38793o254m202k763k632l136k808j470o78j344k082j181Q08K025K102K276
$$ 338793 332539 328337 325574 322942 319806 316998 315528 314850 313506 311424 310243 311051 313076 315178 317454
61048C17454L068L788M317N375O750P142O417O241P660R574J0611J1087J1940
$$ 317454 320522 324310 328627 334002 340752 347894 354311 360552 368212 377786 388397 399484 411424
61035D11424J3008J3682J4293J5466J6812J7535J7780J8239J8969J9821K1495
$$ 411424 424432 438114 452407 467873 484685 502220 520000 538239 557208 577029 598524
61024E98524K4945L0078L6178M3156N1334O0646P1389Q5031J02824J24662J51487
$$ 598524 623469 653547 689725 732881 784215 844861 916250 1001281 1104105 1228767 1380254
61013A380254J86800K29830K64972K64150K08283J08805M137o8027r4293q3059
$$ 1380254 1567054 1796884 2061856 2326006 2534289 2643094 2647231 2579204 2484911 2401852
61003B401852m6269P895O4724R5952P4191k623j04882j92174k40447k50445k35895
$$ 2401852 2355583 2363478 2428202 2524154 2598345 2595722 2490840 2298666 2058219 1807774 1571879
60992A571879k09295j77875j46338j18295r5251p6655o1472m9144l9282l1453
$$ 1571879 1362584 1184709 1038371 920076 824825 748170 686698 637554 598272 566819
60982E66819k5359k0750j7168j4194j1785j0013q651p431o560o441o925p326p259
$$ 566819 541460 520710 503542 489348 477563 467550 458899 451468 444908 438467 431542 424216 416957
60969D16957p060p145p339p154o592o288o677p331p351o445n293m727m771m772
$$ 416957 409897 402752 395413 388259 381667 375379 368702 361371 354020 347575 342282 337555 332784 328012
60955C28012m262l401k585k051j830j764j496q02ML52K39K81P32J013P30O60J868
$$ 328012 323750 320349 317764 315713 313883 312119 310623 309821 309825 310177 310416 310697 311429 312442 313172 313832 315700
60938C15700M050N556N314L972K777J953Q01r37k589l465l673l829m220m553m452
$$ 315700 319750 325306 330620 334592 337369 339322 340123 339186 336597 333132 329459 325630 321410 316857 312405
60923C12405m017l802m134m552m245l206k489k870l589l167j380L96J024Q78Q53
$$ 312405 308388 304586 300452 295900 291655 288449 285960 283090 279501 276334 274954 275350 276374 277252 278105
60908B78105R79Q95J028K118L787M733M533M210M593N092M805M028L742M003L881
$$ 278105 279084 279979 281007 283125 286912 291645 296178 300388 304981 310073 314878 318906 322648 326651 330532
60893C30532K976K050J824J772P14j639m186n544n348m384l681l676m147m602
$$ 330532 333508 335558 337382 339154 339868 338229 334043 328499 323151 318767 315086 311410 307263 302661
60879C02661m700m479m385m796n390n240l880k016p19j03N38J416J830J322N16
$$ 302661 297961 293482 289097 284301 278911 273671 269791 267775 267056 266953 267491 268907 270737 272059 272575
60864B72575L01P18J200J585K160K914L394L429L482M048N008N824O118N970N679
$$ 272575 272876 273594 274794 276379 278539 281453 284847 288276 291758 295806 300814 306638 312756 318726 324405
60849C24405N467N327N123M757M265L805L548L502L382K823J874J095Q78Q51K94
$$ 324405 329872 335199 340322 345079 349344 353149 356697 360199 363581 366404 368278 369373 370251 371102 371396
60834C71396r41k301l267l724l712l380l280l968n076n473m721l756l647m205
$$ 371396 370455 368154 364887 361163 357451 354071 350791 346823 341747 336274 331553 327797 324150 319945
60820C19945m476m109l581l312l282l339l315k914k015r94l78j95o2L00R37J769
$$ 319945 315469 311360 307779 304467 301185 297846 294531 291617 289602 288608 288230 288035 287973 288273 289210 290979
60804B90979K405K254J327O03R31J970K853L571M685N992O600O403O357P039P932
$$ 290979 293384 295638 296965 297568 298499 300469 303322 306893 311578 317570 324170 330573 336930 343969 351901
60789C51901Q566R324J0533J1645J2162J2634J3885J5711J7253J8386J9798K1803
$$ 351901 360467 369791 380324 391969 404131 416765 430650 446361 463614 482000 501798 523601
60777E23601K3967K5946K7870K9697L0963L1493L1732L1811L0870K8016K3720
$$ 523601 547568 573514 601384 631081 662044 693537 725269 757080 787950 815966 839686
60766H39686J9437J5785J1844O617M74n364j0330j4742j8713k1808k3908k5635
$$ 839686 859123 874908 886752 893369 893843 888479 878149 863407 844694 822886 798978 773343
60754G73343k7448k8892k9266k8597k7463k6151k4547k2656k0701j8832j7143
$$ 773343 745895 717003 687737 659140 631677 605526 580979 558323 537622 518790 501647
60743E01647j5778j4643j3289j1566j0170r929j0682j1530j2024j2415j2682j2127
$$ 501647 485869 471226 457937 446371 436201 426272 415590 404060 392036 379621 366939 354812
60731C54812j0281p761n841n256n563n523m311k534j711k403l357l108j900j086
$$ 354812 344531 336770 330929 325673 320110 314587 310276 307742 306031 303628 300271 297163 295263 294177
60717B94177r82o59J95P13N15N57J554K663K782K239K070K196J542k52k268l508
$$ 294177 293195 292536 292731 293444 293959 294516 296070 298733 301515 303754 305824 308020 309562 309310 307042 303534
60701C03534l842l772l825m237m722m667l912l193l301m042m590m626m411l940
$$ 303534 299692 295920 292095 287858 283136 278469 274557 271364 268063 264021 259431 254805 250394 246454
60687B46454k908j591r51j458k427k882k608k042j557j252j099q88k87O44J178
$$ 246454 243546 241955 241004 239546 237119 234237 231629 229587 228030 226778 225679 224791 224504 225148 226326
60672B26326O52n59j266p90K27O12N5o26n74Q4N29L27j02j16M11J066J433J491
$$ 226326 226978 226419 225153 224363 224590 225202 225257 224631 224057 224141 224670 224997 224895 224779 225190 226256 227689 229180
60654B29180J541J905K624L425L984M238M306M273M222M395M995N767O106N713
$$ 229180 230721 232626 235250 238675 242659 246897 251203 255476 259698 264093 269088 274855 280961 286674
60640B86674M859L919K981K116J610J579J589J076Q6p47r69p76p20j196k170l241
$$ 286674 291533 295452 298433 300549 302159 303738 305327 306403 306489 305742 304773 303997 303277 302081 299911 296670
60624B96670l922m026l861l949m475n064n137m501l491k577j880j286q73r89j677
$$ 296670 292748 288722 284861 280912 276437 271373 266236 261735 258244 255667 253787 252501 251628 250639 248962
60609B48962k390k532k046j246l80K46J50p49j650j716j227j110j417j281m53
$$ 248962 246572 244040 241994 240748 240368 240614 240764 240015 238365 236649 235422 234312 232895 231614 231161
60594B31161J76kl89l11j53n22j003p58R8O55N05L1l80n81k77P67K112L018L429
$$ 231161 231337 231335 230946 230635 230482 229960 228957 228199 228297 228952 229457 229488 229108 228527 228250 229017 231129 234147 237576
60575B37576L917M631N044M947M901N377N965N867M860L440K174J174P8j411k972
$$ 237576 241493 246124 251168 256115 261016 266393 272358 278225 283085 286525 288699 289873 289951 288540 285568
60560B85568l819l584k802k230j857j133O8J274K195L078M189N403O459P287P927
$$ 285568 281749 278165 275363 273133 271276 270143 270211 271485 273680 276758 280947 286350 292809 300096 308023
60545C08023Q391Q588Q175O658M080J357n87j897l351m893n498m676l313k508
$$ 308023 316414 325002 333177 339835 343915 345272 344685 342788 339437 334544 329046 324370 321057 318549
60531C18549k245j791j017n90r85j872k509k471j853r80m9R16J820K350K304J907
$$ 318549 316304 314513 313496 312906 311921 310049 307540 305069 303216 302236 302187 303103 304923 307273 309577 311484
60515C11484J547J362J378J917L257M930O020O368O966Q819J1794J4918J7426
$$ 311484 313031 314393 315771 317688 320945 325875 331895 338263 345229 354048 365842 380760 398186
60502C98186J9211K0516K1615K2635K3242K2627K0060J5484R438K535m809j2195
$$ 398186 417397 437913 459528 482163 505405 528032 548092 563576 573014 575549 570740 558545
60490E58545j8970k4259k7307k8012k6994k5032k2485j9522j6649j4465j2814
$$ 558545 539575 515316 488009 459997 433003 407971 385486 365964 349315 334850 322036
60479C22036j0909q497o388n420n372n355m945m458m186m002l680l237k794k316
$$ 322036 311127 302630 296242 290822 285450 280095 275150 270692 266506 262504 258824 255587 252793 250477
60465B50477j672q73j86M2k55p23r54r17q10o34k40J97K44j70n90p09p74j071
$$ 250477 248805 247932 247746 247788 247533 246810 245856 244939 244129 243495 243255 243452 243696 243526 242936 242227 241453 240382
60447B40382j422j542j515j525j394q20P9P98R85O70J33k67l06j63k75p32j081
$$ 240382 238960 237418 235903 234378 232984 232164 232243 233041 234026 234696 234829 234562 234256 234093 233818 233086 232005
60430B32005r66o22m76n75p73j059j338j193m77K28L26J13L33J012J551J836K365
$$ 232005 231039 230417 229941 229366 228593 227534 226196 225003 224526 224754 225080 225193 225526 226538 228089 229925 232290
60413B32290L175L515K923J906J114N20j50p15q41o77n75m42J9O46R14P71P64
$$ 232290 235465 238980 241903 243809 244923 245443 245293 244578 243737 243060 242485 242043 242062 242708 243622 244393 245157
60396B45157J301K121K665K737K556K379K237J983J557J149J051J288J582J719
$$ 245157 246458 248579 251244 253981 256537 258916 261153 263136 264693 265842 266893 268181 269763 271482
60382B71482J862K269K814L122L081K945K867K651K173J725J654J782J552P83
$$ 271482 273344 275613 278427 281549 284630 287575 290442 293093 295266 296991 298645 300427 301979 302762
60368C02762p4n49p86j191j654j558o83L04N72J52j24L43J362K453L492M551N475
$$ 302762 302688 302139 301353 300162 298508 296950 296267 296571 297143 297295 297171 297514 298876 301329 304821 309372 314847
60351C14847N944N851N295M353L137K004J229N35n66j867k472k050j556k107l417
$$ 314847 320791 326642 331937 336290 339427 341431 342660 343195 342629 340762 338290 336240 334684 332577 329160
60336C29160m108l532k577k415l039l467l042k006r90l73k14m37r63j679k350
$$ 329160 325052 321520 318943 316528 313489 310022 306980 304974 303984 303611 303397 302960 301997 300318 297968
60321B97968k602k195j323l87N80J865L285L998L654L283M312O781R340J1050
$$ 297968 295366 293171 291848 291461 292041 293906 297191 301189 304843 308126 312438 319219 328559 339609
60307C39609J2344J3871J5154J5046J3121R939O151J988k341o298r317j1222j2211
$$ 339609 351953 365824 380978 396024 409145 419084 425235 427223 424882 418584 409267 398045 385834
60294C85834j2547j2309j1438j0047q649p815p466o779n187l190j837j453j386
$$ 385834 373287 360978 349540 339493 330844 323029 315563 308784 303597 300407 298570 297117 295731
60281B95731j022n17k64j52K04P24R08O47M84Q58J416J449Q76K87J9l91j478k888
$$ 295731 294709 294192 293928 293776 293980 294704 295612 296259 296743 297601 299017 300466 301342 301629 301648 301257 299779 296891
60263B96891l658l408k810k669k918k851k126j186o84p91j154j393j439j411j307
$$ 296891 293233 289825 287015 284346 281428 278577 276451 275265 274581 273790 272636 271243 269804 268393 267086
60248B67086r27j55Q04J559J888J790J290M44m40q40n16J79P00Q86J055J538K258
$$ 267086 266159 266004 266808 268367 270255 272045 273335 273779 273339 272499 271983 272162 272862 273748 274803 276341 278599
60231B78599K716K372J211p8p15o05k76K8O86J857K852K840K026J465J750K429
$$ 278599 281315 283687 284898 284820 284105 283500 283224 283252 283938 285795 288647 291487 293513 294978 296728 299157
60215B99157K789K697K503K484K673K904K869K324J423O95N81J174K301L550M206
$$ 299157 301946 304643 307146 309630 312303 315207 318076 320400 321823 322518 323099 324273 326574 330124 334330
60200C34330L722K547J952K708M151N009M783L930L013K276J961K279K916L095
$$ 334330 338052 340599 342551 345259 349410 354419 359202 363132 366145 368421 370382 372661 375577 378672
60186C78672K441J402O14J51k77p17r71j066j357k028k740k939k470j818j661
$$ 378672 381113 382515 383129 383280 383003 382286 381315 380249 378892 376864 374124 371185 368715 366897 365236
60171C65236k148k695k638k015j458j370j510j499j447j711k262k586k224j159
$$ 365236 363088 360393 357755 355740 354282 352912 351402 349903 348456 346745 344483 341897 339673 338514
60157C38514K37J471K117K030J479R49P30Q04J053J387J647J586J088L76n3K35
$$ 338514 338751 340222 342339 344369 345848 346797 347527 348331 349384 350771 352418 354004 355092 355468 355415 355650
60141C55650J270K598L638M173M404M491M300L692K866K111J431P60L52N06J030
$$ 355650 356920 359518 363156 367329 371733 376224 380524 384216 387082 389193 390624 391384 391736 392242 393272
60126C93272J439J662K000K377K223J356L73j71m70r66j571j896j904j781j398
$$ 393272 394711 396373 398373 400750 402973 404329 404702 404531 404061 403095 401524 399628 397724 395943 394545
60111C94545n06N70J072O93p1n20l70K26R23J305J163O75J90j60m28n43l94j34
$$ 394545 394039 394609 395681 396374 396303 395783 395413 395639 396562 397867 399030 399705 399895 399735 399307 398764 398370 398236
60093C98236k1KJ74M27M43K11K8m7k60n29l51L54Q91P10K42K94Q61J168Q12K84
$$ 398236 398215 398217 398391 398818 399261 399472 399500 399453 399193 398664 398313 398667 399558 400268 400510 400804 401665 402833 403645 403929
60073D03929K82Q48J408J390P09k79j144j789k455l313m146m618m750m926n308
$$ 403929 404211 405059 406467 407857 408566 408287 407143 405354 402899 399586 395440 390822 386072 381146 375838
60058C75838n505m983l787k661k359k920l642l792l177k147j172n69m23n87p42
$$ 375838 370333 365350 361563 358902 356543 353623 349981 346189 343012 340865 339693 339124 338701 338114 337372
60043C37372n79L3R92J981K587K636K472K647L184L482L191K813L025L632L726
$$ 337372 336793 336826 337818 339799 342386 345022 347494 350141 353325 356807 359998 362811 365836 369468 373194
60028C73194K756J014q62k308k897k635k331k975m481n618n547m877m709n149
$$ 373194 375950 376964 376102 373794 370897 368262 365931 362956 358475 352857 347310 342433 337724 332575
60014C32575n397n017m390l921l453k727j976j707k024k443k471k119j727j360
$$ 332575 327178 322161 317771 313850 310397 307670 305694 303987 301963 299520 297049 294930 293203 291843
60000B91843o99L60J280J457J003N91M79K52l89j055j255j095j058j236j213n80
$$ 291843 291144 291504 292784 294241 295244 295835 296314 296566 296177 295122 293867 292772 291714 290478 289265 288685
59984B88685O78K220L522M146M122L978M155M429M191L245K101J385J180J044
$$ 288685 289363 291583 295105 299251 303373 307351 311506 315935 320126 323371 325472 326857 328037 329081
59970C29081O16M9k49j99j53l46n40m57l46p01j386j551o16R83K198K377J693
$$ 329081 329697 329746 329497 329298 329145 328799 328259 327802 327456 326755 325369 323818 323202 324185 326383 328760 330453
59953C30453Q21L44L20L72K07n4k28n21j204j948k036j284k79L75N81M21j06q16
$$ 330453 331274 331618 331938 332310 332517 332463 332235 331714 330510 328562 326526 325242 324963 325338 325919 326340 326234 325418
59935C25418j326j625k120k856l230k853k194j829j569r04l2L39mn14o58m47r1
$$ 325418 324092 322467 320347 317491 314261 311408 309214 307385 305816 304912 304880 305219 305215 304701 304043 303596 303505
59918C03505L98J163K197L235L896M012L799L598L498L434L521L845L960L330
$$ 303505 303903 305066 307263 310498 314394 318406 322205 325803 329301 332735 336256 340101 344061 347391
59904C47391K298J940K566L153K816K084J999K484K523J630K76j044k261l246
$$ 347391 349689 351629 354195 357348 360164 362248 364247 366731 369254 370884 371160 370116 367855 364609
59890C64609l599l195k372j419l44O79J089N45l60m59Q32K743L885L790L422L752
$$ 364609 361010 357815 355443 354024 353680 354359 355448 355993 355633 355174 356006 358749 362634 366424 369846 373598
59874C73598M297L800K153O66K47M00L76K49J86l15j545k685k806k212j877k071
$$ 373598 377895 381695 383848 384514 384761 385161 385537 385786 385972 385657 384112 381427 378621 376409 374532 372461
59858C72461k470l012l649l715k703j291n34l58m2J61o50k220l056k494j539j336
$$ 372461 369991 366979 363330 359615 356912 355621 355087 354729 354687 354848 354198 351978 348922 346428 344889 343553
59842C43553j878k618l334l861l841l263k663k370k124j606q22J45J157J766J676
$$ 343553 341675 339057 335723 331862 328021 324758 322095 319725 317601 315995 315173 315318 316475 318241 319917
59827C19917J445J903K824L096K298J204N31J89J0J19K30l50j505k062j401l99
$$ 319917 321362 323265 326089 329185 331483 332687 333218 333407 333417 333536 333766 333416 331911 329849 328448 328049
59811C28049j54n59q35p73o64n91m57l14j17L98J156J516J088L00k40n03p96j275
$$ 328049 327895 327336 326501 325728 325064 324473 324016 323702 323585 323983 325139 326655 327743 328043 327803 327300 326504 325229
59793C25229k064l263m492m953m326l090j792o24R0j20r72j377p53K57P92O72
$$ 325229 323165 319902 315410 310457 306131 303041 301249 300625 300715 300595 299623 298246 297493 297750 298542 299214
59777B99214lj143k021j504L66J980K187J708J651J734J200N51Q10J691J960J437
$$ 299214 299211 298068 296047 294543 294909 296889 299076 300784 302435 304169 305369 305920 306730 308421 310381 311818
59761C11818J166J698K392K590K397K198K085K002J878J599J290J368J928K450
$$ 311818 312984 314682 317074 319664 322061 324259 326344 328346 330224 331823 333113 334481 336409 338859
59747C38859K621K878L551M099M003L735L881L984L373K511K260K235J404O6l43
$$ 338859 341480 344358 347909 352008 356011 359746 363627 367611 370984 373495 375755 377990 379394 379460 379117
59732C79117N31J361J058L6p85j092r73n70k63l78m83Q3Q94P44n29j666j767j358
$$ 379117 379648 381009 382067 382103 381318 380226 379253 378683 378420 378042 377559 377642 378536 379280 378751 377085 375318 373960
59714C73960j182j071o95l93m96n43MQ27J255J227J151J192J264J369J490J505
$$ 373960 372778 371707 371012 370619 370123 369580 369584 370411 371666 372893 374044 375236 376500 377869 379359 380864
59698C80864J476J654J968J979J661J622K220K973L255L033K558J916J299J089
$$ 380864 382340 383994 385962 387941 389602 391224 393444 396417 399672 402705 405263 407179 408478 409567
59684D09567J238J030O8j028j401r76k60L45M64m16k232l886m317l778l389l595
$$ 409567 410805 411835 411903 410875 409474 408498 408238 408583 409047 408631 406399 402513 398196 394418 391029 387434
59668C87434l890l843l609l322k807k119j696j676j543p96L47J254J623J661J646
$$ 387434 383544 379701 376092 372770 369963 367844 366148 364472 362929 362133 362480 363734 365357 367018 368664
59653C68664J666J751K008K478K904K908K434J913J821K157K448K216J276k68
$$ 368664 370330 372081 374089 376567 379471 382379 384813 386726 388547 390704 393152 395368 396644 396376
59639C96376k007l294l714l486l126k776k214j519j150j206j178p15k60m63j301
$$ 396376 394369 391075 387361 383875 380749 377973 375759 374240 373090 371884 370706 369991 369731 369268 367967
59624C67967k095k344k164k040k352l041l620l623l159k791k851l092l132k889
$$ 367967 365872 363528 361364 359324 356972 353931 350311 346688 343529 340738 337887 334795 331663 328774
59610C28774k463j963j616j619j642r40O24K057K319J579Q39N65M04J86L53J108
$$ 328774 326311 324348 322732 321113 319471 318531 319155 321212 323531 325110 325949 326514 326918 327104 327457 328565
59594C28565J780J618Q34K79K55K02l28r72j077o73l64m76p44r24j195j728k268
$$ 328565 330345 331963 332797 333076 333331 333533 333205 332233 331156 330483 330119 329643 328899 327975 326780 325052 322784
59577C22784k534k705l073l450l389k919k536k441k329j966j501j042l91N30J329
$$ 322784 320250 317545 314472 311022 307633 304714 302178 299737 297408 295442 293941 292899 292508 293038 294367
59562B94367J512J030L21n2K11Q84J324J094M19k13o89j045q55L88K304L846M677
$$ 294367 295879 296909 297230 297178 297389 298273 299597 300691 301110 300897 300208 299163 298308 298696 301000 304846 309523
59545C09523N480O654P651Q043Q369R249J0699J3098J7636K3996K8204K5070J3650
$$ 309523 315003 321657 329308 337351 345720 354969 365668 378766 396402 420398 448602 473672 487322
59532D87322r62j2110j6995j7242j5430j2605q862m773j366P98J967K633K966
$$ 487322 486360 474250 457255 440013 424583 411978 403116 398343 396977 397775 399742 402375 405341
59519D05341K879K499K276K442K525J818L18j162k027k620l626n082o481p551
$$ 405341 408220 410719 412995 415437 417962 419780 420098 418936 416909 414289 410663 405581 399100 391549
59505C91549q386q894q689p726o564n752n312m980m566l894k768j403m78l75n94
$$ 391549 383163 374269 365580 357854 351290 345538 340226 335246 330680 326786 324018 322615 322137 321762 321168
59490C21168m28K1R3l76r22j266j478j333l36J255K233J887J003Q65J684K735
$$ 321168 320740 320761 320854 320478 319556 318290 316812 315479 315143 316398 318631 320518 321521 322386 324070 326805
59474C26805L577M328M867M657L519J963O20k18m75j94K70M24K28J73N87J139
$$ 326805 330382 334710 339577 344234 347753 349716 350336 350118 349643 349449 349719 350143 350371 350544 351131 352270
59458C52270J297J068J085J937L477M767M937M203L821M699O306P343P319O854
$$ 352270 353567 354635 355720 357657 361134 365901 370838 375041 378862 383561 389867 397210 404529 411383
59444D11383O517N996M634K266p36l789o085o805n922m628m318n084n721n313
$$ 411383 417900 423896 428530 430796 430060 426271 420186 413381 407459 402831 398513 393429 387708 382395
59430C82395m280l553l214k614j557m80M68J660L019L797L917M601O748R512J1614
$$ 382395 378115 374562 371348 368734 367177 366697 367165 368825 371844 375641 379558 384159 390907 400419 412033
59415D12033J3315J5719J8914K2555K7427L3586L6977L1475J6045k568j6199k2345
$$ 412033 425348 441067 459981 482536 509963 543549 580526 612001 628046 625478 609279 586934
59403E86934k3290k0945j5812r217k608M753J3600K0101J7492L879j4261k7983
$$ 586934 563644 542699 526887 517670 515062 519815 533415 553516 571008 574887 560626 532643
59391E32643l3360l2169k7832k2832j8582j5446j2915j0656q882p390n455l255
$$ 532643 499283 467114 439282 416450 397868 382422 369507 358851 349969 342579 337124 333869
59379C33869k054k203k403j756j055j017q50J65J116J042P08J264K204K422K294
$$ 333869 331815 329612 327209 325453 324398 323381 322531 322696 323812 324854 325562 326826 329030 331452 333746
59364C33746K863L736L637K623J876J659J249P35J113K460L553L627L262L217
$$ 333746 336609 340345 343982 346605 348481 350140 351389 352124 353237 355697 359250 362877 366139 369356
59350C69356L460L732M205N288P151R461J1279J1715J1175J1228J2477J3464J2733
$$ 369356 372816 376548 380753 386041 393192 402653 413932 425647 436822 448050 460527 473991 486724
59337D86724J1060J0199J0113R223O985M421K230R4j976l295l840m488n593o566
$$ 486724 497784 507983 518096 527319 534304 538725 540955 541049 539073 535778 531938 527450 521857 515291
59323E15291p173p853q485q139o647n186m751n054n366n478n399n124n073n717
$$ 515291 508118 500265 491780 483641 476994 471808 467057 462003 456637 451159 445760 440636 435563 429846
59309D29846o453n976m235k773k581k852k602k230k418k591j772l76K01m80j393
$$ 429846 423393 417417 413182 410409 407828 404976 402374 400144 397726 395135 393363 392987 393188 392708 391315
59294C91315j478p97k16m11j265j968j814r58j96M9P8K52N08O91Q36Q90P75P71
$$ 391315 389837 389040 388824 388413 387148 385180 383366 382408 382212 382261 382339 382591 383099 383790 384626 385516 386291 387062
59276C87062J282K084K514K601L135M391N612O233O776P937R469J0599J0938J0511
$$ 387062 388344 390428 392942 395543 398678 403069 408681 414914 421690 429627 439096 449695 460633 471144
59262D71144R400P923O620N520L951J563r85k871m092n076n898o409o710o881
$$ 471144 480544 488467 495087 500607 504558 506121 505136 502265 498173 493097 487199 480790 474080 467199
59248D67199o734o264n893n775n460m759m228m171l868k691j309p39o60Q4J558
$$ 467199 460465 454201 448308 442533 437073 432314 428086 423915 420047 417356 416047 415308 414648 414732 416290
59233D16290K538K288J523J252J532J720J325K79j115k270k699k595k624l100
$$ 416290 418828 421116 422639 423891 425423 427143 428468 428747 427632 425362 422663 420068 417444 414344
59219D14344l701m146m655n526o606p437p721p379o494n371m514m184m097l715
$$ 414344 410643 406497 401842 396316 389710 382273 374552 367173 360679 355308 350794 346610 342513 338798
59205C38798k829j694o28K60Q64R62N28J24M28J326J892J558R39J065K080L157
$$ 338798 335969 334275 333647 333907 334771 335733 336261 336385 336813 338139 340031 341589 342528 343593 345673 348830
59189C48830L534L074K005P32p5J31J106K044K530K827L164L398L499L773M309
$$ 348830 352364 355438 357443 358175 358100 358231 359337 361381 363911 366738 369902 373300 376799 380572 384881
59174C84881M799N039N106M886M168L407L561M696N585N304M532M465N124N578
$$ 384881 389680 394719 399825 404711 408879 412286 415847 420543 426128 431432 435964 440429 445553 451131
59160D51131N491N371N490N498N128M553L867K787J139p98k608m090n212n984
$$ 451131 456622 461993 467483 472981 478109 482662 486529 489316 490455 489657 487049 482959 477747 471763
59146D71763o484o809o923o695o101n341m745m591m822m938m475l637l099l070
$$ 471763 465279 458470 451547 444852 438751 433410 428665 424074 419252 414314 409839 406202 403103 400033
59132D00033k960k249j271o94n61l36K54Q49J072J129J672L076M864O066O251
$$ 400033 397073 394824 393553 392859 392298 391962 392216 393065 394137 395266 396938 400014 404878 410944 417195
59117D17195O061O383P243Q058Q770R900J1339J2054J1505J0563J0453J1269J2161
$$ 417195 423256 429639 436882 444940 453710 463610 474949 487003 498508 509071 519524 530793 542954
59104E42954J2510J2266J1492J0205Q621P098N972N553N911O356N732L680J178
$$ 542954 555464 567730 579222 589427 598048 605146 611118 616671 622582 628938 634670 638350 639528
59091F39528o49j727k545l128l188k854k456j956j371j383k621m608o253p242
$$ 639528 638879 637152 634607 631479 628291 625437 622981 621025 619654 618271 615650 611042 604789 597547
59077E97547q070q880r341r634j0424j1498j1538r844p574o518p038p924q082
$$ 597547 589477 580597 571256 561622 551198 539700 528162 518318 510744 504226 497188 489264 481182
59064D81182p704p676q202q458p572n729l992l084k747k419k109k215k804l477
$$ 481182 473478 465802 457600 449142 441570 435841 431849 428765 426018 423599 421490 419275 416471 412994
59050D12994l836l705l084k227j580j376j367j246j023p02j6J091K038K244J906
$$ 412994 409158 405453 402369 400142 398562 397186 395819 394573 393550 392848 392832 393923 395961 398205 400111
59035D00111J670J728J817J847J939K030K076K413L292M247M662M824N577P010
$$ 400111 401781 403509 405326 407173 409112 411142 413218 415631 418923 423170 427832 432656 438233 445243
59021D45243Q343R170R931J0930J1707J1801J1480J1326J1490J1676J1449J0394
$$ 445243 453586 462756 472687 483617 495324 507125 518605 529931 541421 553097 564546 574940
59009E74940Q411O016L841J729r72l944n584m813k654j210j319j923j630k71J257
$$ 574940 583351 589367 593208 594937 593965 590021 584437 579624 576970 575760 574441 572518 570888 570617 571874
58994E71874K121K226K035J933J766J012n09k192l122l124l068l982n954q024
$$ 571874 573995 576221 578256 580189 581955 582967 582458 580266 577144 574020 570952 566970 561016 552992
58980E52992r173r208q669q115p705p266o468n080l305j764q59j75R64K410L172
$$ 552992 543819 534611 525942 517827 510122 502856 496388 491308 488003 486239 485380 485205 486169 488579 491751
58965D91751K706J683J204J649K599L509M091M373M673N264N870N825M990L915
$$ 491751 494457 496140 497344 498993 501592 505101 509192 513565 518238 523502 529372 535197 540187 544102
58951E44102K839J190j370m034n741o504p051p446p034n674m181l318l044k938
$$ 544102 546941 548131 546761 542727 536986 530482 523431 515985 508951 503277 499096 495778 492734 489796
58937D89796k902l159l873m888n799o358o796p378p618o607m485k772k512k821
$$ 489796 486894 483735 479862 474974 469175 462817 456021 448643 441025 434418 429933 427161 424649 421828
58923D21828k224q17O4m4k62L7M40N21M94N02K54k54m82j78K53O08J292K482L612
$$ 421828 419604 418787 418851 418807 418545 418582 419022 419543 420037 420539 420793 420539 420057 419879 420132 420740 422032 424514 428126
58904D28126M234M723N604O644P182O998O366N584M818M117L381K561K062K506
$$ 428126 432360 437083 442687 449331 456513 463511 469877 475461 480279 484396 487777 490338 492400 494906
58890D94906L863N339O398P375Q778J0441J1849J2895J3808J4607J5038J4927
$$ 494906 498769 504108 510506 517881 526659 537100 548949 561844 575652 590259 605297 620224
58878F20224J4196J2677J0297P374M486K007j54k372m849p258q922r597r887j0530
$$ 620224 634420 647097 657394 664768 669254 671261 671107 668735 663886 656628 647706 638109 628222 617692
58864F17692j1394j1669j0987r833q748p697o519n453m908m945n269n588n846
$$ 617692 606298 594629 583642 573809 565061 557364 550845 545392 540484 535539 530270 524682 518836
58851E18836o210o875p682q106p847p335p178p264o915n863m509l218j984r11
$$ 518836 512626 505751 498069 489963 482116 474781 467603 460339 453424 447561 443052 439834 437850 436939
58837D36939l92n12q58j148j693k774m005m589m132l052k240k316l000l377k979
$$ 436939 436547 436035 435177 434029 432336 429562 425557 420968 416836 413784 411544 409228 406228 402851 399872
58822C99872k348k127k029j370l30K43J40N0L77P59R01J050J324J424J322J519
$$ 399872 397524 395397 393368 391998 391668 391911 392051 392101 392478 393237 394138 395188 396512 397936 399258 400777
58806D00777K150K550K145J207L53j48j54N02J486J902J332M06r4k01l23m00j87
$$ 400777 402927 405477 407622 408829 409182 409034 408880 409382 410868 412770 414102 414508 414414 414213 413890 413490 413303
58789D13303O5j24o71j034r23m98N0O86J408K155K788L134L279L704M647N425
$$ 413303 413368 413244 412573 411539 410616 410118 410168 410854 412262 414417 417205 420339 423618 427322 431969 437394
58773D37394N044L604K297J689Q84j011l355m737m783m327m007l516k353p72L29
$$ 437394 442438 446042 448339 450028 450912 449901 446546 441809 437026 432699 428692 425176 422823 422051 422380
58758D22380K40q15j874k230k109k037j825q72N39J277J001Q33J769L174L708
$$ 422380 422620 421805 419931 417701 415592 413555 411730 410858 411397 412674 413675 414508 416277 419451 423159
58743D23159L183K635K799L399L826L840L522L130L059L595M578N517O020N994
$$ 423159 426342 428977 431776 435175 439001 442841 446363 449493 452552 456147 460725 466242 472262 478256
58729D78256N582N110M919N118N569O150O722O873O157M659K971J471J06j019
$$ 478256 483838 488948 493867 498985 504554 510704 517426 524299 530456 535115 538086 539557 539663 538644
58715E38644j466j112m40J21O67J421K310L274M389N432N814N313M348L255J863
$$ 538644 537178 536066 535626 535747 536414 537835 540145 543419 547808 553240 559054 564367 568715 571970 573833
58700E73833Q0j718l366n282p595r511j0257j0280j0721j1903j2948j2889j1716
$$ 573833 573913 572195 568829 563547 555952 546441 536184 525904 515183 503280 490332 477443 465727
58687D65727j0310r489r116q240o369m361l446l551l502k921k721l393l961l371
$$ 465727 455417 445928 436812 428572 422203 417842 414396 410845 407343 404422 401701 398308 394347 390976
58673C90976k002r08l11K18P40J031J345K182L498M793N709O066N668M609L458
$$ 390976 388974 388066 387755 387973 388713 389744 391089 393271 396769 401562 407271 413337 419005 423614 427072
58658D27072K620J866R07j00r83j859k586k621k083k140l476n026n148l614j570
$$ 427072 429692 431558 432465 432365 431382 429523 426937 424316 422233 420093 416617 411591 406443 402829 401259
58643D01259J1Q92J066O90L82P12J453J959K041J945J848J976K786M255N411N403
$$ 401259 401270 402162 403228 403918 404300 405012 406465 408424 410465 412410 414258 416234 419020 423275 428686 434089
58627D34089M639M105L901L384K446J645J196P01q9r08j367j179k18J169K245
$$ 434089 438728 442833 446734 450118 452564 454209 455405 456106 456017 455109 453742 452563 452345 453514 455759
58612D55759K746L255M122M611L935K612J772J471P64p36k338l276l394k855j973
$$ 455759 458505 461760 465882 470493 474428 477040 478812 480283 481047 480311 477973 474697 471303 468448 466475
58597D66475j305j287j701k026k089j952j495p16p0K32P84K092L499L989L724
$$ 466475 465170 463883 462182 460156 458067 456115 454620 453904 453834 454066 454850 456942 460441 464430 468154
58582D68154L825M729N742O172O071N793N548N442N400N116M509M062M164M522
$$ 468154 471979 476708 482450 488622 494693 500486 506034 511476 516876 521992 526501 530563 534727 539249
58568E39249M696M871N411O200P003Q014R288J0193J0307J0395J1525J3634J5857
$$ 539249 543945 548816 554227 560427 567430 575444 584732 594925 605232 615627 627152 640786 656643
58555F56643J7831J9576K0561K0086J8314J5912J2911R105N255K619J275N0j789
$$ 656643 674474 694050 714611 734697 753011 768923 781834 790939 796194 798813 800088 800138 798349
58542G98349l808n411o607p649q707r983j1552j3081j4182j4894j5323j5279j4785
$$ 798349 794541 789130 782523 774874 766167 756184 744632 731551 717369 702475 687152 671873 657088
58529F57088j4314j3830j2438r894p585o791o724n746l879k546k258k227j942
$$ 657088 642774 628944 616506 606612 599027 592236 585512 579766 575887 573341 571083 568856 566914
58516E66914j544p09J092L215M225L880L341L308L264K794K304K133K039J820
$$ 566914 565370 564661 565753 568968 573193 577073 580414 583722 586986 589780 592084 594217 596256 598076
58502E98076J519R11k46j527k319k773l284l475k910k421l186m686n168m087k575
$$ 598076 599595 600506 600260 598733 596414 593641 590357 586882 583972 581551 578365 573679 568511 564424 561849
58487E61849j511o27L20J005J420J980K652L070L545M678O058O729O835P412Q643
$$ 561849 560338 559711 560031 561036 562456 564436 567088 570158 573703 578381 584439 591168 598003 605415 614058
58472F14058R720J0278J0540J0266R024P320N813L853N73k919m584m483m555n364
$$ 614058 623778 634056 644596 654862 663886 671206 677019 680872 681445 678526 673942 669459 664904 659540
58458F59540n477m272k945k196j242K63J499K320L672N489O291N676N056N103
$$ 659540 654063 649791 646846 644650 643408 643671 645170 647490 651162 656651 662942 668618 673674 678777
58444F78777M549K549J57j633l343n320o493o142n183m537l725k219o50L55J116
$$ 678777 683326 685875 686032 684399 681056 675736 669243 663101 657918 653381 649656 647437 646787 647142 648258
58429F48258J745J656J105J506L289N083N990O893Q566J0285J1387J2378J3369
$$ 648258 650003 651659 652764 654270 657559 662642 668632 675525 684091 694376 705763 718141 731510
58416G31510J3254J1652R813Q448O547L639J234M50J01j197k763l437l702m409
$$ 731510 744764 756416 766229 774677 781224 784863 786097 786547 786648 785451 782688 779251 775549 771140
58402G71140m912m326l359l034k829j764k94N80J017J627K146K221K488L432M233
$$ 771140 766228 761902 758543 755509 752680 750916 750622 751202 752219 753846 755992 758213 760701 764133 768366
58387G68366M082L541L355L073K080Q51n5r32j733j425K47J772K029J895K439
$$ 768366 772448 775989 779344 782417 784497 785348 785293 784361 782628 781203 781450 783222 785251 787146 789585
58372G89585L082L077L165M082M924M674M081M334N140N683O220P219Q190Q831
$$ 789585 792667 795744 798909 802991 807915 812589 816670 821004 826144 831827 838047 845266 853456 862287
58358H62287R923J1686J2705J2035J0847J0480J0471J0012R604R687R328Q009
$$ 862287 872210 883896 896601 908636 919483 929963 940434 950446 960050 969737 979065 987074
58346I87074O901O724O258M906M554O635R310J0085R496R603J0489J0912J1118
$$ 987074 993975 1000699 1006957 1011863 1016417 1023052 1032362 1042447 1051943 1061546 1072035 1082947 1094065
58333A094065J2242J3930J5024J5704J6689J7338J6721J5558J5044J4795J3892
$$ 1094065 1106307 1120237 1135261 1150965 1167654 1184992 1201713 1217271 1232315 1247110 1261002
58322A261002J2707J1796J0468Q459P347Q149R111Q276O665O514P840R165J0141
$$ 1261002 1273709 1285505 1295973 1304432 1311779 1319928 1329039 1337315 1343980 1350494 1358334 1367499 1377640
58309A377640J1142J1721J1823J2876J5425J7452J7466J7237J8786K0783K0921
$$ 1377640 1388782 1400503 1412326 1425202 1440627 1458079 1475545 1492782 1511568 1532351 1553272
58298A553272J9982K0272K1684K2459K2428K2355K1627J9600J7763J7688J8345
$$ 1553272 1573254 1593526 1615210 1637669 1660097 1682452 1704079 1723679 1741442 1759130 1777475
58287A777475J8173J7942J8746J9422J9080J9798K3250K7076K8459K9017L1918
$$ 1777475 1795648 1813590 1832336 1851758 1870838 1890636 1913886 1940962 1969421 1998438 2030356
58276B030356L6354L9258M0697M2998M6061M7987M9015N0629N2175N2374N2557
$$ 2030356 2066710 2105968 2146665 2189663 2235724 2283711 2332726 2383355 2435530 2487904 2540461
58265B540461N4310N5881N5214N4405N6492O0032O1857O2979O6440P1248P4141
$$ 2540461 2594771 2650652 2705866 2760271 2816763 2876795 2938652 3001631 3068071 3139319 3213460
58254C213460P5648P8700Q2806Q5292Q6896R0250R4327R6278R7355J00998J06449
$$ 3213460 3289108 3367808 3450614 3535906 3622802 3713052 3807379 3903657 4001012 4102010 4208459
58243D208459J10418J13705J19798J28302J36112J43684J53636J64644J73566
$$ 4208459 4318877 4432582 4552380 4680682 4816794 4960478 5114114 5278758 5452324
58234E452324J82108J94307K08912K21491K32697K46943K64358K81706K99859
$$ 5452324 5634432 5828739 6037651 6259142 6491839 6738782 7003140 7284846 7584705
58225G584705L22455L48424L73800L99480M29450M63274M98514N38169N86962
$$ 7584705 7907160 8255584 8629384 9028864 9458314 9921588 10420102 10958271 11545233
58216A1545233O42954P01924P67106Q45029R35181J034046J145642J277664J431649
$$ 11545233 12188187 12890111 13657217 14502246 15437427 16471473 17617115 18894779 20326428
58207B0326428J607730J814293K063355K363777K725362L150546L607535M040883
$$ 20326428 21934158 23748451 25811806 28175583 30900945 34051491 37659026 41699909
58199D1699909M446765M924660N615962O597606P867846R415820J1250700J3372930
$$ 41699909 46146674 51071334 56687296 63284902 71152748 80568568 91819268 105192198
58191A05192198J5784387J8535327K1698019K5272555K9129814L2921415L5793541
$$ 105192198 120976585 139511912 161209931 186482486 215612300 248533715 284327256
58184B84327256L6144450L2059711K2562127Q728881o502751j9839819k9184907
$$ 284327256 320471706 352531417 375093544 383822425 377319674 357479855 328294948
58177C28294948l4107986l5310348l3891330l0922751k7274043k3532582k0018635
$$ 328294948 294186962 258876614 224985284 194062533 166788490 143255908 123237273
58170A23237273j6883541j4189334j1928030j0042123q471380p174012o107518
$$ 123237273 106353732 92164398 80236368 70194245 61722865 54548853 48441335
58163D8441335n221216m477466l858523l346342k914763k545771k234587j973802
$$ 48441335 43220119 38742653 34884130 31537788 28623025 26077254 23842667 21868865
58155B1868865j748647j551145j383170j241937j116684j002559r04045q21649
$$ 21868865 20120218 18569073 17185903 15943966 14827282 13824723 12920678 12099029
58147A2099029p47910o79254o19649n69850n24307m81219m44786m15134l86316
$$ 12099029 11351119 10671865 10052216 9482366 8958059 8476840 8032054 7616920 7230604
58138G230604l56542l30569l09824k89700k68618k50498k36129k21145k04709
$$ 7230604 6874062 6543493 6233669 5943969 5675351 5424853 5188724 4967579 4762870
58129D762870j91458j82585j73378j61871j51792j44633j36815j27145j19432
$$ 4762870 4571412 4388827 4215449 4053578 3901786 3757153 3620338 3493193 3373761
58120C373761j15003j09916j02356r5876r2510q9256q4165p9731p7491p5048p1184
$$ 3373761 3258758 3148842 3046486 2950610 2858100 2768844 2684679 2604948 2527457 2452409 2381225
58109B381225o8350o7546o6024o2418n9171n7661n5891n2975n0942n0150m7918
$$ 2381225 2312875 2245329 2179305 2116887 2057716 2000055 1944164 1891189 1840247 1790097 1742179
58098A742179m3681m0520l9632l8221l4893l2227l1742l1126k8856k6991k6976
$$ 1742179 1698498 1657978 1618346 1580125 1545232 1513005 1481263 1450137 1421281 1394290 1367314
58087A367314k6995k5830k5201k5959k6032k4508k3725k4955k5812k4415k2429
$$ 1367314 1340319 1314489 1289288 1263329 1237297 1212789 1189064 1164109 1138297 1113882 1091453
58076A091453k1613k0929j9453j8700j9626k0522k0186k0101k1242k1820k0416
$$ 1091453 1069840 1048911 1029458 1010758 991132 970610 950424 930323 909081 887261 866845
58065H66845j8400j7154j5801j3699j2240j2101j1558r619q061q332r189r387
$$ 866845 848445 831291 815490 801791 789551 777450 765892 756273 748212 739880 730691 721304
58053G21304r927j1425j2093j0646q813q591r228r072q372q051p708o847o348
$$ 721304 711377 699952 687859 677213 668400 659809 650581 641509 633137 625086 617378 610531 604183
58040F04183o895p571p528p345p427o999n931n464n934n945n035m774n964p140
$$ 604183 597288 589717 582189 574844 567417 560418 554487 549023 543089 537144 532109 527335 521371 514231
58026E14231p259p401q249q507p486o772p421p912o878n522n334n497m761l787
$$ 514231 506972 499571 491322 482815 475329 468557 461136 453224 446346 440824 435490 429993 425232 421445
58012D21445l562l353k468k114l324m681m354k947k230k418k648k894l372l283
$$ 421445 417883 414530 412062 409948 406624 401943 397589 394642 392412 389994 387346 384452 381080 377797
57998C77797k028o36k87m59m7Q97J825K890L995M034K576R90M98M51j38q21r78
$$ 377797 375769 375133 374846 374387 374340 375237 377062 379952 383947 387981 390557 391547 392045 392496 392358 391537 390559
57981C90559j351k708m251m938n137n554n753n177m345l746k800j331n31j062
$$ 390559 389208 386500 382249 377311 372174 366620 360867 355690 351345 347599 344799 343468 342937 341875
57967C41875j665j148l18l30n75K2R72J243J111J319J535J247J055J462J577O48
$$ 341875 340210 339062 338744 338414 337839 337861 338833 340076 341187 342506 344041 345288 346343 347805 349382 350030
57951C50030l67l18K14J52j01L45J049J118Q72R52Q59J26j91R81K726L433L292
$$ 350030 349663 349345 349559 349711 349610 349955 351004 352122 352994 353946 354805 354931 354740 355721 358447 361880 365172
57934C65172L672M850O001O757P120O587M868K793J105p05l069n025n819o532
$$ 365172 368844 373694 379695 386452 393572 400159 405027 407820 408925 408220 405151 400126 394307 387775
57920C87775q310j0091j0153q883p942p556o783n718n222m928l798k320j989k758
$$ 387775 379465 369374 359221 350338 342396 334840 328057 322339 317117 312189 308391 306071 304082 301324
57906C01324k976j920n52K55N61M31k60j020j168r86j248j731j561q15m48p79
$$ 301324 298348 296428 295876 296131 296692 297123 296863 295843 294675 293689 292441 290710 289149 288334 287886 287107
57890B87107j341j960k728l078k336j041m77r67j704k052j967j439o26k48p85
$$ 287107 285766 283806 281078 278000 275664 274623 274146 273179 271475 269423 267456 266017 265391 265143 264358
57875B64358j655k144k616l711m968n465n276n097m913m321l602l226k814j869
$$ 264358 262703 260559 257943 254232 249264 243799 238523 233426 228513 224192 220590 217364 214550 212681
57861B12681r40p75r12m13O20J522K364L459M303M445M584N267N416L967K086
$$ 212681 211741 210966 210054 209641 210261 211783 214147 217606 221909 226354 230938 236205 241621 245588 247674
57846B47674J698K402K091K49j621k675l599m673n118m695m131l581k400o97M49
$$ 247674 249372 251774 253865 254114 252493 249818 246219 241546 236428 231733 227602 224021 221621 220924 221373
57831B21373P01Q79J447J964K130K025J351p5j175o08J065J979J688J507K020
$$ 221373 222074 222953 224400 226364 228494 230519 231870 231795 230620 230012 231077 233056 234744 236251 238271
57816B38271K260J764J397J479R31q48k819l934m527n203n608n273m684m535m748
$$ 238271 240531 242295 243692 245171 246102 245254 242435 238501 233974 228771 223163 217890 213206 208671 203923
57801B03923m865m744m394l781l127k706k208j085L77J249J236Q47L43l76r52
$$ 203923 199058 194314 189920 186139 183012 180306 178098 177013 177390 178639 179875 180722 181065 180689 179737
57786A79737q58m91o15p72L20K595M483N189N599O469P263P427P336P298O839
$$ 179737 178879 178388 177773 177001 177321 179916 184399 189588 195187 201656 208919 216346 223682 230980 237819
57771B37819N730M556L594K249K32j778l239m428n528o137o328o996q398r436
$$ 237819 243549 248105 251699 253948 254180 252402 249163 244735 239207 233070 226742 219746 211348 201912
57757B01912r146p997o948o205n574n175n004m587l759l099k981k943k591k282
$$ 201912 192766 184769 177821 171616 166042 160867 155863 151276 147517 144418 141437 138494 135903 133621
57743A33621k369k468k116j471p86J09J318K451L199L716M120M253M235M440M687
$$ 133621 131252 128784 126668 125197 124411 124520 125838 128289 131488 135204 139324 143577 147812 152252 156939
57728A56939M311L275K314J708R48k3m49j41p4q95j836j889j178m29R9M56M60
$$ 156939 161250 164525 166839 168547 169495 169472 169023 168882 168808 167913 166077 164188 163010 162581 162680 163136 163596
57711A63596P6l14n44r53j582j889j647j335j173o46M50J506K171L014M378N484
$$ 163596 163672 163358 162814 161861 160279 158390 156743 155408 154235 153589 154039 155545 157716 160730 165108 170592
57695A70592N408M194K337O1k239l763m287m627n297n548m592l015k000j773j616
$$ 170592 176000 180194 182531 182592 180353 176590 172303 167676 162379 156831 152239 149224 147224 145451 143835
57680A43835r01N97K830N279P200Q663J0619J3456J6484J9486K3582K9615L6830
$$ 143835 142934 143531 146361 151640 158840 167503 178122 191578 208062 227548 251130 280745 317575
57667C17575M4226N1766N8291N9209M8972K6674j963k8532m7104n6021n6739n2128
$$ 317575 361801 413567 471858 531067 580039 606713 604750 576218 529114 473093 416354 364226
57655C64226m5167l7919l1246k5321k0243j6215j3336j1367r704p895o170n125
$$ 364226 319059 281140 249894 224573 204330 188115 174779 163412 153708 145813 139643 134518
57643A34518m824m703m347l748k803j390m5M42L91J025K423K971J637l68j298
$$ 134518 129694 124991 120644 116896 114093 112703 112658 113100 113491 114516 116939 119910 121547 121179 119881
57628A19881j105p76m68J92O35p8j522k268j920j367j126p94k86j98o08p50k93
$$ 119881 118776 118000 117532 117724 118359 118281 116759 114491 112571 111204 110078 109284 108998 108800 108192 107442 107149
57611A07149J13j2j84J57Q10J358J783K033J712P94L9L3K64j36j100j807j948
$$ 107149 107262 107250 107066 107223 108033 109391 111174 113207 114919 115713 115752 115785 116049 115913 114813 113006 111058
57594A11058j980k139j945j072r6J67k49o51p43r15j311j382o27O06J555J846
$$ 111058 109078 106939 104994 103922 103826 103993 103744 103093 102350 101435 100124 98742 98115 98721 100276 102122
57578A02122J425K33j434k566k290r80J82N92N07J40n67j286j347o89J4L33M34
$$ 102122 103547 103780 102346 99780 97490 96510 96692 97284 97791 97931 97364 96078 94731 94042 94056 94389 94823
57561I4823L96j5o43r35p74n84m44j5N08M38k13o82q85j619k919l617l199k744
$$ 94823 95219 95204 94561 93626 92852 92268 91824 91809 92317 92755 92542 91860 90975 89356 86437 82820 79621 76877
57543G6877l021l018j611L49J126N38r3J1L74M04J19j89k18K16P86P70J03l05
$$ 76877 73856 70838 69227 69576 70702 71240 71147 71158 71532 71936 72055 71866 71648 71864 72650 73420 73523 73218
57525G3218Q0N49M59M55J314K329K204J068K58M17J064J799K590L029K596J705
$$ 73218 73298 73847 74306 74761 76075 78404 80608 81676 81934 82351 83415 85214 87804 90833 93429 95134
57509I5134J335J539J356L29q60j416j189l68P63J599J532O78k80r62j357j279
$$ 95134 96469 98008 99364 99693 98833 97417 96228 95860 96623 98222 99754 100432 100152 99190 97833 96554
57493I6554n61L08O00M14N21J164J782J928J712J340R21O89P39O31lo36m83J01
$$ 96554 95993 96301 96901 97315 97836 99000 100782 102710 104422 105762 106683 107372 108111 108742 108739 108103 107620 107721
57475A07721j01j453k919l413k934k126j512j295j325j092l60K65J14l36J3J095
$$ 107721 107620 106167 103248 99835 96901 94775 93263 91968 90643 89551 89191 89456 89570 89234 89247 90342
57459I0342J520N75o94q94j4Q84J075N96k11r33j052l29P97J546J547J025L61
$$ 90342 91862 92437 91743 90849 90835 91719 92794 93390 93179 92246 91194 90865 91662 93208 94755 95780 96141
57442I6141l30j025j473j281n01K15L34K00M88J054J082M35k2J91L87o5p12r04
$$ 96141 95811 94786 93313 92032 91531 91746 92080 92280 92768 93822 94904 95339 95317 95508 95895 95830 95118 94214
57424I4214r65j419j781j224l9P35P85O21M35k8n67n83n1M86Q09J077J131O57
$$ 94214 93249 91830 90049 88825 88786 89521 90306 90927 91362 91334 90767 90184 90133 90619 91428 92505 93636 94293
57406I4293m9l09k9L58O67Q38M25p14j532q44Q12J674J048j02r01j460j808j356
$$ 94293 94244 93935 93906 94264 94931 95769 96194 95480 93948 93104 93916 95590 96638 96536 95635 94175 92367 91011
57388I1011OJ432K229K575K648K129J026J20m1K09M02N82P82O90K63k6K9m9o14
$$ 91011 91017 92449 94678 97253 99901 102030 103056 103176 103135 103344 103746 104328 105110 105800 106063 106037 106066 106017 105403
57369A05403j375j951k311k392j978j209n75j93J97M69J73m17m53J72N45J49m56
$$ 105403 104028 102077 99766 97374 95396 94187 93612 93419 93616 94085 94258 93841 93388 93560 94105 94254 93798
57352I3798o98o32j28J382L624N061M593K860J194R3n21m90J39O53N30K52M36
$$ 93798 93100 92468 92340 93722 97346 102407 107000 109860 111054 111147 110626 110136 110275 110928 111458 111710 112146
57335A12146P87P68O59R65J301Q97r2p60p24l75m8K09J63m93j423j732j023R7
$$ 112146 112933 113701 114360 115325 116626 117523 117431 116671 115947 115572 115524 115733 115896 115403 113980 112248 111225 111322
57317A11322O65L03n02q74l95M43P83M94L02P01J234J197O21J71K69P30J087J002
$$ 111322 111987 112290 111788 110914 110519 110962 111745 112239 112541 113242 114476 115673 116294 116465 116734 117464 118551 119553
57299A19553N41J31J21L18K99O7k2O9J8k45m89p74j353j969k111k051k686l988
$$ 119553 120094 120225 120346 120664 120963 121030 121008 121077 121095 120850 120361 119587 118234 116265 114154 112103 109417 105429
57281A05429m727m222l412l469m179m528m192l589k959k246j549r19k0J426L137
$$ 105429 100702 96480 93068 89599 85420 80892 76700 73111 70152 67906 66357 65438 65418 66844 69981
57266F9981M660N899O738O682N536M070L344L541M027M297M361M416M549M674
$$ 69981 74641 80540 87278 93960 99496 103566 106910 110451 114478 118775 123136 127552 132101 136775
57252A36775M470L630K370J304P20M63N75J305K250K473J849J457K000K790K993
$$ 136775 141245 144875 147245 148549 149269 149732 150307 151612 153862 156335 158184 159641 161641 164431 167424
57237A67424K926L177L314K650J642J310J646J839J804K190L052L644L707L818
$$ 167424 170350 173527 176841 179491 181133 182443 184089 185928 187732 189922 192974 196618 200325 204143
57223B04143M295M616M284L517K804K380K340K713L185L282L006K874L151L520
$$ 204143 208438 213054 217338 220855 223659 226039 228379 231092 234277 237559 240565 243439 246590 250110
57209B50110L673L783M125M562M699M425L963L456K791K015J744K730M808O674
$$ 250110 253783 257566 261691 266253 270952 275377 279340 282796 285587 287602 289346 292076 296884 303558
57195C03558P227O872O864P570Q173Q105P803P763P796P758Q091R048J0014J0381
$$ 303558 310785 317657 324521 332091 340264 348369 356172 363935 371731 379489 387580 396628 406642 417023
57181D17023J0532J1214J2324J3110J3255J3101J3014J3110J3447J3987J4568
$$ 417023 427555 438769 451093 464203 477458 490559 503573 516683 530130 544117 558685
57170E58685J5149J5885J6714J7259J7421J7503J7558J7220J6489J5894J5403
$$ 558685 573834 589719 606433 623692 641113 658616 676174 693394 709883 725777 741180
57159G41180J4116J1741R547Q927R637J0375J0532J0459J0487J0642J0999J1549
$$ 741180 755296 767037 776584 785511 795148 805523 816055 826514 837001 847643 858642 870191
57147H70191J2005J2323J2903J3619J3482J2145J0898J1053J1994J2244J1842
$$ 870191 882196 894519 907422 921041 934523 946668 957566 968619 980613 992857 1004699
57136A004699J2110J3353J4443J4742J4841J5143J5150J4653J4478J5383J7108
$$ 1004699 1016809 1030162 1044605 1059347 1074188 1089331 1104481 1119134 1133612 1148995 1166103
57125A166103J8979K0756K2498K4310K6541K9529L2941L6022L8771M2138M6727
$$ 1166103 1185082 1205838 1228336 1252646 1279187 1308716 1341657 1377679 1416450 1458588 1505315
57114A505315N2030N7380O3009O9689P7717Q6756R6529J07313J19826J34720J52207
$$ 1505315 1557345 1614725 1677734 1747423 1825140 1911896 2008425 2115738 2235564 2370284 2522491
57103B522491J72272J95364K22626K55285K94388L41419L98591M67801N49529
$$ 2522491 2694763 2890127 3112753 3368038 3662426 4003845 4402436 4870237 5419766
57094E419766O43231P48154Q62700R83176J104055J219516J324128J412529J479547
$$ 5419766 6062997 6811151 7673851 8657027 9761082 10980598 12304726 13717255 15196802
57085A5196802J520754J532001J508478J445419J340505J195270J013958Q00995
$$ 15196802 16717556 18249557 19758035 21203454 22543959 23739229 24753187 25554182
57077B5554182N59348K91082L16l03378o04650q86210j133270j334794j482803
$$ 25554182 26113530 26404612 26404928 26101550 25496900 24610690 23477420 22142626 20659823
57068B0659823j573248j607941j593982j540579j456960j352601j237035j118099
$$ 20659823 19086575 17478634 15884652 14344073 12887113 11534512 10297477 9179378
57060I179378j000851q88606p83973o88498o02423n25567m57945l99217l48319
$$ 9179378 8178527 7289921 6505948 5817450 5215027 4689460 4231515 3832298 3483979
57051C483979l04134k65868k32520k02876j76495j53962j35621j20840j08864
$$ 3483979 3179845 2913977 2681457 2478581 2302086 2148124 2012503 1891663 1782799
57042A782799r9514r2327q5906p8994p1831o5565o0616n6324n2048m7914m4396
$$ 1782799 1683285 1590958 1505052 1426058 1354227 1288662 1228046 1171722 1119674 1071760 1027364
57031A027364m1582l9113l6625l4207l2263l0916k9796k8526k7181k5949k4636
$$ 1027364 985782 946669 910044 875837 843574 812658 782862 754336 727155 701206 676570
57020F76570k3043k1514k0536k0003j9450j8810j8259j7541j6265j4695j3506
$$ 676570 653527 632013 611477 591474 572024 553214 534955 517414 501149 486454 472948
57009D72948j2798j2164j1590j1395j1416j1145j0682j0555j0660j0363r693r316
$$ 472948 460150 447986 436396 425001 413585 402440 391758 381203 370543 360180 350487 341171
56997C41171r296r003q369q038q047p597o485n485m873l889k238q23k21M26K068
$$ 341171 331875 322872 314503 306465 298418 290821 284336 278851 273978 270089 267851 267028 266807 267233 269301
56982B69301M235N771O111M951J707l486q872j2423j3762j3869j3336j2019j0085
$$ 269301 273536 279307 285418 290369 292076 288590 279718 267295 253533 239664 226328 214309 204224
56969B04224q253o881n598l977k059j51J544L020M406N822P281Q911J1075J3758
$$ 204224 195971 189090 183492 179515 177456 177305 178849 181869 186275 192097 199378 208289 219364 233122
56955B33122J5841J5775J3068Q517K968l148q814j2282j2772j1515j0324r647
$$ 233122 248963 264738 277806 286323 289291 286143 277329 265047 252275 240760 230436 220789
56943B20789q739p091m925k710q78L94J612L684O723R739J2082J4450J7678K1115
$$ 220789 212050 204959 200034 197324 196446 196840 198452 202136 208859 218598 230680 245130 262808 283923
56929B83923K3104K2605J9490J3755N601l692j1940j7449j9931k0143j9142j7725
$$ 283923 307027 329632 349122 362877 368478 364786 352846 335397 315466 295323 276181 258456
56917B58456j6164j4345j2274j0228q351o585n122m360m166l819l023k259j776
$$ 258456 242292 227947 215673 205445 197094 190509 185387 181027 176861 173042 170019 167760 165984
56904A65984j011M03J858K729L425M658O270P629Q716R847J0822J1282J1671J2802
$$ 165984 164973 165376 167234 169963 173388 178046 184316 191945 200661 210508 221330 232612 244283 257085
56890B57085J4579J6057J6710J6886J6986J6892J6250J4669J1582O519k88p843
$$ 257085 271664 287721 304431 321317 338303 355195 371445 386114 397696 404215 403927 396084
56878C96084j4919k0438k3683k4604k3781k1752j8544j4239r621n654k449P39
$$ 396084 381165 360727 337044 312440 288659 266907 248363 234124 224503 218849 216400 217139
56866B17139M582R105J3943J8726K3345K8072L3330L9016M4051M6642M4884L7369
$$ 217139 221721 230826 244769 263495 286840 314912 348242 387258 431309 477951 522835 560204
56854E60204K4115P254r530k2835l0874l3558l2097k8511k4431j9908j4032o917
$$ 560204 584319 591573 582043 559208 528334 494776 462679 434168 409737 389829 375797 368880
56842C68880L0O055J2028J8756K5579L1724L7921M5417N4062O2589O9947P4701
$$ 368880 368910 374965 386993 405749 431328 463052 500973 546390 600452 663041 732988 807689
56830H07689P3566O2559M0605J1413j8438m2994n9195o7082o8448o5086n8236
$$ 807689 881255 943814 984419 995832 977394 934400 875205 808123 739675 674589 616353
56819F16353m9382m0462l2484k4712j6195p598l80N406J1310J8537K6810L5189
$$ 616353 566971 526509 494025 469313 453118 445520 445140 450546 461856 480393 507203 542392
56807E42392M2998M9612N3825N3579M6415L0976Q986j4699l4947m9204n7353n9836
$$ 542392 585390 635002 688827 742406 788821 819797 828783 814084 779137 729933 672580 612744
56795F12744n7254n1230m4013l6933l0141k3765j8243j3512q965m391q9M070Q809
$$ 612744 555490 504260 460247 423314 393173 369408 351165 337653 328688 324297 324208 328278 337087
56782C37087J4427K0271K5300K8516K8824K5190J7287N807p551k0110k9041l3237
$$ 337087 351514 371785 397085 425601 454425 479615 496902 502709 495158 475048 446007 412770
56770D12770l4114l3718l2438k9584k5551k1916j9367j7041j4169j1173q797p247
$$ 412770 378656 344938 312500 282916 257365 235449 216082 199041 184872 173699 164902 157655
56758A57655o529o595o848o400n210m124l505k761j523m49k70q42j539k044k302
$$ 157655 151126 144531 137683 131283 126073 121949 118444 115683 114160 113711 113441 112599 111060 109016 106714
56743A06714k220j756j011j33N11K63j010k241k189j107l92n44o18Q4R08J015
$$ 106714 104494 102738 101727 101594 102105 102368 101358 99117 96928 95821 95429 94885 94267 94351 95259 96274
56727I6274O12L86M29L95J14m56j331k048j763l40J139J523Q97K25O3J78K16K11
$$ 96274 96886 97272 97701 98096 98210 97754 96423 94375 92612 92272 93411 94934 95831 96056 96119 96297 96513 96724
56709I6724M10Q74J310J318R12O53R71J466J331M23m84n98J73J355K407K962K922
$$ 96724 97134 98008 99318 100636 101548 102201 103172 104638 105969 106392 105908 105310 105483 106838 109245 112207 115129
56692A15129K419J617O70k9J6O76J057N05o18j624k418l194l751l856l831l948
$$ 115129 117548 119165 119835 119806 119822 120498 121555 122060 121442 119818 117400 114206 110455 106599 102768 98820
56676I8820l752k782j467m31M20J182J064l84j819j502K00J393J503J690K394
$$ 98820 95068 92286 90819 90388 90808 91990 93054 92670 90851 89349 89549 90942 92445 94135 96529
56661I6529K453J264J9k1Q32J565J826J737J355R60R36R92M12o05r84m13L35R83
$$ 96529 98982 100246 100265 100244 101076 102641 104467 106204 107559 108519 109455 110447 110859 110254 109270 108857 109192 110175
56643A10175K241M117N377N451N439O185O702N759L925K708K462K394K051J625
$$ 110175 112416 116533 121910 127361 132800 138985 145687 151446 155371 158079 160541 162935 164986 166611
56629A66611J247R01P50P57N27Rj61L00O80L48l05p22j172k069k962l189k931
$$ 166611 167858 168759 169509 170266 170793 170802 170641 170941 171621 171969 171664 170942 169770 167701 164739 161550 158619
56612A58619k816k943l112l461m077m472m216l665l306k950k248j504j182j125
$$ 158619 155803 152860 149748 146287 142210 137738 133522 129857 126551 123601 121353 119849 118667 117542
56598A17542r94r78j337j648j360o22oK54J59l55r65q71J13J006R37M02L85Q87
$$ 117542 116548 115570 114233 112585 111225 110603 110597 110851 111010 110655 109690 108819 108932 109938 110875 111277 111662 112549
56580A12549J221J242J288J285R08M03L28O52Q80Q53Q06Q69J089J564K071K063
$$ 112549 113770 115012 116300 117585 118493 118896 119224 119876 120756 121609 122415 123284 124373 125937 128008 130071
56564A30071J648J866L248M811N429N554O377P836Q625P941O083L645J303O4M09
$$ 130071 131719 133585 136833 141644 147073 152627 159004 166840 175465 183406 189489 193134 194437 194501 194910
56549A94910J252R85l25j063n20J17l27j375j877j653j315j113q09m28l68p51
$$ 194910 196162 197147 196822 195759 195239 195356 195029 193654 191777 190124 188809 187696 186887 186459 186091 185340
56533A85340j243j561j856k391l043l328k907k041j335j177j462j836j957j638
$$ 185340 184097 182536 180680 178289 175246 171918 169011 166970 165635 164458 162996 161160 159203 157565
56519A57565j054o85p58q52n24r2j43m80l84J14K50j9K30J230J762R07m36p08
$$ 157565 156511 155826 155068 154216 153692 153600 153457 152977 152593 152707 152957 152938 153168 154398 156160 157067 156631 155923
56501A55923K38J205J305P06M3j51L57J183J499R65K11n6L3p3n47j255k081k632
$$ 155923 156161 157366 158671 159377 159420 159269 159626 160809 162308 163273 163484 163428 163461 163388 162841 161586 159505 156873
56483A56873k230q16O29J179J039R12R74J023J132J379J451J166Q91Q92Q14M34
$$ 156873 154643 153827 154456 155635 156674 157586 158560 159583 160715 162094 163545 164711 165602 166494 167308 167742
56467A67742K54O71J178J149P54L75j36p71p69K73J364J366O95N73J064J122L41
$$ 167742 167996 168667 169845 170994 171748 172123 171987 171216 170447 170720 172084 173450 174145 174718 175782 176904 177245
56450A77245n70j021j206j445j717j854j657r63n0L74J37J8N79J236J233Q27O00
$$ 177245 176675 175654 174448 173003 171286 169432 167775 166812 166762 167136 167273 167291 167870 169106 170339 171166 171766
56433A71766L44l43r51p14J50R23J551K206K298J249j73o99m17m67j125j546j315
$$ 171766 172110 171767 170816 170102 170252 171175 172726 174932 177230 178479 178306 177607 177190 176723 175598 174052 172737
56416A72737r31p39n46l24k62j79Q4q4j276k748l078k088r27l21N9N13Q31R71
$$ 172737 171806 171067 170521 170197 169935 169756 169840 169756 168480 165732 162654 160566 159639 159318 159377 159890 160721 161692
56398A61692J195J453J570J969L128M478M949M538M211M369M578M684M908M855
$$ 161692 162887 164340 165910 167879 171007 175485 180434 184972 189183 193552 198130 202814 207722 212577
56384B12577L807K132J096J058J068M85j28j06M48J114J558J332K26j047j545
$$ 212577 216384 218516 219612 220670 221738 222223 222095 221989 222437 223551 225109 226441 226667 225620 224075
56369B24075j469j760k380k287j256m01m93j022j362j749k453k986k791k045j318
$$ 224075 222606 220846 218466 216179 214923 214522 214029 213007 211645 209896 207443 204457 201666 199621 198303
56354A98303q94p15m43M67K124L644L989L280K568K384K407K352K289K159J921
$$ 198303 197409 196694 196251 196718 198842 202486 206475 209755 212323 214707 217114 219466 221755 223914 225835
56339B25835J993K549K699J560j38p86j27O34Q11Q56R85Q46O96J364K637L145
$$ 225835 227828 230377 233076 234636 234498 233712 233585 234219 235030 235886 236871 237717 238413 239777 242414 245559
56323B45559K348J240O85L69n6j67K50N24J44m49o47m67j72K8k10r69j396n66
$$ 245559 247907 249147 249832 250201 250145 249978 250228 250752 250896 250447 249800 249333 249161 249189 248979 248010 246614 246048
56305B46048R47J652J397J559K731L765L664K956K491K138J543J039J041J325
$$ 246048 246995 248647 250044 251603 254334 258099 261763 264719 267210 269348 270891 271930 272971 274296
56291B74296J552J706J692J283P98Q37J249J398J477K285L591M241M127M372N161
$$ 274296 275848 277554 279246 280529 281327 282164 283413 284811 286288 288573 292164 296405 300532 304904 310065
56276C10065N132L700K295K285L092L524L659M235N156N777N998O126O263O485
$$ 310065 315197 318897 321192 323477 326569 330093 333752 337987 343143 348920 354918 361044 367307 373792
56262C73792P001P584P657P334P513Q521R660J0518J1645J3407J5272J6912J8902
$$ 373792 380793 388377 396034 403368 410881 419402 429062 439580 451225 464632 479904 496816 515718
56249E15718K1604K4350K6460K8317L0635L3404L6052L8143L9485M0107M0318
$$ 515718 537322 561672 588132 616449 647084 680488 716540 754683 794168 834275 874593
56238H74593M0197L9146L6683L3365K9863K5541J9426J2234N750L08n257j1243
$$ 874593 914790 953936 990619 1023984 1053847 1079388 1098814 1111048 1116798 1117106 1111849 1100606
56226A100606j6682k1346k5922k9898l1642l1209l0757l1393l1866l1240l0460
$$ 1100606 1083924 1062578 1036656 1006758 975116 943907 913150 881757 849891 818651 788191
56215G88191l0020k8527k5259k2022k0596k0072j8593j6274j4504j3615j2933
$$ 788191 758171 729644 704385 682363 661767 641695 623102 606828 592324 578709 565776
56204E65776j2193j1347r994q308p471p898q125o788m634l253k854k563j997j284
$$ 565776 553583 542236 532242 523934 516463 508565 500440 493652 489018 485765 482911 480348 478351 477067
56190D77067l77N54Q86N66M98J119J676J622J499J717J806J685K195L508M474
$$ 477067 476690 477244 478130 478696 479194 480313 481989 483611 485110 486827 488633 490318 492513 496021 500495
56175E00495M469M343M686M814M413M426N258N862N737N973P051P628O896O260
$$ 500495 504964 509307 513993 518807 523220 527646 532904 538766 544503 550476 557527 565155 572051 578311
56161E78311P078Q507R262R786J0965J2248J2776J2955J3363J3565J3520J4540
$$ 578311 585389 593896 603158 612944 623909 636157 648933 661888 675251 688816 702336 716876
56149G16876J7350K0794K3890K7527L2621L8477M4591N2192O2114P2914Q2818
$$ 716876 734226 755020 778910 806437 839058 877535 922126 974318 1036432 1109346 1192164
56138A192164R1749R9515J03790J01967R3718Q0438O4196M8769L9207L7827M1919
$$ 1192164 1283913 1383428 1487218 1589185 1682903 1763341 1827537 1876306 1915513 1953340 1995259
56127A995259M6858M9404M6841L6434J8783o10j6053k6171l1955l3623l2766l4570
$$ 1995259 2042117 2091521 2138362 2174796 2193579 2192969 2176916 2150745 2118790 2085167 2052401 2017831
56115B017831m3520n8141p3293q5957r5442j00079r7986r0307q0043o8465n5742
$$ 2017831 1974311 1916170 1842877 1756920 1661478 1561399 1463413 1373106 1293063 1224598 1168856
56104A168856m3760l4729k7956k1347j5184j1157q713n776k349p4J011K166L250
$$ 1168856 1125096 1090367 1062411 1041064 1025880 1014723 1006010 1000234 997885 997811 998822 1000988 1004238
56091A004238L403L508M926O694P063O708P398Q691R177R629J1420J3072J2140
$$ 1004238 1007641 1011149 1016075 1022769 1029832 1036540 1043938 1052629 1061806 1071435 1082855 1095927 1108067
56078A108067R452P888P876P762P572Q617J0274J0972J1480J3448J5704J5910
$$ 1108067 1117519 1125407 1133283 1141045 1148617 1157234 1167508 1178480 1189960 1203408 1219112 1235022
56066A235022J4967J5644J7685J8457J7751J7727J8622J8687J7937J7917J8338
$$ 1235022 1249989 1265633 1283318 1301775 1319526 1337253 1355875 1374562 1392499 1410416 1428754
56055A428754J7900J7778K0077K3500K4820K4053K3886K4628K4279K2960K2718
$$ 1428754 1446654 1464432 1484509 1508009 1532829 1556882 1580768 1605396 1629675 1652635 1675353
56044A675353K3297K2680K1445K2099K4491K6289K7438K9640L2234L3303L4064
$$ 1675353 1698650 1721330 1742775 1764874 1789365 1815654 1843092 1872732 1904966 1938269 1972333
56033A972333L7189M1595M3986M4672M6487M8956M9285M8318M9417N1997N2439
$$ 1972333 2009522 2051117 2095103 2139775 2186262 2235218 2284503 2332821 2382238 2434235 2486674
56022B486674N1052N1722N4792N6783N7241N9277O3093O5496O6279O8668P3154
$$ 2486674 2537726 2589448 2644240 2701023 2758264 2817541 2880634 2946130 3012409 3081077 3154231
56011C154231P7201Q1133Q7624R5405J00404J03123J07790J14295J18584J21041
$$ 3154231 3231432 3312565 3400189 3495594 3595998 3699121 3806911 3921206 4039790 4160831
56001D160831J26306J34575J41301J46045J53152J63005J71420J78405J88570
$$ 4160831 4287137 4421712 4563013 4709058 4862210 5025215 5196635 5375040 5563610
55992E563610K01920K13524K23299K36625K54259K71433K87962L08845L33785
$$ 5563610 5765530 5979054 6202353 6438978 6693237 6964670 7252632 7561477 7895262
55983G895262L57086L79276M07438M42452M77894N13278N55767O06754O59988
$$ 7895262 8252348 8631624 9039062 9481514 9959408 10472686 11028453 11635207 12295195
55974A2295195P15371P80858Q58196R41376J032042J141039J271735J418227J583322
$$ 12295195 13010566 13791424 14649620 15590996 16623038 17764077 19035812 20454039 22037361
55965B2037361J781144K018902K295355K621044L019683L506360M087836M788655
$$ 22037361 23818505 25837407 28132762 30753806 33773489 37279849 41367685 46156340
55957D6156340N650866O702219P951807R420594J1143382J3138448J5418210J8035564
$$ 46156340 51807206 58509425 66461232 75881826 87025208 100163656 115581866 133617430
55949A33617430K1066009K4522497K8303366L2119578L5223346L6113711L2845900
$$ 133617430 154683439 179205936 207509302 239628880 274852226 310965937 343811837
55942C43811837K4208258J0947746m200084j7890935k7806647l3302350l4965252
$$ 343811837 368020095 378967841 374767757 356876822 329070175 295767825 260802573
55935B60802573l3865024l1083929k7521515k3803008k0278174j7114292j4384057
$$ 260802573 226937549 195853620 168332105 144529097 124250923 107136631 92752574
55928I2752574j2088874j0174849q579938p261804o179630n281735m527214l898155
$$ 92752574 80663700 70488851 61908913 54647109 48467479 43185744 38658530 34760375
55920C4760375l378814k942357k567635k249762j984066j755887j554486j381337
$$ 34760375 31381561 28439204 25871569 23621807 21637741 19881854 18327368 16946031
55912A6946031j236407j110067r95501q95772q11993p36990o66705o05873n56521
$$ 16946031 15709624 14599557 13604056 12708284 11896291 11159301 10492596 9886723 9330202
55903I330202n12200m69116m31923m03096l77038l50083l26282l08059k90693
$$ 9330202 8818002 8348886 7916963 7513867 7136829 6786746 6460464 6152405 5861712
55894E861712k71175k53408k39658k25627k09005j94336j84422j74999j62874
$$ 5861712 5590537 5337129 5097471 4871844 4662839 4468503 4284081 4109082 3946208
55885C946208j51673j44462j38007j29293j20918j15301j09872j02587r6044r1914
$$ 3946208 3794535 3650073 3512066 3382773 3261855 3146554 3036682 2934095 2838051 2746137
55875B746137q7351q1060p6927p7388p8843p7763p5760p4632p2099o6738o1843
$$ 2746137 2658786 2577726 2500799 2423411 2344568 2266805 2191045 2116413 2044314 1977576 1915733
55864A915733n9980n8484n4614n0421m8451m6965m3670m0006l7788l5486l1589
$$ 1915733 1855753 1797269 1742655 1692234 1643783 1596818 1553148 1513142 1475354 1439868 1408279
55853A408279k8002k6548k5686k3947k3002k4093k5237k5037k5557k8204l0567
$$ 1408279 1380277 1353729 1328043 1304096 1281094 1257001 1231764 1206727 1181170 1152966 1122399
55842A122399l0602l0137l0954l1111k8725k5786k4500k3280k0097j6727j5788
$$ 1122399 1091797 1061660 1030706 999595 970870 945084 920584 897304 877207 860480 844692
55831H44692j6313j5971j5172j5291j5282j3519j1027r627q912p938p806r567
$$ 844692 828379 812408 797236 781945 766663 753144 742117 732490 723578 715640 707834 698267
55819F98267j1667j2380j2687j4010j5155j4436j2782j1881j1181r620q339q791
$$ 698267 686600 674220 661533 647523 632368 617932 605150 593269 582088 572468 564129 555338
55807E55338r782r295p772o949o757o042m943m174l168j231O90J392J335J341
$$ 555338 545556 536261 528489 521540 514783 508741 503798 499624 496456 495225 495915 497307 498642 499983
55793D99983Q79m64j504j304q05o87N32M047Q020R453P499L143k686q710j2803
$$ 499983 500862 500398 498894 497590 496785 496098 496630 500677 508697 518150 525649 528792 526106 517396 504593
55778E04593j4145j4537j5646j6488j5498j3315j1421r629p309n549n762p306
$$ 504593 490448 475911 460265 443777 428279 414964 403543 393914 386605 381056 375294 367988
55766C67988q498q941q949q053o047m208l579l284k242j078n40K68K058L388K717
$$ 367988 359490 350549 341600 333547 327500 323292 319713 316429 314187 313109 312569 312837 314895 318283 321000
55751C21000J021J00k34j092j985j856j421k067l383m065m322n214o409o796o562
$$ 321000 322021 322121 321887 320795 318810 316954 315533 313466 310083 306018 301696 296482 290073 283277 276715
55736B76715o535o359n284l957l424l181k196r99q10j399j766k080k981l893m029
$$ 276715 270180 263821 258537 254580 251156 247975 245779 244780 243970 242571 240805 238725 235744 231851 227822
55721B27822m170n310o432n854m062k906k552j625L6J036Q55N59R75J839K732
$$ 227822 223652 218342 211910 206056 201994 199088 196536 194911 194947 195983 196838 197397 198372 200211 202943
55706B02943L498L786L473L174L234K807J116j132k894m414o186p330o770n206
$$ 202943 206441 210227 213700 216874 220108 222915 224031 222899 220005 215591 209405 202075 195305 190099
55692A90099m195l920l633l466l943m384l745k540k073k234j894j015n33m53J34
$$ 190099 185904 181984 178351 174885 170942 166558 162813 160273 158200 155966 154072 153057 152524 152071 152205
55677A52205J382K569L316L509K658P87o88o13K6m17j691k321k109j907j597m21
$$ 152205 153587 156156 159472 162981 165639 166426 165738 165125 165151 164734 163043 160722 158613 156706 155109 154688
55661A54688J083J599J231J184J492J060j84j119j305j223q49J62J043N95q03
$$ 154688 155771 157370 158601 159785 161277 162337 162153 161034 159729 158506 157657 157819 158862 159457 158654
55646A58654j665j722j899k221j795q79p56j420j371r9J124J289P75M2j062k338
$$ 158654 156989 155267 153368 151147 149352 148473 147717 146297 144926 144827 145951 147240 148015 148057 146995 144657
55630A44657l112l480m168m919m598l177k044j892j877j290o15m74o95r49j204
$$ 144657 141545 138065 133897 128978 124380 121203 119159 117267 115390 114100 113485 113011 112316 111367 110163
55615A10163j270r45o83j048j499j109k81l77j590k685k969k923k764k032r86
$$ 110163 108893 107948 107265 106217 104718 103609 103328 102951 101361 98676 95707 92784 90020 87988 87002
55600H7002p62j568k121j502m14K0k99p14p03j39N71O27j68p47p0J288K001K072
$$ 87002 86240 84672 82551 81049 80635 80655 80356 79642 78939 78800 79371 79998 79830 79083 79013 80301 82302 84374
55582H4374K570L569M002L640L584M517N923P235Q466R462R801R578R074P737
$$ 84374 86944 90513 94515 98155 101739 106256 112179 119414 127880 137342 147143 156721 165795 173532
55568A73532M835J006k293m796p253r417j0074r214q285p953p434o416n724n576
$$ 173532 178367 179373 177080 172284 165031 155614 145540 136326 128041 120088 112654 106238 100514 94938
55554I4938n043l910l324l745l945l008j848j722k430k927k713j854o46K16J25
$$ 94938 89895 85985 82661 78916 74971 71963 70115 68393 65963 63036 60323 58469 57823 58039 58164
55539E8164l39Q7J449K385K191J637J422J218P80N42N38J63m91n17O5K3j008j733
$$ 58164 57825 57912 59361 61746 63937 65574 66996 68214 68994 69536 70074 70237 69746 69229 69294 69317 68309 66576
55521F6576j324p01q22j196j142j103j577k051k064k150k651k755j864q55q78
$$ 66576 65252 64551 63729 62533 61391 60288 58711 56660 54596 52446 49795 47040 45176 44321 43443
55506D3443j848l011m046m676m234k652r51N9P00J357J682J680K280L787M915
$$ 43443 41595 38584 34538 29862 25628 22976 22025 22084 22784 24141 25823 27503 29783 33570 38485
55491C8485M548L366K609K289J840J534J888K436K397J904J470Q80k39j390j804
$$ 38485 43033 46399 49008 51297 53137 54671 56559 58995 61392 63296 64766 65646 65407 64017 62213
55476F2213j541j153q26o54j003j724j843j008m34j335l096m061l604k443j439
$$ 62213 60672 59519 58693 58039 57036 55312 53469 52461 52027 50692 47596 43535 39931 37488 36049
55461C6049r67r67q93j26J030J512J086P59J025R99J35o19m26q8n74j278j135
$$ 36049 35082 34115 33222 33096 34126 35638 36724 37483 38508 39507 39642 39023 38597 38509 37935 36657 35522
55444C5522m43o3K21Q67J096O3j239j099L03J312J402J530K020J923Q27l95r31
$$ 35522 35079 35016 35237 36104 37200 37263 36024 34925 35228 36540 37942 39472 41492 43415 44242 43847 42916
55427D2916r66r36q67o83l96O5N61N36j15m26L62J393J257J18n60j61M75O21M77
$$ 42916 41950 41014 40147 39464 39068 39133 39694 40230 40115 39689 40051 41444 42701 42819 42259 42098 42573 43194 43671
55408D3671L17m6o85j282j583j470p29N19J408J218M08j25l59p75j050m72O82
$$ 43671 43988 43942 43257 41975 40392 38922 38193 38712 40120 41338 41746 41621 41262 40487 39437 38965 39647
55391C9647J419J557J706J873J460N83nk68q08j340q25N59J188K41j107j467r81
$$ 39647 41066 42623 44329 46202 47662 48245 48240 47972 47164 45824 44999 45558 46746 46987 45880 44413 43432
55374D3432n41l46n5L71P93J223J492J222N96M90J208J803J313J25o00m49o8j08
$$ 43432 42891 42545 42490 42861 43654 44877 46369 47591 48187 48677 49885 51688 53001 53126 52526 52077 52009 51901
55356E1901m96p83p72o64o40n14jO04N10n01j546j746j398j291j298o64M98J142
$$ 51901 51405 50622 49850 49186 48546 48032 48031 48635 49145 48644 47098 45352 43954 42663 41365 40701 41199 42341
55338D2341Q46K98J0l60r65j067j12J220J783J333M88k69r26j475j670j339o23
$$ 42341 43187 43485 43495 43135 42170 41103 40991 42211 43994 45327 45815 45546 44620 43145 41475 40136 39513
55321C9513J08N66P76R46R88M68o21j380r58J57N75j94j164j225m09N72J282J622
$$ 39513 39621 40187 40963 41909 42897 43365 42744 41364 40406 40563 41138 40944 39780 38555 38146 38718 40000 41622
55303D1622J420O54j97n73m71l54n01q09j105j301j199n18O46J621J675Q70O6
$$ 41622 43042 43696 43499 42926 42455 42101 41600 40791 39686 38385 37186 36668 37314 38935 40610 41480 41546
55286D1546j4M25O62M49J04j25k68j73M19J209J432Q97K87J58K98M24O88R79O26
$$ 41546 41532 41957 42619 43068 43172 43047 42779 42606 43025 44234 45666 46563 46850 47008 47306 47730 48418 49397 50023
55267E0023m78j217o60N13R55N22J75L64N73L09l41j078j520j231l18K93kn00
$$ 50023 49545 48328 47668 48181 49136 49658 49833 50197 50770 51079 50738 49660 48140 46909 46591 46884 46882 46382
55249D6382k17N00N14k82q95q09m35q6L34N44J45k74M20K022K806J752j57j380
$$ 46382 46165 46665 47179 46897 46002 45193 44758 44672 45006 45550 45695 45421 45841 47863 50669 52421 52264 50884
55231E0884j605j449j248r11m64q9Q7ql50o25n34k69j73r2L11P61P39N36R42J763
$$ 50884 49279 47830 46582 45671 45207 45118 45205 45197 44847 44222 43688 43419 43246 43154 43465 44226 44965 45501 46443 48206
55211D8206J827O76p19j331j239r92p08l22K5K82N73P45N45L56Q15J511J136o01
$$ 48206 50033 50709 49990 48659 47420 46428 45720 45398 45423 45705 46278 47023 47568 47924 48739 50250 51386 50785
55193E0785k277k575j859j189p64j78M60O88N55M94O02N96L19j20m50l02M02R97
$$ 50785 48508 45933 44074 42885 42121 41943 42403 43091 43646 44140 44742 45338 45657 45537 45087 44785 45187 46184
55175D6184O62l47q02j21R01J385J462J555J447Q08n9o80j011j048n01M68R60
$$ 46184 46846 46499 45697 45576 46477 47862 49324 50879 52326 53134 53075 52395 51384 50336 49835 50303 51263
55158E1263N75J43M37Q37L42o63q92j03N86L36m36q58o40j00K97K75o4l51m16
$$ 51263 51838 51981 52418 53255 53597 52934 52042 51939 52525 52861 52425 51567 50927 50827 51124 51399 51335 50984 50568
55139E0568m74o63p65o15m24l35j45K29M47L48K91M79N05J17k02o1K7n10j201
$$ 50568 50094 49431 48666 48051 47627 47292 47147 47376 47823 48171 48462 48941 49446 49563 49361 49300 49327 48817 47616
55120D7616j130k69O49J262J680J702R83k3l12L43J031Q99J08o18q11m08M13J267
$$ 47616 46486 46217 46866 48128 49808 51510 52493 52470 52158 52501 53532 54431 54539 53921 53110 52702 53115 54382
55102E4382J668J365N48k78n55j10N37N59k16j059j239q11k34K63N52L89j24l56
$$ 54382 56050 57415 57963 57685 57130 57020 57557 58116 57900 56841 55602 54791 54557 54820 55372 55761 55637 55281
55084E5281j8K02l23j035r01L4P33O60K29j11l61m67j74L98P35P14P69J114J358
$$ 55281 55263 55465 55142 54107 53206 53240 53973 54633 54862 54751 54390 53923 53749 54147 54882 55596 56365 57479 58837
55065E8837J110N03KMO29J432J460K55j256j622o72K62J53n85j061j231j508j717
$$ 58837 59947 60450 60452 60456 61085 62517 63977 64232 62976 61354 60682 60944 61097 60512 59451 58220 56712 54995
55047E4995j265j92P19R40P70O90O40K45m24p92n90l54p28j422j415k91J146J834
$$ 54995 53730 53538 54257 55197 55967 56657 57297 57542 57118 56326 55736 55382 54654 53232 51817 51526 52672 54506
55029E4506J645J131O21J11j47K55J138J693J382N57j00l13l07l22l42k05J43
$$ 54506 56151 57282 57903 58014 57867 58122 59260 60953 62335 62892 62792 62479 62172 61850 61508 61303 61446
55012F1446N12O33M23L7l47o07n65j22L43J79o37j235q56J70R77J291J427J441
$$ 61446 61958 62591 63014 63051 62704 62097 61532 61410 61753 61932 61295 60060 59204 59374 60351 61642 63069 64510
54994F4510J027L09n2J98M31Rp81j065n00L05N75K77P9M17R18R59N72L43M46L58
$$ 64510 65537 65846 65794 65992 66423 66432 65651 64586 64086 64391 64966 65243 65322 65739 66657 67616 68188 68531 68977 69335
54974F9335k63j002j282j075n83K76J490K456K493J718Q12R0n97j201j382j142
$$ 69335 69072 68070 66788 65713 65130 65406 66896 69352 71845 73563 74375 74465 73868 72667 71285 70143
54958G0143r74j179j467j349o89J95Q01Q18L99k3k41l41k15M49J377J571N65p00
$$ 70143 69169 67990 66523 65174 64485 64680 65481 66299 66698 66675 66434 66093 65878 66327 67704 69275 69840 69140
54940F9140j001m09N1j6q7J19K33L0k88o86j361j992j778n75P17J196Q65K42k06
$$ 69140 68139 67730 67781 67765 67678 67797 68030 68060 67772 67086 65725 63733 61955 61380 62097 63293 64158 64400 64194
54921F4194p1Q62K063K577K256K056K606L199K993K574L344N468P399P669O452
$$ 64194 64123 64985 67048 69625 71881 73937 76543 79742 82735 85309 88653 94121 101520 109189 115641
54906A15641M987L884K611N54j902l745m571m933n386n707n408m658m056l726
$$ 115641 120628 124512 127123 127677 125775 122030 117459 112526 107140 101433 96025 91367 87311 83585
54892H3585l265k564k002j727j374p15r0J25O8Q3K12K84K86L12L88M64N32O00
$$ 83585 80320 77756 75754 74027 72653 71938 71848 71973 72041 72124 72336 72620 72906 73218 73606 74070 74602 75202
54874G5202P71J257K106K939L367L648M392N558O330O229N727N366M779L169N22
$$ 75202 75973 77230 79336 82275 85642 89290 93682 99240 105570 111799 117526 122892 127671 130840 131362
54859A31362k246m243n268n579n430m986m477m179m178m194l761k799j879j637
$$ 131362 129116 124873 119605 114026 108596 103610 99133 94954 90776 86582 82821 80022 78143 76506
54845G6506j978k162j801j280j149j359j455j125l39P48J673J765Q37l39p83m32
$$ 76506 74528 72366 70565 69285 68136 66777 65322 64197 63858 64606 66279 68044 68881 68542 67759 67327
54829F7327q4j92l01R0O34O66L22L81R98J280N15p37j362j085n28j07L42Q15Q87
$$ 67327 67243 67051 66750 66840 67474 68140 68462 68843 69841 71121 71636 70899 69537 68452 67924 67817 68159 68974 69861
54810F9861M50Rr3j44l58l64N5L80J31k57p7M98P29M67K28K68K99J17k20p01j257
$$ 69861 70311 70320 70227 70083 69725 69361 69416 69796 69927 69670 69593 70091 70820 71287 71515 71783 72082 72199 71979 71278 70021
54789G0021j437r08j22J99J25L25Q90J196R33M37m5n48p37n1J183J754J098J31
$$ 70021 68584 67676 67554 67753 67878 68203 69093 70289 71222 71659 71614 71066 70329 70278 71461 73215 74313 74444
54771G4444jP47J707K547L266L622L335K702K416K785L465L890L857L617L546
$$ 74444 74443 75190 76897 79444 82710 86332 89667 92369 94785 97570 101035 104925 108782 112399 115945
54756A15945L595L308K523J811J707J813J292R4j084j964k944m099m823m765m376
$$ 115945 119540 122848 125371 127182 128889 130702 131994 132088 131004 129040 126096 121997 117174 112409 108033
54741A08033m184m137l970l543k755j728j134j527k217j886n23M62L59J16N55
$$ 108033 103849 99712 95742 92199 89444 87716 86582 85055 82838 80952 80429 80891 81250 81366 81921
54726H1921R49L85n61p46j92L41Q09J676K674L096L042L219L698L915L792L772
$$ 81921 82870 83255 82694 81948 81756 82097 82906 84582 87256 90352 93394 96613 100311 104226 108018 111790
54710A11790L823L414K553J860J502R07l30j935l444m504m755m104l230l007l331
$$ 111790 115613 119027 121580 123440 124942 125849 125519 123584 120140 115636 110881 106777 103547 100540 97209
54695I7209l233k342j416j179j336j153m88J96M70K00n25j386j944j945j487q17
$$ 97209 93976 91634 90218 89039 87703 86550 86062 86258 86728 86928 86403 85017 83073 81128 79641 78824
54679G8824j46L92P33Q69P47K97k98o36n80n05p40j023q91l70O4P8l34j021j618
$$ 78824 78678 79070 79803 80672 81419 81716 81418 80782 80202 79697 78957 77934 77043 76673 76737 76815 76481 75460 73842
54660G3842j639j007l11m1O9M93J036J171R51Q45Q18M15l17p62o60m64n63q05
$$ 73842 72203 71196 70885 70844 70913 71406 72442 73613 74564 75409 76227 76642 76325 75563 74903 74439 73876 73071
54642G3071q83o65n6R31J832K033J525Q73M34J05j35j51r3k69m54p7P00R28K26
$$ 73071 72188 71523 71467 72398 74230 76263 77788 78661 79095 79200 79065 78914 78821 78552 78098 78021 78721 79649 79875
54623G9875n91p18n08p50j386j642j199n15p5R7K35N09R40J358J434J003L25j96
$$ 79875 79284 78566 78058 77308 75922 74280 73081 72566 72491 72588 72823 73332 74272 75630 77064 78067 78392 78196
54605G8196m74p51j202j603j444l76J301K600K595J351q9p76p11n13m73l09K18
$$ 78196 77722 76971 75769 74166 72722 72346 73647 76247 78842 80193 80104 79328 78617 78104 77631 77322 77540
54588G7540Q00Q69L15l44n75m08k29j57L7L86N97N60N69P42P48M27K33M77N91
$$ 77540 78340 79209 79524 79180 78605 78197 77968 77811 77848 78234 78831 79391 79960 80702 81450 81877 82110 82587 83178
54569H3178j47j337j742q22O70J685J877J522J041P77P91P14K12m78q42q42q18
$$ 83178 83031 81694 79952 79130 79800 81485 83362 84884 85925 86702 87493 88207 88419 87941 87099 86257 85439
54552H5439p90n09j53j58k97J82J256J947J726J280J329J556J418J208J431J696
$$ 85439 84649 84140 83987 83829 83532 83714 84970 86917 88643 89923 91252 92808 94226 95434 96865 98561
54536I8561J331P35R47J890K100O07j669k944k550j399o72n96o22l78j05j19k67
$$ 98561 99892 100627 101574 103464 105564 106171 104502 101558 99008 97609 96937 96341 95719 95341 95236 95117 94850
54519I4850j91J00L30N08Q83J313J207L82m53m77K63R71J046N94O7k56m49p13
$$ 94850 94659 94759 95089 95597 96480 97793 99000 99382 98929 98452 98715 99686 100732 101326 101393 101137 100688 99975
54501I9975j014j030n49J39N80P68R84J139P92k1o35o82n78o78n22M31J719K203
$$ 99975 98961 97931 97382 97521 98101 98869 99853 100992 101784 101763 101128 100446 99868 99190 98668 99099 100818 103021
54483A03021J404j01j419k040j808q60K95J033J143R98J082J500J903J855J307
$$ 103021 104425 104324 102905 100865 99057 98197 98492 99525 100668 101666 102748 104248 106151 108006 109313
54468A09313P85Q62J360J498R83N04P40J318J384Q53L65J57j28m87l12N30J081
$$ 109313 110098 110960 112320 113818 114801 115305 116045 117363 118747 119600 119965 120122 119994 119507 119195 119725 120806
54451A20806M34j010j984j863j158n98l49k16j13p7o1l5j23l91n96l76K18O74
$$ 120806 121240 120230 118246 116383 115225 114627 114278 114062 113949 113872 113811 113776 113653 113262 112666 112290 112508 113182
54433A13182O11K01j43l07m98p44p75m36m2m4m62q01o04K1N05M54Q8o4J77M37
$$ 113182 113793 113994 113851 113544 113046 112302 111527 111091 111049 111005 110543 109742 109138 109159 109664 110118 110206 110142 110319 110756
54413A10756L54N4j17j09j52l52o09q41r56o72J73J128J399P56n3q6Q09J895K293
$$ 110756 111110 111164 111047 110938 110786 110434 109825 108984 108028 107356 107529 108657 110056 110812 110759 110673 111482 113377 115670
54394A15670J748Q15L24M96P32M87R3K73R23J100L39o90j151j013o83k25M12Q86
$$ 115670 117418 118233 118557 119053 119785 120272 120365 120638 121561 122661 123000 122310 121159 120146 119463 119238 119650 120536
54376A20536P52J81k68m55p08j106j291j008m07K81R90J561J596Q56l33j258j403
$$ 120536 121288 121469 121201 120746 120038 118932 117641 116633 116226 116507 117497 119058 120654 121510 121177 119919 118516
54359A18516q29l9M89N84K94l01r59j163n73L91Q34M37j69l39k74n98j417k164
$$ 118516 117687 117648 118137 118721 119015 118714 117755 116592 116019 116410 117244 117681 117512 117173 116899 116301 114884 112720
54341A12720k237j484k24Q73J170O41o8m20n17o21n57j08L86M66M01Q69J831K411
$$ 112720 110483 108999 108775 109648 110818 111459 111391 110971 110454 109833 109276 109168 109554 110020 110421 111290 113121 115532
54323A15532J985Q52l30j196j605j455r24n47o85j169j607j800j690j224m79K64
$$ 115532 117517 118369 118039 116843 115238 113783 112859 112312 111627 110458 108851 107051 105361 104137 103658 103922
54307A03922P95J142J324J136M54m60j103j145o05J91P70Q18M71J84J81J92j09
$$ 103922 104717 105859 107183 108319 108773 108313 107210 106065 105460 105651 106421 107239 107710 107894 108075 108267 108158
54290A08158o19r66j042j109j300j326q23K0M61or45j274m17J071K139K316J963
$$ 108158 107539 106573 105531 104422 103122 101796 100973 100993 101454 101448 100503 99229 98812 99883 102022 104338 106301
54273A06301J555J114M17m82j144j188p43l60l98n74l58K08N24L50K23O35J232
$$ 106301 107856 108970 109387 108905 107761 106573 105830 105470 105072 104498 104140 104348 104872 105222 105445 106080 107312
54256A07312J373J158J170J396J232N68N6K2r1o76j188j019p00j253k572l305
$$ 107312 108685 109843 111013 112409 113641 114209 114265 114287 114196 113520 112332 111313 110613 109360 106788 103483
54240A03483k547r60J31K54kl8P3j1k66l62k47k87p22j208j210p42m16o69j201
$$ 103483 100936 99976 100107 100361 100359 100321 100394 100383 100117 99755 99508 99221 98499 97291 96081 95339 94923 94254 93053
54221I3053j347q30M7P75J070J024R77J184J476J410Q21R3l15m46o95j173j545
$$ 93053 91706 90876 90923 91698 92768 93792 94769 95953 97429 98839 99660 99753 99438 98992 98297 97124 95579
54204I5579j480j012l34M56J282J890K019J696J292J175J352J376P16o68k054
$$ 95579 94099 93087 92753 93209 94491 96381 98400 100096 101388 102563 103915 105291 106007 105339 103285
54189A03285k482j669l34N48O72M29J73j57o75j156j280j057p69n89m89l92k57
$$ 103285 100803 99134 98800 99348 100020 100449 100622 100465 99790 98634 97354 96297 95528 94939 94450 94058 93801
54172I3801j4L39O19O59N65N90O67M64q9n63n71k77j60l82o40n75j64L08N43M97
$$ 93801 93787 94126 94745 95404 95969 96559 97226 97690 97601 97038 96467 96190 96030 95648 95008 94433 94269 94577 95120 95617
54152I5617M12M89N57K44m54r87q75l23K2j32m33l57K32R90J415J244P38M97Q14
$$ 95617 96029 96518 97075 97319 96865 95878 95003 94680 94702 94570 94137 93780 94012 95002 96417 97661 98399 98896 99710
54133I9710J312J402J032O65N26L13k19p67r01o86n30n07l14J37M85L83p2n45
$$ 99710 101022 102424 103456 104121 104647 104960 104741 103974 103073 102387 101857 101350 101036 101173 101658 102041 101969 101424
54115A01424p95o77j07O63J065Q37M88O05Q87N35m50r92m13N78Q59L50j89m41
$$ 101424 100629 99952 99845 100508 101573 102410 102898 103503 104390 104925 104475 103483 103070 103648 104507 104857 104668 104227
54097A04227p34j079r34j89L99J53n93r46n01L20Q16O05j02o99p84o34p13q68
$$ 104227 103493 102414 101480 101291 101690 101843 101250 100304 99803 100123 100939 101544 101442 100743 99959 99325 98612 97744
54079I7744n18K70O86M02J22L97O23K0q99q76K59J270J186M61J61N89J148J208
$$ 97744 97226 97496 98182 98584 98706 99103 99726 99746 98847 97971 98230 99500 100686 101147 101308 101897 103045 104253
54061A04253P11R4j95j72l55j122k082k306j305M33J909K434J983J112N62P41
$$ 104253 104964 105058 104863 104691 104336 103214 101132 98826 97521 97954 99863 102297 104280 105392 105954 106695
54045A06695J347J715J550J211J200J523J775J717J571J699K033K032J325L42
$$ 106695 108042 109757 111307 112518 113718 115241 117016 118733 120304 122003 124036 126068 127393 127735
54031A27735o2L24P26L53n61j102q67l88l58q48j389j543j195n08K07O49O86M14
$$ 127735 127673 127997 128723 129076 128515 127413 126546 126158 125800 124952 123563 122020 120825 120317 120524 121173 121859 122273
54013A22273J13O4L79R52J622K357L157L877M440N123O195P238P224N533K579
$$ 122273 122386 122450 122829 123781 125403 127760 130917 134794 139234 144357 150552 157790 165014 170547 173126
53998A73126p32l751o063p252p259o642o018n363m311k911j675r93q66j025j091
$$ 173126 172394 168643 162580 155328 148069 141427 135409 130046 125735 122824 121149 120156 119290 118265 117174
53983A17174p71k26l0m76j204j746k033k063j604p19m8M3R7O87J377J367P35K26
$$ 117174 116403 116177 116147 115671 114467 112721 110688 108625 107021 106302 106254 106297 106394 107081 108458 109825 110560 110786
53965A10786J42L59J002K039K560J717J34q05r18j132j537j171K0P10K82j39M10
$$ 110786 110928 111287 112289 114328 116888 118605 118739 117934 117016 115884 114347 113176 113196 113906 114188 114049 114459
53948A14459J209J194P04O91J206J763K409L268L728L287K625K724L396L831M014
$$ 114459 115668 116862 117566 118257 119463 121226 123635 126903 130631 133918 136543 139267 142663 146494 150508
53933A50508M445M818M394L382K728K515J929P99j15m95r45j652j896j388j075
$$ 150508 154953 159771 164165 167547 170275 172790 174719 175518 175403 174908 173963 172311 170415 169027 167952
53918A67952j738k663k545j283lL90j2o45j136j357j327j189j124j178j254j224
$$ 167952 166214 163551 161006 159723 159720 160110 160098 159453 158317 156960 155633 154444 153320 152142 150888 149664
53902A49664j054q96j020j513k078k321k216k105k158k132j754j150p02o28p47
$$ 149664 148610 147714 146694 145181 143103 140782 138566 136461 134303 132171 130417 129267 128565 127937 127190
53887A27190o44q1O51R19M89q2p5M59Q05O09L43N10Q11N05n01j409j444p85l66
$$ 127190 126546 126465 127116 128035 128524 128442 128367 128826 129631 130240 130583 131093 131904 132409 131908 130499 129055 128270 127904
53868A27904p68j529j658p58N74J490J767J786J827J801J660J720K310L302M225
$$ 127904 127136 125607 123949 123191 123765 125255 127022 128808 130635 132436 134096 135816 138126 141428 145653
53853A45653M842N342N971O774P905R833J2652J5151J5201J1542N011k241q428
$$ 145653 150495 155837 161808 168582 176487 186320 198972 214123 229324 240866 245877 243636 235208
53840B35208j2704j4691j4344j2376j0039q137o635n254l960k706j278K58J405
$$ 235208 222504 207813 193469 181093 171054 162917 156282 151028 147068 144362 143084 143342 144747
53827A44747J840J819J775J910K310L065L949M445M358L956L281J896k96k522
$$ 144747 146587 148406 150181 152091 154401 157466 161415 165860 170218 174174 177455 179351 179055 176533
53813A76533l903m344m220l710k942k292j960j620j039o19p24q96m63M01J006
$$ 176533 172630 168286 164066 160356 157414 155122 153162 151542 150503 149884 149160 148264 147801 148202 149208
53798A49208J190J246J114M70l90o76j57N87R96R91N86k03j067j549j609j484
$$ 149208 150398 151644 152758 153228 152838 152162 152005 152592 153588 154579 155165 154962 153895 152346 150737 149253
53782A49253j111k77O77J043P08K64J35K16L10K79k29j343k269j943n72M18K83
$$ 149253 148142 147865 148542 149585 150293 150557 150692 150908 151218 151497 151268 149925 147656 145713 145141 145559 145842
53765A45842j42J04P29Q83N47L99P43J203J273O75m92j612j944j462r12o91l07
$$ 145842 145700 145804 146533 147416 147963 148362 149105 150308 151581 152256 151764 150152 148208 146746 145834 145143 144836
53748A44836O37J559J696J286J131J311J173M96j07j03K53L70N5l28k86L64J312
$$ 144836 145473 147032 148728 150014 151145 152456 153629 154125 154018 153915 154168 154538 154593 154265 153979 154343 155655
53731A55655K030K286K274K165J891J551J587K150K633K444K031K394L539M133
$$ 155655 157685 159971 162245 164410 166301 167852 169439 171589 174222 176666 178697 181091 184630 188763
53717A88763L127J257L33J150K612L116K387J592J766K698L509L790L667L166
$$ 188763 191890 193147 193480 194630 197242 200358 202745 204337 206103 208801 212310 216100 219767 222933
53703B22933K258J462J569K507L158K719J802J625K496L544L754K883J476L75
$$ 222933 225191 226653 228222 230729 233887 236606 238408 240033 242529 246073 249827 252710 254186 254561
53689B54561R9M17O58N81N90Q88R08J00j042j440q26o7j6o39j347j771j896j791
$$ 254561 254660 255077 255735 256316 256906 257794 258702 258802 257760 256320 255494 255427 255411 254772 253425 251654 249758 247967
53671B47967j544j290j098q99o58n32p44j276j804j942j587r70l60J92P70J314
$$ 247967 246423 245133 244035 243136 242478 241946 241202 239926 238122 236180 234593 233623 233263 233455 234225 235539
53655B35539J623J616J406J068O15J68j4J93O78J233J634J572R21R2j98K93J139
$$ 235539 237162 238778 240184 241252 241867 242035 242021 242214 242892 244125 245759 247331 248252 248344 248146 248439 249578
53638B49578J862K332K485K186J649J470J873K388K607K778L176L473L357L326
$$ 249578 251440 253772 256257 258443 260092 261562 263435 265823 268430 271208 274384 277857 281214 284540
53624B84540M009M974N123M263L468L701M733N665N955N668N141M668M296L867
$$ 284540 288549 293523 298646 302909 306377 310078 314811 320476 326431 332099 337240 341908 346204 350071
53610C50071L393L255L615L907L477K660K385K709K552J246m41j344j295r66p72
$$ 350071 353464 356719 360334 364241 367718 370378 372763 375472 378024 379270 378829 377485 376190 375224 374452
53595C74452p16r06j534k369k905l024l053l169l140k782k238j797j652j858k227
$$ 374452 373736 372830 371296 368927 366022 362998 359945 356776 353636 350854 348616 346819 345167 343309 341082
53580C41082k282j653o19L8j26p37r88m03Q07J918K238J718J145J443K712M151
$$ 341082 338800 337147 336528 336566 336440 335703 334715 334312 335119 337037 339275 340993 342138 343581 346293 350444
53564C50444M896M644L484J619m37j889k339k224k153k052j478n28J83M76Q35
$$ 350444 355340 359984 363468 365087 364650 362761 360422 358198 356045 353993 352515 351987 352170 352646 353481
53549C53481J540K239K649L083L845M637N102N479O127O777P019P199Q065R561
$$ 353481 355021 357260 359909 362992 366837 371474 376576 382055 388182 394959 401978 409177 417242 426803
53535D26803J0885J1789J2900J4498J5865J6332J6266J6426J6900J7310J7680
$$ 426803 437688 449477 462377 476875 492740 509072 525338 541764 558664 575974 593654
53524E93654J8341J9351K0563K2088K4027K5973K7394K8443K9640L0850L1350
$$ 593654 611995 631346 651909 673997 698024 723997 751391 779834 809474 840324 871674
53513H71674L1031L0754L1135L1638L1389L0484K9878L0060L0420K9992K8603
$$ 871674 902705 933459 964594 996232 1027621 1058105 1087983 1118043 1148463 1178455 1207058
53502A207058K7125K6584K7084K7697K7505K6595K5846K5774K6025K5982K5437
$$ 1207058 1234183 1260767 1287851 1315548 1343053 1369648 1395494 1421268 1447293 1473275 1498712
53491A498712K4452K3001K1190J9576J8810J8994J9691K0489K1184K1341K0192
$$ 1498712 1523164 1546165 1567355 1586931 1605741 1624735 1644426 1664915 1686099 1707440 1727632
53480A727632J7309J3237R124N769L165Q85j459m197p643j1759j5886j9174k1287
$$ 1727632 1744941 1758178 1767302 1773071 1776236 1777121 1775662 1771465 1763822 1752063 1736177 1717003 1695716
53467A695716k2469k2982k2851k2338k2123k2733k4089k5934k8291l0969l2968
$$ 1695716 1673247 1650265 1627414 1605076 1582953 1560220 1536131 1510197 1481906 1450937 1417969
53456A417969l3236l1992l0565k9711k8848k7326k5662k4754k4408k3527k1541
$$ 1417969 1384733 1352741 1322176 1292465 1263617 1236291 1210629 1185875 1161467 1137940 1116399
53445A116399j8837j5840j2600r572p741p351p131n603k879l32J335K895N260
$$ 1116399 1097562 1081722 1069122 1059550 1051809 1044458 1037327 1031724 1028845 1028513 1029848 1032743 1038003
53432A038003Q144J0535J2036J3198J4687J6602J8640K0561K2358K4084K5661
$$ 1038003 1046147 1056682 1068718 1081916 1096603 1113205 1131845 1152406 1174764 1198848 1224509
53421A224509K6917K7909K9056L0747L2778L4565L6022L7754M0126M2619M4656
$$ 1224509 1251426 1279335 1308391 1339138 1371916 1406481 1442503 1480257 1520383 1563002 1607658
53410A607658M6627M9451N3219N7030O0224O3056O6010O9030P1755P3891P5138
$$ 1607658 1654285 1703736 1756955 1813985 1874209 1937265 2003275 2072305 2144060 2217951 2293089
53399B293089P5265P4715P4599P5509P6687P6880P5723P3752P1338O8325O4665
$$ 2293089 2368354 2443069 2517668 2593177 2669864 2746744 2822467 2896219 2967557 3035882 3100547
53388C100547O0707N6720N2632M8375M4090L9792L5180L0006K4448J8941J3800
$$ 3100547 3161254 3217974 3270606 3318981 3363071 3402863 3438043 3468049 3492497 3511438 3525238
53377C525238R058M472n35o785j5003k5367l7277m9461o0495o9418p5879p9828
$$ 3525238 3534296 3538768 3538233 3531448 3516445 3491078 3453801 3404340 3343845 3274427 3198548 3118720
53365C118720q1356q1105q0378q0262q0612q0291p8509p5592p2425o9523o6827
$$ 3118720 3037364 2956259 2875881 2795619 2715007 2634716 2556207 2480615 2408190 2338667 2271840
53354B271840o4164o1683n9865n9151n9388n9697n9084n7240n4595n1623m8440
$$ 2271840 2207676 2145993 2086128 2026977 1967589 1907892 1848808 1791568 1736973 1685350 1636910
53343A636910m5027m1480l7941l4488l1189k8009k4662k0977j7470j5118j4309
$$ 1636910 1591883 1550403 1512462 1477974 1446785 1418776 1394114 1373137 1355667 1340549 1326240
53332A326240j4408j4582j4676j4831j4728j3903j2636j1700j1164j0162q227
$$ 1326240 1311832 1297250 1282574 1267743 1253015 1239112 1226476 1214776 1203612 1193450 1185223
53321A185223o188n080m532l136m23K409M104M965O201Q093R719J0492J1117J2666
$$ 1185223 1179035 1173955 1169423 1166287 1165864 1168273 1172377 1177342 1183543 1191636 1201355 1211847 1222964 1235630
53307A235630J5289J8317K1199K3861K6380K8789L1130L3356L5271L6807L8185
$$ 1235630 1250919 1269236 1290435 1314296 1340676 1369465 1400595 1433951 1469222 1506029 1544214
53296A544214L9456M0176L9911L8840L7357L5378L2584K9335K6486K4316K2219
$$ 1544214 1583670 1623846 1663757 1702597 1739954 1775332 1807916 1837251 1863737 1888053 1910272
53285A910272J9690J6875J3853J0097N229j37m924q737j1973j5007j7791k0260
$$ 1910272 1929962 1946837 1960690 1970787 1976016 1975879 1970955 1962218 1950245 1935238 1917447 1897187
53273A897187k2683k5515k8972l2794l6251l8623l9813m0359m0771m1147m1543
$$ 1897187 1874504 1848989 1820017 1787223 1750972 1712349 1672536 1632177 1591406 1550259 1508716
53262A508716m2238m3205m3769m3323m2166m1031l9985l8442l6263l4110l2549
$$ 1508716 1466478 1423273 1379504 1336181 1294015 1252984 1212999 1174557 1138294 1104184 1071635
53251A071635l1504l0849l0883l1720l2647l2656l1469k9667k7927k6508k5259
$$ 1071635 1040131 1009282 978399 946679 914032 881376 849907 820240 792313 765805 740546
53240G40546k3749k1481j8425j5282j2869j1290j0005q704p664p237p387p892
$$ 740546 716797 695316 676891 661609 648740 637450 627445 618741 611077 603840 596453 588561
53228E88561q568r241r810j0539j1843j3539j4739j4809j4130j3429j2698j1377
$$ 588561 579993 570752 560942 550403 538560 525021 510282 495473 481343 467914 455216 443839
53216D43839r513q012p603q027q508q588q303p862p480p330p408p540p599p574
$$ 443839 434326 426314 418711 410684 402176 393588 385285 377423 369943 362613 355205 347665 340066 332492
53202C32492p447p180o950o995p115o733n663m505l940l927l961l830l718l693
$$ 332492 325045 317865 310915 303920 296805 290072 284409 279904 275964 272037 268076 264246 260528 256835
53188B56835l552l187k714k256j902j768j867j968j894j852k149k601k682k178
$$ 256835 253283 250096 247382 245126 243224 241456 239589 237621 235727 233875 231726 229125 226443 224265
53174B24265j428q02l70j24j53m14o38o61o51q34j154j351j194o45Q2M95J76p18
$$ 224265 222837 222035 221665 221541 221388 220974 220336 219675 219024 218190 217036 215685 214491 213846 213928 214423 214599 213881
53156B13881j470j487r12m21m94r48j155p10J05O11N44M23Q54J673K064J566N54
$$ 213881 212411 210924 210012 209591 209097 208149 206994 206284 206389 207000 207544 207967 208821 210494 212558 214124 214678
53139B14678k69o05o12n65o59r05j079q82l00K80M21P8l41k94L77J152J191K33
$$ 214678 214409 213804 213192 212627 211968 211063 209984 209102 208802 209082 209503 209581 209240 208946 209323 210475 211666 211899
53121B11899r60j413j084p99j031j308j014l65j31o14j261j340p74k54n12j484
$$ 211899 210939 209526 208442 207643 206612 205304 204290 203925 203794 203180 201919 200579 199805 199551 199039 197555
53105A97555k323k322j728j304j308j332j101q48p44n38j13P1m21j221j508j013
$$ 197555 195232 192910 191182 189878 188570 187238 186137 185289 184545 184007 183894 183965 183544 182323 180815 179802
53089A79802k53K06L52M74O20N69K93K04P23J586J889J114j47q38o53j70J45L33
$$ 179802 179549 179755 180107 180581 181201 181770 182063 182267 182990 184576 186465 187579 187432 186594 185941 185771 185916 186249
53071A86249L85j0p66j172q50m00n51j091j197n74L32J039J356J262R33P72Q44
$$ 186249 186634 186624 185858 184686 183836 183436 182885 181794 180597 180023 180355 181394 182750 184012 184945 185717 186561
53054A86561N76l78j229q57N51J565J289K12r19k006k956l112k182j150j146j850
$$ 186561 187137 186759 185530 184673 185224 186789 188078 188290 187371 185365 182409 179297 177115 175965 174819 172969
53038A72969j978j248p35j114j638j314l32M32P06P98P24K47l01j80N58R30M02
$$ 172969 170991 169743 169008 167894 166256 164942 164610 165042 165748 166546 167270 167517 167216 167036 167594 168524 168926
53021A68926k73j88L63M19j78o49n24j95j42k83l49l28k54K5N18Q99Q74N59K13
$$ 168926 168653 168465 168828 169247 169069 168420 167896 167701 167559 167276 166927 166599 166345 166370 166888 167787 168661 169220 169433
53002A69433q3k55o4N51J183J326R36L42j35k94L1P53J364J338P04j5l90m26l55
$$ 169433 169350 169095 169031 169582 170765 172091 173027 173369 173234 172940 172971 173724 175088 176426 177130 177115 176725 176299 175944
52983A75944l24k80n5L98P71N73k67j147j362q90l12n2O2M12R90J408J420J257
$$ 175944 175620 175340 175285 175683 176454 177027 176760 175613 174251 173361 173049 172997 173059 173471 174461 175869 177289 178546
52965A78546J323J618J741J515J297J397J482J078M04J14K12m6r51j795j902j582
$$ 178546 179869 181487 183228 184743 186040 187437 188919 189997 190401 190515 190727 190681 189730 187935 186033 184451
52949A84451j517j715j720j531j582j945k187k060j742j427j065o34k73p2j5j23
$$ 184451 182934 181219 179499 177968 176386 174441 172254 170194 168452 167025 165960 165326 165053 164981 164966 164843
52933A64843m27p74r05p61n24l91m12m33j42O18J413J502P37r0j55M33R24Q83
$$ 164843 164416 163642 162737 161976 161452 161061 160649 160216 160074 160692 162105 163607 164344 164254 164099 164532 165456 166339
52915A66339M78R5kK03L25j09r07j209o73q9j94n09j93M27L46l87o76j87J03m65
$$ 166339 166817 166912 166910 167113 167438 167329 166422 165213 164540 164451 164257 163748 163555 163982 164328 163941 163265 163078 163181 162716
52895A62716j166j046k60L32L01j52o40q00m70k1jk56k4Q50J492J247N61J33j37
$$ 162716 161550 160504 160244 160576 160877 160725 160085 159285 158815 158794 158793 158537 158513 159363 160855 162102 162663 162796 162659
52876A62659o44j148j115o30j44K88R01J546J840J792J703J641J582J713K027
$$ 162659 162015 160867 159752 159122 158978 159266 160167 161713 163553 165345 167048 168689 170271 171984 174011
52861A74011J915R07m43j242j542k093k922l156k434j492j080j014q20n66o35
$$ 174011 175926 176833 176390 175148 173606 171513 168591 165435 163001 161509 160429 159415 158595 158029 157394
52846A57394j066j577j874j757j250q17r35j316j118j61O74O85K88K16M06L72
$$ 157394 156328 154751 152877 151120 149870 149053 148118 146802 145684 145523 146197 146882 147170 147386 147792 148164
52830A48164K25M28Q32Q13K86j93l64n96j156j723j834j291j49J231K066J753
$$ 148164 148389 148817 149649 150462 150748 150555 150191 149595 148439 146716 144882 143591 143442 144673 146739 148492
52814A48492P31J21L57Q07Q73P30O70O03O77J505K986L667K365j32k002k635k784
$$ 148492 149223 149344 149701 150508 151381 152111 152781 153384 154061 155566 158552 162219 164584 164452 162450 159815 157031
52797A57031k732j880k97P87O25M7P1L91R8p69j355j226o44Q5O99P23o8j020j217
$$ 157031 154299 152419 152122 152909 153534 153581 153652 154043 154141 153372 152017 150791 150147 150232 150931 151654 151586 150566 149349
52778A49349o01Q5M65P50Q77K82j098k272k165q80L91O03k16j088j086k29O02
$$ 149349 148748 148833 149298 150048 150925 151207 150109 147837 145672 144792 145183 145786 145570 144482 143396 143167 143769
52761A43769P53N46O61J025R25J84m16j37P79J520J640J280P40K16j06l9L57O90
$$ 143769 144522 145068 145729 146754 147679 147863 147447 147310 148089 149609 151249 152529 153269 153485 153379 153340 153697 154387
52743A54387N66P7j39M33J478K070J737R44L67R3n7J10Q27J657J877J443R51O62
$$ 154387 154953 155030 154891 155324 156802 158872 160609 161553 161920 162013 161956 162066 162893 164550 166427 167870 168821 169483
52725A69483L19m3K6M96O17j3q88j459j911k461k641k031j224j141j619j622q11
$$ 169483 169802 169759 169785 170281 170898 170885 169997 168538 166627 164166 161525 159494 158270 157129 155510 153888 153077
52708A53077j5Q8p5J80N83K93p29j447r92L23J542K186K402K245J550N66N6L78
$$ 153077 153062 153150 153075 153255 153838 154131 153402 151955 150963 151286 152828 155014 157416 159661 161211 161777 161833 162211
52690A62211R48J131J155J503J833J377K82m55m61m50r41j435j390j223j504j821
$$ 162211 163159 164290 165445 166948 168781 170158 170440 169985 169524 169074 168133 166698 165308 164085 162581 160760
52674A60760j344k44M19J97j58J39Q51J202R73O25N09M24J05j77J41J157K335
$$ 160760 159416 159172 159591 159788 159630 159769 160620 161822 162795 163420 163929 164353 164458 164281 164422 165579 167914
52657A67914L188L720L953L501K138N07m21n88q18j564k411k908l097k942k049
$$ 167914 171102 174822 178775 182276 184414 184921 184500 183912 183094 181530 179119 176211 173114 170172 168123
52642A68123m68R10J361J199J048P81l4j045j379q58k23q8k72k28L02J206K144
$$ 168123 167655 168565 169926 171125 172173 172954 172920 171875 170496 169638 169415 169327 169055 168827 169129 170335 172479
52625A72479K757K909K736K293J357q5j517k368k634k608k239j313n1R20J232
$$ 172479 175236 178145 180881 183174 184531 184446 182929 180561 177927 175319 173080 171767 171716 172636 173868
52610A73868R89M58j05l98k76Q7M81R41J422J555J183P86P95Q18K84m16l34N01
$$ 173868 174857 175315 175210 174812 174536 174623 175104 176045 177467 179022 180205 180991 181786 182604 182888 182472 182138 182639
52592A82639R57L59n95r22n59j33l5k34n78q30p10k09L28O65Q66R16N97K1j85
$$ 182639 183596 183955 183360 182438 181879 181746 181711 181477 180899 180069 179359 179150 179478 180143 181009 181925 182522 182543 182358
52573A82358L04Q88O89l41j401j804j562j023l99K74Q65J108Q53L19l3qN8k48
$$ 182358 182662 183550 184239 183898 182497 180693 179131 178108 177709 177983 178848 179956 180809 181128 181095 181087 181145 180897
52555A80897p70r43n88j80j81m00l37J67Q40J400J717J608Q58l82j426j504o17
$$ 180897 180127 179184 178596 178416 178235 177835 177498 177665 178505 179905 181622 183230 184088 183706 182280 180776 180159
52538A80159L10L08m84r57m81K21O6q33j258n07P29J327R85K37l62o85q92j112
$$ 180159 180469 180777 180293 179336 178855 179076 179142 178309 177051 176544 177273 178600 179585 179822 179460 178775 177883 176771
52520A76771j182o89M96J673J773N89q37j352q52l3N96J055J444J741J997K296
$$ 176771 175589 174900 175396 177069 178842 179431 178594 177242 176390 176357 176953 178008 179452 181193 183190 185486
52504A85486K544K462J923J074K35k04nN87Q52L15o62j293j326j235j487j968
$$ 185486 188030 190492 192415 193489 193724 193520 193515 194102 194954 195269 194607 193314 191988 190753 189266 187298
52488A87298k267k197j858j380q29k83J96O24J041J409J618J561J209O79K32J73
$$ 187298 185031 182834 180976 179596 178767 178484 178680 179304 180345 181754 183372 184933 186142 186821 187053 187226
52472A87226N63J116J355J017K92l12l81P3O78J066J182J279J669K415L214L608
$$ 187226 187789 188905 190260 191277 191569 191257 190876 190949 191627 192693 193875 195154 196823 199238 202452 206060
52456B06060L358K637J826J114M56k28q96j510k105k669l019k969k540j974j487
$$ 206060 209418 212055 213881 214995 215451 215223 214327 212817 210712 208043 205024 202055 199515 197541 196054
52441A96054j077o39j97M8m8l51n44m05J08R00J677J907J223K0p48n95J8M28O19
$$ 196054 194977 194338 194141 194189 194141 193790 193246 192841 192949 193849 195526 197433 198656 198676 197928 197333 197351 197779 198398
52422A98398R22J190J011O01P07J559K555L324M380O248Q475J0151J1045J1504
$$ 198398 199320 200510 201521 202122 202829 204388 206943 210267 214647 220895 229370 239521 250566 262070
52408B62070J1307R463N457K00m577p662q887q703p723o494n346m286l190k157
$$ 262070 273377 282840 288297 288497 283920 276258 267371 258668 250945 244451 239105 234819 231629 229472
52394B29472j462j121p95k42L28N78N54N86P44P77O15N69Q59J270J499J635J962
$$ 229472 228010 226889 226094 225852 226180 226758 227312 227898 228642 229419 230034 230603 231462 232732 234231 235866 237828
52377B37828K510L129L848M771N602N679M748L445K785L217M322N425O239O840
$$ 237828 240338 243467 247315 252086 257688 263367 268115 271560 274345 277562 281884 287309 293548 300388
52363C00388P109O611N195L447K231J853K049K709L954N492O581P041P646Q988
$$ 300388 307497 314108 319303 322750 324981 326834 328883 331592 335546 341038 347619 354660 362306 371294
52349C71294J0541J1552J2352J3806J5710J6873J6867J6685J7226J8077J8310
$$ 371294 381835 393387 405739 419545 435255 452128 468995 485680 502906 520983 539293
52338E39293J7908J7682J8161J9085J9850K0005J9539J8922J8677J8681J8223
$$ 539293 557201 574883 593044 612129 631979 651984 671523 690445 709122 727803 746026
52327G46026J6967J5458J4308J3337J2043J0532R314Q329O870M574J930l47k038
$$ 746026 762993 778451 792759 806096 818139 828671 837985 846314 853184 857758 859688 859341 857303
52314H57303l322m422n532o856q354r614j0193r994r253q227p088n929m708l272
$$ 857303 853981 849559 844027 837171 828817 819203 809010 799016 789763 781536 774448 768519 763811 760539
52300G60539j618j1J376K824M756P025Q931J0096J0953J2044J3194J3852J3978
$$ 760539 758921 758910 760286 763110 767866 774891 783822 793918 804871 816915 830109 843961 857939
52287H57939J3991J3862J3119J1862J1067J1396J2325J2825J2432J1157R025O378
$$ 857939 871930 885792 898911 910773 921840 933236 945561 958386 970818 981975 991000 997378
52275I97378M117K779J785L47j284k514l869o440r906j2592j3708j4140j4611
$$ 997378 1001495 1004274 1006059 1006406 1005122 1002608 998739 992299 982393 969801 956093 941953 927342
52262I27342j4525j3488j2572j2894j3784j3756j2658j1538j0825r947q608p177
$$ 927342 912817 899329 886757 873863 860079 846323 833665 822127 811302 801355 792747 785570
52250G85570n743l963k030p51l05J25J045J825J662Q02K21M56J272K131K627K651
$$ 785570 779827 775864 773834 773083 772778 772903 773948 775773 777435 778237 778458 778914 780186 782317 784944 787595
52234G87595K477K529K847L002K684K161J950K286L079M069M850N036M739M646
$$ 787595 790072 792601 795448 798450 801134 803295 805245 807531 810610 814679 819529 824565 829304 833950
52220H33950N268O221O643O286N801N863O298O374N827N273N368N786N463L938
$$ 833950 839218 845439 852082 858368 864169 870032 876330 882704 888531 893804 899172 904958 910421 914359
52206I14359K035R25P85Q49N53L7m17q17j160j268j158j177j427j479j054n70
$$ 914359 916394 917319 918104 918953 919506 919543 919126 918309 917149 915881 914723 913546 912119 910640 909586 909016
52190I09016o11j153j837k543l149l030j713M7Q17K32o29r15j060j645k159j878
$$ 909016 908405 907252 905415 902872 899723 896693 894980 895027 895844 896076 895447 894532 893472 891827 889668 887790
52174H87790j290j462k247k359j320j43K43J78M24R49J332J716K595M009N596
$$ 887790 886500 885038 882791 880432 879112 878969 879212 879390 879814 880763 882095 883811 886406 890415 896011
52159H96011P157Q620R728J0383J0957J1717J2231J1988J1328J0999J1025J0826
$$ 896011 903168 911788 921516 931899 942856 954573 966804 978792 990120 1001119 1012144 1022970
52147A022970J0341J0188J0719J1679J2901J4438J5827J6124J5052J3495J2418
$$ 1022970 1033311 1043499 1054218 1065897 1078798 1093236 1109063 1125187 1140239 1153734 1166152
52136A166152J1828J1163J0216R292Q758Q708Q820Q488P457O289N701N530N132
$$ 1166152 1177980 1189143 1199359 1208651 1217409 1226117 1234937 1243425 1250882 1257171 1262872 1268402 1273534
52123A273534M638M762N241M779L039J407R07N50j064l447m968n319n658o526
$$ 1273534 1278172 1282934 1288175 1292954 1295993 1297400 1298307 1298857 1297793 1294346 1289378 1284059 1278401 1271875
52109A271875p127o855o315o324o841p373p632p380o227m089j443J251M066P220
$$ 1271875 1264748 1257893 1251578 1245254 1238413 1231040 1223408 1216028 1209801 1205712 1204269 1205520 1209586 1216806
52095A216806J0473J3208J5043J6203J7317J8749K0110K0681K0361J9818J9388
$$ 1216806 1227279 1240487 1255530 1271733 1289050 1307799 1327909 1348590 1368951 1388769 1408157
52084A408157J8347J5949J2804J0348R154Q520P754O930O204N282L920K315N36
$$ 1408157 1426504 1442453 1455257 1465605 1474759 1483279 1491033 1497963 1504167 1509449 1513369 1515684 1516220
52071A516220j866n169q833j1959j4233j5969j7469j8776j9966k1313k3001k4848
$$ 1516220 1514354 1509185 1500352 1488393 1474160 1458191 1440722 1421946 1401980 1380667 1357666 1332818
52059A332818k6436k7501k8100k8307k7888k6611k4814k3218k1963k0394j8190
$$ 1332818 1306382 1278881 1250781 1222474 1194586 1167975 1143161 1119943 1097980 1077586 1059396
52048A059396j6059j4698j3608j1796r345p294o083n196m414m314n058n721n456
$$ 1059396 1043337 1028639 1015031 1003235 993890 986596 980513 975317 970903 966589 961531 955810 950354
52035I50354m561l736k915j663k72L85J07l06j18L57N7j708m514p210q981r999
$$ 950354 945793 942057 939142 937479 937207 937592 937699 937393 937275 937632 937689 935981 931467 924257 915276 905277
52019I05277j0899j1842j2510j2833j3191j3825j4566j5292j6164j7151j7844
$$ 905277 894378 882536 870026 857193 844002 830177 815611 800319 784155 767004 749160
52008G49160j8066j8222j8658j9039j8737j7537j5668j3450j1316r860r339r284
$$ 749160 731094 712872 694214 675175 656438 638901 623233 609783 598467 588607 579268 569984
51996E69984r004q375p794p508p364p148o783o201n318m198l073k164j565j241
$$ 569984 560980 552605 544811 537303 529939 522791 516008 509807 504489 500291 497218 495054 493489 492248
51982D92248j094j111j467k355l698n236o857q550r995j0636j0370r727r147q401
$$ 492248 491154 490043 488576 486221 482523 477287 470430 461880 451885 441249 430879 421152 412005 403604
51968D03604p116n550m359l712l097k010n04J039K406L660M815N571N534M745
$$ 403604 396488 390938 386579 382867 379770 377760 377256 378295 380701 384361 389176 394747 400281 405026
51954D05026L876L620L939M096L439J917j31k292m110n118n111m288l061j810
$$ 405026 408902 412522 416461 420557 423996 425913 425782 423490 419380 414262 409151 404863 401802 399992
51940C99992o75O26K571N004O781O866N742M921M966M856L619J656j52j839l958
$$ 399992 399317 399943 402514 407518 414299 421165 426907 431828 436794 441650 445269 446925 446773 444934 440976
51925D40976o318q065q859r161r402r525r379r033q587q075p557p013o275n321
$$ 440976 434658 426593 417734 408573 399171 389646 380267 371234 362647 354572 347015 340002 333727 328406
51911C28406m529m220m181l979l554l024k215r44L38R06Q07R73K110L954N696
$$ 328406 323877 319657 315476 311497 307943 304919 302704 301760 302098 303004 303811 304784 306894 310848 316544
51896C16544O804P291P577Q118Q817Q844P423M881K450R39P2p21j390j391l09
$$ 316544 323348 330639 338216 346334 355151 363995 371418 376299 378749 379688 379760 379039 377649 376258 375949
51881C75949J963N349R455J3416J6145J6746J4746J0188L858k709p813j0412j0564
$$ 375949 377912 383261 392716 406132 422277 439023 453769 463957 467815 465106 457293 446881 436317
51868D36317r162p254n489m114l335l413m297n513o620p573q307q336p281n645
$$ 436317 427155 419901 414412 410298 406963 403550 399253 393740 387120 379547 371240 362904 355623 349978
51854C49978m330l436k169j64J865L155L859M400M440L261J040j126k476l173
$$ 349978 345648 342212 340043 339879 341744 344899 348758 353158 357598 360859 361899 360773 358297 355124
51840C55124l545l538l226l218l852m386l808k316j235j311j816j772j350j337
$$ 355124 351579 348041 344815 341597 337745 333359 329551 327235 326000 324689 322873 321101 319751 318414
51826C18414j700j579o53L51P84Q41Q58N09o04k015k794k688k153j355L6J841
$$ 318414 316714 315135 314482 314833 315617 316458 317316 317825 317221 315206 312412 309724 307571 306216 306252 308093
51810C08093K923K343P06k47N68K493L957M076L137J636n30l478o287p347o036
$$ 308093 311016 313359 314065 313818 314386 316879 320836 324912 328049 329685 329155 325677 319390 312043 306007
51795C06007l526j561q27r41j485k316l128l481l375l150k760j746j61J107J305
$$ 306007 302481 300920 300093 299152 297667 295351 292223 288742 285367 282217 279457 277711 277550 278657 279962
51780B79962O96J50J48N45J009J224R44K46l12k09M02Q66R34J133K086L681N153
$$ 279962 280658 280808 280956 281501 282510 283734 284678 284924 284612 284403 284805 285671 286605 287738 289824 293505 298658
51763B98658N966O302O588O790O486N623M757M260L671K214j28k544m415n916
$$ 298658 304624 310926 317514 324304 330790 336413 341170 345430 349101 351315 351187 348643 344228 338312
51749C38312p414q714r137q230o214l863k102j360j141l86J509M136O621Q371
$$ 338312 330898 322184 313047 304817 298603 294740 292638 291278 290137 289751 291260 295396 302017 310388
51735C10388R128Q697P203N469M579M940O104P500Q887R878R507O850K118l170
$$ 310388 319516 328213 335416 340885 345464 350404 356508 364008 372895 382773 392280 399130 401248 398078
51721C98078p207r068r028p941o441m674k716j108p63k140m573o622p238o494
$$ 398078 390871 381803 372775 364834 358393 353719 351003 349895 349132 346992 342419 335797 328559 322065
51707C22065n178l783k102K35L088N720P241O963M697J050k477m210l482j055
$$ 322065 316887 313104 311002 311237 314325 320045 327286 334249 338946 339996 337519 333309 329827 328772
51693C28772J761M171N954O702N723K793j329n371q264r362q490o283m124l126
$$ 328772 330533 334704 340658 347360 353083 355876 354547 349176 340912 331550 323060 316777 312653 309527
51679C09527l136l154k610j693n67J015L009M771N943P219R545J2765J5583J6645
$$ 309527 306391 303237 300627 298934 298367 299382 302391 307162 313105 320324 329869 342634 358217 374862
51665C74862J5231J1157M954j791p013r567r787q545o250l172k83R36l04l302
$$ 374862 390093 401250 406204 404413 397400 387833 378046 369501 363251 360079 359796 360732 360428 357126
51651C57126o378q134q245p277n905m503l284k477k062j645r60l54m71j457k886
$$ 357126 350748 342614 334369 327092 321187 316684 313400 310923 308861 307216 306256 305902 305431 303974 301088
51636C01088m281n381n904n637m758l678k524j264l29l82j333k146k054j394r04
$$ 301088 296807 291426 285522 279885 275127 271449 268925 267661 267332 266950 265617 263471 261417 260023 259119
51621B59119p13m98r2N20J457K557L117K644J692J381K131L298L989L799K827
$$ 259119 258406 257908 257816 258336 259793 262350 265467 268111 269803 271184 273315 276613 280602 284401 287228
51606B87228J517M31j22k67j01O50K212M214O012P337P947P015L821p88m585o062
$$ 287228 288745 289176 289054 288787 288686 289336 291548 295762 301774 309111 317058 324073 327894 327106 322521 316459
51590C16459n781n157m626l674k227j001m39m9Q46K230L605M808O207Q177J0760
$$ 316459 310678 305521 300895 297221 294994 293993 293554 293505 294351 296581 300186 304994 311201 319378 330138
51575C30138J3695J6452J8215J8353J7107J5565J4671J4465J4366J3750J1988
$$ 330138 343833 360285 378500 396853 413960 429525 444196 458661 473027 486777 498765
51564D98765Q570M006L22k67K648P639J3448K0184K8084L5778M0560M0307L5027
$$ 498765 507335 511341 511663 511396 514044 521683 535131 555315 583399 619177 659737 700044 735071
51551G35071K6760J8170J0761M205k475r204j4966j9521k3872k8543l2323l3655
$$ 735071 761831 780001 790762 794967 792492 783288 768322 748801 724929 696386 664063 630408
51539F30408l2668l0960k9680k8659k7202k4904k1844j8574j5902j4144j2706
$$ 630408 597740 566780 537100 508441 481239 456335 434491 415917 400015 385871 373165
51528C73165j0817q438o104m236l157l164l965m486m110l608l922m566m355l402
$$ 373165 362348 353910 347806 343570 340413 337249 333284 328798 324688 321080 317158 312592 308237 304835
51514C04835k906l045k608j073L45M24l54o00J56J200J622J003m46j907k474k031
$$ 304835 301929 298884 296276 295203 295548 295972 295618 295018 295174 296374 297996 298999 298553 296646 294172 292141
51498B92141j313q71n23k2L22J68k17l49k20k10n54j180j818k068j686j009p10
$$ 292141 290828 289957 289434 289412 289734 289902 289685 289336 289116 288906 288352 287172 285354 283286 281600 280591 279881
51481B79881j002j424j520j306r60m72J74R46J939L074L626K801R15p11j370j663
$$ 279881 278879 277455 275935 274629 273669 273197 273371 274317 276256 279330 282956 285757 286672 285961 284591 282928
51465B82928k289k930k932k339j572o75L57R39M13j024k415k976k552j450k76
$$ 282928 280639 277709 274777 272438 270866 270191 270548 271487 271900 270876 268461 265485 262933 261483 261207
51450B61207L58M47O85J636L029M220N034N879P334R773J2779J4749J3875J0075
$$ 261207 261565 262012 262697 264333 267362 271582 276616 282495 289829 299602 312381 327130 341005 351080
51436C51080N417K077N42L33J389L521N091L897m19n752r599j0968j0357q757
$$ 351080 356497 358574 359116 359449 360838 364359 369450 373347 372928 367176 357577 346609 336252 327495
51422C27495p116o091n728n525m957l759j943P6J471J556M80q79j680j604q92
$$ 327495 320379 314288 308560 303035 298078 294319 292376 292452 293923 295479 295959 295080 293400 291796 290904
51407B90904k48l79j194j740j355n36j26l6L38Q53P90K45K79J352K620L232L509
$$ 290904 290656 290277 289083 287343 285988 285452 285326 285290 285628 286481 287271 287516 287795 289147 291767 294999 298508
51390B98508M222N333O212O764P631R290J1483J3686J5787J8121K1000K4528K8913
$$ 298508 302730 308063 314275 321039 328670 337960 349443 363129 378916 397037 418037 442565 471478
51377D71478L4461M0689M5598M6785M3838L9067L5127L2282K8722K3143J5955
$$ 471478 505939 546628 592226 639011 682849 721916 757043 789325 818047 841190 857145
51366H57145Q096j50q762j7298k5264l2482l8639m2998m5156m5615m5007m3140
$$ 857145 865241 865091 856329 839031 813767 781285 742646 699648 654492 608877 563870 520730
51354E20730l9478l4378k9128k4683k0925j7334j3867j0881q467o353m417k994
$$ 520730 481252 446874 417746 393063 372138 354804 340937 330056 321589 315236 310819 307825
51342C07825k443k652l225l989m945n676n415m015k423j713j881k037j630r29
$$ 307825 305382 302730 299505 295516 290571 284895 279480 275465 273042 271329 269448 267411 265781 264852
51328B64852m19l40p76j607k228j954r02nJ70J7P6J51k21q27r83n82l23p67j596
$$ 264852 264433 264093 263317 261710 259482 257528 256626 256621 256791 256808 256884 257035 256814 255987 255004 254422 254099 253332 251736
51309B51736j985j574q29m84p15r71o63J07P44R98J254J819K321K094J020l61
$$ 251736 249751 248177 247348 246864 246149 245178 244515 244622 245366 246364 247618 249437 251758 253852 254872 254511
51293B54511j449k009k012j468n65K47N87N62O98J387K539L768M753N234M862
$$ 254511 253062 251053 249041 247573 247008 247255 247842 248404 249102 250489 253028 256796 261549 266783 271645
51278B71645L529J876R71J210J820J797J102M18M7l20p29o94k1P23R83R57J015
$$ 271645 275174 277050 278021 279231 281051 282848 283950 284368 284415 284095 283366 282672 282651 283374 284357 285314 286329
51261B86329Q53j47j832l261l771l502k855j972j082p28j212k071k516k262j547
$$ 286329 287182 287035 285203 281942 278171 274669 271814 269842 268760 268032 266820 264749 262233 259971 258424
51246B58424o00M35J152J070K72n79j028j181j198r02k50L39N37N40N23J22q61
$$ 258424 257824 258259 259411 260481 260753 260174 259146 257965 256767 255865 255615 255954 256491 257031 257554 257676 256815
51229B56815j687j467n25J4q3P0Q95J615J621J459J718J877J235L04J46P80J333
$$ 256815 255128 253661 253136 253150 253067 253137 254032 255647 257268 258727 260445 262322 263557 263861 264007 264787 266120
51212B66120J586K126K944L066J994N47k14k87l60p43j167j361j299j037o85m54
$$ 266120 267706 269832 272776 275842 277836 278383 278169 277882 277522 276779 275612 274251 272952 271915 271230 270776
51196B70776m39n47o92q78r14m35N47J407J577J236R12O56J30n16n77K56J344
$$ 270776 270337 269790 269098 268220 267306 266871 267418 268825 270402 271638 272550 273206 273336 272820 272243 272499 273843
51179B73843J903J990K158K413K186J324M57P4j53p09j370j593j395j216j050
$$ 273843 275746 277736 279894 282307 284493 285817 286274 286348 286195 285486 284116 282523 281128 279912 278862
51164B78862n18L19R16J075J083R05Q6j264k197k137j649j469j402q53L8N85N14
$$ 278862 278344 278663 279579 280654 281737 282642 282728 281464 279267 277130 275481 274012 272610 271757 271795 272380 272894
51147B72894Q6m57r51j083p82m85n02m20J79Q54R08N13L45L75N3n02n77j51j7
$$ 272894 272980 272523 271572 270489 269707 269222 268720 268300 268479 269333 270241 270754 271099 271474 271527 271025 270448 270297 270280
51128B70280l82l91N43J826K640K973L265L605L841L943L786L028J704M66j58
$$ 270280 269898 269507 270050 271876 274516 277489 280754 284359 288200 292143 295929 298957 300661 301127 300969
51113C00969l51m28k79J38K96k09p45k77J148K270K070R16m4j89J71M98P33J150
$$ 300969 300618 300190 299911 300049 300345 300136 299391 299114 300262 302532 304602 305518 305474 305285 305456 305954 306687 307837
51095C07837J787K291K395K227J989J661J338J542K668M147M747L882K226R04
$$ 307837 309624 311915 314310 316537 318526 320187 321525 323067 325735 329882 334629 338511 340737 341641
51081C41641L38Q8m38j334k112k245j803j384j272r55P9J402K071J945J880K546
$$ 341641 341979 342067 341629 340295 338183 335938 334135 332751 331479 330524 330603 332005 334076 336021 337901 340447
51065C40447L750N145O916R292J1684J2806J1689Q518M584J447j6K89K265N727
$$ 340447 344197 349342 356258 365550 377234 390040 401729 410247 414831 416278 416262 416551 418816 424543
51051D24543R554J1710J1171R473R077J0197J0556Q576N382L005J854J072M21
$$ 424543 434097 445807 456978 466451 475528 485725 496281 504857 510239 513244 515098 516170 516591
51038E16591L93O97n0k864p359j2228j6190j8431j8770j7731j6143j4483j2674
$$ 516591 516984 517681 517631 514767 507408 495180 478990 460559 441789 424058 407915 393432 380758
51025C80758j0491p971n416l184j491l20M82J009J310J578K107K969L896M561
$$ 380758 370267 362296 356880 353696 352205 351885 352367 353376 354686 356264 358371 361340 365236 369797
51011C69797M893N040N217N516N766N709N448N461N887O222O141O301P531R517
$$ 369797 374690 379730 384947 390463 396229 401938 407386 412847 418734 424956 431097 437398 444929 454446
50997D54446J1181J2235J3439J5156J6636J7145J6988J6966J7403J8127J8907
$$ 454446 465627 477862 491301 506457 523093 540238 557226 574192 591595 609722 628629
50986F28629J9451J9294J8020J5380J1387O830L366K140K396K483K316L453O477
$$ 628629 648080 667374 685394 700774 712161 718991 722357 724497 726893 729376 731692 735145 741622
50973G41622R913J2530J5285J9793K5945L2354L8262M3680M8367N2118N5726O0177
$$ 741622 751535 764065 779350 799143 825088 857442 895704 939384 987751 1039869 1095595 1155772
50961A155772O5060O8935P1180P2386P2896P2109O9371O4709N8520N1281M3711
$$ 1155772 1220832 1289767 1360947 1433333 1506229 1578338 1647709 1712418 1770938 1822219 1865930
50950A865930L6456K9543K2663J6078J0703P239N509M374J926l628j2224k1187
$$ 1865930 1902386 1931929 1954592 1970670 1981373 1988612 1994121 1998495 2000421 1996793 1984569 1963382
50938A963382k7068k8419k6423k3138j9967j7608j6430j6557j8094k1300k6098
$$ 1963382 1936314 1907895 1881472 1858334 1838367 1820759 1804329 1787772 1769678 1748378 1722280
50927A722280l1538l6444m0524m4272m7973n1426n4438n6886n8332n8319n6898
$$ 1722280 1690742 1654298 1613774 1569502 1521529 1470103 1415665 1358779 1300447 1242128 1185230
50916A185230n4342n0611m5874m1144l7342l3999l0007k5531k1907j9615j7675
$$ 1185230 1130888 1080277 1034403 993259 955917 921918 891911 866380 844473 824858 807183
50905H07183j5386j3246j1669j0049p895n899m895m557m059l399l118l072k524
$$ 807183 791797 778551 766882 756833 748938 743039 738144 733587 729528 726129 723011 719939 717415
50892G17415j355l73k61p62j074p02J87J068J585J810J999K243K529K949L585
$$ 717415 716060 715687 715426 714664 713590 712888 713075 714143 715728 717538 719537 721780 724309 727258 730843
50877G30843M223M605M916N616O779Q035R155J0290J1565J2880J4213J5678J7277
$$ 730843 735066 739671 744587 750203 756982 765017 774172 784462 796027 808907 823120 838798 856075
50864H56075J8916K0725K2935K5491K8233L1416L5496M0420M5701N1221N7393
$$ 856075 874991 895716 918651 944142 972375 1003791 1039287 1079707 1125408 1176629 1234022
50853A234022O4461P2267Q0842R0512J01171J12002J22207J31497J39747J46776
$$ 1234022 1298483 1370750 1451592 1542104 1643275 1755277 1877484 2008981 2148728 2295504
50843B295504J52697J57914J62300J64793J64053J59140J49525J35023J16069
$$ 2295504 2448201 2606115 2768415 2933208 3097261 3256401 3405926 3540949 3657018
50834C657018R3681O9056M3552J9073k433k0178l4720m6639n5529o0545o1282
$$ 3657018 3750699 3819755 3863307 3882380 3879947 3859769 3825049 3778410 3722881 3662336 3601054
50823C601054n7783n0257l9388k6560j3543k225N369P542L911m544j6573l1223
$$ 3601054 3543271 3493014 3453626 3427066 3413523 3411298 3416667 3424209 3428120 3423576 3407003 3375780
50811C375780m7342o3488p8887r3647j07489j19014j26965j31454j33158j31988
$$ 3375780 3328438 3264950 3186063 3092416 2984927 2865913 2738948 2607494 2474336 2342348
50801B342348j27477j19991j10559r9737q7582p4530o1410m8692l6420k4882j4574
$$ 2342348 2214871 2094880 1984321 1884584 1797002 1722472 1661062 1612370 1575950 1551068 1536494
50790A536494n567K411R204J4145J6841J7493J6458J4025J0694P095L497j76l758
$$ 1536494 1530927 1533338 1542542 1556687 1573528 1591021 1607479 1621504 1632198 1639293 1642790 1642614 1638856
50777A638856o710q686r909j0929j2275j4387j7469k1313k5461k9612l3666l7445
$$ 1638856 1632146 1623460 1613551 1602622 1590347 1575960 1558491 1537178 1511717 1482105 1448439 1410994
50765A410994m0596m2809m3916m3816m2513m0222l7235l3825l0327k7093k4164
$$ 1410994 1370398 1327589 1283673 1239857 1197344 1157122 1119887 1086062 1055735 1028642 1004478
50754A004478k1188j7914j4579j1494q533n365j988J319M428P366J0021J2294
$$ 1004478 983290 965376 950797 939303 930770 925405 923417 924736 929164 936530 946551 958845
50742I58845J4489J7137K0430K4191K8407L3377L9234M5563N1695N7296O2592
$$ 958845 973334 990471 1010901 1035092 1063499 1096876 1136110 1181673 1233368 1290664 1353256
50731A353256O8058P3773P9180Q3561Q6736Q8953R0105Q9623Q7462Q4573Q1777
$$ 1353256 1421314 1495087 1574267 1657828 1744564 1833517 1923622 2013245 2100707 2185280 2267057
50720B267057P8392P2581O2948M9366L2523J3419o448k5056m0467n1413n7366
$$ 2267057 2345449 2418030 2480978 2530344 2562867 2576286 2569838 2544782 2504315 2452902 2395536
50709B395536n8370n5054m8542m0068l0620k0879j1423k907L995Q818J1435J1691
$$ 2395536 2337166 2282112 2233570 2193502 2162882 2142003 2130580 2127673 2131668 2140486 2151921 2163612
50697B163612R091L119n996j7224k9462m1898n3561o3092o9409p2236p1670o7764
$$ 2163612 2172703 2175822 2169826 2152602 2123140 2081242 2027681 1964589 1895180 1822944 1751274 1683510
50685A683510o0952n2377m3136l3503k3389j3147l243O586J6939K7711L8218M8227
$$ 1683510 1622558 1570181 1527045 1493542 1470153 1457006 1453763 1460349 1477288 1504999 1543217 1591444
50673A591444N8005O7197P4553P9008Q0388P8817P4200O6795N7770M8669M0490
$$ 1591444 1649449 1716646 1791199 1870207 1950595 2029412 2103612 2170407 2228177 2276846 2317336
50662B317336L3540K7832K3315J9938J7694J6441J5598J4347J2210R256N763K168
$$ 2317336 2350876 2378708 2402023 2421961 2439655 2456096 2471694 2486041 2498251 2507507 2513270 2515438
50650B515438p17k052j726k13K416O724J2865K0011K7240L4380M1461M7927N3001
$$ 2515438 2514721 2512669 2510943 2510730 2513146 2519870 2532735 2552746 2579986 2614366 2655827 2703754 2756755
50637B756755N6342N7784N6922N3764M9234M4388L9778L6451L6199L8232L5757
$$ 2756755 2813097 2870881 2927803 2981567 3030801 3075189 3114967 3151418 3187617 3225849 3261606
50626C261606J9101j5053n8355r6365j19278j26563j22874j12471r7944q1420
$$ 3261606 3280707 3265654 3207299 3110934 2991656 2865093 2742219 2629748 2531804 2450384
50616B450384o4528m7686l0813j4690o99J0633J9934K7755L3514L5712L2999K5191
$$ 2450384 2385856 2338170 2307357 2292667 2291968 2302601 2322535 2350290 2383804 2419516 2452515 2477706
50604B477706J3532k77j5503l2340n0114o6305p8352q6021r1020r4384r5416r3371
$$ 2477706 2491238 2490961 2475458 2443118 2393004 2326699 2248347 2162326 2071306 1976922 1881506 1788135
50592A788135q9000q3774p8317p2349o5672n8648n1802m5456l9588l3932k8353
$$ 1788135 1699135 1615361 1537044 1464695 1399023 1340375 1288573 1243117 1203529 1169597 1141244
50581A141244k3210j9033j5796j2892r970p259m951k743l98J706K995L409L511
$$ 1141244 1118034 1099001 1083205 1070313 1060343 1053084 1048133 1045390 1044992 1046698 1049693 1053102 1056613
50568A056613M097N786Q582J1708J4351J6660J9582K3525K7914L2187L6540M1261
$$ 1056613 1060710 1066496 1075078 1086786 1101137 1117797 1137379 1160904 1188818 1221005 1257545 1298806
50556A298806M6139N1043N6373O2228O7687P1534P3238P2667O9504O3835N6897
$$ 1298806 1344945 1395988 1452361 1514589 1582276 1653810 1727048 1799715 1869219 1933054 1989951
50545A989951N0420M5470M2458M1733M3361M6806N1682N8360O6842P5530Q2480
$$ 1989951 2040371 2085841 2128299 2170032 2213393 2260199 2311881 2370241 2437083 2512613 2595093
50534B595093Q7773R3426J00850J09586J18711J28272J38626J49309J59196J67406
$$ 2595093 2682866 2776292 2877142 2986728 3105439 3233711 3372337 3521646 3680842 3848248
50524C848248J73557J77500J79061J77742J72574J62658J47845J28452J04524
$$ 3848248 4021805 4199305 4378366 4556108 4728682 4891340 5039185 5167637 5272161
50515E272161P6079M4036J0141k4199n8245r1103j21435j48152j70564j87571
$$ 5272161 5348240 5392276 5402417 5378218 5319973 5228870 5107435 4959283 4788719 4601148
50505D601148j97574j99642j94132j81900j63637j40285j13274q3855n2856k1451
$$ 4601148 4403574 4203932 4009800 3827900 3664263 3523978 3410704 3326849 3273993 3252542
50495C252542Q679L6432O1521Q2945R8013J03797R8910Q3241N6996K1465j9673
$$ 3252542 3261221 3297653 3359174 3442119 3540132 3643929 3742839 3826080 3883076 3904541 3884868
50484C884868o1272r9153j30983j55249j70891j78289j79466j76544j70479j61601
$$ 3884868 3823596 3724443 3593460 3438211 3267320 3089031 2909565 2733021 2562542 2400941
50474B400941j50797j39506j28752j18652j08844r9214r0095q1813p4173o6638
$$ 2400941 2250144 2110638 1981886 1863234 1754390 1655176 1565081 1483268 1409095 1342457
50464A342457n9054n1808m5172l8962l3149k8270k4568k1263j7412j3306j0121
$$ 1342457 1283403 1231595 1186423 1147461 1114312 1086042 1061474 1040211 1022799 1009493 999372
50453I99372q306p199o225n500n055m343l067j734q41j65N52Q76M42n7N01K226
$$ 999372 991066 983867 977642 972142 967087 962744 959677 957943 957102 956937 957489 958365 958807 958750 959251 961477
50437I61477M243O142Q468J1650J5244J8647K1976K5648K9462L2656L4631L5326
$$ 961477 965720 971862 980330 991980 1007224 1025871 1047847 1073495 1102957 1135613 1170244 1205570
50425A205570L5020L4252L3799L4257L5659L7809M1015M5930N2588O0037O7252
$$ 1205570 1240590 1274842 1308641 1342898 1378557 1416366 1457381 1503311 1555899 1615936 1683188
50414A683188P4035Q0760Q7528R4095J00297J05912J10080J11512J09674J05393
$$ 1683188 1757223 1837983 1925511 2019606 2119903 2225815 2335895 2447407 2557081 2662474
50404B662474R9912R3569Q5728P5849O4040N0491L4820J6427m579k7102m9762
$$ 2662474 2762386 2855955 2941683 3017532 3081572 3132063 3166883 3183310 3178731 3151629 3101867
50393C101867p1546r1622j08684j21013j27443j28149j24237j16588j05454r1183
$$ 3101867 3030321 2938699 2830015 2709002 2581559 2453410 2329173 2212585 2107131 2015948
50383B015948p4935n8181m1677k5312r046O422K0108L1453M0173M5635M6955M3631
$$ 2015948 1941013 1882832 1841155 1815843 1806797 1813219 1833327 1864780 1904953 1950588 1997543 2041174
50371B041174L5672K3114O201j3676l3811n1577o5799p6421q3344q6299q5707
$$ 2041174 2076846 2099960 2106161 2092485 2058674 2007097 1941298 1864877 1781533 1695234 1609527
50360A609527q2808p8830p4476p0208o6273o2345n7777n2472m7027m1848l6766
$$ 1609527 1526719 1447889 1373413 1303205 1236932 1174587 1116810 1064338 1017311 975463 938697
50349I38697l1732k7203k3434k0000j6563j3550j1486j0146q947p795o915o218
$$ 938697 906965 879762 856328 836328 819765 806215 794729 784583 775636 767841 760926 754708
50337G54708n436m641l993l366k772k750l570m431m369l687l472l780l438j786
$$ 754708 749272 744631 740638 737272 734500 731750 728180 723749 719380 715693 712221 708441 705003 703217
50323G03217L61J844K397K431K396K822M303O880R780J2211J4159J6215J8958
$$ 703217 703578 705422 707819 710250 712646 715468 719771 726651 736431 748642 762801 779016 797974
50310G97974K2603K6785L0554L2940L3480L1767K6841J8234P756j048n965p826
$$ 797974 820577 847362 877916 910856 944336 976103 1002944 1021178 1028934 1027886 1021921 1014095
50298A014095q668r192q939q030p345p256p406p680q518j0033j1634j2667j2985
$$ 1014095 1005427 996235 987296 979266 971921 964665 957259 949579 941061 931028 919394 906727 893742
50285H93742j2803j2465j2342j2518j2594j2097j0938r078o147k068K331O276
$$ 893742 880939 868474 856132 843614 831020 818923 807985 798907 792760 790692 793023 799299
50273G99299J0491J6399K3277K7263K4372J4491J797q680j4495j6088j4859j1765
$$ 799299 809790 826189 849466 876729 901101 915592 917389 908709 894214 878126 863267 851502
50261H51502p579l512q17K36N09R42J527J497L43j507l003l405l019k993m157
$$ 851502 843923 840411 839594 839830 840339 841281 842808 844305 844648 843141 840138 836733 833714 830721 826564
50246H26564o063p493p866p685p581p501p226o964o848o322m808k756j183k75
$$ 826564 820501 813008 805142 797457 789876 782375 775149 768185 761337 755015 750207 747451 746268 745993
50232G45993Q03K678N103P715J0681J4242J8252K2682K8103L5001M2838N0279
$$ 745993 746796 749474 754577 762292 772973 787215 805467 828149 856252 891253 934091 984370
50220I84370N6405O1222O4909O6908O6070O1701N4371M5682L7364L0683K6529
$$ 984370 1040775 1101997 1166906 1233814 1299884 1361585 1415956 1461638 1499002 1529685 1556214
50209A556214K5538K7509L0780L2681L0925K4560J3700j121j9017l8443n7249
$$ 1556214 1581752 1609261 1640041 1672722 1703647 1728207 1741907 1740786 1721769 1683326 1626077
50198A626077p3197q4480r0103r0174q5918p9031p0822o1921n2726m3827l5779
$$ 1626077 1552880 1468400 1378297 1288123 1202205 1123174 1052352 990431 937705 893878 858099
50187H58099k8603k1948j6079j2460j2827j7264k3420k8004k9199k7579k4820
$$ 858099 829496 807548 791469 779009 766182 748918 725498 697494 668295 640716 615896
50176F15896k1943j8882j5314j1424p894n414m270m131m165l564k159m79R59K256
$$ 615896 593953 575071 559757 548333 540439 535025 530755 526624 522459 518895 516736 516257 517216 519472
50162E19472L789N451O574O795O583O693P377Q441R789J1401J2893J3592J3178
$$ 519472 523261 528712 535286 542081 548664 555357 562734 571175 580964 592365 605258 618850 632028
50149F32028J1859R993P908O120N095M580L715K108L92o46r71q57p8J746M259
$$ 632028 643887 653880 661788 667908 673003 677583 681298 683406 683798 683152 682181 681324 681246 682992 687251
50134F87251O541Q147R288J0017R957R022P811O984O674O733P121P733Q256Q634
$$ 687251 693792 701939 711227 721244 731201 740223 748034 755018 761692 768425 775546 783279 791535 800169
50120H00169R327J0759J2694J4613J6571J9226K3076K7979L3415L8991M4609N0465
$$ 800169 809496 820255 832949 847562 864133 883359 906435 934414 967829 1006820 1051429 1101894
50108A101894N7015O4788P4132Q5094R7318J09872J21197J29491J33227J31420
$$ 1101894 1158909 1223697 1297829 1382923 1480241 1590113 1711310 1840801 1974028 2105448
50098B105448J23829J11509R7160Q4327P5712P2105P2679P5740P8923P9216P3662
$$ 2105448 2229277 2340786 2437946 2522273 2597985 2670090 2742769 2818509 2897432 2976648 3050310
50087C050310O0377L9028J0728k1969n5300q5375j09753j27956j40505j47845
$$ 3050310 3110687 3149715 3160443 3138474 3083174 2997799 2888046 2760090 2619585 2471740
50077B471740j50264j48336j42978j35236j26135j16442j06188r4852q2360o9685
$$ 2471740 2321476 2173140 2030162 1894926 1768791 1652349 1546161 1451309 1368949 1299264
50067A299264n8049m7835l8807l1112k5326k1526j9092j7476j6478j5606j4086
$$ 1299264 1241215 1193380 1154573 1123461 1098135 1076609 1057517 1040041 1023563 1007957 993871
50056I93871j1970j0402j0111j0244r548q284p921r075j0790j2029j2908j3967
$$ 993871 981901 971499 961388 951144 941596 933312 925391 916316 905526 893497 880589 866622
50044H66622j4946j5069j4213j3114j2481j2395j2530j2529j2056j0905r261p633
$$ 866622 851676 836607 822394 809280 796799 784404 771874 759345 747289 736384 727123 719490
50032G19490o327n160l811k320j040k52J5q8k21N6R32J972K403J797L88j258k558
$$ 719490 713163 708003 704192 701872 700832 700580 700595 700507 700286 700342 701274 703246 705649 707446 707834 706576 704018
50015G04018k994k398j341q03j127j684j888k156l188m701n665n653n149m379
$$ 704018 701024 698626 697285 696482 695355 693671 691783 689627 686439 681738 676073 670420 665271 660892
50001F60892k772j9L148N835Q155J0854J4059J7181J9912K2551K5359K8177L0945
$$ 660892 658120 658101 661249 667084 675239 686093 700152 717333 737245 759796 785155 813332 844277
49988H44277L4017L7728M2052M7016N3016O0244O7816P3892P6673P5177O9270
$$ 844277 878294 916022 958074 1005090 1058106 1118350 1186166 1260058 1336731 1411908 1481178
49977A481178N9584M7606L5607K5978K0405J9478K2704K8517L4394L7384L5006
$$ 1481178 1540762 1588368 1623975 1649953 1670358 1689836 1712540 1741057 1775451 1812835 1847841
49966A847841K5892R924j1803l6992o2398q4518j00492j08858j09905j05409r7654
$$ 1847841 1873733 1883657 1871854 1834862 1772464 1687946 1587454 1478596 1368691 1263282 1165628
49955A165628q8344p8306o8002n7934m8442l9531l1270k4082j8366j3955j0262
$$ 1165628 1077284 998978 930976 873042 824600 785069 753799 729717 711351 697396 687134
49944F87134o911m014j977j178j661k810l601l498l011l108m265o390r288j2670
$$ 687134 680223 676209 674232 673054 671393 668583 664982 661484 658473 655365 651100 644710 635422 622752
49930F22752j5802j7782j8264j7583j6180j4338j2430j0893r798q719p160m929
$$ 622752 606950 589168 570904 553321 537141 522803 510373 499480 489682 480963 473803 468874
49918D68874k219L45J871J901R79J70K4L06O09Q40J169J892L111M246M200K698
$$ 468874 466655 467000 468871 470772 471751 471921 471945 472251 472860 473700 474869 476761 479872 484118 488318 491016
49902D91016J125J206L040N327P353R518J1826J3102J2360J0046P265M561K009
$$ 491016 492141 493347 496387 501714 509067 518585 530411 543513 555873 565919 573184 577745 579754
49889E79754j19j491k099k086j608j236j872l845o552r356j2205j4958j6819j7081
$$ 579754 579635 578144 576045 573959 572351 571115 569243 565398 558846 549490 537285 522327 505508 488427
49875D88427j5962j4107j1823r361p325o059n040l665k233j423j140o73J91R90
$$ 488427 472465 458358 446535 437174 429849 423790 418750 415085 412852 411429 410289 409616 409807 410797
49861D10797J456J841K321K647K624K552L038M419O341P932Q606Q740R191J0176
$$ 410797 412253 414094 416415 419062 421686 424238 427276 431695 438036 445968 454574 463314 472505 482681
49847D82681J1049J1198J0488Q863O345L664J929J251N82o26j626j877k232l659
$$ 482681 493730 504928 515416 524279 530624 534288 536217 537468 538050 537424 535798 533921 531689 528030
49833E28030n634o975p511p785p664o574m809l390k684k186j486o42L29J392K160
$$ 528030 522396 515421 507910 500125 492461 485887 481078 477688 475004 472818 471332 470690 471019 472411 474571
$$ [...]
##END NTUPLES=NMR SPECTRUM
##END=
