
##TITLE=AC1371_2395_7221463_d1VE8KR3dx
##JCAMPDX= 6.0         $$ Bruker NMR JCAMP-DX V2.0
##DATA TYPE= NMR SPECTRUM
##DATA CLASS= NTUPLES
##ORIGIN= BRUKER
##OWNER= Administrator
$$ 1.72 TOPSPIN		Version 2.1
$$ 2012-12-13 19:20:23.659 -0500  Administrator@X
$$ Compression mode = diff/dup
##.OBSERVE FREQUENCY= 400.02188249412
##.OBSERVE NUCLEUS= ^1H
##.ACQUISITION MODE= SIMULTANEOUS (DQD)
##.ACQUISITION SCHEME= undefined
##.AVERAGES= 8
##.DIGITISER RES= 22
##SPECTROMETER/DATA SYSTEM= spect
##.PULSE SEQUENCE= zg30
##.SOLVENT NAME= COFFEE_meoh
##.SHIFT REFERENCE= INTERNAL, COFFEE_meoh, 1, 14.98509
##AUDIT TRAIL= $$ (NUMBER, WHEN, WHO, WHERE, PROCESS, VERSION, WHAT)
$$ ##TITLE= Audit trail, TOPSPIN		Version 2.1
$$ ##JCAMPDX= 5.01
$$ ##ORIGIN= Bruker BioSpin GmbH
$$ ##OWNER= Administrator
$$ $$ E:\/data/COFFEE/nmr/AC1371_2395_7221463_d1VE8KR3dx/10/pdata/1/auditp.txt
$$ ##AUDIT TRAIL=  $$ (NUMBER, WHEN, WHO, WHERE, PROCESS, VERSION, WHAT)
(   1,<2012-12-13 19:20:14.939 -0500>,<Administrator>,<X>,<go>,<TOPSPIN 2.1>,
      <created by zg
	started at 2012-12-13 19:19:11.816 -0500,
	POWCHK enabled, PULCHK disabled,
       configuration hash MD5:
       86 BA 57 50 F2 9D 5C 9B 26 00 A9 28 5F 66 2E 89
       data hash MD5: 64K
       70 F0 44 2A CC DD 20 FA 14 9E CC 80 D8 5E E0 9E>)
(   2,<2012-12-13 19:20:18.222 -0500>,<Administrator>,<X>,<proc1d>,<TOPSPIN 2.1>,
      <Start of raw data processing
       efp LB = 0 FT_mod = 6 PKNL = 1 PHC0 = 0 PHC1 = 0 SI = 32K 
       data hash MD5: 32K
       A6 90 03 BC 2E 75 DD 8C 93 C8 35 65 28 44 B7 F7>)
(   3,<2012-12-13 19:20:18.715 -0500>,<Administrator>,<X>,<proc1d>,<TOPSPIN 2.1>,
      <pk PHC0 = 100.1184 PHC1 = 0 
       data hash MD5: 32K
       E0 E7 97 FF 45 C9 57 FB 5E 44 D4 48 C2 E1 7F 87>)
(   4,<2012-12-13 19:20:18.961 -0500>,<Administrator>,<X>,<proc1d>,<TOPSPIN 2.1>,
      <abs ABSG = 1 
       data hash MD5: 32K
       2C D4 49 48 BA 1C 45 AD ED A1 C3 2D F9 EA 60 F1>)
(   5,<2012-12-13 19:20:19.158 -0500>,<Administrator>,<X>,<proc1d>,<TOPSPIN 2.1>,
      <abs ABSG = 2 
       data hash MD5: 32K
       76 8C A2 90 2C B3 00 7D 49 87 A0 05 7A 29 9D F4>)
(   6,<2012-12-13 19:20:19.306 -0500>,<Administrator>,<X>,<proc1d>,<TOPSPIN 2.1>,
      <abs ABSG = 3 
       data hash MD5: 32K
       15 3A 69 93 0D 83 B0 BF 54 64 FD 88 7E 7B C0 3B>)
(   7,<2012-12-13 19:20:19.487 -0500>,<Administrator>,<X>,<proc1d>,<TOPSPIN 2.1>,
      <abs ABSG = 4 
       data hash MD5: 32K
       18 DA 02 0C 32 56 A5 23 78 D5 47 4F 45 31 60 DD>)
(   8,<2012-12-13 19:20:19.635 -0500>,<Administrator>,<X>,<proc1d>,<TOPSPIN 2.1>,
      <abs ABSG = 5 
       data hash MD5: 32K
       C2 4E 5F D6 1E 11 8E FC B9 A7 98 F0 F4 EE 53 2F>)
$$ ##END=
$$ 
$$ $$ hash MD5
$$ $$ FA 8F E5 CA E6 9B 1B 17 88 13 6F 30 6F E8 91 D4
##$RELAX= 
##$RELAX= 
##$RELAX= 
##$RELAX= 
##$RELAX= 
##$RELAX= 
##$RELAX= 
##$RELAX= 
$$ Bruker specific parameters
$$ --------------------------
##$DU= <E:\>
##$EXPNO= 10
##$NAME= <AC1371_2395_7221463_d1VE8KR3dx>
$$ [...]
150 150 150 150 150 150 150 150
##$TP07= 0
##$TPNAME0= <>
##$TPNAME1= <>
##$TPNAME2= <>
##$TPNAME3= <>
##$TPNAME4= <>
##$TPNAME5= <>
##$TPNAME6= <>
##$TPNAME7= <>
##$TPOAL= (0..7)
0.5 0.5 0.5 0.5 0.5 0.5 0.5 0.5
##$TPOFFS= (0..7)
0 0 0 0 0 0 0 0
##$TUNHIN= 0
##$TUNHOUT= 0
##$TUNXOUT= 0
##$USERA1= <user>
##$USERA2= <user>
##$USERA3= <user>
##$USERA4= <user>
##$USERA5= <user>
##$V9= 5
##$VALIST= <valist>
##$VCLIST= <CCCCCCCCCCCCCCC>
##$VD= 0
##$VDLIST= <DDDDDDDDDDDDDDD>
##$VPLIST= <PPPPPPPPPPPPPPP>
##$VTLIST= <TTTTTTTTTTTTTTT>
##$WBST= 1024
##$WBSW= 4
##$XGAIN= (0..3)
0 0 0 0
##$XL= 0
##$YL= 0
##$YMAX_a= 660125
##$YMIN_a= -563164
##$ZGOPTNS= <>
##$ZL1= 120
##$ZL2= 120
##$ZL3= 120
##$ZL4= 120
##$ABSF1= 14.98509
##$ABSF2= -5.573092
##$ABSG= 5
##$ABSL= 3
##$ALPHA= 0
##$AQORDER= 0
##$ASSFAC= 0
##$ASSFACI= 0
##$ASSFACX= 0
##$ASSWID= 0
##$AUNMP= <proc_prof1d_extract_pilot.lims>
##$AXLEFT= 0
##$AXNAME= <>
##$AXNUC= <1H>
##$AXRIGHT= 0
##$AXTYPE= 0
##$AXUNIT= <>
##$AZFE= 0.1
##$AZFW= 0.1
##$BCFW= 0
##$BC_mod= 0
##$BYTORDP= 0
##$COROFFS= 0
##$CY= 15
##$DATMOD= 1
##$DC= 0
##$DFILT= <>
##$DTYPP= 0
##$F1P= 0
##$F2P= 0
##$FCOR= 0.5
##$FTSIZE= 32768
##$FT_mod= 6
##$GAMMA= 0
##$GB= 0
##$INTBC= 1
##$INTSCL= 1
##$ISEN= 128
##$LB= 0
##$LEV0= 0
##$LPBIN= 0
##$MAXI= 10000
##$MC2= 0
##$MEAN= 0
##$ME_mod= 0
##$MI= 0
##$NCOEF= 0
##$NC_proc= -8
##$NLEV= 6
##$NOISF1= 0
##$NOISF2= 0
##$NSP= 0
##$NTH_PI= 0
##$NZP= 0
##$OFFSET= 14.98509
##$PC= 1
##$PHC0= 100.1184
##$PHC1= 0
##$PH_mod= 1
##$PKNL= yes
##$PPARMOD= 0
##$PPDIAG= 0
##$PPIPTYP= 0
##$PPMPNUM= 2147483647
##$PPRESOL= 1
##$PSCAL= 4
##$PSIGN= 0
##$PYNMP= <proc.py>
##$REVERSE= no
##$SF= 400.02
##$SI= 32768
##$SIGF1= 0
##$SIGF2= 0
##$SINO= 400
##$SIOLD= 32768
##$SPECTYP= <>
##$SREGLST= <1H.CDCl3>
##$SSB= 0
##$STSI= 32768
##$STSR= 0
##$SW_p= 8223.68421052631
##$SYMM= 0
##$S_DEV= 0
##$TDeff= 65536
##$TDoff= 0
##$TI= <>
##$TILT= no
##$TM1= 0
##$TM2= 0
##$TOPLEV= 0
##$USERP1= <user>
##$USERP2= <user>
##$USERP3= <user>
##$USERP4= <user>
##$USERP5= <user>
##$WDW= 1
##$XDIM= 32768
##$YMAX_p= 463019974
##$YMIN_p= -739903
##$CURPLOT= <Network HP LaserJet P1505>
##$CURPRIN= <$Network HP LaserJet P1505>
##$DFORMAT= <normdp>
##$LAYOUT= <+/1D_H.xwp>
##$LFORMAT= <normlp>
##$PFORMAT= <normpl>
##$SURQMSG= 1
$$ End of Bruker specific parameters
$$ ---------------------------------
##NTUPLES= NMR SPECTRUM
##VAR_NAME=  FREQUENCY,     SPECTRUM/REAL,   SPECTRUM/IMAG
##SYMBOL=    X,             R,               I
##VAR_TYPE=  INDEPENDENT,   DEPENDENT,       DEPENDENT
##VAR_FORM=  AFFN,          ASDF,            ASDF
##VAR_DIM=   32768,         32768,           32768
##UNITS=     HZ,            ARBITRARY UNITS, ARBITRARY UNITS
##FACTOR=    0.250966925370066, 1,           1
##FIRST=     8223.43324360094, -125104,      -280276
##LAST=      0,             12930,           -75621
##MIN=       0,             -739903,         0
##MAX=       8223.43324360094, 463019974,    0
$$ Real data points
##PAGE= N=1
##DATA TABLE= (X++(R..R)), XYDATA
$$ [...]
19550c82911A3461i6446k65496B79616a01728k30482A99320a9716k86782J2348
19540b94150m9180p1901a91999a7607k75201E01454i3423J0007o514L3272c543
19528a55678f5291a3958C25380a50456A4562a80269B13005c13449Q915A94820
19517g3737b9423l88429A08479a52303k2415J8744A74697J95117e02296a50816
19506B08925b1656j39845k7783D0711b79855a16380A34506b9477l41068I7091
19495A5832N3547K48023b35986R7365l0841F6030a55575N7779B6546M2497g4120
19483a18483l9530n6434a07068b2026j10265m0993A44333f5550l55906A36783
19472c93309h5554o4813A15990c57686J26130K5173B15023H320a94875M6739C64069
$$ y = [-382911, 13461, -96446, -361942, 279616, -101728, -332210, 199320, -19716, -306498, -294150, -343330, -415231, -191999, -17607, -292808, 501454, -93423, -83416, -89930, -56658, -3543, -155678, -65291, -13958, 325380, -150456, 14562, -180269, 213005, -313449, -304534, 194820, -73737, -29423, -417852, 108479, -152303, -174718, -155974, 174697, 369814, -502296, -150816, 208925, -21656, -161501, -189284, 40711, -279855, -116380, 134506, -29477, -370545, 97091, 15832, 69379, 317402, -235986, -138621, -169462, 66030, -155575, -97796, 26546, 69043, -74120, -118483, -158013, -214447, -107068, -22026, -132291, -173284, 144333, -65550, -421456, 136783, -393309, -85554, -150367, 115990, -357686, -231556, -206383, 215023, 8320, -194875, -148136, 364069]
19460B84956c46053C156c34846h0155B49119f1004B56754c31025c2212H1265J10930
19449A92195i7979k6871a7511I8304g5378C9846c21051B18463m0670m996p0626
19438A02171i2027A3542N7977a49110B52410B3168d6585k63980F8134K61281A16883
19426a33316B09712k021I1027L1795b38894j30813A96362F0929O19a67151e746
19414B54961b15898R4011j6382k13999J53102N5073e474j30452l7018D6948b40077
19402A694a9761n4598A22009p426J54559I5501g2812F8168d8718C5326c84955
19390C30302A1591a43186A21754i1731E4816a67896j57636A73357j9408b02554
19379a87474H6419a06957b1383l4770a1740F6827C341P2957M5583l9826c19060
$$ y = [284956, -346053, 3156, -334846, -80155, 249119, -61004, 256754, -331025, -32212, 81265, 192195, -97979, -124850, -17511, 98304, -75378, 39846, -321051, 218463, 177793, 172797, 102171, -92027, 13542, 71519, -149110, 252410, 23168, -46585, -310565, 68134, 329415, 116883, -133316, 209712, 207691, 91027, 122822, -238894, -369707, 196362, 60929, 61548, -167151, -5746, 254961, -215898, -121887, -138269, -352268, -199166, -144093, -5474, -135926, -172944, 46948, -240077, 1694, -19761, -74359, 122009, 114583, 269142, 95501, -72812, 68168, -48718, 35326, -384955, 330302, 11591, -143186, 121754, -91731, 54816, -167896, -325532, 173357, 153949, -202554, -187474, 86419, -106957, -21383, -56153, -11740, 66827, 3341, 76298, 121881, 82055, -319060]
19367b04696H3197a13044A78102q0593b21728g2238q0957e036k04855k387j4834
19356b27112H5784b30770K0823a04593b7324m3123d964A29509E4224i8070A55686
19344F5249M3089a58711E8843J96974a41851j32314A9756a66468k59112B65628
19333B0881a04953j53236Q2172c1913B4420J34287a61262H2645k9838e2144A34471
19321a70253d2030A12394b27424R5504H9595a8629n39429a23433k15174A07822
19310a20372K5749A23652a67170C3901a80099P3199q2239k22771e5747r8944E9309
19298c2756l9076j38174j89g4689j46534Q1167B27594F1257a87562H4818h0093
19286A87706a94174a0123o4094n606F7561C585b61900n9957i8221D58150b0421
$$ y = [-204696, 83197, -113044, 178102, 97509, -221728, -72238, -153195, -5036, -209891, -212278, -227112, 85784, -230770, -209947, -104593, -27324, -70447, -4964, 129509, 54224, -98070, 155686, 65249, 108338, -158711, 58843, 255817, -141851, -274165, 19756, -166468, -425580, 265628, 20881, -104953, -258189, -176017, -31913, 24420, 158707, -161262, 82645, 52807, -52144, 134471, -170253, -42030, 112394, -227424, -131920, 89595, -18629, -558058, -123433, -338607, 107822, -120372, -94623, 123652, -167170, 33901, -180099, -106900, -189139, -411910, -55747, -154691, 59309, -32756, -71832, -210006, -210195, -74689, -221223, -140056, 227594, 61257, -187562, 84818, -80093, 187706, -194174, -10123, -74217, -79823, 67561, 3585, -261900, -321857, -98221, 458150, -20421]
19274a70255c9856o698k22899L8077g255n8502j88422L5929j15309J05289A07859
19262a90564j8864Q0340M2963j24909h3126m5968J3984j38236O1297Q7127D8574
19250D777J23683B7521c31060A1337M4216h3213F1090J44352f6494A09329a15478
19238b22329G3364C4612b61550F042c7240j16457m6248A74442b41288J3507f3726
19226f0170q0443N378k36317e8096I6385c7840o087I738K28048c08617a31977
19214a27239f037A7916g8480n4287c7923A16078c3788k4873n1032J7699c4759
19202H3475R1609b62092J13422J456j51514f0580A91339b55102a24181j38344
19192b62525c3069C4643a56218B05090H7665j941a41684H8431b01691f7243A88738
$$ y = [-170255, -39856, -46554, -269453, -231376, -7255, -65757, -254179, -218250, -333559, -228270, 107859, -190564, -209428, -129088, -86125, -211034, -83126, -129094, -115110, -253346, -192049, -104922, 48574, 4777, 128460, 27521, -331060, 11337, 55553, -83213, 61090, 205442, -66494, 109329, -115478, -222329, 73364, 34612, -261550, 6042, -37240, -153697, -199945, 174442, -241288, -227781, -63726, -60170, -140613, -135235, -371552, -58096, 96385, -37840, -43927, 9738, 237786, -308617, -131977, -127239, -6037, 17916, -78480, -132767, -37923, 116078, -33788, -58661, -109693, -91994, -34759, 83475, 175084, -262092, -148670, -147214, -298728, -60580, 191339, -255102, -124181, -262525, -33069, 34643, -156218, 205090, 87665, 85724, -141684, 88431, -201691, -67243, 188738]
19180c25220J46497K0261A3711b53247O6852G7609j4020b05667a0838k00660B01581
19168g9502k48795A54066b02078N9432H2430e3176k35377c529j63297n0447i6292
19156d292j23416j66241a10281r0434d7317J7851a3178l20882D3662M9320K06140
19145B99122j28925D2652c89348A03093h2789H0175a15617m6000a5540d090l10269
19134c14359C3411K7907f5547r5738A27734a74552B25133o6402f19283a33407
19123B01988c61076d2432k17133i0171p0415p4511o3523c054k22490A43174e2628
19111b51637B7375b86914A06527m6047c876C646a80186j25308b4965q5202D9392
19099c44514E2441J05756c28246B09560b8544C97593a40843k9391a7085k9210
$$ y = [-325220, -178723, -158462, 13711, -253247, -186395, 77609, 63589, -205667, -10838, -211498, 201581, -79502, -328297, 154066, -202078, -142646, 82430, -53176, -288553, -3529, -166826, -217273, -96292, -4292, -127708, -293949, -110281, -200715, -47317, -29466, -13178, -334060, 43662, 92982, 299122, 170197, 42652, -389348, 103093, -82789, 80175, -115617, -161617, -15540, -4090, -314359, 33411, 61318, -65547, -161285, 127734, -174552, 225133, 158731, -619283, -133407, 201988, -361076, -42432, -259565, -90171, -160586, -235097, -298620, -3054, -225544, 143174, -52628, -251637, 27375, -286914, 106527, 60480, -3876, 3646, -180186, -305494, -24965, -110167, 49392, -344514, 52441, 158197, -328246, 209560, -28544, 397593, -140843, -170234, -17085, -46295]
19089d6295d079D3536i17j59345n4963a5763j74705q8617A56261c00780K5604
19078b75176J03761b0839B23398o4462m1027B9329d97845A06092J20041H2804
19067e4859D3519h7392K32j33755D2682b59414A11016C5736J34598e5257A31670
19055A65386b64620A11519b2560I6489m2732b70776A76390G5898i764B27490I7599
19043i5174d192n8830j86305E0622f1397C31456g0197a5161A11250c55300a10241
19031B31008R3281M1750P8027a57959E2861e3973o1732d9853j48264C5440M039
19020C9479J06545c47688A440a68092P1718k47486A85426b36488R7007A25685
19009e42205b14445L060c3389o9298H9070K02268A39368a56471G5137c9905j7961
$$ y = [-46295, -4079, 43536, -917, -160262, -215225, -15763, -190468, -279085, 156261, -300780, -275176, -171415, -20839, 223398, 158936, 117909, 29329, -497845, 106092, 226133, 82804, -54859, 43519, -87392, -87160, -220915, 42682, -259414, 111016, 35736, 170334, -55257, 131670, 165386, -264620, 111519, -22560, 96489, 53757, -270776, 176390, 75898, -9764, 227490, 97599, -95174, -4192, -63022, -249327, 50622, -61397, 331456, -70197, -15161, 111250, -355300, -110241, 231008, 324289, 366039, 444066, -157959, 52861, -53973, -115705, -49853, -198117, 35440, 39479, 146024, -347688, 1440, -168092, -96374, -343860, 185426, -236488, -139481, 125685, -542205, -214445, -211385, -33389, -102687, 89070, 291338, 139368, -156471, 75137, -39905, -57866]
18998e7866A07337f3624n8856b5544A75042g7537j13664A28575c94095A91881
18987G4195h8515C3312a64692M2897c5301A83840D4952J04310a26439A01902b73155
18975B9921b92200j3098J27321P6873B07130a7881k55495F3593b69178j37781
18965d06959E5020Q6809i1718j45856C3299a26113J6885o5204C66806a95757B003
18953b31859j47623E7815c09508h1813K0038A8405N6207c02296J787J07111m0103
18942b33501H6002a40460K1911f54A44770L2318n2110q037B8817b77064J37629
18931a39435b0229A59489E2005a30233k39032J34245M3552m4455N4807A40363
18920d3063n0414j50882a20885E49c03599M9944E0797a46328j05202b7063A5353
$$ y = [-57866, 107337, -63624, -122480, -25544, 175042, -77537, -191201, 128575, -394095, 191881, 74195, -88515, 33312, -164692, -121795, -35301, 183840, 44952, 149262, -126439, 101902, -273155, 29921, -292200, -305298, -177977, -101104, 207130, -17881, -273376, 63593, -269178, -406959, 55020, 141829, -91718, -237574, 33299, -126113, -109228, -174432, 366806, -195757, 2003, -231859, -379482, 57815, -309508, -81813, -61775, 18405, 74612, -302296, -300509, -193398, -233501, 86002, -140460, -118549, -654, 144770, 177088, 124978, 116941, 28817, -277064, -139435, -20229, 159489, 52005, -130233, -369265, -235020, -191468, -235923, -181116, 140363, -43063, -93477, -244359, -120885, 549, -303599, -253655, 50797, -146328, -251530, -27063, 15353]
18908d0231l867I9559a06180E4292h4784b9835C1948a44049k65125J64203B71709
18896a66988j06304i2799I1520J36840e0008j43436f8849l81429I4583a59074
18885a59523b35j39926G7304b11174b3278A33189E9013b46775c5890k84415h0610
18873h9295K8542j09547A32765c8506j53319F5806J53189a94334l45840a20012
18862F1281c4774q6977H5519K68401A39572b0946o8630A5036M1873a43743c5790
18850A7372R6568M2367i1513k2027j16587A36940c20294a18480b4553j99200K8597
18839a95156R7335j04412Q0986e7496B6861J23101f41415h4490c614k72496A73836
18827E720J40351a11557m741M4866B15949b19901J02965D00883j83455H0199e2102
$$ y = [-40231, -44098, 99559, -106180, 54292, -84784, -29835, 31948, -144049, -409174, -244971, 271709, -166988, -273292, -92799, 91520, 228360, -50008, -193444, -68849, -450278, 94583, -159074, -159523, -235, -140161, 77304, -211174, -23278, 133189, 59013, -246775, -35890, -320305, -80610, -89295, -60753, -170300, 132765, -38506, -191825, 65806, 218995, -194334, -540174, -120012, 61281, -34774, -121751, 85519, 353920, 139572, -20946, -89576, 15036, 56909, -143743, -35790, 17372, 113940, 156307, -91513, -113540, -230127, 136940, -320294, -118480, -24553, -223753, -195156, -97821, -202233, -121247, -57496, 26861, 149962, -641415, -84490, -3614, -276110, 173836, 5720, 146071, -111557, -116298, -71432, 215949, -219901, -116936, 400883, 217428, 80199, -52102]
18815A12581c1464C451b52828H5434C8347i2735j80828A05822M3950C2899b4186
18803a99832a5781A3009J3554J43426p49M7330a17080j74632Q240A11479J46495
18792B57974F9284b10648c0551B13308C7546I092h7008j67623B3549a55415B2487
18780A73447b78985B28188e5264B95877a03938E406J8589J8790g7544j26311H8042
18768g8631p6204e7931H2387J51805a12700m6301j72256g0918b4391A80679b02329
18756A44073i4431j00150A04623o548J09822b32385h0706G2997J63565f592F7099
18744c43521A67567c7671A86404o1777h5399n8019K5549B51466b66204i775o7251
18733g7026C17795A04166a56418d1326j45912G6735M6524h2382j0078j18134j0990
$$ y = [112581, -31464, 3451, -252828, 85434, 38347, -92735, -273563, 105822, 149772, 32899, -24186, -199832, -15781, 13009, 26563, 169989, 169240, 216570, -117080, -291712, -283472, 111479, 257974, 69284, -210648, -30551, 213308, 37546, 9092, -87008, -254631, 23549, -155415, 22487, 173447, -278985, 228188, -55264, 295877, -103938, 5406, 23995, 42785, -77544, -203855, 88042, -78631, -154835, -57931, 82387, 234192, -112700, -159001, -331257, -70918, -24391, 180679, -202329, 144073, -94431, -194581, 104623, 98075, 207897, -232385, -80706, 72997, 236562, -6592, 67099, -343521, 167567, -37671, 186404, 124627, -85399, -143418, -117869, 251466, -266204, -9775, -77026, 317795, 104166, -156418, -41326, -187238, 76735, 123259, -82382, -92460, -210594, -221584]
18722b21584A72922A5531g5806K8443m1773K4604m28066f8407A45575b56469H6168
18710C7806J12524l9291n0378c46044A42316a9244B5867a16989A63526d20840
18699a63039q3010c1291j93040h8166p8698n3098C47661a42289G6192c28965B33913
18687A4973J601a63468A78550b57219e8293B14343H465c0150j07092k03494f5170
18675A72045b19927P2239k9420d5605j88315a02309L9998j72011M2020A69139
18664D30141a41275D4383b7698k68567A74114e688l74189I9308B1698J5071b03939
18652e1240A1290e8245k95995g4897A80387m7709h1731B2358J50853a56877k02156
18641c59033A16304l6267b11213r7140R3690k8249B5212J58645d7994A2688J94723
$$ y = [-221584, 172922, 15531, -75806, -47363, -89136, -64532, -492598, -68407, 145575, -256469, 86168, 37806, 150330, 111039, 60661, -346044, 142316, -19244, 25867, -116989, 163526, -420840, -163039, -246049, -31291, -224331, -88166, -166864, -219962, 347661, -142289, 76192, -328965, 233913, 14973, 16574, -163468, 178550, -257219, -58293, 214343, 8465, -30150, -137242, -340736, -65170, 172045, -219927, -147688, -177108, -45605, -233920, -102309, -62311, -234322, -192302, 169139, 430141, -141275, 44383, -27698, -296265, 174114, -5688, -379877, 99308, 21698, 36769, -203939, -51240, 11290, -58245, -354240, -74897, 180387, 132678, -81731, 22358, 173211, -156877, -359033, 116304, 80037, -211213, -308353, -214663, -242912, 25212, 183857, -47994, 12688, 207411]
18630B07411c24661A30724d2178C11978b16013Q4285j178L7458b7A37024B0665
18618B25987c920n2797k8406L1144B42485A14155J23008K9193B8317a86095Q5561
18607a00534L0070O184o5154M5277q002A30141a23935d6363j96403G5763b34005
18595A02171J64373f5786G9813a21868c221F3500M0319K1022c3997A39779a05012
18583A73863b45097d7126m68432K33847d1980B7696c5767A68312B3819d6582o0475
18572a07057n6287j22559l4945A57758J80800a45501k35936J19348a04396C66514
18561c98560A88724n7566a5577B15229d1181F2178J31664a26247J2515r9937H6827
18549B6813a32379J0527H8636a90200J020Q2383A11400a34702r9743I755K4689
$$ y = [207411, -324661, 130724, -42178, 311978, -216013, -131728, -132906, -95448, -27, 137024, 20665, 225987, -3920, -56717, -85123, -53979, 242485, 114155, 237163, 266356, 28317, -186095, -100534, -70464, -64280, -129434, -84157, -92159, 130141, -123935, -46363, -242766, 75763, -234005, 102171, 266544, -65786, 79813, -121868, -3221, 63500, 103819, 124841, -33997, 139779, -105012, 173863, -245097, -47126, -515558, -281711, -41980, 27696, -35767, 168312, 23819, -46582, -107057, -163344, -285903, -320848, 157758, 338558, -145501, -381437, -262089, -104396, 366514, -398560, 188724, 131158, -15577, 215229, -41181, 62178, 193842, -126247, -113732, -213669, 86827, 26813, -132379, -121852, 88636, -190200, -189180, -106797, 111400, -134702, -234445, 9755, 34444]
18538C4444a17751A92030a40510m7272f7862a3404B16007b53147G4518g0142F885
18526D6033O0867L52773a26151e0349k25328b5450A18922E3941K2215h5952k02107
18515b88059a00781k1103D4844h8122c3197B4062b13245B45348e8839m5241A59854
18503b68259a2805A93915n1376b93739j8991R4784e1970P425j64552P8221C10167
18491I1706a67386a4115A7224L8567d2305G8827P575b19442E4815K4911J52853
18480B32579c1943C16012b68374c3195E4285e8937H7668j6649b20154A37987j6053
18469A21934a82159C40391b6028j07915A2047J2694a69129A9554c64856J28282
18459b36574B0203f8134g051m7407J4412A74197b69072J16612j34309A496b19173
$$ y = [34444, -117751, 192030, -140510, -187782, -67862, -13404, 216007, -253147, 74518, -70142, 6885, 46033, 106900, 459673, -126151, -50349, -275677, -25450, 118922, 53941, 76156, -85952, -288059, -100781, -121884, 44844, -88122, -33197, 24062, -213245, 245348, -58839, -104080, 159854, -268259, -12805, 193915, 142539, -293739, -312730, -217946, -51970, -44545, -209097, -130876, 310167, 91706, -167386, -14115, 17224, 55791, -42305, 78827, 86402, -219442, 54815, 79726, 232579, -31943, 316012, -268374, -33195, 54285, -58937, 87668, 71019, -220154, 137987, 121934, -182159, 340391, -26028, -133943, 12047, 24741, -169129, 19554, -364856, -236574, 20203, -68134, -7051, -54458, -40046, 174197, -269072, -152460, -286769, 1496, -219173]
18447B37402a61047G6066a22650l07734J89654h2326D9673P018a45871j41472
18437b87343g1252A83890a83730a9200E5577g6064C58809M588H8529C8193c24818
18425a17416j12634J1309h1238C256e7227G3491a37084j41794A2942a84465G205
18413c19098H8542O0614c99782A34548c20040A93186a87039A55412b09610g9880
18402A89447O5626a22303B88330A6351K71202j09754r053o916d8664B43766A17341
18390a64602l639C5395e1234j878l6320j82892F7246J37327a10413j84233j42359
18379d37005A37622d3422E4358a29270j20848k28024K03743d5084C1836N1230
18369H3066a02889A9636M8426J19955a23744K0291H0634b49285B043a43470A32498
$$ y = [237402, -161047, 76066, -122650, -430384, -240730, -82326, 49673, 56691, -145871, -287343, -71252, 183890, -183730, -19200, 55577, -76064, 358809, 363397, 88529, 38193, -324818, -117416, -230050, -218741, -81238, 3256, -57227, 73491, -137084, -278878, 12942, -184465, 7205, -319098, 88542, 149156, -399782, 134548, -320040, 193186, -187039, 155412, -209610, -79880, 189447, 255073, -122303, 288330, 16351, 287553, 177799, 168746, 161830, -48664, 243766, 117341, -164602, -168241, 35395, -51234, -53112, -89432, -272324, 67246, 204573, -110413, -294646, -437005, 137622, -43422, 54358, -129270, -250118, -478142, -274399, -45084, 31836, 83066, -102889, 19636, 68062, 188017, -123744, -103453, 80634, -249285, 2043, -143470, 132498]
18357a60990A62228l1219j4757g9539m3458C7419b77501J27066C0040a16803D5087
18345A17357C4127b7290j90941M6426p0591f3030B89285a69641K117B03048i0279
18333b69732A12809a96259j94350b7758A13246a02740a4768k01380E6336d30774
18322i0696r338k50080D0820J36489L8329G779h6127j56835L6648d9996C73219
18310E9239k3292f1420e110C10615a56150B22937M2269m6049M2938o5852a15145
18298d3738H3428d9125l65669e946A49134o1386l1415K7319d0168E6456a2055
18286B5078K4068K7627e7559A01862j8497C24N5604a33383j65156d9898G8821
18274A08761g7075j92857D3676c3644m616j05252j85781C7538M8495K10414D5019
$$ y = [-160990, 162228, 131009, 116252, -79539, -122997, 37419, -277501, -150435, 30040, -116803, 45087, 117357, 34127, -27290, -218231, -171805, -242396, -63030, 289285, -169641, -167524, 203048, -90279, -269732, 112809, -196259, -390609, -27758, 113246, -102740, -14768, -216148, 56336, -430774, -90696, -100034, -350114, 40820, 177309, 215638, 7779, -86127, -242962, -206314, -49996, 373219, 59239, 35947, -61420, -5110, 310615, -156150, 222937, 265206, 219157, 262095, 196243, -115145, -43738, 83428, -49125, -414794, -5946, 149134, 87748, 56333, 83652, -40168, 56456, -12055, 25078, 49146, 76773, -57559, 101862, 83365, 324, 55928, -133383, -298539, -49898, 78821, 108761, -77075, -269932, 43676, -33644, -38260, -143512, -329293, 37538, 86033, 296447, 45019]
18262d3439j60014A27080J3198B1248J29184g0614A32253a36847q3927Q0893c3450
18250A50201P9241D5300d3618l02990a3737j38936f249C8186c16746I8532b16542
18238b4945k64289O3971d0021l21562J24390O1095h7226C41084i5618H9863K236
18227I2099j5016c4402j59829P9723C1592J3306q929J10367a34868r7238J09259
18216a22847C17424A09878a82543c4151r09k14710A51312A7653J8923J2813k791
18205D6598h9853c0698k3492j23087j96552b8794l46307F0691i5998A35935E2394
18193f34600F0467J80299n1138e8003A99377L0625G0630K64998j36546a4392E9717
18181b18770d4867C28370D539a91395A54402C3632i3401j84739p2031D4373b9645
$$ y = [-43439, -203453, 127080, 140278, 21248, 150432, -70614, 132253, -136847, -220774, -139881, -33450, 150201, 229442, 45300, -43618, -346608, -13737, -152673, -6249, 38186, -316746, 98532, -216542, -24945, -289234, -225263, -40021, -361583, -237193, -176098, -87226, 341084, -95618, 89863, 92099, 77083, -34402, -194231, -114508, 31592, 44898, 35969, 146336, -134868, -232106, -122847, 317424, 109878, -182543, -34151, -35060, -249770, 151312, 17653, 36576, 49389, 46598, -89853, -30698, -54190, -177277, -373829, -28794, -375101, 60691, -95998, 135935, 52394, -634600, 60467, 240766, 189628, -58003, 199377, 230002, 70630, 335628, 199082, -14392, 59717, -218770, -44867, 328370, 4539, -191395, 154402, 33632, -93401, -278140, -350171, 44373, -29645]
18169c16177A23084a20217Q772G6226a60464J7977b2416A14449a11611A70483
18158a70796L5218A92747B1476K4794d4193i628k01884j5851h7992I1235L43543
18147D34778c9529D7036a95736D03601b33126E8327K87074b05250L8776c5325
18136d05370B04371a33010e1978A00901d3095j905A53922a47941a7782D493a17741
18124B84802a49775j33859B52845b4320A96381E0975L8377b7370l04097e453l3625
18113c9078B83522g2194o4994M1689L2280A03199C8877O2315g1177j29603o5279
18102b66059R3481A14906A7592a81765A01019m1028d3688j97132a4728D7054a1247
18090a01296A28674a08109L1048k16159G8881c55206c9784j59732e2923E420a02252
$$ y = [-316177, 123084, -120217, -111445, 76226, -160464, -142487, -22416, 114449, -111611, 170483, -170796, -135578, 192747, 21476, 46270, -44193, -9628, -211512, -227363, -87992, 91235, 434778, -39529, 47036, -195736, 403601, -233126, 58327, 345401, -205250, -166474, -35325, -405370, 204371, -133010, -51978, 100901, -43095, -45000, 153922, -147941, -17782, 4493, -117741, 284802, -149775, -283634, 252845, -24320, 196381, 50975, 89352, -27370, -331467, -5453, -39078, 283522, -72194, -137188, -95499, -63219, 103199, 38877, 101192, -71177, -200780, -266059, -172578, 114906, 17592, -181765, 101019, 59991, -43688, -240820, -14728, 47054, -11247, -101296, 128674, -108109, -77061, -293220, 78881, -355206, -39784, -199516, -52923, 5420, -102252]
18078E4333c1117j4604D37646d4407A085b95314J3964J30267c2569A6731F800
18066D7905a40827B0357R6062a61843O1696J7715m2697q8693b3767k3127A0860
18054A83218q7435a29065k19211b8663l35263B00846b950E270c73645A42985C0855
18042g0991j49068A44585m011P5516q273a60544m0952a1677B9345g3874A14612
18030b14446B0497M6220J88636Q1608I6253M9757B3671J43154P1222c6284J3867
18019b2417l40530G688a68124J2016G248i0813L4534B9627c51870G4266g3694
18007h7150l03322d6877q8046I2945K7301J64819D4690A3266e1175A32139b32067
17995B1612J9908e4284j18862f0684C00642a13519A08444C4708M631a83304g7508
$$ y = [54333, -31117, -45721, 437646, -44407, 1085, -295314, -281350, -151083, -32569, 16731, 6800, 47905, -140827, 20357, 116419, -161843, -100147, -82432, -125129, -213822, -23767, -46894, 10860, 183218, 95783, -129065, -348276, -28663, -363926, 200846, -2950, 5270, -373645, 142985, 30855, -70991, -220059, 144585, 140574, 216090, 207817, -160544, -201496, -11677, 29345, -73874, 114612, -214446, 20497, 66717, 255353, 336961, 96253, 146010, 23671, 166825, 238047, -36284, -22417, -362947, 7688, -168124, -156108, 7248, -90813, -56279, 29627, -351870, 74266, -73694, -87150, -390472, -46877, -134923, 92945, 120246, 285065, 44690, 13266, -51175, 132139, -232067, 21612, 41520, -54284, -173146, -60684, 300642, -113519, 108444, 34708, 39339, -183304, -77508]
17983a38812A4237L66133a82800B58763a03327E8810d58116c4680A62407a82320
17972a616k01616Q5081l8349A08896c63596B94783b9463n0945A7415O0435b54180
17960B520a5721B03797e0288j47645G0547J36520b24565i2577A40045d4272C35934
17948B30951a04023h54o9829K4892l09349A8707H679M524K74937F231J74071c64134
17935a33552D67928A59626E2159H379R637J24377b22940A77612a06268A10124
17924a27105k3821B52449C2373J22697P6925c749A29581f319G8064c27345A53468
17912C01258k3999L3195c09411d3803E3774b21743j25842A81055C3786i5343A72883
17900B99718F3015a32473G5471J71461a74482h3581A53662d28501G6231g3896
$$ y = [-138812, 14237, 380370, -182800, 258763, -103327, 58810, -458116, -34680, 162407, -182320, -1616, -203232, -118151, -156500, 108896, -363596, 294783, -29463, -80408, 17415, 77850, -254180, 2520, -15721, 203797, -50288, -197933, 70547, 207067, -224565, -92577, 140045, -44272, 335934, 230951, -104023, -854, -70683, -45791, -355140, 18707, 8679, 13203, 288140, 6231, 180302, -364134, -133552, 467928, 159626, 52159, 8379, 18016, 142393, -222940, 177612, -106268, 110124, -127105, -150926, 252449, 32373, 155070, 231995, -3749, 129581, -6319, 78064, -327345, 153468, 301258, 277259, 310454, -309411, -43803, 53774, -221743, -347585, 181055, 33786, -95343, 172883, 299718, 63015, -132473, 75471, 246932, -174482, -83581, 153662, -428501, 76231, -73896]
17889F5404a67429O5311A38606d9377F0488K68178i0887G4897i225C4302M1861
17878G6163a98866l666c0902n7395j12219B4243a57944f1652j3147F9293a28398
17866E2926d0746k16135B06324m9112K372b38700J0336M6482r2199i5475k9907
17855a25382A27761a14801B77300a501E0205a38392K3344k9239g0720k3216q5489
17844a79425A50841c8560k0972k08656f2462D1190j5013J32441f4547C403L616
17833G019B337b64351f2063k9752o3709b8734j54536A59966K98545e60048H1539
17821a01532B04013a72561C3108a0574r2049M583j4296o8469b5135D5487c7388
17809b42892g918A07248c71925a19437B98375i9917j12538A01416J55763H2505
$$ y = [65404, -167429, -102118, 138606, -49377, 60488, 328666, -90887, 74897, -9225, 34302, 76163, -198866, -202532, -30902, -88297, -200516, 24243, -157944, -61652, -74799, 69293, -128398, 52926, -40746, -256881, 206324, 157212, 159584, -238700, -228364, -181882, -274081, -95475, -125382, 127761, -114801, 277300, -1501, 50205, -138392, -115048, -144287, -70720, -93936, -179425, 150841, -38560, -59532, -268188, -62462, 41190, 26177, 158618, -64547, 3403, 7019, 2337, -264351, -62063, -91815, -155524, -28734, -183270, 159966, 458511, -560048, 81539, -101532, 204013, -172561, 33108, -10574, -102623, -98040, -112336, -180805, -25135, 45487, -37388, -242892, -7918, 107248, -371925, -119437, 298375, -99917, -212455, 101416, 257179, 82505]
17798c17915a50326L7212a3875E4981K64891E329J24709C1361K10814I2795J37991
17787B30786A12224A2436O9677J78619G6661c3260j63383k39387a42574O3890
17777g8684B3873d1888B05807a79519M7028l4599A37529a26351j09935d6212A06190
17765A88241J43577A41423A036c5510G0921G133O7208i5389d2186A03995K37112
17754C41107c0126G7379j1549b23540c680k05452R8637j72935D48768j83271b20432
17742f5560j49193G1069a14195E3921j3480b39506iD3028d2071A54287m1604L20565
17730D33248A2709J22529l5258C3675a31243l7114E1090c3786r2749e566H8381
17718A8181P44N8093Q8768b9140l0659j01218A46178m0416J4340e02875f5301
$$ y = [-317915, -150326, -113114, -13875, 54981, 319872, 5329, 130038, 31361, 242175, 92795, 230786, 112224, 12436, 82113, 260732, 76661, -33260, -196643, -436030, -142574, -78684, 23873, -41888, 205807, -179519, -132491, -167090, 137529, -126351, -236286, -46212, 106190, 188241, 331818, 141423, 1036, -35510, 70921, 7133, 74341, -95389, -42186, 103995, 341107, -30126, 77379, 65830, -223540, -3680, -209132, -110495, -283430, 448768, 265497, -220432, -65560, -214753, 71069, -114195, 53921, 40441, -239506, -9, 43028, -42071, 154287, 112683, 433248, 12709, 135238, 99980, 33675, -131243, -168357, 51090, -33786, -126535, -5566, 88381, 18181, 18925, 77018, 165786, -29140, -59799, -161017, 146178, 105762, 120102, -502875, -65301]
17706A11279m092I802g4925o2756G9910a48877A15460L77808H5601J87466a2763
17694I8577a2347j9273B29299J14370G5949p006f6470F9656K55444o8896f2317
17682i3702j76699B07736e5351k05231C44163e357B33042k5854J1201j00344J2094
17671A30139c66597h9882A67710D3759K2137b09919n7387f6302D4982a45416A44081
17659A39056D5134d5247j14514B64480i8215F7109b64188J15508A15124b70437
17648A70168J21313e5730A33936d3353o54036A20279d73234d4745B81183A26824
17637B410N8046h0597H8918k6143d42751g0761J485D8355K14530g4257B62711
17625a40890A40660b73602B25045o4313b93811A8437K0881e3700A74323a27655
$$ y = [111279, 107187, 9802, -74925, -137681, 79910, -148877, 115460, 493268, 85601, 273067, -12763, 98577, -12347, -31620, 229299, 343669, 75949, 68943, -66470, 69656, 325100, 256204, -62317, -93702, -270401, 207736, -55351, -260582, 344163, -5357, 233042, 207188, 218389, 118045, 130139, -366597, -89882, 167710, 43759, 65896, -209919, -267306, -66302, 44982, -145416, 144081, 139056, 45134, -45247, -159761, 264480, -98215, 67109, -264188, -148680, 115124, -270437, 170168, 291481, -55730, 133936, -43353, -697389, 120279, -473234, -44745, 281183, 126824, 2410, 60456, -80597, 88918, 62775, -442751, -70761, -69276, 48355, 262885, -74257, 262711, -140890, 140660, -273602, 225045, 160732, -293811, 18437, 39318, -53700, 174323, -127655]
17614A95726a8203C06031k68r1598b94078J19019e5562l177C8864P7073h4659
17602i7134C29937f2709k7296j71165a628p1795j34782A8711a7720B62476a71274
17590B1427a08106G5123J87994A07679l7681K5019k0621r442K05852g1085A14825
17578a10479m0230a4265A87176b1970A49815b70488A51657n1440J2565b57649
17567H8934l1679j737c25801B9705b08425B56378e8229A39366d5901I5593r213
17556H6380a42428B20477a96166G4173i5897c2459j03256d2793B76414b5788j3019
17545c8807A46537e1737A31508c10983c009B6000O6059c07798B94906a0442l3987
17534d4429A27051L56977A35523M5369m8795F3262b18973G0932A829a00922A91650
$$ y = [195726, -18203, 306031, 305763, 214165, -294078, -175059, -55562, -58739, 38864, 115937, -84659, -97134, 329937, -62709, -90005, -261170, -1628, -73423, -208205, 18711, -17720, 262476, -171274, 21427, -108106, 75123, 263117, 107679, 69998, 95017, 74396, 64954, 270806, -71085, 114825, -110479, -150709, -14265, 187176, -21970, 149815, -270488, 151657, 100217, 112782, -257649, 88934, 57255, 55518, -325801, 29705, -208425, 256378, -58229, 139366, -45901, 95593, 86380, -142428, 220477, -196166, 74173, -95897, -32459, -135715, -42793, 276414, -25788, -38807, 146537, -51737, 131508, -310983, -3009, 26000, 92059, -307798, 294906, -10442, -44429, 127051, 484028, 135523, 180892, 132097, 63262, -218973, 70932, 1829, -100922, 191650]
17522G6724i0854A97328a25673A91526Q8264f6528E6154K2663b6199A24770a84403
17510D2733K51549o3309C3446e5315a1809D66867k24645a11403I0717M4928c085
17498a73659h2794B7691b0207B15983A0080K40198E2983N9421C3268a52959A17507
17486C76766d6133j35846A22893a68731E02345I1854i914A96181B0981J01749
17476A22730a75888k0267H6918J99421j16457C9405A2903K86866C4874J11922
17466A46796Q1218C5693d4055A33767g2751D02878i1905C83562j03538i2026k4357
17455a16383A731K72178B4898K8931J96586G6896J34297F3940J33734J79471n0357
17444C26788p3473e7969D66568k05321l4316F8752L73031j59923j39220J69033
$$ y = [76724, -90854, 197328, -125673, 191526, 279790, -66528, 56154, 78817, -26199, 124770, -184403, 42733, 294282, 230973, 33446, -55315, -11809, 466867, 242222, -111403, 90717, 135645, -3085, -173659, -82794, 27691, -20207, 215983, 10080, 250278, 52983, 112404, 33268, -152959, 117507, 376766, -46133, -181979, 122893, -168731, 502345, 91854, -9914, 196181, 20981, 122730, -175888, -196155, 86918, 286339, 169882, 39405, 12903, 299769, 34874, 146796, 228014, 35693, -44055, 133767, -72751, 402878, -91905, 383562, 280024, -92026, -116383, 1731, 273909, 24898, 53829, 250415, 76896, 211193, 63940, 197674, 377145, 326788, 253315, -57969, 466568, 261247, 226931, 68752, 441783, 281860, 142640, 311673]
17434C11673p6288O522I1163c6346C27204a02337A42968A5984M19501A94280j8727
17423A75553J37804K44539A96486N1096j22207O7279J62396k3017P4412M72828
17413H79273A14543J32037g0284B13000J39617m1273l5794n8252o8296j0342e7260
17401D7727L75888L0055j39533A4306L58651A31322M6735J57196A38041K12999
17391C51040a30460b3459G5844K12878A20929j6788C2721J77313q2887L24220
17381D51367E3452M00515A46982k0251b6398B42319O1211k6752j00808r810k1843
17370A44317f1258A13593n5267J9644C1583K43563H062N7781J26868H2036K76706
17359C58742q5413N8318D9637K6136j6888M8260J13055K29471A17031a3434D07827
$$ y = [311673, 235385, 241907, 91163, -36346, 327204, -102337, 142968, 15984, 435485, 194280, 175553, 313357, 557896, 196486, 247582, 125375, 192654, 355050, 332033, 406445, 879273, 114543, 246580, -70284, 213000, 352617, 311344, 275550, 217298, 149002, 138660, -57260, 47727, 423615, 453670, 314137, 14306, 372957, 131322, 178057, 335253, 138041, 351040, -130460, -23459, 75844, 288722, 120929, 104141, 32721, 210034, 127147, 451367, 53452, 453967, 146982, 126731, -26398, 242319, 303530, 276778, 175970, 166160, 144317, -61258, 113593, 58326, 77970, 31583, 275146, 8062, 65843, 192711, 82036, 358742, 273329, 331647, 49637, 75773, 58885, 107145, 220200, 449671, 117031, -13434, 407827]
17347A00762J54761I6974a32655A33432b26665J05620A32337m4210L62273c0266
17336A70109M6913j9850n0204G20K55321M3900K8318j43716E0943J03246J19823
17325B74012C8301c034D3483R4008J08037C0281L61438j52633Q2453a54162O5812
17314h8350J2401D5569a03121Q840A57927a63346D0622K33569H7668C0247R4284
17303A24531E8855K41785R6782g3233p362H4405K96194A58286a74210D16694I5330
17291B54802E271M0384R3981j1293m8953k94R8803K17560n5602E4936N6688j8385
17279I3239R5728B3216e8667D1119K54346b560B79725J27392K3092A24161J89956
17268C14117p2116J27585f5641C10615q2469p079M2026a10859C26815A7474e1564
$$ y = [100762, 255523, 96974, -132655, 133432, -226665, -121045, 132337, 88127, 450400, -30266, 170109, 217022, 197172, 146968, 720, 256041, 299941, 328259, 184543, 50943, 154189, 274012, 38301, -3034, 43483, 137491, 245528, 30281, 391719, 239086, 321539, -154162, -88350, -75949, 45569, -103121, -94281, 157927, -163346, 40622, 274191, 87668, 30247, 124531, 58855, 300640, 397422, -73233, -80595, 84405, 380599, 158286, -174210, 416694, 95330, 254802, 5271, 45655, 139636, 128343, 79390, 79096, 177899, 395459, 339857, 54936, 111624, 93239, 188967, 23216, -58667, 41119, 295465, -2560, 279725, 407117, 430209, 124161, 314117, 242001, 369586, -65641, 310615, 228146, 221067, 263093, -110859, 326815, 17474, -51564]
17256A83859D5480L86228D2520J86814F9634O1333K25184j02666j07228J99321
17246C45578q7455p6429b1238j29723B2465J39723c9975B27536J59145A08858
17235A4648E537J47465J9404h711A66889J85586A64282J1294P1659G6986b6816
17223A34479L09014A6710a19474J3014B26553I8531Q3292M8175L4208b6713B55117
17211E8479J20371J12552K88540o655j13406k12489a9635A94430f3285p5248B71348
17199d57487D04816A23969D2264J76901a47505B6022K01407m890Q2663d9497H6797
17187i4276B74098j24721L30932m1562E4778K25691c3327C53645j14929d153o8819
17176g2972E56680A00984a70996B43865O364J08710o2447m0485m3264J42212A60455
$$ y = [183859, 45480, 431708, 42520, 229334, 69634, 130967, 356151, 253485, 146257, 345578, 258123, 181694, -21238, -150961, 22465, 162188, -39975, 227536, 386681, 108858, 14648, 5537, 153002, 172406, -8711, 166889, 352475, 164282, 175576, 247235, 76986, -26816, 134479, 443493, 16710, -119474, -106460, 226553, 98531, 181823, 229998, 264206, -26713, 255117, 58479, 178850, 291402, 579942, 573287, 459881, 247392, -19635, 194430, -63285, -138533, 271348, -457487, 404816, 123969, 42264, 219165, -147505, 26022, 227429, 222539, 305202, -49497, 86797, -94276, 274098, 149377, 480309, 438747, 54778, 280469, -33327, 353645, 238716, -4153, -72972, 556680, 100984, -170996, 243865, 250229, 358939, 296492, 256007, 212743, 354955, 160455]
17164A38589D7704J45364O4342a58600C21577n2154P7109A9918M04127j32522
17154B91523N0691A22554K56761G5508K97569J91959O6845B76859J73533A73444
17143B83436n4579n2095L64903F3431K29555J04821J16521p8685p6800l6432H9638
17131A97974M45978B89859K70505B63785H6248Q253L19335A52421J44601J75021
17121D72043A52758O38537B45594L93699A31376k810K04916o2596Q1306j42951
17111B09241K10123j00085r9105B4147P74440l58140b2962D03275j69462J41120
17101C74933j33129N7551L02055k98294J20373A64556K2544J18954L14258A13482
17090C7792J04518M05412J18700A30327K69988K72602C21065g98D06280m6635
$$ y = [138589, 47704, 193068, 257410, -158600, 321577, 269423, 346532, 19918, 424045, 291523, 342214, 122554, 379315, 75508, 373077, 565036, 631881, 276859, 450392, 173444, 283436, 228857, 176762, 541665, 63431, 292986, 397807, 514328, 435643, 358843, 322411, 89638, 197974, 643952, 289859, 560364, 263785, 86248, 94501, 413836, 152421, 297022, 472043, 152758, 791295, 245594, 639293, 131376, 128566, 333482, 270886, 352192, 209241, 419364, 319279, 220174, 24147, 798587, 440447, -22962, 403275, 233813, 374933, 241804, 299355, 601410, 303116, 423489, 164556, 187100, 306054, 620312, 113482, 37792, 142310, 547722, 666422, 130327, 400315, 672917, 321065, -798, 406280, 359645]
17080C59645L15102j01749j72812R5017m2405J83397j78930j78940L30068A44105
17069H7390K33206J41412K24499n7948B17495j01351M26752j34948J14172j27188
17059C94932K19273B59878L65080A97670L94424Q7349j24953J36495k46986K13345
17049F57344R0110j12067J7468m0454j23682A16591J80959L20051M9445k64063
17039D02983K96325p5771k12730R6316o2720B08977Q9152L19248k22324j29000
17029B66053P2153P7254J27901K09525C27124J47381J30606J49776k80031J51231
17019F26087k18653J35857K0218j06067J67230L44341l15946p6131K22955l41273
17009D58618k2734N06952l24564L9125L2645K2436J15709J5226l51883K22530
$$ y = [359645, 674747, 572998, 400186, 495203, 452798, 636195, 457265, 278325, 608393, 144105, 87390, 320596, 462008, 686507, 628559, 217495, 116144, 542896, 407948, 522120, 394932, 614205, 259878, 624958, 197670, 592094, 679443, 554490, 690985, 443999, 657344, 747454, 635387, 652855, 612401, 488719, 116591, 297550, 617601, 667046, 402983, 699308, 623537, 410807, 507123, 444403, 208977, 298129, 617377, 395053, 266053, 338206, 415460, 543361, 752886, 327124, 474505, 605111, 754887, 474856, 626087, 407434, 543291, 563509, 457442, 624672, 969013, 653067, 576936, 799891, 458618, 435884, 942836, 618272, 657397, 690042, 712478, 828187, 843413, 491530, 714060]
16999G14060J37260K4141l51233p783Q1138N1356J23629J18311p6997R7268l90992
16988E20158J94045J38884k71068r6560O11926m78269j08833M79275l72194J15473
16978G32837L17795l30413k5675J74573r9241k427K78997j96599r3521M3942Q1116
16967H81384J6609l33845M36985N4510j51544K79642k22827J68220J59234r5092
16957A193276m22774K44346o1460J1113K23296j01367j93479n4340J31066j33782
16947H35895M02726k63657l6085k62587P63302l52876j93854J75287J66140O0029
16937A294320j85037J51604J40090p6671K02953n63346K97074K80272j67023m38868
16927I35368N67871j47230Q7813J7448j09261P3919r2049j1698O5094J87816k90457
$$ y = [714060, 851320, 875461, 524228, 516445, 597583, 648939, 772568, 890879, 813882, 911150, 520158, 714203, 853087, 582019, 485459, 1097385, 619116, 510283, 989558, 617364, 732837, 1050632, 720219, 694544, 869117, 769876, 767449, 1046446, 849847, 756326, 800268, 881384, 897993, 564148, 1001133, 1055643, 904099, 1183741, 960914, 1129134, 1288368, 1193276, 770502, 1014848, 953388, 964501, 1187797, 1086430, 892951, 838611, 969677, 835895, 1238621, 974964, 938879, 676292, 1439594, 1086718, 892864, 1068151, 1234291, 1294320, 1109283, 1260887, 1400977, 1324306, 1527259, 963913, 1260987, 1541259, 1374236, 935368, 1503239, 1356009, 1443822, 1461270, 1352009, 1425928, 1333879, 1322181, 1387275, 1575091, 1284634]
16916A284634j90134L90533J2406K85255Q3443l85966L0622q5605K1620L20143
16906A766951j76372j01139K90773O9230j41973J252j19140l8072k6090J07952
16896A633372L85375n22057L59559l2034Q2518j24924J09890j03546L66814j37282
16886B017685K88402j29262l34633M52979k08033j03397J18944J08418J79255
16877B390358m09810J87576K30144j06333J77079k16630Q1265J69976J85949m42288
16867B247286L86497k91391O68637l04919j21127J83159L6009l76842M54154J48239
16857C029702O6502P2820R4668P1365o0204l3601K48606Q8805J7131p3176J8014
16846C540632J40685J79718J46842k18703J34865j21476L4289n6763p4645L19652
$$ y = [1284634, 1094500, 1485033, 1497439, 1782694, 1866137, 1480171, 1510793, 1425188, 1446808, 1766951, 1590579, 1489440, 1780213, 1849443, 1707470, 1708722, 1589582, 1551510, 1525420, 1633372, 2018747, 1496690, 1856249, 1824215, 1906733, 1781809, 1891699, 1788153, 2154967, 2017685, 2306087, 2176825, 1842192, 2295171, 2087138, 1983741, 2102685, 2211103, 2390358, 1980548, 2168124, 2398268, 2291935, 2469014, 2252384, 2333649, 2503625, 2689574, 2247286, 2633783, 2342392, 3011029, 2706110, 2584983, 2768142, 2804151, 2427309, 2881463, 3029702, 3096204, 3169024, 3263692, 3335057, 3274853, 3241252, 3489858, 3578663, 3595794, 3522618, 3540632, 3681317, 3861035, 4007877, 3789174, 3924039, 3802563, 3836852, 3780089, 3705444, 4025096]
16836D025096J17677K78844k70058J19809L16150K20213q6461j67727M24031k94075
16826D683499L44823R7437J66112j48004K89574M6604J08914L30412j10777J44620
16816E953214K69546J55289P0222J38561K9218R4064L50322j04046M86165r9565
16806G342990K58991J3694L82799J00300K86327J59344M63478k36049J56861O89018
16796I617753K13938K06342K18022M01888K3040M61146M28948J13409M37115M76561
16786A2598162J05044K84897L62358P42060L04736K99344M94405Q24333M30724
16777A6446063M92974J99151Q38347M85879O17643O74734O71058J120454P80543
16768B2326846M32215J023797O97271R53876J240952O42974J851587Q54375J086766
$$ y = [4025096, 4142773, 4421617, 4151559, 4271368, 4587518, 4807731, 4721270, 4553543, 4977574, 4683499, 5028322, 5125759, 5291871, 5143867, 5433441, 5480045, 5588959, 5919371, 5808594, 5953214, 6222760, 6378049, 6448271, 6586832, 6616050, 6710114, 7060436, 6956390, 7442555, 7342990, 7601981, 7615675, 7998474, 8098774, 8385101, 8544445, 9007923, 8771874, 8928735, 9617753, 9831691, 10038033, 10256055, 10657943, 10680983, 11142129, 11571077, 11684486, 12121601, 12598162, 12703206, 12988103, 13350461, 14092521, 14397257, 14696601, 15191006, 16015339, 16446063, 16939037, 17138188, 17976535, 18462414, 19080057, 19754791, 20425849, 21546303, 22326846, 22759061, 23782858, 24480129, 25434005, 26674957, 27317931, 29169518, 30023893, 31110659]
16759C1110659J478239J769721J038781J378949J887664J538655K186850J922821
16751D4312339K428689K297244K592403K342526K404066L225185L386776L326673
16743F6315901L720866L596964M033014M297611M348852N209204N224881N140241
16735A01887534N827677N479662O675025O049715O420215O569437O201424O756966
16727A51867655N875136N762231N416826M580771L751091L162709J971571J136248
16719A83524238k94877j264633k309301l153308m051431m856850n469119n736079
16711A56388640o422681o260598o829822o459995o832211o086240o101195n931205
16703A05464693n787263n468061n328076m740636m418216m565666l969423l622157
$$ y = [31110659, 32588898, 34358619, 35397400, 36776349, 38664013, 40202668, 42389518, 44312339, 46741028, 49038272, 51630675, 53973201, 56377267, 59602452, 62989228, 66315901, 70036767, 73633731, 77666745, 81964356, 86313208, 91522412, 96747293, 101887534, 107715211, 113194873, 119869898, 125919613, 132339828, 138909265, 145110689, 151867655, 157742791, 163505022, 168921848, 173502619, 177253710, 180416419, 182387990, 183524238, 183229361, 181964728, 179655427, 176502119, 172450688, 167593838, 162124719, 156388640, 149965959, 143705361, 136875539, 130415544, 123583333, 117497093, 111395898, 105464693, 99677430, 94209369, 88881293, 84140657, 79722441, 75156775, 71187352, 67565195]
16695F7565195l606824l172763l100654k893184l024110k416618k006338k233255
16687D5111449k148538k149483j841068j774040j187238j799845j499362j298866
16679C1413009j648416j008098q99996j189482j265254r37106p65904q92989n28376
16670B2277388j149178o22962o07541q52975o02546n31317o04767m92081o73694
16661A6140327m39965n20317o42599p04653l1038n43004m23610j4070q20677k36519
16651A1763875l56085r7262l83791N8037l94200l52726j25129n20489l15374J67998
16641I444854n18679l60354k8880k79459o7330q6791l88027N4677j77724n97371
16631F994916K25556P8965m06880m3143m62560l10155k75388L01675K18526m86079
$$ y = [67565195, 63958371, 60785608, 57684954, 54791770, 51767660, 49351042, 47344704, 45111449, 42962911, 40813428, 38972360, 37198320, 36011082, 34211237, 32711875, 31413009, 29764593, 28756495, 27856499, 26667017, 25401763, 24464657, 23698753, 22805764, 22277388, 21128210, 20505248, 19897707, 19044732, 18442186, 17910869, 17306102, 16814021, 16140327, 15700362, 15180045, 14537446, 13832793, 13801755, 13258751, 12835141, 12821071, 12000394, 11763875, 11407790, 11310528, 10926737, 10984774, 10590574, 10237848, 10112719, 9592230, 9276856, 9444854, 8926175, 8565821, 8536941, 8257482, 8190152, 8103361, 7715334, 7770011, 7592287, 6994916, 7220472, 7299437, 6892557, 6849414, 6386854, 6076699, 5801311, 6102986, 6321512, 5835433]
16621E835433K44709n82970o8003K83426m45001o0517j29565n03816J18847J43069
16611D835612j2169J7386j60101j93836k45205q8603K27844p0310l93063j4579
16601C902976n9593Q0236L9901l83910j06925L38238k97519k7718j30497j99139
16591C156050J48158k605j21033K17671j63076k14865K36365j21407j27081l07338
16581B700839j59839O10271m67943j4173O8732M726P6261n90194O59268l82467
16571B505481n6886m6724L29612l17796J56106k56129j60499k51398K3584J11284
16561B036635Q3408k32210K04034j08312N18476m85166k10598O1955L62035m83075
16551A747182K63517r0233p2873J13303k74437J29973Q8693j45011K6068j56157
$$ y = [5835433, 6080142, 5497172, 5429169, 5712595, 5267594, 5207077, 5077512, 4573696, 4692543, 4835612, 4823443, 4840829, 4680728, 4486892, 4241687, 4153084, 4380928, 4310618, 3917555, 3902976, 3843383, 3923619, 3963520, 3579610, 3472685, 3810923, 3513404, 3485686, 3355189, 3156050, 3304208, 3301603, 3180570, 3398241, 3235165, 3020300, 3256665, 3135258, 3008177, 2700839, 2541000, 3151271, 2683328, 2669155, 2737887, 2742613, 2818874, 2228680, 2887948, 2505481, 2448595, 2401871, 2731483, 2413687, 2569793, 2313664, 2153165, 1901767, 1925351, 2036635, 2120043, 1887833, 2091867, 1983555, 2502031, 2016865, 1806267, 1868222, 2230257, 1747182, 2010699, 1920466, 1847593, 1960896, 1686459, 1816432, 1905125, 1760114, 1786182, 1630025]
16541A630025K99995l79076N26363l06467J22792k99850J61232l80033J39266
16532A514247k7187J7307p2339J36859j79253N4235j82579J35120p1349K37700
16522A562761j12410k63494J34656J65127P0317p7135q8733j09299K18516m5816
16512A454490K1491j6718K02721k50538k25770K46038k97270J07204R2841K49822
16502A584311n00528J21306k42387K94960r6547j42226J41719k5212J53690j75455
16492A113631k41147N06316k63241j06839Q5046K11797L5754l90689K1646P7279
16482A049553L30094m52318K07462r5944K08066m51776L41505j0855k40559L03555
16472A188783l41926o3206K45933j72930j30669K33371k40592J64203K36057Q3631
$$ y = [1630025, 1930020, 1550944, 2077307, 1770840, 1893632, 1593782, 1755014, 1374981, 1514247, 1487060, 1504367, 1432028, 1568887, 1389634, 1443869, 1261290, 1396410, 1325061, 1562761, 1450351, 1186857, 1321513, 1486640, 1556957, 1479822, 1391089, 1281790, 1500306, 1454490, 1475981, 1459263, 1661984, 1411446, 1185676, 1431714, 1134444, 1241648, 1334489, 1584311, 1083783, 1205089, 962702, 1257662, 1161115, 1018889, 1160608, 1135396, 1289086, 1113631, 872484, 1378800, 1115559, 1008720, 1093766, 1305563, 1341317, 950628, 972274, 1049553, 1379647, 927329, 1134791, 1038847, 1246913, 795137, 1136642, 1125787, 885228, 1188783, 846857, 783651, 1029584, 856654, 725985, 959356, 718764, 882967, 1119024, 1202655]
16462A202655n10110K83372j09111o3535k0823N5290M9392q9982j82132L71966
16452I86982J09600E12309M09427J1235k44888J94074j91629O1744j9035n7443
16442F75794J40394j97480K94533k7067k61712M3068L61308m25334J99404k70625
16432E32283J66428L9860k22528J74547R6539j21621R1986j28054R4355K16787
16422I40582l95770L04645M1229k5946j62465m1151N4839l3243J9688A76741O11137
16411G87878m1724C40052N74958l39458k51584L55776P6948O044n5939j81230
16401E25567j90976L70961N6565j04819K01738C37260L13981o5232j90591K73534
16391F68952Q6323p7405j41725K24667k32998j28359j3946L2013J39924l8548
$$ y = [1202655, 692545, 975917, 866806, 803271, 782448, 837738, 887130, 797148, 615016, 986982, 1096582, 512309, 921736, 932971, 688083, 882157, 690528, 752272, 733237, 675794, 816188, 618708, 913241, 886174, 624462, 667530, 1028838, 603504, 802908, 532283, 698711, 738571, 516043, 690590, 787129, 665508, 757494, 629440, 723795, 940582, 544812, 849457, 890686, 864740, 702275, 661124, 715963, 682720, 702408, 176741, 787878, 746154, 340052, 915010, 575552, 323968, 679744, 756692, 762736, 706797, 525567, 334591, 705552, 762117, 657298, 859036, 337260, 651241, 586009, 395418, 668952, 755275, 677870, 536145, 760812, 527814, 399455, 385509, 417522, 557446, 518898]
16381E18898J72342M4307k58201j26021L39224B75812L59136B57070K90020l2066
16371E15024k2904K4513j78165M52202j66181k12756j69025M00016J11662n7678
16361F96708K9603m4324J21335C99587O7942R2545K96850m13865J7901Q9209j06874
16350D43295J34596A58506K52439J50499k58323j34498L96418J27747q2277L7966
16340F48477n7822j55684j10043K25666k36718L40668B76749K27678K55101m7651
16330G11877K1317A83316J39472N4404k1813A48300K88950J41490J22331j69989
16320E31082j49853j61481J27965k5181k9994K29122I3336K66164P9401o6970
16310C71931K32313j86967l5621o0944L56697n6807j53221J34357k49616J59800
$$ y = [518898, 691240, 735547, 477346, 351325, 690549, 275812, 634948, 257070, 547090, 515024, 492120, 516633, 338468, 790670, 624489, 411733, 242708, 642724, 754386, 696708, 726311, 681987, 803322, 399587, 467529, 560074, 856924, 443059, 460960, 550169, 443295, 577891, 158506, 410945, 561444, 303121, 168623, 565041, 692788, 610511, 648477, 590655, 434971, 324928, 550594, 313876, 654544, 276749, 504427, 759528, 711877, 733194, 183316, 322788, 377192, 355379, 148300, 437250, 578740, 701071, 531082, 381229, 219748, 347713, 322532, 292538, 521660, 93336, 359500, 438901, 371931, 604244, 417277, 381656, 320712, 677409, 620602, 467381, 601738, 352122, 511922]
16300E11922j02581N237L9250o2813A75832M69342k98445J26471j04822m7902
16290C20476L04282E6156M60097j81077K65148B60430A2895O31543j34489k21620
16280B88329L16507j14351j48714L58142l41459p0364l2441K3289J64151j91878
16270B51211E5228K50241A36180J25628J19369Q6561A77298n0113L77550Q3243
16260E87978j35110K12464A58504J84203G1488L22413J61541j88207j72070L12034
16250E07199j12690K29851j60817Q535j91946K56888B64332A13760Q5335L42473
16240E41568B60701F1996L34355J77431A75805J26139k4849E4841L8786R7104
16230A90731J90107j27908o9746J81448D8004J84309L42010b2281C23230J77130
$$ y = [511922, 409341, 414578, 453828, 391015, 175832, 645174, 346729, 473200, 368378, 320476, 624758, 56156, 516253, 335176, 600324, 260430, 12895, 644438, 509949, 288329, 604836, 490485, 341771, 699913, 358454, 288090, 255649, 278938, 443089, 251211, 55228, 305469, 136180, 261808, 381177, 467738, 177298, 127185, 504735, 587978, 452868, 665332, 158504, 342707, 71488, 393901, 555442, 367235, 195165, 507199, 394509, 624360, 463543, 472078, 280132, 537020, 264332, 113760, 199095, 541568, 260701, 61996, 396351, 573782, 175805, 301944, 277095, 54841, 93627, 190731, 380838, 252930, 183184, 364632, 48004, 232313, 574323, -22281, 323230, 500360]
16220E00360j89240K22586f5678E44013k03827P031j7753c6186B03556K44727
16210D48283j02357k8293q8203k2795J67589j47538K9337r2608R3508K70821A00603
16198C65296r4188N5464J7035A42614J21846p1696J81987J50072A91658J10059
16188C01717Q8919l9904A58121K57034H6054K06162o702J79822B4886M49113k01844
16177B72155a09867B20755r1798n7334K62296a89381A3175K59597c917B35994
16166c1399A45794L6287a40827B58943I872f8849C29501H3882O1210R7782G6335
16154B27783D8768L0440P5573J32315a0678E6516M0691N2438m9527a65657A24330
16142a0501B96874H6973N1198d2916H5183c2441A33034K15795c696D33490A64745
$$ y = [500360, 311120, 533706, -65678, 544013, 340186, 347217, 329464, -36186, 203556, 448283, 345926, 317633, 229430, 206635, 374224, 226686, 256023, 163415, 256923, 527744, 100603, 365296, 271108, 326572, 343607, 142614, 264460, 192764, 374751, 524823, 191658, 301717, 390636, 350732, 158121, 415155, 86054, 292216, 285514, 465336, 24886, 473999, 272155, -109867, 220755, 128957, 71623, 333919, -189381, 13175, 272772, -3917, 235994, -31399, 145794, 182081, -140827, 258943, 9872, -68849, 329501, 83882, 145092, 242874, 76335, 227783, 48768, 79208, 154781, 287096, -10678, 56516, 97207, 149645, 100118, -165657, 124330, -10501, 296874, 86973, 138171, -42916, 85183, -32441, 133034, 348829, -3696, 433490, 164745]
16130C21540j58999C9500K22373o6672J7287J92345j90704a90306g9341B41734
16119d074A75776K13690A27789H297A003J06009J1713b32458c9332E6936M99469
16108E56405A88364O464P8096C6996J34937K0032r5139J73676p924g0243o3968
16097a34211G7526L59600A34780J53874d9311P965l3478A06409g6962A58302C8819
16085A51931J80784A1895a77304A14502f8254n9418C9085J67354E1327N8020M26126
16074E35473f3796A43159a39045k8479H9060P0258M5678k8394N9614c2587a3135
16062i5141A3489N9022d6703j0845C5317K70603C8546b39365A04434a3415A14025
16050e40080I0777d6168B00574D698J96265J71215a53219C2215J0367J28447a4165
$$ y = [321540, 162541, 39500, 261873, 195201, 212488, 404833, 214129, -190306, -79341, 241734, -4074, 175776, 389466, 127789, 8297, 1003, 107012, 118725, -232458, -39332, 56936, 556405, 188364, 194828, 272924, 36996, 171933, 191965, 96826, 270502, 262578, -70243, -134211, 77526, 437126, 134780, 288654, -49311, -41346, -74824, 106409, -76962, 158302, 38819, 151931, 332715, 11895, -177304, 114502, -68254, -127672, 39085, 206439, 51327, 109347, 535473, -63796, 143159, -139045, -167524, 89060, 159318, 204996, 176602, 236216, -32587, -13135, -95141, 13489, 72511, -46703, -57548, 35317, 305920, 38546, -239365, 104434, -13415, 114025, -540080, 90777, -46168, 200574, 4698, 200963, 372178, -153219, 32215, 42582, 171029, -14165]
16038g2918B68315q4945b1009o9558O528a6384r3094B99454A06774I749a53218
16026b42204P0953B05779c18278A9905O1329Q4793a51869B63503c03402A37360
16015a8727k8935j7651k06291D15994H7679d2081d224C01316H9253a15087G0774
16003A6448f7067p7552a7760A46648a19617J0173m886n2288P3481A1037J680N6262
15991F8979J36030k8558D8836L4941j218K34579B3320J6615K36849M7740J72097
15980D96621b810A35916a54392E6676M1521K1537g0696C1194L7831a76643D4803
15968c6102A42575J92197e1967n1019H4380a65547L2813A45411a74537l6343C3550
15956A51892b77983A6981a69207B62453j0935q0902a63442F0658a44856j92370
$$ y = [-72918, 268315, 183370, -21009, -90567, -84039, -16384, -109478, 299454, 106774, 9749, -153218, -242204, -171251, 205779, -318278, 19905, 81234, 166027, -151869, 263503, -303402, 137360, -18727, -47662, -65313, -271604, 415994, 87679, -42081, -4224, 301316, 89253, -115087, 70774, 16448, -67067, -144619, -17760, 146648, -119617, -109444, -114330, -166618, -93137, 11037, 12717, 68979, 205009, 176451, 48836, 83777, 82559, 317138, 23320, 39935, 276784, 324524, 496621, -2810, 135916, -154392, 56676, 98197, 119734, -70696, 31194, 69025, -176643, 44803, -36102, 142575, 334772, -51967, -102986, 84380, -165547, -132734, 145411, -174537, -210880, 33550, 151892, -277983, 16981, -169207, 262453, 251518, 170616, -163442, 60658, -144856, -337226]
15946c37226i5261I9983K61522h243F9122A8726M74100b86354a3502n1602k44334
15935c09438g2759H5765a61854k1334b3697k53155B95317a80104C51221d0059
15924c14531g8250A00798a75065d0654j880G1578J50884D6309b67417N3775R2851
15913a20791k344K8460E9824a44555f7253C92369J57d4466j05963g990A38274
15901g7476m6448k14318C0574a02281d6965n8813H408a88600o0512b4308C93557
15889a30852A49977R9416c21601B49376A18595b43915M7184R4284D1225P444b76365
15877a46931N9626j35519g0409A2279f16146b45995A51787a26839A05147a13070
15866h2444L4730B52303L0121E2030d12571i4929m4856N7055o871J5929A72376
$$ y = [-337226, -95261, 99983, 361505, -8243, 69122, 18726, 492826, -286354, -13502, -65104, -309438, -72759, 85765, -161854, -183188, -23697, -276852, 295317, -180104, 351221, -40059, -314531, -78250, 100798, -175065, -40654, -42534, 71578, 222462, 46309, -267417, -213642, -120791, -123135, -94675, 59824, -144555, -67253, 392369, 392526, -44466, -150429, -7990, 138274, -77476, -123924, -338242, 30574, -102281, -46965, -105778, 8408, -188600, -249112, -24308, 393557, -130852, 149977, 249393, -321601, 249376, 118595, -243915, -196731, -102447, 41225, 48669, -276365, -146931, -87305, -222824, -70409, 12279, -616146, -245995, 151787, -126839, 105147, -113070, -82444, -47714, 252303, 282424, 52030, -412571, -94929, -139785, -82730, -89601, -73672, 172376]
15854F584K20834a96459A67813C6356N8159a54433e5292j05358l18135A30071
15843I1748L35303h8405r8744A1297i4571D6860J92909F8833L33048a0623a853
15831A77720a45563A87504b63633D2568c58228M6762a13458C79785Q303i6595
15820C61771a83549j33832J37153j7389O0258o9924A77247D9692K5540R7471N3654
15809B26357a42693r8774B1507a11513a560C9123a47312M407r1913j19396n5170
15798d09384g5991C49000F2845a32444J0753c9065l7740o3820p1504A9334a20607
15786g0354D9441J73342f5755r0919M9110l8839C3160b13533B23050q4482b02184
15774a68151C87182D0541O7627b33225A99547j3195G3205e0262k6061D7158b0606
$$ y = [6584, 227418, -196459, 167813, 36356, 94515, -154433, -55292, -160650, -478785, 130071, 91748, 427051, -88405, -187149, 11297, -94571, 46860, 239769, 68833, 401881, -10623, -1853, 177720, -145563, 187504, -263633, 42568, -358228, -311466, -113458, 379785, 388088, -96595, 361771, -183549, -317381, -180228, -197617, -137359, -207283, 177247, 49692, 75232, 172703, 226357, -142693, -241467, 21507, -111513, -1560, 39123, -147312, -142905, -234818, -354214, -409384, -75991, 349000, 62845, -132444, -121691, -39065, -76805, -140625, -212129, 19334, -120607, -70354, 49441, 222783, -65755, -156674, -107564, -146403, 33160, -213533, 223050, 138568, -202184, -168151, 387182, 40541, 108168, -233225, 199547, 186352, 73205, -50262, -76323, 47158, -20606]
15762b0806k56916C899b16076i4296G8139b11173a2409j42490A02570J77332D4648
15750A61726c00640B4132J32341n6847h0421j88126B70735d8253l44968a64983
15739G1428g8706E5445R1926E6314b05306A27864k0428b88050g9884k60378a64495
15727D00175a12898F0198J77790d7219E5001J49980b5045j73229B56058f4936
15716b4222o1681n064A22535f4915b2141A34346b86455D7361i6763j3708j95364
15705c05835a52716j3763j34425e3304j06316A06349C8706a29736j7289N948B05764
15693B8412J66467c10381a46009I6480b195l8815B50013b59657q0123J22386i9068
15681a04512j98752B0749b51970C41K05564P2019A38438E9997b59016F1048L7935
$$ y = [-20806, -277722, 3899, -216076, -94296, 78139, -211173, -12409, -154899, 102570, 279902, 44648, 161726, -300640, 24132, 156473, 99626, -80421, -268547, 270735, -48253, -393221, -164983, 71428, -78706, 55445, 147371, 56314, -205306, 127864, 107436, -288050, -79884, -340262, -164495, 400175, -112898, 60198, 237988, -47219, 55001, 204981, -25045, -198274, 256058, -64936, -24222, -85903, -90967, 122535, -64915, -22141, 134346, -286455, 47361, -96763, -110471, -305835, -152716, -166479, -300904, -53304, -159620, 106349, 38706, -129736, -147025, -141077, 205764, 28412, 194879, -310381, -146009, 96480, -2195, -41010, 250013, -259657, -339780, -217394, -99068, -104512, -303264, 20749, -251970, 341, 205905, 277924, 138438, 59997, -259016, 61048, 98983]
15670I8983m1481a65694e1075A08557c33247a32712N6134B63520B1444a31072
15659a04231A01138C3311m673j0783a4516r8357b2406j71778j2775m0917J22928
15648a24948a7236A87855b47844B1390K61366m5270a17677D2822a17882A30828
15637a23562B924b30181a6413j13319A18332k7253P0845e27843J71107c592A02427
15625c07991n6629h2012k60522a06215D5867r25a02034b8897E2251D505J45040
15614A49545a27810k9142A14852J60467b32849i041j90715L6214B46442c3528
15603B02601R5071A32432N8128B8279Q5294A8520g5295k5772l745j966m9810A86137
15590a4176k07720i6823B58573g9788F010J03556A4650L10053a31625A84812p1320
$$ y = [98983, 57502, -165694, -51075, 108557, -333247, -132712, -76578, 263520, 21444, -131072, -104231, 101138, 33311, 28638, 17855, -14516, -112873, -22406, -194184, -206959, -247876, -124948, -17236, 187855, -247844, 21390, 282756, 237486, -117677, 42822, -117882, 130828, -123562, 2924, -230181, -16413, -129732, 118332, 91079, 161924, -527843, -356736, -3592, 102427, -307991, -364620, -82012, -342534, -106215, 45867, 44942, -102034, -28897, 52251, 4505, 149545, -127810, -156952, 114852, 275319, -232849, -9041, -199756, -163542, 246442, -33528, 202601, 297672, 132432, 190560, 28279, 113573, 18520, -75295, -101067, -104812, -106778, -156588, 186137, -14176, -221896, -96823, 258573, -79788, 6010, 109566, 14650, 324703, -131625, 184812, 113492]
15579A13492L07743I0163i2629G0826b6452A27590C2613b93491a09020L047D3397
15567i8753j01190H6362d76143C8567c23177d5777r6174I7739J72659b23j90611
15556a90834n4834i7699A35646i856k60166o2089C2344d6685k67178A65973J11517
15545B77490c5047n092G7862b73412M3848e5200I101L9801A8467b64385a17971
15533f9198A18836A5807J33068O0074K73118h2444A12782D9510J8602M7958a34761
15521a81584A3718N6796B1469g9596E0175o176C155c47471B51266D5855d8085
15509g9907E3295c378q1312C11611b34456D2376d36919A3207a92342A7030a72056
15497a62461n4445m0919J05682A95690D8339b49471C08781A42497n2278r021a85260
$$ y = [113492, 421235, 90163, -92629, 70826, -26452, 127590, 32613, -293491, -109020, -105973, 43397, -98753, -199943, 86362, -476143, 38567, -323177, -45777, -141951, 97739, 270398, -223, -190834, -245668, -97699, 135646, -9856, -270022, -332111, 32344, -46685, -313863, 165973, 277490, -35047, -40139, 77862, -273412, -229564, -55200, 9101, 48902, 18467, -264385, -117971, -69198, 118836, 15807, 148875, 208949, 482067, -82444, 112782, 49510, 68112, 116070, -134761, -181584, 13718, 70514, 21469, -79596, 50175, 43999, 3155, -347471, 251266, 45855, -48085, -79907, 53295, -3378, -84690, 311611, -234456, 42376, -436919, 13207, -192342, 17030, -172056, -162461, -216906, -257825, -152143, 195690, 48339, -249471, 308781, 142497, 90219, 81198, -185260]
15485a24586B21817I511R3386J4386a6992o0658b1520B62354f4114n9160B11542
15473a88274A62264a63732j90298A90773o2799Q610a04125E4456i852j65104M530
15462a70426D2937c8898A1439J45233a05421A16658q069R9010a31691B1523O2116
15451H3639c91501g8699B05862F2696a76770m8903e1027H5241L5067A342Q7472
15440H8814a4429B23667a98768A66731a59310L3803e757A46004c47227a29559
15429a1534j03386k71468A2168J60881d0431k71505a03510A19729D6032Q6752
15419A32784Q8229c47j08000D7406a49413A79021J72924b76979B9791K00650E9281
15407E5412n875b5623j88380a9265j08764C2759O5593k9536L0556f4113K1209
$$ y = [-124586, 221817, 9511, 102897, 117283, -16992, -77650, -21520, 262354, -64114, -123274, 211542, -188274, 162264, -163732, -354030, 190773, 127974, 136584, -104125, 54456, -9852, -174956, -170426, 42937, -38898, 11439, 156672, -105421, 116658, 108589, 207599, -131691, 21523, 83639, -391501, -78699, 205862, 62696, -176770, -225673, -51027, 85241, 120308, 1342, 88814, -14429, 223667, -198768, 166731, -159310, -125507, -5757, 146004, -347227, -129559, -11534, -114920, -386388, 12168, 173049, -40431, -311936, -103510, 119729, 46032, 132784, 221013, -347, -108347, 47406, -149413, 179021, 351945, -276979, 29791, 230441, 59281, 55412, 49537, -25623, -214003, -19265, -128029, 32759, 98352, 68816, 99372, -64113, -42904]
15396d2904I7876b5972k30986A14221k054a54076P1270n5183A27998A5023c0465
15384g179n5419p9482G2021J6923J09024b09144Q7347E2032A0715K10K84231D3343
15371B57050a49638C44982d9047B73828N1136C8359R1525Q631K65587a69042a1457
15359a20064e7046b3453A03761b13015O5167A21054a40031L1100B84200j15411
15349A68789p2743K60658J5626c46602Q7660J12625p3049A26427m4811J36880
15339B18496f1761B3141a57004C51173a24082l1027G1878b89917A21843J13266
15329B35109i0925C61376a31879A40716N6263E2511g056k06166g6213B2882i6491
15317A06001a18837C8362K10434a44884a3514A20480C8006R1435a40010B21175
$$ y = [-42904, 97876, -25972, -256958, 114221, 112167, -154076, -82806, -137989, 127998, 15023, -30465, -7179, -62598, -142080, 72021, 88944, 197968, -209144, -121797, 52032, 10715, 10925, 295156, 43343, 257050, -149638, 344982, -49047, 273828, 324964, 38359, 129884, 138515, 404102, -169042, -11457, -120064, -57046, -23453, 103761, -213015, -147848, 121054, -140031, -108931, 284200, 168789, 96046, 356704, 372330, -346602, -258942, -146317, -219366, 126427, 81616, 218496, -61761, 23141, -157004, 351173, -124082, -155109, 71878, -289917, 121843, 235109, -90925, 361376, -131879, 140716, 196979, 52511, -7056, -213222, -76213, 22882, -96491, 106001, -118837, 38362, 248796, -144884, -13514, 120480, 38006, 129441, -140010, 221175]
15306a79275G179Q9963D7911J68777i9577A24324j5315a1834q653B54325d45100
15294h1098o1777d3414A39745a1930C16613G1015g2739q0351D3038K4403b5470
15282b68231b3038H8703J05605I1075b01561l7647F2038K19589b20163A98668
15271B89498J7960r1670E9675P175d1007A05954d4331B86314n5851j4799m270
15260B11394D0691J02076f0101A40663J78610j30691K3115Q5392a2877C56644
15249A86254n4632J07200A013J32766j7605L04090A06893c14268D4567M1993Q8996
15238A75556b22918B62689j21878a3344A59796d3292A48322H912L96214A65671
15227A35341b65761f9902l21404C9967d7229r6173O4080B74348a68340B7313R6241
$$ y = [-179275, 7179, 97142, 47911, 216688, -99577, 124324, 109009, -11834, -20487, 254325, -445100, -81098, -142875, -43414, 139745, -11930, 316613, 71015, -72739, -153090, 43038, 67441, -25470, -268231, -23038, 88703, 194308, 91075, -201561, -239208, 62038, 281627, -220163, 198668, 289498, 307458, 215788, 59675, 66850, -41007, 105954, -44331, 286314, 230463, 215664, 211394, 40691, 142767, -60101, 140663, 319273, 188582, 211697, 297089, -12877, 356644, 186254, 131622, 238822, 1013, 133779, 116174, 420264, 106893, -314268, 44567, 86560, 175556, -222918, 262689, 140811, -13344, 159796, -43292, 148322, 8912, 405126, 165671, 135341, -265761, -69902, -391306, 39967, -47229, -143402, -79322, 274348, -168340, 27313, 123554]
15216A23554a99291A29970J35110p8369E3294O2227J7591m9156N1745E2878N1410
15205A04288k4170a8622l17065f1953E9135a50970A97369E522a25782I4246A2023
15193D02383a31512F5871K13362A02799K5346a42205B74990c3942G1886P4511
15183A46397d31933a53750I5656a48986B1093g836B77080a82933C7277K59898
15173B97175f9859A63016b04479a4000I024N3386i3865C93101E6052O4050h0558
15161e4621A2420L41818A7994K41518F077a35634b2011B31353G0890J44679p4435
15150A41134L61297F4239B2304J0621J15657K26473I0909J05955B6718J65669
15140A92387f8666A79627j9119K6903D8772b63135b459C5342K74351j34978A2821
$$ y = [123554, -199291, 129970, 265080, 186711, 53294, 115521, 133112, 83956, 135701, 52878, 104288, 80118, -18622, -335687, -61953, 59135, -150970, 197369, 5522, -125782, 94246, 12023, 402383, -131512, 65871, 279233, 102799, 128145, -142205, 274990, -33942, 71886, 146397, -431933, -153750, 95656, -148986, 21093, -7836, 277080, -182933, 37277, 297175, -69859, 163016, -204479, -14000, 9024, 62410, -93865, 393101, 56052, 120102, -80558, -54621, 12420, 354238, 17994, 259512, 6077, -135634, -22011, 231353, 70890, 215569, 141134, 502431, 64239, 22304, 32925, 148582, 375055, 90909, 196864, 26718, 192387, -68666, 179627, 160508, 187411, 48772, -263135, -2459, 35342, 309693, 174715, 12821]
15128A04308O2086A7220M56049j66978G8525K48510N6825A40607j4531f8719j18474
15117a87193f4429B36726a60712D6798A1599J95807M0940J35570A87569g0841
15106A50589K9249K08312p8218A36079J6434G3109j5358a01785D2074J63432k063
15095B03443b05859B81284m8896R5350b9846C14616D0666J79584R3933j56387
15085A57796n3294p57k9781a07811C11415K6322A025J62344a48732C4682J72731
15074B07413c0081H8580A3117h0969A61442M7229d0533A81182H4442J19335f5961
15062A41892P8345K36773I1455e504F8615J97254M3264m2799p6474M7447j12916
15051A24391P3523P4956J75214a73978F7221R0495a49930j16886f5786c980A54967
$$ y = [104308, 166394, 17220, 473269, 306291, 78525, 327035, 383860, 140607, 126076, -68719, -187193, -64429, 236726, -160712, 46798, 11599, 207406, 248346, 383916, 187569, -70841, 150589, 179838, 388150, 309932, 136079, 152513, 73109, 57751, -101785, 42074, 205506, 203443, -205859, 281284, 232388, 327738, -29846, 314616, 40666, 220250, 314183, 157796, 104502, 103745, 73964, -107811, 311415, 337737, 1025, 163369, -148732, 34682, 207413, -30081, 88580, 13117, -80969, 161442, 208671, -40533, 181182, 84442, 203777, -65961, 141892, 220237, 457010, 91455, -5504, 68615, 265869, 309133, 266334, 189860, 237307, 124391, 197914, 272870, 448084, -173978, 67221, 157716, -149930, -266816, -65786, -3980, 154967]
15039C19867K6907A02578k1619R4367K48339j14635A20792J48306j30949b73325
15028C64029H4466g8942D7677K58836B6733J95146A07054a95859A89307m9978
15018A39329b47089C02732O7143A49651J31386c0976D30495j16628C1516K61382
15008B92898A04167K07493j54061C4316a36269D28941I2597R1996J42109A26920
14997F20447A25230j9437K44920A33232e5281B13772F4229M19031d9382C66731
14986A47273D6568J72031L01274A26539J21309r7551q162J2113J37089M6158K1970
14975C59465j0541k0436j18980K55370B832g1427C76223m6467P6899A90593p4330
14964A16263L29137a5193B62249A6393L17474j29485J82957j1452j69225J38376
$$ y = [319867, 346774, 102578, 80959, 175326, 423665, 309030, 120792, 269098, 138149, -273325, 364029, 84466, -78942, 47677, 306513, 26733, 221879, 107054, -195859, 189307, 139329, -247089, 302732, 369875, 149651, 281037, -30976, 430495, 313867, 31516, 292898, 104167, 311660, 157599, 34316, -136269, 428941, 92597, 184593, 326702, 126920, 620447, 125230, 105793, 350713, 133232, -55281, 213772, 64229, 483260, -49382, 366731, 147273, 46568, 218599, 519873, 126539, 247848, 150297, 142135, 154248, 291337, 337495, 359465, 348924, 328488, 209508, 464878, 2832, -71427, 376223, 329756, 406655, 190593, 116263, 445400, -15193, 262249, 16393, 333867, 204382, 387339, 375887, 206662, 345038]
14954C45038O553A24256J09112o4437j3282J93517C9080M30323j84299K1145i7125
14942B12276l7525M1296K20827j68488L24159j45452b00364A76441K68969j04244
14932C41166r6097F2053K62265j7364J36744j85539J23111P4678B26313J42251
14922C68564p3334G6518L56972M5232L7934k28825J988A35891K85815j67367j16435
14911A37904J88875j2277j01515q4630K36556J05424A34697J54424J34800I2034
14900D37238j30439a20808E05522k05432j23027J82546n6202r8412P6341J2857
14890B94193q8831n2921m0542K33293J05240j61007L18630C00058J46040A37156
14879E25059j93335K25333q5129n0347a132B38694L59544k55182o8158A08386
$$ y = [345038, 351591, 124256, 233368, 168931, 155649, 349166, 39080, 469403, 285104, 306249, -97125, 212276, 174751, 216047, 436874, 268386, 592545, 447093, -200364, 176441, 445410, 341166, 245069, 62053, 324318, 306954, 443698, 258159, 381270, 455948, 226313, 368564, 295230, 76518, 433490, 478722, 516656, 287831, 289819, 135891, 421706, 254339, 137904, 326779, 314502, 212987, 128357, 364913, 470337, 134697, 289121, 423921, 92034, 437238, 306799, -120808, 505522, 300090, 177063, 359609, 303407, 204995, 281336, 294193, 205362, 152441, 111899, 345192, 450432, 289425, 608055, 300058, 446098, 137156, 525059, 331724, 557057, 471928, 421581, -1132, 238694, 598238, 343056, 274898, 108386]
14868E96346k41869k6001k5085j31262J54105q4120N15021k74607L09708B86402
14857D10247j49604J54048A19944J27560K09529J04758K1739k57313c8110C47737
14846B87420M30530C50830j50538J9179P9967J04513m0407j01099r5385K30413
14836C97473O9118j22320P29o0599r4086M68041j9362C03308J42471q4259A71046
14824D30938J63034B40860m1505D6997N06187J94581j6548j97184p0192Q678J57180
14813F29699k03211P0550P2355j50146k6203M59910A32047O53513A82986L75287
14803E58273J9069l0043B11393J58366M58026j58432R9496l01023j88233N82916
14793H62509C12342L57238J21259C63958J35560J1789E2193M98267J47772l11298
$$ y = [596346, 354477, 328476, 303391, 172129, 326234, 242114, 757135, 482528, 792236, 286402, 410247, 260643, 414691, 119944, 247504, 457033, 561791, 583530, 326217, -38110, 347737, 287420, 717950, 350830, 200292, 219471, 299438, 403951, 363544, 262445, 167060, 397473, 466591, 344271, 345000, 284401, 190315, 658356, 638994, 303308, 445779, 361520, 171046, 430938, 593972, 240860, 199355, 46997, 553184, 747765, 731217, 534033, 463841, 472519, 629699, 426488, 497038, 569393, 419247, 393044, 852954, 132047, 785560, 182986, 558273, 577342, 547299, 211393, 369759, 827785, 669353, 768849, 467826, 279593, 862509, 312342, 669580, 790839, 363958, 499518, 511307, 52193, 550460, 698232, 386934]
14783C86934l9947R2111q0069R9392K37056J17831j81085k36033N36792m42112
14773D90870O6770r2002K64488l35286K85156k91142L11798j80731Q7779J3515
14763F21215J79940l8335J2628j653k49318J9072N0537l2927R3746q2952K45708
14752H17661k38637L7788K82802C59026M92182j33822j80267K96526k00826A96285
14741G36272J82272C63695K22952M42881k14240p1763j77939p5031K77526Q9619
14731H57700J8847K72033E37442K98287J74222n01442N55803k97974k56703N8278
14721E67913N16720l79826N7730K77600k37215N4960K59894l99235L74057k48893
14711H43705j42329M51040m51889j92895J94098M34516j15383k01135k3155Q998
$$ y = [386934, 346987, 439098, 359029, 458421, 695477, 813308, 632223, 396190, 932982, 490870, 557640, 465638, 730126, 394840, 679996, 388854, 700652, 519921, 607700, 621215, 801155, 762820, 775448, 773795, 524477, 543549, 594086, 561159, 654905, 571953, 817661, 579024, 616812, 899614, 359026, 851208, 717386, 537119, 833645, 632819, 196285, 736272, 918544, 363695, 586647, 1029528, 815288, 743525, 565586, 490555, 768081, 857700, 876547, 1148580, 537442, 835729, 1009951, 508509, 1064312, 766338, 509635, 567913, 1084633, 704807, 762537, 1040137, 802922, 857882, 1117776, 718541, 1092598, 843705, 701376, 1152416, 700527, 507632, 701730, 1136246, 1020863, 819728, 796573, 805571]
14701H05571J5181K52454k13943l22493N75812j20296r6505M10654m19262j48170
14691G39003m1212j23893M62440k95950L00676k03365N6567L05488j83163K756
14681A019347m5195j90854K52623p5203K05014r8551k65315L28512k7833n9194
14671A043351j10992J96491l4821k21025J17789J88206j1075j92061j33233L70251
14661A212881j9718k00088K72194l5744J30910r2664l65967L80071j63930J66837
14651A284782j58813J86099k63993J48386n4220J1263K43270j15053M0997J22342
14641A445060j48388R2431J39176m46950L6802l2840m0593L4378J58942J9086
14631A257104n6865O7700K54105r5057J16436J29111m68103K93166j84093Q1632
$$ y = [805571, 820752, 1073206, 859263, 536770, 1112582, 992286, 895781, 1306435, 887173, 739003, 697791, 573898, 1036338, 740388, 1041064, 837699, 894266, 1199754, 1016591, 1019347, 974152, 783298, 1035921, 960718, 1165732, 1067181, 801866, 1130378, 1102545, 1043351, 932359, 1128850, 1094029, 873004, 990793, 1178999, 1167924, 975863, 842630, 1212881, 1193163, 993075, 1265269, 1229525, 1360435, 1267771, 901804, 1281875, 1117945, 1284782, 1125969, 1312068, 1048075, 1196461, 1142241, 1153504, 1396774, 1281721, 1322718, 1445060, 1296672, 1389103, 1528279, 1081329, 1118131, 1085291, 1044698, 1079076, 1238018, 1257104, 1200239, 1267939, 1522044, 1426987, 1543423, 1672534, 1204431, 1497597, 1313504, 1395136]
14621A395136k07541J70917K85214k40469K31636J65479k93787O0619j15216m592
14611A447396n7286J83898K25729J67240n84786K40275k72968L62120O6829N1571
14601A830018L0935j17531K36061j70981l80954J52892M5250J44643J99847n4421
14591A915759j68588N0954n5582Q521L60864k92550K75747j79241J78413J06188
14581B200485k09697K83732k38310K62981m49102O12293j07385L2900j64788j54385
14571B068724j75812M64454k28854L09687k61026K84527J82527j33040m5018l9032
14561B427137O84580J25129j50767k13593J06590R6169L26210N56292k03749P20668
14551D474666N23275J452976J605694K979814P440334J2782056P524923j5393469
$$ y = [1395136, 1187595, 1358512, 1643726, 1403257, 1634893, 1800372, 1506585, 1567204, 1451988, 1447396, 1390110, 1574008, 1799737, 1966977, 1382191, 1622466, 1349498, 1711618, 1778447, 1830018, 1860953, 1743422, 1979483, 1808502, 1427548, 1580440, 1625690, 1770333, 1970180, 1915759, 1747171, 1798125, 1742543, 1751064, 2111928, 1819378, 2095125, 1915884, 2094297, 2200485, 1990788, 2274520, 2036210, 2299191, 1850089, 2462382, 2354997, 2387897, 2223109, 2068724, 1892912, 2357366, 2128512, 2438199, 2177173, 2461700, 2644227, 2511187, 2466169, 2427137, 3111717, 3236846, 3086079, 2872486, 2979076, 3075245, 3401455, 3957747, 3753998, 4474666, 4997941, 6450917, 8056611, 11036425, 18476759, 31258815, 38783738, 23390269]
14543B3390269A1676950n432544j967717j393791n9140n08865J11242r508q2359
14534B334268l36149J24823L06302j54078j12810J46651L34222k42251K44732
14525B645710k2350k07396k16698L27121J10395J0187k88154L55828M650j08062
14515B611231n4376K84662j30468k93808M92811J06008m14537L03175J57177N3813
14505C115688o03644J54917N26714r7263J50551k34844K03957J1866m7616L23342
14495C503668N9919n1037J13986p0099j67310O101K39962j1669J7878K53219K668
14484C897286j15758R1350J34135n451j83781J63145p7776J8661L48218m64422
14474C805607Q66217l34154m50573O26359R356j12041O1810N7163K76699J7009
$$ y = [23390269, 11676950, 6244406, 4276689, 2882898, 2823758, 2314893, 2426135, 2416627, 2334268, 1998119, 2122942, 2429244, 2275166, 2162356, 2309007, 2643229, 2400978, 2645710, 2623360, 2415964, 2199266, 2526387, 2636782, 2646969, 2358815, 2714643, 2719293, 2611231, 2556855, 2841517, 2711049, 2417241, 2910052, 3016060, 2601523, 2904698, 3061875, 3115688, 2512044, 2666961, 3193675, 3096412, 3246963, 3012119, 3216076, 3227942, 3180326, 3503668, 3563587, 3512550, 3626536, 3556437, 3389127, 3395228, 3635190, 3623521, 3641399, 3894618, 3897286, 3781528, 3872878, 4007013, 4001562, 3817781, 3980926, 3903150, 3921811, 4270029, 3805607, 4671824, 4337670, 3887097, 4513456, 4522812, 4410771, 4472581, 4529744, 4806443, 4823452]
14464D823452l15925J59816m3211M23354n81462J013964m65564m7270L25384j71707
14454E120831p3410L09694M9028K87878k66004K93064M2892K02268j43587n5097
14444E767557R0586L55144k19902J79473Q4793R6889N3725L15783j9350P1573
14434F776271R7979j51552L34261q0617J4223k54440O42927J24337p669q5949
14424G409771N00652R7276M0434m23748M49645L21629L03698j19432L47709j61912
14414H765722j7359M64305R3371j29601R3167J57173J94799K12924j73638P39848
14404A0400711m7193p0015K70222L94925J69510o2394K21437N67752k07751K17953
14394A1855157r0991J90555N89441L05788J77287K59082J6121l1006O86575P1994
$$ y = [4823452, 4507527, 4667343, 4624132, 5047486, 4466024, 5479988, 5014424, 4967154, 5292538, 5120831, 5047421, 5357115, 5406143, 5694021, 5428017, 5721081, 5763973, 5966241, 5822654, 5767557, 5858143, 6213287, 5993385, 6172858, 6257651, 6354540, 6408265, 6724048, 6704698, 6776271, 6874250, 6722698, 7056959, 6976342, 6990565, 6736125, 7379052, 7503389, 7495720, 7409771, 7910423, 8007699, 8048133, 7624385, 8074030, 8395659, 8699357, 8579925, 8927634, 8765722, 8748363, 9212668, 9306039, 9176438, 9269605, 9426778, 9621577, 9834501, 9660863, 10400711, 10353518, 10283503, 10553725, 10948650, 11118160, 11055766, 11277203, 11844955, 11637204, 11855157, 11764166, 11954721, 12544162, 12849950, 13027237, 13286319, 13302440, 13271434, 13958009, 14030003]
14384A4030003K07437K76748R5690K55639N42061K62576j03878O38902J05812
14375A6310990N48828N2353M69030M42822K3746O53205L84219J0543O19722J88290
14365A9703748N71811N70746M62426L23012M80589N67017M66713M15832L75808
14356B3937702O09478N03934O59256P51055J68772J314810L74123M27597Q22543
14347B9569270Q79463Q06018J078926O45542Q24836P38576R20628R24077J331074
14338C7718410Q32814J201041J307121O38136J415970J378881J114609J764407
14330D7371389J146508J592884J550300J899280J650982J373734K080165K077388
14322F0742630K154171K061303K487723K266865K363745K654493K932615K841290
$$ y = [14030003, 14237440, 14514188, 14609878, 14865517, 15407578, 15670154, 15566276, 16205178, 16310990, 16859818, 16912171, 17381201, 17824023, 17847769, 18500974, 18885193, 18895736, 19515458, 19703748, 20275559, 20846305, 21308731, 21631743, 22112332, 22679349, 23146062, 23561894, 23937702, 24547180, 25051114, 25710370, 26461425, 26630197, 27945007, 28319130, 28746727, 29569270, 30448733, 31254751, 32333677, 32979219, 33804055, 34542631, 35463259, 36387336, 37718410, 38551224, 39752265, 41059386, 41697522, 43113492, 44492373, 45606982, 47371389, 48517897, 50110781, 51661081, 53560361, 55211343, 56585077, 58665242, 60742630, 62896801, 64958104, 67445827, 69712692, 72076437, 74730930, 77663545, 80504835]
14314H0504835L277538L221703L131651L729938L707626M208886M183348M404545
14306A10370070M563400N375224N008301N717804N532428O208997O576291O840410
14298A56192925P234814P925894Q413753P997493R554811R656831R991536J0916393
14290B27884450J0610968J2052517J2332510J2956242J3162903J3547057J4227939
14283C16774586J4148835J4815475J4300948J4765200J4398691J3773368J3531595
14276D16508698J2248008J1005672J0007470P588044M352149Q72995M36938m80120
14268D62539854k488519l720742n081320p940540r669032j1547713j3141284j4257300
14260C94693404j4579563j4856254j5363814j5573804j5053086j4905577j4478590
$$ y = [80504835, 83782373, 87004076, 90135727, 93865665, 97573291, 101782177, 105965525, 110370070, 114933470, 120308694, 125316995, 131034799, 136567227, 142776224, 149352515, 156192925, 163427739, 171353633, 179767386, 187764879, 197319690, 206976521, 216968057, 227884450, 238495418, 250547935, 262880445, 275836687, 288999590, 302546647, 316774586, 330923421, 345738896, 360039844, 374805044, 389203735, 402977103, 416508698, 428756706, 439762378, 449769848, 457357892, 461710041, 462583036, 463019974, 462539854, 460051335, 456330593, 451249273, 443308733, 433639701, 422091988, 408950704, 394693404, 380113841, 365257587, 349893773, 334319969, 319266883, 304361306, 289882716]
14253B89882716j3867003j3466160j2843224j2116175j1819880j0976110j0285210
14246B04508954j0088978r461869q528368q309075p950727p172986p317816o248433
14238A39430702o308453n670742n445606n264160m575776m976770m401852l681139
14230I9106204l570379l790225l844779l670734l115807l066830k796157k720495
14222G2530798k395034k432478k059437k205498k388838j932942j947830j673108
14214E5495633j648918j310720j999521j137180j902643j532653j242873m23087
14206D4298038j310537j798096j036241j298830r21094j066360n88108j159168
14198C5119604r81442p79325o02397j247628o04913l60255j208538o74218k89609
$$ y = [289882716, 276015713, 262549553, 249706329, 237590154, 225770274, 214794164, 204508954, 194419976, 184958107, 176429739, 168120664, 160169937, 152996951, 145679135, 139430702, 133122249, 127451507, 122005901, 116741741, 112165965, 107189195, 102787343, 99106204, 95535825, 91745600, 87900821, 84230087, 81114280, 78047450, 75251293, 72530798, 70135764, 67703286, 65643849, 63438351, 61049513, 59116571, 57168741, 55495633, 53846715, 52535995, 50536474, 49399294, 47496651, 45963998, 44721125, 44298038, 42987501, 41189405, 40153164, 38854334, 37933240, 36866880, 36278772, 35119604, 34138162, 33358837, 32756440, 31508812, 30903899, 30543644, 29335106, 28660888, 28371279]
14189B8371279r76525n84506p89714q99458j98090p44241j08989o50099o11519
14180B2808138k47896n95697j060733L29609p86248j18408o63359l40613l25346
14171A8999447p41100j41177k36924m94129l59550m18128l2473k29231o70510
14162A5676225j5457m42752q9811k93222k66033l39691j65736K4586n77582p527
14152A3503000o14741J03913l60848n35276K83554k29904l69610m69996K25776
14143A1535868l79196Q4483r5371n60127l1650k33438J06153k3900l22040l36998
14133I743784J92337m37885j4596k33662M3286j27123l71910r2966k11465L06639
14123H796439m1017j50259k52980j1863o03961j04103J60941o20287J49835M9189
$$ y = [28371279, 27394754, 26810248, 26020534, 25121076, 24922986, 24178745, 24069756, 23419657, 22808138, 22560242, 21964545, 20903812, 21233421, 20447173, 20328765, 19665406, 19324793, 18999447, 18258347, 18117170, 17880246, 17386117, 17026567, 16608439, 16575966, 16346735, 15676225, 15660768, 15218016, 15128205, 14834983, 14568950, 14229259, 14063523, 14088109, 13510527, 13503000, 12888259, 12992172, 12631324, 12096048, 12379602, 12149698, 11780088, 11310092, 11535868, 11156672, 11241155, 11145784, 10585657, 10554007, 10320569, 10426722, 10402822, 10080782, 9743784, 9936121, 9498236, 9483640, 9249978, 9293264, 9166141, 8794231, 8701265, 8489800, 8796439, 8755422, 8605163, 8352183, 8340320, 7736359, 7632256, 7793197, 7172910, 7322745, 7371934]
14113G371934J5906k24927L49751n06884j89020K53661o11602O7769j23753K27862
14103F630697l28256K06250k90226j54687L51173j95678j50780K75280l06464
14094F037309n15368J21740J91531m08611j21272p4442P04261j29195n59484k30610
14084E015859K30582l05191M50233l68570L16671n56378l1720J47995k0020O0714
14074D940175l53229j01107j32272J45419k20197L47552q4811j95814j03246j33736
14064D108734J32625N3724K9344k24792P476O417j21865K56239l53062m896J38941
14053D028885j33572l12172L60525k13492J29800l62319K26642k79573J38423
14044C583147q1104J740K87381n99699l3300J29819n2455K51948j6338l31045
$$ y = [7371934, 7387840, 7162913, 7512664, 7005780, 6816760, 7070421, 6458819, 6526588, 6402835, 6630697, 6302441, 6508691, 6218465, 6063778, 6414951, 6219273, 6068493, 6343773, 6037309, 5521941, 5643681, 5835212, 5426601, 5305329, 5230887, 5935148, 5805953, 5246469, 5015859, 5246441, 4941250, 5391483, 5022913, 5339584, 4783206, 4751486, 4899481, 4879461, 4940175, 4586946, 4485839, 4353567, 4498986, 4278789, 4626341, 4541530, 4345716, 4242470, 4108734, 4241359, 4295083, 4324427, 4099635, 4107111, 4113528, 3991663, 4247902, 3894840, 3889944, 4028885, 3895313, 3583141, 3943666, 3730174, 3859974, 3497655, 3724297, 3444724, 3583147, 3502043, 3503783, 3791164, 3191465, 3158165, 3287984, 3235529, 3487477, 3471139, 3140094]
14034C140094K92287j77324k48654Q9511q8999K11308j36342J30428k05242P6570
14024C083637k15510P9428k32405P4762k26461M90509l15836o8239J54829o8169
14014B756545j70969l1005k1828j17525j53904J19417Q2474r3438j22504L9397
14004B286660J23837j1678k68850K2370K86107j30630k20424L17817l82391L16305
13994B339123J41710j71397M79643K28939J36962J408622K101996O214337J3024075
13985B5904010J2877712j0192953j1900803o504932l226713j445770p95302l88463
13977D326786o23868n65163k56642K22943j41190p147m27188K91245m03853N04600
13967B920523l27463k24772J27340L4744o00303K42748j26305J16680K12259J9688
$$ y = [3140094, 3432381, 3255057, 3006403, 3095914, 3006915, 3218223, 3081881, 3212309, 3007067, 3083637, 2868127, 2947555, 2715150, 2789912, 2563451, 3053960, 2738124, 2669885, 2824714, 2756545, 2585576, 2554571, 2532743, 2415218, 2261314, 2380731, 2463205, 2369767, 2247263, 2286660, 2410497, 2398819, 2129969, 2152339, 2438446, 2307816, 2087392, 2405209, 2022818, 2339123, 2480833, 2309436, 2789079, 3018018, 3154980, 4563602, 6665598, 12879935, 25904010, 38781722, 28588769, 16687966, 10183034, 6956321, 5510551, 4715249, 4326786, 3702918, 3137755, 2881113, 3104056, 2962866, 2955719, 2528531, 2819776, 2415923, 2920523, 2593060, 2368288, 2495628, 2530372, 1930069, 2172817, 2046512, 2163192, 2375451, 2395139]
13957B395139j74034l0394K5769l44549L8067M30598k49797k76776O6726L3962
13947A914711j09238K47121k72338p9184J09679L4561J66505m04108L02568l76887
13937A533390N01579l04522j5858J75638j49488m9091j74327k0674N4875P9257
13927A630779k319K10051k09230j29659l662K22691J8486j34717J74197m81027
13917A295590N4402K48123j85390J46679J04744k4696J87630k49231L304k49092
13907A332063K8651J38214l85489M95183J60463m24681M2090Q0445k05905l1271
13897A229763J26822K2225j93032K39727j0201Q1054j70713k3383L0838k54711
13887A078389L10551J16391j94534K4521l6553J52046j56272M1438K83504k79834
$$ y = [2395139, 2221105, 2190711, 2216480, 1871931, 1909998, 2340596, 2090799, 1814023, 1880749, 1914711, 1805473, 2052594, 1780256, 1701072, 1810751, 1845312, 2011817, 1607709, 1910277, 1533390, 2034969, 1730447, 1714589, 1890227, 1740739, 1691648, 1517321, 1496647, 1551522, 1630779, 1628460, 1838511, 1629281, 1499622, 1495960, 1718651, 1737137, 1602420, 1776617, 1295590, 1349992, 1598115, 1412725, 1559404, 1664148, 1639452, 1827082, 1577851, 1581155, 1332063, 1360714, 1498928, 1113439, 1608622, 1769085, 1344404, 1386494, 1466939, 1261034, 1229763, 1356585, 1378810, 1185778, 1425505, 1415304, 1496358, 1325645, 1302262, 1333100, 1078389, 1388940, 1505331, 1310797, 1335318, 1298765, 1450811, 1294539, 1335977, 1619481, 1339647]
13877A339647N0781l15677J04134R1336P929K02462n52984L07737r0557J34902
13867A279710k50880j65586L63519j95476L03780k32605R3002L5573j40230M9969
13857A140776P7814l19196M60512l21933l37265M38895j05369j62148L08034l19688
13847H60432J11483m3312Q7792J62406P540L37922o22215p8202L31315j59407
13837I95754j18243N8328k41985M70198l83514k4397K36150J43012l01789M9887
13827H83401j30871L23868p9689J10625J3808J9624k34254J09056K9613o9758
13817I75423J05029n1153m07946K70978j14244j6349K737j60228L13680m54729
13807D63198L76251j85132L06960K258l07179K24540j17427J81785k24421j36836
$$ y = [1339647, 1390428, 1074751, 1178885, 1270221, 1278150, 1480612, 927628, 1235365, 1144808, 1279710, 1028830, 863244, 1226763, 1031287, 1335067, 1102462, 1195464, 1231037, 1090807, 1140776, 1218590, 899394, 1359906, 1037973, 700708, 1139603, 1034234, 872086, 1180120, 860432, 971915, 928603, 1016395, 1178801, 1186341, 1524263, 902048, 823846, 1155161, 995754, 877511, 935839, 693854, 1164052, 780538, 756141, 992291, 1135303, 833514, 883401, 752530, 1076398, 996709, 1107334, 1121142, 1140766, 906512, 1015568, 1045181, 975423, 1080452, 1029299, 621353, 892331, 778087, 761738, 764475, 604247, 917927, 463198, 839449, 654317, 961277, 963535, 656356, 880896, 763469, 945254, 720833, 583997]
13797E83997L34416Q3612m55151L92756l45967K95182j52568R5991j60535j15631
13787E56102J09591j4008N37066l25977k96441L82040k61025j43700O15767n34451
13777F24964j07519L23237J60479k11695o7766Q61k0735k16503N00975l21122
13767F65176J53770j52102r0541J43361J15101j2915k95014J25374R4559Q1192
13757H27961J34690J1927B65271J80433L03031j73892J90737q9105j08701m6931
13747E20843L54444m35577O0703J30154O8655M7032l31791J20642P7172j45320
13737D66957k07929K72810j60055L6057L86399j25324L07180l46657C08633M27843
13727G36476C61381m3879K02583j04059J3972K31605A41340L30599K0739J17371
$$ y = [583997, 918413, 1002025, 546874, 939630, 593663, 888845, 736277, 832268, 671733, 556102, 665693, 651685, 1188751, 862774, 566333, 948373, 687348, 543648, 1159415, 624964, 517445, 840682, 1001161, 789466, 721700, 722561, 701826, 485323, 986298, 665176, 818946, 666844, 576303, 719664, 834765, 821850, 526836, 652210, 746769, 827961, 962651, 974578, 265271, 445704, 748735, 574843, 765580, 676475, 567774, 520843, 875287, 439710, 500413, 630567, 699222, 746254, 414463, 535105, 612277, 466957, 259028, 531838, 371783, 407840, 794239, 668915, 976095, 629438, 308633, 736476, 361381, 317502, 520085, 416026, 429998, 661603, 141340, 471939, 492678, 610049]
13717F10049k3233j69651K60836j68189j42061J13802J57568j69168q867p6024
13707C85062A77781M11074J08414q1691m4669K4001k96286L84733j19513J2940
13697E76784k78801M58144L12518k74389j4466C76009L7751J33138B44964M98717
13687G43681k13440A81698L28079P7812j56471J49866A67396K10113l2572J22667
13677D67604q6418J75698j87771L24205B41139O25551l78481j24110K37760n2785
13667E49074Q9019J07307k16892j16859J22329k21091J82329K086j40747J74739
13657E31294P2747j5356j39398K87508B64238K05310q2064O9196A41788M81629
13647F23417B59172L48729n9603m2611L9430K0315j87771k8968J50414J06408
$$ y = [610049, 586816, 417165, 678001, 509812, 367751, 481553, 639121, 469953, 461086, 385062, 177781, 588855, 697269, 615578, 570909, 594910, 298624, 683357, 563844, 576784, 297983, 756127, 1068645, 794256, 779790, 376009, 413760, 546898, 244964, 743681, 530241, 181698, 509777, 587589, 431118, 580984, 167396, 377509, 344937, 467604, 381186, 556884, 369113, 693318, 241139, 866690, 488209, 364099, 601859, 549074, 638093, 745400, 528508, 411649, 533978, 312887, 495216, 497302, 356555, 531294, 604041, 588685, 449287, 736795, 264238, 469548, 387484, 456680, 141788, 623417, 259172, 607901, 548298, 505687, 545117, 565432, 377661, 348693, 499107, 605515]
13637F05515a2637C93558K24231j04672j13158K485M05020l16694j10733Q9239
13627D69276j12251r6356M19108k83242q6647J95652j84262C2011L56130p0650
13617C17491q8668N05657B46203J48083j17605o143n1406K42907A69610M49750
13607F19360j08036k09799A6904K70817J45163k9868j07196M2210j22202n0717
13597A65111L40627L00367j80982q9761F9781O62805j78182c26050D09714l3165
13587C76549J84704k54736M8680A29929L85657J3569a51693B75488n0137n4566
13577A70785J30780J73488L2820j09022j80777J47073j08241A11409N26056B99079
13566C44239j8354J62427J94005k35177O4627a18959A03304L25603j6194P4093
$$ y = [605515, -12637, 393558, 617789, 513117, 399959, 402444, 807464, 490770, 380037, 469276, 357025, 260669, 679777, 396535, 309888, 505540, 321278, 32011, 388141, 317491, 228823, 734480, 246203, 394286, 276681, 270538, 219132, 462039, 169610, 619360, 511324, 301525, 16904, 287721, 432884, 403016, 295820, 338030, 215828, 165111, 505738, 806105, 625123, 535362, 69781, 732586, 554404, -326050, 409714, 376549, 561253, 306517, 355197, 129929, 515586, 529155, -151693, 275488, 225351, 170785, 301565, 475053, 507873, 398851, 218074, 365147, 256906, 111409, 637465, 299079, 344239, 325885, 488312, 682317, 447140, 511767, -118959, 103304, 428907, 412713, 486806]
13556D86806m8051A17892J98957L3781m9612j31511J5409k7627O8166J12927q3777
13545B54605J0403P0658j57679K87749j06735O5202j22041M4394k6447j19872
13535B00237A588J88199N2460K1106R0118j57759K0618J94182A47962J93211A22778
13523E88007j28435q3025o0541p1798L38333A47582J50239L06813B37K89143M1043
13512C30423p3962L8656j11526K86157m6848j08311A51953M67079C1322K10982
13502B42304p7169b0529A37215a5018B40630G9049R7795R4369K39931j6876B02188
13490B27186E0604K02910B9167a95388D30011j23260A28696R2669E0599N13344
13480E63943A34625J45539j0203L9449K0986D8598K97602A00087K65236A41964
$$ y = [486806, 438755, 117892, 316849, 350630, 301018, 169507, 184916, 157289, 225455, 338382, 254605, 265008, 335666, 177987, 465736, 359001, 424203, 302162, 346556, 320109, 200237, 1588, 189787, 242247, 263353, 353471, 195712, 216330, 410512, 147962, 341173, 122778, 588007, 459572, 376547, 316006, 244208, 582541, 147582, 297821, 604634, 237, 289380, 330423, 256461, 295117, 183591, 469748, 422900, 314589, 151953, 619032, 31322, 242304, 165135, -20529, 137215, -15018, 240630, 79049, 176844, 271213, 511144, 494268, 202188, 227186, 50604, 253514, 29167, -195388, 430011, 306751, 128696, 221365, 50599, 563943, 134625, 280164, 269961, 309410, 330396, 48598, 346200, 100087, 365323, 141964]
13469B78171g3857A17693L4549N15017B04132J74213j87990J21796a66334A04646
13458C84353A83753J42667j56487K9097E984K79140o4337J50862A64568A0537
13447D02149b5203C73078k3083O344o7790o8728a08626A57867E7134J44481K69919
13436D71534H1465P1699k4773A3084K52114K73964a61527B82516R7108j65388
13426B14236J06544J02039a15954e3316C99604A46922k1938N1717n4799K21739
13416C43641R0297K0642j26148C3046K20141J5156J23295J30133A76010O2142
13406B38152J62431j55062l1268j5034k0117C8200a9904A77085R8416A10684K71752
13395C82436o9738G4164K51952I714K92505G1065J3370R197J64900E0068K63828
$$ y = [278171, -73857, 117693, 152242, 667259, 204132, 378345, 190355, 312151, -166334, 104646, 384353, 183753, 326420, 169933, 199030, 5984, 285124, 220787, 371649, 164568, 10537, 402149, -25203, 373078, 349995, 356339, 288549, 219821, -108626, 157867, 57134, 201615, 471534, 81465, 153164, 128391, 13084, 265198, 539162, -161527, 282516, 379624, 214236, 320780, 422819, -115954, -53316, 399604, 146922, 124984, 176701, 121902, 343641, 433938, 454580, 328432, 33046, 253187, 268343, 391638, 521771, 176010, 238152, 400583, 245521, 214253, 199219, 179102, 38200, -19904, 177085, 275501, 110684, 382436, 312698, 74164, 326116, 9714, 302219, 71065, 84435, 93632, 258532, 50068, 313896]
13384C13896A10557J16277J26379A09182D7375G874M03772j16197E7087a03242
13373F54369c5391I6730L41503J95733k48072n3554f7115A89218J2318R6425j46371
13362A51590K45813c4054B44199r8755L6351k2058K68282H0961a40983C68761
13351B37428l4141J13422l4594N8578A24904L27288a3316B47458A20579K62129
13341C82708j28836K08269D0627K20245A00902q202K0084K62044r0052e1318D53499
13329A83111J628L6730M0892K16106k18683b4372C01662M1833K48943B61447J09053
13318C70500A12464J57674J20944J55727l8736c4155E3485A8384K53627j29074
13308A42937M4406k2876J8668A9005J0982m032J12307D8541J08696K543L6907
$$ y = [313896, 110557, 226834, 353213, 109182, 47375, 7874, 411646, 295449, 57087, -103242, 654369, -35391, 96730, 438233, 633966, 385894, 332340, -67115, 189218, 201536, 297961, 151590, 397403, -34054, 244199, 145444, 181795, 159737, 428019, 80961, -140983, 368761, 237428, 203287, 316709, 282115, 340693, 124904, 452192, -13316, 247458, 120579, 382708, 253872, 462141, 40627, 260872, 100902, 92700, 112784, 374828, 284776, -51318, 453499, 183111, 184739, 221469, 262361, 478467, 259784, -24372, 301662, 343495, 592438, 261447, 370500, 112464, 270138, 391082, 546809, 508073, -34155, 53485, 18384, 272011, 142937, 187343, 164467, 183135, 19005, 29987, 25955, 138262, 48541, 157237, 159780, 196687]
13297A96687J39378A36434b33402E6081K43328o3480o5486a3311A66573a71138
13286F2888d08028c418B69505f2631J1158K0809i208I9424a25085D6749j4548
13275C2201a27825B0613Q5976K8720a68629B44719r4023M1224n9016L77248A40391
13263E9781J96943j07349j7541a32476C04617j39527K03007A80060M3495O5431
13253B88986C6343c6181B15301J70799A00879O365m3871a69969H3242b0469A32775
13241I4258Q9333i2232A54734K25864q2472n4036F8544P0696a21297H3098J70415
13230B53513J51374j1306i1882C9027L8842N2574J69287g2451H9570a26837C36893
13218H28667a15887I9523i9298A88679d12820i3424B05576I8684a6286A1219a06154
$$ y = [196687, 336065, 136434, -233402, 56081, 299409, 235929, 170443, -13311, 166573, -171138, 62888, -408028, -3418, 269505, -62631, -51473, -30664, -9208, 99424, -125085, 46749, 32201, -127825, 20613, 106589, 135309, -168629, 244719, 150696, 191920, 132904, 510152, 140391, 59781, 256724, 149375, 131834, -132476, 304617, 165090, 368097, 180060, 223555, 288986, 36343, -36181, 215301, 386100, 100879, 107244, 63373, -169969, 83242, -20469, 132775, 94258, 183591, -92232, 154734, 380598, 298126, 244090, 68544, 139240, -121297, 83098, 253513, 404887, 393581, -91882, 39027, 77869, 130443, 299730, -72451, 89570, -126837, 336893, 828667, -115887, 99523, -99298, 188679, -412820, -93424, 205576, 98684, -16286, 11219, -106154]
13206h9510o3457A04491P8787b1723A22395J5898E6745K07309C21J83800M9049
13195B33170j1726a10482A08580N6677i753A18593B9606K19342E2542J27361n9047
13184A20856d9468j32135A02300h3579j8168A89416b16779A57479F9174K6014
13174I5188f5923n3226C99307B4815i646A28576b584j20259B11469a15681G8830
13162A51914L9204L80339d7222A43235J77695I3470L9168a40632F0037B3685J76336
13151B00021J66665b42101A53142M0260r2580B085J27319K61518b98760e1426
13140A06203a03736B28697i3287A12656E1438n915K49010b5363a132j69111A64686
13128D6361f2115j69436C34394A32312i226j75030B31019C5222b64406A71167
$$ y = [-89510, -152967, 104491, 183278, -21723, 122395, 138293, 56745, 264054, 321, 184121, 233170, 221444, -110482, 108580, 165257, -9753, 118593, 29606, 248948, 52542, 179903, 120856, -49468, -181603, 102300, -83579, -101747, 189416, -216779, 157479, 69174, 95188, -65923, -119149, 399307, 24815, -9646, 128576, -2584, -122843, 211469, -115681, 78830, 151914, 191118, 571457, -47222, 143235, 320930, 93470, 132638, -140632, 60037, 23685, 200021, 366686, -242101, 153142, 193402, 100822, 2085, 129404, 390922, -298760, -51426, 106203, -103736, 228697, -93287, 112656, 51438, 45523, 294533, -25363, -1132, -170243, 164686, 46361, -62115, -231551, 334394, 132312, -9226, -184256, 231019, 35222, -264406, 171167]
13117i042l5384I2356F505J5396O8139g1840l8921A87100O5257a01075C31530
13105b6533A80510L22812I9384b9987j78485H3601a3203B25623o400a42894e8782
13093I7066J66045q1134p4408c17917E950L86658D6993a9420o1005A36435j4879
13082A21556L9509L4798d5545B23067p4535a7923E29268A920a50691C19953e5744
13070A10629a52947C55976f5249b7714A24952i9699L0231B23192o8008a15107
13059B36273G769J51308R6623D8906A7911K52317g7106p858I7572J30668O4156
13048B92396d9978B5426N3954K80576i3952L2912B28499g3166D62460k11944R8330
13037C48846H3698e6373C8016J34425Q7517E4309J22877Q8936b28922A84110Q5023
$$ y = [-9042, -44426, 92356, 6505, 21901, 90040, -71840, -110761, 187100, 252357, -101075, 331530, -26533, 180510, 503322, 99384, -29987, -208472, 83601, -13203, 225623, 219223, -142894, -58782, 97066, 263111, 181977, 107569, -317917, 5950, 392608, 46993, -19420, -80425, 136435, 121556, 161065, 195863, -45545, 223067, 148532, -17923, 529268, 1920, -150691, 319953, -55744, 110629, -152947, 355976, -65249, -27714, 124952, -99699, -69468, 223192, 155184, -115107, 236273, 7769, 159077, 255700, 48906, 17911, 270228, -77106, -84964, 97572, 228240, 292396, -49978, 25426, 79380, 359956, -93952, -61040, 228499, -73166, 462460, 250516, 348846, 83698, -56373, 38016, 172441, 259958, 54309, 177186, 266122, -228922, 184110, 269133]
13026B69133P0341A5773L35090A45353o0790J08808a10269A10365n447N2314J17057
13015B74289j35844F136M5567a61803B04289d3025l3415j12091e9790D47382f7157
13003H5375J87449e6576r4539H12g2933j765m5691F7701M9533c33257N8741a31666
12990e2969A84530a03497C50296N6697a1087E1070a2161A29103B0199L91172A7538
12978g3250b2991H2660q264K67971a68195c3731F0160i7931I4470c41659D5146
12966A97881r1756m6489j1076N0275a62282B65146h0621A58275g6323A15189B4471
12954b49822a7420G131f1631m8760j3210B67807p0850K65982B21582b99185d5383
12942A55709k6624m7043c19606A62093o9924N0275J2934k674i6823c5388G8062
$$ y = [269133, 339474, 15773, 350863, 145353, 84563, 193371, -110269, 110365, 104918, 157232, 274289, 138445, 6136, 51703, -161803, 204289, -43025, -76440, -188531, -59790, 447382, -67157, 85375, 272824, -56576, -151115, 812, -72933, -74698, -120389, 67701, 117234, -333257, -274516, -131666, -52969, 184530, -103497, 350296, 406993, -11087, 51070, -12161, 129103, 20199, 411371, 17538, -73250, -22991, 82660, 74396, 342367, -168195, -33731, 60160, -97931, 94470, -341659, 45146, 197881, 106125, 59636, 48560, 98835, -162282, 265146, -80621, 158275, -76323, 115189, 24471, -249822, -17420, 7131, -61631, -110391, -123601, 267807, 196957, 462939, 221582, -299185, -45383, 155709, 129085, 82042, -319606, 162093, 92169, 142444, 155378, 152704, -96823, -35388, 78062]
12930G2252N2635a35569E8021a32748E6845r888b10794H4302L00547j78582q2733
12919A23534a12477B23656c4810A58356i5845B57174N0195a38657j09650a2005
12908C00422c25861I8735b24582C6285b15968N0004j69174B58539g2808l3241
12898a06049b4502j8538b1206B40014a37723L6691B73104a53136F3250M3529J76373
12887B83152a34439j42240a28878H7084b0357n9547f722m4680A19896j7349b6331
12875C1582e8184C23095i4248B2789K13012A6154N1393b4490A67581B2414f087
12863b36058a6154j74945A71022f183q1194H1110P0625d9879k63193I6703R7500
12852A94203G370c36416A29023f7866m27539h1621B14623J30469J39823a14903
$$ y = [72252, 124887, -135569, 58021, -132748, 56845, 46957, -210794, 84302, 384849, 206267, 123534, -112477, 223656, -34810, 158356, -95845, 257174, 307369, -138657, -248307, -12005, 300422, -325861, 98735, -224582, 36285, -215968, -165964, -335138, 258539, -72808, -106049, -24502, -43040, -21206, 240014, -137723, -101032, 273104, -153136, 63250, 106779, 283152, -134439, -276679, -128878, 87084, -20357, -79904, -6722, -51402, 119896, 102547, -26331, 31582, -58184, 323095, -94248, 22789, 235801, 16154, 67547, -24490, 167581, 22414, -6087, -236058, -16154, -191099, 171022, -6183, -87377, 81110, 151735, -49879, -313072, 96703, 194203, 7370, -336416, 129023, -67866, -495405, -81621, 214623, 345092, 484915, -114903]
12841a3506A58263p004c5882k04727G5206d8102A75227i4744A7282J94762b82908
12829b30455C7611h6047D5103N8326d69352A8957a71771e8575l8390k83645b5540
12817d1062B45987a21209c6252o2806b2873j72919N8881A95513A4875R7666c70494
12805c82324A63336D7552g344A30770Q0662b06821B25499e7327a4814j87555F465
12793A3174P3106N3160R8904A8010b56431A64381J77299A3358P8719C7608c300
12781C26245r9941a72219k63627h157B36110o5024n9764n0901J4838A3489e4701
12769h2841A96803p9245f9825a1260j07476k75750C75469H6136a50370B70906
12758A68603h0709q4682o4167B37618A2589h5405A71131a80092A68952b77443
$$ y = [-13506, 158263, 151259, -35882, -240609, 75206, -48102, 175227, -94744, 17282, 212044, -282908, -230455, 37611, -86047, 45103, 103429, -469352, 18957, -171771, -58575, -96965, -380610, -25540, -41062, 245987, -121209, -36252, -99058, -22873, -195792, -136911, 195513, 14875, 112541, -370494, -382324, 163336, 47552, -7344, 130770, 211432, -206821, 225499, -57327, -14814, -202369, 6465, 13174, 86280, 139440, 238344, 18010, -256431, 164381, 341680, 13358, 92077, 37608, -3300, 326245, 226304, -172219, -435846, -8157, 236110, 171086, 111322, 60421, 75259, 13489, -54701, -82841, 196803, 117558, -69825, -11260, -118736, -394486, 375469, 86136, -150370, 270906, 168603, -80709, -165391, -229558, 237618, 12589, -85405, 171131, -180092, 168952, -277443]
12747I8590c52796A94091p8642M6671b8616H3261L84218A4764M2966A5341a46547
12735C26065r7843D0037J49045a80356B43563a89137A06886A4653b0709m8709
12725f9418j03754r9299A96778a34215A7635a13458H1967a52242m6632Q9401b6114
12713I3538m0902N7218L0221b9702B22258e2377A82552d6175B42690m9823L5430
12702B28297a28848A71068L5078a57264j10115B35373A3190P7062b7568I3436
12691B21792J5794a39087C31951H4930a4032D8783a12983c6567l6933B04186b63151
12679I9354b70852F6594c923F8560i6549A64329a18165k82429D47767B5192i0232
12667a70944f7283C62451j78240Q8506j08695n0533E0340M55971B0188K1227J6638
$$ y = [98590, -352796, 194091, 115449, 162120, -28616, 83261, 467479, 14764, 57730, 15341, -146547, 326065, 228222, 40037, 189082, -180356, 243563, -189137, 106886, 14653, -20709, -69418, -173172, -272471, 196778, -134215, 17635, -113458, 81967, -152242, -198874, -109473, -26114, 93538, 52636, 109854, 140075, -29702, 222258, -52377, 182552, -46175, 242690, 192867, 228297, -128848, 171068, 206146, -157264, -267379, 235373, 13190, 90252, -27568, 93436, 221792, 237586, -139087, 331951, 84930, -14032, 48783, -112983, -36567, -73500, 204186, -263151, 99354, -270852, 66594, -3923, 68560, -96549, 164329, -118165, -400594, 447767, 25192, -90232, -170944, -67283, 362451, 184211, 272717, 164022, 113489, 50340, 506311, 20188, 41415, 58053]
12656E8053B1311L36984a74995A95063q0989N1461e0226G0207A3319N3526K23712
12645B90557F0911b18188D1868J8293J963R8413a20025l4357H5393L63881h4226
12633E3469L82546J74063A93057E748L16037a38997E26703k33099H5650M8816
12623A34466B8806K93004I26e8252j46491C77978i1375I3871e6688B06861J1625
12612B18486k7700j7403G8213a1771I6396C915e313A1609N698Q7339A7577N63716
12600E81293A13841J00810f368E8220d44890H4618I765K27660e4140J7021n9686
12589i6805A49668B865P6792a7183B666L4203O4716J11414c26A95108K9707b3750
12576A54467h3002j75677B39863A05352J29617a0435l53659J44542F5809J23968
$$ y = [58053, 21311, 358295, -174995, 195063, 114074, 165535, -50226, 70207, 13319, 66845, 290557, 60911, -218188, 41868, 60161, 62124, 160537, -120025, -154382, 85393, 449274, -84226, 53469, 436015, 610078, 193057, 5748, 321785, -138997, 526703, 293604, 85650, 134466, 28806, 321810, 926, -58252, -204743, 377978, -91375, 93871, -56688, 206861, 218486, 190786, 173383, 78213, -11771, 96396, 3915, -5313, 11609, 17307, 104646, 17577, 581293, 113841, 214651, -6368, 58220, -444890, 84618, 9765, 237425, -54140, -37119, -96805, 149668, 2865, 79657, -17183, 2666, 36869, 101585, 212999, -326, 195108, 224815, -23750, 154467, -83002, -258679, 239863, 105352, 234969, -10435, -364094, -219552, 65809, 189777]
12566A89777a24541A27327M9665d3258j04902C8892g6584A56915a35184O3953
12556g1231j74360q8931a8977D01454b86722I4164b7628E0448J76681b6520B3304
12544D66028c47969F6796g5685q9397n590A06592i9258a8761j40566A90327k9525
12533A60802a7174C06114B6711b4293o723a0721k4058p6555N1195j43485l6318
12522b39942K6409A3399a31951C3940J19329K1258L03497H2848N6736K9842F738
12510a15666A05630O8792K27279a1184l8917k37520M3763c7192A09049a49572
12499A69519g6013j6601c4341o0316E9502J28961o4204e1621j57805J7009A70413
12487H0210J03167b89516I6644b91781B07413J12340e5557q0744A46798J8384
$$ y = [189777, -124541, 127327, 176992, -43258, -148160, 38892, -76584, 156915, -135184, -71231, -245591, -334522, -18977, 401454, -286722, 94164, -27628, 50448, 227129, -26520, 23304, 466028, -347969, 66796, -75685, -165082, -170672, 106592, -99258, -18761, -159327, 190327, 160802, -17174, 306114, 26711, -24293, -31016, -10721, -34779, -111334, -60139, -203624, -239942, -213533, 13399, -131951, 33940, 153269, 174527, 478024, 82848, 139584, 169426, 6738, -115666, 105630, 174422, 401701, -11184, -50101, -287621, -243858, -37192, 109049, -149572, 169519, -76013, -92614, -34341, -94657, 59502, 188463, 124259, -51621, -209426, -192417, 170413, 80210, 183377, -289516, 96644, -291781, 207413, 319753, -55557, -136301, 146798, 165182]
12477A65182a08623C3534d42084B58648c0923o8121j74319i3657L4563D64248
12466a77j80964Q5607B81141a3528A48562d2379m8690A8005a17291C95316C3333
12454H6511l2057p909M9521k4663J62270g6096q1382j46225e2589A81806b9075
12442h3794C7281a10850B35113h1022C27220A31759c9028k49137A28066e63792
12431A26161e0881p7880b0024k1100A44980b24074g5289n8386A23880L83975B5923
12419g7477I5002K61565H0670K28686J5511c80495A22912J47959J7852a64657
12408A9602a65280K5139j66364J966A38615f3917K4509r281j32737A00756c11185
12396a07302B71023a37649A90781a86388Q3024B38835D1451b21593g9317E1352
$$ y = [165182, -108623, 33534, -442084, 258648, -30923, -99044, -273363, -93657, -59094, 464248, -177, -181141, -95534, 281141, -13528, 148562, -42379, -91069, 18005, -117291, 395316, 33333, 86511, 54454, 46545, 96066, 71403, 233673, -76096, -157478, -303703, -52589, 181806, -29075, -83794, 37281, -110850, 235113, -81022, 327220, 131759, -39028, -288165, 128066, -563792, 126161, -50881, -128761, -20024, -41124, 144980, -224074, -75289, -133675, 123880, 507855, 25923, -77477, 95002, 356567, 80670, 309356, 324867, -380495, 122912, 270871, 288723, -164657, 19602, -165280, -140141, -306505, -304539, 138615, -63917, -39408, -48689, -181426, 100756, -311185, -107302, 271023, -137649, 190781, -186388, -103364, 238835, 41451, -221593, -79317, 51352]
12385B34396E954P1491g4295A00125c9736A8272j976f923K393A3907E422a0856
12372g6015j77999j83498A57882a54803a7327k54179A17346P6601q0342b4055
12361a20380A21894K8182a72623A71963g3085q0304A61750d742l3491j5622b5733
12349A60789a05936n7482j5816G8757f6447E8222h2589G3874d818o3655A1462
12337a68199m8613J4926A01141K1123k9767a83417D3162N9818a58373G0401b36154
12325B6543Q842K1774i1001j20919c8914J7804A18838b53305J18904D6676a4980
12313A21142e1801A31980n0229R8094l9623R6375N2377H4219B0443a84168B00057
12301I4251m7117K46270b90462A65196n5878b04145A71325o3875J21038a86448
$$ y = [234396, 5954, 77445, -74295, 100125, -39736, 18272, 16296, -6923, -4530, 13907, 5422, -10856, -76015, -254014, -437512, 157882, -154803, -17327, -271506, 117346, 193947, 113605, -24055, -120380, 121894, 150076, -172623, 171963, -73085, -153389, 161750, -4742, -38233, -53855, -25733, 160789, -105936, -163418, -179234, 78757, -66447, 58222, -82589, 73874, -4818, -68473, 11462, -168199, -216812, -201886, 101141, 122264, 92497, -183417, 43162, 102980, -158373, 70401, -236154, 26543, 35385, 57159, -91001, -211920, -38914, -21110, 118838, -253305, -134401, 46676, -14980, 121142, -51801, 131980, 81751, 179845, 140222, 236597, 288974, 84219, 20443, -184168, 200057, 94251, 47134, 293404, -290462, 165196, 109318, -204145, 171325, 107450, 228488, -186448]
12290I4662m1306a13693D3109r363c153D9561g7903D7444K8616c20422K1127H5264
12277a21635N1767B820P6948K90570h5759b1502r6698j8669j60015F2767N0318
12266A13085a47649j28129h6000b5614A12382K85121A84600i7566a0444A00323
12255A39799a75336A1559J45053D6198h0419L9186A55951L1011a884B326K25169
12244B27495B6397L4079L5586L38855g1186D9487J33745J60960A17197O7428b19531
12232B63986o2372J15814h2722A28983n9275K37977a15246C70795j71687I7127
12221D43213A4129M05052n5792l2519j47721R1847q2314A2845a52477A70720m4526
12210A26194L55452A4701K63892c0582j24844B44947C8775K44264I0271h2148
$$ y = [94662, 53356, -113693, 43109, 33746, -3153, 49561, -77903, 47444, 76060, -320422, -299295, 85264, -121635, -69868, 2820, 79768, 370338, -85759, -21502, -118200, -136869, -296884, 62767, 113085, -147649, -275778, -86000, -25614, 112382, 397503, 184600, -97566, -10444, 100323, 139799, -175336, 11559, 156612, 46198, -80419, -41233, 155951, 186962, -1884, 2326, 227495, 26397, 60476, 96062, 434917, -71186, 49487, 183232, 344192, 117197, 184625, -219531, 263986, 201614, 317428, -82722, 128983, 69708, 307685, -115246, 370795, 199108, 97127, 443213, 14129, 419181, 363389, 330870, 183149, 274996, 192682, 12845, -152477, 170720, 126194, 481646, 14701, 278593, -30582, -155426, 244947, 38775, 283039, 90271, -82148]
12199d0154D7387c6499B38878A4134J28628P1382R1374j24007M8458h2233B11152
12187g1494C36470e5094B17104H4899j8865K09058H7269l274d9266e985n927j88534
12175b00446M9923G46417i9266A11711M5773P8774B9036K29336h627D8422P6909
12164A25331f7138C7723J85831a38990A01235J66930b29738A06400J83438A6960
12153g1882a8060I5053e2348j22910D6859f7385a8073H0392l9033J52239R5112
12142B88710a22762d2780j1924K3913e633o9464C76717a68667A7327b32633B20480
12130G1624b03723j01065B04358p8143a68518d2811B52315a42184l4215a0284
12119b07021G3907e6407p3053M5484A23380a18623B3016J85282K95024h4761A69569
$$ y = [-40154, 47387, -36499, 238878, 14134, 142762, 214144, 305518, 181511, 229969, -82233, 211152, -71494, 336470, -55094, 217104, 84899, 66034, 275092, 87269, 83995, -49266, -5985, -11912, -200446, -150523, 746417, -99266, 111711, 157484, 236258, 29036, 258372, -8627, 48422, 125331, -67138, 37723, 223554, -138990, 101235, 268165, -229738, 106400, 289838, 16960, -71882, -18060, 95053, -52348, -175258, 46859, -67385, -18073, 80392, 41359, 193598, 288710, -122762, -42780, -54704, -30791, -5633, -75097, 376717, -168667, 17327, -232633, 220480, 71624, -203723, -304788, 204358, 126215, -168518, -42811, 252315, -142184, -176399, -10284, -207021, 73907, -56407, -129460, -83976, 123380, -118623, 23016, 208298, 503322, -84761, 169569]
12107C0109R6940b28185A34799R901b02847E3219A6638b17091A79994J12188f2152
12095B6156J81217p8658A46b82052B97736H8617D2693a11844D2387K45146j0727
12084B76806j23392B2163c43806A19109b73993D7859M42923A71858D0775P6623
12074A17398J79071a33494c5968a5291q3489L1150a5436A27894K6544K7221K18933
12063D00592D9155d5991J8340m3280J5358D36655j30905A21126K90092M43790
12053H55008l2179k79867I0533f270j22760G2871h9179r6987g3571l3326C11915
12041a26481A18872J51018a24030K0460K3655B72168d13624a7169E2484B5434
12030b733B6303J9255a09417j16914f5136n9353F0262g0357A9107b3277A26317
$$ y = [30109, 127049, -228185, 134799, 144700, -202847, 53219, 16638, -217091, 179994, 292182, -62152, 26156, 207373, 128715, 146, -282052, 297736, 88617, 42693, -111844, 42387, 287533, 276806, 153414, 22163, -343806, 119109, -273993, 47859, 490782, 171858, 40775, 117398, 296469, -133494, -35968, -15291, -98780, -67630, -15436, 127894, 154438, 181659, 400592, 49155, -45991, -27651, -70931, -55573, 436655, 305750, 121126, 411218, 855008, 822829, 542962, 90533, -6270, -129030, 72871, -89179, -186166, -73571, -106897, 311915, -126481, 118872, 269890, -124030, -103570, -79915, 272168, -413624, -17169, 52484, 25434, -2733, 26303, 45558, -109417, -226331, -65136, -124489, 60262, -70357, 19107, -23277, 126317]
12018b62963J0243M308D02651f539m7323j51613B87664b15990G2520K35538a23435
12006A87063b36140b948A96040b63513a20746H7110K761P9152g585k69510r5227
11995c72322f9353C4922K1755K38759A3808a08880I1894i603j42908N3991p7479
11984a75999j1804c4091A12809b83764R6780K2866A39048c72779B750M1416a91646
11972a15346A26143b09532K6236B62728b08574K3330C6272K0475b71641A48427
11961a20732p2905g5255b0782j94547a8738m6147j25792D15908a52245q0719A97251
11949A40500B5915q822O4769a75864F4749K147k7156c15354R6011J5868B88384
11937a26813B81094a85287B45997c61742i5624c5530D4312B1726c72690f7995
$$ y = [-262963, -252720, -248412, 402651, -6539, -53862, -205475, 287664, -215990, 72520, 308058, -123435, 187063, -236140, -2948, 196040, -263513, -120746, 87110, 89871, 169023, -7585, -277095, -372322, -69353, 34922, 56677, 295436, 13808, -108880, 91894, -9603, -152511, -98520, -175999, -187803, -34091, 112809, -283764, -186984, -164118, 139048, -372779, 2750, 44166, -191646, -115346, 126143, -209532, -183296, 262728, -208574, -185244, 36272, 56747, -271641, 148427, -120732, -193637, -75255, -20782, -215329, -18738, -64885, -190677, 415908, -152245, -232964, 197251, 140500, 25915, 17093, 81862, -175864, 64749, 66896, 39740, -315354, -219343, -203475, 288384, -126813, 281094, -185287, 245997, -361742, -95624, -35530, 44312, 21726, -372690, -67995]
11926c823j71961q4785i1327q5336q2909A54026c62655e7477n7391k0203L877
11915a31194c2201j81131d6510B69799a39924d8064A81948l7280A3865J05479
11905A19344a35026A33676D4744a03788i915n2971p9456I2204d460C34320a00548
11893e03082B3717M971d48553i9089D31437A70275b25608F4643k8519a66677a4409
11881e6638b2519E136i0301l2995B90484d846m1664o1351d9404A05869M2766b3862
11868a74572E1207J19193b5585A37236b49166e8501A99075h6134A03776L1664
11858A35440a58240l0511b9411j99204c4187A55859a83740J8759f1861A0062e218
11846C82133j72693o4421a25436B25974q5962h7296J6644j23103A34630D3979
$$ y = [-3823, -175784, -260569, -91327, -176663, -259572, 154026, -362655, -57477, -114868, -135071, -131194, -32201, -213332, -46510, 269799, -139924, -48064, 181948, 144668, 13865, 119344, -135026, 133676, 44744, -103788, -9915, -62886, -142342, 92204, -4460, 334320, -100548, -503082, 23717, 28688, -448553, -99089, 431437, 170275, -225608, 64643, 36124, -166677, -14409, -56638, -22519, 5136, -90301, -123296, 290484, -4846, -46510, -107861, -49404, 105869, 148635, -23862, -174572, 51207, 170400, -25585, 137236, -249166, -58501, 199075, -86134, 103776, 135440, -158240, -188751, -29411, -228615, -34187, 155859, -183740, -164981, -61861, 10062, -5218, 382133, 209440, 145019, -125436, 225974, 140012, -87296, -70652, -193755, 134630, 43979]
11835E5828a23684H1945b8264H9848J44292b17760A637K3377J27683c2812H0621
11823b73704a31848g400j63230B00319C3224J52309B5663K52634b69655F9503
11812F1761I349J10382b16802F2596j5361Q3180b44974Q1498b6230H2124J55167
11801B37291p2485M5305I5597K1724m3284J3117a2829N851E5780d29348b03765
11789A46284f2903b2405r869A6387a18967F4172J020O6514a69370j57084R1390
11778b35064k9196A67684d2248j49723C96718j54912b49332D9417b36670A59103
11767A3572M5235g0693D9335d7778A46004K69874A77930a58367A1400d1608r6580
11756a38188N3326j48213l2964A2228b78268J03570B9485Q3267b7241j47452A88915
$$ y = [55828, -123684, 81945, -28264, 89848, 234140, -217760, 1637, 25014, 152697, -32812, 80621, -273704, -131848, -7400, -170630, 200319, 33224, 185533, 25663, 278297, -269655, 69503, 61761, 9349, 119731, -216802, 62596, 47235, 130415, -244974, -163476, -26230, 82124, 237291, 164806, 210111, 95597, 117321, 74037, 87154, -12829, -6978, 55780, -429348, -203765, 146284, -62903, -22405, -32274, 16387, -118967, 64172, 65192, 131706, -169370, -326454, -235064, -264260, 167684, -42248, -191971, 396718, 241806, -249332, 49417, -236670, 159103, 13572, 58807, -70693, 49335, -47778, 146004, 415878, 177930, -158367, 11400, -41608, -138188, -84862, -233075, -266039, 12228, -278268, -174698, 29485, 112752, -27241, -174693, 188915]
11744B73424F2115b7646A72378a38718B62797j16699P4037b89025E9223a35797
11733B1811R4427E3672c2381A17434a24932M8201j37259f2308f408B32507D3676
11721A43026b46613h2015A64356c2376k04294d5953E2692a00893B21126F9183
11710B41881d8288j96927H3477J48586C472a36253A18922k2893m0249d78851C1249
11698a38088A93168a58600j04336p1025f6223j9720f434H0015Q2374c8109A36103
11686A23594K20834p2958f9896l5894d1665F8113K1090b05020c0725j79897P7116
11675a33506B24815c4906l8371B43428d0836j69675g3607o0048j63614C68358
11664C8024b82466B6170P6678A1274c21897A56824p116a23651K9232a0752E1113
$$ y = [273424, 62115, -27646, 172378, -138718, 262797, 146098, 220135, -289025, 59223, -135797, 21811, 116238, 53672, -32381, 117434, -124932, -76731, -213990, -62308, -6408, 232507, 43676, 143026, -246613, -82015, 164356, -32376, -236670, -45953, 52692, -100893, 221126, 69183, 241881, -48288, -245215, 83477, 232063, 3472, -136253, 118922, 96029, 55780, -478851, 31249, -138088, 193168, -158600, -262936, -333961, -66223, -85943, -6434, 80015, 162389, -38109, 136103, 123594, 344428, 271470, -69896, -105790, -41665, 68113, 89203, -205020, -30725, -210622, -133506, 224815, -34906, -73277, 243428, -40836, -210511, -73607, -133655, -297269, 368358, 38024, -282466, 26170, 102848, 11274, -321897, 156824, 149708, -123651, -94419, -10752, 51113]
11652F6903k1228J38352p7542e4139J8495D67972a70662H0196R2932e1732j94866
11641b46598E4187a12825M6643o3383B31317b25607A93131C2424c00222G0854
11630A64897b32068R1223d7999F1698K0765c40248D3788c15957B11254g4090l593
11619g7683G6235L0908D4582a03135F8424c7592j39364q4323B07521p184b61947
11607a46683C8656M1985a20161A40843h4293A19563J1351K20882A01957k2554
11597G9403b66356A10536b7384A61640K7995e9793E262L17439A22410c4951A08217
11585F8075K66367I8493a56593B34859M0646Q2136a00568m1600c9047E5774J0394
11574F6168J8345c7045J4563C5206b04451e7564B4979b48944e3194C10334h7717
$$ y = [66903, 45675, 184027, 106485, -54139, -35644, 467972, -170662, 80196, 173128, -51732, -246598, 54187, -112825, -66182, -129565, 231317, -225607, 193131, 32424, -300222, 70854, 164897, -232068, -140845, -47999, 61698, 82463, -340248, 43788, -315957, 211254, -74090, -77683, 76235, 107143, 44582, -103135, 68424, -37592, -176956, -261279, 207521, 200337, -261947, -146683, 38656, 80641, -120161, 140843, -84293, 119563, 130914, 351796, 101957, 79403, -266356, 110536, -27384, 161640, 189635, -59793, 5262, 322701, 122410, -34951, 108217, 68075, 334442, 98493, -156593, 234859, 275505, 357641, -100568, -142168, -39047, 55774, 66168, 84513, -37045, -22482, 35206, -204451, -57564, 24979, -248944, -53194, 310334, -87717]
11562A26884L1102K52985A08456K1660b44262A88479a70867J275m6598B07667
11551b0060r7706l1854c2748m0869B64282b88556P2563g929k04431H0613b08568
11539A11399R248b00172f0506H0356I928J95349j8625E3389K1641b37673B50650
11527h3284C0909J29978D9718A0699m960L95276A88029r0832R0492b5710H6878
11515a57195B63740B4259L19641A23280J10N3587E8027M77201A85219K80396a20019
11503A69769J8938L1386k6098L00450k06007a14487D4840K73472k843A48615D0801
11491E31573A02441C9007J79134r0651C2625R2592J2390a28649C15132a49458
11480E0085M1007d6839A51617c5238D6319K2314j9023M32856A20546N8059C9596
$$ y = [126884, 157986, 410971, 108456, 130116, -244262, 188479, -170867, -169592, -216190, 207667, -20060, -117766, -149620, -32748, -73617, 264282, -288556, -215993, -7929, -212360, 80613, -208568, 111399, 120647, -200172, -60506, 80356, 9928, 205277, 186652, 53389, 75030, -237673, 250650, -83284, 30909, 160887, 49718, 10699, 5739, 401015, 188029, 97197, 187689, -25710, 86878, -157195, 263740, 24259, 343900, 123280, 123390, 176977, 58027, 535228, 185219, 465615, -120019, 169769, 188707, 220093, 193995, 494445, 288438, -114487, 44840, 318312, 315469, 148615, 40801, 531573, 102441, 39007, 218141, 127490, 32625, 125217, 137607, -128649, 315132, -149458, 50085, 91092, -46839, 151617, -35238, 46319, 68633, 49610, 482466, 120546, 178605, 39596]
11468F1415K92643G9845O4539a20309n2807I507a5625E9917p949J12221A3888
11456i048A1396R1300b97731A87486R4012c53378B9474b6808h306D802J92966
11445A97768e2091A10415j3899D4218L8043J1274J63873a67588B51845D6109L24382
11434C70491A78569c41829B02655k7332c48454e1065l9791A22838R5051c725A72011
11422C2936g552A49460g7662I2190c23428C46811a77508q3439i9470r206D1385
11410A40000c55431A51441j7421l5917d1040A21578C4519h626k01965B01125G6331
11398h9282A02966b12309A12472J47403a33039E3392b0583j7555A30321F4266
11387F0186c8453j28795A92526E7151Q5136D3915O8535b25329C64068r0433d851
$$ y = [61415, 354058, 79845, 144384, -120309, -173116, 9507, -15625, 59917, 51968, 164189, 13888, -9048, 11396, 102696, -297731, 187486, 281498, -353378, 29474, -26808, -8306, 4802, 197768, -52091, 110415, 96516, 44218, 82261, 93535, 257408, -167588, 251845, 46109, 370491, 178569, -341829, 202655, 175323, -348454, -51065, -90856, 122838, 217889, -3725, 172011, 32936, -7552, 149460, -77662, 92190, -323428, 346811, -177508, -260947, -99470, -108676, 41385, 140000, -355431, 151441, 134020, 98103, -41040, 121578, 34519, -8626, -210591, 201125, 76331, -89282, 102966, -212309, 112472, 259875, -133039, 53392, -20583, -38138, 130321, 64266, 60186, -38453, -167248, 192526, 57151, 142287, 43915, 112450, -225329, 364068, 273635, -4851]
11375F0944a20093M9188q2414A90149a68749D580d78237A59409a23650A14768
11364d2487r1817o1512F2172a91912H012K00292b1737F0111b92648A69927a09575
11352D4438J57694i1407K4191k5013J4035j06330o799A2701Q2232g6579C3512
11340b59988B15162P2292a32995b4948k55062A43162K0090a84658j00293A64695
11329a75845H4679J250i3980B17273M571f1879M921B02675q9272a41734O9449
11318g2285H2817c5457F2983Q4983a60937O1535d7950j23929A32572d5799E7357
11306a57439g0655A09072b2170j66511d6832A79583o3119O4285a90186a2449j33252
11295a45701M6011c7464A01042r333M07177c5046r438B92306b6119A73583L6785
$$ y = [60944, -120093, -70905, -153319, 190149, -168749, 4580, -478237, 159409, -123650, 114768, -42487, -134304, -195816, 62172, -191912, 8012, 208304, -21737, 60111, -292648, 169927, -109575, 44438, 202132, -91407, -67216, -92229, -78194, -184524, -191323, 12701, 94933, -76579, 33512, -259988, 215162, 287454, -132995, -24948, -280010, 143162, 163252, -184658, -284951, 164695, -175845, 84679, 85929, -93980, 217273, 221844, -61879, -56958, 202675, 113403, -141734, -72285, 82817, -35457, 62983, 147966, -160937, -99402, -47950, -171879, 132572, -45799, 57357, -157439, -70655, 109072, -22170, -188681, -46832, 179583, 116464, 180749, -190186, -12449, -145701, -99690, -37464, 101042, 91709, 498886, -35046, -44484, 292306, -26119, 173583, 210368]
11284B10368d01342c7517A25336D2016c40694B06784H0092Q2030c42005e661E1132
11272c4600k48289i6417c6253C4643R4114a63945m1149G1824b90568B18154C7081
11260c80134B2384a03391j65107a26955G7759a29695A6294b7033r158B10968H2682
11248a12851m7581A97164b07259N5592B08439n6572K38152a58170A13900a39215
11237a60715A60519J12935a35045j94956A68445h9968o8001K938A07683g3172
11226a58305N6581b0172j43904l9389A61595c0217B12530a24638j3063K390M0187
11215i5124C06747a87074B71853d8824B63388e53k8000j75506j22027K5218J12631
11204a88237C7673d863j24022r7110A75655C2243J7728a98886q5419i4014i038
$$ y = [210368, -401342, -37517, 125336, 42016, -340694, 206784, 80092, 162122, -342005, -5661, 51132, -34600, -282889, -96417, -36253, 34643, 128757, -163945, -205094, 71824, -290568, 218154, 37081, -380134, 22384, -103391, -268498, -126955, 77759, -129695, 16294, -27033, -36191, 210968, 82682, -112851, -160432, 197164, -207259, -151667, 208439, 151867, 390019, -158170, 113900, -139215, -160715, 160519, 273454, -135045, -330001, 168445, -89968, -157969, -155031, 107683, -73172, -158305, -101724, -20172, -164076, -203465, 161595, -30217, 212530, -124638, -137701, -135311, -95124, 306747, -187074, 271853, -48824, 263388, -553, -28553, -204059, -326086, -300868, -188237, 37673, -4863, -128885, -225995, 175655, 32243, 49971, -198886, -284305, -94014, -9038]
11192D4340J25210a98756n41147C9537a81846F8517j6882f786B01516c3896B62332
11180b50976P431D63385b37251J14471A46747e9016B41472H1753l7861a78244
11169a07962L5421q5354j39566B61580j07195J1556a46351E5772a8014p2585C6248
11157a84139c7468A50042a73979d6686G0507J53038a2640j49667D6663k961h4834
11145a95637B20952G1146a66867A10521J5304N9853d52872a00592B28423N708
11135B34131A3078J09228g489o207G2684a41250E9820f5255A79729e1597A23087
11123i6451l5467A33597g7496C14086j3716b12366e1971A73107B1648J55280C9188
11111i2865b2545D4678a46186I0280C0795a4010C95965c3216A90600J31986E1496
$$ y = [44340, 169550, -198756, -739903, 39537, -181846, 68517, 51635, -6786, 201516, -33896, 262332, -250976, -243545, 463385, -237251, -122780, 146747, -59016, 241472, 81753, 43892, -178244, -107962, -72541, -157895, -297461, 261580, 154385, 165941, -146351, 55772, -18014, -90599, 36248, -184139, -37468, 150042, -173979, -46686, 70507, 223545, -12640, -162307, 46663, 43702, -84834, -195637, 220952, 71146, -166867, 110521, 125825, 185678, -452872, -100592, 228423, 234131, 13078, 122306, -7489, -13696, 72684, -141250, 59820, -65255, 179729, -51597, 123087, -96451, -131918, 133597, -77496, 314086, 300370, -212366, -51971, 173107, 21648, 176928, 39188, -92865, -22545, 44678, -146186, 90280, 30795, -14010, 395965, -33216, 190600, 322586, 51496]
11099C12498F4346P8102J31622j09857A7899c5790A27230J23617a80940A6564
11088a52056F6482i420A0562a4611B46522m4277B5499M03458K03424C3346P317
11077D0663J95639K90256k57490A32827N34664B77576L08919k00693J36164I8531
11066D91164J6574A55521J49028l2058N0558K66191p0435J76295J86104l43335
11056E37869J61724k17920J55905k70994K11282J02347j18253M36159l21826j10717
11046E65576J82585J14754l8688j09417J61944k29776J26233m0149o725N6378
11036G82715J10953k29717p8166K28856j74910j01746P2766J00433j32801L07759
11026H86142l19732M68607k26631Q492k76804k05045J42954M14089k92978k41996
$$ y = [312498, 64346, 142448, 274070, 164213, 17899, -35790, 127230, 250847, -180940, 16564, -152056, 66482, -9420, 10562, -14611, 246522, 202245, 25499, 428957, 632381, 33346, 40663, 236302, 526558, 269068, 132827, 667491, 277576, 586495, 385802, 521966, 98531, 491164, 507738, 155521, 304549, 272491, 323049, 589240, 518805, 695100, 881204, 537869, 699593, 481673, 637578, 366584, 577866, 680213, 561960, 998119, 676293, 565576, 748161, 862915, 824227, 714810, 876754, 646978, 773211, 733062, 726337, 782715, 893668, 663951, 585785, 814641, 639731, 537985, 610751, 711184, 578383, 886142, 566410, 1035017, 808386, 816878, 540074, 335029, 477983, 892072, 599094, 357098]
11016C57098L9721K19325n9747R4076j07726k6943M34479l62477M8523p6765J94890
11005G54454Q4359p8528j10416j52748L30557l23768K21814C57961K20733J25573
10995G04267k10727J04398l3567K59216M0840k46786r6083L65288J69595r0151
10985I66290J84577J18062n48573J4138L79496J05636J02661M11744K16170L49703
10975B299904K7275O68218j66713K21577k86066J73574R5257j95817p56818j76708
10965A903683k09763q9387r6645k03997P5777k10162M2174N2835j53600R9187
10955A210102k70960l39465N51024E04797N03214k73385K0496k21855j77226A68523
10944E14145e0482B49341i2946A19052b62761C37554h3123A06170b30618J01562
$$ y = [357098, 396819, 616144, 556397, 650473, 542747, 515804, 950283, 587806, 636329, 559564, 754454, 838813, 760285, 649869, 497121, 827678, 503910, 725724, 357961, 578694, 704267, 493540, 597938, 564371, 823587, 864427, 617641, 521558, 886846, 1056441, 966290, 1150867, 1268929, 720356, 734494, 1113990, 1219626, 1322287, 1734031, 1950201, 2299904, 2327179, 2995397, 2828684, 3050261, 2764195, 2937769, 3033026, 2837209, 2080391, 1903683, 1693920, 1604533, 1507888, 1303891, 1379668, 1169506, 1211680, 1264515, 1110915, 1210102, 939142, 599677, 1150701, 504797, 1008011, 734626, 755122, 533267, 356041, 168523, 514145, -50482, 249341, -92946, 119052, -262761, 337554, -83123, 106170, -230618, -129056]
10934a29056A58628c2403A67234i4881I2139b7808B11535I0702J23934K3842C5396
10922b9330C25700A10312D7996b50660A39819J1853P5412a0679k20893A10755
10911B62308L1082J52031A49604J56844d1304j34017l3032B48393j11297a4829
10900g0415C07171e7755F5815L3693a18461A22292b81262F1387L41536c18894
10889i8981m0778B16313a70507B22155a22022E8699O845J81372g6900C18040b379
10877A39893P062c7083B04472h0686j07660D2671L909K82308D1339N7310a7050
10865B79348A24927O629h5086A70214a93200B83151c16681a46718j11596d166
10854A6077J54936n5294D8967h5166B42818a13091B265d6831j66635B08084b40097
$$ y = [-129056, 158628, -32403, 167234, -94881, 92139, -27808, 211535, 90702, 214636, 238478, 35396, -29330, 325700, 110312, 47996, -250660, 139819, 151672, 227084, -10679, -231572, 110755, 262308, 293390, 445421, 149604, 306448, -41304, -175321, -208353, 248393, 137096, -14829, -70415, 307171, -57755, 65815, 99508, -118461, 122292, -281262, 61387, 402923, -318894, -98981, -139759, 216313, -170507, 222155, -122022, 58699, 65544, 246916, -76900, 318040, -2379, 139893, 146955, -37083, 204472, -80686, -188346, 42671, 46580, 328888, 41339, 98649, -17050, 279348, 124927, 131556, -85086, 170214, -193200, 283151, -316681, -146718, -258314, -4166, 16077, 171013, 115719, 48967, -85166, 242818, -113091, 2265, -46831, -213466, 208084, -240097]
10842b24088i0996F9199J49385a68494B85415a82316L897j37047C6642K7584a8729
10830I7088e3297j04572f204n69027d2341g586A14413N1060F9524H294J8994b37470
10817c2864A25787D6412c06386B05296B1334a09125K2900b1852I2701L3219C0579
10805a80229A57822b57091r1487A82015a12220c8443A22322K640b49346a00909
10794b24107M8482C6408c4891A28545g8021A24040b48850B2161h608l64354i1514
10782c88029b783m26494A99460c76020l6821k9248J61459A31228C4055a05362
10771b45481J01360N856O8751D2641J64832b97924e6794j43986G7282J21330m2080
10760A56532e5343k19931A16022Q6336P3023E3727a99304C2154Q8940K287a04156
$$ y = [-224088, -90996, 69199, 218584, -168494, 285415, -182316, -178419, -315466, 36642, 64226, -18729, 97088, -53297, -157869, -6204, -575231, -42341, -7586, 114413, 165473, 69524, 8294, 27288, -237470, -32864, 125787, 46412, -306386, 205296, 21334, -109125, -86225, -21852, 92701, 125920, 30579, -180229, 157822, -257091, -348578, 182015, -112220, -38443, 122322, 124962, -249346, -100909, -224107, -175625, 36408, -34891, 128545, -78021, 124040, -248850, 22161, -8608, -372962, -91514, -388029, -2783, -429277, 199460, -376020, -412841, -442089, -280630, 131228, 34055, -105362, -245481, -144121, -138265, -69514, 42641, 207473, -297924, -56794, -200780, 77282, 198612, 156532, -55343, -275274, 116022, 202358, 275381, 53727, -199304, 32154, 121094, 123381, -104156]
10748a95239O4437q9850B1453J8048m010f9142j37807r2378a33126A56301j6452
10737A39849J09135J102N349d1905C04091a52841g0369l4156d0861k37014I6038
10725B39841j3980a47569A64204b85896I0176h1003k9730d6767A96812a30242
10714b15841L4304B79644b0993H3421c67331a21620A21059n8275f9816p511j24982
10703b02309j39796G1930J13762O1539j17601a72575l5148i267E7645a39847e4699
10691c03003A09054b48871B9909b11640C0395h2922F3989h1844j01261A60461
10680a59271n6748J00330d6282I2901e8450k83563c47j0034j1800A71001g1714
10668a31064j23296G7233O3602B122J2040a1466l9687j27077o7738Q447C6622
$$ y = [-195239, -130802, -220652, 21453, 39501, 35491, -69142, -206949, -299327, -133126, 156301, 139849, 248984, 250086, 255435, -41905, 304091, -152841, -70369, -104525, -40861, -277875, 96038, 239841, 225861, -147569, 164204, -285896, 90176, -81003, -110733, -46767, 196812, -130242, -215841, -181537, 279644, -20993, 83421, -367331, -121620, 121059, 62784, -69816, -77327, -202309, -342105, 71930, 185692, 247231, 129630, -172575, -207723, -9267, 57645, -139847, -54699, -303003, 109054, -248871, 29909, -211640, 30395, -82922, 63989, -81844, -183105, 160461, -159271, -216019, -115689, -46282, 92901, -58450, -342013, -347, -10381, -22181, 171001, -71714, -131064, -254360, 77233, 140835, 2122, 14162, -11466, -51153, -178230, -245968, -237521, 36622]
10656e10201I1158i7016E120a77557A63771b01681P2025p8965B6345J47662a46309
10644b10485j44779C27032j16230I7142a00805C3648j4713c60186b1035G5371
10633a21118c6177p5356c9719h490j86943B68998g6959l8264a9028l47543A16836
10621A82529C788b8980l00316D2571f0011j21049O462O2512G9564R3090a46960
10609H4149K90984a03681j41218B36495a00190B49435A24374h4083B29318j09503
10599A19815K07970b37770A87397b99304a15308p2755A35558a1405j45867l6390
10589a93662d7447n1368G9206d21808g819A18121a03390D6062J15889E7376d8607
10577f5272M198J9654A26918a43834p4336A28833g6457C13314b0249B4773Q2077
$$ y = [-510201, 91158, -97016, 5120, -177557, 163771, -201681, -129656, -208621, 26345, 174007, -146309, -210485, -355264, 327032, 210802, 97142, -100805, 33648, 18935, -360186, -21035, 75371, -121118, -36177, -111533, -39719, -8490, -195433, 268998, -76959, -115223, -19028, -366571, 116836, 182529, 3788, -28980, -329296, 42571, -60011, -181060, -174598, -112086, 79564, 172654, -146960, 84149, 375133, -103681, -244899, 236495, -100190, 249435, 124374, -84083, 229318, 119815, 327785, -237770, 187397, -299304, -115308, -188063, 135558, -11405, -157272, -193662, -47447, -98815, 79206, -421808, -7819, 118121, -103390, 46062, 161951, 57376, -48607, -65272, -61074, -41420, 126918, -143834, -218170, 128833, -76457, 313314, -20249, 24773, 106850]
10566A06850k251b791l5713B37046B9221O3889g4168m3340H388i98A4085d1346
10553B41269c06791h262C04325a49408J7411l9194p3271e2297j53469B5243J9820
10542D5063a18556m8313D1419i4441q3935n3341j42330B585c14412C8663a37480
10530i6088b8027q8764I0441a235j21105j96952Q282F9287R1952k361b62576f2345
10517a0300j74024B45445c35959c576r1247I8808c915k1113A70541c53213A3770
10505h0817p4727F2115J30069q3405a06267B17380f1079j5065j22257k11562a06272
10493c0230B6132a36965A97268C418d7859A2200J70887J00122j06193D6084D060
10481A77217K60092A69601L4387J69199f7256D2927J83857A12655b83255L9418
$$ y = [106850, 104599, -2791, -38504, 237046, 29221, 93110, -74168, -117508, 8388, -998, 14085, -41346, 241269, -306791, -8262, 304325, -149408, -131997, -171191, -244462, -52297, -205766, 25243, 45063, -118556, -166869, 41419, -94441, -178376, -231717, -374047, 2585, -314412, 38663, -137480, -96088, -28027, -116791, 90441, -1235, -122340, -319292, -311010, 69287, 161239, 158878, -262576, -62345, -10300, -184324, 245445, -335959, -3576, -94823, 98808, -3915, -25028, 170541, -353213, 13770, -80817, -155544, 62115, 192184, 108779, -106267, 217380, -61079, -76144, -198401, -409963, -106272, -30230, 26132, -136965, 197268, 3418, -47859, 12200, 183087, 283209, 177016, 46084, 4060, 177217, 437309, 169601, 203988, 373187, -67256, 42927, 226784, 112655, -283255, -243837]
10471b43837A23303J2795E1092A3606Q6082a88859P7118B787K5242J94044a41956
10459C256c41007a33502B51025c4015l37154J68327B31546b71337A25023a934
10448F1724c1939A13445b83647e5772J0407j24963d6410C9770e3634A17756a3879
10436e58229H6506i658A41892c07661C7624h9199L8476k05153H5837i5433L8201
10425e7232j43154B23403b10778a081j80623L80a8330k97553A13826e4704p8490
10414a33194e7319k25141c046l53866B5592c69424a44904E6204a455j03492C11189
10402G0722c75612a680C07569d7841H3304B1801K29982C9103K95522K82705E0119
10390B27457i8319C27454g5311A38926R2128k6865b44482B30664l2824K78764
$$ y = [-243837, 123303, 136098, 51092, 13606, 99688, -188859, -111741, 2787, 28029, 222073, -141956, 3256, -341007, -133502, 251025, -34015, -371169, -202842, 231546, -271337, 125023, -1934, 61724, -31939, 113445, -283647, -55772, -45365, -170328, -46410, 39770, -53634, 117756, -13879, -558229, 86506, -9658, 141892, -307661, 37624, -89199, -50723, -255876, 85837, -95433, -57232, -200386, 223403, -210778, -1081, -181704, -181324, -18330, -315883, 113826, -54704, -133194, -57319, -282460, -3046, -356912, 25592, -369424, -144904, 56204, -1455, -104947, 311189, 70722, -375612, -1680, 307569, -47841, 83304, 21801, 251783, 39103, 334625, 617330, 50119, 227457, -98319, 327454, -75311, 138926, 231054, 204189, -244482, 230664, 197840, 476604]
10380D76604A23056A0847K63423P8483j06920A05542J17400k8860E7157J98455
10370B55612n044L88871A48548L36696k05224M2884l0683j08022N3068E2949K70231
10359C23180b771I7728J88199Q2156r5729N7477J24733p4934K91075j07081k18495
10348C45129P3393c5373m3206C53568j31706K24251A51146J21648p6047r0781
10338A05966e9666B15545P0521j17593n4476A9147M9925P8177J85296e8707A48424
10326C69053A32453J37805j8015b3153E9204K06794a46990g2236I3063c9258G4420
10314H1333K2708P8611D4945K53970b6662B87497b34064I6779m5623P380L59635
10303D18171b2688q4380A30992a05886A36689C7640R261K0253J59970E7681b57780
$$ y = [476604, 123056, 10847, 274270, 352753, 245833, 105542, 222942, 194082, 57157, 255612, 250568, 639439, 148548, 485244, 280020, 322904, 292221, 184199, 237267, 52949, 323180, -2771, 97728, 285927, 368083, 272354, 329831, 454564, 379630, 670705, 563624, 345129, 418522, -35373, -78579, 353568, 221862, 446113, 151146, 272794, 196747, 105966, -59666, 215545, 286066, 168473, 113997, 19147, 69072, 147249, 332545, -58707, 148424, 369053, 132453, 270258, 252243, -23153, 59204, 265998, -146990, -72236, 93063, -39258, 74420, 81333, 104041, 182652, 44945, 298915, -26662, 287497, -234064, 96779, 51156, 58536, 418171, -22688, -107068, 130992, -105886, 136689, 37640, 46901, 67154, 227124, 57681, -257780]
10291b4539l51671j24325a78321C8536L42922A85100e6342C96907a35871A36264
10280f2401k44147B07085b52513b6813p4439d5757A30491a40412j24471A49689
10269c26659J51947E8010j3852K23084a03424D32448k10395M6176J908j26200
10259A43937a10586B60324b53142F7627j9511a38951o1360B19198F7529k1451
10249D6078K8948c1398I1020L5026a16427B8108p416a7560m04761g5122k3744
10238i8866K442j00149L8652A85623P8198A24145f6660j80194A69513c08209I8042
10226b16351A07981a7184r7093a7490q0887I4128k8984L02289a23262a2831j80904
10215a93735b5490k05937f7254d080l85993J31406B56294a04464D08302A11291
$$ y = [-24539, -376210, -500535, -178321, 38536, 381458, 185100, -56342, 396907, -135871, 136264, -62401, -306548, 207085, -252513, -26813, -101252, -45757, 130491, -140412, -264883, 149689, -326659, -174712, 58010, 44158, 267242, -103424, 432448, 222053, 268229, 270137, 143937, -110586, 260324, -253142, 67627, 48116, -138951, -200311, 219198, 67529, 46078, 75026, -31398, 91020, 126046, -116427, 28108, 20692, -17560, -422321, -75122, -98866, -96424, -196573, -157921, 185623, 263821, 124145, -66660, -246854, 169513, -308209, 98042, -216351, 107981, -17184, -114277, -17490, -98377, 94128, 65144, 367433, -123262, -12831, -193735, -25490, -231427, -67254, -4080, -390073, -258667, 256294, -104464, 408302, 111291]
10204b03079R5785E5123c59560D12072a56661A03262b77715o3901J35132g0795
10193b4944k93819a10087M4530k79917B05028b83126A3993i8389G6825L8188a82298
10181a83984e3283j89546A54616D1893K26591a00262j8299j17491B55210a26067
10170A9027e22436e1617D1891b20294H316c02254e5151p9895c0702j23444c6809
10158a01625A06233a7782D6308a42350b0668k16403a7936B54874m2496c4234A3175
10146B30763e3578J8055k6927j21235D72663G2652a57903A92155a41905F2776
10135b61193o2513a39805I7446k5296a78713d7723l63034a73121P5184E536J37965
10124A43501a40104d213D5202a73644e0256o4970j62843f0082A01842A9400c01797
$$ y = [-203079, -107294, 55123, -359560, 412072, -156661, 103262, -277715, -341616, -206484, -70795, -24944, -318763, -110087, -65557, -345474, 205028, -283126, 13993, -98389, 76825, 115013, -182298, -183984, -53283, -242829, 154616, 41893, 268484, -100262, -118561, -236052, 255210, -126067, 19027, -522436, -51617, 41891, -220294, 8316, -302254, -55151, -135046, -30702, -154146, -36809, -101625, 106233, -17782, 46308, -142350, -20668, -237071, -17936, 254874, 212378, -34234, 13175, 230763, -53578, -35523, -62450, -183685, 472663, 72652, -157903, 192155, -141905, 62776, -261193, -323706, -139805, 97446, 72150, -178713, -47723, -410757, -173121, -97937, 5536, 143501, -140104, -4213, 45202, -173644, -50256, -115226, -278069, -60082, 101842, 19400, -301797]
10112d22350J6947E1629L7897N322a86917o2340B58551I8669B4027b10893A04531
10100A58011b26664D5517a68741m7274J00250j2292q6098o6094F0068b00288B1356
10088a37102E6637a02801A01035a93017A15522f8462o1876r5177A9258a25973
10077h6662L057m4880F4152E685a30653j39020K1307k1372B2317a54115n9473
10066b13588g6616B36160a0253k33983j78041a19167H4419b07319a7052C55446
10055b50574i3021A21729A7157a10685k29268a39876A21384d6721j18846P4279
10045i1288N626B56456h3325k73069f0449j80580a05132K6034A4022b61394f8081
10033b37461E3415L8451A7035N49j610a80380A13061K95154b66566d765k52752
$$ y = [-422350, -405403, 51629, 89526, 94848, -186917, -249257, 258551, 98669, 24027, -210893, 104531, 158011, -226664, 45517, -168741, -216015, -115765, -128057, -214155, -280249, 60068, -200288, 21356, -137102, 56637, -102801, 101035, -193017, 115522, -68462, -130338, -225515, 19258, -125973, -86662, -83605, -128485, 64152, 5685, -130653, -269673, -248366, -269738, 22317, -154115, -213588, -76616, 236160, -10253, -244236, -422277, -119167, 84419, -207319, -17052, 355446, -250574, -93021, 121729, 17157, -110685, -339953, -139876, 121384, -46721, -165567, -91288, -85662, 256456, -83325, -356394, -60449, -241029, -105132, -79098, 14022, -261394, -68081, -237461, 53415, 91866, 17035, 17584, 15974, -180380, 113061, 408215, -266566, -4765, -257517]
10022b57517J10060j23502C33777A51554B674J33159e0813k22445N6794C23717
10011a69836C0638a94994k336M3424f7667k58048k5607J69519q7791J16287l30808
10000d84115c0212A02844A9412L4119a54641B7814O8125h8882C11351a34985A55889
9988A78845B4630b20689q5127B29060H401b53782R4778N2738J0401E7225g9434
9976i201A38052o1821b61541J26020p6574Q0734j4457m15915a6910k20817B62580
9964A06270p818b87151C37349a72747l1340B8049b51807a24489o7722B75509a68340
9952C07123A18013b023j74943A55470f0385K1129B07378A01987c04883D2053a14412
9940C04826A22399i3233D9464a0586B9889a23182j68192B1895K29579b67673C2818
$$ y = [-257517, -147457, -270959, 333777, 151554, 2674, 135833, -50813, -273258, -216464, 323717, -169836, 30638, -194994, -197330, -153906, -67667, -325715, -351322, -181803, -269594, -153307, -484115, -30212, 102844, 19412, 53531, -154641, 27814, 95939, -88882, 311351, -134985, 155889, 178845, 24630, -220689, -305816, 229060, 8401, -253782, -159004, -106266, -95865, 57225, -79434, -9201, 138052, 76231, -261541, -135521, -212095, -131361, -145818, -561733, -16910, -237727, 262580, 106270, 98452, -287151, 337349, -172747, -204087, 28049, -251807, -124489, -192211, 275509, -168340, 307123, 118013, -2023, -176966, 155470, -60385, -39256, 207378, 101987, -304883, 42053, -114412, 304826, 122399, -93233, 49464, -10586, 29889, -123182, -291374, 21895, 251474, -267673, 32818]
9928e1154I4441K4135b47804J22020k9859A06321a16919H5168A0084b42272E4019
9916c24359A47326b4950j90999A28406m7646p782P6401F8135d12689A41715a42256
9904d88726e4532j48676j4527b2336A14456J63411c18282J21839A7762L73705
9894C91467A56279c07554a31637j27774r6993c776o2944G800f6589j56558j6756
9883b39903D16g186D0130A4119a45261l9572h1785B504a95847r1344C56866b24683
9870h1278l073I0605a12683A24138c69276i510q9876C3475K41892E9798J05849
9859A65647L1182g1714j70487p2906B1863Q5235a55757e3878o0699p2387C3927
9847a05744k5387M1305m4410C34204a3481m1803I8549g7291B7384q783K82200
$$ y = [-51154, 94441, 118576, -247804, -125784, -155643, 106321, -116919, 85168, 10084, -242272, 54019, -324359, 147326, -24950, -215949, 128406, 80760, 72978, 149379, 68135, -412689, 141715, -142256, -488726, -54532, -203208, -217735, -22336, 114456, 277867, -318282, -196443, 17762, 391467, 156279, -307554, -131637, -259411, -356404, -3776, -66720, 7800, -66589, -223147, -239903, 416, -7186, 40130, 14119, -145261, -184833, -81785, 2504, -195847, -287191, 356866, -224683, -81278, -84351, 90605, -112683, 124138, -369276, -9510, -99386, 33475, 275367, 59798, 165647, 196829, -71714, -242201, -315107, 21863, 107098, -155757, -53878, -114577, -186964, 33927, -105744, -131131, -89826, -134236, 334204, -13481, -55284, 98549, -77291, 27384, 18601, 300801]
9836C00801a32043k672A6202J39371g7806l12409E4993a42934H6757A9457d3595
9824c5480A42170b36791O8453L9642e9378B1343f0760h264k75611N4475h8319
9812b68503F5458a47399j64572c3723A46584e6719i035A00255D9610c46807N0694
9801b96113M5927H4893D755i5454A6831J640a15573p1388C1067h8318F1717a49170
9788c19755a15886j61938B70227h3785j03480j7947I8141R5142A8521O9369b94719
9776B56447b63643A27547a47379E2725e6656j27648b1715B2292e1100p9176H4536
9764A10784l2584b3909j84093D0415f1245j36718m487Q0024A20172d47707h9908
9752d9550j9626A14828h6523p532j59613a818l85596e1921A8909a36754A40143
$$ y = [300801, -132043, -134715, 16202, 155573, -77806, -390215, 54993, -142934, 86757, 19457, -43595, -35480, 142170, -236791, -168338, -128696, -59378, 21343, -60760, -8264, -283875, -229400, -88319, -268503, 65458, -147399, -311971, -33723, 146584, -56719, -9035, 100255, 49610, -346807, -296113, -250186, 84893, 4755, -95454, 16831, 18471, -115573, -186961, 31067, -88318, 61717, -149170, -319755, -115886, -277824, 270227, -83785, -187265, -205212, 98141, 193283, 18521, 87890, -294719, 256447, -263643, 127547, -147379, 52725, -56656, -184304, -21715, 22292, -51100, -130276, 84536, 110784, 78200, -23909, -208002, 40415, -61245, -197963, -202450, -122426, 120172, -447707, -89908, -49550, -69176, 114828, -86523, -94055, -253668, -1818, -387414, -51921, 18909, -136754, 140143]
9740A70214p3444l9062g6190A41045c83572A26317m6622K4342d9761j07758O8528
9729h8991B41470a93163c9956e763B65833a81252Q7552a8253A53217L3403A075
9717b15920O0810A64599d01749J48661m4102A53013c4897l23880b294l57150H57
9705a25124D2880J19215Q07a334k48979A59341a6469H4724o955b17647K0850p4892
9693b71689C08908b60770Q450J21522J8688j46847O4442R212k24851B08850b41929
9681B38750D2901J0574b35876E9636d8547q0560N1522K9079l03517A24926F187
9669f1741A80149h3742j683L478B9642b97684A8862c5862q923F4693a05966A09437
9656E0214J00096N1523i6440l6411C04483a92263g674l16010J7654g639j89358
$$ y = [170214, 96770, 57708, -76190, 141045, -383572, 126317, 79695, 104037, -49761, -157519, -88991, 241470, -193163, -39956, -5763, 265833, -181252, -93700, -18253, 153217, 186620, 1075, -215920, -155110, 164599, -401749, -253088, -297190, 153013, -34897, -358777, -2294, -359444, 857, -125124, 42880, 162095, 162902, -1334, -250313, 159341, -16469, 84724, 77769, -217647, -196797, -271689, 308908, -260770, -252320, -130798, -112110, -258957, -194515, -185303, -410154, 208850, -241929, 238750, 42901, 53475, -235876, 59636, -48547, -129107, -77585, -48506, -352023, 124926, 6187, -61741, 180149, -83742, -85425, -81947, 29642, -297684, 18862, -35862, -44785, 64693, -105966, 109437, 50214, 150310, 201833, -96440, -132851, 304483, -192263, -7674, -323684, -306030, -7639, -196997]
9645a96997m6364c5941A63864B9481a34193A5269L07853A49236a50527j38349
9635b88876C7864a55293L5156l9818r6940a0857r753Q883n1600l9285m8004M9592
9623a01024j65271k3118O1868D18168a70208J376k48019J27873C1320J53844d239
9611d7639K218j44669e1165D9553e9314m4275l55261A9368q762a145A28056e8860
9598F3432f8432j92072A04647b47459C5280i2745j72579J09655j80059C3849a55603
9586i1269k50174A25322a13383j41551P9082A20792Q4885b86800J17953O9109
9576i9738J096F7163a32307b2145B3781M6673b09485j39721A5646K55850d0050
9564A39507a70908L2096A62865h7252j45150B81975B6578a06023A38290c70086
$$ y = [-196997, -243361, -35941, 163864, 29481, -134193, 15269, 323122, 149236, -150527, -288876, 37864, -155293, -120137, -159955, -256895, -10857, -20610, -11727, -63327, -102612, -150616, -101024, -266295, -289413, -227545, 418168, -170208, -168832, -416851, -288978, 31320, 185164, -4239, -47639, -45421, -190090, -51165, 49553, -59314, -103589, -458850, 19368, 10606, -1145, 128056, -58860, 63432, -68432, -260504, 104647, -247459, 35280, -92745, -265324, -155669, -335728, 33849, -155603, -91269, -341443, 125322, -113383, -254934, -175852, 120792, 205677, -286800, -168847, -99738, -98642, 67163, -132307, -22145, 23781, 70454, -209485, -349206, 15646, 271496, -40050, 139507, -170908, -138812, 162865, -87252, -232402, 281975, 26578, -106023, 138290, -370086]
9553a59058o74P4321F3151c7557O047o0537k28587a04741A49703m740c5464j61162
9541a96626i4234A473a46691g2023j938B5008P1730C9096A0021L88580e08022
9529A20044b05862H8049c4716j55546A60297b11751B5111a01799B23081a61124
9518b1562k46035R1648B8197c1996m07352D0690b98717A64250D6194M0119l4873
9507E1440a60317b6164C29500A53772a90821A28051a3127j87095E1140c84936
9496a7405j33996d7175I1443b01416o7652B27634a75956E2953j6863d19631J12363
9485c07268J01541A28047c4969O140l22950F0323f3716B72348A08030k7894c8760
9473C7411N2756d32456e9744l243F5f6513B15380a01077l04411C0091e7639j17719
$$ y = [-159058, -159732, -85411, 63151, -37557, -31510, -92047, -320634, -104741, 149703, 144963, -35464, -196626, -94234, 1473, -146691, -72023, -73961, 25008, 96738, 39096, 10021, 398601, -508022, 120044, -205862, 88049, -34716, -190262, 160297, -211751, 25111, -101799, 223081, -161124, -21562, -267597, -175949, 28197, -31996, -439348, 40690, -298717, 164250, 46194, 86313, 51440, -160317, -26164, 329500, 153772, -190821, 128051, -13127, -200222, 51140, -384936, -17405, -151401, -47175, 91443, -201416, -269068, 227634, -175956, 52953, 36090, -419631, -307268, -205727, 128047, -34969, -28829, -351779, 60323, -63716, 272348, 108030, 80136, -38760, 37411, 90167, -432456, -59744, -62987, 65, -66513, 215380, -101077, -405488, 30091, -57639, -175358]
9461a75358A50477a32254A04799a69507K2767j42553j91632e337A73411b16294
9450A43242d3632j40695n5551d7630F5879c09736g1250k26425h7744m0982p3099
9439b01825g9500n9805G7453l4435M16362g8849l1226d0287I5467O405l7794a24069
9426A69301a4197j03551A30164g9286D85948d9544A02610C2797a03546k2740k37
9415a26523l68041c4848A4473a07285H402M4431j4997b39400R9512j3697A17359
9403B46314b94880A44443b6479k34076c1303A2102b26646B9579a3767B81143a82338
9391c15480J22547L7784k264l175B62658G2514e41045f0854G178d3104F1907a41237
9378A27472a75587B21457i1134E7827a77492j40005A67810m4251a841A1800J30008
$$ y = [-175358, 150477, -132254, 104799, -169507, -146740, -289293, -480925, -5337, 173411, -216294, 143242, -43632, -184327, -239878, -47630, 65879, -309736, -71250, -297675, -87744, -128726, -201825, -79500, -139305, 77453, 43018, 459380, -78849, -110075, -40287, 95467, 101872, 64078, -124069, 169301, -14197, -117748, 130164, -79286, 485948, -49544, 102610, 32797, -103546, -126286, -126523, -494564, -34848, 14473, -107285, 8402, 52833, 37836, -239400, -139888, -153585, 117359, 246314, -294880, 144443, -26479, -260555, -31303, 12102, -226646, 29579, -13767, 281143, -182338, -315480, -192933, -155149, -157413, -160588, 262658, 72514, -541045, -60854, 7178, -43104, 61907, -141237, 127472, -175587, 221457, -91134, 57827, -177492, -317497, 167810, 123559, -1841, 11800, 141808]
9367A41808a4600m6314r195C8192b26992D2304a726B41850B5697A1794J11533
9356A23327h5287j25846A44631C3127L8669g5550j76353J5351b2033A11073a43214
9344b08115f0604J7883A44630a57917A13349a09650r1692Q9335l06319a51526
9333a35210A04867m941D7191o820a17516D10108b1312m465n4012j01509A56960
9321f7059j84538e5985j95628D2350J25306a42825a9982k26295k84298a35903
9310F81a72545j63187J06946I7463J24609c00826a392B06489a36080A3679K15251
9299B28930a49174n0081e2489A97049a47550I6169C8448a43842A83810b6449j24867
9288a51316R486a1697A645h0446I3671j6144b73824B13436G6206Q4559N3344J297
$$ y = [141808, -14600, -60914, -70109, 38192, -226992, 42304, -1726, 241850, 25697, 11794, 123327, -85287, -211133, 144631, 33127, 71796, -75550, -251903, -236552, -22033, 111073, -143214, -208115, -60604, -42721, 144630, -157917, 113349, -109650, -201342, -112007, -418326, -151526, -135210, 104867, 99926, 47191, 40371, -117516, 410108, -21312, -25777, -79789, -181298, 156960, -67059, -251597, -55985, -251613, 42350, 167656, -142825, -19982, -246277, -530575, -135903, 681, -172545, -335732, -228786, 97463, 222072, -300826, -1392, 206489, -136080, 13679, 228930, -149174, -199255, -52489, 197049, -147550, 96169, 38448, -143842, 183810, -26449, -151316, -141830, -11697, 1645, -80446, 93671, 77527, -273824, 213436, 76206, 160765, 214109, 215406]
9276B15406G4931c30328A36676a72288C6255e3630C9766J43367a75831b7390j62430
9265a89820m3026B4666b25959M6214F1994c15225A07098c0590J3152A73966J34935
9254C08901a56691n37A50029a00548n9410o0434j06673A24375a03159o8838r9299
9243b71296P0596A2992b85737C6892E838c94954A1916J39767a76431N4306D07188
9231C1597q079d9087n9489b1551m4768r089q6833A5626b88499d5906i914l03877
9219c13791a6724I8805i133r891k15149A98996b1948j85420f7980j72312j27710
9208c68002H9502a71060k17974A0647J73592b29612A12142A1031b5026C5677a77229
9196A69479j0414a31762a3332n9688D6769O4944D1204j3956K0461b5626m46375
$$ y = [215406, 74931, -330328, 136676, -172288, 36255, -53630, 39766, 183133, -175831, -27390, -189820, -232846, 24666, -225959, -179745, 61994, -315225, 107098, -30590, -17438, 173966, 308901, -156691, -157228, 150029, -100548, -159958, -220392, -327065, 124375, -103159, -171997, -271296, -200700, 12992, -285737, 36892, 5838, -394954, 11916, 151683, -176431, -122125, 407188, 31597, 23518, -49087, -108576, -21551, -66319, -75408, -162241, 15626, -288499, -45906, -9914, -313791, -16724, 98805, -9133, -19024, -234173, 198996, -21948, -207368, -67980, -240292, -368002, 89502, -171060, -389034, 10647, 184239, -229612, 112142, 11031, -25026, 35677, -177229, 169479, 159065, -131762, -13332, -73020, 46769, 111713, 41204, 27248, 47709, -25626, -472001]
9185d72001a15242C1471a65567A88048C4626J28723D7739a03563F1042O4714i0321
9173A12206J34742c39969E8713K6216L63417A81377Q934d24136B36157H6861c4341
9161a95243A21456k5197O9439h5579I7508e2983A30110J269e3431a7015F5869
9149C99497b83981D8408b3111j10589A01643h9036o5135L9588p0772L7572q8829
9138b36612G4033a03989k82822F0041O3687a53882j04143c9395E6184c97237A07981
9126H9707k6886h2269J5696j6790j48117i2401d3022q9998f0983E5900a85155
9114C54b1013j53641N5066J3012l42017O3672d2395A21250a19792n2072j6388
9103a88252c7975r6247l3715o52n5568A15707b44318m0123g5762j41146g7098
$$ y = [-472001, -115242, 31471, -165567, 188048, 34626, 163349, 47739, -103563, 61042, 125756, -90321, 112206, 246948, -339969, 58713, 84929, 448346, 181377, 190311, -424136, 236157, 86861, -34341, -195243, 121456, 96259, 165698, -85579, 97508, -52983, 130110, 131379, -53431, -17015, 65869, 399497, -283981, 48408, -23111, -133700, 101643, -89036, -154171, -114583, -185355, -147783, -236612, 74033, -103989, -386811, 60041, 123728, -153882, -258025, -39395, 56184, -397237, 107981, 89707, 62821, -82269, -66573, -83363, -231480, -92401, -43022, -133020, -60983, 55900, -185155, 354, -21013, -174654, -119588, -106576, -448593, -384921, -42395, 121250, -119792, -171864, -188252, -37975, -134222, -167937, -168589, -224157, 115707, -244318, -284441, -75762, -216908, -77098]
9091C60717q9101G7377i092B418N672K44332b01062O4142j27299J29081A74633
9079a06980q0050F0764M5766E0102b86747A21033a8461M378H6219a55333j8543
9068a73876j61541J67573A00955O1269p0976e4222j65417A5820a75103D4712Q8847
9057A33559a40954l85527K62425A05207a35696i705A42600c9839H7957a10727
9046e422A46822a1416j2614A0367e4505l42533g3774K0967B01036K76a84906c6269
9033b81221F5540d13539a01165D862K83746I9011h0426b2580m29330A70067a69849
9021a68627g3493n7852B76771d2016I5662J02131h2801F4664b25502Q1291L6412
9010a07799B6586a33052G8167a13180l53763c8519j27586b6045A43961A4683h2331
$$ y = [360717, 271616, 77377, -9092, 2418, 8090, 252422, -201062, -136920, -264219, -135138, 174633, -106980, -187030, 60764, 106530, 50102, -286747, 121033, -18461, -14083, 86219, -155333, -173876, -335417, -167844, 100955, 162224, 91248, -54222, -219639, 15820, -175103, 44712, 133559, -140954, -526481, -264056, 105207, -135696, -9705, 142600, -39839, 87957, -110727, -5422, 146822, -11416, -24030, 10367, -54505, -397038, -73774, -52807, 201036, 201312, -184906, -36269, -281221, 65540, -413539, -101165, 4862, 288608, 99011, -80426, -22580, -451910, 170067, -169849, -168627, -73493, -131345, 276771, -42016, 95662, 197793, -82801, 64664, -225502, -144211, -107799, 26586, -133052, 78167, -113180, -466943, -38519, -166105, -26045, 143961, 14683, -82331]
8998b18196g6811j19950k01214A23399k1804a06295A6551a20888E1818B5012c21862
8986a96425P1800e4011E8252b91913d093k35787a08112N1902r7406N4971H0812
8974b08946A09597d373E0772O9067M9474f5207b0889q5361j41033a11612N1698
8963e9914m04999d1547B5999f0731j00201J9610r1968g0205j00313k9149r6400
8952b96067a152p8513n6223j52002l7935h0674C31284j34526a4927m07061a46071
8940a5703A10611b170r0081b3202B36173A16603j9714i1629A45298a17057L0221
8929h6836A07153a53492B21873j07478O1029R54902J979808N762051C220926I30409
8918D84724k2904a18765B24491q952a69081J2429b6594E9770A8091L22726K6273
$$ y = [-218196, -76811, -196761, -397975, 123399, 101595, -106295, 16551, -120888, 51818, 25012, -321862, -196425, -124625, -54011, 58252, -291913, -4093, -239880, -108112, -56210, -153616, -98645, 80812, -208946, 109597, -4373, 50772, 119839, 169313, -65207, -20889, -106250, -247283, -111612, -59914, -464913, -41547, 25999, -60731, -160932, -141322, -233290, -70205, -170518, -199667, -296067, -1152, -79665, -135888, -287890, -325825, -80674, 331284, 196758, -14927, -421988, -146071, -15703, 110611, -2170, -92251, -23202, 236173, 116603, 96889, -91629, 145298, -117057, -86836, 107153, -153492, 221873, 114395, 175424, 1130326, 3110134, 8872185, 3220926, 930409, 484724, 461820, -118765, 224491, 215539, -169081, -156652, -26594, 59770, 18091, 340817, 367090]
8907C67090j47057a01748c6565B07258k1379q4927i0865H6043L8917C8185b54399
8895A42983A2623J47151K9269a79654D3971J20406a93587A0508P0650c6697k45503
8884b82200G3572g591k98591i273r6739M0687K36F4940a4393A20864a1707k36581
8872b48288K6702j09151a51366A78073f669C5339J46775G2119h7627j02627I755
8860b2090q444P864j02672A25553c32224J5762D3038K12849d54008a63806M4926
8849a18880P912A8648a43066f7298j13764b993B9297K45389p4539b21215A51757
$$ y = [367090, 220033, -101748, -36565, 207258, 185879, 100952, -90865, 86043, 124960, 38185, -254399, 142983, 12623, 159774, 189043, -179654, 43971, 164377, -193587, 10508, 81158, -36697, -282200, 73572, -7591, -306182, -9273, -106012, -65325, -65089, 64940, -14393, 120864, -11707, -248288, -221586, -330737, -151366, 178073, -6669, 35339, 182114, 72119, -87627, -190254, 9755, -22090, -30534, -22670, -125342, 125553, -332224, -316462, 43038, 255887, -454008, -163806, -118880, -110968, 18648, -143066, -67298, -181062, -2993, 29297, 274686, 200147, -221215, 151757]
$$ [...]
##END NTUPLES=NMR SPECTRUM
##END=
