
##TITLE=AC1371_2395_7221463_d1VE8KR3dx
##JCAMPDX= 6.0         $$ Bruker NMR JCAMP-DX V2.0
##DATA TYPE= NMR SPECTRUM
##DATA CLASS= NTUPLES
##ORIGIN= BRUKER
##OWNER= Administrator
$$ 1.72 TOPSPIN		Version 2.1
$$ 2012-12-13 19:33:31.282 -0500  Administrator@X
$$ Compression mode = diff/dup
##.OBSERVE FREQUENCY= 400.02188249412
##.OBSERVE NUCLEUS= ^1H
##.ACQUISITION MODE= SIMULTANEOUS (DQD)
##.ACQUISITION SCHEME= undefined
##.AVERAGES= 64
##.DIGITISER RES= 22
##SPECTROMETER/DATA SYSTEM= spect
##.PULSE SEQUENCE= noesygpps1d.comp
##.SOLVENT NAME= COFFEE_meoh
##.SHIFT REFERENCE= INTERNAL, COFFEE_meoh, 1, 14.9606
##AUDIT TRAIL= $$ (NUMBER, WHEN, WHO, WHERE, PROCESS, VERSION, WHAT)
$$ ##TITLE= Audit trail, TOPSPIN		Version 2.1
$$ ##JCAMPDX= 5.01
$$ ##ORIGIN= Bruker BioSpin GmbH
$$ ##OWNER= Administrator
$$ $$ E:\/data/COFFEE/nmr/AC1371_2395_7221463_d1VE8KR3dx/12/pdata/1/auditp.txt
$$ ##AUDIT TRAIL=  $$ (NUMBER, WHEN, WHO, WHERE, PROCESS, VERSION, WHAT)
(   1,<2012-12-13 19:33:25.110 -0500>,<Administrator>,<X>,<go>,<TOPSPIN 2.1>,
      <created by zg
	started at 2012-12-13 19:21:50.809 -0500,
	POWCHK enabled, PULCHK disabled,
       configuration hash MD5:
       86 BA 57 50 F2 9D 5C 9B 26 00 A9 28 5F 66 2E 89
       data hash MD5: 64K
       F2 CB AA C4 C2 05 8E 10 00 70 70 1F 78 0D 28 35>)
(   2,<2012-12-13 19:33:28.329 -0500>,<Administrator>,<X>,<proc1d>,<TOPSPIN 2.1>,
      <Start of raw data processing
       efp LB = 0.3 FT_mod = 6 PKNL = 1 PHC0 = 0 PHC1 = 0 SI = 128K 
       data hash MD5: 128K
       1F 47 E3 16 27 94 AF 4C FC 78 C5 4C CF C3 82 14>)
(   3,<2012-12-13 19:33:29.532 -0500>,<Administrator>,<X>,<proc1d>,<TOPSPIN 2.1>,
      <pk PHC0 = -78.08533 PHC1 = 0 
       data hash MD5: 128K
       56 FC CE F4 07 25 C9 D8 A9 12 73 71 08 02 05 D5>)
(   4,<2012-12-13 19:33:30.219 -0500>,<Administrator>,<X>,<proc1d>,<TOPSPIN 2.1>,
      <abs ABSG = 1 
       data hash MD5: 128K
       9A FC 55 FF 8C F7 6D CF 09 6E C7 06 16 47 22 57>)
(   5,<2012-12-13 19:33:30.454 -0500>,<Administrator>,<X>,<proc1d>,<TOPSPIN 2.1>,
      <abs ABSG = 2 
       data hash MD5: 128K
       C9 C7 53 11 68 92 B9 80 04 89 1A 4B 95 E0 64 DA>)
(   6,<2012-12-13 19:33:30.610 -0500>,<Administrator>,<X>,<proc1d>,<TOPSPIN 2.1>,
      <abs ABSG = 3 
       data hash MD5: 128K
       AD 22 54 CC FC 13 5C 41 2D 07 1B 2D D0 09 96 A1>)
(   7,<2012-12-13 19:33:30.782 -0500>,<Administrator>,<X>,<proc1d>,<TOPSPIN 2.1>,
      <abs ABSG = 4 
       data hash MD5: 128K
       AE 16 85 FE 45 D8 D9 68 2A 98 59 19 6F B6 EC AB>)
(   8,<2012-12-13 19:33:30.938 -0500>,<Administrator>,<X>,<proc1d>,<TOPSPIN 2.1>,
      <abs ABSG = 5 
       data hash MD5: 128K
       61 03 70 00 07 E6 AA 48 07 FB 3F A7 2C 40 12 14>)
$$ ##END=
$$ 
$$ $$ hash MD5
$$ $$ B4 2B 8D 86 A3 2F E9 76 E2 26 4E F2 8E 4B D9 7D
##$RELAX= 
##$RELAX= 
##$RELAX= 
##$RELAX= 
##$RELAX= 
##$RELAX= 
##$RELAX= 
##$RELAX= 
##$RELAX= 
$$ Bruker specific parameters
$$ --------------------------
##$DU= <E:\>
##$EXPNO= 12
$$ [...]
150 150 150 150 150 150 150 150
##$TP07= 0
##$TPNAME0= <>
##$TPNAME1= <>
##$TPNAME2= <>
##$TPNAME3= <>
##$TPNAME4= <>
##$TPNAME5= <>
##$TPNAME6= <>
##$TPNAME7= <>
##$TPOAL= (0..7)
0.5 0.5 0.5 0.5 0.5 0.5 0.5 0.5
##$TPOFFS= (0..7)
0 0 0 0 0 0 0 0
##$TUNHIN= 0
##$TUNHOUT= 0
##$TUNXOUT= 0
##$USERA1= <user>
##$USERA2= <user>
##$USERA3= <user>
##$USERA4= <user>
##$USERA5= <user>
##$V9= 5
##$VALIST= <valist>
##$VCLIST= <CCCCCCCCCCCCCCC>
##$VD= 0
##$VDLIST= <DDDDDDDDDDDDDDD>
##$VPLIST= <PPPPPPPPPPPPPPP>
##$VTLIST= <TTTTTTTTTTTTTTT>
##$WBST= 1024
##$WBSW= 4
##$XGAIN= (0..3)
0 0 0 0
##$XL= 0
##$YL= 0
##$YMAX_a= 5904294
##$YMIN_a= -11578409
##$ZGOPTNS= <>
##$ZL1= 120
##$ZL2= 120
##$ZL3= 120
##$ZL4= 120
##$ABSF1= 14.9606
##$ABSF2= -5.597582
##$ABSG= 5
##$ABSL= 3
##$ALPHA= 0
##$AQORDER= 0
##$ASSFAC= 0
##$ASSFACI= 0
##$ASSFACX= 0
##$ASSWID= 0
##$AUNMP= <proc_prof1d_extract.lims>
##$AXLEFT= 0
##$AXNAME= <>
##$AXNUC= <1H>
##$AXRIGHT= 0
##$AXTYPE= 0
##$AXUNIT= <>
##$AZFE= 0.1
##$AZFW= 0.1
##$BCFW= 0
##$BC_mod= 0
##$BYTORDP= 0
##$COROFFS= 0
##$CY= 15
##$DATMOD= 1
##$DC= 0
##$DFILT= <>
##$DTYPP= 0
##$F1P= 0
##$F2P= 0
##$FCOR= 0.5
##$FTSIZE= 131072
##$FT_mod= 6
##$GAMMA= 0
##$GB= 0
##$INTBC= 1
##$INTSCL= 1
##$ISEN= 128
##$LB= 0.3
##$LEV0= 0
##$LPBIN= 0
##$MAXI= 10000
##$MC2= 0
##$MEAN= 0
##$ME_mod= 0
##$MI= 0
##$NCOEF= 0
##$NC_proc= -2
##$NLEV= 6
##$NOISF1= 0
##$NOISF2= 0
##$NSP= 0
##$NTH_PI= 0
##$NZP= 0
##$OFFSET= 14.9606
##$PC= 1
##$PHC0= -78.08533
##$PHC1= 0
##$PH_mod= 1
##$PKNL= yes
##$PPARMOD= 0
##$PPDIAG= 0
##$PPIPTYP= 0
##$PPMPNUM= 2147483647
##$PPRESOL= 1
##$PSCAL= 4
##$PSIGN= 0
##$PYNMP= <proc.py>
##$REVERSE= no
##$SF= 400.020009795059
##$SI= 131072
##$SIGF1= 0
##$SIGF2= 0
##$SINO= 400
##$SIOLD= 131072
##$SPECTYP= <>
##$SREGLST= <1H.CDCl3>
##$SSB= 0
##$STSI= 131072
##$STSR= 0
##$SW_p= 8223.68421052631
##$SYMM= 0
##$S_DEV= 0
##$TDeff= 65536
##$TDoff= 0
##$TI= <>
##$TILT= no
##$TM1= 0
##$TM2= 0
##$TOPLEV= 0
##$USERP1= <user>
##$USERP2= <user>
##$USERP3= <user>
##$USERP4= <user>
##$USERP5= <user>
##$WDW= 1
##$XDIM= 131072
##$YMAX_p= 370450133
##$YMIN_p= -12983
##$CURPLOT= <Network HP LaserJet P1505>
##$CURPRIN= <$Network HP LaserJet P1505>
##$DFORMAT= <normdp>
##$LAYOUT= <+/1D_H.xwp>
##$LFORMAT= <normlp>
##$PFORMAT= <normpl>
##$SURQMSG= 1
$$ End of Bruker specific parameters
$$ ---------------------------------
##NTUPLES= NMR SPECTRUM
##VAR_NAME=  FREQUENCY,     SPECTRUM/REAL,   SPECTRUM/IMAG
##SYMBOL=    X,             R,               I
##VAR_TYPE=  INDEPENDENT,   DEPENDENT,       DEPENDENT
##VAR_FORM=  AFFN,          ASDF,            ASDF
##VAR_DIM=   131072,        131072,          131072
##UNITS=     HZ,            ARBITRARY UNITS, ARBITRARY UNITS
##FACTOR=    0.0627417313425164, 1,          1
##FIRST=     8223.62146879497, -1707,        -52131
##LAST=      0,             -1300,           -52504
##MIN=       0,             -12983,          0
##MAX=       8223.62146879497, 370450133,    0
$$ Real data points
##PAGE= N=1
##DATA TABLE= (X++(R..R)), XYDATA
$$ [...]
$$ plain form
63960 395934 407876 421102 436176 453638 473833 496905 522985 552361 585568 623468 667293
63949 667293 718390 777816 846222 924168 1012364 1111312 1220647 1338969 1464486 1595897 1732482
63938 1732482 1873385 2016964 2160919 2302662 2439191 2566754 2681266 2779406 2859197 2919500
63928 2919500 2959326 2977883 2974941 2950755 2905704 2840370 2755924 2654253 2537804 2409645 2273569
63917 2273569 2133600 1993044 1854052 1718076 1586479 1460673 1342001 1231805 1131332
63908 1131332 1041200 960951 889531 826292 771290 724462 684865 651038 621960 597284 576670
63897 576670 559352 544558 532040 521946 514308 508882 505263 502904 501195 499907 499536 500834 503984
63884 503984 508545 514225 521395 530702 542479 556644 572966 591279 611650 634398 659751 687472
$$ packed form
63960C95934J1942J3226J5074J7462K0195K3072K6080K9376L3207L7900M3825
63949F67293N1097N9426O8406P7946Q8196R8948J09335J18322J25517J31411J36585
63938A732482J40903J43579J43955J41743J36529J27563J14512R8140P9791O0303
63928B919500L9826J8557k942k4186m5051o5334q4446j01671j16449j28159j36076
63917B273569j39969j40556j38992j35976j31597j25806j18672j10196j00473
63908A131332r0132q0249p1420o3239n5002m6828l9597l3827k9078k4676k0614
63897E76670j7318j4794j2518j0094p638n426l619k359j709j288l71J298L150
63884E03984M561N680P170R307J1777J4165J6322J8313K0371K2748K5353K7721
$$ plain form
63872 687472 717158 749001 783715 821393 860793 900209 938837 976869 1014494 1051314 1086652
63861 1086652 1119820 1150004 1176400 1198645 1216678 1229920 1237107 1237368 1231275 1220335 1205534 1186749
63849 1186749 1163539 1135985 1104585 1069749 1031890 991861 950869 909837 869052 828590 788795
63838 788795 750153 712844 676671 641479 607448 574973 544398 515940 489711 465692 443712
63827 443712 423500 404763 387282 371001 355998 342357 330170 319719 311396 305126 299996 294870
63815 294870 289425 284310 280197 277063 274516 272451 271045 270267 269659 268513 266165 262337 257401 252071 246626
63800 246626 240689 234016 227214 221243 216379 212121 208066 204431 201679 199961 198945 197838 195682 192181
63786 192181 188388 186025 185704 186171 185702 184011 182354 181916 182589 183380 183547 183074 182316 181601 181183 181235 181611 181693
$$ packed form
63872F87472K9686L1843L4714L7678L9400L9416L8628L8032L7625L6820L5338
63861A086652L3168L0184K6396K2245J8033J3242P187K61o093j0940j4801j8785
63849A186749k3210k7554l1400l4836l7859m0029m0992m1032m0785m0462l9795
63838G88795l8642l7309l6173l5192l4031l2475l0575k8458k6229k4019k1980
63827D43712k0212j8737j7481j6281j5003j3641j2187j0451q323o270n130n126
63815B94870n445n115m113l134k547k065j406p78o08j146k348l828m936n330n445
63800B46626n937o673o802n971m864m258m055l635k752j718j016j107k156l501
63786A92181l793k363l21M67m69j691j657m38O73P91J67m73p58p15m18N2L76Q2
$$ plain form
63768 181693 180784 178862 176823 175770 176015 176876 177448 177404 177032 176687 176409 176050 175581 175120 174668 173980 172895 171752
63750 171752 171245 171699 172728 173797 174958 176677 179076 181738 184266 186586 188561 189825 190385 191043 192657
63735 192657 195123 197581 199618 201758 204577 207883 211224 214918 219906 226505 233797 240559 246515 252299
63721 252299 258396 264554 270229 275114 278983 281361 281744 280028 276519 271658 266027 260391 255305 250643
63707 250643 245900 241037 236645 233181 230433 227981 225841 224351 223645 223562 223928 224625 225494 226526 228091 230637
63691 230637 234096 237849 241318 244422 247396 250460 253776 257532 261794 266320 270618 274233 276990 279028
63677 279028 280637 282093 283616 285450 287809 290618 293439 295810 297693 299501 301735 304633 307997 311203
63663 311203 313460 314294 313748 311941 308636 303554 297021 289885 282774 275811 269093 262975 257634 252791 248195
$$ packed form
63768A81693r09j922k039j053K45Q61N72m4l72l45k78l59m69m61m52o88j085j143
63750A71752n07M54J029J069J161J719K399K662K528K320J975J264N60O58J614
63735A92657K466K458K037K140K819L306L341L694M988O599P292O762N956N784
63721B52299O097O158N675M885L869K378L83j716l509m861n631n636n086m662
63707B50643m743m863m392l464k748k452k140j490p06q3L66O97Q69J032J565K546
63691B30637L459L753L469L104K974L064L316L756M262M526M298L615K757K038
63677B79028J609J456J523J834K359K809K821K371J883J808K234K898L364L206
63663C11203K257Q34n46j807l305n082o533p136p111o963o718o118n341m843m596
$$ plain form
63648 248195 244093 240866 238492 236763 235838 236102 237497 239408 241318 243265 245586 248433 251685 255169 258890
63633 258890 263079 267978 273508 279280 285078 291136 297779 305013 312850 321794 332507 344982 358476
63620 358476 372342 386577 401558 417680 435397 455112 476761 499807 523854 548960 575165
63609 575165 602029 628841 654871 679136 700270 717096 729166 736492 739070 737132 731645 724028
63597 724028 715381 706293 697252 688690 680508 671864 661589 648832 633465 616109 597656 578592 558969
63584 558969 539169 520235 503020 487341 472532 458570 446005 435075 425709 418350 413743 411685
63572 411685 410913 410713 411866 415324 420687 426768 433249 440840 449980 460246 471159 482887 495891 510328
63558 510328 526035 542809 560586 579630 600653 624477 651415 681247 713930 749976 789666
$$ packed form
63648B48195m102l227k374j729r25K64J395J911J910J947K321K847L252L484L721
63633B58890M189M899N530N772N798O058O643P234P837Q944J0713J2475J3494
63620C58476J3866J4235J4981J6122J7717J9715K1649K3046K4047K5106K6205
63609E75165K6864K6812K6030K4265K1134J6826J2070P326K578j938n487p617
63597G24028q647r088r041q562q182q644j0275j2757j5367j7356j8453j9064j9623
63584E58969j9800j8934j7215j5679j4809j3962j2565j0930r366p359m607k058
63572D11685p72k00J153L458N363O081O481P591R140J0266J0913J1728J3004J4437
63558E10328J5707J6774J7777J9044K1023K3824K6938K9832L2683L6046L9690
$$ plain form
63547 789666 831643 872269 906534 930108 941209 941018 932416 918390 901463 883991 868084 854790
63535 854790 843772 834277 826323 820421 816082 811124 802915 790200 773440 753540 730786 705175 677281
63522 677281 648372 619774 592391 566678 542670 520108 498855 479254 461763 446261 432040
63511 432040 418541 405754 393907 383129 373586 365533 359016 353766 349492 345905 342383 338222 333559
63498 333559 329526 326939 325248 323397 321381 320200 320359 321187 321769 321881 321807 321806 322187 323422 325746 328834 332292
63481 332292 336332 341559 348078 355133 361756 367557 372734 377375 381051 383180 383593 382550 380265 376682
63467 376682 371711 365411 357905 349542 341221 334082 328486 323638 318650 313701 309686 307019 305402 304645
63453 304645 304960 306306 308141 310141 312745 316677 322279 329586 338685 349630 362254 376534 393135
$$ packed form
63547G89666M1977M0626L4265K3574J1101j91q602j4026j6927j7472j5907j3294
63535H54790j1018r495p954n902m339m958q209j2715j6760j9900k2754k5611k7894
63522F77281k8909k8598k7383k5713k4008k2562k1253j9601j7491j5502j4221
63511D32040j3499j2787j1847j0778r543q053o517n250m274l587l522m161m663
63498C33559m033k587j691j851k016j181J59Q28N82J12p4jL81J235K324L088L458
63481C32292M040N227O519P055O623N801N177M641L676K129M13j043k285l583
63467C76682m971o300p506q363q321p139n596m848m988m949m015k667j617p57
63453C04645L15J346J835K000K604L932N602P307R099J0945J2624J4280J6601
$$ plain form
63440 393135 413296 438080 467822 502092 539810 579091 616972 649724 674116 688923 695240 695281
63428 695281 691121 684728 678582 675331 676718 683339 695385 712943 735421 761419 789585 819126 849152
63415 849152 877987 903547 924079 938326 945564 946076 941283 932953 922508 911298 900799 891684 882939
63402 882939 872664 859676 843785 824865 802673 777659 751103 724006 696455 668319 640055
63391 640055 612493 586306 562048 540247 521037 503980 488663 475262 464206 455574 449193 445059
63379 445059 443189 443200 444565 447281 451818 458337 466308 475055 484359 494373 505267 517274 530925 546937
63365 546937 565774 587458 611772 638480 667266 697619 728937 760747 792714 824342 854670
63354 854670 882292 905701 923687 935521 940961 940263 934306 924694 913455 902291 891838 881624
$$ packed form
63440C93135K0161K4784K9742L4270L7718L9281L7881L2752K4392J4807O317M1
63428F95281m160o393o146l251J387O621J2046J7558K2478K5998K8166K9541L0026
63415H49152K8835K5560K0532J4247P238N12m793q330j0445j1210j0499r115q745
63402H82939j0275j2988j5891j8920k2192k5014k6556k7097k7551k8136k8264
63391F40055k7562k6187k4258k1801j9210j7057j5317j3401j1056q632o381m134
63379D45059j870J1J365K716M537O519P971Q747R304J0014J0894J2007J3651J6012
63365E46937J8837K1684K4314K6708K8786L0353L1318L1810L1967L1628L0328
63354H54670K7622K3409J7986J1834N440o98n957r612j1239j1164j0453j0214
$$ plain form
63342 881624 870863 859249 846893 833508 817919 798672 775255 748701 720922 693432 666669
63331 666669 640470 615102 591743 571974 556801 546193 539525 536393 536779 540206 544696 546904 543696
63318 543696 533850 518349 499222 478286 456847 436026 416913 400295 386335 374594 364403 355359
63306 355359 347510 340976 335468 330317 325027 319602 314293 309257 304621 300585 297197 294180 291274 288668
63292 288668 286760 285501 284253 282409 279955 277379 275187 273598 272521 271703 270943 270220 269518 268610 267195
63277 267195 265281 263201 261199 259210 257238 255727 255225 255673 256299 256392 256067 256145 257240 259105 260891 261985
63261 261985 262476 262848 263418 264225 265347 267068 269653 273042 276825 280521 283863 286923 289969 293198 296644
63246 296644 300402 304854 310533 317730 326309 335903 346179 356931 368102 379773 392043 404851 418052
$$ packed form
63342H81624j0761j1614j2356j3385j5589j9247k3417k6554k7779k7490k6763
63331F66669k6199k5368k3359j9769j5173j0608o668l132L86L427M490K208l208
63318E43696r846j5501j9127k0936k1439k0821j9113j6618j3960j1741j0191r044
63306C55359p849o534n508n151n290n425n309n036m636m036l388l017k906k606
63292B88668j908j259j248j844k454k576k192j589j077q18p60p23p02r08j415
63277B67195j914k080k002j989j972j511n02M48O26R3l25P8J095J865J786J094
63261B61985M91L72N70Q07J122J721K585L389L783L696L342L060L046L229L446
63246B96644L758M452N679P197Q579R594J0276J0752J1171J1671J2270J2808J3201
$$ plain form
63233 418052 431691 446023 461121 476540 491622 506094 520211 534304 548343 562073 575426
63222 575426 588596 601716 614679 627414 640144 653064 665716 676899 685385 690582 692360 690405
63210 690405 684102 673210 658458 641332 623285 605093 586789 568105 549084 530436 513306 498666
63198 498666 486947 478239 472664 470322 470879 473448 477124 481710 487817 496147 506725 518909 532139
63185 532139 546448 562126 579106 596884 614968 633102 651084 668663 685779 702634 719289
63174 719289 735357 750268 763821 776256 787805 798273 806919 812541 813731 809398 799299 784093
63162 784093 764857 742501 717510 690034 660270 628998 597747 568230 541407 517151 494878
63151 494878 474316 455597 438864 424090 411156 399797 389511 379800 370608 362291 355088 348853
$$ packed form
63233D18052J3639J4332J5098J5419J5082J4472J4117J4093J4039J3730J3353
63222E75426J3170J3120J2963J2735J2730J2920J2652J1183Q486N197J778j955
63210F90405o303j0892j4752j7126j8047j8192j8304j8684j9021j8648j7130j4640
63198D98666j1719q708n575k342N57K569L676M586O107Q330J0578J2184J3230
63185E32139J4309J5678J6980J7778J8084J8134J7982J7579J7116J6855J6655
63174G19289J6068J4911J3553J2435J1549J0468Q646N622J190m333j0099j5206
63162G84093j9236k2356k4991k7476k9764l1272l1251k9517k6823k4256k2273
63151D94878k0562j8719j6733j4774j2934j1359j0286r711r192q317p203o235
$$ plain form
63139 348853 343422 338930 335472 332624 329675 326330 322964 320146 318088 316605 315369 314206 313277 313000 313618
63124 313618 314851 316161 317388 318801 320516 322248 323827 325548 327654 329840 331750 333875 337323 342595
63110 342595 348947 355082 360195 364283 367878 371688 376207 381362 386655 391800 397014 402539 408133 413311
63096 413311 417837 421688 424689 426625 427654 428233 428564 428454 427780 426783 425714 424417 422507 419856 416724
63081 416724 413507 410465 407735 405565 404509 405219 407782 411296 414508 417097 420127 424964 431928 440246
63067 440246 449204 458900 469840 482237 495908 510618 526218 542546 559554 577592 597439 619890
63055 619890 645320 673569 704062 735957 768333 800507 832312 863983 895769 927749 960076
63044 960076 993164 1027333 1062293 1097317 1132034 1166799 1202135 1237999 1273818 1308925 1342506
$$ packed form
63139C48853n431m492l458k848k949l345l366k818k058j483j236j163r29k77O18
63124C13618J233J310J227J413J715J732J579J721K106K186J910K125L448N272
63110C42595O352O135N113M088L595L810M519N155N293N145N214N525N594N178
63096D13311M526L851L001J936J029N79L31j10o74r97j069j297j910k651l132
63081D16724l217l042k730k170j056P10K563L514L212K589L030M837O964Q318
63067D40246Q958R696J0940J2397J3671J4710J5600J6328J7008J8038J9847K2451
63055F19890K5430K8249L0493L1895L2376L2174L1805L1671L1786L1980L2327
63044I60076L3088L4169L4960L5024L4717L4765L5336L5864L5819L5107L3581
$$ plain form
63033 1342506 1373207 1399263 1419215 1432325 1438267 1436822 1428017 1412212 1389798 1361049 1326575 1287700
63021 1287700 1246107 1203200 1160149 1118384 1079600 1045130 1015540 990895 971181 956326 946101
63010 946101 940234 938647 941496 949010 961273 978030 998606 1022037 1047376 1073980 1101598 1130241
62998 1130241 1159874 1190103 1220250 1249812 1278826 1307679 1336652 1365666 1394255 1421488 1446005
62987 1446005 1466380 1481477 1490426 1492442 1487006 1474103 1453862 1426005 1390168 1346959 1298344 1246647
62975 1246647 1193348 1138946 1083707 1028313 974000 922318 874574 831175 791614 755261 722061
62964 722061 692275 665795 642083 620733 601744 585123 570483 557139 544516 532404 520907
62953 520907 510199 500315 491130 482517 474370 466400 458093 449045 439426 430015 421742 415035 409465 404007
$$ packed form
63033A342506L0701K6056J9952J3110N942j445q805j5805k2414k8749l4474l8875
63021A287700m1593m2907m3051m1765l8784l4470k9590k4645j9714j4855j0225
63010I46101n867j587K849P514J2263J6757K0576K3431K5339K6604K7618K8643
62998A130241K9633L0229L0147K9562K9014K8853K8973K9014K8589K7233K4517
62987A446005K0375J5097Q949K016n436j2903k0241k7857l5837m3209m8615n1697
62975A246647n3299n4402n5239n5394n4313n1682m7744m3399l9561l6353l3200
62964G22061k9786k6480k3712k1350j8989j6621j4640j3344j2623j2112j1497
62953E20907j0708r884r185q613q147p970q307r048r619r411q273o707n570n458
$$ plain form
62939 404007 397912 391418 385424 380377 375731 370644 364954 359212 353922 349130 344746 340900 337839 335525
62925 335525 333445 330911 327693 324371 321844 320408 319571 318871 318497 318798 319521 320037 320174 320294 320584 320751 320612
62908 320612 320567 321250 322894 325182 327570 329661 331431 333165 335119 337248 339389 341628 344199 347013 349593
62893 349593 351585 353126 354535 355803 356542 356388 355399 354063 352885 351868 350466 348184 345193 342205 339806
62878 339806 338109 337005 336414 336211 336110 335852 335446 335161 335190 335295 334829 333373 331442 330184 330089 330298 329636 328154
62860 328154 327067 327210 328092 328593 328108 326834 325428 324658 325007 326289 327871 329450 331340 333795 336429 338609
62844 338609 340157 341332 342334 343189 343979 344835 345728 346540 347350 348374 349605 350672 351244 351540 352327 354231
62828 354231 356952 359421 361005 362346 364583 367810 370917 373037 374527 376146 377809 378717 378490 377670 377174
$$ packed form
62939D04007o095o494n994n047m646n087n690n742n290m792m384l846l061k314
62925C35525k080k534l218l322k527j436q37p00l74L01P23N16J37J20K90J67j39
62908C20612m5O83J644K288K388K091J770J734J954K129K141K239K571K814K580
62893C49593J992J541J409J268P39j54r89j336j178j017j402k282k991k988k399
62878C39806j697j104n91k03j01k58m06k85K9J05m66j456j931j258r5K09o62j482
62860C28154j087J43Q82N01m85j274j406p70L49J282J582J579J890K455K634K180
62844C38609J548J175J002Q55P90Q56Q93Q12Q10J024J231J067N72K96P87J904
62828C54231K721K469J584J341K237L227L107K120J490J619J663R08k27q20m96
$$ plain form
62813 377174 377587 378939 380897 383218 386127 390081 395052 400381 405547 410734 416322 422268 428479 435457
62799 435457 443902 453773 464298 474887 485549 496525 508155 521186 536554 554542 574628 596492
62787 596492 620885 649153 682082 719433 760456 804613 851887 902553 956623 1013403 1071538
62776 1071538 1129391 1185321 1237791 1285519 1327504 1362598 1389129 1405333 1410346 1404593 1389162 1365071
62764 1365071 1333210 1294605 1250434 1201948 1150560 1097834 1045138 993321 942883 894275 847889
62753 847889 803885 762309 723438 687796 655739 627061 601090 577172 555008 534593 515940
62742 515940 499068 484187 471622 461371 452866 445330 438307 431744 425763 420575 416491 413681 411970
62729 411970 411084 411016 411885 413574 415841 418709 422258 426120 429820 433845 439727 448535 459625 471412 483208
$$ packed form
62813C77174M13J352J958K321K909L954M971N329N166N187N588N946O211O978
62799D35457Q445R871J0525J0589J0662J0976J1630J3031J5368J7988K0086K1864
62787E96492K4393K8268L2929L7351M1023M4157M7274N0666N4070N6780N8135
62776A071538N7853N5930N2470M7728M1985L5094K6531J6204N013n753j5431k4091
62764A365071l1861l8605m4171m8486n1388n2726n2696n1817n0438m8608m6386
62753H47889m4004m1576l8871l5642l2057k8678k5971k3918k2164k0415j8653
62742E15940j6872j4881j2565j0251q505p536p023o563n981n188m084k810j711
62729D11970q86o8Q69J689K267K868L549L862L700M025N882Q808J1090J1787J1796
$$ plain form
62714 483208 495804 510358 527296 546413 567529 590701 616038 643742 674381 708878 747997
62703 747997 791782 839553 890551 944629 1002212 1063513 1127759 1193199 1257833 1320094 1378863
62692 1378863 1432916 1480431 1519187 1547359 1564087 1569133 1562177 1542798 1511331 1469416 1419381 1363136
62680 1363136 1301996 1237471 1171764 1107074 1044582 984454 926852 872572 822476 776572 734112
62669 734112 694590 658292 625782 597161 572031 549826 529867 511387 494029 478265 464897
62658 464897 454016 444763 436172 427927 420207 413157 406720 400754 395065 389472 384017 378940 374329 369961
62644 369961 365651 361610 358309 356099 355020 354799 354900 354816 354489 354231 354120 353745 352804 351671 350982 350815 350677
62627 350677 350228 349633 349192 349069 349501 350900 353450 356731 359958 362557 364513 366276 368431 371361 375161
$$ packed form
62714D83208J2596J4554J6938J9117K1116K3172K5337K7704L0639L4497L9119
62703G47997M3785M7771N0998N4078N7583O1301O4246O5440O4634O2261N8769
62692A378863N4053M7515L8756K8172J6728N046o956j9379l1467m1915n0035n6245
62680A363136o1140o4525o5707o4690o2492o0128n7602n4280n0096m5904m2460
62669G34112l9522l6298l2510k8621k5130k2205j9959j8480j7358j5764j3368
62658D64897j0881r253q591q245p720p050o437n966n689n593n455n077m611m368
62644C69961m310m041l301k210j079k21J01q4l27k58j11l75r41j133o89j67j38
62627C50677m49n95m41j23M32J399K550L281L227K599J956J763K155K930L800
$$ plain form
62612 375161 379803 385269 391413 397889 404506 411576 419592 428578 438156 448345 459923 473751 490037
62599 490037 508528 529105 551766 576239 602059 628981 656807 684716 711242 735119 755785
62588 755785 772803 785285 792387 794180 791466 784700 773600 757973 738490 716370 692586 667678
62576 667678 642090 616240 590346 564533 539196 514973 492367 471615 452940 436555 422312
62565 422312 409645 398131 387932 379424 372471 366369 360495 354830 349765 345557 342045 338839 335735
62552 335735 332979 331061 330157 329793 329181 327977 326561 325536 325079 324999 325307 326421 328615 331517 334441 337170
62536 337170 340069 343389 346856 350186 353742 358280 364139 371014 378515 386625 395558 405460 416369 428348
62522 428348 441611 456745 474743 496447 521828 550060 580392 612601 646538 681680 717388
$$ packed form
62612C75161M642N466O144O476O617P070Q016Q986R578J0189J1578J3828J6286
62599D90037J8491K0577K2661K4473K5820K6922K7826K7909K6526K3877K0666
62588G55785J7018J2482P102J793k714o766j1100j5627j9483k2120k3784k4908
62576F67678k5588k5850k5894k5813k5337k4223k2606k0752j8675j6385j4243
62565D22312j2667j1514j0199q508o953o102n874n665n065m208l512l206l104
62552C35735k756j918r04l64o12j204j416j025m57q0L08J114K194K902K924K729
62536C37170K899L320L467L330L556M538N859O875P501Q110Q933R902J0909J1979
62522D28348J3263J5134J7998K1704K5381K8232L0332L2209L3937L5142L5708
$$ plain form
62511 717388 753132 788032 820552 849227 873433 892930 906862 913939 913600 906367 892993 874019
62499 874019 850415 823856 795723 766257 735313 703679 673042 644738 619080 595868 575037
62488 575037 556684 540920 527882 517568 509507 502886 497245 492876 490414 490160 491849 494814 498150
62475 498150 500967 502792 503718 504027 503732 502643 500766 498324 495270 490928 484376 475348 464756 454047
62461 454047 443898 433648 422308 409937 397591 385962 374776 363810 353812 345718 339301 333424
62449 333424 327529 322121 317695 313960 310508 307616 305938 305745 306805 308635 310474 311463 311402 311078 311326 311961
62433 311961 312234 312154 312594 313962 315440 315871 315000 313560 312448 312088 312267 312282 311397 309465 307066 304934 303397
62416 303397 302435 302001 302018 302157 301911 300908 299160 297135 295626 295264 295933 296848 297389 297695 298238 299088 299951 300788
$$ packed form
62511G17388L5744L4900L2520K8675K4206J9497J3932P077l39p233j3374j8974
62499H74019k3604k6559k8133k9466l0944l1634l0637k8304k5658k3212k0831
62488E75037j8353j5764j3038j0314q061o621n641m369k462k54J689K965L336
62475D98150K817J825R26L09k95j089j877k442l054m342o552r028j0592j0709
62461D54047j0149j0250j1340j2371j2346j1629j1186j0966r998q094o417n877
62449C33424n895n408m426l735l452k892j678j93J060J830J839R89o1l24K48O35
62433C11961K73q0M40J368J478M31q71j440j112l60J79J5q85j932k399k132j537
62416C03397r62m34J7J39k46j003j748k025j509l62O69R15N41L06N43Q50Q63Q37
$$ plain form
62398 300788 301929 303531 305329 307093 309007 311310 313754 315779 317247 318778 321202 324746 328882 332898
62384 332898 336520 339921 343323 346838 350682 355341 361382 369080 378252 388333 398655 408862 419187
62371 419187 430199 442213 455177 469180 484782 502525 522307 543669 566665 592087 620800
62360 620800 653156 689135 728677 771682 817889 866899 918016 969758 1019775 1065630 1105654
62349 1105654 1138960 1164925 1183109 1193548 1196621 1192570 1181588 1164422 1142271 1115748 1084435 1048024
62337 1048024 1007641 965499 923366 881985 841884 804017 769292 737927 709652 684169 661129
62326 661129 640042 620666 603290 588234 575180 563310 551957 540776 529449 517681 505484
62315 505484 493080 480555 467984 455881 444988 435451 426619 417885 409395 401706 395074 389345 384315
$$ packed form
62398C00788J141J602J798J764J914K303K444K025J468J531K424L544M136M016
62384C32898L622L401L402L515L844M659O041P698R172J0081J0322J0207J0325
62371D19187J1012J2014J2964J4003J5602J7743J9782K1362K2996K5422K8713
62360F20800L2356L5979L9542M3005M6207M9010N1117N1742N0017M5855M0024
62349A105654L3306K5965J8184J0439L073m051j0982j7166k2151k6523l1313l6411
62337A048024m0383m2142m2133m1381m0101l7867l4725l1365k8275k5483k3040
62326F61129k1087j9376j7376j5056j3054j1870j1353j1181j1327j1768j2197
62315E05484j2404j2525j2571j2103j0893r537q832q734q490p689o632n729n030
$$ plain form
62302 384315 379862 375801 371949 368375 365420 363417 362385 361969 361740 361669 362218 363725 365773 367559 368926
62287 368926 370603 373224 376539 379924 383330 387282 392112 397592 403238 408602 413323 417329 421139 425681
62273 425681 431581 438667 446218 453672 461194 469701 480274 493450 509104 527063 547591 571124 597803
62260 597803 627658 661156 699096 741879 789189 840436 895074 952052 1009105 1062991 1110661
62249 1110661 1150263 1181120 1202978 1215522 1218706 1213348 1200999 1182965 1159525 1130265 1095092 1054745
62237 1054745 1010394 963067 913707 863617 814548 768121 725157 685665 649471 616658 587303
62226 587303 561038 537318 516048 497528 481658 467626 454640 442641 431927 422380 413538 405267
62214 405267 397914 391709 386411 381588 377005 372663 368712 365411 363018 361646 361267 361682 362334 362471 361927
$$ packed form
62302C84315m453m061l852l574k955k003j032m16k29p1N49J507K048J786J367
62287C68926J677K621L315L385L406L952M830N480N646N364M721M006L810M542
62273D25681N900P086P551P454P522Q507J0573J3176J5654J7959K0528K3533K6679
62260E97803K9855L3498L7940M2783M7310N1247N4638N6978N7053N3886M7670
62249A110661L9602L0857K1858J2544L184n358j2349j8034k3440k9260l5173m0347
62237A054745m4351m7327m9360n0090m9069m6427m2964l9492l6194l2813k9355
62226E87303k6265k3720k1270j8520j5870j4032j2986j1999j0714r547q842q271
62214D05267p353o205n298m823m583m342l951l301k393j372l79M15O52J37n44
$$ plain form
62199 361927 361655 362939 366037 370073 374343 379224 385504 393343 402384 412544 424103 437050 450825
62186 450825 464861 479079 493686 508660 523560 537735 550606 561812 571172 578541 583769 586967
62174 586967 588921 591117 595189 602248 612763 626992 645315 668034 695017 725785 759825 796518
62162 796518 834718 872689 908556 940606 967157 986724 998786 1004185 1004251 999601 990165 976175 958396
62149 958396 937180 911949 882220 848883 813942 778989 744385 710077 676781 645976 618803
62138 618803 595397 575355 558523 544996 534547 526571 520732 517250 516265 517088 518440 519404 520014 521027
62124 521027 523379 527730 534207 542442 551873 561963 572198 582182 591953 601904 612073 621784 630362
62111 630362 638033 645599 653358 660884 667846 674415 680728 686539 691687 696466 701194 705774 710045 714272
$$ packed form
62199C61927k72J284L098M036M270M881O280P839R041J0160J1559J2947J3775
62186D50825J4036J4218J4607J4974J4900J4175J2871J1206R360P369N228L198
62174E86967J954K196M072P059J0515J4229J8323K2719K6983L0768L4040L6693
62162G96518L8200L7971L5867L2050K6551J9567J2062N399O6m650r436j3990j7779
62149I58396k1216k5231k9729l3337l4941l4953l4604l4308l3296l0805k7173
62138F18803k3406k0042j6832j3527j0449p976n839l482r85Q23J352R64O10J013
62124E21027K352M351O477Q235R431J0090J0235R984R771R951J0169R711Q578
62111F30362P671P566P759P526O962O569O313N811N148M779M728M580M271M227
$$ plain form
62097 714272 718873 723767 728368 732155 735080 737467 739750 742215 744887 747731 751065 755629 762066 770439
62083 770439 780363 791509 803871 817667 833113 850253 868949 889159 911242 935735 962678 991288
62071 991288 1020391 1048999 1076437 1102241 1126279 1148867 1170544 1191650 1212157 1231741 1249881
62060 1249881 1266002 1279641 1290400 1297642 1300459 1298218 1291178 1280517 1267631 1253283 1237201 1218468
62048 1218468 1196393 1171022 1142798 1111921 1078352 1042315 1004476 965650 926727 888845 853055
62037 853055 819573 787755 757046 727675 700305 675426 653298 633926 616708 600595 585114
62026 585114 570939 558985 549244 540950 533579 527037 521027 514869 508005 500230 491482 481923 472232 463318
62012 463318 455700 449531 445146 443045 443214 445023 448013 452377 458447 466079 474839 484424 494600 504868
$$ packed form
62097G14272M601M894M601L787K925K387K283K465K672K844L334M564O437Q373
62083G70439R924J1146J2362J3796J5446J7140J8696K0210K2083K4493K6943K8610
62071I91288K9103K8608K7438K5804K4038K2588K1677K1106K0507J9584J8140
62060A249881J6121J3639J0759P242K817k241p040j0661j2886j4348j6082j8733
62048A218468k2075k5371k8224l0877l3569l6037l7839l8826l8923l7882l5790
62037H53055l3482l1818l0709k9371k7370k4879k2128j9372j7218j6113j5481
62026E85114j4175j1954r741q294p371o542o010o158o864p775q748r559r691q914
62012D63318p618o169m385k101J69J809K990M364O070P632Q760R585J0176J0268
$$ plain form
61998 504868 514487 522756 529103 533074 534436 533286 530011 525196 519473 513163 505998 497432 487348 476309
61984 476309 465027 453893 443132 433144 424342 416791 410239 404483 399533 395397 391878 388624 385388
61971 385388 382255 379558 377444 375609 373651 371729 370555 370539 371213 371798 372145 372746 373846 375026 375901 376914
61955 376914 379006 382563 387057 391842 396999 403163 410727 419657 430073 442588 457767 475482 495087
61942 495087 516223 539123 564135 591172 619850 650044 682035 715963 751211 786504 820641
61931 820641 852983 883210 910970 936031 958550 978657 995712 1008422 1015842 1017928 1015025 1007339
61919 1007339 995329 980270 963967 947995 933506 921555 913143 908939 909240 914174 923729 937731
61907 937731 955967 978108 1003124 1028949 1053159 1074005 1090521 1101937 1107519 1106942 1100235 1087279
$$ packed form
61998E04868R619Q269O347L971J362j150l275m815n723o310p165q566j0084j1039
61984D76309j1282j1134j0761r988q802p551o552n756m950m136l519l254l236
61971C85388l133k697k114j835j958j922j174j6O74N85L47O01J100J180Q75J013
61955C76914K092L557M494M785N157O164P564Q930J0416J2515J5179J7715J9605
61942D95087K1136K2900K5012K7037K8678L0194L1991L3928L5248L5293L4137
61931H20641L2342L0227K7760K5061K2519K0107J7055J2710P420K086k903p686
61919A007339j2010j5059j6303j5972j4489j1951q412m204L01M934R555J4002
61907I37731J8236K2141K5016K5825K4210K0846J6516J1416N582n77o707j2956
$$ plain form
61895 1087279 1067919 1042768 1013431 981662 948568 914732 880722 847161 814610 783670 755023
61884 755023 729079 705649 684127 663906 644551 625818 607679 590326 574063 559219 546083
61873 546083 534784 525282 517579 511783 507743 504887 502906 502431 504464 509087 515324 522387 530476 540221
61859 540221 552035 566492 584709 607624 635118 666403 701096 739468 781702 827439 876065
61848 876065 927065 980042 1034543 1089807 1144384 1196073 1242513 1281924 1313293 1336110 1350236
61837 1350236 1355943 1353791 1344474 1328930 1308583 1285427 1262000 1241224 1225761 1217091 1215355 1220238
61825 1220238 1231617 1248978 1270648 1294231 1317592 1338860 1355697 1365438 1366134 1356904 1337247 1306821
61813 1306821 1266263 1217596 1163297 1105347 1045537 986102 929187 875702 825314 777703 733349
$$ packed form
61895A087279j9360k5151k9337l1769l3094l3836l4010l3561l2551l0940k8647
61884G55023k5944k3430k1522k0221j9355j8733j8139j7353j6263j4844j3136
61873E46083j1299r502p703n796m040k856j981m75K033M623O237P063Q089R745
61859E40221J1814J4457J8217K2915K7494L1285L4693L8372M2234M5737M8626
61848H76065N1000N2977N4501N5264N4577N1689M6440L9411L1369K2817J4126
61837A350236N707k152r317j5544k0347k3156k3427k0776j5463q670j736M883
61825A220238J1379J7361K1670K3583K3361K1268J6837R741O96r230j9657l0426
61813A306821m0558m8667n4299n7950n9810n9435n6915n3485n0388m7611m4354
$$ plain form
61802 733349 692995 656791 624318 595258 569660 547550 528563 512083 497683 485272 474833
61791 474833 466183 459096 453460 449111 445535 442040 438274 434383 430589 426849 423127 419734 417036 414873
61777 414873 412538 409446 405649 401660 397967 394768 391995 389431 386900 384449 382282 380436 378612 376452
61763 376452 373916 371287 368909 367060 365963 365690 366030 366626 367264 367864 368266 368287 367995 367625 367151 366309 365171
61746 365171 364285 363934 363620 362760 361615 361040 361414 362360 363450 364584 365650 366440 367193 368678 371369 374872
61730 374872 378488 382051 385890 390271 395215 400668 406453 412162 417387 422055 426424 430932 436125 442356
61716 442356 449248 455780 461240 465826 470013 473728 476647 478911 480794 481785 480776 477304 472034 465944
61702 465944 459645 453689 448813 445339 442727 440215 437748 435943 435291 435675 436515 437135 437095 436390 435330 434205
$$ packed form
61802G33349m0354l6204l2473k9060k5598k2110j8987j6480j4400j2411j0439
61791D74833q650p087n636m349l576l495l766l891l794l740l722l393k698k163
61777D14873k335l092l797l989l693l199k773k564k531k451k167j846j824k160
61763C76452k536k629k378j849j097k73L40N96O38O00M02K1k92l70m74q42j138
61746C65171q86l51l14q60j145n75L74R46J090J134J066P90P53J485K691L503
61730C74872L616L563L839M381M944N453N785N709N225M668M369M508N193O231
61716D42356O892O532N460M586M187L715K919K264J883R91j009l472n270o090
61702D65944o299n956m876l474k612k512k467j805o52L84Q40O20m0p05j060j125
$$ plain form
61686 434205 433201 432663 433100 434651 436745 438524 439511 439770 439576 439118 438383 437174 435379 433259 431245 429348
61670 429348 427199 424839 423049 422401 422305 421600 420038 418631 418427 419370 420487 420833 420081 418538 416834 415480
61654 415480 414546 413815 413222 412936 413064 413606 414798 417126 420799 425479 430788 436798 443670 450992 457853 463568
61638 463568 468037 471394 473614 474536 474004 471880 468111 462968 457156 451516 446564 442260 438166 433898 429597
61623 429597 426050 424173 424308 426060 428794 432143 436006 440314 444980 449897 454751 458898 461635 462561 461535
61608 461535 458409 453134 446161 438362 430357 422104 413300 403997 394616 385545 377032 369399 362975 357729
61594 357729 353207 349010 345146 341767 338752 335771 332710 329801 327293 325167 323242 321453 319905 318638
61580 318638 317418 315807 313550 310958 308815 307699 307364 307010 306297 305866 306575 308352 310156 311135 311451 311769
$$ packed form
61686D34205j004n38M37J551K094J779R87K59j94m58p35j209j795k120k014j897
61670D29348k149k360j790o48r6p05j562j407k04R43J117L46p52j543j704j354
61654D15480r34p31n93k86J28N42J192K328L673M680N309O010O872P322O861N715
61638D63568M469L357K220R22n32k124l769n143n812n640m952m304m094m268m301
61623D29597l547j877J35J752K734L349L863M308M666M917M854M147K737R26j026
61608D61535l126n275o973p799q005q253q804r303r381r071q513p633o424n246
61594C57729m522m197l864l379l015k981l061k909k508k126j925j789j548j267
61580C18638j220j611k257k592k143j116l35l54p13m31P09J777J804R79L16L18
$$ plain form
61564 311769 312244 312360 311622 310050 308002 305847 303936 302611 301983 301778 301544 301028 300306 299581 298889 297975 296523
61547 296523 294584 292720 291528 291084 291025 291093 291276 291380 290865 289419 287450 285782 285026 285463 287266 290362 294127
61530 294127 297645 300392 302387 303613 303664 302163 299298 295660 291605 287013 281726 276144 271218 267754 265655
61515 265655 263982 261874 259334 257021 255422 254423 253542 252302 250465 248262 246387 245396 245076 244761 244308 244168
61499 244168 244318 243815 241994 239616 238066 237613 237272 236373 235398 235027 235132 235238 235375 235810 236309 236403 236278 236725
61481 236725 238089 239794 241096 241861 242340 242575 242405 241904 241486 241550 242216 243369 244853 246598 248578 250573
61465 250573 252088 252739 252772 252858 253181 253044 251746 249687 248176 248132 249331 250965 252497 253797 254760 255285 255616
61448 255616 256379 258039 260349 262434 263550 263799 264058 265102 266877 268711 270192 271656 273880 277421 282269
$$ packed form
61564C11769M75J16p38j572k048k155j911j325o28k05k34n16p22p25o92r14j452
61547B96523j939j864j192m44n9O8J83J04n15j446j969j668p56M37J803L096L765
61530B94127L518K747J995J226N1j501k865l638m055m592n287n582m926l464k099
61515B65655j673k108k540k313j599r99q81j240j837k203j875r91l20l15m53j40
61499B44168J50n03j821k378j550m53l41q99r75l71J05J06J37M35M99R4j25M47
61481B36725J364J705J302P65M79K35j70n01m18O4O66J153J484J745J980J995
61465B50573J515O51L3Q6L23j37j298k059j511m4J199J634J532J300R63N25L31
61448B55616P63J660K310K085J116K49K59J044J775J834J481J464K224L541M848
$$ plain form
61433 282269 287866 293376 298127 301979 305249 308259 311021 313295 314797 315330 314947 314090 313341 312953 312841 313089
61417 313089 314148 316275 319059 321846 324448 327099 329785 331970 333049 332765 331177 328517 325164 321507
61403 321507 317674 313551 309157 304802 300746 296890 292997 289112 285489 282195 279005 275837 273078 271303
61389 271303 270648 270612 270514 270062 269439 268945 268674 268464 268060 267371 266715 266700 267607 268906 269696 269732 269767 270646 272359 274220
61369 274220 275818 277408 279434 281971 284715 287269 289399 291127 292667 294220 295826 297477 299341 301768
61355 301768 305202 310091 316628 324385 332413 340060 347630 355963 365448 375736 386273 396707 406719
61342 406719 415914 424051 431156 437278 442364 446490 450024 453440 457076 460999 464840 467814 469291 469373 468569
61327 468569 466836 463525 458489 452709 447387 442765 438241 433363 428208 423049 418225 414266 411565 409834
$$ packed form
61433B82269N597N510M751L852L270L010K762K274J502N33l83q57p49l88j12K48
61417C13089J059K127K784K787K602K651K686K185J079k84j588k660l353l657
61403C21507l833m123m394m355m056l856l893l885l623l294l190l168k759j775
61389B71303o55l6r8m52o23m94k71k10m04o89o56j5R07J299P90L6L5Q79J713J861
61369B74220J598J590K026K537K744K554K130J728J540J553J606J651J864K427
61355C01768L434M889O537P757Q028P647P570Q333R485J0288J0537J0434J0012
61342D06719R195Q137P105O122N086M126L534L416L636L923L841K974J477Q2q04
61327D68569j733l311n036n780n322m622m524m878n155n159m824l959k701j731
$$ plain form
61313 409834 408306 406574 404859 403432 402240 401338 401274 402698 405742 410021 415082 420647 426521 432473 438115
61298 438115 442740 445417 445540 443366 439889 436092 432307 428226 423438 417998 412517 407717 403882 400836
61284 400836 398426 396808 396119 396085 396279 396717 397845 399895 402549 405401 408482 412071 416216 420768 425784
61269 425784 431500 437870 444424 450721 456755 462826 469230 476110 483433 490996 498758 507265 517389 529394
61255 529394 542496 555676 568633 581505 593825 604419 612497 618399 622967 626447 628344 628199 626176
61242 626176 622779 618184 612074 604239 595176 585838 576791 567977 559434 551675 544893 538243 530694 522509
61228 522509 515150 509677 505948 503461 502043 501315 500414 499006 497925 497948 498367 497749 495947 494393 494319 495571
61212 495571 497327 499178 501026 502599 503645 504260 504612 504566 503981 503107 502393 502150 502780 505072 509723 516594
$$ packed form
61313D09834j528j732j715j427j192r02o4J424L044M279N061N565N874N952N642
61298D38115M625K677J23k174l477l797l785m081m788n440n481m800l835l046
61284D00836k410j618o89l4J94M38J128K050K654K852L081L589M145M552N016
61269D25784N716O370O554O297O034O071O404O880P323P563P762Q507J0124J2005
61255E29394J3102J3180J2957J2872J2320J0594Q078N902M568L480J897j45k023
61242F26176l397m595o110p835r063r338r047q814q543p759o782o650p549q185
61228E22509p359n473l729k487j418p28r01j408j081K3M19o18j802j554p4J252
61212D95571J756J851J848J573J046O15L52m6n85q74p14k43O30K292M651O871
$$ plain form
61196 516594 524944 534441 545533 558660 573536 589516 606394 624316 642918 660957 677094 690869
61184 690869 702699 713079 722183 730256 737937 745806 753748 761078 767241 772101 775582 777435 777548 776270
61170 776270 774134 771312 767477 762173 755291 747244 738714 730048 720849 710271 697859 684037 669695
61157 669695 655485 641676 628502 616323 605421 595895 587827 581345 576453 572908 570410 568776 567769
61144 567769 566864 565356 562677 558547 552870 545696 537334 528309 519093 509976 501279 493538 487326 482911
61130 482911 480217 479076 479359 480939 483741 487889 493630 501065 510025 520307 531891 544903 559441
61117 559441 575522 593105 612143 632627 654507 677417 700597 723396 745810 768169 790281
61106 790281 811356 831000 849721 867979 885172 900211 912843 923619 932527 938450 940268 937911
$$ packed form
61196E16594Q350R497J1092J3127J4876J5980J6878J7922J8602J8039J6137J3775
61184F90869J1830J0380R104Q073P681P869P942P330O163M860L481J853J13j278
61170G76270k136k822l835n304o882q047q530q666r199j0578j2412j3822j4342
61157F69695j4210j3809j3174j2179j0902r526q068o482m892l545k498j634j007
61144E67769r05j508k679m130n677p174q362r025r216r117q697p741o212m415
61130D82911k694j141K83J580K802M148N741P435Q960J0282J1584J3012J4538
61117E59441J6081J7583J9038K0484K1880K2910K3180K2799K2414K2359K2112
61106G90281K1075J9644J8721J8258J7193J5039J2632J0776Q908N923J818k357
$$ plain form
61094 937911 931978 922849 910678 895889 879075 860537 840467 819495 798512 777785 756721 734801
61082 734801 712558 691333 672064 654464 637391 619953 602245 585052 568933 553767 539221
61071 539221 525441 513009 502287 493094 485081 478175 472465 467815 463864 460417 457654 455900 455335 456011
61057 456011 457993 461279 465601 470485 475615 481033 486973 493620 501149 509796 519645 530481 542097 554705
61043 554705 568701 583987 599921 616161 633209 651768 671775 692474 713399 734864 757451
61032 757451 781416 806804 833743 862246 891904 922248 953643 987664 1026520 1072252 1126640
61021 1126640 1191806 1270644 1366515 1482751 1622808 1790927 1992444 2233330 2519089 2851740
61011 2851740 3222983 3605775 3953340 4213704 4354731 4381468 4331715 4255123 4194011 4175644
$$ packed form
61094I37911n933r129j2171j4789j6814j8538k0070k0972k0983k0727k1064k1920
61082G34801k2243k1225j9269j7600j7073j7438j7708j7193j6119j5166j4546
61071E39221j3780j2432j0722r193q013o906n710m650l951l447k763j754n65O76
61057D56011J982L286M322M884N130N418N940O647P529Q647R849J0836J1616J2608
61043E54705J3996J5286J5934J6240J7048J8559K0007K0699K0925K1465K2587
61032G57451K3965K5388K6939K8503K9658L0344L1395L4021L8856M5732N4388
61021A126640O5166P8838R5871J16236J40057J68119K01517K40886K85759L32651
61011B851740L71243L82792L47565K60364J41027K6737m9753p6592o1112j8367
$$ plain form
61001 4175644 4209443 4281226 4350138 4360297 4266205 4054610 3746998 3384167 3007208 2646359
60991 2646359 2318909 2031781 1785221 1576056 1399867 1252142 1128859 1026648 942458 873139
60981 873139 815598 767236 725998 690168 658520 630520 605900 583987 563935 545531 529125
60970 529125 514576 500998 487953 476292 467105 460159 454027 447668 441294 435720 431456 428520 426634
60957 426634 425338 424320 423866 424669 426959 430049 433038 435797 439044 443585 449608 456482 462952 467724 470251
60942 470251 471011 470837 470026 468359 465854 462993 460027 456452 451534 445192 438108 431026 424205 417470 410515
60927 410515 403120 395360 387658 380435 373627 366776 359669 352647 346099 339912 333786 327979 323303 320289
60913 320289 318603 317462 316434 315623 315164 314808 314134 313098 312272 312461 313980 316299 318463 319921 320977 322490
$$ packed form
61001D175644L3799P1783O8912J0159r4092k11595l07612l62831l76959l60849
60991B646359l27450k87128k46560k09165j76189j47725j23283j02211q4190o9319
60981H73139n7541m8362m1238l5830l1648k8000k4620k1913k0052j8404j6406
60970E29125j4549j3578j3045j1661r187o946o132o359o374n574m264k936j886
60957D26634j296j018m54Q03K290L090K989K759L247M541O023O874O470M772K527
60942D70251P60j74q11j667k505k861k966l575m918o342p084p082o821o735o955
60927D10515p395p760p702p223o808o851p107p022o548o187o126n807m676l014
60913C20289j686j141j028q11m59l56o74j036q26J89J519K319K164J458J056J513
$$ plain form
60897 322490 325154 328981 333270 337043 339694 341388 342798 344395 346038 347253 347727 347441 346539 345350 344414
60882 344414 344159 344493 344976 345451 346194 347327 348391 348841 348790 348931 349724 350931 352034 352822 353443 354042 354470 354250
60864 354250 352810 349947 346213 342670 340045 338160 336251 333723 330456 326620 322557 318800 315851 313789
60850 313789 312325 311355 311222 312255 314191 316351 318323 320252 322378 324518 326274 327711 329497 332053 334732
60835 334732 336310 336464 336375 337469 339832 342350 344259 345917 347981 350524 353321 356457 360073 363780 366934
60820 366934 369371 371397 373134 374344 374958 375274 375548 375765 375925 376171 376457 376458 376094 375771 375737 375365 373501 369569
60802 369569 364140 358373 353073 348252 343452 338323 332933 327574 322418 317484 312817 308486 304424 300569
60788 300569 297226 294931 293745 292918 291574 289606 287663 286376 285914 286157 286889 287755 288404 288895 289738 291408
$$ packed form
60897C22490K664L827M289L773K651J694J410J597J643J215M74k86r02j189r36
60882C44414k55L34M83M75P43J133J064M50n1J41P93J207J103P88O21N99M28k20
60864C54250j440k863l734l543k625j885j909k528l267l836m063l757k949k062
60850C13789j464r70j33J033J936K160J972J929K126K140J756J437J786K556K679
60835C34732J578J54q9J094K363K518J909J658K064K543K797L136L616L707L154
60820C66934K437K026J737J210O14L16K74K17J60K46K86Jl64l23l4l72j864l932
60802C69569n429n767n300m821m800n129n390n359n156m934m667m331m062l855
60788C00569l343k295j186q27j344j968j943j287m62K43P32Q66O49M91Q43J670
$$ plain form
60772 291408 293934 297044 300423 303653 306167 307648 308441 309304 310684 312452 314359 316510 319229 322587 326269
60757 326269 329896 333403 337080 341322 346349 352116 358381 364753 370732 375959 380637 385516 391114 396955
60743 396955 401911 405343 407527 408864 409199 408340 406734 404992 402922 399829 395757 391638 388005 384317 380006
60728 380006 375535 371726 368475 364864 360382 355319 350032 344497 338738 333124 328018 323530 319721 316666
60714 316666 314181 311861 309538 307336 305226 303055 301254 300863 302363 304854 306913 308044 308834 309937 311572
60699 311572 313882 317084 321039 325202 329258 333517 338438 344076 350175 356497 362771 368603 373824 378806
60685 378806 384063 389540 394620 398805 402075 404513 405956 406255 405619 404424 402883 401202 399914 399568 400047
60670 400047 400644 401027 401806 403809 407078 410995 415298 420492 427193 435410 444685 454708 465588 477676
$$ packed form
60772B91408K526L110L379L230K514J481P93Q63J380J768J907K151K719L358L682
60757C26269L627L507L677M242N027N767O265O372N979N227M678M879N598N841
60743C96955M956L432K184J337L35q59j606j742k070l093m072m119l633l688m311
60728C80006m471l809l251l611m482n063n287n535n759n614n106m488l809l055
60714C16666k485k320k323k202k110k171j801l91J500K491K059J131P90J103J635
60699C11572K310L202L955M163M056M259M921N638O099O322O274N832N221M982
60685C78806N257N477N080M185L270K438J443K99o36j195j541j681j288l46M79
60670D00047N97L83P79K003L269L917M303N194O701Q217R275J0023J0880J2088
$$ plain form
60656 477676 491361 506992 524798 544781 566692 590158 614913 640934 668263 696601 725204
60645 725204 753290 780422 806174 829441 848493 861910 869325 871168 867929 859884 847312 830699
60633 830699 810721 788186 763948 738748 713196 688009 664155 642549 623555 606840 591651
60622 591651 577230 563118 549391 536668 525750 517068 510424 505214 500859 496998 493356 489589 485396
60609 485396 480723 475695 470324 464508 458403 452468 446813 440752 433496 425243 417091 409854 403435 397428
60595 397428 391743 386317 380823 375129 369664 364810 360287 355750 351707 349138 348210 348011 347653 347040 346489
60580 346489 346220 346494 347720 350033 353184 357160 362540 369778 378425 387528 396585 405595 414284 421831 427468
60565 427468 430846 431687 429652 424951 418787 412635 407060 401595 395880 390548 386756 385082 385219 386766 389927
$$ packed form
60656D77676J3685J5631J7806J9983K1911K3466K4755K6021K7329K8338K8603
60645G25204K8086K7132K5752K3267J9052J3417P415J843l239q045j2572j6613
60633H30699j9978k2535k4238k5200k5552k5187k3854k1606j8994j6715j5189
60622E91651j4421j4112j3727j2723j0918q682o644n210m355l861l642l767m193
60609D85396m673n028n371n816o105n935n655o061p256q253q152p237o419o007
60595C97428n685n426n494n694n465m854m523m537m043k569r28j99l58o13n51
60580C46489k69K74J226K313L151L976N380P238Q647R103R057R010Q689P547N637
60565D27468L378Q41k035m701o164o152n575n465n715n332l792j674J37J547L161
$$ plain form
60550 389927 395224 402672 411595 421281 431534 442378 453336 463278 471021 475905 477742 476466 472197
60537 472197 465664 458267 451430 445864 441479 437918 435027 432930 431840 431832 432691 433936 435090 435950 436508 436779
60521 436779 436900 437383 438920 441785 445587 449703 453819 457987 462436 467582 474030 482244 492216 503740
60507 503740 516993 532691 551648 574348 600930 631299 665069 701445 739151 776393 810876
60496 810876 840066 861677 874051 876228 867858 849148 820897 784607 742603 697855 653338 611239
60484 611239 572648 537918 507213 480685 458261 439423 423266 408907 395957 384594 375035 366901
60472 366901 359282 351612 344378 338707 335147 332991 330900 328092 324817 321757 319223 317030 314907 312758
60458 312758 310532 308114 305533 303221 301839 301685 302212 302325 301365 299798 298720 298634 298954 298825 298079 297117 296181
$$ packed form
60550C89927N297P448Q923R686J0253J0844J0958R942P743M884J837j276m269
60537D72197o533p397o837n566m385l561k891k097j090qQ59J245J154Q60N58K71
60521D36779J21M83J537K865L802M116M116M168M449N146O448Q214R972J1524
60507E03740J3253J5698J8957K2700K6582L0369L3770L6376L7706L7242L4483
60496H10876K9190K1611J2374K177q370j8710k8251l6290m2004m4748m4517m2099
60484F11239l8591l4730l0705k6528k2424j8838j6157j4359j2950j1363r559q134
60472C66901p619p670p234n671l560k156k091k808l275l060k534k193k123k149
60458C12758k226k418k581k312j382j54N27J13r60j567j078q6L20j29p46r62r36
$$ plain form
60441 296181 295237 294454 294177 294295 294141 293238 291794 290258 288728 287103 285462 283963 282594 281351 280495 280249
60425 280249 280430 280668 280863 281089 281214 281097 281092 281865 283575 285603 287212 288167 288579 288492 287899 286981 286055 285349 284963
60406 284963 284948 285232 285538 285590 285444 285447 285848 286567 287453 288656 290460 292730 294763 295960 296540 297325 298834 300830
60388 300830 302748 304215 305068 305258 305039 305058 305884 307537 309632 311894 314295 316811 319318 321745 324117 326401
60372 326401 328448 330124 331418 332459 333421 334326 334942 335005 334617 334220 334122 334213 334226 334101 334075 334650 336435 339582
60354 339582 343235 346049 347570 348735 350691 353519 356507 359176 361456 363162 363984 363904 363121 361695 359760
60339 359760 357896 356705 356105 355595 355098 354931 355040 354979 354646 354356 354088 353336 351891 350174 348628 347360 346526
60322 346526 346400 346776 346969 346820 347216 349155 352704 357271 362549 368803 376472 385870 397147 410358 425644
$$ packed form
60441B96181r44p83k77J18j54r03j444j536j530j625j641j499j369j243q56k46
60425B80249J81K38J95K26J25j17nP73J710K028J609R55M12q7n93r18r26p06l86
60406B84963j5K84L06N2j46LM01P19Q86J203J804K270K033J197N80P85J509J996
60388C00830J918J467Q53J90k19J9Q26J653K095K262K401K516K507K427K372K284
60372C26401K047J676J294J041R62R05O16O3l88l97r8R1J3j25k6N75J785L147
60354C39582L653K814J521J165J956K828K988K669K280J706Q22q0p83j426j935
60339C59760j864j191o00n10m97j67J09o1l33k90k68p52j445j717j546j268q34
60322C46526j26L76J93j49L96J939L549M567N278O254P669R398J1277J3211J5286
$$ plain form
60307 425644 443160 462319 481185 497362 509718 518571 524000 524884 520198 510505 497472 482494 466643
60294 466643 451440 438594 428897 421951 416856 412638 408352 403621 399117 395802 393691 391884 389756 387410
60280 387410 384954 382121 378854 375614 372760 370142 367606 365382 363578 361709 359266 356551 354414 353246
60266 353246 352575 351728 350503 349113 347719 346312 344988 344041 343638 343489 343086 342295 341552 341370 341811 342520 343156
60249 343156 343635 344030 344373 344561 344451 344128 343969 344294 344934 345479 345922 346706 347958 349108 349569 349528 349778 350967
60231 350967 353243 356310 359471 361894 363308 364303 365605 367196 368525 369434 370403 371922 374019 376401 378692
60216 378692 380567 382013 383452 385299 387417 389352 391032 392838 395019 397473 400117 403048 406204 409305
60202 409305 412334 415694 419592 423502 426570 428523 429975 431783 434166 436538 438280 439582 441241 443553
$$ packed form
60307D25644J7516J9159J8866J6177J2356Q853N429Q84m686r693j3033j4978j5851
60294D66643j5203j2846r697o946n095m218m286m731m504l315k111j807k128k346
60280C87410k456k833l267l240k854k618k536k224j804j869k443k715k137j168
60266C53246o71q47j225j390j394j407j324r47m03j49m03p91p43j82M41P09O36
60249C43156M79L95L43J88j10l23j59L25O40N45M43P84J252J150M61m1K50J189
60231C50967K276L067L161K423J414R95J302J591J329R09R69J519K097K382K291
60216C78692J875J446J439J847K118J935J680J806K181K454K644K931L156L101
60202D09305L029L360L898L910L068J953J452J808K383K372J742J302J659K312
$$ plain form
60188 443553 445786 446985 446965 446182 444942 443286 441376 439409 437229 434576 431639 428855 426240 423577 421218
60173 421218 419874 419450 418880 417494 415840 414680 413839 412699 411339 410475 410506 411239 412428 413966 415565 416788
60157 416788 417413 417515 417258 417043 417662 419692 422581 424880 425645 425353 425230 426055 427850 430414 433745 438015
60141 438015 443495 450541 459294 469265 479376 488553 496144 501752 505036 505972 505126 503231 500552 497074
60127 497074 493287 490205 488293 486828 484780 482021 479281 477195 475947 475592 476014 476544 476282 475038 473427
60112 473427 471895 470173 467989 465812 464365 463721 463266 462426 461059 459295 457330 455384 453660 452344 451697
60097 451697 451920 452805 453755 454397 454999 456091 457912 460440 463747 467908 472716 477774 482832 487777 492468
60082 492468 496905 501477 506523 511623 515692 518046 519112 519910 521016 522235 523098 523384 523043 521862 519439
$$ packed form
60188D43553K233J199k0p83j240j656j910j967k180k653k937k784k615k663k359
60173D21218j344m24n70j386j654j160q41j140j360q64L1P33J189J538J599J223
60157D16788O25J02k57k15O19K030K889K299P65k92j23Q25J795K564L331M270
60141D38015N480P046Q753R971J0111R177P591N608L284R36q46j895k679l478
60127D97074l787l082j912j465k048k759k740k086j248l55M22N30k62j244j611
60112D73427j532j722k184k177j447o44m55q40j367j764j965j946j724j316o47
60097D51697K23Q85R50O42O02J092J821K528L307M161M808N058N058M945M691
60082D92468M437M572N046N100M069K354J066P98J106J219Q63K86l41j181k423
$$ plain form
60067 519439 515518 510213 503854 496775 489431 482521 476622 471595 466670 461315 455820 450803 446410 442316
60053 442316 438365 434807 431912 429667 427983 426862 426178 425492 424410 423109 422317 422639 423986 425707 427247
60038 427247 428532 429743 430965 432185 433475 434888 436178 436933 437044 436721 435924 434081 430705 426086 421014
60023 421014 415911 410614 405026 399552 394619 390041 385188 379760 374116 368786 363857 359032 354239 349951
60009 349951 346791 344871 343632 342332 340652 338865 337534 337101 337642 338869 340309 341537 342401 343148 344330
59994 344330 346388 349182 351974 354005 355114 355765 356594 358021 360155 362834 365733 368626 371555 374660 377864
59979 377864 380855 383313 384994 385683 385366 384427 383380 382341 381047 379468 378070 377232 376702 375895 374652 373411
59963 373411 372670 372458 372359 371908 370937 369609 368207 366949 365980 365368 364954 364353 363377 362413 362130 362801 364152 365852
$$ packed form
60067E19439l921n305o359p079p344o910n899n027m925n355n495n017m393m094
60053D42316l951l558k895k245j684j121o84o86j082j301p92L22J347J721J540
60038D27247J285J211J222J220J290J413J290P55J11l23p97j843l376m619n072
60023D21014n103n297n588n474m933m578m853n428n644n330m929m825m793m288
60009C49951l160j920j239j300j680j787j331m33N41J227J440J228Q64P47J182
59994C44330K058K794K792K031J109O51Q29J427K134K679K899K893K929L105L204
59979C77864K991K458J681O89l17r39j047j039j294j579j398q38n30q07j243j241
59963C73411p41k12r9m51r71j328j402j258r69o12m14o01r76r64k83O71J351J700
$$ plain form
59945 365852 367724 369418 370337 370220 369510 368780 368001 366699 364715 362424 360189 357926 355346 352502 349955
59930 349955 348376 347943 348137 348210 347799 346988 345914 344669 343608 343335 344090 345397 346522 347144 347445 347803 348587
59913 348587 349965 351628 352977 353929 355309 357998 361833 365805 369233 372207 374846 376755 377572 377678 377935
59898 377935 378815 380166 381727 383517 385577 387647 389413 390977 392780 395024 397459 399935 402825 406538
59884 406538 410801 414926 418827 423248 428812 435272 441957 448487 454616 459709 462984 464297 464305 463741 462782
59869 462782 461155 458659 455520 452282 449349 446605 443644 440406 437304 434606 432023 429181 426199 423437
59855 423437 420935 418560 416565 415421 415050 414702 413777 412453 411332 410673 410178 409380 408077 406407 404568 402550
59839 402550 400275 397980 396204 395271 395032 395216 395737 396453 397006 397302 397808 398888 400124 400847 401154 401696 402488
$$ packed form
59945C65852J872J694R19j17p10p30p79j302j984k291k235k263k580k844k547
59930C49955j579m33J94P3m11q11j074j245j061k73P55J307J125O22L01L58P84
59913C48587J378J663J349R52J380K689L835L972L428K974K639J909Q17J06K57
59898C77935Q80J351J561J790K060K070J766J564J803K244K435K476K890L713
59884D06538M263M125L901M421N564O460O685O530O129N093L275J313Qn64r59
59869D62782j627k496l139l238k933k744k961l238l102k698k583k842k982k762
59855D23437k502k375j995j144l71l48r25j324j121o59m95p98j303j670j839k018
59839D02550k275k295j776r33k39J84N21P16N53K96N06J080J236P23L07N42P92
$$ plain form
59822 402488 402640 401454 399198 396506 393538 390110 386290 382468 379007 376034 373420 370791 367768 364397
59808 364397 361243 358887 357439 356606 356099 355912 356263 357187 358117 358169 357135 355949 355633 355952 355763 354616 353214
59791 353214 352118 350872 348882 346474 344466 343204 342654 342942 343990 344842 344310 342406 340550 340131 341273
59776 341273 343100 344706 345663 346012 346164 346634 347511 348260 348247 347548 347113 347953 350063 352233 353088 352394 351207
59759 351207 350770 351485 353021 354970 357052 358860 359946 360253 360337 361052 363080 366533 370780 374731 377577 379352
59743 379352 380750 382498 384970 388099 391374 394115 396156 398185 401027 404587 407871 410069 411255 411983
59729 411983 412615 413201 413661 413757 413148 411759 409948 408113 406253 404192 402095 400470 399638 399377 399133 398492 397460
59712 397460 396393 395704 395582 396034 397146 399063 401641 404327 406634 408586 410403 411900 412687 412973 413686 415412
$$ packed form
59822D02488J52j186k256k692k968l428l820l822l461k973k614k629l023l371
59808C64397l154k356j448q33n07j87L51R24R30N2j034j186l16L19j89j147j402
59791C53214j096j246j990k408k008j262n50K88J048Q52n32j904j856m19J142
59776C41273J827J606R57L49J52M70Q77P49j3o99m35Q40K110K170Q55o94j187
59759C51207m37P15J536J949K082J808J086L07Q4P15K028L453M247L951K846J775
59743C79352J398J748K472L129L275K741K041K029K842L560L284K198J186P28
59729D11983O32N86M60R6o09j389j811j835j860k061k097j625q32k61k44o41j032
59712C97460j067o89j22M52J112J917K578K686K307J952J817J497P87K86P13J726
$$ plain form
59696 415412 417558 418957 419157 418683 418104 417338 416081 414485 413049 412010 411274 410914 411359 412832 414784 416135
59680 416135 416198 415233 414030 413029 411950 410284 407877 404913 401540 397861 394237 391232 389035 387208 385185
59665 385185 382834 380373 377949 375647 373775 372768 372742 373367 374247 375218 376269 377419 378805 380729 383444
59650 383444 386902 390757 394567 397950 400546 401929 401748 400187 398236 397051 396788 396374 394764 392211 389882
59635 389882 388437 387521 386614 385742 385140 384747 384364 384022 383874 383940 384097 384080 383401 381669 379185 376802 374911 372980
59617 372980 370449 367630 365205 363239 361347 359637 358732 358854 359626 360878 363021 366239 369838 372773 374567
59602 374567 375494 376166 377177 378806 380691 382053 382517 382468 382266 381523 379750 377527 376280 376733 378122 379194
59586 379194 379506 379395 379101 378474 377388 375958 374266 372248 369941 367587 365321 362943 360093 356617 352806
$$ packed form
59696D15412K146J399K00m74n79p66j257j596j436j039p36l60M45J473J952J351
59680D16135O3r65j203j001j079j666k407k964l373l679l624l005k197j827k023
59665C85185k351k461k424k302j872j007k6O25Q80R71J051J150J386J924K715
59650C83444L458L855L810L383K596J383j81j561j951j185k63m14j610k553k329
59635C89882j445r16r07q72o02l93l83l42j48O6J57j7o79j732k484k383j891j931
59617C72980k531k819k425j966j892j710r05J22P72J252K143L218L599K935J794
59602C74567R27O72J011J629J885J362M64m9k02p43j773k223j247M53J389J072
59586C79194L12j11k94o27j086j430j692k018k307k354k266k378k850l476l811
$$ plain form
59571 352806 349360 346998 345780 344867 343321 341177 339371 338535 338310 338085 337940 338410 339660 341475 343849 346913
59555 346913 350292 353146 355155 357005 359611 363087 366728 369840 372480 375575 380413 387757 397264 407961
59541 407961 419451 432545 448523 467726 488553 507483 520304 524241 519672 509786 498303 487500
59529 487500 478185 470788 465808 463496 463716 466221 470627 476142 481714 486637 490817 494427 497469 499705
59515 499705 500820 500588 499003 496255 492509 487772 482063 475546 468368 460547 452286 444225 437014 430676
59501 430676 424692 418757 413136 408256 404245 400938 398141 395746 393744 392167 390929 389790 388646 387777
59487 387777 387524 387761 387972 387888 387725 387761 388018 388522 389516 391228 393613 396527 399925 403704 407541 411094 414185
59470 414185 416680 418363 419186 419438 419453 419337 419255 419759 421429 424229 427644 431533 436496 443244 451841 461698
$$ packed form
59571C52806l446k362j218r13j546k144j806q36k25k25j45M70J250J815K374L064
59555C46913L379K854K009J850K606L476L641L112K640L095M838P344R507J0697
59541D07961J1490J3094J5978J9203K0827J8930J2821L937m569r886j1483j0803
59529D87500r315p397m980k312K20K505M406N515N572M923M180L610L042K236
59515D99705J115k32j585k748l746m737n709o517p178p821q261q061p211o338
59501D30676n984n935n621m880m011l307k797k395k002j577j238j139j144q69
59487C87777k53K37K11q4j63L6K57N04R94J712K385K914L398L779L837L553L091
59470D14185K495J683Q23K52J5j16q2N04J670K800L415L889M963O748Q597R857
$$ plain form
59454 461698 472080 482471 492684 502920 513633 525099 537047 548757 559438 568325 574540 577162
59442 577162 575688 570419 562380 552853 542875 532946 523098 513368 504212 496365 490135 484972 479857 474182
59428 474182 468199 462757 458756 456765 456939 459226 463734 470813 480682 493063 507451 523697 542148
59415 542148 563301 587626 615416 645819 675521 699111 711874 712623 703770 689118 672125 655738
59403 655738 642385 633337 628620 627963 631094 636362 639665 636059 622940 601416 574805 546464 518981
59390 518981 494223 473135 455577 440874 428568 418536 410668 404739 400364 396809 393154 389160 385751
59377 385751 384085 384169 384855 385154 384983 384602 384041 383404 383210 383889 385221 386668 388015 389351 390720 392246 394341
59360 394341 397276 400675 403913 406995 410604 415334 421303 428412 436462 445011 453772 463274 474523 487762
$$ packed form
59454D61698J0382J0391J0213J0236J0713J1466J1948J1710J0681Q887O215K622
59442E77162j474n269q039r527r978r929r848r730r156p847o230n163n115n675
59428D74182n983n442m001j991J74K287M508P079R869J2381J4388J6246J8451
59415E42148K1153K4325K7790L0403K9702K3590J2763P49q853j4652j6993j6387
59403F55738j3353r048m717o57L131N268L303l606j3119k1524k6611k8341k7483
59390E18981k4758k1088j7558j4703j2306j0032p868n929m375l555l655l994l409
59377C85751j666Q4O86K99j71l81n61o37j94O79J332J447J347J336J369J526K095
59360C94341K935L399L238L082L609M730N969P109Q050Q549Q761R502J1249J3239
$$ plain form
59346 487762 502091 516610 531344 546598 561944 576480 589817 602100 613175 622398 629341 634135
59334 634135 636882 637159 634416 628664 620570 610929 600178 588373 575554 562166 549054 536931 525898
59321 525898 515640 506071 497620 490823 485733 481677 477484 472126 465439 458328 452023 447001 442781 438783
59307 438783 435108 432285 430477 429281 428235 427179 426091 424928 423843 423286 423527 424239 424876 425448 426531
59292 426531 428426 430707 432797 434629 436404 438068 439462 440834 442693 445221 448227 451621 455491 459758
59278 459758 464252 469195 475129 482180 489883 497871 506296 515349 524871 534721 545059 555888 566721
59265 566721 577067 586855 595925 603502 608766 611702 612841 612331 609818 605197 598983 591935 584624 577269
59251 577269 569632 561250 552277 543943 537603 533302 529768 525882 521758 518368 516608 516746 518261 520049
$$ packed form
59346D87762J4329J4519J4734J5254J5346J4536J3337J2283J1075R223O943M794
59334F34135K747K77k743n752q094r641j0751j1805j2819j3388j3112j2123j1033
59321E25898j0258r569q451o797n090m056m193n358o687p111o305n022m220l998
59307D38783l675k823j808j196j046j056j088j163j085n57K41P12O37N72J083
59292D26531J895K281K090J832J775J664J394J372J859K528L006L394L870M267
59278D59758M494M943N934P051P703P988Q425R053R522R850J0338J0829J0833
59265E66721J0346R788R070P577N264K936J139n10k513m621o214p048p311p355
59251E77269p637q382q973q334o340m301l534l886m124l390j760J38J515J788
$$ plain form
59237 520049 521194 521819 522935 525405 529283 534005 538701 542328 544118 544172 543152 541269 538043 533248 527416
59222 527416 520998 513602 504643 494475 484242 474789 466171 458119 450516 443411 436900 431018 425573 420219
59208 420219 414942 410280 406735 404117 401849 399766 398149 397046 396156 395447 395335 395900 396425 396133 395121 394125
59192 394125 393605 393527 393941 395139 397111 399389 401753 404681 408660 413375 418058 422500 427132 432111 436933
59177 436933 441185 445187 449587 454672 460424 466867 473885 480908 487290 493008 498690 504971 512116 520071
59163 520071 528501 536791 544431 551469 558265 564714 569988 573190 574058 572974 570473 566825 561993 556013
59149 556013 549421 543114 537567 532397 526972 521248 515614 510156 504597 498937 493624 488990 484980 481477
59135 481477 478469 475796 473211 470808 468937 467560 466193 464750 463974 464679 466882 469917 473142 476291 479531
$$ packed form
59237E20049J145O25J116K470L878M722M696L627J790N4j020j883l226m795n832
59222E27416o418p396q959j0168j0233r453q618q052p603p105o511n882n445n354
59208D20219n277m662l545k618k268k083j617j103q90p09j12N65N25k92j012r96
59192C94125n20p8M14J198J972K278K364K928L979M715M683M442M632M979M822
59177D36933M252M002M400N085N752O443P018P023O382N718N682O281P145P955
59163E20071Q430Q290P640P038O796O449N274L202Q68j084k501l648m832n980
59149E56013o592o307n547n170n425n724n634n458n559n660n313m634m010l503
59135D81477l008k673k585k403j871j377j367j443p76P05K203L035L225L149L240
$$ plain form
59120 479531 483456 488726 495415 502991 511151 520244 530561 541693 553123 565149 578540 593276 608178
59107 608178 621957 634405 646420 658978 672104 684780 695904 705282 713455 720610 726185 729745
59095 729745 731734 732931 733481 732979 731304 728838 726029 723211 720794 719045 717543 715275 711474 706123 699612
59080 699612 692244 684180 675473 665946 655305 643658 631772 620510 610041 599786 589173 578233
59068 578233 567439 557228 547895 539798 533246 528036 523395 518621 513614 508624 503763 499103 494955 491517
59054 491517 488345 484712 480504 476296 472584 469508 467306 466265 465975 465431 464301 463449 463690 464597 465157 465086
59038 465086 464843 464779 465066 466117 468207 470746 472718 473982 475565 478615 483475 489734 496629 503491 510338
59023 510338 518024 527356 538191 549956 562818 577440 593498 609376 623627 636013 646728 655385
$$ packed form
59120D79531L925N270O689P576Q160R093J0317J1132J1430J2026J3391J4736J4902
59107F08178J3779J2448J2015J2558J3126J2676J1124R378Q173P155N575L560
59095G29745J989J197N50n02j675k466k809k818k417j749j502k268l801n351o511
59080F99612p368q064q707r527j0641j1647j1886j1262j0469j0255j0613j0940
59068E78233j0794j0211r333q097o552n210m641m774n007m990m861m660m148l438
59054D91517l172l633m208m208l712l076k202j041k90n44j130q52K41R07N60p1
59038D65086k43o4K87J051K090K539J972J264J583L050M860O259O895O862O847
59023E10338P686R332J0835J1765J2862J4622J6058J5878J4251J2386J0715Q657
$$ plain form
59011 655385 661402 664876 666326 665924 663641 660075 656483 653831 652133 650855 649776 649395 650572 653764 658537
58996 658537 663845 668831 673229 677081 680295 682646 684000 684438 684221 683653 682712 680779 676944 670756 662550
58981 662550 653103 643225 633706 625185 617731 610778 603836 597233 591939 588687 587379 587310 587863 589030 591264
58966 591264 594779 599129 603663 608292 613447 619315 625587 632051 638973 646585 654541 662149 668736 673448
58952 673448 675209 673550 669291 663736 657239 649233 639772 630270 622270 615937 610254 604430 598533 592805
58938 592805 586978 580522 573260 565421 557209 548617 539666 530642 522020 514290 507914 503258 500282 498348
58924 498348 496549 494414 492163 490210 488627 487246 486139 485574 485460 485190 484376 483550 483808 485737 488991 492922
58908 492922 497237 501894 506762 511860 517756 525174 534064 543400 552025 559483 565957 571793 577303 582725
$$ packed form
59011F55385O017L474J450m02k283l566l592k652j698j278j079l81J177L192M773
58996F58537N308M986M398L852L214K351J354M38k17n68r41j933l835o188q206
58981F62550r447r878r519q521p454o953o942o603n294l252j308o9N53J167K234
58966E91264L515M350M534M629N155N868O272O464O922P612P956P608O587M712
58952F73448J761j659m259n555o497q006r461r502q000o333n683n824n897n728
58938E92805n827o456p262p839q212q592q951r024q622p730o376m656k976j934
58924D98348j799k135k251j953j583j381j107n65j14k70q14q26K58J929L254L931
58908D92922M315M657M868N098N896P418Q890R336Q625P458O474N836N510N422
$$ plain form
58894 582725 588030 592991 597770 603349 610984 621255 633942 648759 665727 684699 704915 725399
58882 725399 745591 765236 783793 800386 814447 825994 834998 840783 842509 840103 834184 825036 812264
58869 812264 795803 776761 756700 736468 716340 696987 679437 664057 650464 638586 629000 621774
58857 621774 615698 609215 601652 593082 583641 573643 563867 554920 546592 538536 531258 525580 521251 517023
58843 517023 512138 506964 502062 497491 493288 489865 487424 485491 483465 481263 479090 476925 474626 472258
58829 472258 470020 467984 466113 464291 462222 459578 456445 453381 450882 449074 448024 447913 448593 449402 449811
58814 449811 450070 450841 452344 454255 456327 458686 461460 464395 467017 469097 470787 472248 473246 473363 472704
58799 472704 472066 472092 472436 472195 471053 469513 468043 466648 465409 464809 465099 465824 466343 466575 466932 467934 470156
$$ packed form
58894E82725N305M961M779N579P635J0271J2687J4817J6968J8972K0216K0484
58882G25399K0192J9645J8557J6593J4061J1547R004N785J726k406n919r148j2772
58869H12264j6461j9042k0061k0232k0128j9353j7550j5380j3593j1878r586p226
58857F21774o076o483p563q570r441r998r776q947q328q056p278n678m329m228
58843E17023m885n174m902m571m203l423k441j933k026k202k173k165k299k368
58829D72258k238k036j871j822k069k644l133l064k499j808j050j11O80Q09M09
58814D49811K59P71J503J911K072K359K774K935K622K080J690J461R98J17o59
58799D72704o38K6L44k41j142j540j470j395j239o00K90P25N19K32L57J002K222
$$ plain form
58782 470156 474048 479284 484625 489027 492663 496346 500155 503316 505359 506704 507860 508626 508416 507060 504977
58767 504977 502699 500443 498080 495408 492540 489999 488289 487339 486563 485477 484118 482842 481956 481683 482203
58752 482203 483509 485310 487338 489701 492732 496481 500521 504360 507901 511403 515114 519065 523043 526633
58738 526633 529451 531726 534602 539400 546321 554161 561543 568146 574460 580730 586764 592648 598958 605982
58724 605982 613120 619385 624292 628048 631055 633470 635227 636325 636991 637575 638335 639484 641503 645026 650151
58709 650151 656086 661860 667208 672314 676844 679865 680804 679955 677858 674584 669786 663029 653873 642139
58695 642139 628420 614044 600201 587302 575235 563838 552891 542133 531687 522200 514220 507599
58683 507599 501819 496580 491730 486908 481737 476367 471420 467332 463956 460859 457908 455511 454253 454256 455055
$$ packed form
58782D70156L892N236N341M402L636L683L809L161K043J345J156P66k10j356k083
58767E04977k278k256k363k672k868k541j710r50p76j086j359j276q86k73N20
58752D82203J306J801K028K363L031L749M040L839L541L502L711L951L978L590
58738E26633K818K275K876M798O921P840P382O603O314O270O034N884O310P024
58724F05982P138O265M907L756L007K415J757J098O66N84P60J149K019L523N125
58709F50151N935N774N348N106M530L021R39q49k097l274m798o757r156j1734
58695F42139j3719j4376j3843j2899j2067j1397j0947j0758j0446r487p980o621
58683E07599n780n239m850m822n171n370m947m088l376l097k951k397j258LP99
$$ plain form
58668 455055 456320 458470 462138 467155 472707 478539 485258 493215 501755 509959 517393 523613 527710 529199
58654 529199 528946 528347 527846 527034 525887 524878 523904 522165 519481 516929 515622 515369 514987 513641 511405 508750
58638 508750 505961 503106 500263 497651 495580 494347 494136 494910 496330 497813 498894 499524 499876 499910 499527 499184
58622 499184 499808 501822 504710 507980 512127 518062 525859 534708 543995 553815 564422 575768 587626 599617
58608 599617 610962 620738 628604 634936 640040 643627 645314 645326 644400 643073 641270 638511 634435 629245 623672
58593 623672 618493 614077 610466 607701 605800 604542 603634 603209 603912 606368 610676 616418 622991 629933 637113
58578 637113 644673 652705 660961 668859 675708 681017 684889 688184 691897 696130 700085 703396 707108 712836
58564 712836 721225 731730 743665 756800 770990 785941 801562 818065 835413 852930 869550 884273
$$ packed form
58668D55055J265K150L668N017N552N832O719P957Q540Q204P434O220M097J489
58654E29199k53n99n01q12j147j009r74j739k684k552j307k53l82j346k236k655
58638E08750k789k855k843k612k071j233k11P74J420J483J081O30L52L4l83l43
58622D99184O24K014K888L270M147N935P797Q849R287R820J0607J1346J1858J1991
58608E99617J1345R776P866O332N104L587J687J2r26j327j803k759m076n190n573
58593F23672n179m416l611k765j901j258r08m25P03K456M308N742O573O942P180
58578F37113P560Q032Q256P898O849N309L872L295L713M233L955L311L712N728
58564G12836Q389J0505J1935J3135J4190J4951J5621J6503J7348J7517J6620J4723
$$ plain form
58552 884273 896486 906224 914113 920587 925118 926640 924799 920422 914711 908366 901548 894158 885843 876094
58538 876094 864674 851825 838028 823767 809504 795560 781964 768724 756239 745022 735076 726005
58526 726005 717846 711165 706207 702564 700026 699061 699876 701551 702836 703630 704912 707205 709790 711681 712853
58511 712853 714143 716194 718889 721780 724752 728119 732196 736964 742146 747452 752737 758100 763870 770252
58497 770252 776829 782576 786593 788661 788960 787512 784300 779722 774396 768535 761949 754781 747792 741756
58483 741756 736917 733187 730555 729113 728971 730369 733683 739068 746176 754280 762552 770250 776939 782678
58469 782678 787724 791926 794581 795015 793186 789714 785475 781185 777143 773267 769543 766398 764412 763715 763938
58454 763938 764739 766060 767926 770409 773852 778607 784290 789673 793618 795957 797268 798058 798396 798088 796947
$$ packed form
58552H84273J2213R738P889O474M531J522j841m377n711o345o818p390q315r749
58538H76094j1420j2849j3797j4261j4263j3944j3596j3240j2485j1217r946r071
58526G26005q159o681m958l643k538r65Q15J675J285P94J282K293K585J891J172
58511G12853J290K051K695K891K972L367M077M768N182N306N285N363N770O382
58497G70252O577N747M017K068K99j448l212m578n326n861o586p168o989o036
58483G41756m839l730k632j442j42J398L314N385P108Q104Q272P698O689N739
58469G82678N046M202K655M34j829l472m239m290m042l876l724l145j986o97K23
58454G63938Q01J321J866K483L443M755N683N383L945K339J311P90L38l08j141
$$ plain form
58439 796947 795060 792972 791448 790887 791128 791907 793259 795302 797911 800907 804371 808505 813328 818795 825106
58424 825106 832626 841502 851539 862406 873811 885475 897100 908379 918952 928370 936187 942086
58412 942086 945900 947609 947449 945985 943970 941957 939980 937651 934722 931588 929131 928100 928720 930853 934138
58397 934138 937963 941760 945681 950597 956961 963894 969853 974018 976529 977579 976959 974625 971083 966902
58383 966902 962184 956761 950666 944242 937975 932318 927535 923745 921259 920677 922302 925607 929757 934613
58369 934613 940659 947935 955694 963425 971702 981571 993366 1006484 1020127 1033879 1047620 1061200 1074382
58356 1074382 1087074 1099509 1112036 1124688 1137063 1148668 1159190 1168424 1176253 1182934 1189107 1195346
58344 1195346 1202022 1209710 1219093 1230003 1241205 1251855 1262811 1275690 1290970 1307785 1325343 1343570
$$ packed form
58439G96947j887k088j524n61K41P79J352K043K609K996L464M134M823N467O311
58424H25106P520Q876J0037J0867J1405J1664J1625J1279J0573R418P817N899
58412I42086L814J709j60j464k015k013j977k329k929l134k457j031O20K133L285
58397I34138L825L797L921M916O364O933N959M165K511J050o20k334l542m181
58383I66902m718n423o095o424o267n657m783l790k486n82J625L305M150M856
58369I34613O046P276P759P731Q277R869J1795J3118J3643J3752J3741J3580J3182
58356A074382J2692J2435J2527J2652J2375J1605J0522R234P829O681O173O239
58344A195346O676P688R383J0910J1202J0650J0956J2879J5280J6815J7558J8227
$$ plain form
58332 1343570 1362536 1382201 1402821 1424616 1446849 1467978 1487009 1504073 1519607 1533702 1546359
58321 1546359 1557674 1567555 1575957 1583578 1591619 1600641 1610225 1619941 1630040 1641105 1653628 1668002 1684247
58308 1684247 1701704 1719703 1738544 1759067 1781308 1804458 1828151 1852782 1878475 1904785 1931547
58297 1931547 1958886 1986196 2012355 2037376 2062661 2089050 2115717 2141597 2166885 2192492 2219018
58286 2219018 2246895 2276570 2307856 2339919 2372575 2406760 2443146 2481158 2520011 2559796 2600995
58275 2600995 2643823 2688697 2736412 2787152 2840263 2895550 2953695 3014709 3077202 3140176 3204497
58264 3204497 3271655 3342034 3415385 3491901 3571694 3654140 3738927 3826923 3918866 4014000 4111173
58253 4111173 4210516 4312800 4417819 4524708 4633458 4745081 4860681 4981250 5107843 5241102
$$ packed form
58332A343570J8966J9665K0620K1795K2233K1129J9031J7064J5534J4095J2657
58321A546359J1315R881Q402P621Q041R022R584R716J0099J1065J2523J4374J6245
58308A684247J7457J7999J8841K0523K2241K3150K3693K4631K5693K6310K6762
58297A931547K7339K7310K6159K5021K5285K6389K6667K5880K5288K5607K6526
58286B219018K7877K9675L1286L2063L2656L4185L6386L8012L8853L9785M1199
58275B600995M2828M4874M7715N0740N3111N5287N8145O1014O2493O2974O4321
58264C204497O7158P0379P3351P6516P9793Q2446Q4787Q7996R1943R5134R7173
58253D111173R9343J02284J05019J06889J08750J11623J15600J20569J26593J33259
$$ plain form
58243 5241102 5381081 5528264 5684108 5849916 6025903 6212011 6408817 6617047 6837170
58234 6837170 7070125 7317397 7579787 7857275 8150691 8462166 8793441 9145366 9519752
58225 9519752 9919820 10347919 10804772 11291987 11813319 12372526 12972525 13618189 14317606
58216 14317606 15079042 15909152 16816022 17811770 18910867 20128849 21484448 22999965 24698133
58207 24698133 26602598 28744187 31164077 33910324 37034673 40587393 44598330 49056862
58199 49056862 53931956 59243651 65131429 71858639 79761735 89199817 100527571 114074183
58191 114074183 130125658 148926241 170680928 195507891 223312943 253587902 285138136
58184 285138136 315816803 342515053 361697711 370450133 367517476 353697045 331384933
$$ packed form
58243E241102J39979J47183J55844J65808J75987J86108J96806K08230K20123
58234F837170K32955K47272K62390K77488K93416L11475L31275L51925L74386
58225I519752M00068M28099M56853M87215N21332N59207N99999O45664O99417
58216A4317606P61436Q30110R06870R95748J099097J217982J355599J515517J698168
58207B4698133J904465K141589K419890K746247L124349L552720M010937M458532
58199D9056862M875094N311695N887778O727210P903096R438082J1327754J3546612
58191A14074183J6051475J8800583K1754687K4826963K7805052L0274959L1550234
58184B85138136L0678667K6698250J9182658Q752422k932657j3820431k2312112
$$ plain form
58177 331384933 303655624 273429383 243016302 214000354 187313471 163388776 142324906
58170 142324906 124016580 108241809 94722802 83170501 73309178 64885115 57672192
58163 57672192 51477462 46140172 41525037 37517942 34024976 30969116 28284959 25916887
58155 25916887 23819658 21956222 20293967 18804425 17465041 16257895 15166586 14176230
58147 14176230 13275390 12455101 11706022 11018627 10385762 9802843 9265627 8769586 8310990
58138 8310990 7886641 7492744 7125820 6784464 6468372 6175719 5903047 5647617 5408287
58129 5408287 5184210 4974154 4777214 4592879 4420228 4257972 4105154 3960898 3823787
58120 3823787 3692493 3566785 3447006 3332914 3223882 3119766 3020614 2925994 2835563 2749774
$$ packed form
58177C31384933k7729309l0226241l0413081k9015948k6686883k3924695k1063870
58170A42324906j8308326j5774771j3519007j1552301r861323q424063p212923
58163E7672192o194730n337290m615135m007095l492966l055860k684157k368072
58155B5916887k097229j863436j662255j489542j339384j207146j091309r90356
58147A4176230r00840q20289p49079o87395o32865n82919n37216m96041m58596
58138H310990m24349l93897l66924l41356l16092k92653k72672k55430k39330
58129E408287k24077k10056j96940j84335j72651j62256j52818j44256j37111
58120C823787j31294j25708j19779j14092j09032j04116r9152r4620r0431q5789
$$ plain form
58110 2749774 2668925 2592046 2517869 2446374 2378180 2312866 2249205 2186771 2126018 2066989 2009303
58099 2009303 1953412 1900637 1851727 1806316 1763852 1724150 1686960 1651797 1618364 1586544 1556041
58088 1556041 1526600 1498385 1471518 1445466 1419591 1394026 1369303 1345364 1321667 1297988 1274400
58077 1274400 1250743 1226885 1203200 1180045 1157061 1133801 1110716 1088660 1067736 1047508 1028052
58066 1028052 1009795 992532 975620 959029 943255 928364 914052 900498 888125 876581 864978
58055 864978 853084 841272 829408 816921 804062 791873 780681 769710 758497 747607 737551
58044 737551 728017 718731 710097 702325 694681 686321 677365 668504 660023 651789 643786 636107 628725 621761
58030 621761 615689 610696 606008 600349 593147 585000 576954 569574 562716 556007 549289 542541 535624 528467
$$ packed form
58110B749774q0849p6879p4177p1495o8194o5314o3661o2434o0753n9029n7686
58099B009303n5891n2775m8910m5411m2464l9702l7190l5163l3433l1820l0503
58088A556041k9441k8215k6867k6052k5875k5565k4723k3939k3697k3679k3588
58077A274400k3657k3858k3685k3155k2984k3260k3085k2056k0924k0228j9456
58066A028052j8257j7263j6912j6591j5774j4891j4312j3554j2373j1544j1603
58055H64978j1894j1812j1864j2487j2859j2189j1192j0971j1213j0890j0056
58044G37551r534r286q634p772p644q360q956q861q481q234q003p679p382o964
58030F21761o072m993m688n659p202q147q046p380o858o709o718o748o917p157
$$ plain form
58016 528467 521569 515842 511630 508217 504634 500658 496656 492870 489389 486482 484320 482563 480847 479488
58002 479488 479018 479189 479181 478747 478404 478458 478608 478661 478933 479683 480703 481667 482400 482697 482421 481862 481520 481474 481490 481767
57982 481767 482822 484497 485791 486000 485423 484680 483879 482763 481157 478917 475917 472362 468731 465095 460947
57967 460947 455940 450440 445078 440232 436153 433161 431359 430450 429960 429346 427901 425229 421973 419451 418230
57952 418230 417560 416438 414580 412060 408840 405276 402453 401259 401485 402442 404085 406839 410705 415266 420383
57937 420383 426273 432984 440388 448525 457366 466342 474775 482757 491037 499885 508440 515183 518702 518150
57923 518150 513636 506341 497769 488623 478659 467657 456070 444587 433543 423083 413544 405218 397903
57910 397903 391087 384582 378659 373513 368873 364330 359906 356076 353217 351152 349244 346794 343375 339034
$$ packed form
58016E28467o898n727m212l413l583l976m002l786l481k907k162j757j716j359
58002D79488m70J71qm34l43N4J50N3K72P50J020R64P33K97k76n59l42m6J6K77
57982D81767J055J675J294K09n77p43q01j116j606k240l000l555l631l636m148
57967D60947n007n500n362m846m079k992j802r09m90o14j445k672l256k522j221
57952D18230o70j122j858k520l220l564k823j194K26R57J643K754L866M561N117
57937D20383N890O711P404Q137Q841Q976Q433P982Q280Q848Q555O743L519n52
57923E18150m514p295q572r146r964j1002j1587j1483j1044j0460r539q326p315
57910C97903o816o505n923n146m640m543m424l830k859k065j908k450l419m341
$$ plain form
57896 339034 334365 330192 326951 324401 322082 319945 318338 317497 317336 317679 318437 319623 321370 323832 326749
57881 326749 329370 331252 332928 335161 337592 338913 338541 337302 336098 334697 332470 329678 327177 325196
57867 325196 323252 321113 319102 317485 316312 315964 317144 320018 323874 327951 332266 337303 343155 349315
57853 349315 355216 360716 366050 371406 376502 380626 383223 384490 385180 385698 385582 384066 381030 377144 373096
57838 373096 368924 364191 358618 352362 345870 339741 334688 331207 329183 328115 327903 328975 331325 333910
57824 333910 335613 336561 337802 339759 341767 343213 344313 345478 346620 347494 348072 348121 347014 344593 341752
57809 341752 339481 337728 335873 333886 332134 330297 327470 323476 319175 315360 312059 309198 307114 305966
57795 305966 305252 304430 303557 302794 301730 299870 297625 296134 296031 296819 297581 297854 297646 297111 296640 297116 299459
$$ packed form
57896C39034m669m173l241k550k319k137j607q41j61L43P58J186J747K462K917
57881C26749K621J882J676K233K431J321l72j239j204j401k227k792k501j981
57867C25196j944k139k011j617j173l48J180K874L856M077M315N037N852O160
57853C49315N901N500N334N356N096M124K597J267O90N18j16j516l036l886m048
57838C73096m172m733n573o256o492o129n053l481k024j068k12J072K350K585
57824C33910J703R48J241J957K008J446J100J165J142Q74N78M9j107k421k841
57809C41752k271j753j855j987j752j837k827l994m301l815l301k861k084j148
57795C05966p14q22q73p63j064j860k245j491j03P88P62K73k08n35m71M76K343
$$ plain form
57778 299459 303682 308663 313158 316960 320784 325154 329746 333872 337171 339589 341040 341401 340701 338972 336072
57763 336072 331866 326423 319811 311979 303218 294575 287278 281750 277559 274282 271966 270744 270511 271168 272748
57748 272748 275060 277571 279860 281920 283821 285418 286640 287799 289270 291081 293081 295344 297989 300687
57734 300687 302730 303693 303754 303235 302022 299739 296501 293254 291107 290337 290281 290292 290455 291182 292402 293712 295201
57717 295201 297477 300693 304132 307161 310191 314120 318961 323578 326860 328748 329973 331146 332416 333806
57703 333806 335540 337943 341211 345330 350100 355165 360120 364662 368573 371475 372758 372007 369446 365782
57689 365782 361641 357388 353449 350336 348204 346777 346019 346502 348780 352711 357859 364365 372950 384207
57675 384207 398392 415830 437015 462372 492400 527999 570103 618998 674322 735031 797801
$$ packed form
57778B99459M223M981M495L802L824M370M592M126L299K418J451L61p00j729k900
57763C36072m206n443o612p832q761q643p297n528m191l277k316j222k33O57J580
57748B72748K312K511K289K060J901J597J222J159J471J811K000K263K645K698
57734C00687K043R63O1n19j213k283l238l247k147p70n6J1J63P27J220J310J489
57717B95201K276L216L439L029L030L929M841M617L282J888J225J173J270J390
57703C33806J734K403L268M119M770N065M955M542L911K902J283p51k561l664
57689C65782m141m253l939l113k132j427p58M83K278L931N148O506Q585J1257
57675C84207J4185J7438K1185K5357L0028L5599M2104M8895N5324O0709O2770
$$ plain form
57664 797801 855064 896193 912504 901734 867999 818484 760742 701648 646387 597272 554116
57653 554116 516278 484021 457777 436897 419829 405339 393123 383281 375633 369656 364885 361160
57641 361160 358434 356500 355020 353836 353059 352786 352863 353016 353066 352881 352314 351430 350678 350633 351584 353389 355617 357723
57623 357723 359295 360322 361043 361486 361405 360768 359921 358976 357550 355630 354315 354966 357657 361046 363797 365543
57607 365543 366526 367045 367562 368758 370988 373893 376788 379248 381167 382596 383782 385126 386881 388993 391281
57592 391281 393510 395261 396149 396349 396597 397496 399078 401158 403568 405837 407144 407184 406823 407339 409134 411517
57576 411517 413600 415002 415837 416506 417514 419127 421147 423273 425592 428368 431425 434188 436430 438593 441230
57561 441230 444434 447941 451496 454965 458332 461801 465702 470041 474292 477833 480609 483177 486125 489553
$$ packed form
57664G97801N7263M1129J6311j0770l3735m9515n7742n9094n5261m9115m3156
57653E54116l7838l2257k6244k0880j7068j4490j2216r842p648n977m771l725
57641C61160k726j934j480j184p77k73P7J53N0j85n67q84p52m5R51J805K228K106
57623C57723J572J027P21M43q1o37q47r45j426j920j315O51K691L389K751J746
57607C65543R83N19N17J196K230K905K895K460J919J429J186J344J755K112K288
57592C91281K229J751Q88K00K48Q99J582K080K410K269J307M0l61N16J795K383
57576D11517K083J402Q35O69J008J613K020K126K319K776L057K763K242K163K637
57561D41230L204L507L555L469L367L469L901M339M251L541K776K568K948L428
$$ plain form
57547 489553 493091 496270 498778 500521 501680 502828 504778 507946 511801 515155 517201 518167 518889 519965 521508
57532 521508 523474 525899 528819 532195 535964 540054 544417 549128 554328 559949 565658 571263 576921 582686
57518 582686 588119 592770 596924 601430 606845 613123 619957 626909 633287 638584 643175 647987 653322 658643
57504 658643 663717 669167 675372 681492 686324 689722 692430 694803 696456 697109 697047 696704 696388 696503 697500 699427
57488 699427 701937 704844 708301 712367 716797 721298 725649 729607 733155 736846 741277 746205 750853 755271
57474 755271 760589 767414 774693 780853 785643 790166 795429 801598 808485 815883 823316 830165 836303 842173
57460 842173 848096 853965 859787 865982 872807 879852 886574 893092 900095 907937 916080 923447 929314 933966
57446 933966 938588 944344 951397 958890 965943 972548 979369 986812 994490 1001588 1007635 1012937 1018327 1024505
$$ packed form
57547D89553L538L179K508J743J159J148J950L168L855L354K046R66P22J076J543
57532E21508J966K425K920L376L769M090M363M711N200N621N709N605N658N765
57518E82686N433M651M154M506N415O278O834O952O378N297M591M812N335N321
57504F58643N074N450O205O120M832L398K708K373J653O53o2l43l16J15R97J927
57488F99427K510K907L457M066M430M501M351L958L548L691M431M928M648M418
57474G55271N318O825P279O160M790M523N263O169O887P398P433O849O138N870
57460H42173N923N869N822O195O825P045O722O518P003P842Q143P367N867M652
57446I33966M622N756P053P493P053O605O821P443P678P098O047N302N390O178
$$ plain form
57432 1024505 1031545 1038973 1046213 1052873 1058867 1064565 1070769 1078092 1086176 1093832 1100202 1105636 1111251 1117860
57418 1117860 1125568 1134129 1143224 1152406 1161158 1169236 1176786 1184152 1191745 1200081 1209560 1220002 1230526
57405 1230526 1240172 1248693 1256675 1264905 1273678 1282724 1291701 1300646 1309854 1319392 1328929 1338146 1347177 1356456
57391 1356456 1366146 1375924 1385371 1394435 1403454 1412773 1422516 1432672 1443312 1454551 1466251 1477889 1488919
57378 1488919 1499295 1509475 1519811 1530074 1539766 1548786 1557641 1566979 1577093 1587846 1598966 1610319
57366 1610319 1621953 1633934 1646206 1658632 1671062 1683213 1694590 1704895 1714636 1724965 1736599
57355 1736599 1749092 1761500 1773526 1785605 1797996 1810343 1822200 1833601 1844961 1856731 1869225
57344 1869225 1882405 1895660 1908155 1919622 1930593 1941714 1953173 1964941 1977167 1989925 2002863
$$ packed form
57432A024505P040P428P240O660N994N698O204P323Q084P656O370N434N615O609
57418A117860P708Q561R095R182Q752Q078P550P366P593Q336R479J0442J0524
57405A230526R646Q521P982Q230Q773R046Q977Q945R208R538R537R217R031R279
57391A356456R690R778R447R064R019R319R743J0156J0640J1239J1700J1638J1030
57378A488919J0376J0180J0336J0263R692R020Q855R338J0114J0753J1120J1353
57366A610319J1634J1981J2272J2426J2430J2151J1377J0305R741J0329J1634
57355A736599J2493J2408J2026J2079J2391J2347J1857J1401J1360J1770J2494
57344A869225J3180J3255J2495J1467J0971J1121J1459J1768J2226J2758J2938
$$ plain form
57333 2002863 2015615 2028470 2042196 2057140 2072755 2088096 2102570 2116235 2129570 2143053 2156839
57322 2156839 2170806 2184922 2199364 2214180 2229045 2243621 2258028 2272637 2287502 2302302 2316830
57311 2316830 2331185 2345493 2359794 2374302 2389390 2405074 2420798 2436010 2450784 2465656 2480985
57300 2480985 2496742 2512843 2529378 2546422 2563788 2581079 2597944 2614257 2630159 2645966 2662026
57289 2662026 2678550 2695482 2712495 2729186 2745423 2761501 2777894 2794769 2811807 2828537 2844799
57278 2844799 2860881 2877212 2894002 2911164 2928552 2946185 2964194 2982608 3001372 3020636 3040809
57267 3040809 3062122 3084202 3106274 3127791 3148704 3169172 3189297 3209216 3229166 3249221 3269094
57256 3269094 3288482 3307580 3326975 3346861 3366494 3384737 3401303 3417315 3434407 3453209 3472892
$$ packed form
57333B002863J2752J2855J3726J4944J5615J5341J4474J3665J3335J3483J3786
57322B156839J3967J4116J4442J4816J4865J4576J4407J4609J4865J4800J4528
57311B316830J4355J4308J4301J4508J5088J5684J5724J5212J4774J4872J5329
57300B480985J5757J6101J6535J7044J7366J7291J6865J6313J5902J5807J6060
57289B662026J6524J6932J7013J6691J6237J6078J6393J6875J7038J6730J6262
57278B844799J6082J6331J6790J7162J7388J7633J8009J8414J8764J9264K0173
57267C040809K1313K2080K2072K1517K0913K0468K0125J9919J9950K0055J9873
57256C269094J9388J9098J9395J9886J9633J8243J6566J6012J7092J8802J9683
$$ plain form
57245 3472892 3492294 3511179 3530178 3549728 3569558 3589271 3608925 3628747 3648529 3667733 3686220
57234 3686220 3704594 3723570 3743091 3762266 3780322 3797543 3815063 3833673 3853090 3872517 3891589
57223 3891589 3910445 3929121 3947446 3965531 3983785 4002262 4020467 4038004 4054954 4071280 4086382
57212 4086382 4099757 4111735 4123009 4133672 4143333 4152004 4160122 4167700 4174162 4179253 4183516 4187642 4191875
57199 4191875 4196373 4201501 4207261 4212853 4217474 4221276 4224968 4228661 4231825 4234399 4237229 4241041 4245460 4249415
57185 4249415 4252293 4254391 4256404 4258731 4261207 4263301 4264596 4265220 4265767 4266781 4268330 4270062 4271441 4271893 4271065
57170 4271065 4269252 4267339 4265973 4264784 4262752 4259371 4255248 4251470 4248542 4245997 4242890 4238648 4233539 4228397
57156 4228397 4223815 4219710 4215725 4211888 4208569 4205896 4203620 4201597 4199923 4198319 4195796 4191338 4184700 4176123
$$ packed form
57245C472892J9402J8885J8999J9550J9830J9713J9654J9822J9782J9204J8487
57234C686220J8374J8976J9521J9175J8056J7221J7520J8610J9417J9427J9072
57223C891589J8856J8676J8325J8085J8254J8477J8205J7537J6950J6326J5102
57212D086382J3375J1978J1274J0663R661Q671Q118P578O462N091M263M126M233
57199D191875M498N128N760N592M621L802L692L693L164K574K830L812M419L955
57185D249415K878K098K013K327K476K094J295O24N47J014J549J732J379M52q28
57170D271065j813j913j366j189k032l381m123l778k928k545l107m242n109n142
57156D228397m582m105l985l837l319k673k276k023j674j604k523m458o638q577
$$ plain form
57142 4176123 4165428 4151948 4135399 4116304 4095318 4072506 4047561 4020502 3991767 3961720 3930450
57131 3930450 3898149 3865415 3832955 3801100 3769847 3739423 3710646 3684547 3661710 3642123 3625599
57120 3625599 3612038 3601189 3592440 3585146 3579039 3574117 3570335 3567723 3566723 3568032 3572200 3579894 3592691
57107 3592691 3613120 3643544 3685284 3739162 3806700 3890437 3993288 4118131 4268160 4447455
57097 4447455 4661181 4915568 5217753 5575349 5995726 6485253 7048513 7687177 8398695
57088 8398695 9175623 10006117 10875155 11765576 12658597 13534169 14371537 15149690 15847207
57079 15847207 16442018 16912814 17242911 17424329 17458343 17351366 17109624 16737121 16237769
57070 16237769 15618809 14892715 14077243 13194444 12268933 11325668 10387961 9476265 8607335
$$ packed form
57142D176123j0695j3480j6549j9095k0986k2812k4945k7059k8735l0047l1270
57131C930450l2301l2734l2460l1855l1253l0424k8777k6099k2837j9587j6524
57120C625599j3561j0849q749p294o107m922l782k612j000J309M168P694J2797
57107C592691K0429L0424M1740N3878O7538Q3737J02851J24843J50029J79295
57097D447455K13726K54387L02185L57596M20377M89527N63260O38664P11518
57088H398695P76928Q30494Q69038Q90421Q93021Q75572Q37368P78153O97517
57079A5847207N94811M70796L30097J81418L4014j06977k41742l72503m99352
57070A6237769o18960p26094q15472q82799r25511r43265r37707r11696q68930
$$ plain form
57061 8607335 7793388 7041717 6355321 5734161 5176184 4677909 4234917 3842330 3495103
57052 3495103 3188131 2916394 2675222 2460562 2269200 2098728 1947048 1811768 1690141
57043 1690141 1579624 1478183 1383986 1295196 1210567 1130026 1054210 983403 917242 855360 797813
57032 797813 744770 696098 651370 610022 571474 535534 502672 473436 447377 423067 399538
57021 399538 377267 357282 339673 323522 308053 293142 278823 265056 252165 240823 231138 222223
57009 222223 213161 204122 196010 189141 182824 176343 169893 164151 159190 154280 148891 143486 138963 135470
56995 135470 132307 129073 126305 124556 123307 121516 119135 117317 117043 118236 120516 124098 129358 135985
56981 135985 143189 150393 157043 161956 163698 161802 157123 150917 144075 137293 131254 126240 121992 118403
$$ packed form
57061H607335q13947p51671o86396o21160n57977m98275m42992l92587l47227
57052C495103l06972k71737k41172k14660j91362j70472j51680j35280j21627
57043A690141j10517j01441r4197q8790q4629q0541p5816p0807o6161o1882n7547
57032G97813n3043m8672m4728m1348l8548l5940l2862k9236k6059k4310k3529
57021C99538k2271j9985j7609j6151j5469j4911j4319j3767j2891j1342r685q915
57009B22223r062r039q112o869o317o481o450n742m961m910n389n405m523l493
56995A35470l163l234k768j749j249j791k381j818k74J193K280L582N260O627
56981A35985P204P204O650M913J742j896m679o206o842o782o039n014m248l589
$$ plain form
56967 118403 116038 115593 117105 120070 124163 129378 135615 142692 150888 161003 173537 187993 203079
56954 203079 217305 229132 236917 239447 236850 230614 222358 212711 201714 190090 179453 171037 164664
56941 164664 159400 154971 152073 151426 153065 156682 162173 169642 179113 190514 203731 218457 234029
56928 234029 249416 263213 273549 278466 276902 269412 257712 243456 227557 210607 193624 178050
56916 178050 164889 153973 144252 134866 125794 117435 109864 102881 96653 91778 88500 86255 84273 82379
56902 82379 80837 79614 78339 77056 76559 77633 80087 82864 85093 86842 88850 91853 96413 103101 112197
56887 112197 123109 134623 146164 158432 172166 186421 198696 206896 210715 211042 208681 204151 198337
56874 198337 192701 188682 187031 187655 190048 194033 200178 209397 222131 238170 257214 279222 304167
$$ packed form
56967A18403k365m45J512K965M093N215O237P077Q196J0115J2534J4456J5086
56954B03079J4226J1827P785K530k597o236q256r647j0997j1624j0637q416o373
56941A64664n264m429k898o47J639L617N491P469R471J1401J3217J4726J5572
56928B34029J5387J3797J0336M917j564p490j1700j4256j5899j6950j6983j5574
56916A78050j3161j0916r721r386r072q359p571o983o228m875l278k245j982j894
56902H2379j542j223j275j283m97J074K454K777K229J749K008L003M560O688R096
56887A12197J0912J1514J1541J2268J3734J4255J2275Q200L819L27k361m530n814
56874A98337n636m019j651O24K393L985O145R219J2734J6039J9044K2008K4945
$$ plain form
56861 304167 331997 363032 397702 435358 473585 509049 538628 559502 569087 566161 552195 530784
56849 530784 505631 479447 454378 432325 414424 400967 392313 389365 392781 402326 417590 438950
56837 438950 467258 502803 545204 594129 649325 709481 771218 829279 877573 910352 923398
56826 923398 915267 887939 846069 795112 739760 683739 630386 582629 542143 508976 482510 462784
56814 462784 450635 446680 450568 461291 477961 500215 528054 561372 599376 640164 680597 716315
56802 716315 741997 752536 745208 721259 685150 642036 595913 549653 505645 465611 430086 398768
56790 398768 371561 349091 332213 321286 315988 315696 319927 328449 341020 357095 375822 396109
56778 396109 416410 434392 447116 451910 447332 433622 412443 386178 357125 327072 297406 269314
$$ packed form
56861C04167K7830L1035L4670L7656L8227L5464K9579K0874R585k926j3966k1411
56849E30784k5153k6184k5069k2053j7901j3457q654k948L416R545J5264K1360
56837D38950K8308L5545M2401M8925N5196O0156O1737N8061M8294L2779J3046
56826I23398q131k7328m1870n0957n5352n6021n3353m7757m0486l3167k6466j9726
56814D62784j2149l955L888J0723J6670K2254K7839L3318L8004M0788M0433L5718
56802G16315K5682J0539p328k3949l6109m3114m6123m6260m4008m0034l5525l1318
56790C98768k7207k2470j6878j0927n298k92M231Q522J2571J6075J8727K0287
56778C96109K0301J7982J2724M794m578j3710k1179k6265k9053l0053k9666k8092
$$ plain form
56766 269314 243629 220623 200234 182475 167414 154835 144255 135231 127350 120056 112918 106144
56754 106144 100432 96149 92945 90195 87429 84279 80520 76419 72697 69928 68233 67659 68298 69779 71108
56739 71108 71557 71418 71463 71888 72179 71910 71218 70570 70385 70848 71841 72996 73939 74387 74070 72924 71529 70905
56721 70905 71489 72586 73206 73216 73318 74130 75676 77557 79182 80049 80209 80304 80724 81021 80657 80082 80311 81535
56703 81535 82839 83409 83320 82995 82543 81935 81256 80448 79289 77966 77235 77588 78657 79804 80968 82474 84344
56686 84344 86342 88534 91270 94566 97926 100862 103309 105480 107548 109472 110968 111676 111570 111138 110903
56671 110903 110791 110290 109233 108103 107374 106831 105761 103696 100785 97565 94463 91436 87990 83727 79002
56656 79002 74860 72054 70318 68923 67799 67558 68349 69264 69290 68476 67736 67792 68775 70673 73432 76569 79289
$$ packed form
56766B69314k5685k3006k0389j7759j5061j2579j0580r024p881p294p138o774
56754A06144n712m283l204k750k766l150l759m101l722k769j695n74O39J481J329
56739G1108M49j39M5M25K91k69o92o48j85M63R93J155R43M48l17j146j395o24
56721G0905N84J097O20J0J02Q12J546J881J625Q67J60R5M20K97l64n75K29J224
56703H1535J304N70q9l25m52o08o79q08j159j323p31L53J069J147J164J506J870
56686H4344J998K192K736L296L360K936K447K171K068J924J496P08j06m32k35
56671A10903j12n01j057j130p29n43j070k065k911l220l102l027l446m263m725
56656G9002m142k806j736j395j124k41P91R15K6q14p40N6R83J898K759L137K720
$$ plain form
56639 79289 81287 83016 84901 86724 88098 89171 90376 91794 93269 94954 97151 99636 101644 102673
56625 102673 102874 102582 101966 101398 101721 103565 106507 109268 110814 111083 110693 110251 110020 109969 109921 109726 109444 109310
56607 109310 109374 109251 108510 107383 106840 107669 109543 111270 112007 112084 112557 114073 116228 117920 118242 117144 115390
56590 115390 113925 113269 113398 113975 114551 114743 114474 114014 113577 112963 111851 110365 109084 108518 108812 109832 111195
56573 111195 112307 112859 113327 114491 116454 118619 120688 122999 125737 128594 131592 135416 140331 145502 150163
56558 150163 154918 160933 168200 175539 182124 188082 193697 198992 204203 209701 215175 219739 223174 226322
56544 226322 229830 233142 235261 235993 235943 235665 235265 234523 232992 230273 226541 222544 218722 214587 209365 203030
56528 203030 196343 190055 184443 179491 175087 171073 167352 164015 161182 158774 156592 154555 152706 151063
$$ packed form
56639G9289J998J729J885J823J374J073J205J418J475J685K197K485K008J029
56625A02673K01k92o16n68L23J844K942K761J546K69l90m42k31n1m8j95k82j34
56607A09310O4j23p41j127n43Q29J874J727P37P7M73J516K155J692L22j098j754
56590A15390j465o56J29N77N76J92k69m60m37o14j112j486j281n66K94J020J363
56573A11195J112N52M68J164J963K165K069K311K738K857K998L824M915N171M661
56558A50163M755O015P267P339O585N958N615N295N211N498N474M564L435L148
56544B26322L508L312K119P32n0k78m00p42j531k719l732l997l822m135n222o335
56528B03030o687o288n612m952m404m014l721l337k833k408k182k037j849j643
$$ plain form
56514 151063 149552 148020 146295 144395 142677 141556 140990 140506 139829 139163 138716 138316 137747 137151 136777 136509 135968
56497 135968 134951 133560 132085 130970 130630 130978 131344 131182 130722 130553 130760 130887 130704 130574 130952 131816 132641
56480 132641 132723 131574 129368 127076 125861 126143 127323 128438 128969 129102 129442 130484 132106 133585 134333 134591
56464 134591 135113 136108 136956 137147 137150 137955 139970 142716 145496 147901 149641 150354 149944 148895 147966 147530 147396
56447 147396 147209 146885 146629 146693 147166 147885 148546 148965 149207 149324 149074 148172 146829 145740 145402 145722 146405 147402
56429 147402 148665 149781 150312 150385 150558 151116 151864 152604 153399 154256 154897 155058 154837 154650 154956 155991 157587 159271
56411 159271 160761 162370 164631 167543 170513 173045 175129 176902 178306 179204 179515 179108 177876 176054 174106
56396 174106 172189 170082 167815 165899 164633 163604 162258 160743 159753 159706 160455 161735 163542 166082 169514
$$ packed form
56514A51063j511j532j725j900j718j121n66m84o77o66m47m00n69n96l74k68n41
56497A35968j017j391j475j115l40L48L66j62m60j69K07J27j83j30L78Q64Q25
56480A32641Q2j149k206k292j215K82J180J115N31J33L40J042J622J479P48K58
56464A34591N22R95Q48J91LQ05K015K746K780K405J740P13m10j049r29m36j34
56447A47396j87l24k56O4M73P19O61M19K42J17k50r02j343j089l38L20O83R97
56429A47402J263J116N31P3J73N58P48P40P95Q57O41J61k21j87L06J035J596J684
56411A59271J490J609K261K912K970K532K084J773J404Q98L11m07j232j822j948
56396A74106j917k107k267j916j266j029j346j515r90m7P49J280J807K540L432
$$ plain form
56381 169514 173736 178327 182795 186967 190982 194858 198428 201879 205911 211029 216863 222470 227028 229953
56367 229953 230743 229321 226485 223490 221034 218880 216462 213610 210717 208412 207046 206312 205486 204241 203114
56352 203114 202961 204056 205898 207652 208588 208427 207673 207387 208189 209600 210741 211458 212272 213440 214728 216049
56336 216049 217668 219597 221428 223012 224819 227269 230049 232398 233864 234590 235088 235907 237279 238934 240464
56321 240464 241942 243869 246430 249084 251056 251968 251896 251230 250668 250892 251863 252720 252747 252251 252187 253099 254754 256619
56303 256619 258322 259726 260961 262396 264295 266488 268525 270132 271363 272474 273856 275871 278380 280637
56289 280637 282085 283155 284793 287226 289774 291993 294376 297493 300961 303807 305672 307154 309007 311438
56275 311438 314214 317068 319914 322901 326344 330439 334988 339576 344028 348522 353322 358605 364538 371204
$$ packed form
56381A69514M222M591M468M172M015L876L570L451M032N118N834N607M558K925
56367B29953P90j422k836k995k456k154k418k852k893k305j366p34q26j245j127
56352B03114j53J095J842J754R36j61p54k86Q02J411J141P17Q14J168J288J321
56336B16049J619J929J831J584J807K450K780K349J466P26M98Q19J372J655J530
56321B40464J478J927K561K654J972R12p2o66n62K24R71Q57K7m96o4R12J655J865
56303B56619J703J404J235J435J899K193K037J607J231J111J382K015K509K257
56289B80637J448J070J638K433K548K219K383L117L468K846J865J482J853K431
56275C11438K776K854K846K987L443M095M549M588M452M494M800N283N933O666
$$ plain form
56261 371204 378484 386270 394834 404636 415663 427392 439531 452442 466583 481982 498705 517495
56249 517495 539351 564539 592447 622379 653985 686885 720393 753883 787154 820228 852945
56238 852945 884836 915175 942971 967105 986700 1001350 1010956 1015415 1014537 1008210 996700 980835
56226 980835 961707 940071 916164 890315 863500 836870 810817 784950 759046 733621 709418
56215 709418 686755 665606 646049 628333 612507 598178 584704 571759 559730 549328 540610 532688
56203 532688 524745 517048 510459 505138 500409 495898 492044 489349 487738 486906 486694 486873 487142 487652 488944
56188 488944 491002 492934 494057 494768 495810 497208 498575 500111 502494 505879 509689 513430 517213 521365
56174 521365 525912 530609 535291 540089 545256 550712 555948 560752 565949 572753 581212 590011 598155 606144
$$ packed form
56261C71204P280P786Q564R802J1027J1729J2139J2911J4141J5399J6723J8790
56249E17495K1856K5188K7908K9932L1606L2900L3508L3490L3271L3074L2717
56238H52945L1891L0339K7796K4134J9595J4650R606M459q78o327j1510j5865
56226I80835j9128k1636k3907k5849k6815k6630k6053k5867k5904k5425k4203
56215G09418k2663k1149j9557j7716j5826j4329j3474j2945j2029j0402q718p922
56203E32688p943p697o589n321m729m511l854k695j611q32k12J79K69N10J292
56188D88944K058J932J123P11J042J398J367J536K383L385L810L741L783M152
56174E21365M547M697M682M798N167N456N236M804N197O804Q459Q799Q144P989
$$ plain form
56160 606144 614930 624468 634141 644090 655118 667460 680636 694458 709290 725292 742269 760564
56148 760564 781378 805845 834337 867003 904580 948326 999462 1058911 1127323 1205097 1292417
56137 1292417 1389075 1493679 1602724 1710799 1812234 1902958 1981333 2047998 2105340 2156728
56127 2156728 2205299 2252483 2296927 2334666 2360886 2372377 2369028 2353448 2329447 2300561 2268991
56116 2268991 2234919 2196503 2150710 2094473 2025699 1944212 1852494 1755329 1658196 1565644 1480756
56105 1480756 1405269 1339645 1283406 1236000 1197264 1166785 1143280 1125148 1111431 1101737 1095440 1091534
56093 1091534 1089240 1088298 1088720 1090537 1093676 1097764 1102233 1106858 1111922 1117614 1123648 1129848 1136642 1144516
56079 1144516 1153403 1163136 1174087 1186672 1200562 1215045 1229898 1245297 1261127 1277084 1293205 1309687
$$ packed form
56160F06144Q786R538R673R949J1028J2342J3176J3822J4832J6002J6977J8295
56148G60564K0814K4467K8492L2666L7577M3746N1136N9449O8412P7774Q7320
56137A292417R6658J04604J09045J08075J01435R0724P8375O6665N7342N1388
56127B156728M8571M7184M4444L7739K6220J1491l349j5580k4001k8886l1570
56116B268991l4072l8416m5793n6237o8774q1487r1718r7165r7133r2552q4888
56105A480756p5487o5624n6239m7406l8736l0479k3505j8132j3717r694o297l906
56093A091534k294r42M22J817L139M088M469M625N064N692O034O200O794P874
56079A144516Q887R733J0951J2585J3890J4483J4853J5399J5830J5957J6121J6482
$$ plain form
56067 1309687 1326394 1343202 1360544 1378944 1398289 1418226 1438945 1460754 1483221 1505666 1528306
56056 1528306 1552005 1576978 1602596 1628345 1654128 1679750 1705075 1730648 1757237 1784735 1812370
56045 1812370 1840019 1868358 1897671 1927481 1957591 1988658 2021424 2056041 2092289 2129876 2168478
56034 2168478 2208143 2249677 2294019 2341243 2390794 2442502 2496548 2552533 2609486 2666813 2724573
56023 2724573 2782898 2841984 2902517 2965327 3030675 3098634 3169807 3244808 3323351 3404861 3489711
56012 3489711 3578764 3672097 3769374 3871178 3978561 4091443 4208838 4330584 4457537 4590222
56002 4590222 4728849 4874572 5029103 5192892 5365114 5545588 5735361 5935369 6146001
55993 6146001 6367933 6601980 6848196 7106804 7379825 7670080 7978768 8306024 8653677
$$ packed form
56067A309687J6707J6808J7342J8400J9345J9937K0719K1809K2467K2445K2640
56056A528306K3699K4973K5618K5749K5783K5622K5325K5573K6589K7498K7635
56045A812370K7649K8339K9313K9810L0110L1067L2766L4617L6248L7587L8602
56034B168478L9665M1534M4342M7224M9551N1708N4046N5985N6953N7327N7760
56023B724573N8325N9086O0533O2810O5348O7959P1173P5001P8543Q1510Q4850
56012C489711Q9053R3333R7277J01804J07383J12882J17395J21746J26953J32685
56002D590222J38627J45723J54531J63789J72222J80474J89773K00008K10632
55993F146001K21932K34047K46216K58608K73021K90255L08688L27256L47653
$$ plain form
55984 8653677 9025213 9422973 9847840 10301984 10789542 11314095 11877979 12484821 13140590
55975 13140590 13851540 14623386 15463258 16380431 17384747 18486724 19699846 21040840 22527871
55966 22527871 24181465 26027908 28099974 30435804 33081904 36098902 39562975 43564783
55958 43564783 48214592 53652070 60050688 67616578 76589067 87236753 99837161 114650963
55950 114650963 131914056 151837968 174574360 200113535 228113740 257658408 286986286
55943 286986286 313393481 333597553 344629797 344865636 334575563 315681796 290963319
55936 290963319 263227892 234795867 207321079 181821545 158809296 138447914 120684893
55929 120684893 105339688 92164009 80889210 71255798 63023346 55974496 49921414
$$ packed form
55984H653677L71536L97760M24867M54144M87558N24553N63884O06842O55769
55975A3140590P10950P71846Q39872R17173J004316J101977J213122J340994J487031
55966B2527871J653594J846443K072066K335830K646100L016998L464073M001808
55958D3564783M649809N437478O398618P565890Q972489J0647686J2600408J4813802
55950A14650963J7263093J9923912K2736392K5539175K8000205K9544668K9327878
55943B86986286K6407195K0204072J1032244K35839j0290073j8893767k4718477
55936B90963319k7735427k8432025k7474788k5499534k3012249k0361382j7763021
55929A20684893j5345205j3175679j1274799r633412q232452p048850o053082
$$ plain form
55922 49921414 44707661 40201831 36291837 32884875 29906244 27293403 24991873 22956366
55914 22956366 21150932 19544895 18110337 16824009 15668197 14627479 13686469 12831652
55906 12831652 12052941 11341900 10690275 10091153 9539560 9030673 8558973 8119927 7710915
55897 7710915 7329820 6974304 6643022 6335826 6051984 5789511 5546670 5322671 5116523
55888 5116523 4926721 4752468 4593728 4449723 4318808 4199932 4092482 3994303 3901496 3810569
55878 3810569 3719232 3625018 3525178 3418735 3307038 3191703 3073607 2954438 2837372 2725126
55868 2725126 2618565 2517817 2423343 2335155 2252492 2175106 2103623 2037896 1976386 1917996 1863205
55857 1863205 1812560 1765372 1720926 1679712 1642240 1607626 1574430 1542061 1510448 1479129 1447713
$$ packed form
55922D9921414n213753m505830l909994l406962k978631k612841k301530k035507
55914B2956366j805434j606037j434558j286328j155812j040718r41010q54817
55906A2831652p78711p11041o51625n99122n51593n08887m71700m39046m09012
55897G710915l81095l55516l31282l07196k83842k62473k42841k23999k06148
55888E116523j89802j74253j58740j44005j30915j18876j07450r8179r2807r0927
55878C810569r1337r4214r9840j06443j11697j15335j18096j19169j17066j12246
55868B725126j06561j00748r4474q8188q2663p7386p1483o5727o1510n8390n4791
55857A863205n0645m7188m4446m1214l7472l4614l3196l2369l1613l1319l1416
$$ plain form
55846 1447713 1416503 1385717 1354756 1323103 1291342 1260500 1230904 1202424 1175165 1149220 1124300
55835 1124300 1100378 1078081 1057748 1038608 1019634 1000768 982641 965611 949692 934984 921427
55824 921427 908434 895316 881782 867672 852645 836593 819984 803388 787029 771069 755852
55813 755852 741581 728222 715935 704998 695060 685243 675307 665967 657668 649975 642705 636738 632896
55800 632896 630728 629277 628500 629002 630788 633086 635252 637180 639032 641095 643689 646820 650115 653286 656068
55785 656068 657282 654673 646465 632870 615642 596622 577211 558649 541914 527439 515452 506357
55773 506357 500251 496285 492957 488926 483420 476381 468634 461444 455366 449892 444524 439549 435293 431405
55759 431405 427744 425320 425266 427086 428809 428852 427009 423833 419896 415672 411335 406444 400313 392805 384432
$$ packed form
55846A447713l1210l0786l0961l1653l1761l0842k9596k8480k7259k5945k4920
55835A124300k3922k2297k0333j9140j8974j8866j8127j7030j5919j4708j3557
55824I21427j2993j3118j3534j4110j5027j6052j6609j6596j6359j5960j5217
55813G55852j4271j3359j2287j0937r938r817r936r340q299p693p270n967l842
55800F32896k168j451p77N02J786K298K166J928J852K063K594L131L295L171K782
55785F56068J214k609q208j3595j7228j9020j9411j8562j6735j4475j1987r095
55773E06357o106l966l328m031n506p039p747p190o078n474n368m975m256l888
55759D31405l661k424n4J820J723M3j843l176l937m224m337m891o131p508q373
$$ plain form
55744 384432 375799 367332 359423 352353 346120 340601 335673 330925 325748 320254 315641 312914 311556 310259
55730 310259 308682 307555 307143 306566 304855 301842 297790 292868 287351 281799 276633 271876 267475 263504 259910
55715 259910 256509 253440 251200 250013 249474 249001 248371 247699 247220 247239 248016 249499 251383 253452 255516 256965
55699 256965 256834 254552 250402 245081 239129 232950 227130 222340 218949 216818 215389 213932 211953 209554
55685 209554 207343 205888 205256 205058 204815 204309 203749 203657 204439 206040 208031 210022 211843 213348 214181 213782 211635
55668 211635 207709 202778 198160 194867 193031 192235 192223 192952 194077 194832 194611 193511 192136 191037 190424 190264
55652 190264 190490 191051 191810 192568 193280 194159 195335 196474 197070 197181 197430 198051 198393 197740 196278 194701 193044
55635 193044 190584 186867 182264 177433 172782 168678 165593 163613 162111 160392 158582 157494 157660 158769
$$ packed form
55744C84432q633q467p909p070o233n519m928m748n177n494m613k727j358j297
55730C10259j577j127m12n77j711l013m052m922n517n552n166m757m401l971l594
55715B59910l401l069k240j187n39m73o30o72m79J9P77J483J884K069K064J449
55699B56965j31k282m150n321n952o179n820m790l391k131j429j457j979k399
55685B09554k211j455o32j98k43n06n60r2P82J601J991J991J821J505Q33l99k147
55668B11635l926m931m618l293j836p96j2P29J125P55k21j100j375j099o13j60
55652A90264K26N61P59P58P12Q79J176J139N96J11K49O21L42o53j462j577j657
55635A93044k460l717m603m831m651m104l085j980j502j719j810j088J66J109
$$ plain form
55621 158769 160095 161148 161748 161657 160526 158309 155528 152858 150492 148173 145807 143735 142144 140558 138282
55606 138282 135198 131811 128573 125592 123005 121190 120347 120150 120061 119858 119641 119465 119221 118852 118529 118510 118947
55589 118947 119852 121146 122652 124103 125250 126083 126891 128063 129812 132177 135249 139296 144518 150833 158049
55574 158049 166246 175687 186134 196356 204603 209786 212048 212070 210000 205375 198045 188816 178990 169549
55560 169549 160904 153111 145989 139266 132995 127697 123746 120714 117699 114272 110740 107547 104777 102275
55546 102275 99889 97572 95538 94264 93935 93938 93383 92133 90837 89942 89318 88955 89289 90418 91603 92052 91752
55529 91752 91057 89835 87670 84677 81615 79273 78048 77938 78451 78711 78138 77071 76452 76919 78387 80353
55513 80353 82295 83883 85108 86201 87279 88187 88854 89598 90861 92781 95150 97585 99605 100849 101464
$$ packed form
55621A58769J326J053O00r1j131k217k781k670k366k319k366k072j591j586k276
55606A38282l084l387l238k981k587j815q43j97q9k03k17j76k44l69l23j9M37
55589A18947R05J294J506J451J147Q33Q08J172J749K365L072M047N222O315P216
55574A58049Q197R441J0447J0222Q247N183K262K2k070m625p330r229r826r441
55560A69549q645p793p122o723o271n298l951l032l015l427l532l193k770k502
55546A02275k386k317k034j274l29Ln55j250j296q95o24l63L34J129J185M49l00
55529I1752o95j222k165k993l062k342j225j10N13K60n73j067o19M67J468J966
55513H0353J942J588J225J093J078R08O67P44J263J920K369K435K020J244O15
$$ plain form
55498 101464 102019 102849 103775 104570 105237 105570 104995 103285 101007 98774 96439 93560 90236 86927 83807 80974
55482 80974 78960 78243 78419 78608 78611 78927 79685 80320 80472 80524 81017 82011 83185 84114 84354 83722 82636 81819 81607
55463 81607 81888 82578 83614 84490 84488 83541 82359 81521 80880 80076 79139 78386 78035 78111 78404 78441 77904 77115 76755 76968
55443 76968 77212 77055 76686 76448 76372 76358 76401 76448 76437 76622 77421 78728 79866 80486 81042 82024 83162 83830 83936 83962
55423 83962 84277 84782 85121 84995 84343 83437 82650 81989 81052 79648 78274 77714 78197 79116 79593 79250 78470 77889
55405 77889 77635 77207 76208 74932 74017 73734 73908 74267 74409 73708 71938 69881 68667 68469 68514 68446 68951 70716
55387 70716 73365 75745 76904 76663 75706 75189 75725 76579 76428 75023 73404 72343 71451 70189 68916 68332
55371 68332 68578 69453 70826 72176 72418 71084 69208 68234 68365 68727 68788 68710 68569 68219 67904 68155 68947 69634
$$ packed form
55498A01464N55Q30R26P95O67L33n75j710k278k233k335k879l324l309l120k833
55482H0974k014p17J76J89LL16P58O35J52N2M93R94J174R29K40o32j086q17k12
55463H1607K81O90J036Q76kr47j182q38o41q04r37p53l51P6K93L7n37p89l60K13
55443G6968K44j57l69k38p6j4M3M7j1J85P99J307J138O20N56R82J138O68J06K6
55423H3962L15N05L39j26o52r06p87o61r37j404j374n60M83R19M77l43p80n81
55405G7889k54m28r99j276r15k83J74L59J42p01j770k057j214j98M5o8N05J765
55387G0716K649K380J159k41r57n17N36Q54j51j405j619j061q92j262j273n84
55371F8332K46Q75J373J350K42j334j876r74J31L62O1p8j41l50l15K51P92O87
$$ plain form
55353 69634 69748 69306 68315 66702 64866 63713 63868 65159 66930 68492 69312 69283 68861 68556 68249 67445 66140
55336 66140 64909 64066 63316 62417 61655 61400 61571 61837 62027 62131 62140 62116 62243 62580 62923 63024 62887 62773 62997 63681
55316 63681 64590 65339 65865 66572 67750 69068 69954 70344 70587 70697 70197 68850 67109 65664 64817 64446 64307
55299 64307 64188 64013 63948 64280 65073 66061 66916 67491 67828 68087 68470 69045 69658 70165 70679 71371 72094 72458 72244
55280 72244 71566 70642 69621 68594 67584 66647 66093 66347 67326 68226 68344 67928 67773 68189 68865 69538 70165 70537
55262 70537 70411 70102 70233 70776 71027 70716 70469 70821 71390 71485 71066 70588 70292 70139 70160 70444 70917 71467 72073 72536
55242 72536 72357 71240 69526 67837 66495 65492 64748 64075 63213 62292 61986 62739 64038 64933 65160 65257 65643
55225 65643 66072 66133 65887 65789 66165 66909 67607 67942 68007 68164 68570 69044 69462 70006 70739 71248 71104 70551 70353 70967
$$ packed form
55353F9634J14m42r91j613j836j153J55J291J771J562Q20k9m22l05l07q04j305
55336F6140j231q43p50q99p62k55J71K66J90J04Rk4J27L37L43J01j37j14K24O84
55316F3681R09P49N26P07J178J318Q86L90K43J10n00j347j741j445q47l71j39
55299F4307j19j75o5L32P93R88Q55N75L37K59L83N75O13N07N14O92P23L64k14
55280G2244o78r24j021j027j010r37n54K54R79R00J18m16j55M16O76O73O27L72
55262G0537j26l09J31N43K51l11k47L52N69R5m19m78k96j53K1K84M73N50O06M63
55242G2536j79j117j714j689j342j003p44o73q62r21l06P53J299Q95K27R7L86
55225F5643M29O1k46r8L76P44O98L35O5J57M06M74M18N44P33N09j44n53j98O14
$$ plain form
55205 70967 72191 73551 74665 75234 75057 74231 73086 71830 70459 69051 67941 67490 67783 68601 69527 70098
55189 70098 70047 69571 69276 69800 71332 73317 74618 74307 72571 70665 69705 69689 69953 70278 71007 72210 73459
55172 73459 74535 75750 77222 78342 78449 77760 77153 77173 77642 78189 78710 79259 79794 80202 80409 80403 80272 80231 80424
55153 80424 80622 80294 79109 77297 75381 73668 72182 71038 70615 71171 72402 73624 74357 74593 74452 73860
55137 73860 72769 71517 70745 70901 71947 73442 74784 75497 75542 75344 75271 75109 74334 72948 71672 71140 71206 71300
55119 71300 71249 71396 72008 72868 73456 73340 72469 71348 70819 71349 72472 73265 73396 73355 73570 73746 73415 72793 72527
55100 72527 72704 72672 72015 71236 71145 71855 72767 73482 74298 75705 77639 79423 80343 80215 79468 78829 78828 79501 80465
55081 80465 81319 81908 82240 82280 81949 81277 80388 79342 78169 77116 76693 77206 78267 79031 79100 79043 79765 81384
$$ packed form
55205G0967J224J360J114N69j77q26j145j256j371j408j110m51K93Q18R26N71
55189G0098n1m76k95N24J532J985J301l11j736j906r60j6K64L25P29J203J249
55172G3459J076J215J472J120J07o89o07K0M69N47N21N49N35M08K07oj31m1J93
55153H0424J98l28j185j812j916j713j486j144m23N56J231J222P33K36j41n92
55137G3860j091j252p72J56J046J495J342P13M5j98p3j62p75j386j276n32O6R4
55119G1300n1J47O12Q60N88j16q71j121n29N30J123P93J31m1K15J76l31o22k66
55100G2527J77l2o57p79r1P10R12P15Q16J407J934J784R20j28p47o39jO73R64
55081H0465Q54N89L32M0l31o72q89j046j173j053m23N13J061P64O9n7P22J619
$$ plain form
55063 81384 83026 83828 83822 83567 83231 82559 81744 81637 82674 84015 84348 83438 82321 81942 82172 82398 82505 82743
55045 82743 82975 82737 82043 81548 81684 82077 82116 81786 81560 81608 81534 80872 79564 77910 76354 75414 75483 76450 77630
55026 77630 78334 78484 78523 78780 79107 79162 78801 78175 77586 77419 78030 79472 81305 82817 83532 83499 83117 82796 82757
55007 82757 82988 83268 83337 83186 83145 83562 84390 85198 85582 85462 84973 84298 83704 83591 84204 85330 86456 87265 87831
54988 87831 88299 88581 88480 88045 87638 87642 88129 88827 89430 89989 90943 92616 94662 96206 96591 95879 94565 93077
54970 93077 91791 91251 91892 93465 95093 96055 96293 96064 95427 94369 93207 92514 92603 93351 94520 95944 97365
54953 97365 98390 98836 98949 99066 99137 98826 98060 97218 96713 96559 96467 96251 95977 95810 95885 96309 97113 98095 98804 98773
54933 98773 97842 96265 94587 93352 92804 92788 93014 93481 94543 96454 98906 101294 103520 106286 110289 115217
$$ packed form
55063H1384J642Q02ok55l36o72q15j07J037J341L33r10j117l79K30K26J07K38
55045H2743K32k38o94m95J36L93L9l30k26M8p4o62j308j654j556r40O9R67J180
55026G7630P04J50L9K57L27N5l61o26n89j67O11J442J833J512P15l3l82l21l9
55007H2757K31K80O9j51m1M17Q28Q08L84j20m89o75n94j13O13J126J126Q09N66
54988H7831M68K82j01m35m07MM87O98O03N59R54J673K046J544L85p12j314j488
54970I3077j286n40O41J573J628R62K38k29o37j058j162o93Q9P48J169J424J421
54953I7365J025M46J13J17P1l11p66q42n05j54r2k16k74j67P5M24Q04R82P09l1
54933I8773r31j577j678j235n48j6K26M67J062J911K452K388K226K766M003M928
$$ plain form
54917 115217 119983 124156 128816 135421 143833 151960 157596 160241 160794 159938 157499 153349 148241 143396 139564
54902 139564 136657 133986 130676 126295 121402 117234 114490 112578 110405 107607 104622 101864 99486 97896
54888 97896 97714 98892 100402 101185 101095 100664 100304 100150 100400 101302 102856 104927 107653 111402 116312 122130 128543
54871 128543 135392 142438 149145 154863 159143 161794 162709 161783 159054 154919 150136 145442 141053 136680 132136
54856 132136 127743 123915 120548 117141 113559 110274 107762 105924 104302 102651 101070 99700 98513 97421
54842 97421 96408 95563 94971 94526 93868 92714 91345 90518 90643 91198 91215 90283 88833 87539 86807 86826 87639 88914
54824 88914 90011 90602 91005 91578 91966 91433 89939 88429 87865 88286 89040 89630 90027 90340 90592 90830 91166 91619
54806 91619 92110 92617 93152 93569 93626 93317 92904 92568 92263 92005 92009 92286 92397 92001 91459 91454 92079 92765 93177 93673 94646
$$ packed form
54917A15217M766M173M660O605Q412Q127N636K645N53q56k439m150n108m845l832
54902A39564k907k671l310m381m893m168k744j912k173k798k985k758k378j590
54888I7896j82J178J510P83r0m31l60j54K50R02J554K071K726L749M910N818O413
54871A28543O849P046O707N718M280K651R15r26k729m135m783m694m389m373m544
54856A32136m393l828l367l407l582l285k512j838j622j651j581j370j187j092
54842I7421j013q45n92m45o58j154j369q27J25N55J7r32j450j294p32J9Q13J275
54824H8914J097N91M03N73L88n33j494j510n64M21P54N90L97L13K52K38L36M53
54806I1619M91N07N35M17N7l09m13l36l05k58MK77J11l96n42nO25O86M12M96R73
$$ plain form
54785 94646 95859 96811 97485 98254 99191 99957 100389 100776 101401 102144 102791 103480 104580 106261 108437 111076 114253
54768 114253 117782 121018 123382 125152 127494 131462 136939 142752 147873 152233 156283 160066 163123 165096
54754 165096 165964 165627 163757 160290 155766 150888 145975 141064 136312 131961 128012 124267 120729 117682 115374
54739 115374 113801 112767 111998 111234 110422 109824 109759 110204 110797 111215 111478 111865 112626 113643 114361 114348 114136 115133
54721 115133 118223 122657 126932 130644 134786 140120 146034 151332 155420 158139 159027 157626 154323 150110
54707 150110 145482 140204 134286 128530 123815 120237 117314 114738 112571 110902 109702 109061 109228 110198 111328
54692 111328 111571 110299 107945 105656 104271 103740 103602 103695 104056 104358 104025 103031 102130 102046 102646 103135 102875 101836
54674 101836 100447 99271 98702 98709 98877 98854 98682 98602 98702 98946 99412 100160 100891 101094 100602 99776 99035 98461 98051
$$ packed form
54785I4646J213R52O74P69R37P66M32L87O25P43O47O89J100J681K176K639L177
54768A14253L529L236K364J770K342L968N477N813N121M360M050L783L057J973
54754A65096Q68l37j870l467m524m878m913m911m752m351l949l745l538l047k308
54739A15374j573j034p69p64q12n98o5M45N93M18K63L87P61J017P18j3k12R97
54721A15133L090M434M275L712M142N334N914N298M088K719Q88j401l303m213
54707A50110m628n278n918n756m715l578k923k576k167j669j200o41J67R70J130
54692A11328K43j272k354k289j385n31j38R3L61L02l33r94r01q4O00M89k60j039
54674A01836j389j176n69PJ68k3j72q0J00K44M66P48P31K03m92q26p41n74m10
$$ plain form
54655 98051 98017 98495 99074 99045 98234 97260 96801 96818 96732 96237 95639 95432 95740 96222 96383 95979 95240 94724 94810 95296 95647
54634 95647 95563 95154 94604 93984 93501 93579 94398 95552 96482 97108 97695 98207 98238 97707 97181 97200 97467 97149 95961 94621
54614 94621 94027 94219 94450 94168 93559 93026 92542 91863 91124 90729 90721 90790 91010 92008 94069 96518 98453 99749 100858
54595 100858 101800 101990 101093 99548 98059 96964 96347 96353 97088 98280 99315 99668 99313 98823 98962 100021 101459
54578 101459 102456 102786 102979 103599 104645 105742 106619 107172 107277 106805 105819 104591 103483 102828 102797 103240 103699 103698
54560 103698 102992 101598 99788 98126 97308 97665 98929 100561 102289 104141 106023 107507 108156 108026 107727 107922
54544 107922 108730 109707 110443 111069 112019 113383 114752 115741 116486 117445 118794 120151 120890 120696 119848 118974 118509
54527 118509 118428 118493 118615 118781 118754 118117 116705 114875 113309 112609 112987 114102 115216 115704 115504 115023 114684 114683 115004
$$ packed form
54655I8051l4M78N79k9q11r74m59J7q6m95n98k07L08M82J61m04p39n16Q6M86L51
54634I5647q4m09n50o20m83P8Q19J154R30O26N87N12L1n31n26J9K67l18j188j340
54614I4621n94J92K31k82o09n33m84o79p39l95qO9K20R98K061K449J935J296J109
54595A00858R42J90q97j545j489j095o17OP35J192J035L53l55m90J39J059J438
54578A01459R97L30J93O20J046J097Q77N53J05m72r86j228j108o55l1M43M59j
54560A03698p06j394j810j662q18L57J264J632J728J852J882J484O49j30k99J95
54544A07922Q08R77P36O26R50J364J369R89P45R59J349J357P39j94q48q74m65
54527A18509q1O5J22J66k7o37j412j830j566p00L78J115J114M88k00m81l39jL21
$$ plain form
54508 115004 115371 115292 114528 113512 112958 112990 113068 112822 112588 112889 113767 114869 115869 116499 116466 115689 114529 113528
54490 113528 112969 112831 113017 113439 114044 114989 116622 119036 121702 123796 124933 125485 126165 127314 128550 129173
54474 129173 129011 128726 129083 130061 131107 132090 133406 135064 136340 136738 136707 136968 137556 138017 138184 138210 138107 137811
54456 137811 137504 137343 137014 136109 134817 133694 132817 131759 130433 129349 128895 128787 128466 127727 126804 126072 125742
54439 125742 125666 125473 125085 124924 125299 125759 125554 124639 123703 123210 123020 123029 123523 124584 125683 126276 126455 126655 126994
54420 126994 127266 127380 127477 127732 128266 129136 130186 131030 131412 131458 131420 131275 130831 130185 129877 130473 131936 133460 134084
54401 134084 133581 132608 131877 131413 130887 130404 130418 130986 131675 132240 132821 133355 133389 132780 132059 131743 131727 131709 131773 132120
54381 132120 132562 132839 133150 133876 134929 135846 136373 136514 136190 135412 134714 134809 135786 137090 138302 139362 139989 139566
$$ packed form
54508A15004L67p9p64j016n54L2P8k46k34L01Q78J102J000O30l3p77j160j001
54490A13528n59j38J86M22O05R45J633K414K666K094J137N52O80J149J236O23
54474A29173j62k85L57R78J046R83J316J658J276L98l1K61N88M61J67K6j03k96
54456A37811l07j61l29r05j292j123q77j058j326j084m54j08l21p39r23p32l30
54439A25742p6j93l88j61L75M60k05r15r36m93j90RM94J061J099N93J79K00L39
54420A26994K72J14R7K55N34Q70J050Q44L82M6l8j45m44o46l08N96J463J524O24
54401A34084n03r73p31m64n26m83J4N68O89N65N81N34L4o09p21l16j6j8O4L47
54381A32120M42K77L11P26J053R17N27J41l24p78o98R5R77J304J212J060O27m23
$$ plain form
54363 139566 137986 136123 134970 134602 134336 133661 132578 131269 129980 129209 129443 130499 131480 131630 130977 129992
54347 129992 128937 127902 127206 127228 127759 128003 127456 126535 126051 126233 126506 126179 125084 123614 122309 121461 120995
54330 120995 120681 120450 120379 120411 120347 120265 120634 121687 122926 123622 123658 123470 123325 123171 123118 123463 124133 124666 124895 125108
54310 125108 125382 125386 125149 125323 126218 127109 127177 126679 126472 126736 126956 127008 127370 128184 128953 129377 129798 130465 130937 130650
54290 130650 129624 128257 126804 125503 124792 124857 125131 124806 123800 122817 122417 122393 122129 121313 120224 119539 119833
54273 119833 120991 122152 122530 122322 122468 123445 124665 125270 125096 124556 123926 123247 122777 122926 123636 124255 124280 123926
54255 123926 123782 124111 124722 125289 125579 125532 125406 125709 126650 127698 127962 127078 125529 124097 123216 122905 123038 123437
54237 123437 123843 123957 123618 122882 121960 121086 120420 120026 119841 119642 119154 118346 117576 117196 116983 116329 115123 114061
$$ packed form
54363A39566j580j863j153l68k66o75j083j309j289p71K34J056R81J50o53r85
54347A29992j055j035o96K2N31K44n47r21m84J82K73l27j095j470j305q48m66
54330A20995l14k31p1L2o4q2L69J053J239O96L6j88j45j54n3L45O70N33K29K13
54310A25108K74Mk37J74Q95Q91O8m98k07K64K20N2L62Q14P69M24M21O67M72k87
54290A30650j026j367j453j301p11O5K74l25j006r83m00k4k64q16j089o85K94
54273A19833J158J161L78k08J46R77J220O05j74n40o30o79m70J49P10O19K5l54
54255A23926j44L29O11N67K90m7j26L03R41J048K64q84j549j432q81l11J33L99
54237A23437M06J14l39p36r22q74o66l94j85j99m88q08p70l80k13o54j206j062
$$ plain form
54219 114061 113764 113933 113795 113207 112812 113186 114277 115639 116744 117076 116469 115476 114917 114918 114849 114385 114086 114546 115474
54200 115474 116095 116183 116173 116378 116616 116591 116314 116012 115852 115820 115774 115626 115461 115425 115531 115695 115921 116178 116188 115730 115201
54179 115201 115330 116169 116882 116830 116329 115945 115529 114602 113358 112569 112583 113035 113547 114125 114816 115453 115889 116132 116141 115846
54159 115846 115429 115291 115627 116225 116658 116513 115575 114171 113186 113294 114192 115006 115353 115532 115702 115587 115189 115111 115745
54140 115745 116591 116911 116741 116777 117371 118145 118581 118624 118563 118567 118494 118119 117449 116773 116424 116526 116999 117682 118306 118502 118103
54119 118103 117399 116880 116739 116879 117317 118182 119259 119962 120045 120058 120791 122368 124052 124879 124340 122629 120428 118406
54101 118406 116822 115577 114613 114042 113875 113855 113697 113375 113049 112895 113112 113900 115283 117007 118715 120151 121145
54084 121145 121602 121615 121482 121499 121776 122222 122576 122475 121793 120938 120557 120863 121485 122068 122652 123273 123583 123241 122499
$$ packed form
54219A14061k97J69j38n88l95L74J091J362J105L32o07r93n59Jo9m64k99M60R28
54200A15474O21Q8j0K05K38k5k77l02j60l2m6j48j65l6J06J64K26K57J0m58n29
54179A15201J29Q39P13n2n01l84m16r27j244p89J4M52N12N78O91O37M36K43Rk95
54159A15846m17j38L36N98M33j45r38j404r85J08Q98Q14L47J79J70j15l98p8O34
54140A15745Q46L20j70L6N94P74M36M3o1Mp3l75o70o76l49J02M73O83O24J96l99
54119A18103p04n19j41J40M38Q65J077P03Q3J3P33J577J684Q27n39j711k201k022
54101A18406j584j245r64n71j67k0j58l22l26j54K17P88J383J724J708J436R94
54084A21145M57J3j33J7K77M46L54j01o82q55l81L06O22N83N84O21L10l42p42
$$ plain form
54065 122499 121988 122007 122329 122655 122941 123250 123573 123893 124234 124547 124686 124593 124414 124350 124456 124630 124759 124813 124804 124769 124802
54044 124802 125064 125631 126365 127117 128030 129405 131146 132641 133480 134000 134750 135616 136052 136081 136428 137523 138931
54027 138931 140011 140613 140891 140968 141179 142099 143776 145285 145635 144864 143737 142604 141185 139341 137373 135526
54011 135526 133759 132087 130654 129441 128360 127662 127642 127847 127230 125372 123034 121214 120175 119763 120053 121046
53995 121046 122139 122691 122988 123914 125626 127231 128007 128379 129293 130991 132781 133823 133745 132661 131058 129698
53979 129698 129300 130005 131257 132317 132833 132901 132731 132471 132294 132426 133002 133930 135032 136217 137483 138803 140138
53962 140138 141572 143293 145343 147425 149108 150211 150927 151531 152109 152654 153333 154460 156172 158258 160413
53947 160413 162611 165196 168683 173527 179953 187909 197244 207995 220415 234601 250117 265998 280942
$$ packed form
54065A22499n11J9L22L26K86L09L23L20L41L13J39r3j79o4J06J74J29N4rl5L3
54044A24802K62N67P34P52R13J375J741J495Q39N20P50Q66M36K9L47J095J408
54027A38931J080O02K78P7K11R20J677J509L50p71j127j133j419j844j968j847
54011A35526j767j672j433j213j081o98k0K05o17j858k338j820j039m12K90R93
53995A21046J093N52K97R26J712J605P76L72R14J698J790J042p8j084j603j360
53979A29698l98P05J252J060N16O8j70k60j77J32N76R28J102J185J266J320J335
53962A40138J434J721K050K082J683J103P16O04N78N45O79J127J712K086K155
53947A60413K198K585L487M844O426P956R335J0751J2420J4186J5516J5881J4944
$$ plain form
53934 280942 293369 301652 304816 303171 298047 290788 282191 272847 263556 255067 247510 240408 233285 226166
53920 226166 219526 213820 209110 205136 201689 198748 196108 193108 189168 184643 180705 178155 176627 175179
53906 175179 173368 171417 169593 167880 166220 164728 163522 162558 161621 160379 158500 155975 153311 151203 149937
53891 149937 149225 148624 147979 147453 147206 147131 146883 146255 145492 145046 145004 144977 144670 144276 144090 144013 143765 143339 142878 142286
53871 142286 141458 140765 140778 141417 141920 141811 141478 141532 141965 142230 141888 140886 139429 137916 136896 136716 137164 137618
53853 137618 137628 137302 137160 137599 138488 139307 139767 140146 140839 141731 142396 142806 143375 144167 144682 144720 144878 145662 146515
53834 146515 146447 145478 144687 144742 145101 144958 144379 143978 143849 143486 142679 141902 141612 141611 141411 140926 140419 139887 138996 137800
53814 137800 137128 137910 140220 143294 146295 148792 150587 151646 152338 153312 154841 156568 158099 159516 161026
$$ packed form
53934B80942J2427Q283L164j645n124p259q597r344r291q489p557p102p123p119
53920B26166o640n706m710l974l447k941k640l000l940m525l938k550j528j448
53906A75179j811j951j824j713j660j492j206r64r37j242j879k525k664k108j266
53891A49937p12o01o45n26k47p5k48o28p63m46m2k7l07l94j86p7k48m26m61n92
53871A42286q28o93J3O39N03j09l33N4M33K65l42j002j457j513j020j80M48M54
53853A37618J0l26j42M39Q89Q19M60L79O93Q92O65M10N69P92N15L8J58P84Q53
53834A46515o8r69p91N5L59j43n79m01j29l63q07p77k90jk00m85n07n32q91j196
53814A37800o72P82K310L074L001K497J795J059O92R74J529J727J531J417J510
$$ plain form
53799 161026 162457 163558 164530 165726 166965 167777 168279 169161 170603 171815 171963 171137 170048 169182 168651 168514
53783 168514 168785 169257 169773 170462 171369 172080 172248 172371 173419 175652 178368 180966 183781 187682 193235 200484
53767 200484 209156 218777 228874 239249 249645 258828 264461 264554 259046 249747 238912 228141 218306
53754 218306 209775 202521 196306 190962 186407 182538 179328 176856 174973 173160 171127 169356 168545 168603 168772
53739 168772 168683 168658 168954 169429 170148 171576 173714 175685 176667 176779 176566 176180 175653 175492 176141 177168 177873 178561
53721 178561 180294 183253 186246 188215 189521 191201 193497 195746 197502 199117 201189 203852 206718 209309
53707 209309 211424 213236 215134 217438 220143 222905 225298 227231 229124 231526 234504 237575 240405 243249
53693 243249 246425 249523 251640 252402 252361 252272 252321 252164 251461 250178 248622 247325 246673 246519 246359 245965 245589 245431
$$ packed form
53799A61026J431J101R72J196J239Q12N02Q82J442J212J48q26j089q66n31j37
53783A68514K71M72N16O89R07P11J68J23J048K233K716K598K815L901N553P249
53767B00484Q672R621J0097J0375J0396R183N633R3n508r299j0835j0771r835
53754B18306q531p254o215n344m555l869l210k472j883j813k033j771q11N8J69
53739A68772q9k5K96M75P19J428K138J971R82J12k13l86n27j61O49J027P05O88
53721A78561J733K959K993J969J306J680K296K249J756J615K072K663K866K591
53707B09309K115J812J898K304K705K762K393J933J893K402K978L071K830K844
53693B43249L176L098K117P62m1q9M9j57p03j283j556j297o52j54j60l94l76j58
$$ plain form
53675 245431 245233 244606 243594 242670 242351 242964 244581 246951 249603 252280 255142 258370 261689 264550 266795
53660 266795 268951 271763 275410 279132 281618 281939 280211 277218 273519 269225 264654 260660 257916 256156
53646 256156 254573 252783 250945 249142 247243 245450 244367 244216 244369 244019 243091 242160 241623 241379 241317 241703 242875
53629 242875 244786 247115 249726 252740 256115 259449 262330 264742 266963 269223 271672 274535 277969 281765
53615 281765 285495 289003 292468 295914 299011 301591 304013 306667 309359 311583 313324 315165 317561 320322
53601 320322 322888 324835 326031 326579 326839 327272 328050 328900 329490 329856 330245 330625 330585 329736 327991 325491 322555
53584 322555 319786 317868 316905 316157 314823 312983 311298 309867 308002 305355 302669 300866 299822 298670 297088
53569 297088 295606 294698 294245 294025 294172 294915 296281 298194 300460 302568 303995 304890 305919 307289 308491 309257
$$ packed form
53675B45431j98o27j012r24l19O13J617K370K652K677K862L228L319K861K245
53660B66795K156K812L647L722K486L21j728k993l699m294m571l994k744j760
53646B56156j583j790j838j803j899j793j083j51J53l50r28r31n37k44o2L86J172
53629B42875J911K329K611L014L375L334K881K412K221K260K449K863L434L796
53615B81765L730L508L465L446L097K580K422K654K692K224J741J841K396K761
53601C20322K566J947J196N48K60M33P78Q50N90L66L89L80m0q49j745k500k936
53584C22555k769j918r63p48j334j840j685j431j865k647k686j803j044j152j582
53569B97088j482r08m53k20J47P43J366J913K266K108J427Q95J029J370J202P66
$$ plain form
53553 309257 310137 311682 313616 315381 317058 319125 321698 324540 327491 330340 332664 334487 336740 340313
53539 340313 344946 349839 355068 361427 368981 376951 385124 394265 404749 415760 426435 436981 448074
53526 448074 459833 472128 485301 499837 515624 532200 549457 567554 586464 606225 627446
53515 627446 650854 676415 703410 731245 759622 787990 815489 841666 866793 891332 915345
53504 915345 938537 960568 981276 1000818 1019701 1038480 1057421 1076585 1096102 1116098 1136420
53493 1136420 1156703 1176679 1196168 1214898 1232686 1249780 1266653 1283418 1299725 1315360 1330625
53482 1330625 1346051 1361851 1377677 1392730 1406198 1417800 1427819 1436326 1442624 1445906 1446401 1445205
53470 1445205 1442787 1438246 1430394 1419163 1405526 1390377 1374002 1356555 1338563 1320787 1303725 1287149
$$ packed form
53553C09257Q80J545J934J765J677K067K573K842K951K849K324J823K253L573
53539C40313M633M893N229O359P554P970Q173R141J0484J1011J0675J0546J1093
53526D48074J1759J2295J3173J4536J5787J6576J7257J8097J8910J9761K1221
53515F27446K3408K5561K6995K7835K8377K8368K7499K6177K5127K4539K4013
53504I15345K3192K2031K0708J9542J8883J8779J8941J9164J9517J9996K0322
53493A136420K0283J9976J9489J8730J7788J7094J6873J6765J6307J5635J5265
53482A330625J5426J5800J5826J5053J3468J1602J0019Q507O298L282M95j196
53470A445205k418m541p852j1231j3637j5149j6375j7447j7992j7776j7062j6576
$$ plain form
53458 1287149 1269993 1250917 1229348 1206015 1182218 1158635 1135126 1111619 1088731 1067226 1047176
53447 1047176 1028002 1009250 990996 973519 956912 941233 926799 914052 903193 894154 886933 881698
53435 881698 878576 877531 878525 881537 886311 892314 899174 906994 916031 926263 937591 950328 965076
53422 965076 981986 1000410 1019500 1039076 1059758 1082233 1106463 1131739 1157626 1184718 1214183
53411 1214183 1246507 1281084 1317080 1354275 1392778 1432553 1473809 1517473 1564473 1614651 1667018
53400 1667018 1720951 1776348 1832714 1889117 1945357 2002266 2060397 2119162 2177755 2236124 2294275
53389 2294275 2351257 2405723 2457166 2505790 2551517 2594022 2633562 2670857 2706070 2738651 2768177
53378 2768177 2794619 2817768 2837220 2853111 2865998 2875608 2880351 2878497 2869208 2852127 2826710 2792731
$$ packed form
53458A287149j7156j9076k1569k3333k3797k3583k3509k3507k2888k1505k0050
53447A047176j9174j8752j8254j7477j6607j5679j4434j2747j0859r039p221n235
53435H81698l122j045R94L012M774O003O860P820R037J0232J1328J2737J4748
53422I65076J6910J8424J9090J9576K0682K2475K4230K5276K5887K7092K9465
53411A214183L2324L4577L5996L7195L8503L9775M1256M3664M7000N0178N2367
53400A667018N3933N5397N6366N6403N6240N6909N8131N8765N8593N8369N8151
53389B294275N6982N4466N1443M8624M5727M2505L9540L7295L5213L2581K9526
53378B768177K6442K3149J9452J5891J2887R610M743j854r289j7081k5417l3979
$$ plain form
53366 2792731 2751039 2703094 2649994 2592570 2532225 2470803 2409485 2348319 2287044 2225987 2165957
53355 2165957 2107606 2051102 1996211 1942426 1889169 1836126 1783420 1731350 1679919 1628717 1577365
53344 1577365 1526138 1476044 1428226 1383280 1341219 1301963 1265674 1232597 1202812 1176218 1152591
53333 1152591 1131589 1112804 1095879 1080472 1066145 1052549 1039711 1027880 1016956 1006386 995843
53322 995843 985769 977072 970375 965681 962544 960377 958814 958037 958608 960814 964302 968522 973264 978652
53308 978652 984918 992509 1002045 1013798 1027436 1042703 1060057 1080134 1102758 1127083 1152551 1179092
53296 1179092 1206477 1234260 1262458 1291522 1321352 1351021 1379726 1407362 1433750 1458076 1479834
53285 1479834 1499746 1518918 1537337 1554031 1568476 1580909 1591131 1597971 1600458 1599015 1595041 1589606
$$ packed form
53366B792731m1692m7945n3100n7424o0345o1422o1318o1166o1275o1057o0030
53355B165957n8351n6504n4891n3785n3257n3043n2706n2070n1431n1202n1352
53344A577365n1227n0094m7818m4946m2061l9256l6289l3077k9785k6594k3627
53333A152591k1002j8785j6925j5407j4327j3596j2838j1831j0924j0570j0543
53322I95843j0074q697o697m694l137k167j563p77N71K206L488M220M742N388
53308I78652O266P591R536J1753J3638J5267J7354K0077K2624K4325K5468K6541
53296A179092K7385K7783K8198K9064K9830K9669K8705K7636K6388K4326K1758
53285A479834J9912J9172J8419J6694J4445J2433J0222O840K487j443l974n435
$$ plain form
53273 1589606 1582860 1574334 1563354 1549352 1532163 1512048 1489232 1463605 1435190 1404737 1373416 1341752
53261 1341752 1309183 1274900 1239020 1202733 1167291 1133041 1099621 1067015 1036076 1007681 981494
53250 981494 955974 929759 902712 875374 847845 819761 791203 762953 735710 709552 684397
53239 684397 660452 637808 616103 595234 576179 560312 547818 537348 527459 517811 508659 499737
53227 499737 490294 480035 469428 459030 448893 438673 428019 416782 405174 393804 383323 373882
53215 373882 365149 356899 349329 342632 336563 330740 325216 320339 316036 311600 306400 300618 295007 289965
53201 289965 285140 280007 274594 269472 265162 261746 258830 255661 251459 246106 240576 236241 233605 232001
53187 232001 230591 229165 227805 226403 225059 224440 225036 226237 226864 226509 225712 224930 224062 223071 222251 221633 220829
$$ packed form
53273A589606o746q526j0980j4002j7189k0115k2816k5627k8415l0453l1321l1664
53261A341752l2569l4283l5880l6287l5442l4250l3420l2606l0939k8395k6187
53250I81494k5520k6215k7047k7338k7529k8084k8558k8250k7243k6158k5155
53239F84397k3945k2644k1705k0869j9055j5867j2494j0470r889r648r152q922
53227D99737r443j0259j0607j0398j0137j0220j0654j1237j1608j1370j0481r441
53215C73882q733q250p570o697o069n823n524m877m303m436n200n782n611n042
53201B89965m825n133n413n122m310l416k916l169m202n353n530m335k636j604
53187B32001j410j426j360j402j344o19N96J201O27l55p97p82q68r91q20o18q04
$$ plain form
53170 220829 219807 219202 219438 220109 220709 221406 222534 223821 224800 225630 226762 227999 228634 228455 228037 228026 228654
53153 228654 229890 231506 232943 233707 233965 234272 234659 234530 233574 232217 231011 230124 229669 229968 231078 232374
53137 232374 233022 232741 231917 231214 231156 231741 232243 231770 230229 228423 227022 225945 225004 224506 224615 224625 223672 221948
53119 221948 220411 219339 218000 215889 213550 211839 210884 210186 209304 208097 206589 205028 203879 203403 203364 203388
53103 203388 203400 203440 203283 202616 201505 200275 198996 197473 195780 194378 193579 193191 192879 192555 192237 191815 191325
53086 191325 191221 191947 193235 194241 194458 194227 194168 194478 195008 195789 196952 198122 198348 197022 194743 192965 192663
53069 192663 193466 194112 193600 191862 189543 187430 186092 185783 186424 187658 189008 190035 190451 190286 190024 190363
53053 190363 191564 193049 193844 193475 192302 191026 190096 189605 189493 189680 190122 190847 191819 192724 193085 192771 192222
$$ packed form
53170B20829j022o05K36O71O00O97J128J287R79Q30J132J237O35j79m18j1O28
53153B28654J236J616J437P64K58L07L87j29r56j357j206q87m55K99J110J296
53137B32374O48k81q24p03n8N85N02m73j541j806j401j077r41m98J09J0r53j724
53119B21948j537j072j339k111k339j711r55o98q82j207j508j561j149m76l9K4
53103B03388J2M0j57o67j111j230j279j523j693j402p99l88l12l24l18m22m90
53086A91325j04P26J288J006K17k31n9L10N30P81J163J170K26j326k279j778l02
53069A92663Q03O46n12j738k319k113j338l09O41J234J350J027M16j65k62L39
53053A90363J201J485P95l69j173j276r30m91j12J87M42P25R72R05L61l14n49
$$ plain form
53036 192222 191948 191930 191774 191351 191022 191183 191815 192576 193178 193547 193657 193388 192646 191602 190675 190154 189952 189925 190325
53017 190325 191546 193347 194744 194946 194066 192664 190970 189032 187252 186108 185425 184621 183720 183429 184045 184948
53001 184948 185537 186015 186713 187161 186637 185452 184891 185737 187393 188735 189395 189913 190876 192274 193662 194662 195188
52984 195188 195312 195109 194694 194282 194007 193718 193116 192182 191289 190779 190584 190441 190334 190493 190999 191703 192564 193820
52966 193820 195665 197836 199777 201169 202131 202772 202772 201686 199736 197911 197052 197003 196946 196393 195465 194299 192769
52949 192769 190936 189297 188227 187512 186747 185929 185321 184984 184873 185192 186142 187317 187903 187599 186951 186539 186170
52932 186170 185179 183400 181510 180394 180369 181063 181889 182477 182703 182530 181991 181250 180500 179824 179315 179250 179827 180730
52914 180730 181298 181289 181178 181441 181869 181883 181282 180316 179217 178111 177284 177049 177274 177400 177016 176208 175318 174663 174510
$$ packed form
53036A92222k74j8j56m23l29J61O32P61O02L69J10k69p42j044r27n21k02k7M00
53017A90325J221J801J397K02q80j402j694j938j780j144o83q04r01k91O16R03
53001A84948N89M78O98M48n24j185n61Q46J656J342O60N18R63J398J388J000N26
52984A95188J24k03m15m12k75k89o02r34q93n10j95j43j07J59N06P04Q61J256
52966A93820J845K171J941J392R62O41%j086j950j825q59m9n7n53r28j166j530
52949A92769j833j639j070p15p65q18o08l37j11L19R50J175N86l04o48m12l69
52932A86170r91j779j890j116k5O94Q26N88K26j73n39p41p50o76n09o5N77R03
52914A80730N68rj11K63M28J4o01r66j099j106q27k35K25J26l84q08q90o55j53
$$ plain form
52895 174510 174964 175782 176555 177155 177804 178623 179402 179935 180368 181047 182195 183807 185704 187554 188982 189731 189739 189105
52877 189105 188112 187156 186433 185743 184834 183835 183090 182684 182515 182783 183923 185945 188208 189960 190845 190864 190287 189709
52859 189709 189760 190529 191602 192716 193878 194737 194515 192931 190661 188430 186185 183700 181449 180060 179163 177668
52843 177668 175216 172601 170643 169272 168018 166842 166106 166004 166340 166796 167205 167602 168062 168467 168577 168406 168295
52826 168295 168365 168181 167367 166365 166025 166486 167040 167174 167172 167543 168409 169679 171319 173080 174446 175303 176327 178225
52808 178225 180802 183164 184638 185081 184530 183101 181175 179150 176869 173767 169738 165561 162282 160411 159796
52793 159796 159987 160525 161103 161693 162398 163042 163118 162391 161347 160716 160641 160718 160808 161280 162200 162787 162241 160910 160009
52774 160009 160139 160687 160885 160875 161219 161844 162181 162183 162456 163265 164066 164333 164301 164467 164713 164480 163648 162777 162449 162725
$$ packed form
52895A74510M54Q18P73O00O49Q19P79N33M33O79J148J612J897J850J428P49Qo34
52877A89105r93r56p23o90r09r99p45m06j69K68J140K022K263J752Q85J9n77n78
52859A89709N1P69J073J114J162Q59k22j584k270k231k245k485k251j389q97j495
52843A77668k452k615j958j371j254j176p36j02L36M56M09L97M60M05J10j71j11
52826A68295P0j84q14j002l40M61N54J34kL71Q66J270J640J761J366Q57J024J898
52808A78225K577K362J474M43n51j429j926k025k281l102m029m177l279j871o15
52793A59796J91N38N78N90P05O44P6p27j044o31p5P7R0M72R20N87n46j331r01
52774A60009J30N48J98j0L44O25L37KK73Q09Q01K67l2J66K46k33q32q71l28K76
$$ plain form
52754 162725 163242 163573 163457 163021 162791 163210 164029 164451 164068 163467 163692 165162 167314 169225 170412 171054 171648
52737 171648 172563 173824 175188 176380 177327 178196 179205 180345 181302 181702 181468 180872 180231 179576 178657 177245 175347
52720 175347 173194 171148 169632 169010 169322 170101 170581 170263 169359 168584 168486 168999 169701 170343 170946 171434 171525 171186
52702 171186 170961 171488 172702 173802 174157 174019 174137 174803 175531 175711 175304 174807 174699 175074 175726 176405 177020 177673
52684 177673 178486 179353 179938 180035 179791 179443 178979 178345 177844 177909 178426 178726 178476 178138 178270 178697 178861 178760 179025
52665 179025 180095 181781 183668 185545 187336 188948 190344 191540 192455 192991 193244 193311 192843 191171 188083 184249
52649 184249 180757 178398 177391 177413 177750 177781 177523 177447 177682 177797 177530 177255 177421 177971 178711 179845 181629 183732
52631 183732 185483 186617 187371 188066 189063 190860 193550 196182 197356 196651 195003 193559 192626 191915 191322 191033
$$ packed form
52754A62725N17L31j16m36k30M19Q19M22l83o01K25J470K152J911J187O42N94
52737A71648R15J261J364J192R47Q69J009J140R57M00k34n96o41o55r19j412j898
52720A75347k153k046j516o22L12P79M80l18r04p75r8N13P02O42O03M88R1l39
52702A71186k25N27J214J100L55j38J18O66P28J80m07m97j08L75O52O79O15O53
52684A77673Q13Q67N85R7k44l48m64o34n01O5N17L00k50l38J32M27J64j01K65
52665A79025J070J686J887J877J791J612J396J196R15N36K53O7m68j672l088l834
52649A84249l492k359j007K2L37L1k58p6K35J15k67k75J66N50P40J134J784K103
52631A83732J751J134P54O95R97J797K690K632J174p05j648j444r33p11n93k89
$$ plain form
52615 191033 191087 191108 190500 188936 186792 184985 184141 183989 183853 183608 183729 184493 185684 187138 189021 191343 193660
52598 193660 195441 196438 196637 196342 196345 197361 198986 199872 199327 198191 197647 197764 197790 197388 196873 196534 196493 197001 198130
52579 198130 199310 199855 199891 200053 200348 200134 199309 198658 198736 199132 199236 199086 199000 198904 198547 197988 197347 196451 195280
52560 195280 194503 194870 196159 197328 197751 197831 198262 199097 199780 199829 199275 198607 198407 198916 199815 200490 200557 200111 199504
52541 199504 199045 198915 199157 199614 199988 200080 199950 199842 199952 200277 200600 200629 200224 199502 198598 197409 195740 193728
52523 193728 191880 190562 189669 189013 188883 189820 191784 193875 195120 195423 195538 196218 197563 199158 200599 201862
52507 201862 203307 205350 207952 210421 211912 212235 211957 211647 211227 210305 208924 207685 207140 207254 207502 207263
52491 207263 206161 204273 202067 200000 198144 196389 194954 194388 195009 196591 198734 201247 203977 206563 208692
$$ packed form
52615A91033N4K1o08j564k144j807q44j52j36k45J21P64J191J454J883K322K317
52598A93660J781R97J99k95LJ016J625Q86n45j136n44J17K6m02n15l39m1N08J129
52579A98130J180N45L6J62K95k14q25o51P8L96J04j50q6r6l57n59o41q96j171
52560A95280p77L67J289J169M23Q0M31Q35O83M9n54o68k00N09Q99O75O7m46o07
52541A99504m59j30K42M57L74R2j30j08J10L25L23K9m05p22r04j189j669k012
52523A93728j848j318q93o56j30R37J964K091J245L03J15O80J345J595J441J263
52507B01862J445K043K602K469J491L23k78l10m20r22j381j239n45J14K48k39
52491B07263j102j888k206k067j856j755j435n66O21J582K143K513K730K586K129
$$ plain form
52476 208692 210430 211978 213178 213695 213649 213675 214158 214743 214850 214482 214222 214545 215426 216605 217941 219375 220753
52459 220753 221922 222935 223990 225087 225826 225647 224266 221925 219214 216662 214447 212527 210952 209907 209391
52444 209391 209037 208530 208134 208445 209478 210300 209926 208474 207088 206736 207375 208346 209222 210020 210852 211712 212558 213323
52426 213323 213848 214034 214067 214306 214893 215719 216864 218827 222033 226237 230717 235175 240229 246839 255319 265007
52410 265007 274754 283408 289837 292929 292093 287844 281591 274656 267615 260619 254108 248844 245263 243091
52396 243091 241707 240693 239937 239352 238790 238189 237658 237312 237073 236717 236156 235716 236102 237918 241089 244801 248157
52379 248157 250896 253406 256127 259083 262003 264706 267342 270412 274552 280000 286140 291712 295745 298273
52365 298273 300083 301880 303755 305289 305971 305645 304735 303940 303590 303443 303302 303587 304994 307721 311439 315879
$$ packed form
52476B08692J738J548J200N17m6K6M83N85J07l68k60L23Q81J179J336J434J378
52459B20753J169J013J055J097P39j79j381k341k711k552k215j920j575j045n16
52444B09391l54n07l96L11J033Q22l74j452j386l52O39R71Q76P98Q32Q60Q46P65
52426B13323N25J86L3K39N87Q26J145J963L206M204M480M458N054O610Q480R688
52410B65007R747Q654O429L092q36m249o253o935p041o996o511n264l581k172
52396B43091j384j014p56n85n62o01n31l46k39l56n61m40L86J816L171L712L356
52379B48157K739K510K721K956K920K703K636L070M140N448O140N572M033K528
52365B98273J810J797J875J534O82l26r10p95l50j47j41K85J407K727L718M440
$$ plain form
52349 315879 321023 326741 332744 338993 345813 353473 361981 371298 381317 391648 402023 413027 425678
52336 425678 439933 454369 467936 481399 496243 512572 528991 544368 558832 573060 587407
52325 587407 601882 616271 630088 642930 655023 666849 678139 687862 695365 700877 704633 706285
52313 706285 705687 703582 700857 697533 693177 688029 683067 679047 676003 673585 671376 668936 666075 663175
52299 663175 660879 659442 658725 658786 660038 662659 666195 669953 673633 677485 681991 687479 693897 700888 708159
52284 708159 715774 724036 733128 742941 753163 763360 773030 781874 790080 798231 806774 815531 823704 830460
52270 830460 835665 840005 844086 847380 848432 846375 841977 836927 832304 828047 823644 818791 813461 807845
52256 807845 802398 797575 793357 789283 785074 780990 777456 774609 772335 770504 768958 767415 765685 763954
$$ packed form
52349C15879N144N718O003O249O820P660Q508R317J0019J0331J0375J1004J2651
52336D25678J4255J4436J3567J3463J4844J6329J6419J5377J4464J4228J4347
52325E87407J4475J4389J3817J2842J2093J1826J1290R723P503N512L756J652
52313G06285n98k105k725l324m356n148m962m020l044k418k209k440k861k900
52299F63175k296j437p17O1J252K621L536L758L680L852M506N488O418O991P271
52284G08159P615Q262R092R813J0222J0197R670Q844Q206Q151Q543Q757Q173O756
52270H30460N205M340M081L294J052k057m398n050m623m257m403m853n330n616
52256H07845n447m823m218m074m209m084l534k847k274j831j546j543j730j731
$$ plain form
52242 763954 762636 761863 761302 760605 759981 760101 761464 764085 767896 772979 779013 784803 789150 792286 795779
52227 795779 800676 806424 811976 817306 823006 828890 833983 837897 841409 845584 850984 857820 866012 874754
52213 874754 882649 888863 893803 898294 902443 905741 908057 909967 912068 914368 916473 918226 919901 921675
52199 921675 923054 923259 922350 921545 921888 922855 922978 921803 920499 920374 921492 923047 924370 925015 924439 922298
52183 922298 918905 914919 910793 906827 903331 900196 896652 892122 887132 882777 879435 876674 874328 872885
52169 872885 872661 873314 874456 876192 878581 880991 882499 882866 882863 883630 885824 889210 892938 896278 899110 901607
52153 901607 903599 904707 905143 905857 907562 909968 912458 915248 919333 925260 932446 939927 947376 955096 963255
52138 963255 971615 980022 988765 998182 1008093 1017931 1027400 1036753 1046456 1056835 1068133 1080571 1094073
$$ packed form
52242G63954j318p73n61o97o24J20J363K621L811N083O034N790M347L136L493
52227G95779M897N748N552N330N700N884N093L914L512M175N400O836Q192Q742
52213H74754P895O214M940M491M149L298K316J910K101K300K105J753J675J774
52199I21675J379K05r09q05L43R67J23j175j304j25J118J555J323O45n76k141
52183I22298l393l986m126l966l496l135l544m530m990m355l342k761k346j443
52169H72885k24O53J142J736K389K410J508L67lP67K194L386L728L340K832K497
52153I01607J992J108M36P14J705K406K490K790M085N927P186P481P449P720Q159
52138I63255Q360Q407Q743R417R911R838R469R353R703J0379J1298J2438J3502
$$ plain form
52125 1094073 1108124 1122150 1135914 1149275 1161803 1173054 1183137 1192498 1201021 1207973 1213092 1217216
52113 1217216 1221227 1224636 1225867 1223995 1219642 1214055 1207805 1200806 1193210 1185738 1179090 1173399 1168393 1163947
52099 1163947 1160434 1158598 1159085 1161882 1166218 1171190 1176531 1182650 1189875 1197881 1205926 1213495 1220542 1227259
52085 1227259 1233814 1240319 1246919 1253903 1261741 1270926 1281633 1293556 1306049 1318352 1329692 1339475 1347555
52072 1347555 1354173 1359452 1363108 1364806 1364558 1362484 1358474 1352452 1344718 1335515 1324360 1310493 1294104
52059 1294104 1276547 1259137 1242198 1225495 1208985 1192716 1176494 1160239 1144391 1129417 1115099
52048 1115099 1100819 1086461 1072492 1059235 1046567 1034492 1023537 1014374 1007213 1001669 997069 992950
52036 992950 989585 987953 988813 991693 995048 997479 998465 997916 995569 991183 984996 977527 969043 959506 948942
$$ packed form
52125A094073J4051J4026J3764J3361J2528J1251J0083R361Q523O952N119M124
52113A217216M011L409J231j872m353n587o250o999p596p472o648n691n006m446
52099A163947l513j836M87K797M336M972N341O119P225Q006Q045P569P047O717
52085A227259O555O505O600O984P838R185J0707J1923J2493J2303J1340R783Q080
52072A347555O618N279L656J698k48k074m010o022p734r203j1155j3867j6389
52059A294104j7557j7410j6939j6703j6510j6269j6222j6255j5848j4974j4318
52048A115099j4280j4358j3969j3257j2668j2075j0955r163p161n544m600m119
52036I92950l365j632Q60K880L355K431R86n49k347m386o187p469q484r537j0564
$$ plain form
52021 948942 937555 925542 913088 900527 888215 876153 863972 851400 838598 825892 813325
52010 813325 800637 787662 774582 761767 749479 737803 726789 716506 706858 697400 687479 676689
$$ packed form
52021I48942j1387j2013j2454j2561j2312j2062j2181j2572j2802j2706j2567
52010H13325j2688j2975j3080j2815j2288j1676j1014j0283r648r458r921j0790
$$ [...]
##END NTUPLES=NMR SPECTRUM
##END=
