
##TITLE=AC1371_2395_7221463_d1VE8KR3dx
##JCAMPDX= 6.0         $$ Bruker NMR JCAMP-DX V2.0
##DATA TYPE= NMR SPECTRUM
##DATA CLASS= NTUPLES
##ORIGIN= BRUKER
##OWNER= Administrator
$$ 1.72 TOPSPIN		Version 2.1
$$ 2012-12-14 00:46:38.224 -0500  Administrator@X
$$ Compression mode = diff/dup
##.OBSERVE FREQUENCY= 400.02188249412
##.OBSERVE NUCLEUS= ^1H
##.ACQUISITION MODE= SIMULTANEOUS (DQD)
##.ACQUISITION SCHEME= undefined
##.AVERAGES= 8
##.DIGITISER RES= 22
##SPECTROMETER/DATA SYSTEM= spect
##.PULSE SEQUENCE= zg30
##.SOLVENT NAME= COFFEE_meoh
##.SHIFT REFERENCE= INTERNAL, COFFEE_meoh, 1, 14.98509
##AUDIT TRAIL= $$ (NUMBER, WHEN, WHO, WHERE, PROCESS, VERSION, WHAT)
$$ ##TITLE= Audit trail, TOPSPIN		Version 2.1
$$ ##JCAMPDX= 5.01
$$ ##ORIGIN= Bruker BioSpin GmbH
$$ ##OWNER= Administrator
$$ $$ E:\/data/COFFEE/nmr/AC1371_2395_7221463_d1VE8KR3dx/20/pdata/1/auditp.txt
$$ ##AUDIT TRAIL=  $$ (NUMBER, WHEN, WHO, WHERE, PROCESS, VERSION, WHAT)
(   1,<2012-12-14 00:46:29.990 -0500>,<Administrator>,<X>,<go>,<TOPSPIN 2.1>,
      <created by zg
	started at 2012-12-14 00:45:23.881 -0500,
	POWCHK enabled, PULCHK disabled,
       configuration hash MD5:
       86 BA 57 50 F2 9D 5C 9B 26 00 A9 28 5F 66 2E 89
       data hash MD5: 64K
       9C BC 5C 87 6F FD 2F 91 BF A8 15 F4 FB AB E7 84>)
(   2,<2012-12-14 00:46:33.084 -0500>,<Administrator>,<X>,<proc1d>,<TOPSPIN 2.1>,
      <Start of raw data processing
       efp LB = 0 FT_mod = 6 PKNL = 1 PHC0 = 0 PHC1 = 0 SI = 32K 
       data hash MD5: 32K
       21 7A BC BE 0B C3 6B 29 B8 D4 CA 15 D0 28 52 08>)
(   3,<2012-12-14 00:46:33.568 -0500>,<Administrator>,<X>,<proc1d>,<TOPSPIN 2.1>,
      <pk PHC0 = 101.5192 PHC1 = 0 
       data hash MD5: 32K
       DF 47 E5 9E 99 98 2C 1D 7E 5D CE 0B ED A5 4C 75>)
(   4,<2012-12-14 00:46:33.803 -0500>,<Administrator>,<X>,<proc1d>,<TOPSPIN 2.1>,
      <abs ABSG = 1 
       data hash MD5: 32K
       57 9D 7F 7D 8F CD 5C 9A 09 66 0D D3 4E 1F 9C 7D>)
(   5,<2012-12-14 00:46:33.943 -0500>,<Administrator>,<X>,<proc1d>,<TOPSPIN 2.1>,
      <abs ABSG = 2 
       data hash MD5: 32K
       12 80 6F AB 45 32 09 A8 C2 F5 EB 85 50 C5 41 62>)
(   6,<2012-12-14 00:46:34.099 -0500>,<Administrator>,<X>,<proc1d>,<TOPSPIN 2.1>,
      <abs ABSG = 3 
       data hash MD5: 32K
       44 A7 5F B2 05 68 89 D4 4A F0 D7 73 D8 22 76 2F>)
(   7,<2012-12-14 00:46:34.240 -0500>,<Administrator>,<X>,<proc1d>,<TOPSPIN 2.1>,
      <abs ABSG = 4 
       data hash MD5: 32K
       0C DB 94 5F 03 00 09 AF 00 DE 2B 60 EC 28 EE E2>)
(   8,<2012-12-14 00:46:34.381 -0500>,<Administrator>,<X>,<proc1d>,<TOPSPIN 2.1>,
      <abs ABSG = 5 
       data hash MD5: 32K
       7C AB C1 30 49 6F 21 AD 2C D4 4F 7B 10 E6 35 CF>)
$$ ##END=
$$ 
$$ $$ hash MD5
$$ $$ D0 EF 5C EE F2 3F F9 B3 C3 5C C7 79 2D 8D A5 90
##$RELAX= 
##$RELAX= 
##$RELAX= 
##$RELAX= 
##$RELAX= 
##$RELAX= 
##$RELAX= 
##$RELAX= 
$$ Bruker specific parameters
$$ --------------------------
##$DU= <E:\>
##$EXPNO= 20
##$NAME= <AC1371_2395_7221463_d1VE8KR3dx>
$$ [...]
150 150 150 150 150 150 150 150
##$TP07= 0
##$TPNAME0= <>
##$TPNAME1= <>
##$TPNAME2= <>
##$TPNAME3= <>
##$TPNAME4= <>
##$TPNAME5= <>
##$TPNAME6= <>
##$TPNAME7= <>
##$TPOAL= (0..7)
0.5 0.5 0.5 0.5 0.5 0.5 0.5 0.5
##$TPOFFS= (0..7)
0 0 0 0 0 0 0 0
##$TUNHIN= 0
##$TUNHOUT= 0
##$TUNXOUT= 0
##$USERA1= <user>
##$USERA2= <user>
##$USERA3= <user>
##$USERA4= <user>
##$USERA5= <user>
##$V9= 5
##$VALIST= <valist>
##$VCLIST= <CCCCCCCCCCCCCCC>
##$VD= 0
##$VDLIST= <DDDDDDDDDDDDDDD>
##$VPLIST= <PPPPPPPPPPPPPPP>
##$VTLIST= <TTTTTTTTTTTTTTT>
##$WBST= 1024
##$WBSW= 4
##$XGAIN= (0..3)
0 0 0 0
##$XL= 0
##$YL= 0
##$YMAX_a= 615736
##$YMIN_a= -527181
##$ZGOPTNS= <>
##$ZL1= 120
##$ZL2= 120
##$ZL3= 120
##$ZL4= 120
##$ABSF1= 14.98509
##$ABSF2= -5.573092
##$ABSG= 5
##$ABSL= 3
##$ALPHA= 0
##$AQORDER= 0
##$ASSFAC= 0
##$ASSFACI= 0
##$ASSFACX= 0
##$ASSWID= 0
##$AUNMP= <proc_prof1d_extract_pilot.lims>
##$AXLEFT= 0
##$AXNAME= <>
##$AXNUC= <1H>
##$AXRIGHT= 0
##$AXTYPE= 0
##$AXUNIT= <>
##$AZFE= 0.1
##$AZFW= 0.1
##$BCFW= 0
##$BC_mod= 0
##$BYTORDP= 0
##$COROFFS= 0
##$CY= 15
##$DATMOD= 1
##$DC= 0
##$DFILT= <>
##$DTYPP= 0
##$F1P= 0
##$F2P= 0
##$FCOR= 0.5
##$FTSIZE= 32768
##$FT_mod= 6
##$GAMMA= 0
##$GB= 0
##$INTBC= 1
##$INTSCL= 1
##$ISEN= 128
##$LB= 0
##$LEV0= 0
##$LPBIN= 0
##$MAXI= 10000
##$MC2= 0
##$MEAN= 0
##$ME_mod= 0
##$MI= 0
##$NCOEF= 0
##$NC_proc= -8
##$NLEV= 6
##$NOISF1= 0
##$NOISF2= 0
##$NSP= 0
##$NTH_PI= 0
##$NZP= 0
##$OFFSET= 14.98509
##$PC= 1
##$PHC0= 101.5192
##$PHC1= 0
##$PH_mod= 1
##$PKNL= yes
##$PPARMOD= 0
##$PPDIAG= 0
##$PPIPTYP= 0
##$PPMPNUM= 2147483647
##$PPRESOL= 1
##$PSCAL= 4
##$PSIGN= 0
##$PYNMP= <proc.py>
##$REVERSE= no
##$SF= 400.02
##$SI= 32768
##$SIGF1= 0
##$SIGF2= 0
##$SINO= 400
##$SIOLD= 32768
##$SPECTYP= <>
##$SREGLST= <1H.CDCl3>
##$SSB= 0
##$STSI= 32768
##$STSR= 0
##$SW_p= 8223.68421052631
##$SYMM= 0
##$S_DEV= 0
##$TDeff= 65536
##$TDoff= 0
##$TI= <>
##$TILT= no
##$TM1= 0
##$TM2= 0
##$TOPLEV= 0
##$USERP1= <user>
##$USERP2= <user>
##$USERP3= <user>
##$USERP4= <user>
##$USERP5= <user>
##$WDW= 1
##$XDIM= 32768
##$YMAX_p= 461222269
##$YMIN_p= -712032
##$CURPLOT= <Network HP LaserJet P1505>
##$CURPRIN= <$Network HP LaserJet P1505>
##$DFORMAT= <normdp>
##$LAYOUT= <+/1D_H.xwp>
##$LFORMAT= <normlp>
##$PFORMAT= <normpl>
##$SURQMSG= 1
$$ End of Bruker specific parameters
$$ ---------------------------------
##NTUPLES= NMR SPECTRUM
##VAR_NAME=  FREQUENCY,     SPECTRUM/REAL,   SPECTRUM/IMAG
##SYMBOL=    X,             R,               I
##VAR_TYPE=  INDEPENDENT,   DEPENDENT,       DEPENDENT
##VAR_FORM=  AFFN,          ASDF,            ASDF
##VAR_DIM=   32768,         32768,           32768
##UNITS=     HZ,            ARBITRARY UNITS, ARBITRARY UNITS
##FACTOR=    0.250966925370066, 1,           1
##FIRST=     8223.43324360094, -88448,       -297922
##LAST=      0,             238486,          -109981
##MIN=       0,             -712032,         0
##MAX=       8223.43324360094, 461222269,    0
$$ Real data points
##PAGE= N=1
##DATA TABLE= (X++(R..R)), XYDATA
$$ [...]
19546A6763b42062A54643a8879j59348b439n153r1467m4793A88013b74604C60242
19534C6774c3877A31536j5007g35A38554a93877A22385c79789A41192a06802C37359
19522a82069g4517m7497e5451L420C9185a90304A27270K38754e5452B33038i0444
19510B0135j431e3653A06698b98963J20860A02750l5382D780J00549b14735K7433
19499a87302Q2401j04302d8464D8937B3884c29181c303F6331b8247A20244a13079
19487A39139k8082g6043H5291f8511B6396a84492B7558J53766d11671a95865j52280
19476c48145a51159C394N8764L2190D2043j4226N8427f2838k39327e1008l8247
19465h9255j28990B9900a57896N0129l4891A0400b63276J19418E5569o07c11470
$$ plain form
19546 16763 -242062 154643 -18879 -178227 -2439 -7592 -99059 -143852 188013 -274604 360242
19534 36774 -33877 131536 116529 -735 138554 -193877 122385 -379789 141192 -106802 337359
19522 -182069 -74517 -122014 -55451 -52031 39185 -190304 127270 366024 -55452 233038 -90444
19510 20135 18704 -53653 106698 -298963 -178103 102750 67368 4780 105329 -214735 -187302
19499 -187302 -104901 -209203 -48464 48937 23884 -329181 -3303 66331 -28247 120244 -113079
19487 139139 111057 -76043 85291 -68511 26396 -184492 27558 181324 -411671 -195865 -348145
19476 -348145 -151159 3394 62158 94348 42043 27817 86244 -62838 -302165 -51008 -89255
19465 -89255 -218245 29900 -157896 -107767 -142658 10400 -263276 -143858 55569 54962 -311470
19453d2229B94419H3486b64955d0676j42734H0526h3545M1176k32648B846c31190
19441A18316E7951E880f8089n1647p3796A6766k104e8667D08092b11022o3771
19430b74793J06099A49301b58629a1824C79837B0000J37260a11099q781E3340
19419a91584Q9682C44152j65153E0560K25293b33596j2621i1003j24844p464k00746
19408d24057d5546j82289g9864A81202q4175c70546O7975J46772k1714B18857
19397b66621J7154K1415d4225k89117B1524b92512i2816j39718B1474J93130H0033
19385a43381A4541b3415k60860C2024b05458B59477b87283J42816c5675j70664
19375b06339C9424a69766j66142L6552A51403b9029k35781G8170c59329h2587
$$ plain form
19453 -42229 294419 83486 -264955 -40676 -183410 80526 -83545 -42369 -275017 2846 -331190
19441 118316 57951 5880 -68089 -119736 -193532 16766 14662 -58667 408092 -211022 -274793
19430 -274793 -168694 149301 -258629 -11824 379837 20000 157260 -111099 -119880 53340
19419 -191584 -101902 344152 178999 50560 275853 -233596 -246217 -91003 -215847 -223311 -424057
19408 -424057 -45546 -227835 -79864 181202 97027 -370546 -302571 -155799 -177513 218857
19397 -266621 -249467 -228052 -44225 -333342 21524 -292512 -92816 -232534 21474 214604 80033
19385 -143381 14541 -23415 -284275 32024 -205458 259477 -287283 -144467 -35675 -206339
19375 -206339 39424 -169766 -335908 -299356 151403 -29029 -264810 78170 -359329 -82587
19364H6645h6169b5597k79769h3493l28423P1152J11084E823g469B4507a33624
19352c22373B10458C9334L2080J12794c44508M9024a37776A2984g8567G9786P7795
19341A57581J04839H3552a03831B92614d2097A8392O2796b46707R9315k36494
19331c83886K8152d6071a0697k74484J1778P0856A17490Q6756D9165b4340A28705
19319a36410K0709p6399A46083B1530b7431k37545n6350a7378H2347q947c97126
19307c79695A19113J68719j09602b5777n6140n5434E8L79742D356J82393a03854
19295d02861a3796r6851H1950b1011q6641f252G9471O9833K13941H4531f8944
19283B02167b36918e2914E3050J5147a01078c3175j20583d7461k02483h8357H1274
$$ plain form
19364 86645 -86169 -25597 -305366 -83493 -411916 -340764 -229680 5823 -7469 24507 -133624
19352 -322373 210458 39334 71414 184208 -344508 -295484 -137776 12984 -78567 79786 157581
19341 157581 262420 83552 -103831 292614 -42097 18392 81188 -246707 -147392 -383886
19331 -383886 -355734 -46071 -10697 -285181 -273403 -202547 117490 204246 49165 -24340 128705
19319 -136410 -115701 -192100 146083 21530 -27431 -264976 -321326 -17378 82347 73400 -397126
19307 -379695 119113 287832 178230 -25777 -81917 -137351 58 379800 4356 186749 -103854
19295 -402861 -13796 -110647 81950 -21011 -107652 -6252 79471 149304 363245 84531 -68944
19283 202167 -236918 -52914 53050 68197 -101078 -33175 -153758 -47461 -249944 -88357 81274
19271i6511j8972j31153B4497P389L51591a44204f2266k9999j04383c3586J1397
19260b2189B96793c40431B2881a61857N7220M0313j31690A88425e02637a30427
19249f444A01658k718J2355A5726d2099A4144Q3113a83499l0112A18309a01361
19237b91726i180q7643L1726j7860B75254a38118B8619O1673b00558e4128A96691
19225A88338a1403I948a15618q8210O6291p7809C63165A38397i6820C60864a24724
19213e4393A6798b88944F0673O5398c42286b872n9476J8268j93083l4101c0015
19201a62978A76102a22659b0361E5467c8317A81583G3000f6810j19507A07121
19190a06886I7251b66664A87531b41870d8789B0876J08916C1726e00892E02K4692
$$ plain form
19271 -96511 -115483 -246636 24497 31886 383477 -144204 -62266 -92265 -196648 -33586 -22189
19260 -22189 296793 -340431 22881 -161857 -104637 -64324 -196014 188425 -502637 -130427
19249 -6444 101658 98940 111295 15726 -42099 14144 97257 -183499 -213611 118309 -101361
19237 -291726 -9180 -96823 -65097 -82957 275254 -138118 28619 90292 -200558 -54128 196691
19225 188338 -11403 9948 -115618 -203828 -137537 -215346 363165 138397 -96820 360864 -124724
19213 -54393 16798 -288944 60673 126071 -342286 -2872 -62348 -44080 -237163 -271264 -30015
19201 -162978 176102 -122659 -20361 55467 -38317 181583 73000 -66810 -186317 107121
19190 -106886 97251 -266664 187531 -241870 -48789 20876 129792 31726 -500892 502 25194
19179B5194O9361a17176b5047j71544A05973e9363A7142J20712M5905M5745a40599
19167E5911d65505C4761N5495g642l00053a14012d6155B5200b88169C21J86526
19156A86847i1475l27876i9692B1556M1476l0673a10907A75943b04365q6953i1856
19144a17841p2642c7678j13301b8540m7726j51377C6420a50090F3192a61078N255
19133a55823F4789a04814j14584P4843D1324f7235c1355k0797a9082o6961J4459
19122g1584j24467B3595b39821j67409G8548J74344h1885C16495h2642j89635
19112b72277e9012j70455I7805a34784B0478e6454k5530k4659j84401i7910k339
19101a00249k11221a19208o4387A1119J27542a64122L7043K8170D6904g9485A65240
$$ plain form
19179 25194 94555 -117176 -25047 -196591 105973 -59363 17142 137854 183759 229504 -140599
19167 55911 -465505 34761 90256 -7642 -307695 -114012 -46155 25200 -288169 321 186847
19156 186847 -91475 -419351 -99692 21556 63032 32359 -110907 175943 -204365 -291318 -91856
19144 -117841 -190483 -37678 -150979 -28540 -76266 -227643 36420 -150090 63192 -161078 -155823
19133 -155823 64789 -104814 -219398 -144555 41324 -67235 -31355 -52152 -19082 -86043 -71584
19122 -71584 -196051 23595 -239821 -407230 78548 252892 -81885 316495 -82642 -272277
19112 -272277 -59012 -229467 97805 -134784 20478 -56454 -81984 -106643 -291044 -97910 -100249
19101 -100249 -311470 -119208 -183595 11119 138661 -164122 -127079 -98909 46904 -79485 165240
19089g0093j66335i2539j95089I5958L2764e8953L838c45G4138i1203H9586o787
19077H2799f5442R284C5251b71413e1183r794F979N5076b07691q2683i3461l02239
19065c95700a30258n469K9158B3467b19791A6728C761c28507B02964b53823a19538
19053d11709B65284d15213J48906i535B75782p5779b12767M1743M2767B36019
19042b5902p1414j00456L66b215F782K16442o0818J96722g7385j45250h288p9755
19030h8043A95983b15962I2356d8609l16581h1282k13865J28342A20051Q9449
19020B09500C8455J53848H4363c94530J30949k28013i4924B42065p3779c553E1958
19008b04079A38071B0765a82063A91843a27068M9043k42191A18696a30556n5767
$$ plain form
19089 -70093 -236428 -92539 -287628 95958 128722 -58953 -55115 -345 74138 -91203 89586 82799
19077 82799 -65442 -56158 35251 -271413 -51183 -60977 6979 62055 -207691 -290374 -93461 -395700
19065 -395700 -130258 -135727 -106569 23467 -219791 16728 3761 -328507 202964 -253823 -119538
19053 -411709 265284 -415213 -266307 -9535 275782 200003 -212767 -171024 -128257 236019
19042 -25902 -97316 -197772 -197406 -2215 6782 223224 162406 359128 -77385 -222635 -8288 -88043
19030 -88043 195983 -215962 92356 -48609 -365190 -81282 -295147 -166805 120051 209500
19020 209500 38455 192303 84363 -394530 -263581 -491594 -94924 242065 168286 -3553 51958
19008 -204079 138071 20765 -182063 191843 -127068 -78025 -320216 118696 -130556 -186323
18998a86323B32928b17818N8868C8048a05310L1892D921b00110A04508j9492h3092
18986d1434n6753E3601N022J58554C7993j1489J94215a604B6321P3903q071d5931
18973a83901e1243E7793b24284A39862h2785B74081a29830L2595o8088B03726
18962G2436a01660A22889D407a19755B28845d647A82994c84505b7572q9732k0919
18951a38223k45358A74955i669m57542a08612a712o0912I7555L4355i8666k6476
18940a25142O2451o6506c2196A47066a72665D6401L759d9957B3857g500l00139
18929c07639C6582Q7860a50770a0608l08419P1066C84000c8478j46392P0949H356
18917B00935A7310a21509A78888B3918b9839K202D1435c5780I5527a16134K9121
$$ plain form
18998 -186323 232928 -217818 -158950 38048 -105310 -73418 4921 -200110 104508 85016 -83092
18986 -41434 -98187 53601 58623 217177 37993 26504 220719 -1604 26321 100224 92153 -45931
18973 -183901 -51243 57793 -224284 139862 -82785 274081 -129830 -97235 -165323 203726
18962 72436 -101660 122889 4407 -119755 228845 -4647 182994 -384505 -27572 -117304 -138223
18951 -138223 -383581 174955 -9669 -467211 -108612 -1712 -62624 97555 131910 -98666 -125142
18940 -125142 -62691 -129197 -32196 147066 -172665 46401 50160 -49957 23857 -7500 -307639
18929 -307639 36582 124442 -150770 -10608 -319027 -247961 384000 -38478 -184870 -113921 8356
18917 200935 17310 -121509 178888 23918 -29839 -27637 41435 -35780 95527 -116134 -87013
18906h7013n0536b6819j996k50106E583R6697k293a81032C5941a97686c93B19344
18893f7528l1577B96930E4088a59275C2731b48214a21570E39266j65517g2437
18882a15316m2949d5256j74041j71316a04857j78119a32910P18k0941j3965B38568
18870c5264k79182d198A44913a46080q8778h177H3139a81753R0507n7915a941
18858b14274O963j9413k13191I1671B9608J96649B6376K23975i3943E527K27386
18847B32913B7277J1163D519b45498A04657g3832G598c21088c500k09160j54319
18836c66979a27310r5501i2720D7185c53371A00233a00020D3397h9386D8382b71722
18824a21311c6712k3165A41915L4427b89955B53221a71901H1724b9106B2335b3850
$$ plain form
18906 -87013 -137549 -26819 -28815 -278921 5583 102280 99987 -181032 35941 -197686 -393 219344
18893 -67528 -99105 296930 54088 -159275 32731 -248214 -121570 539266 373749 -72437
18882 -115316 -158265 -45256 -219297 -390613 -104857 -282976 -132910 -132192 -153133 -167098 238568
18870 -35264 -314446 -4198 144913 -146080 -234858 -8177 83139 -181753 -91246 -149161 -1941
18858 -214274 -207311 -226724 -439915 91671 29608 226257 26376 250351 -93943 5527 232913
18847 232913 27277 38440 4519 -245498 104657 -73832 7598 -321088 -3500 -212660 -366979
18836 -366979 -127310 -222811 -92720 47185 -353371 100233 -100020 43397 -89386 48382 -271722
18824 -121311 -36712 -59877 141915 176342 -289955 253221 -171901 81724 -29106 22335 -23850
18812f3807A3686C950a27265j45300H4859c3418n1912D242J32876a03364B14959
18800B8906b20493J4570D6835O2190K32457c33972A29040i0114q1363c2912q0743
18789a13655D774c31395F4020a95012A10723b89894C82093b32417q111M6601c1804
18777a29294D319b609r9970L7895B64921d00200A2293e8657k3338j18685c9084
18765B3118c17080C50825c20742J21033j48235B21064g4585j23509a407A55610
18754b8312m1283G3825c2736G4490f7569A62944p3028b8888k32144L7538A94160
18742A83687n7586J7890h6162L4265p4923C1075a74588L8436D8522J9161b25129
18730a25421A70351b1458r8936e0578K237A93342a14418B33750c98949B48811
$$ plain form
18812 -63807 13686 3950 -127265 -272565 84859 -33418 -85330 4242 137118 -103364 214959
18800 28906 -220493 -205923 46835 109025 341482 -333972 129040 -90114 -171477 -32912 -113655
18789 -113655 4774 -331395 64020 -195012 110723 -289894 382093 -232417 -240528 -193927 -31804
18777 -129294 4319 -2609 -102579 -64684 264921 -400200 12293 -58657 -81995 -200680 -39084
18765 23118 -317080 350825 -320742 -199709 -347944 221064 -74585 -198094 -1407 155610
18754 -28312 -69595 73825 -32736 74490 -67569 162944 89916 -28888 -261032 -223494 194160
18742 183687 126101 143991 -86162 -51897 -126820 31075 -174588 -136152 48522 67683 -225129
18730 -125421 170351 -21458 -120394 -50578 -48341 193342 -114418 233750 -398949 248811
18719a26266N2090m3500K7618r5695D904J1340a30203D1919b00917C93353A59161
18707a3237p6149G7651k3990a2252r6484B31777h4825k5567b4980j10749j61408
18696b97137a23956q4647A90233G3657L39433E5118a70145m0822p7569D2558A1878
18684C2334b65358a11122d2126j61222e8877B23389a13669k24390j6130i8084
18673a4918A90488b29023C4708d74162i1016k6595H825a37313G6993M22239A49785
18661b34206M9414P802f0358l22228a5053m96127g6809I6336a96671n2203n1112
18650b99986J2187C1904b23774o9423B6745Q5220d6348l26613I2302d8331j55619
18639b03950K1353A33308a83706m70099f8963D2559a01903c9135D7997a51518
$$ plain form
18719 -126266 -74176 -117676 -90058 -185753 4904 16244 -130203 41919 -200917 393353 159161
18707 -13237 -89386 77651 53661 -12252 -108736 231777 -84825 -110392 -24980 -135729 -297137
18696 -297137 -123956 -208603 190233 73657 413090 55118 -170145 -210967 -288536 42558 11878
18684 32334 -265358 -111122 -42126 -203348 -58877 223389 -113669 -338059 -354189 -98084
18673 -14918 190488 -229023 34708 -474162 -91016 -117611 8825 -137313 76993 499232 149785
18661 -234206 -184792 -176990 -60358 -382586 -15053 -511180 -76809 96336 -196671 -248874 -299986
18650 -299986 -287799 31904 -223774 -293197 26745 111965 -46348 -372961 92302 -48331 -203950
18639 -203950 -182597 133308 -183706 -653805 -68963 42559 -101903 -39135 47997 -151518
18628a59850E5370K13697a75168k31028a79105k31666a39737b8653p7380L3741
18618g2292A29635j6289f22170b96065J07870h3030N298r9827O371C08865D7064
18606d1644o2327m2526j36992E1606a95727A76894a97817B6167J94307L1029o800
18595B44703e31467b48580d5489J2614m1251D9881L5016J22894D0818c66479A05588
18583b18028g4848C00960D577a58666j34687K6868A13530i1522K8625I4826h7018
18571h7632B52952G8597J2283h5486B73764c8079A83499e13253a57095l16637
18561d73732a40345A28942B6622a14211j24321m5709f8630g529n23897C9967M1937
18550H1904a10304H6350J1702h0103k24341a12471C5586Q6442a29242f4418D17556
$$ plain form
18628 -159850 55370 269067 -175168 -406196 -179105 -410771 -139737 -28653 -106033 -72292
18618 -72292 129635 113346 -622170 -296065 -188195 -83030 -77732 -177559 -171188 308865 47064
18606 -41644 -103971 -146497 -283489 51606 -195727 176894 -197817 26167 220474 251503 244703
18595 244703 -531467 -248580 -45489 -32875 -74126 49881 84897 207791 40818 -366479 105588
18583 -218028 -74848 300960 4577 -158666 -293353 -266485 113530 -91522 -62897 94826 -87018
18571 -87632 252952 78597 90880 -85486 273764 -38079 183499 -513253 -157095 -473732
18561 -473732 -140345 128942 26622 -114211 -238532 -284241 -68630 -7529 -531426 39967 81904
18550 81904 -110304 86350 98052 -80103 -304444 -112471 35586 122028 -129242 -64418 417556
18538A19000i5633j44697j6017P4088G3226i2857A26043J1505a93805k44485b8652
18526a01526j22721i7402C0908g9634j24299g2466K9948j01512k20456A43798
18515B48849a42866A06551j8656j6150N4261n6729k0403K80240B6741Q1396c43145
18503a40944B97353A38346M4902l6974g8870k68765b7227F6139O6693C1008b0913
18491a77010f1400p0397D25245a84353a8595B3194K29998A11520f3854j42305
18481b06159M7444k35098h085k01285l5813B38955p5105c99632b2809j51695N4952
18470a19552F401J03703h0636o5058I8812c0981B92628a86723A36538h7340a0267
18458A35676m1955k2965J5146J02124a63530L6492l35996F2220a65502j95545
$$ plain form
18538 119000 -95633 -240330 -256347 -182259 73226 -92857 126043 137548 -193805 -438290 -28652
18526 -101526 -224247 -97402 30908 -79634 -203933 -72466 -42518 -144030 -364486 143798
18515 248849 -142866 106551 87895 71745 126006 69277 48874 329114 26741 108137 -343145
18503 -140944 297353 138346 183248 146274 -78870 -347635 -27227 66139 132832 31008 -20913
18491 -177010 -61400 -131797 425245 -184353 -18595 23194 253192 111520 -63854 -206159
18481 -206159 -158715 -393813 -8085 -209370 -245183 238955 163850 -399632 -22809 -174504 -119552
18470 -119552 6401 110104 -80636 -145694 98812 -30981 292628 -186723 136538 -87340 -10267
18458 135676 93721 70756 85902 188026 -163530 -127038 -463034 62220 -165502 -361047
18448c61047f6467A31420c260j43918k23551E4111b4919H3086h8847B17962E771
18436i8167o519c168m20070i4343b0226m4965H4376c86985J24875h5472k61089
18425c46561C7942b10617j6814a00164B69184e6853A16976a49637d6541A60979
18414C03370A9875c03415J48732b6932H2638K14604I3053B8396h1103C311i6799
18402a93596P6161L797k8378N9712k47038n1182A87941R7947M2298E3587A5312
18390b07487H3593i8061B17244A1931a99774B02819I1464C4021K52062p5853i3406
18378a51202H0875c49082i6664K7986C73122j70629m146c59358D0710A6635a56925
18366C83616c7557A45329a40761A4800K25797b97067B64927a9029n09943D1398
$$ plain form
18448 -361047 -66467 131420 -3260 -147178 -370729 54111 -24919 83086 -88847 217962 5771
18436 -98167 -104686 -3168 -423238 -94343 -20226 -65191 84376 -386985 -262110 -85472 -346561
18425 -346561 37942 -210617 -227431 -100164 269184 -56853 116976 -149637 -46541 160979
18414 303370 19875 -303415 -154683 -26932 82638 297242 93053 28396 -81103 3311 -96799
18402 -193596 -117435 -113638 -142016 -82304 -329342 -380524 187941 285888 328186 53587 15312
18390 -207487 83593 -98061 217244 11931 -199774 202819 91464 34021 286083 210230 -93406
18378 -151202 80875 -349082 -96664 -68678 373122 202493 198347 -359358 40710 16635 -156925
18366 383616 -37557 145329 -140761 14800 240597 -297067 264927 -19029 -528972 41398
18355c3610A77028d00065c8355B0273O8149a53849f5931H0614h8509A3856K28047
18344B41903b18107A68841k9222F1514J15616B8516a29750F9672Q539J35167b6360
18332b26782P3901A5623J09644a25065j85908J26837B1708L43804a36793l2195
18322a68988C8887b37004N2111M1217o751k89548h2592k05961a24232A44655P9630
18311B24285A08290O084J04160d01661B84137D1444A472J18500H819b25835L0674
18300a95161Q794A99321a58306j60424a06447N3037q052A80164g3862K1549l8905
18289i1218j41160A09122N8850Q0398a59781K2957B38a11605K1352h158A08863
18277h2210r4693G1781b31711A07515a57432C92028h6182k8608I3674O1012a15538
$$ plain form
18355 -33610 177028 -400065 -38355 20273 88422 -153849 -65931 80614 -88509 13856 241903
18344 241903 -218107 168841 139619 61514 177130 28516 -129750 69672 78211 213378 -26360
18332 -226782 -152881 15623 125267 -125065 -310973 -184136 21708 365512 -136793 -168988
18322 -168988 38887 -237004 -184893 -143676 -150427 -439975 -82592 -288553 -124232 144655 224285
18311 224285 108290 114374 218534 -401661 284137 41444 1472 119972 8819 -225835 -195161
18300 -195161 -186367 199321 -158306 -318730 -106447 -53410 -61462 180164 -73862 -52313 -91218
18289 -91218 -232378 109122 167972 248370 -159781 -136824 238 -111605 -90253 -8158 108863
18277 -82210 -176903 71781 -231711 107515 -157432 392028 -86182 -114790 93674 154686 -115538
18265E385J29356n8727l5719E905b05103j64611J36632C19354H6834J3170c07348
18253D1907L21155c8064G7321e491k3226H8743L36403b36684A76347b08693A71317
18241f9548A8528J18968b55122f0272B04526a94547M4003I8932c9704D1699J73333
18230B15032r0444a70371A78919a4775k00246b5575B98917c9081r6541B45776
18219b50726C1348a62982B2572b41830q360G7484a83509A38142b0708J0237j58124
18208a68595A19201c33189R3912D104a09058c0977D27761a77962A18469j29g679
18196a57625E9239J704a90731j03255j29625R3860J3913O7227A92438j1371b9006
18184b7935B19962d5680B26755D1171j0549c00151B0208a85667e8894D1948a43480
$$ plain form
18265 5385 134741 76014 40295 5905 -205103 -369714 -233082 319354 86834 100004 -307348
18253 41907 363062 -38064 77321 -5491 -28717 88743 425146 -236684 176347 -208693 171317
18241 -69548 18528 137496 -255122 -60272 204526 -194547 -150544 98932 -39704 41699 215032
18230 215032 124588 -170371 178919 -14775 -215021 -25575 298917 -39081 -135622 245776
18219 -250726 31348 -162982 22572 -241830 -250190 77484 -183509 138142 -20708 -10471 -168595
18208 -168595 119201 -333189 -239277 4104 -109058 -30977 427761 -177962 118469 118340 -7679
18196 -157625 59239 60943 -190731 -293986 -423611 -329751 -315838 -248611 192438 181067 -29006
18184 -27935 219962 -45680 226755 41171 30622 -300151 20208 -185667 -58894 41948 -143480
18172a03555q4043A78890C0564c82203E1408M7775J4398F752J8278a81264M2106
18161a39158j66260B6441b25757C9473K1620b21115C30004l4998D3364J6026J90250
18150B49640r9662l9954J72052h5237C12604a77137A90535b05590N6972d9725
18139A33922C7781h8199n6205r6272C8669d07901J85434h8107d1706o6145D8329
18127D4823K0014b78889B02861b84293e4839l70215a76995C11741j23378f5412
18116A11479M7522R9001k374A11738E2498j24j323b8856A85388G5527K6793g9499
18103b42269A15104f2298n7816l1528d6753k62059l92605A43709d7734H5923J49993
18092B35916a80720a7086C18079A46777a46850l585d405k63632J32123B0850M7041
$$ plain form
18172 -103555 -187598 178890 30564 -382203 51408 99183 113581 6752 25030 -181264 -139158
18161 -139158 -305418 26441 -225757 39473 61093 -221115 330004 295006 43364 59390 249640
18150 249640 149978 110024 282076 -85237 312604 -177137 190535 -205590 -148618 -49725
18139 133922 37781 -88199 -144404 -240676 38669 -407901 -222467 -88107 -41706 -107851 48329
18127 44823 64837 -278889 202861 -284293 -54839 -425054 -176995 311741 188363 -65412
18116 111479 159001 258002 255628 111738 52498 52374 51051 -28856 185388 75527 102320 -79499
18103 -242269 115104 -62298 -120114 -151642 -46753 -308812 -701417 143709 -47734 85923 235916
18092 235916 -180720 -17086 318079 146777 -146850 -150435 -4405 -268037 -135914 20850 67891
18081F7891h0658c4207C53856b08601R6315n985C4967J3799b17591K8147C68478
18069b09307c4098q2248M3590A11684b72150M6302e0784A22633d02683N8486A48216
18057a28053H9842R0153k1390F112J61367C7660b16560h515A66841b3806G3172
18045h093l88584a19075I4488b64495A98960a00758A42996c22467B07250L6209
18035B43459a66745B8345J29828J34527A05870d2807j9359A60998c82541E473
18024a77096j07678B80655i8389K4878o4650a0321k51784B5871n794a07358A2438
18012D3071O9695a11788L6155j06355P7906l0989G0710f5472q7283n145A19485
18000B4461e0453F7210c9195A02420a99897E2538b26449g9968A49174f2920B18494
$$ plain form
18081 67891 -80658 -34207 353856 -208601 -112286 -118271 34967 48766 -217591 -189444 368478
18069 -209307 -34098 -116346 -72756 111684 -272150 -225848 -50784 122633 -402683 -344197 148216
18057 -128053 89842 179995 158605 6112 167479 37660 -216560 -8515 166841 -23806 73172
18045 -8093 -396677 -119075 94488 -264495 198960 -100758 142996 -322467 207250 243459
18035 243459 -166745 28345 158173 292700 105870 -42807 -62166 160998 -382541 5473
18024 -177096 -284774 280655 -98389 -73511 -138161 -10321 -262105 25871 20077 -107358 12438
18012 43071 112766 -111788 -75633 -181988 -104082 -135071 70710 -65472 -152755 -157900 119485
18000 24461 -50453 67210 -39195 102420 -199897 52538 -226449 -79968 149174 -62920 218494
17988b49236a03355B81165A11157J84421A38642a29570A24938A5612Q17b2808
17977a52777b9819I2756i4849K9106B81803h1557r5582O8153C19991h1460C4828
17965g4091G3225h2622i171k01207A4795b28665c8919B1748a37419A74a63337
17953A34902J92C175J16578c68403D7186a83243I0005J71728h7370K7907h767
17941a15183d3989e945k0490G5375b26344A18990M3712c93505a51915d3410B4431
17929b87142Q6880A1110a445E9252b4628l36113e3790k28817a7505B88854j24848
17918A64006J96679F6378a51784n0731F7118a26343A8227e6463r1569C8421a89598
17906c9468n7871B90367o8071E4575d743A06011N0321K1968b1609D48P2228c83636
$$ plain form
17988 -249236 -103355 281165 111157 295578 138642 -129570 124938 15612 16429 -22808
17977 -152777 -29819 92756 -94849 -65743 281803 -81557 -177139 -108986 319991 -81460 34828
17965 -74091 73225 -82622 -9171 -210378 14795 -228665 -38919 21748 -137419 174 -163337
17953 134902 135094 3175 119753 -368403 47186 -183243 90005 261733 -87370 -59463 -8767
17941 -115183 -43989 -5945 -26435 75375 -226344 118990 162702 -393505 -151915 -43410 24431
17929 -287142 -200262 11110 -1445 59252 -24628 -360741 -53790 -282607 -17505 288854 164006
17918 164006 360685 66378 -151784 -202515 67118 -126343 18227 -56463 -148032 38421 -189598
17906 -39468 -97339 290367 222296 54575 -4743 106011 156332 178300 -21609 448 72676 -383636
17893a9931j08747e0505F3932Q6551G128b43170D6067g8044A74106f9548C8565
17881b49779f7850A53470F8897b47644j51331a43998C90776r1534p2502a53639
17870B4159K19723D9682A0842O2286h5817K2203m9510M4270l21246i2736m5519
17859a38255k49670a12787G2398b9159j22873A8600K4218l400J22678J16131j09414
17848A68813a27308j22641j38569A66477h2100A2007b95010A6957c2985o3684
17838i6669D4289e7635k03874A2895L0873c78903h5308k292A07648a03772B77075
17826g8780k108A00218e9594k14995a842D3845L11625a62878K1390b4072A50925
17814A26434d03624B19600H1994Q1460N541b05137B83397Q6154E5649J59310a15604
$$ plain form
17893 -19931 -128678 -50505 63932 150483 7128 -243170 46067 -78044 174106 -69548 38565
17881 -249779 -67850 153470 68897 -247644 -398975 -143998 390776 299242 226740 -153639
17870 24159 243882 49682 10842 73128 -85817 -63614 -113124 -68854 -390100 -92736 -138255
17859 -138255 -387925 -112787 72398 -29159 -152032 18600 42818 39418 162096 278227 168813
17848 168813 -127308 -249949 -388518 166477 -82100 12007 -295010 16957 -32985 -96669
17838 -96669 44289 -57635 -261509 12895 43768 -378903 -85308 -87600 107648 -103772 277075
17826 -78780 -80888 100218 -59594 -274589 -1842 43845 355470 -162878 -141488 -24072 150925
17814 126434 -403624 219600 81994 163454 168995 -205137 283397 369551 55649 214959 -115604
17802A94865a22488m3760O7037B99914A5691a39003l5215B8087g6655o56j44756
17791b22067l2528A70854D2094b1599j13493r9908J02198h768B32695m093J32861
17780C61463A00827J7140b26234A02474c08781A9033a0588B3829e1682j58630
17770b10312M677E0782a16941B57013a74349g5829I9367J30009c4127B57350F8473
17758D21488a19446B5579K1496a79083C38876a35119n3697A20312r861C588O7062
17747G0650L0948O444a77420j0057q2943d4596q6569q3301j75210B60805a20274
17735a31651A18727L8019n9625l5759a21899m5042d5595A42664i6954j180C03562
17723f5369H6305a37623A51040f2927A26486b33680g7663A54426b050j92402G8372
$$ plain form
17802 194865 -122488 -166248 -99211 299914 15691 -139003 -174218 28087 -76655 -77311 -222067
17791 -222067 -254595 170854 42094 -21599 -135092 -235000 -132802 -8768 232695 228602 361463
17780 361463 100827 117967 -226234 102474 -308781 19033 -10588 23829 -51682 -210312
17770 -210312 -205635 50782 -116941 257013 -174349 -75829 99367 229376 -34127 257350 68473
17758 421488 -119446 25579 47075 -179083 338876 -135119 -188816 120312 110451 3588 70650
17747 70650 101598 108042 -177420 -187477 -270420 -44596 -131165 -214466 -389676 260805 -120274
17735 -131651 118727 156746 97121 61362 -121899 -166941 -45595 142664 -96954 -98134 303562
17723 -65369 86305 -137623 151040 -62927 126486 -233680 -77663 154426 -2050 -194452 78372
17711D1618b28149L3197h980A76023g5004K6982C62083C8245M8737C3074a28380
17699e10644b9532k70280A61045a56311l37122B83105J97638c1090B22391l9441
17689A82950J22147A5668P9866C0465j4983a20538B25846D4251K47675M5755b62205
17677B30326a7836B10541C0334K10620a84683j23375D7812K96913a87751M8428
17667a39323f1573C20115b56530P2829g674j75242A46676B6583f1359I4322P8700
17656A73022r32q5082d3046a9259A40549b6486A2216a34130g809C52980a02746
17644A82824b0664l7002G9450B5226a98703C9757a56177K8032e3743n0183A70477
17632b02644N144K6772L5513B12936J23412A59921j7073E0248d9303B82156a35134
$$ plain form
17711 41618 -228149 -194952 -8980 176023 -75004 -48022 362083 38245 86982 33074 -128380
17699 -510644 -29532 -299812 161045 -156311 -493433 283105 480743 -31090 222391 182950
17689 182950 305097 15668 95534 30465 15482 -120538 225846 44251 291926 337681 -262205
17677 230326 -17836 210541 30334 240954 -184683 -308058 47812 344725 -187751 -139323
17667 -139323 -61573 320115 -256530 -183701 -7674 -182916 146676 26583 -61359 94322 173022
17656 173022 172090 87008 -43046 -19259 140549 -26486 12216 -134130 -7809 352980 -102746
17644 182824 -20664 -57666 79450 25226 -198703 39757 -156177 -128145 -53743 -103926 170477
17632 -202644 -197500 -170728 -135215 212936 336348 159921 142848 50248 -49303 282156 -135134
17620C4307M268d5858f663F72837F365a50846j152G7031M06656G6962i7872A00795
17607A23489J1704o4167a20396A74861C4288H478K37891b27222q9142J6641a19144
17595e0273c375A80876c9961I5943b26393c703I867d6957j7832l45909a257A71093
17582F4738K5082a7731j90505A07274b94602F879R6144c1845A87358a45131r1996
17571b37127A19175N9159g6167j93612B03756I7982a08119i372C14066F5978J7820
17560H3798a25600L793B30370b87869C58151a32058l04523a32834K1273J5861
17550i5700B14815F8644g3949D0589M3352C7182a2520B26570d7092k4582q2443
17539a54117C5340R8202b38229f8256j01547A59562A9772f034A26070k9935g8439
$$ plain form
17620 34307 38575 -45858 -6663 672837 6365 -150846 -151998 77031 483687 76962 -97872 100795
17607 123489 135193 71026 -120396 174861 34288 8478 246369 -227222 -316364 -299723 -119144
17595 -50273 -3375 180876 -39961 95943 -226393 -3703 9867 -46957 -64789 -410698 -1257 171093
17582 64738 89820 -17731 -208236 107274 -294602 6879 103023 -31845 187358 -145131 -237127
17571 -237127 119175 178334 -76167 -269779 203756 97982 -108119 -9372 314066 65978 83798
17560 83798 -125600 -121807 230370 -287869 358151 -132058 -436581 -132834 -111561 -95700
17550 -95700 214815 68644 -73949 40589 83941 37182 -12520 226570 -47092 -71674 -154117
17539 -154117 35340 133542 -238229 -68256 -169803 159562 19772 -6034 126070 96135 -78439
17527b62382B6152a39818o2995A67541b6673j02969L5455A39426B3233J51619
17517A74852o4970L74472b9546k4390B99300j30539h9607A58429a77976d0561
17506A41861k1546a88994D71377A0447J04292m0815K15807j30936K4959J37424
17496C21178B7930J1594N5928K87563o1884A53822a04896k61986i29k09319B40657
17484A13284k1689a04777b4860B12384J4913E9260O7609D3864J99448a6325B97092
17472F2804J56074l7142J00643P3046G7909J2266K17029a84650r7495A52460G2151
17460d6859F7366M10364H0168a5268k83656A54339L27037A53459c4852A47082
17449A93732k0313K15796K6051A13838K78864A81049a66726B54330A05548J72186
$$ plain form
17527 -262382 26152 -139818 -202813 167541 -26673 -129642 -94187 139426 23233 174852
17517 174852 109882 484354 -29546 -53936 299300 168761 -89607 158429 -177976 -40561
17506 141861 120315 -188994 471377 10447 114739 73924 289731 158795 183754 321178
17496 321178 27930 39524 95452 383015 321131 153822 -104896 -366882 -929 -210248 240657
17484 113284 91595 -104777 -24860 212384 227297 59260 126869 43864 243312 -16325 297092
17472 62804 218878 181736 282379 355425 77909 90175 307204 -184650 -282145 152460 72151
17460 -46859 67366 477730 80168 -15268 -298924 154339 481376 153459 -34852 147082
17449 193732 173419 389215 415266 113838 392702 181049 -166726 254330 105548 277734
17439B77734a4356k08788B09936R742M03051k40822j03087J27726i7904C47769
17428B32982H9352K68538A5147N6776C088R4647l5792M69455A79445I941O82724
17417F92665B13144K37364k05181L2368d5118B28661B5172J73861N5565j2796
17407B41802q2502N6360a39357e9233A42627K61056q3256p4367c66168B13268
17396A54732E5504J71437b58095H1986Q9534a49964B21184K75022A34962L82296
17386E17258i1373f675m2668G5849K31718O5645F3544k6952c8172D2839k978K49252
17374B89113a4624A30173D9694L16173A21708N7018J33155c0236B18282r607O250
17363B14925j7021f4210A67659B4245K38928D212K34909H7569m1887j5191c5764
$$ plain form
17439 277734 -14356 -223144 209936 219678 622729 381907 278820 406546 -97904 347769
17428 232982 89352 357890 15147 71923 3088 97735 61943 531398 179445 9941 692665
17417 692665 213144 450508 245327 277695 -45118 228661 25172 199033 254598 241802
17407 241802 159300 215660 -139357 -59233 142627 403683 320427 246060 -366168 213268
17396 154732 55504 226941 -258095 81986 171520 -149964 221184 496206 134962 517258
17386 517258 -91373 -6675 -49343 75849 307567 373212 63544 36592 -38172 42839 39861 289113
17374 289113 -14624 130173 49694 365867 121708 178726 311881 -30236 218282 208675 214925
17363 214925 197904 -64210 167659 24245 263173 4212 239121 87569 45682 30491 -35764
17351A21456m4987b08886e2096C75524A14708J06071C7948h0351j6022A32958
17340A92852p5111J59859r6632P5494G3431g0746E1633R5858J67227A32665O2756
17329A95421l7146F2326i5754I6720J08442A2173N302K4520a52082a1334G7136
17317e5765l218A83563K45235r0519A52459n15Q4831a5464C7141D884J40135d92724
17304i7982D8009g363D00208H0382a29465B85688j09573C9858a6980m7791B02686
17292A79107e2043B53580a30469A38817M5441f0575j36243C40583a43891A20739
17281e7631I9773J51564d3134D7049J33357m2690a3363m7233B35519m487F8483
17269A11314J30130K16010B13644j00997n5115h6375A76458h6404l3062A68408
$$ plain form
17351 121456 76469 -208886 -52096 375524 114708 220779 37948 -80351 -96373 132958
17340 192852 117741 277600 180968 256462 73431 -70746 51633 147491 314718 132665 195421
17329 195421 158275 62326 -95754 96720 205162 12173 17475 41995 -152082 -11334 77136
17317 -55765 -58983 183563 428798 338279 152459 151944 236775 -15464 37141 4884 145019 -492724
17304 -97982 48009 -7363 400208 80382 -129465 285688 176115 39858 -16980 -64771 202686
17292 179107 -52043 253580 -130469 138817 184258 -60575 -196818 340583 -143891 120739
17281 -57631 99773 251337 -43134 47049 180406 137716 -13363 -60596 235519 231032 68483
17269 111314 241444 457454 213644 112647 57532 -86375 176458 -86404 -119466 168408
17258I2389d499H4075R6763N6931F5526L5095O0418M5400c4311p2731C24474E6118
17245B71466A00356J47286I183J02704J09967M4472a30159A18927D7855Q6250
17235A34105a8939C48460L071F0503K46039G7468a5967D29490A34813e9943H0681
17223a89258D21384E8819a45941A63754G8910K02009q7018J24183n8074Q2159
17213C42169E3069A8010R8270l6149K90224I1477k6700J05707I870K29463J72615
17202D11948K5644e70C27908A10116a19651B50340R948d26983F0539N1142i353
17190A46878E8749K45887P5142A02083q845L43870P647h1944C32544h4272D1989
17178d9039A07352N7816B510L16727N1714k653A32945L96812B36763c8873C77664
$$ plain form
17258 92389 -4499 84075 180838 237769 65526 100621 161039 206439 -34311 -107042 324474 56118
17245 271466 100356 247642 9183 111887 221854 266326 -130159 118927 47855 134105
17235 134105 -18939 348460 351531 60503 306542 77468 -15967 429490 134813 -59943 80681
17223 -189258 421384 58819 -145941 163754 78910 280919 193901 318084 260010 342169
17213 342169 53069 18010 116280 80131 370355 91477 64777 170484 9870 239333 411948
17202 411948 437592 -570 327908 110116 -119651 250340 260288 -426983 60539 111681 -9353
17190 146878 58749 304636 379778 102083 93238 437108 444755 -81944 332544 -84272 41989
17178 -49039 107352 165168 2510 319237 370951 368298 132945 529757 236763 -38873 377664
17166A64595J61545K0266j50773J41906j24369L0657l1094A04447K13229N8818
17156C76494f891C06301j23675J62489n8392j4983n3974e380B79923q372A0906
17144D57904k21747I1940K64765R6681H0321K79280K12797A57835K4641O0513
17134B42989J63095b96754C53991L04115g1755B50372j02970M8327J26359m2230
17124B79858q0453I8706L4383b8334C31777J9847A73021Q8588b4430k5392F70063
17112e816A33145D6622K81407J77630q0388J53693B75262L49002k92466I6369
17101H08278C33700q260Q71J8929f9739D04809M42852B36054D3246J1699K71546
17090C26491n700r7139p4070M7560o301J47030j8825J15277J47390B57082J4250
$$ plain form
17166 164595 326140 346406 195633 337539 213170 243827 212733 104447 317676 376494
17156 376494 -6891 306301 182626 345115 286723 271740 217766 -5380 279923 271551 10906
17144 457904 236157 91940 356705 453386 80321 359601 572398 157835 182476 242989
17134 242989 406084 -296754 353991 658106 -71755 250372 147402 195729 322088 279858
17124 279858 199405 98706 133089 -28334 331777 351624 173021 261609 -24430 -49822 670063
17112 -5816 133145 46622 328029 505659 425271 578964 275262 624264 331798 96369
17101 808278 333700 325440 326311 345240 -69739 404809 847661 236054 43246 54945 326491
17090 326491 320791 223652 149582 197142 190841 337871 319046 434323 581713 257082 271332
17079B71332j21051K0325L07134k38458K18719B24556J30335J29875A92192L34414
17069E26606n429j11426A78215N24927C18924r9099n4186J99027j44091L29484
17059E50059M6737j88873j74797L45006Q0803j09431J58757P9248B74676J81591
17049D56267j10655K16018j49817j04404N15363I4134M43166j2130k46469K28691
17039E07392k47548r3716E4803Q16058k97349j15152M7749r0693P0541J17518
17029F03475j30019J75224l3718N8312l27205K94245B89309I4710M58785J19023
17019F72518C04961N16025l23293M03457D49595O7532r5467j88947K00361j699
17009D31375K27173q2613q5240k41177L72708j35694K6513p8005J31156k4130
$$ plain form
17079 271332 150281 170606 477740 239282 458001 224556 354891 484766 192192 526606
17069 526606 521177 409751 178215 703142 318924 219825 165639 364666 220575 550059
17059 550059 596796 407923 233126 578132 658935 549504 708261 787509 274676 456267
17049 456267 345612 561630 411813 307409 822772 94134 537300 525170 278701 507392
17039 507392 259844 166128 54803 870861 573512 458360 506109 415416 485957 603475
17029 603475 473456 648680 614962 673274 346069 640314 289309 94710 553495 672518
17019 672518 304961 820986 497693 901150 449595 517127 421660 232713 433074 431375
17009 431375 658548 575935 490695 249518 622226 486532 513045 435040 566196 542066
16999E42066n6596L56324k55013K2486B59183K91480M38638m20794K94839L4821
16989H98167k71464M17131j5162D78580p6404N14383l65435J3542j04937M39383
16979H99112o4285o3465l01332K08525L2854J26310j81231p8724M5995k72311
16969C51448L20972J7903J50889j92134M28905L4946l17473L0433k31165K41052
16959H35776k62177J40598Q7686J8626J61530j39342L91907m46639J68679k2800
16949I33844k49912j281J09995K86794k35853Q9062M8659J85300m41698J80174
16939I05084J17140J3005j71607L32686k89237L32723J0969k54824k05137M69616
16929A260418J56656n598n50385K63974m44606K49584M97115k62489k64131L00344
$$ plain form
16999 542066 485470 841794 586781 609267 259183 550663 989301 568507 863346 898167
16989 898167 626703 1043834 1028672 478580 402176 916559 551124 564666 459729 899112
16979 899112 834827 771362 470030 678555 711409 837719 656488 577764 623759 351448
16969 351448 672420 690323 841212 649078 1077983 1112929 795456 825889 594724 835776
16959 835776 573599 714197 801883 820509 982039 842697 1234604 787965 956644 933844
16949 933844 683932 682651 792646 1079440 843587 932649 981308 1166608 724910 905084
16939 905084 1022224 1035229 863622 1196308 907071 1239794 1250763 995939 790802 1260418
16929 1260418 1417074 1411476 861091 1125065 680459 930043 1427158 1164669 900538 1200882
16919A200882k0990J00261p7851o529K13855q0461m08343L82538r0967K04367
16909A416762J69116q9944l1989L4197q451k64860j17029L86586J53588l20577
16899A327399K01195N3449m42406L25976M13754j90748j90836M35282j15758n3203
16889A764104j00591J55373P4623k45626M32690m34864K07634J95775j54544j26814
16879A767760K32209n02669L54259K38769k62331N1353p224K00634M04191l80515
16869B096436L15464k02911L0663J94508k87706J61108L94275l37499M8788N7916
16859B471042K05002J05679l15109M72246l61591J34615L74352j6064j96455K39792
16849C113509j26321J29827J34425K01970l37867j16676M07104j5933J76698r1823
$$ plain form
16919 1200882 1179892 1280153 1202302 1195773 1409628 1329167 920824 1303362 1212395 1416762
16909 1416762 1585878 1495934 1463945 1498142 1489691 1224831 1107802 1494388 1647976 1327399
16899 1327399 1528594 1582043 1139637 1465613 1879367 1688619 1497783 1933065 1817307 1764104
16889 1764104 1663513 1818886 1893509 1647883 2080573 1645709 1853343 2049118 1894574 1767760
16879 1767760 1999969 1497300 1851559 2090328 1827997 1879350 1872126 2072760 2476951 2096436
16869 2096436 2411900 2208989 2239652 2434160 2146454 2307562 2701837 2364338 2413126 2471042
16859 2471042 2676044 2781723 2466614 2938860 2577269 2711884 3086236 3070172 2873717 3113509
16849 3113509 2987188 3117015 3251440 3453410 3115543 2998867 3405971 3390038 3566736 3474913
16839C474913J15595L65038j71129k6644j5461K16303k50832M23774k82089O19091
16829D468559k76344L98481l28291M315M87407k04503J42681r9616M67198J22057
16819E181944l4374q728M37055l52792L16584M55030j21162j12723L75193J43283
16809F279310J83578Q5838J6238K45645n1956O44477j01353Q3824K12051L26194
16799G923846q3082L30017K38407N68412L0766J77376j36693P15203L25977L13687
16789A0403916K72167L55442J87090k10977N49765O99574L71304M59491L31348
16780A3419120L51456L77742L79211L68021M39137O42025M18352J131219L85099
16771A7911382K72658R83661O36012R67594N15032J084719P80049Q52141J028635
$$ plain form
16839 3474913 3590508 3955546 3784417 3757773 3742312 3958615 3707783 4131557 3849468 4468559
16829 4468559 4192215 4590696 4262405 4266720 4754127 4549624 4692305 4592689 5059887 5181944
16819 5181944 5147570 5138842 5575897 5223105 5539689 5994719 5873557 5760834 6136027 6279310
16809 6279310 6462888 6548726 6564964 6810609 6758653 7403130 7301777 7385601 7597652 7923846
16799 7923846 7840764 8170781 8409188 8977600 9008366 9185742 9049049 9764252 10090229 10403916
16789 10403916 10676083 11031525 11218615 11007638 11557403 12256977 12628281 13087772 13419120
16780 13419120 13770576 14148318 14527529 14895550 15334687 15976712 16395064 17526283 17911382
16771 17911382 18184040 19167701 19803713 20771307 21286339 22371058 23151107 24003248 25031883
16762B5031883P43854J229150J010978J252995J767273J065005J702785J439198
16754C5243121J584760J588877K151790J930876J975147K006655K678111K807306
16746E1966643K487211L114902K953297L648935L113678L950476L947245L930921
16738G9113308N006674M653479N208385M976820N644860O040801N820061N832385
16730A22296773O389800O163508O591126N348826N585685N255195M780293L667664
16722A66078870L117127K221045J405365q80p86766j534698k824326m125128m319956
16713A59230653m928627n174284o369182n716855o631562n889540o416564o137613
16705A11966426n725347n852584n452121n204647m666437m743379m293504m212701
$$ plain form
16762 25031883 25775737 27004887 28015865 29268860 31036133 32101138 33803923 35243121
16754 35243121 36827881 38416758 40568548 42499424 44474571 46481226 49159337 51966643
16746 51966643 54453854 57568756 60522053 64170988 67284666 71235142 75182387 79113308
16738 79113308 84119982 88773461 93981846 98958666 104603526 110644327 116464388 122296773
16730 122296773 128686573 134850081 141441207 146790033 152375718 157630913 162411206 166078870
16722 166078870 169195997 171417042 172822407 172821527 172034761 170500063 167675737 163550609 159230653
16713 159230653 154302026 149127742 142758560 137041705 130410143 124520603 118104039 111966426
16705 111966426 106241079 100388495 94936374 89731727 85065290 80321911 76028407 71815706
16697G1815706l753674l911805k866504l466885k972951k617093k609737k526814
16689D7090243k370163k184940k055046j764039j738577j463500j843480j562657
16681C2107841j062661j510273j149825q63661j334858r54548j316579j037975
16673B2877461m85358q45143p78682p03007q16702n82035n32669o90958o21610
16664A6821297p80488m18769l74411q61736l79589m08475j53472n07362l54186
16655A2582809o48281O3780n80798k35091k41235m64455J06985k58992o44541
16646I680181j71061j32974j32986k84400n18658p57l33800l24759k31942j99189
16636G349655O9487j10882n5323l49167l51434R332r9402j75460R5509j47298
$$ plain form
16697 71815706 68062032 64150227 61283723 57816838 54843887 52226794 49617057 47090243
16689 47090243 44720080 42535140 40480094 38716055 36977478 35513978 33670498 32107841
16681 32107841 31045180 29534907 28385082 27521421 26186563 25232015 23915436 22877461
16673 22877461 22392103 21546960 20768278 20065271 19248569 18666534 18133865 17442907 16821297
16664 16821297 16040809 15622040 15247629 14385893 14006304 13597829 13444357 12936995 12582809
16655 12582809 11934528 11998308 11417510 11182419 10941184 10476729 10583714 10324722 9680181
16646 9680181 9509120 9376146 9243160 8958760 8440102 8439345 8105545 7780786 7548844 7349655
16636 7349655 7419142 7308260 7252937 6903770 6552336 6561668 6462266 6286806 6382315 6235017
16626F235017m37547K07369j66140l76982r0996k17618Q6890k08182o91557P01455
16616E041709P6705l22239l55396k11296J08874j27424J89199j28098q7813m5412
16606D138809P0454k31073l38556L88523P635k96454p2234j47352j42824r9564
16596C277364K35340m46271k44547L81881o8050j89942R6340j87598J54732n6714
16586B952535L41361m57541k65108L3489J16047j335j83633L41790k25098n2962
16576B599545k84142K99130k87554k74171K3928M66046l23549J05585J85520l27394
16566B182944r9373K94333l48937R2076R4312l95525j14202O15502l85922k08543
16556A726665L27799j00252j52092j58391J06024J21698m64732L55648j98811
$$ plain form
16626 6235017 5797470 6004839 5838699 5461717 5370721 5153103 5239993 5031811 4340254 5041709
16616 5041709 5118414 4796175 4440779 4229483 4338357 4210933 4400132 4272034 4184221 4138809
16606 4138809 4209263 3978190 3639634 4028157 4035792 3739338 3667104 3519752 3376928 3277364
16596 3277364 3512704 3066433 2821886 3203767 3135717 2945775 3042115 2854517 3009249 2952535
16586 2952535 3293896 2836355 2571247 2604736 2720783 2719448 2535815 2877605 2652507 2599545
16576 2599545 2315403 2614533 2326979 2052808 2076736 2542782 2219233 2324818 2510338 2182944
16566 2182944 2083571 2377904 2028967 2121043 2215355 1819830 1705628 2321130 1935208 1726665
16556 1726665 2054464 1954212 1802120 1643729 1749753 1871451 1406719 1762367 1563556
16547A563556L68082k67907o4283m49K00108l94262j75457M45679o1686J8082
16537A631463j14525J00835J36788k63656j36615K25854N2592k08382j4935J64797
16527A574216k18258k05395K55481j76498K74415l96881J45051J63086k05520
16518A209697N2583m8324K09904k73304M19152m59158j75192L61944L6050J04621
16508A437973m96952N08290k47895n8383P4614j32783j51100K84722n21270K05816
16498I03032O2994j30612L26788L89241n89685Q1831Q0255K55593k91713J14117
16488A201841l62895o7092L61601E16475O14003r3947k66118j084r3625K66993
16478I42697j6144o8702P516j19930J48081J81439k73261j71802J9316M64449
$$ plain form
16547 1563556 1931638 1663731 1599448 1598999 1799107 1404845 1229388 1675067 1613381 1631463
16537 1631463 1516938 1617773 1754561 1490905 1354290 1580144 1632736 1424354 1409419 1574216
16527 1574216 1355958 1150563 1406044 1229546 1503961 1107080 1252131 1415217 1209697
16518 1209697 1262280 1213956 1423860 1150556 1569708 1110550 935358 1297302 1333352 1437973
16508 1437973 941021 1449311 1201416 1143033 1217647 1084864 933764 1218486 697216 903032
16498 903032 966026 835414 1162202 1551443 961758 1043589 1123844 1379437 1087724 1201841
16488 1201841 838946 771854 1133455 516475 1130478 1036531 770413 769329 675704 942697
16478 942697 926553 857851 865367 745437 893518 1074957 801696 629894 649210 1113659
16468A113659M3676l68372k21706J76957K59702j19191J94104K3096m63765L07887
16458I46047l72221r2255L28990j50024P6387L82746l98801Q0511P3759j9471
16448H55668l2931n1m01420L77157j6051L6426J03874k63050M6012k40745J91030
16437F55919j36170K54781k39743M2235l9204K89976k23161L2681P0901l6993
16427F71222j87696K38101q2252k12101K24117J11539m9317l26070J23627J40082
16417F51252K76957k59650j26544K84174J07144k29761K37407k09173k55262Q6417
16407E62961m173L3108N5448K36679l72703J73156l38701p5482P82241E2231O87615
16396G39846r2550j1578m7428j41506J79927J82552j27780j78255O5934O1986
$$ plain form
16468 1113659 1157335 788963 567257 744214 1003916 884725 1078829 1101925 638160 946047
16458 946047 573826 481571 810561 660537 736924 1119670 720869 801380 875139 855668
16448 855668 822737 822686 421266 798423 782372 818798 922672 659622 705634 464889 655919
16437 655919 519749 774530 534787 577022 537818 827794 604633 637314 708215 671222
16427 671222 483526 721627 639375 427274 651391 762930 713613 387543 511170 651252
16417 651252 928209 668559 542015 826189 933333 703572 940979 731806 476544 562961
16407 562961 558788 591896 647344 884023 511320 684476 345775 270293 1052534 52231 739846
16396 739846 647296 635718 588290 446784 626711 809263 681483 503228 569162 631148
16386F31148k4295j94550M0762P2762k7879K25138j20750j20874O4619j98111
16376C47970m9927K75120j38562P0826r7522J13202L10315j3404C75981J35374
16366E11355q0883j4298L33203k79880j85728J87937J39826J01419K7376l32926
16356D07401J14996k53053L01258J22762k30757j4591j74132i3194E09180L02068
16346H11248C27070R0307J31414L20318p0742j16798B78452M24061k69031A43075
16335A52739N96517j64277j24857M25505l34313q3194J62793K4556k19659R4760
16325E30570B25086N24085k96500M53665k61106P9250k04255M7124k25464P478
16315C49363J99525J28213k05222Q3050j4156J50082j11419A20782N11496C03762
$$ plain form
16386 631148 606853 412303 453065 525827 497948 723086 602336 481462 546081 347970
16376 347970 298043 573163 434601 505427 407905 521107 831422 818018 375981 511355
16366 511355 430472 416174 749377 469497 283769 471706 611532 712951 740327 407401
16356 407401 522397 269344 570602 693364 462607 448016 273884 -93194 509180 811248
16346 811248 327070 417377 548791 869109 798367 681569 278452 702513 433482 143075
16335 152739 749256 584979 460122 885627 551314 468120 630913 655469 435810 530570
16325 530570 225086 749171 452671 906336 645230 724480 520225 567349 341885 349363
16315 349363 548888 677101 471879 554929 540773 690855 579436 120782 632278 303762
16304G00603r8197j50903j2228J4464j38438O9706j54278J99462M226j020m76
16293D32921A15481K02048j1366o835L58528A74262K74788N7471j68606J78040
16283E15955k46897J19695J85061B55080K0753L60886j08053j81254o139j8886
16273C22387m9962A32962L79469J74962k18099p9776H2581M03735j87075J99593
16263D98834n6640K04951K5196k31286B03984K81221k06549n8933l3490m1039
16253A45194N47245k87642P9259J99202b2004D64737j00588j58872M00694A37030
16242C42010K09400P9853j73797R2884j74088M7033k3042j55118K36181p5094
16232D06222j9801r7073A28586J06513J5975K45356A55266J52093K60312k60729
$$ plain form
16304 700603 602406 451503 439275 453739 315301 385007 230729 430191 434417 433397 432921
16293 432921 115481 317529 306163 299328 657856 174262 449050 506521 337915 515955
16283 515955 269058 388753 573814 255080 275833 636719 528666 347412 341273 322387
16273 322387 272425 132962 512431 687393 469294 389518 82581 486316 299241 498834
16263 498834 442194 647145 672341 441055 203984 485205 278656 219723 186233 145194
16253 145194 692439 404797 484056 683258 -22004 464737 364149 205277 605971 137030
16242 342010 551410 631263 457466 550350 376262 423295 400253 245135 481316 406222
16232 406222 386421 289348 128586 235099 251074 496430 155266 307359 567671 306942
16222C06942K0339n8668p6833K43088j92613L73819A76413L45817j75320p4142
16212B72768A31646K5804J51868L2987E4598K32299j3284a17516D09513L2556
16202D42069A45224j9535J10888K17235j11074M0852j33096A03669i8272B07444
16191B42397J17339n739A49940D8912K4492l0629J6822J41641J24906B7476M41895
16180D69371j49923K05948k36730N7721k2154J3695J5201J35664G3454K01418
16170B74872m4736B0860P3114J92913a70964B24653k7819f7152D21666A08632
16159A48498L03850A02411K83606p8650j02500L8507J14773j05410a73501Q0367
16149i3134C0076b30758B4884G590K51845o9305J55566j58761o9181J50697j8798
$$ plain form
16222 306942 327281 268613 191780 434868 242255 616074 176413 522230 346910 272768
16212 272768 131646 157450 309318 342305 54598 286897 273613 -117516 409513 442069
16202 442069 145224 125689 236577 453812 342738 383590 250494 103669 -98272 207444
16191 242397 359736 353997 149940 48912 73404 42775 59597 201238 326144 27476 469371
16180 469371 319448 525396 288666 346387 324233 337928 353129 488793 73454 274872
16170 274872 230136 20860 93974 286887 -170964 224653 196834 -67152 421666 108632
16159 148498 452348 102411 386017 307367 204867 243374 358147 252737 -173501 -93134
16149 -93134 30076 -230758 24884 7590 259435 190130 345696 186935 117754 268451 249653
16138B49653R6881A23185k127a3418A60142M4076P9774K2963a38303C87662A91077
16126C84365A09858J16487Q1928j25752c2876C00235F0835K43370F0535K21662
16116B82197l7143a06785L76B08148C6367l434f0699E2169J53921r172K43059
16105D39977f5598A6398J6150K71098g8555b2160E50137h0697B49351p7108J25271
16094B97514e322j64328A75772l5479m495O0806p5088d5200I2280J60965a03268
16082A51233A2264N1151i1619k43131D6280a20210A81192h221n5094b1527A57172
16070a5485A2671K9136b10455J8457B79751n6695R4831F8996B544K11245b53236
16058d2013j68112d9060K1174A51631E9645J23677a23218c1564j26456M0649k0874
$$ plain form
16138 249653 346534 123185 121058 -13418 160142 204218 283992 306955 -138303 387662 191077
16126 384365 109858 226345 308273 182521 -32876 300235 60835 304205 60535 282197
16116 282197 245054 -106785 -106409 208148 36367 32933 -60699 52169 206090 196918 439977
16105 439977 -65598 16398 32548 303646 -78555 -22160 550137 -80697 249351 172243 297514
16094 297514 -5322 -169650 175772 140293 135798 196604 121516 -45200 92280 253245 -103268
16082 151233 12264 63415 -91619 -334750 46280 -120210 181192 -8221 -63315 -21527 157172
16070 -15485 12671 41807 -210455 -191998 279751 223056 317887 68996 2544 213789 -253236
16058 -42013 -210125 -49060 -27886 151631 59645 183322 -123218 -31564 -158020 -117371 -138245
16047a38245j40058J28757A23457L6478c88312a82086f8241C55995n4496A42354
16036A66553J05085C3386K5658K4658a62074o0953K0712A18982K30770a39904
16025A39738f4728k2969j69228A59473C7513a93666G15351g9251j70485B83584
16014c77888a57203I977a64676C53691e6968A53876a07777Q154A48685j7932E4128
16002a2544B15243a36531B99056f5335n0253A24385b35700H0796P6661c3856k71550
15991c05406I4939a41467B18690c92313A60001b97004b9997A32948D1458j4925
15981B6533K14961b34367A53187M4339q6892j5655c7529r2363A26951E9505A1375
15969A40801L1525o1498J01855E9775l356e1217m1311m0390A06175K7233M1179
$$ plain form
16047 -138245 -278303 -149546 123457 159935 -388312 -182086 -68241 355995 301499 142354
16036 166553 271638 33386 59044 83702 -162074 -223027 -202315 118982 349752 -139904
16025 139738 -64728 -87697 -256925 159473 37513 -193666 715351 -79251 -249736 283584
16014 -377888 -157203 9977 -164676 353691 -56968 153876 -107777 -99623 148685 130753 54128
16002 -12544 215243 -136531 299056 -65335 -115588 124385 -235700 80796 157457 -33856 -305406
15991 -305406 94939 -141467 218690 -392313 160001 -297004 -29997 132948 41458 26533
15981 26533 241494 -234367 153187 197526 110634 94979 -37529 -129892 126951 59505 11375
15969 140801 172326 110828 212683 59775 56419 -51217 -92528 -132918 106175 133408 174587
15958A74587E4246a79844F0208E002c59702C7456A441L5440K00563a55762g3617
15946e7770k7423F3703k8846O8480f4727A33356n6878c30625g947B45134i2666
15934B88137M1900a00554j14498B74849e5941A78147B1087R155a03509k8681B64249
15922A53374a41990j83086B77183e5324k29403B7628d5611G3826g0109r2361h825
15910A07114c3106n5053j24848A25335b52207d8154A49642a57510j6842O0639
15900a13713Q228D15468A38716f8714F024M2702a54029c8987l9957F2763a38768
15888E0459M8147N8841J24609D8390J26268M2754j02198c50560D7798J26160q697
15877A65261g6246J587c1780A31204a17452E3734a26122l0057O5872l3417l15066
$$ plain form
15958 174587 54246 -179844 60208 5002 -359702 37456 1441 36881 237444 -155762 -73617
15946 -57770 -85193 63703 34857 103337 -64727 133356 76478 -330625 -7947 245134 -92666
15934 288137 330037 -100554 -215052 274849 -55941 178147 21087 30242 -103509 -132190 264249
15922 153374 -141990 -325076 277183 -55324 -284727 27628 -45611 73826 -70109 -162470 -8825
15910 107114 -33106 -88159 -213007 125335 -252207 -48154 149642 -157510 -174352 -113713
15900 -113713 -105485 415468 138716 -68714 6024 48726 -154029 -38987 -78944 62763 -138768
15888 50459 98606 157447 282056 48390 174658 217412 115214 -350560 47798 173958 165261
15877 165261 -76246 -74659 -31780 131204 -117452 53734 -126122 -156179 -90307 -123724 -438790
15866d38790J43538D49422D4778h3079h436j82836P9017e788j64670O992m630
15855a68096H7010J69330a64244P0277E1225N7589a63162a2871j76783M7001p7598
15844b20251C3511A6352e962j26109b2144B85098e0443k77233a11280D2519f1180
15832a30098d8568A09554q682j1911P2106a68908b7897A21960E136i1578j29567
15821b21145J04849D74879b32638l3609B19319f6277j41430j42984C37051n3773
15811B83278a72725j00418e0227o5962n7551O804k14025B18226O9512J27808f8317
15799a09061K6678m5022L6322q96j46440p4229A61748e6130l9267j87564M5545
15788b37416a5401p0777m00375a35041B99027d0369j87876m9408B0765b70442
$$ plain form
15866 -438790 -295252 449422 44778 -83079 -8436 -191272 -112255 -5788 -170458 -163466 -168096
15855 -168096 87010 256340 -164244 -93967 51225 108814 -163162 -12871 -189654 -142653 -220251
15844 -220251 33511 16352 -5962 -132071 -22144 285098 -50443 -327676 -111280 42519 -61180
15832 -130098 -48568 109554 100872 88961 161067 -168908 -27897 121960 5136 -91578 -221145
15821 -221145 -116296 474879 -232638 -266247 219319 -66277 -207707 -350691 337051 283278
15811 283278 -172725 -273143 -50227 -116189 -173740 -166936 -380961 218226 287738 415546 -68317
15799 -109061 -82383 -127405 -91083 -91979 -238419 -312648 161748 -56130 -95397 -282961 -237416
15788 -237416 -15401 -86178 -486553 -135041 299027 -40369 -228245 -277653 20765 -270442
15777b62958R9715M5914a919k25565A3496b82826j62696a91583C5464b3178D409
15765D0127M4264f4568k40946J1806d168k42659R8307B23630c5019j38432b4032
15753B63037b58819F549K0129c85068g1478a904k56979f5657A7403a85231A59901
15741A94018A7154a75439j09738k9486N5072R9205p7484B908f00867h9735A8955
15729d0156l3863b7866o2841q3250H8863M320b27725R2776j7967b3909j06166
15718a30075l88621i1222k35217G7931a37949m891j29624b4585A50044K57420
15708D07464j97855c43650A06144j0812K21935H2417b38462C2541a62619A83529
15697I0249b1887k51973g8592n91p1926J2763j54A29551n6569i8586C06376b07445
$$ plain form
15777 -262958 -163243 -117329 -1919 -227484 13496 -282826 -445522 -191583 35464 -23178 4409
15765 40127 84391 -64568 -305514 -293708 -4168 -246827 -148520 223630 -35019 -173451 -24032
15753 263037 -258819 6549 26678 -385068 -71478 -1904 -258883 -65657 17403 -185231 159901
15741 194018 17154 -175439 -285177 -314663 -259591 -160386 -237870 2908 -600867 -89735 18955
15729 -40156 -74019 -27866 -90707 -173957 88863 93183 -227725 -134949 -152916 -23909 -130075
15718 -130075 -518696 -91222 -326439 77931 -137949 -142840 -272464 -24585 150044 407464
15708 407464 209609 -343650 106144 95332 317267 82417 -238462 32541 -162619 183529
15697 90249 -21887 -273860 -78592 -79183 -151109 -138346 -138500 129551 72982 -98586 306376 -207445
15684E9186K6390G14b25549O1272H8390J57618i9012j94099a21421A01711L7242
15673A38953b9674A0967a00890K833p1041A10283f8724B478K9760b606A24521
15661C82603h2706k41429C5824J30511b64640J08836a4689B88943F5519R287j9069
15650E5737b57192R1217A46767j0126D8140e3840P661j43194m8737N1680C18811
15638A47556e0854A77734K4817f116C68890B6011K46232H6049J59503a10631A37104
15626a68627j01776a26600C22675j19897a53912n6901A73206g0229H3207K89224
15616C72431r6902A13827i9478B07180I2592b11951j38360A83276b05922Q4710
15606a21212A29094a09224a0693I4903e6256j27470k22n3939k8220d225k5140
$$ plain form
15684 59186 85576 714 -225549 -164277 88390 246008 -99012 -293111 -121421 101711 138953
15673 138953 -29674 10967 -100890 -98057 -169098 110283 -68724 2478 32238 -2606 124521
15661 382603 -82706 -324135 35824 166335 -264640 -155804 -14689 288943 65519 74806 55737
15650 55737 -257192 -165975 146767 136641 48140 -53840 -46179 -189373 -238110 -186430 318811
15638 147556 -50854 177734 202551 -6116 368890 26011 272243 86049 245552 -110631 137104
15626 -168627 -270403 -126600 322675 202778 -153912 -210813 173206 -70229 83207 372431
15616 372431 275529 113827 -99478 207180 92592 -211951 -350311 183276 -205922 -121212
15606 -121212 129094 -109224 -10693 94903 -56256 -183726 -183948 -237887 -266107 -4225 -29365
15595b9365A34495b09942h7607A56686c0068B5368J88089g4783c6215A50945k1890
15584A29055b27965g0685j61909b5677j75236B40812F9020K36481c54890F9803
15573b83901L0593G7290a5200m6573p4740k7854g9151n6185H0749b04510C11920
15561A7496a04495j428c1469C0440J9040b50441e1841k03093A00152P0217D4821
15549i560E6296b54560d5358e012B5967J3183L9646k6027e4533C3669j57K6130
15537E9642i2933A31851J31401K588E8029a46104C7869b27679J11501A31148m4482
15526H6666d50010G720a80443b5197A16672P593a70220M6972k3388F5589J12999
15515A78588a75726f3742b8227j15962M6510j63449D3872a86017B2480g8275j52022
$$ plain form
15595 -29365 134495 -209942 -87607 156686 -30068 25368 213457 -74783 -36215 150945 129055
15584 129055 -227965 -70685 -232594 -25677 -200913 240812 69020 305501 -354890 69803
15573 -283901 -253308 77290 -15200 -61773 -136513 -164367 -79151 -135336 80749 -204510 311920
15561 17496 -104495 -105923 -31469 30440 49480 -250441 -51841 -254934 100152 170369 44821
15549 -9560 56296 -254560 -45358 -5012 25967 39150 78796 52769 -54533 33669 33512 59642
15537 59642 -92933 131851 263252 265840 58029 -146104 37869 -227679 -116178 131148 86666
15526 86666 -450010 7720 -180443 -25197 116672 124265 -170220 -123248 -146636 65589 178588
15515 178588 -175726 -63742 -28227 -144189 -97679 -261128 43872 -186017 22480 -78275 -230297
15504b30297a10953B09827H1573K2986K00602e19024a7696F9149a08464B21083
15493a67096B90450a04417L6874o9918H6340i2470j46020f9857j3564A20001b78033
15481e1375H0259a3783q5082D04044A57418D1373L64793i0321r2098O7062k49991
15470c65348a2572G8305a78367B16681r4269o770J642J23168h6179c2334A48294
15458A24008a24045B05329n2707a29814A68485h3288q8693P1252A04669L1543
15448A36212c35702a15670A56416d3370p8823e8952C59939B1476a45648j0121
15438a55769g2167c715C02249b84183G8479k496b0440B83482c52268a0941n5747
15427f6688B5580J90964Q485a16219B62592D2604Q0882b00485K8169N2619I5577
$$ plain form
15504 -230297 -110953 209827 81573 104559 305161 -519024 -17696 69149 -108464 221083
15493 -167096 290450 -104417 -67543 -137461 86340 -92470 -238490 -69857 -83421 120001 -278033
15481 -51375 80259 -13783 -98865 404044 157418 41373 406166 -90321 -182419 -115357 -365348
15470 -365348 -12572 78305 -178367 216681 122412 115642 117284 240452 -86179 -32334 148294
15458 124008 -124045 205329 152622 -129814 168485 -83288 -171981 -100729 104669 136212
15448 136212 -335702 -115670 156416 -43370 -122193 -58952 359939 21476 -145648 -155769
15438 -155769 -72167 -3715 302249 -284183 78479 75983 -20440 283482 -352268 -10941 -66688
15427 -66688 25580 216544 225029 -116219 262592 42604 123486 -200485 -172316 -119697 95577
15415a55746P3096A38009J0639c896G7926I201K08812b7582B5182J4052b67628
15403c87802c0916A73719E0516b26830K4672A35849D4399K02770r1145a27332
15392i8364a2930C2424K2522O0781N231a25096C0404J4887R5845j4631l1627K12633
15380C07511a99840r7699a45466d652j60527D5778a32158M4877a140j30901A46367
15368c79632a17452F1637a18956D00450a3029k87425b1277A40902c53300i5801
15357C00227a65506j7942f3104G8737d8963J0346H8004a16755L6961E8174a76762
15345g7604C8869J32096c529l47628c0391q0217A01031c6290j18110c8669C04596
15333D4715d4270r3873B69717a99483A88011F3136O2446L9448E6172J39916E3748
$$ plain form
15415 -155746 -82650 138009 148648 -3896 77926 9201 218013 -27582 25182 39234 -267628
15403 -387802 -30916 173719 50516 -226830 -202158 135849 44399 247169 156024 -127332
15392 -98364 -12930 32424 54946 115727 120958 -125096 30404 45291 141136 126505 94878 307511
15380 307511 -199840 -297539 -145466 -4652 -165179 45778 -132158 -87281 -1140 -132041 146367
15368 -379632 -117452 61637 -118956 400450 -13029 -300454 -21277 140902 -353300 -95801
15357 300227 -165506 -183448 -63104 78737 -48963 -38617 88004 -116755 -79794 58174 -176762
15345 -77604 38869 170965 -3529 -351157 -30391 -110608 101031 -36290 -154400 -38669 304596
15333 44715 -44270 -138143 269717 -199483 188011 63136 125582 165030 56172 196088 53748
15321a9181A59093E3085L6073J55616m937b29348C24148F9815J2241Q8607J58832
15310C29495a04843H6290K78130A33386j62a99139D8134h7048r957j11245L6442
15299a71808A26837a08145A0974a02989A10751J86081j5040o2730a7889A76531
15288I7234d23406E7369R51O0083h0213H5709Q2875n6152C1002L98344A23109
15276D684d7136A87841n5075b54715e2632A08393K56271a05145A11492f604A53885
15264e1177j3565A32925c1952n929A07482k1714b31788A04955Q6633L4601A1524
15252C65620E7861J79198p9599r537E1970O2158b13983j23176F4483a86272A42010
15240B23579C3966b09612B58201f455A49922n5067c8890A74948B8231f6248H5819
$$ plain form
15321 -19181 159093 53085 89158 244774 239837 -229348 324148 69815 82056 170663 329495
15310 329495 -104843 86290 364420 133386 133224 -199139 48134 -87048 -97005 -208250 -171808
15299 -171808 126837 -108145 10974 -102989 110751 296832 281792 219062 -17889 176531
15288 97234 -423406 57369 58320 118403 -80213 85709 168584 112432 31002 429346 123109
15276 4684 -47136 187841 132766 -254715 -52632 108393 364664 -105145 111492 -6604 153885
15264 -51177 -64742 132925 -31952 -37881 107482 85768 -231788 104955 191588 226189 11524
15252 365620 57861 237059 157460 147923 51970 114128 -213983 -337159 64483 -186272 142010
15240 223579 33966 -209612 258201 -6455 149922 94855 -38890 174948 28231 -66248 85819
15228a03252c3835D07107b68972e84q380G5386J1092G45K57253a36358D52714
15216i252B76181q1407F7490a41476I9088h0942A3362c4391B18397O8182g3340
15204i372A37143a55507f7830A42356B1040J17959a42073a0328H7091a19317H4966
15192A24160m2519a78845B29093k7434O9861a0842n9619a8361o4775B01417b8915
15180i9489D2746a5162B93346D7129i2612A71765c531o4485B97684F28a10325
15168B15857J12331o4803c1713j2153m9043B12008c62583A22956P8059b04297
15157f5151A98174f8882A91933R6399M649A29343J89831Q1478A64982J86202B1230
15145c8229j26510D0877K45204O5841j29895b64582K6641A27674R9737a76701
$$ plain form
15228 -103252 -33835 407107 -268972 -584 -8964 75386 86478 745 257998 -136358 452714
15216 -9252 276181 194774 67490 -141476 99088 -80942 13362 -34391 218397 286579 -73340
15204 -9372 137143 -155507 -67830 142356 21040 138999 -142073 -10328 87091 -119317 84966
15192 124160 81641 -178845 229093 201659 271520 -10842 -70461 -18361 -83136 201417 -28915
15180 -99489 42746 -15162 293346 47129 -92612 171765 -3531 -68016 297684 628 -110325
15168 215857 328188 263385 -31713 -43866 -92909 212008 -362583 122956 201015 -204297
15157 -65151 198174 -68882 191933 288332 292981 129343 319174 400652 164982 351184 21230
15145 -38229 -164739 40877 286081 351922 222027 -264582 -237941 127674 227411 -176701
15134b85101b2749l00794B24796N4642l5022R6030a67463G2393J70892p3640C1552
15122B38680K2362A08435M1764a64857J4694A56783a22617D71658I2168g8868
15111A86251P341m8392l199m2228J28740a91178O5653A05634j4560K59346a51552
15099A02067c1148B63555I8468N4754P3193b3436B89189h935r0798j02371D08525
15087B62679D5292J02413E1712P6643N0437J31037b27042A40526J10678b81797
15076A00456j4501J67778M7576a10062E3735L46388b2281G3099J19234a1149B76509
15064A71015C3968L30096A19924K47962H2881b47250D07350k00104a67658A5948
15053c0657F8144a13260B72739j15443g6903B63828H9101J43838i5385I3150J50690
$$ plain form
15134 -285101 -22749 -323543 224796 279438 244416 340446 -167463 72393 243285 169645 31552
15122 238680 261042 108435 150199 -164857 -150163 156783 -122617 471658 92168 -78868
15111 186251 193592 145200 142001 99773 228513 -191178 -125525 105634 91074 350420 -151552
15099 102067 -31148 263555 98468 153222 226415 -23436 289189 -8935 -99733 -202104 408525
15087 262679 45292 147705 51712 128355 178792 309829 -227042 140526 251204 -281797
15076 100456 85955 253733 301309 -110062 53735 400123 -22281 73099 192333 -11149 276509
15064 171015 33968 364064 119924 367886 82881 -247250 407350 207246 -167658 15948
15053 -30657 68144 -113260 272739 157296 -76903 263828 89101 232939 -95385 93150 243840
15042B43840J4111A07800C8591M17889A58324K47138A65099J19681A10146K7830
15032A37976j6023n1542J64397o7238J51249M4103F3832K48913A55304f6501D43399
15020D62343A65244K33981d4821B38200g4762D03954c7952F4284f0737A85061
15009B09358D6087N6166C7546K11451A24023K19903a23965B39516O7503A49685
14998H4610h6189E0236M99966k41671q0181K07374r6376P342e1084j13265G2770
14986d1914m5036B4108J64139M4833n6230i7284C31583a00102B21095r3034K55185
14975C83246j39121H3047G553P6118J63895J18497b2535G2259J47958J47074J15320
14964D82611B22480K34525H1269k077M15229I3984J55370J0485F3259J92709l6058
$$ plain form
15042 243840 257951 107800 38591 456480 158324 405462 165099 284780 110146 137976
15032 137976 121953 70411 234808 167570 318819 362922 63832 312745 155304 -66501 443399
15020 462343 165244 399225 -44821 238200 -74762 403954 -37952 64284 -60737 185061
15009 209358 46087 102253 37546 248997 124023 343926 -123965 239516 307019 149685
14998 84610 -86189 50236 550202 308531 228350 435724 339348 346690 -51084 -164349 72770
14986 -41914 -86950 24108 188247 233080 176850 -97284 331583 -100102 221095 128061 383246
14975 383246 244125 83047 7553 83671 247566 366063 -22535 72259 220217 367291 482611
14964 482611 222480 457005 81269 79192 494421 93984 249354 259839 63259 255968 219910
14953B19910j7163r2881D1699M37601G7047K37443m5953o9392a54519b1794j36120
14942a57914A81518O5141p4335P5144K07629m7655c6649C2361J08958l8345K94495
14931C97469j62620l2290P6409o727A24140D2407L04399A11469K25030N198F6076
14919C67419h1830D47089j88520p1869K10997p5254A45057J29615j08380N9531
14909B25823H9319J91756j8482r4909j6356Q7258l0813n6178K328M69579j45323
14898D78179J26729B20442O7188l5561N67762C69366L23527l39661J1482q5449
14888B79265G8513d3518B28419M2750A28859K30369A26973K05600K14644f4915
14877C50190J92422b1456D3060K4468J86991Q24J17943L40211B30336r1070b41140
$$ plain form
14953 219910 202747 109866 41699 479300 77047 314490 268537 199145 -154519 -21794 -157914
14942 -157914 181518 246659 172324 247468 455097 407442 -36649 32361 141319 102974 397469
14931 397469 234849 202559 278968 272241 124140 42407 346806 111469 336499 341697 66076
14919 367419 -81830 447089 258569 186700 397697 322443 145057 274672 166292 225823
14909 225823 89319 281075 262593 167684 151328 238586 207773 151595 153923 623502 478179
14898 478179 604908 220442 287630 252069 819831 369366 692893 353232 364714 279265
14888 279265 78513 -43518 228419 271169 128859 359228 126973 332573 547217 -64915
14877 350190 542612 -21456 43060 67528 254519 255343 373286 713497 230336 139266 -241140
14865C48859b2780B55491O4755K45008B66308l4469P5290m7283A26237L56796
14855D83033N6694J7742r8271K7634K03354A33871K90293j6632N7336A97962K67210
14844D65172k04036A13300L26070O5417m0055r7599J42145K3175B38269K0098
14834B58367K00268n5504A56167J61353p1295F3475L57915m7593J98066J27097
14824F98960B75904N8355K1225K16732j09444K9652A02118K74905n464j57020
14814B14539P1620R7690J05840R605j20495J80254K78229C56551J56029j81212
14804C31368K11684k26788M01557F9223L20668n9240L0357J14731j61207J90284
14794E04816k3414j63746O70551C76849m5608M7354O7200M5542A12942M63984
$$ plain form
14865 348859 -22780 255491 320246 565254 266308 231839 307129 259846 126237 483033
14855 483033 539727 557469 459198 486832 690186 133871 424164 407532 464868 197962 465172
14844 465172 261136 113300 439370 504787 464732 367133 509278 532453 238269 258367
14834 258367 458635 403131 156167 317520 246225 63475 421390 373797 571863 698960
14824 698960 275904 334259 355484 572216 462772 492424 102118 377023 371559 214539
14814 214539 286159 383849 489689 499294 378799 559053 837282 356551 512580 331368
14804 331368 543052 316264 717821 69223 389891 330651 361008 475739 314532 504816
14794 504816 481402 317656 988207 376849 331241 378595 445795 491337 112942 576926
14784E76926j84804J99776B44480K96284j0416j5333J12197j86051m540N2868
14774D89489L12649l18461J75526r3554r3112J49913k15745J97593k88580K78887
14764E94605n3083k40152M0991O46060m46671N4790k56417K01811B63369M60954
14754G24323k03250p9681J44337J27251j7352k91495R9912J75108P897l43502
14744C43548M21910k49611P2004J5780Q7172P4245j61632n019J24658j79916L65746
14733I08885k05987j76021J26407l4287j55966M47101l58526P1172J44211j61749
14723F05240k95030O06237j38471J70540k90195J98715l381j84317O3738k76458
14713D56618M8626L12910C32071J17570J51139J07202J34371M1030k55401k09841
$$ plain form
14784 576926 392122 591898 244480 540764 530348 515015 627212 441161 436621 489489
14774 489489 802138 483677 659203 565649 472537 622450 406705 604298 315718 594605
14764 594605 541522 301370 342361 988421 541750 596540 340123 541934 263369 724323
14754 724323 521073 441392 585729 712980 695628 404133 504045 679153 687050 343548
14744 343548 765458 515847 587851 603631 690803 765048 603416 598397 723055 543139 908885
14733 908885 702898 526877 653284 618997 463031 910132 551606 622778 766989 605240
14723 605240 310210 916447 777976 948516 658321 857036 853655 669338 733076 456618
14713 456618 505244 818154 332071 449641 600780 707982 842353 883383 627982 418141
14703D18141L15333K07319j20978j42313L89766n15480L63747m06030P3084J05390
14693F87979J44804p612L20126j37472k02630J57842j53201j39372K16771l13698
14683E73537M78139l63728P2993l4952K28686k41753j69809P8033Q0087J43105
14673H44338l8363J18444O6228k46284Q0549m1308L07402m09808J97075j13446
14663G64827K29640N7848P4926l63819J57261Q2417N5972l4604o2484L10045n6474
14652A215555k90348K23251k80368J67140j96354K34381M2797P4024j50086M93896
14642A533888o57797J85883K42549n6311k0428J56492j61517j01808k4434K06281
14632A302798k3086j80365J93597K4106q2238k25161L15338j17861k53612n549
$$ plain form
14703 418141 733474 940793 819815 677502 1067268 551788 915535 509505 582589 687979
14693 687979 832783 825171 1145297 1007825 805195 963037 809836 670464 887235 573537
14683 573537 1051676 687948 760941 725989 954675 712922 543113 621146 701233 844338
14673 844338 805975 924419 990647 744363 824912 783604 1091006 681198 878273 764827
14663 764827 994467 1052315 1127241 763422 920683 1003100 1059072 1024468 961984 1272029 1215555
14652 1215555 925207 1148458 868090 1035230 838876 1073257 1116054 1190078 1039992 1533888
14642 1533888 876091 1061974 1304523 1248212 1227784 1384276 1222759 1120951 1096517 1302798
14632 1302798 1279712 1099347 1292944 1317050 1234812 1009651 1324989 1207128 953516 947967
14622I47967J07459Q8942l3252J24484k6333P1299k12196N59990N0478m89543
14612A189295L76611m78325N17177k93549J48102m39616N69685k88155K30138
14603A531363k21321L78080k98851L58186n91133J05520K81369k5578o397q5587
14593A425651n2893r0922K16211L56845j68636k07415r6876j24845J86878L16564
14583A760562J06465q9823j85614J73311j0400K4300j56876o7557J64679L21507
14573B040554p5185r9154L11465m86977J51304J94305o3155L3521J59783P0502
14563B236963N1120M43957m9769r3110K22690l2949J45324n7109P035J89329N55568
14552C619049P579J174176J191480J303959K904854O987624J2178353O413592
$$ plain form
14622 947967 1055426 1144368 1111116 1235600 1209267 1280566 1068370 1628360 1678838 1189295
14612 1189295 1565906 1087581 1604758 1311209 1459311 1019695 1589380 1301225 1531363
14603 1531363 1310042 1688122 1389271 1747457 1156324 1261844 1543213 1517635 1511238 1425651
14593 1425651 1372758 1281836 1498047 1854892 1686256 1478841 1381965 1257120 1443998 1760562
14583 1760562 1867027 1777204 1591590 1764901 1754501 1778801 1621925 1554368 1719047 2040554
14573 2040554 1965369 1866215 2177680 1690703 1842007 2036312 1973157 2006678 2166461 2236963
14563 2236963 2288083 2732040 2682271 2589161 2811851 2778902 2924226 2867117 2874152 3063481 3619049
14552 3619049 3626628 4800804 5992284 7296243 10201097 17188721 29367074 35780666
14544C5780666j3633166A1019177E400998j766286p86772l16764n43995o5778
14536A921403L57291k61653k13002n2893L6402O9269J91482j18209n9047K88863
14526B159906q0352j29608K40541L1406q7276L55784N360k25756Q0757K3176k79715
14515B094223L96267m17020N37409k86280L8984M9624l38999K85931M67325k62041
14505B565423m7173k19862J37977j8403J49860j7397J31443K83410j20779L34008
14495C178507o76104N24367l23974L12895j84535K92217J19313P6191R394j71161
14485C157110K26801r7407K0077N6397N9292j00905L84235K50652n26450L09850
14475C739652j94688M7841K23519m9486L1554L56624k60275L6628l4858l8402
$$ plain form
14544 35780666 22147500 11019177 5400998 3634712 2847940 2531176 1987181 1921403
14536 1921403 2278694 2017041 1804039 1751146 1787548 1856817 2048299 1930090 1871043 2159906
14526 2159906 2079554 1949946 2190487 2221893 2134617 2490401 2495761 2270005 2350762 2373938 2094223
14515 2094223 2490490 2073470 2610879 2324599 2363583 2413207 2074208 2360139 2827464 2565423
14505 2565423 2518250 2298388 2436365 2417962 2567822 2550425 2681868 2965278 2844499 3178507
14495 3178507 2502403 3026770 2702796 3015691 2831156 3123373 3242686 3318877 3328271 3157110
14485 3157110 3383911 3286504 3306581 3362978 3422270 3321365 3705600 3956252 3429802 3739652
14475 3739652 3544964 3592805 3816324 3766838 3798392 4155016 3894741 3931369 3896511 3858109
14465C858109j77262L68182k32946K86358J86165j25134N69127k77714Q5856N5277
14455D596018k03991N08686j98385j04936K26977J46643l81332J42319J61914
14446D893913K96132O0610n81654N77136m9822J68416q0303J52174j78153J9719
14436E278168L73063Q0983J5298N97958n44098R4805L01630q0942L8286K7838
14426F182989N40873k75596L70172l67973J86434j2210L7878N32743j4730Q7475
14416G268055M6231O6595M14422M2924k53092J99051N5072K90671J88176K34406
14406H552511p445L30670J06216j8614L29864J48997K52114k67601N1420J75141
14396I653273M3921L75111L48699M64865l71950K43836J09589L95786L34020J90393
$$ plain form
14465 3858109 3680847 4049029 3816083 4102441 4288606 4163472 4732599 4454885 4540741 4596018
14455 4596018 4392027 4900713 4702328 4597392 4824369 4971012 4589680 4731999 4893913
14446 4893913 5190045 5250655 4669001 5246137 5196315 5364731 5284428 5436602 5258449 5278168
14436 5278168 5651231 5732214 5747512 6345470 5801372 5896177 6197807 6116865 6155151 6182989
14426 6182989 6723862 6448266 6818438 6450465 6636899 6624689 6662567 7195310 7180580 7268055
14416 7268055 7314286 7380881 7795303 7838227 7585135 7784186 7839258 8129929 8318105 8552511
14406 8552511 8545066 8875736 8981952 8963338 9293202 9442199 9694313 9426712 9478132 9653273
14396 9653273 9697194 10072305 10421004 10885869 10513919 10757755 10867344 11263130 11597150 11787543
14386A1787543L29730j73134K36826J00350K26550L75481R3183M97973N1369L47320
14376A3873191K70201L9527P62125M6881M11154K0375L43063L12798M69693K39741
14366A6788749L43407K47984N19894M30869J42844P38903M74459L06173M28559
14357B0421841K83167O50456K43987P79763M03132P18133J55294P89539P03995
14348B5149307K88395R02070N03000R84544N30266Q87513P28581N89647J101835
14339C1665158P97363R59154Q21859P08116J539181J240023L16789J961248N35874
14330D0544765J359385J414231J560507J103490J800079J321111J881417J872626
14322E2857611J880564J718246J773033K138969K218455K731929K028325K974256
$$ plain form
14386 11787543 12117273 11944139 12180965 12281315 12507865 12883346 12976529 13474502 13525871 13873191
14376 13873191 14143392 14182919 14945044 14991925 15403079 15423454 15766517 16079315 16549008 16788749
14366 16788749 17132156 17380140 17900034 18330903 18473747 19212650 19687109 19993282 20421841
14357 20421841 20705008 21355464 21599451 22379214 22782346 23500479 23655773 24445312 25149307
14348 25149307 25437702 26339772 26842772 27827316 28357582 29245095 29973676 30563323 31665158
14339 31665158 32462521 33421675 34243534 34951650 36490831 37730854 38047643 40008891 40544765
14330 40544765 41904150 43318381 44878888 45982378 47782457 49103568 50984985 52857611
14322 52857611 54738175 56456421 58229454 60368423 62586878 65318807 67347132 70321388
14314G0321388K365897L105976K853179L159348L196560L915132L778079L995987
14306I6691546M160646M611686M763307N394558N098350O095828O145337O320568
14298A39281826O811617P515362P818028Q425132Q344357R495535R730193J0479445
14290B07901495J1095372J1896414J2160899J3029050J3749258J3813821J4785370
14283B98431679J5189706J5209754J5877355J5545532J5779639J5191421J4730496
14276D05955582J3861146J2765068J1301462Q868703N423771K401716O44821j390
14268D61220879j746643l266680n082560q354981j0491629j2564744j4011201
14261D05702441j4862802j5585939j6294660j6397214j6247900j6453359j5449357
$$ plain form
14314 70321388 72687285 75793261 78646440 81805788 85002348 88917480 92695559 96691546
14306 96691546 100852192 105463878 110227185 115621743 120720093 126815921 132961258 139281826
14298 139281826 146093443 153608805 161426833 169851965 178196322 187691857 197422050 207901495
14290 207901495 218996867 230893281 243054180 256083230 269832488 283646309 298431679
14283 298431679 313621385 328831139 344708494 360254026 376033665 391225086 405955582
14276 405955582 419816728 432581796 443883258 452751961 458175732 460577448 461222269 461220879
14268 461220879 459474236 456207556 451124996 442770015 432278386 419713642 405702441
14261 405702441 390839639 375253700 358959040 342561826 326313926 309860567 294411210
14254B94411210j5023742j4352838j3985513j2919148j2705956j1514151j1077433
14247B02832429j0845759r511920r271232q688652q117195p538193p111761o823500
14239A34924217o532193n656274n372778n685048m790468m696812m631818m071778
14231I3487048l665293l107665m019579l502285k665729l097005l223576k543304
14223F7662612k459935k546440j900601k075775k085745j859245k084649j542590
14215E1107632j742257j421788j263737j888780j190154j523959j463896n30283
14207D0082778r59074j370129j101740r66719j514750o61024q50824j49632j305076
14198C1203810j136772p20628j082908p54818j82192q73839l60729j044418m02495
$$ plain form
14254 294411210 279387468 265034630 251049117 238129969 225424013 213909862 202832429
14247 202832429 191986670 182474750 173203518 164514866 156397671 148859478 141747717 134924217
14239 134924217 128392024 122735750 117362972 111677924 106887456 102190644 97558826 93487048
14231 93487048 89821755 86714090 82694511 79192226 76526497 73429492 70205916 67662612
14223 67662612 65202677 62656237 60755636 58679861 56594116 54734871 52650222 51107632
14215 51107632 49365375 47943587 46679850 44791070 43600916 42076957 40613061 40082778
14207 40082778 39123704 37753575 36651835 35685116 34170366 33509342 32658518 32508886 31203810
14198 31203810 30067038 29346410 28263502 27508684 27326492 26452653 26091924 25047506 24645011
14189B4645011o78931n80588p38595m69086o9043q09665l52910o15711j038652
14180A9291830K14320k68115n95213j93991p20466l01920m0757n47367n56868
14171A6281453m64486N8894m52261k36347k66586l49952o36012N6531M5483o88405
14161A3348312j58271l29619k22091n0867n22724J10435p4680j27690o66424k23658
14151A1082723Q8869l94222K00281l08197l46459r9095l46239o350N9589k21030
14141I709870o8828n31318J11667m16849L2940J6641L41n92453N3857o0382m1431
14130H214055l22447L05902l53860n21208P4172l65507J25085l1011j60512K42521
14120G207190k45382l44184j4248L270j10617L06598m79678j36278M84442p56943
$$ plain form
14189 24645011 23966080 23385492 22646897 22177811 22108768 21299103 20946193 20330482 19291830
14180 19291830 19506150 19238035 18642822 18448831 17728365 17426445 17385688 16838321 16281453
14171 16281453 15816967 15875861 15423600 15187253 14920667 14570715 13934703 13991234 14036717 13348312
14161 13348312 13190041 12860422 12638331 12587464 12064740 12175175 12100495 11972805 11306381 11082723
14151 11082723 11171592 10777370 10977651 10669454 10322995 10223900 9877661 9871311 9930900 9709870
14141 9709870 9641042 9109724 9221391 8804542 8837482 8854123 8854464 8262011 8315868 8255486 8214055
14130 8214055 7891608 8197510 7843650 7322442 7396614 7031107 7156192 7125181 6964669 7207190
14120 7207190 6961808 6617624 6603376 6606646 6496029 6802627 6322949 6186671 6671113 5914170
14110E914170Q2548N3582j91075k90612M03306j32959l04181J03498l71217J60546
14100E427606K79019n92473j3519L0322K84898l72854Q5706j08340r9580j66566
14090D754219j4838j83136J07211L83048m09896k76359J32507Q4248j08247J12039
14080D580796j10852k66077K04774l06918R4506l37101L15833l38802J66082l17625
14070C684616L87108n21893K30510J20668L1261k42337J9924l46533L21334P9791
14060C764449m73960J71363j31837J12517Q5866k17290J95403k65761J02467J41889
14050C485106l47389P153m566j57143J81128n21430O35179k351l33059j4583J53457
14039C081502K4579o03617o6449K10732K02732j15011K0388J60362o4855j2305
$$ plain form
14110 5914170 5996718 6050300 5859225 5568613 5971919 5838960 5534779 5638277 5267060 5427606
14100 5427606 5706625 5114152 5100633 5130955 5415853 5042999 5128705 5020365 4920785 4754219
14090 4754219 4739381 4556245 4663456 5046504 4636608 4360249 4492756 4577004 4468757 4580796
14080 4580796 4469944 4203867 4408641 4101723 4196229 3859128 4174961 3836159 4002241 3684616
14070 3684616 4071724 3549831 3780341 3901009 3932270 3689933 3709857 3363324 3684658 3764449
14060 3764449 3290489 3461852 3330015 3442532 3528398 3311108 3506511 3240750 3343217 3485106
14050 3485106 3137717 3144870 3140304 2983161 3164289 2642859 3278038 3275687 2942628 2928045 3081502
14039 3081502 3106081 2502464 2436015 2646747 2849479 2734468 2754856 2915218 2850363 2838058
14029B838058j92412J84o2089j98611k01123P1760N9165O8545K1589J53027j00699
14018B457394K40745o60973q4161N28960k54686p6953R9553k30413K84034j79454
14008B124046M3420j3520N347l90589M43345j62686j55553J74612J11786r3031
13998B087177k75027J4160J48830p3494N04856k5047J47421k11280P58568P46846
13988C823010K354028O191788J2153502J1646402r572883j1403047n668255l167294
13980F357251j454883r10678m74411m70306k30327j98939K66044l69693j61176
13971B352882J97318k66000L3945L7570p75702P99068m08728L13766k19512J11871
13961B176478l14399K60386j12939n44017J97032Q7748J52421K28470n67607k38876
$$ plain form
14029 2838058 2645646 2645830 2583741 2385130 2184007 2255767 2314932 2383477 2405066 2558093 2457394
14018 2457394 2698139 2037166 1953005 2481965 2227279 2150326 2249879 2019466 2303500 2124046
14008 2124046 2167466 2153946 2159293 1768704 2212049 2049363 1893810 2068422 2180208 2087177
13998 2087177 1812150 1826310 1975140 1901646 2406502 2381455 2528876 2317596 3076164 3823010
13988 3823010 6177038 12368826 24522328 36168730 26595847 15192800 9524545 6357251
13980 6357251 4902368 3991690 3517279 3046973 2816646 2617707 2883751 2514058 2352882
13971 2352882 2550200 2284200 2318145 2355715 1580013 2379081 1970353 2284119 2064607 2176478
13961 2176478 1862079 2122465 2009526 1465509 1662541 1750289 1902710 2131180 1563573 1324697
13951A324697O21952k16556m22262O41125m11437Q4734J27013J3424p4124o7908
13941A620658m6778p882k51800K89583m22284Q1991M93709j54794r7610q7961
13931A416832k48631M29798p948j34545R3284j39817R6327j90397j26791K18741
13921A406853j08920k85967M94380l0349j4062j28932J02908j42936l453j39528
13911A149994K09193j32325R2054m0693n9207J64830Q9471l06441J98282j69127
13901A196031j08133K44215n7389J48321l35871K04454l79833O63089k69267n36484
13891G69133K59682M61886k51933j71717n3423J38182L4051l2340J35156k77424
13881A011253m2970j65305L00275l97121M46009l88133K36793Q67k1420p8624
$$ plain form
13951 1324697 1946649 1730093 1307831 1948956 1537519 1622253 1749266 1762690 1688566 1620658
13941 1620658 1573880 1565998 1314198 1603781 1181497 1263488 1757197 1602403 1504793 1416832
13931 1416832 1168201 1597999 1590051 1455506 1548790 1408973 1505300 1314903 1188112 1406853
13921 1406853 1297933 1011966 1506346 1475997 1461935 1333003 1435911 1292975 1289522 1149994
13911 1149994 1359187 1226862 1318916 1278223 1219016 1383846 1473317 1166876 1365158 1196031
13901 1196031 1087898 1332113 1274724 1423045 1087174 1291628 911795 1574884 1305617 769133
13891 769133 1028815 1490701 1238768 1067051 1013628 1151810 1185861 1153521 1288677 1011253
13881 1011253 968283 802978 1103253 706132 1152141 764008 1000801 1001668 980248 901624
13871I01624j12495J78741K5495j1164r8181j10428J52695k4627J14542j53914
13861H62288J07147l818J23217j91494K49488m73922L23294q9761P9150o6054
13851I19535O3148k54723J88940L65747E96907K80354l4342J71108n7319k91201
13841F65507L60012l90328K17911j59076K51922j55076J37124k5557j53249j18271
13831F30919L36752j63774M6793k93903k7817P2258L08566j90882Q236J64339
13821H91487j90885J72290q6549m1681J12144r0989O3297Q3544q9178j02731P4474
13810G95223j15127j45538L63867j65997l56048J58713B63844L95263J43181o1645
13800G40643j16451p6523j13260L91554j76281j43170J86741J15256l88681N09549
$$ plain form
13871 901624 789129 967870 993365 982201 884020 773592 926287 901660 1016202 862288
13861 862288 969435 965617 1088834 897340 1146828 672906 996200 906439 985589 919535
13851 919535 982683 727960 916900 1282647 596907 877261 842919 1014027 956708 665507
13841 665507 1025519 635191 853102 694026 945948 790872 927996 902439 749190 630919
13831 630919 967671 803897 850690 556787 528970 601228 909794 718912 727148 891487
13821 891487 700602 872892 786343 744662 856806 765817 829114 912658 823480 720749 795223
13810 795223 680096 534558 898425 732428 376380 535093 263844 659107 802288 740643
13800 740643 624192 547669 434409 825963 649682 506512 693253 808509 419828 929377
13790I29377j00652j59377J06238K28313j74129J36338j44417p3271j44941K561
13780F06040A51713K55680O4031M85601l23773O2933K19571m03908J79437k13347
13770D77938L64573L3486k17877k22148O5195J76223j29908k0619R6588O7035
13760F90486l39553K55031k52402J5219K56347A95198K53943n0787M62737k34813
13750F26278J5450j56771Q8020j05405J87802A71997M76671B53676J2274L46991
13740F12941B10527L44286K75908A54547L98903P9079A91409K60243J42257k12136
13730C81773J29948J86867o6354j64704L9413R8760j42402B09693M38964B14381
13719F30802R5067o8373o2778l3692j25619K04208q0788J84095l03667N04714
$$ plain form
13790 929377 828725 669348 775586 1003899 829770 966108 821691 748420 603479 606040
13780 606040 151713 407393 471424 957025 633252 696185 915756 511848 691285 477938
13770 477938 842511 875997 658120 435972 501167 677390 547482 526863 623451 690486
13760 690486 350933 605964 353562 368781 625128 195198 449141 398354 861091 626278
13750 626278 641728 484957 572977 467572 655374 171997 648668 253676 265950 612941
13740 612941 210527 554813 830721 154547 553450 632529 191409 451652 593909 381773
13730 381773 511721 698588 632234 467530 506943 605703 463301 209693 648657 214381
13719 630802 725869 657496 594718 561026 435407 639615 558827 742922 439255 943969
13709I43969A16924L74739j64076L85043C43491J59193L54536C95771R2156M51919
13699I39846l89590J78271l19251J00186n2583k09448J05189A46473L91002p1023
13689D66452j06174q2802M67622m0726j39694B73870J04749Q2190N1798O6365
13679E78972B05234k1669L54436o3815K69090k61228A49198L86140B01709L26202
13669E27911r4916M8965M5778j95409o3039J13177K70699B0513L28325M5994A37764
13657H6757M77070j22297J82855B62787K06635j64395q3352J33377M7326j31476
13647B70902j13323J78143L74149C18590k5084A23637K86018J54366o9891j16729
13637C77401j00345J10648q9916A16766J60739p2359Q5084p3306J12781L47403
$$ plain form
13709 943969 116924 491663 327587 712630 343491 502684 857220 395771 487927 939846
13699 939846 550256 728527 409276 509462 456879 247431 352620 146473 537475 466452
13689 466452 360278 277476 745098 704372 564678 273870 378619 460809 512607 578972
13679 578972 205234 183565 538001 474186 743276 482048 149198 535338 201709 527911
13669 527911 432995 481960 527738 332329 269290 382467 653166 20513 348838 394832 137764
13657 86757 563827 441530 624385 262787 469422 305027 221675 355052 402378 270902
13647 270902 157579 335722 709871 318590 293506 123637 409655 564021 494130 377401
13637 377401 277056 387704 297788 116766 277505 205146 290230 216924 329705 677108
13627F77108B99085c9978C54694K32353K0617k68042l0474m3190J0288n8387M33099
13616F50958B53404j14830l1989L22523q984M3693j75750A39175J02818q7827
13606A54166J6277J26395K640r560A41824J39456J18413j99063P4460K69671r5778
13595D48983j98126J95436F6893K03961j2215o2192K19445n7696A59577J8726
13585A78303N9046J30255I8583J13574N7579O1982J17047A72828L3065A01509
13574A65195K23645K53130C17277p6083P1132e6109B71316L7313q3895N447j05487
13563A24694J65659E7603m145J64438J18842l0196L3691j14609I2296k9686K96296
13552C58906P133p8622K8821A18198J97546q6861j4865J07576A35198b19113B40116
$$ plain form
13627 677108 299085 -39978 354694 587047 607664 339622 309148 265958 276246 217859 650958
13616 650958 253404 138574 106585 429108 420124 463817 288067 139175 241993 154166
13606 154166 170443 296838 299478 289918 141824 281280 399693 200630 275090 544761 448983
13595 448983 250857 446293 66893 270854 258639 196447 415892 358196 159577 178303
13585 178303 237349 367604 98583 212157 269736 331718 448765 172828 205893 101509
13574 165195 388840 641970 317277 241194 312326 -56109 271316 308629 224734 230181 124694
13563 124694 290353 57603 53458 217896 336738 306542 340233 225624 92296 62610 358906
13552 358906 366039 287417 316238 118198 315744 228883 214018 321594 135198 -219113 240116
13540c5980C95302j41646k3016P7957A02909N68106A05348O3293L9158b04736
13529B07003g0516A92525a30920E80437k44885A03696e5720A61091g0427E51261
13518C13510k6541j20608K00326J9637a47788E00009A21592E9396L9606J16251
13508B15253D1657a6973A66401K62566j72301h9298A6297a10048C91588j41842
13498B49746J60585p341A06077J61501k8845J3585K85887j76683o6769A34469
13487a3330E26462j96093J55079b36973B89303j23543O8670J57108m9899J63702
13477E05341A65626L9211L8005O6309K5245o1869n1057B7338J9284R1159L62521
13466E00302k44928k9293Q8144o3317b12631A96971N925A3195K39273p8983j8044
$$ plain form
13540 -35980 395302 253656 230640 308597 102909 671015 105348 168641 207799 -204736
13529 207003 -70516 192525 -130920 580437 335552 103696 -55720 161091 -70427 551261
13518 313510 286969 166361 366687 386324 -147788 500009 121592 59396 99002 215253
13508 215253 41657 -16973 166401 428967 256666 -89298 16297 -110048 391588 249746
13498 249746 410331 402990 106077 267578 238733 252318 538205 361522 294753 134469
13487 -13330 526462 330369 485448 -236973 289303 165760 234430 391538 341639 505341
13477 505341 165626 204837 242842 309151 334396 272527 221470 27338 46622 137781 500302
13466 500302 255374 226081 314225 250908 -212631 196971 202896 13195 252468 173485 155441
13455A55441K17176l3860A16053L48057j25303K56254G2074B8576K46692L8219
13445C13487j36106k3012d4477C31661A28783h8830G9058L25887j19805D6352
13434f0089a2876m19351E4429L6784N2010n7409Q6800P9835O8258q724K05358
13423E17341a51774d3842A49577C9032N03815G0856d6998B14345J18029g7429
13412E6892L47703A41360e1660q697b2225A94302K30164j82086K38781e5044B36531
13400B73023r7319N938i7834M807H8198R445J74576K45840J38058C01574r0566
13389B11008o4525j252J26109J17930j90722A8398K19663J24713n2104j37192
13379A73478q6733K693L20473D2266L78811A33097J92251j02500G8166a1347B43428
$$ plain form
13455 155441 372617 338757 116053 464110 338807 595061 72074 28576 275268 313487
13445 313487 177381 154369 -44477 331661 128783 -88830 79058 404945 285140 46352
13434 -60089 -12876 -432227 54429 91213 143223 85814 172614 252449 320707 311983 517341
13423 517341 -151774 -43842 149577 39032 542847 70856 -46998 214345 332374 -77429
13412 56892 404595 141360 -51660 -60357 -22225 194302 424466 242380 481161 -55044 236531
13400 273023 175704 181642 -97834 -93027 88198 97643 272219 518059 656117 301574 211008
13389 211008 146483 145231 271340 389270 198548 18398 238061 362774 310670 173478
13379 173478 86745 89438 409911 42266 421077 133097 325348 222848 78166 -11347 243428
13367C54538A43834K01904K56132D6189K33473A33044i5307A83820b54239f6489
13356a50156g3077E79916A60715J36404H8350p553b01063D68385A00366M4794
13346A45160J83060A17001L41504A37667K3819J90301J01099G2521Q1255J91137
13336C44913M6688j57070j0119J32921C8104a49111A58505l9162K86127A53366
13325a72922P2548A04991Q7825K36426G9408P334L6519J15007m8556l3057k1431
13314A35224a17528c0185F2653J0197K73412j38843J43851a93156A04386b1172
13303a1241d899m4481C29112b46487C88511j56242Q3747B5951J91656a8146A50961
13291A81244G1444R366L53771L6675A15734N4470O7130g354A07311J1943I861
$$ plain form
13367 354538 143834 345738 601870 46189 279662 133044 -95307 183820 -254239 -66489
13356 -150156 -73077 579916 160715 297119 88350 80797 -201063 468385 100366 145160
13346 145160 328220 117001 458505 137667 161486 351787 452886 72521 153776 344913
13336 344913 391601 234531 224412 357333 38104 -149111 158505 119343 405470 153366
13325 -172922 -100374 104991 192816 429242 79408 86742 123261 238268 189712 156655 135224
13314 135224 -117528 -30185 62653 72850 346262 207419 351270 -193156 104386 -21172
13303 -11241 -4899 -49380 329112 -246487 388511 232269 316016 25951 217607 -18146 150961
13291 181244 71444 80810 434581 471256 115734 170204 237334 -7354 107311 119254 9861
13279b5166H4194a13549B9154J02238a18777B93238M463J25455A6158b72522C40725
13267i213j04589C18397g4518A80413M35942k88043A04677C8361J56742a01320
13256B90976d4500A51668a00580j78951a30282A03103a07677E28862G3401C5815
13245b6486B11844m3369G499J85290B39J71699k3586a40898l9608A35841J86236
13234C22077O4969k8463a31345B52079J20460M8763A05003b74569J6774A34468
13223A27300K0479R4882a1176D471K39580b9937n9900j3804D71322F5066J33544
13212A98610R3546a70614c8264A73804o2892a99929H467J48331N1174a19557A23059
13200C77573A56408a08375A90125A2839a15564A70245Q8169J17126a97588D0831
$$ plain form
13279 -25166 84194 -113549 29154 131392 -118777 293238 297701 423156 16158 -272522 340725
13267 -9213 -113802 318397 -74518 180413 616355 328312 104677 38361 195103 -101320
13256 290976 -44500 151668 -100580 -279531 -130282 103103 -107677 528862 73401 35815
13245 -26486 211844 168475 7499 192789 239 171938 148352 -140898 -180506 135841 322077
13234 322077 387046 358583 -131345 252079 372539 421302 105003 -274569 -257795 134468
13223 127300 147779 242661 -11176 4471 244051 -29937 -89837 -103641 471322 65066 198610
13212 198610 292156 -170614 -38264 173804 110912 -199929 8467 156798 207972 -119557 123059
13200 377573 156408 -108375 190125 12839 -115564 170245 258414 375540 -197588 40831
13189a74565O4257I5009b13415l9710h9218C28770G0155l2076b76220A6543M33492
13178D50035a941E0405P9159b9329j1900A8303b14917c0943I224a16718B52558
13166A0874b987l2310B50835a42606B45471a22574k173A63884N0276a11109E3011
13154B5547K34838A17818F700P9607i1682c6311j35990M4081D1451J60626J12548
13143C14625j12476a59077B5053J50409D8903K7584j289k7430J05736b20317C59049
13131C0633a79390D89099C8944K7602L9229a47284A93919r0802e2692D5017a22292
13119A15080R0565c8597k72901A32750J61032j07157o1567l8651J41797b10717
13108b02301C72202b8292D4041J77954h4413A01383R7503G9646P041O8237J88629
$$ plain form
13189 -174565 -110308 95009 -213415 -253125 -89218 328770 70155 38079 -276220 16543 450035
13178 450035 -1941 50405 129564 -29329 -41229 18303 -214917 -30943 9224 -116718 252558
13166 10874 -2987 -35297 250835 -142606 245471 -122574 -124747 163884 214160 -111109 53011
13154 25547 260385 117818 6700 86307 -91682 -36311 -172301 -128220 41451 202077 314625
13143 314625 202149 -159077 25053 175462 48903 76487 75198 47768 153504 -220317 359049
13131 30633 -179390 489099 38944 66546 105775 -147284 193919 103117 -52692 45017 -122292
13119 115080 205645 -38597 -311498 132750 293782 186625 125058 86407 228204 -210717
13108 -202301 372202 -28292 44041 221995 -84413 101383 198886 79646 86687 154924 343553
13097C43553O4963A36523Q8745a8062l28914A10276C3556J31454a21397G1819
13086A87692c2360j1538A58160f4542C9291J28456k1889J14815J52073b46884
13075I0163a3160j48180N4491e864j66968A35967g2706A88299P4136F4520L94609
13064D59129d6343B80243j31321J35002l466I4200a93807A67420F1298a27837
13053A84549d0186J7916D47787A62415F6481O9958C962P566L16421A10651J6758
13042A27409J30505a16427A77981c6126A40121l4068O1983k3603B7708J62852
13032A90560g843H5989K56090A70989d7618A09526d16960A79194G5313J22771
13022A98084k4630a69770C5090c41627A28541K61027b13604B9148N5696K11790
$$ plain form
13097 343553 408516 136523 225268 -18062 -346976 110276 33556 165010 -121397 71819
13086 187692 -32360 -43898 158160 -64542 39291 167747 145858 260673 412746 -246884
13075 90163 -13160 -161340 -106849 -5864 -172832 135967 -72706 188299 262435 64520 459129
13064 459129 -46343 280243 148922 283924 280458 94200 -193807 167420 61298 -127837
13053 184549 -40186 -22270 447787 162415 66481 136439 3962 11528 327949 110651 127409
13042 127409 257914 -116427 177981 -36126 140121 106053 168036 144433 27708 190560
13032 190560 -7843 85989 342079 170989 -47618 109526 -416960 179194 75313 198084
13022 198084 173454 -169770 35090 -341627 128541 389568 -213604 29148 84844 296634
13012B96634j03112i5070B16438J4829a0750G82L05536j38317b38413B8142J78838
13001B06980q5431e6344n2615A62284h2750A53195L6618d865j15639n7540B20652
12989A51648g6670j53875C8986Q8438k2530l8772N8586P1111l2730F5091K01329
12978B66420d0566I0008K61341j16299a15502A23557d3086l27570K2044A5913
12967B31445A9734O62871A15565K39532C5622a29318e891o07081c2686F5020J60021
12956B25041a25204D53798i4106H4691Q2561D9932a36833A42592E4983a39729
12945C9777a46294K1509K5538E8378c4676D0062f6549B06862b42037F1401J89638
12934B51039o3836n8948J65663K364C2555b40337C3594K07971c49537C29244A19746
$$ plain form
13012 296634 193522 -95070 216438 231267 -10750 782 306318 168001 -238413 28142 206980
13001 206980 121549 -56344 -108959 162284 -82750 153195 189813 -4865 -120504 -178044 220652
12989 151648 -76670 -230545 38986 127424 104894 66122 124708 195819 163089 65091 266420
12978 266420 -40566 90008 351349 235050 -115502 123557 -43086 -370656 -348612 15913
12967 231445 19734 682605 115565 355097 35622 -129318 -5891 -612972 -32686 65020 225041
12956 225041 -125204 453798 -94106 84691 167252 49932 -136833 142592 54983 -139729
12945 39777 -146294 -124785 -99247 58378 -34676 40062 -66549 206862 -242037 61401 251039
12934 251039 187203 128255 293918 296282 32555 -240337 33594 241565 -349537 329244 119746
12922c41388E8879K81437G7133K11879b33072A44974P8899E1337K3150h4344d856
12910B9807g681F371i6780A4065f2295I3263g4205F5570a58573o880A06081a10864
12897f5026j69133N7781C08388c9910C7687N7688L9803J34927e6986l8997j71807
12886b67790C41247j02661F6552c3523J0748C92997I5734C9096a02289Q935B18651
12874D5708N1457m4965B4985J59364o3984f9064A79423o8543k0760a29628d0576
12862g311A4810c42510F418a20594j4216A17807n4498b29901R5049B93275e010
12850I853a28062b874E7167e7100j77921i5825L6744n5270J03A71359p4784k2882
12838G3693c316C20321e8707p4449A59153b62535F4707l273O3681L34135k15087
$$ plain form
12922 -341388 58879 340316 77133 289012 -233072 144974 223873 51337 74487 -84344 -4856
12910 29807 -7681 6371 -96780 14065 -62295 93263 -74205 65570 -158573 -165453 106081 -110864
12897 -65026 -234159 -176378 308388 -39910 37687 95375 135178 270105 -56986 -95983 -267790
12886 -267790 341247 238586 66552 -33523 -22775 392997 95734 39096 -102289 -93354 218651
12874 45708 97165 52200 24985 184349 120365 -69064 179423 110880 90120 -129628 -40576
12862 -7311 14810 -342510 6418 -120594 -134810 117807 63309 -229901 -134852 293275 -5010
12850 9853 -128062 -2874 57167 -57100 -235021 -95825 -59081 -114351 -114248 171359 96575 73693
12838 73693 -3316 320321 -58707 -133156 159153 -262535 64707 61434 125115 459250 244163
12827B44163c58563C77508d0675C72486b26639a10633E93040D4592J49335b4727
12816B65120a79842n4692a01397d632q867j2416C10488I9699N9039b52950D6831
12804A18949b37107C8361K43229p0899b6404G5844f7967A31769h7056A29313c32330
12792a86945E9101j8847d3302B0685L8578J80289b9384n2940l35241A34779K4203
12781A58982B85b42213p8322a29724A30975n8544k7667J22608i6425j195j48676
12770b46296m1467B9012c4474j68238j18539a09425A00565J07808J4844r4150
12760A29067j1131i7187C6562L8917K4187m6564K6381c51273a63083G7873b18415
12748b6533D74226F3181b60586n1221O0595R9465p0756F059P6395a19313A57155
$$ plain form
12827 244163 -358563 377508 -40675 372486 -226639 -110633 593040 44592 193927 -24727
12816 265120 -179842 -234534 -101397 -4632 -13499 -25915 310488 99699 158738 -252950 46831
12804 118949 -237107 38361 281590 210691 -26404 75844 -67967 131769 -87056 129313 -332330
12792 -186945 59101 40254 -43302 20685 59263 239552 -29384 -82324 -417565 134779 158982
12781 158982 285 -242213 -320535 -129724 130975 72431 44764 167372 -96425 -97620 -246296
12770 -246296 -287763 29012 -34474 -202712 -321251 -109425 100565 208373 223217 129067
12760 129067 117936 -97187 36562 75479 99666 53102 79483 -351273 -163083 77873 -218415
12748 -26533 474226 63181 -260586 -311807 -251212 -151747 -222503 6059 82454 -119313 157155
12736a61352K2856H2671K36670g3591C683a22793r9225C45453a53366N0020A85445
12724A59412g8738A55838h2789J0591J4481k84001C1695K55546c4397j00121A74659
12712a80810B44700k4523k6611b21310A68445i4395A17551L13176q859G6108K0026
12701I6134N2962K8958c0271F4657h9082G6568P6266i3036B42098a21671A64930
12689b41861c3490J4310k43326a12469q1849D5085j6060J16173B2590a60585K7841
12678a32744M4803B66054A10049j7004C582K40488A05561j9453O5911A8474M2619
12667F1093a90252h8922A56724n1631M14136A84915C4327a25939e2861D9758J54278
12656B04036a89701B72114A11536j606b17711Q9399A96300b62957A94602q3985
$$ plain form
12736 -161352 -138496 82671 319341 -73591 3683 -122793 -222018 345453 -153366 -103346 185445
12724 159412 -78738 155838 -82789 -72198 -57717 -341718 31695 287241 -34397 -134518 174659
12712 -180810 244700 220177 193566 -221310 168445 -94395 117551 430727 421868 76108 96134
12701 96134 149096 178054 -30271 64657 -89082 76568 152834 -93036 242098 -121671 164930
12689 -241861 -33490 -19180 -262506 -112469 -194318 45085 29025 145198 22590 -160585 -132744
12678 -132744 -87941 266054 110049 93045 3582 244070 105561 86108 152019 18474 61093
12667 61093 -190252 -88922 156724 105093 519229 184915 34327 -125939 -52861 49758 204036
12656 204036 -189701 272114 111536 109930 -217711 -128312 196300 -262957 194602 110617
12646A10617J34647c4513A70364j6399a85596A83609a56532A35571J8687N2769
12636B07027F6292K5238K1896N595B9382M0513L97220A46962d9715A43597R5399
12625B38996j2952l8310H1093k8642J86472F5278N5318A4713N0146C0138a66996
12613a00365E8747K03279F8640K62831A27382E1740a17249H5264M3528D0949P5348
12602A16297N6722n877J99857a28368e2672B31464a08962B1415L45067A08998
12591e0438A26916c9496l24784h3249I6005k7140J75138d7986o0846I3787A5826
12579A37225a12757j7744b4119G8642K35803j06981G0001J73546L26765A66595
12568C535h6663A39717a04200M8109j11641g4436j86166L4605g9891B842P4289
$$ plain form
12646 110617 245264 -34513 170364 153965 -185596 183609 -156532 135571 154258 207027
12636 207027 66292 91530 113426 119021 29382 69895 467115 146962 -49715 143597 238996
12625 238996 226044 187734 81093 52451 238923 65278 120596 14713 64859 30138 -166996
12613 -100365 58747 262026 68640 331471 127382 51740 -117249 85264 128792 40949 116297
12602 116297 173019 167142 366999 -128368 -52672 231464 -108962 21415 366482 108998
12591 -50438 126916 -39496 -364280 -83249 96005 68865 244003 -47986 -108832 93787 15826
12579 137225 -112757 -130501 -24119 78642 314445 207464 70001 243547 570312 166595
12568 3535 -86663 139717 -104200 -56091 -167732 -74436 -260602 -225997 -79891 2842 77131
12557G7131k0063J90918a52256c736A7602a31766I1221f169k10379i7042b7449
12545d87815B22478f8946j37238i0855C68023A76687a76466L8083B28297a85804
12534a59902b015k06761C84638A8826b3819j68935R3650k43661g4068k5118j49661
12523b48847A74710b11308m0855i8070O823B71452B3850J48692G7738L3921b59276
12511D5592K39898j04207b26406a0754C8141a93706Q5614I0301a63829A4912K11999
12500B26911b26138k5392r4444A06065J73779F1908d1158a5854n4362a2995C25740
12488B51133b1408I3645a13621C83759A14640A2458c3029l9461j05770D4299a95183
12476i2689D4452L8711M47214g1577j12418l1592C5719N5020l1349a77529A1391
$$ plain form
12557 77131 57068 247986 -152256 -3736 17602 -131766 91221 -6169 -216548 -97042 -27449
12545 -487815 222478 -68946 -206184 -90855 368023 176687 -176466 -138383 228297 -185804
12534 -159902 -2015 -208776 384638 18826 -23819 -192754 -99104 -342765 -74068 -99186 -248847
12523 -248847 174710 -211308 -252163 -98070 -91247 271452 23850 172542 77738 111659 -259276
12511 45592 285490 181283 -226406 -10754 38141 -193706 -108092 90301 -163829 14912 226911
12500 226911 -226138 -251530 -345974 106065 279844 61908 -41158 -15854 -70216 -12995 325740
12488 251133 -21408 93645 -113621 383759 114640 12458 -33029 -72490 -178260 44299 -195183
12476 -92689 44452 83163 530377 -71577 -183995 -215587 35719 90739 59390 -177529 11391
12464b54131B8965J17073J36621D0877L02816c60484A73872o7571J30963I2084
12453A73217E3670d386A93255e7630k6804j49703H6564A8019f5698k20049I5431
12441a89118A11286a17034F1571C0437a61283P0174L3320D7651O9389B5783b67009
12429c158B04830L7216a40847L4995n1062B61961a81049A8843N2769b5310I379
12417f9957D48928a17411B54417a01258j65354H0831m0338A2616b83527J5709
12407b67818a28637A37732b1327l4789A5363a07489k91940J68199K282Q9062o0057
12396a99943q595e148j75248o0326J01042f3916A36545g6581m8517N9878j37203
12385b02423N8731f6843k04597F8445b67079H100L1163a22765A22630Q2724b51180
$$ plain form
12464 -254131 28965 146038 282659 40877 343693 -360484 173872 106301 237264 92084
12453 173217 53670 -4386 193255 -57630 -84434 -234137 86564 18019 -65698 -285747 95431
12441 -189118 111286 -117034 61571 30437 -161283 -91109 -57789 47651 117040 25783 -267009
12429 -3158 204830 242046 -140847 -105852 -156914 261961 -181049 18843 71612 -25310 9379
12417 -69957 448928 -117411 254417 -101258 -266612 80831 40493 12616 -283527 -267818
12407 -267818 -128637 137732 -21327 -56116 15363 -107489 -399429 -231230 -228948 -139886 -199943
12396 -199943 -208538 -5148 -180396 -240722 -139680 -63916 136545 -76581 -125098 -65220 -202423
12385 -202423 -143692 -66843 -271440 68445 -267079 8100 39263 -122765 122630 205354 -251180
12373F4251a81335j59593A03653O4092A8687d11125i8491A4238b9362C17363B7451
12361b19800m0100b7584l232C47641d4892F0635a91622E9635k7030h2608A40148
12349b41521m14870e1385j07206A72514b86841a6563A82922M3310o6418g5595
12338B56522f1877K8684k27685A40047e9458f05A14863C066a91619B70207H8540
12326E6297i3465o9097A77935H702a6324j01581A09470D6270b54968P6592P2353
12315a06023j86966a4292k5187j27278B49225a49319A37959D5175R3984C3586
12304D885a40974B04096r9609b18692C6216M4996l1884b56057F340d6591j62565
12293b09156A48927h5339C54504a63803c1126A20868N6748i1651A24756M6174
$$ plain form
12373 64251 -181335 -340928 103653 167745 18687 -411125 -98491 14238 -29362 317363 27451
12361 -219800 -259900 -27584 -30816 347641 -44892 60635 -191622 59635 32605 -82608 140148
12349 -241521 -656391 -51385 -158591 172514 -286841 -16563 182922 226232 159814 -75595
12338 256522 -61877 -33193 -260878 140047 -59458 -605 114863 3066 -191619 270207 88540
12326 56297 -93465 -162562 177935 8702 -16324 -117905 109470 46270 -254968 -178376 -106023
12315 -106023 -292989 -14292 -39479 -166757 249225 -149319 137959 45175 139159 33586
12304 4885 -140974 204096 104487 -218692 36216 81212 49328 -256057 6340 -46591 -209156
12293 -209156 148927 -85339 354504 -163803 -31126 120868 177616 -91651 124756 170930
12283A70930c8884D15512j55280a16696A37569J7024f6428B31188c08756a42736
12272a64036c9477A00269j5852a4381B40348j3352G2169J33646J14639H8877l9881
12261D8996c1875C35341h7917C9999a97361A68782a17800J2962A32287K96283
12251D28570B3551M9091a9550P089B387J31778a39170C1119K13659r2869o2545
12240H9364f7515A98086i7162A97652r1948J19804l4052H0273K63239b607I4558
12228A42639b05018A94471K29334H7890l531a72030A70527i286K291o622E47664
12216D34496D4995K223G748K6500h0392b3436D40005A41557n3164a40170H5544
12204C91655A03653k7201K1881P9519a22570B06852D0234A7822M5341J64450A3819
$$ plain form
12283 170930 -38884 415512 260232 -116696 137569 154593 -66428 231188 -308756 -142736
12272 -164036 -39477 100269 84417 -14381 240348 226996 72169 205815 320454 88877 48996
12261 48996 -31875 335341 -87917 39999 -197361 168782 -117800 -104838 132287 428570
12251 428570 23551 72642 -19550 -12461 2387 134165 -139170 31119 244778 151909 89364
12240 89364 -67515 198086 -97162 197652 105704 225508 191456 80273 343512 -2607 94558
12228 142639 -205018 194471 423805 87890 84359 -172030 170527 -9286 -6995 -13617 547664
12216 434496 44995 47218 7748 34248 -80392 -23436 440005 141557 88393 -140170 85544
12204 391655 103653 76452 98333 177852 -122570 206852 40234 17822 63163 227613 13819
12192B08629H30P1852f8768j03571D36499d7837F6546j1863K78332r3138D8465
12180C05230E5348j8775L11828a67908A57371l1511d8106j08997A00000B074K5951
12169B8025a3601C80642a43962m1258a5992E9010P1104a74047B32971b25272A69991
12157A72227J1773F5632b4980j02623f0073J7379I9194C0206b35270H5075h5217
12145B4152f5523B32216o8867D7868a88983O587A71963L9268d6654E3611a71470
12133A29785k7200m4600i796I8742b79634I6723j6145a51523l217J215A86704
12121A62860b1756j53041h6508j8876A90414o4159B1800g2399l2610A22912c7081
12109d2706j02981a9110h443C3569a20055M5383C13090e70403K77473E9310b83343
$$ plain form
12192 208629 830 72682 -68768 -172339 436499 -47837 66546 54683 333015 239877 48465
12180 305230 55348 36573 348401 -167908 157371 125860 -48106 -157103 100000 2074 28025
12169 28025 -13601 380642 -143962 -185220 -15992 59010 130114 -174047 232971 -225272 169991
12157 172227 184000 65632 -24980 -127603 -60073 -42694 99194 30206 -235270 85075 -85217
12145 24152 -65523 232216 163349 47868 -188983 -182396 171963 211231 -46654 53611 -171470
12133 129785 102585 57985 -9796 98742 -279634 96723 80578 -151523 -154740 -153525 186704
12121 162860 -21756 -174797 -86508 -105384 190414 126255 21800 -72399 -105009 122912 -37081
12109 -42706 -145687 -19110 -8443 33569 -120055 -74672 313090 -570403 -292930 59310 -283343
12097b13079b8058j01498A01697b39271E2673a52776c3404m9605n4701A27451
12086A52229K18549e5017A71913a41342R744a2245j06586d5294A11626c73742
12075a31497C2801d7398r7960i377B57067F0125b12832D4872a72829A14701K42796
12064C57497b41641F8512j9379J25098a34509F4444a22750B21412o960J27251
12054C41703P51069m50782C5360f7297B75218d1886D7934J41376a38922k3455
12044a62377A23218a28614b0320B240a79941A16958c29166J48723c0662G4242
12033B2708b37936N2213M9921K9644n9650a8089B96001i8474A34241i707l402
12022a3109o5703F4177M16299a90875c0578a0006r5140J1057C04580a56267E0367
$$ plain form
12097 -213079 -28058 -129556 101697 -239271 52673 -152776 -33404 -83009 -137710 127451
12086 152229 370778 -55017 171913 -141342 -131598 -12245 -118831 -45294 111626 -373742
12075 -131497 32801 -47398 -145358 -9377 257067 60125 -212832 44872 -172829 114701 357497
12064 357497 -241641 68512 49133 174231 -134509 64444 -122750 221412 214452 341703
12054 341703 1092772 641990 35360 -67297 275218 -41886 47934 189310 -138922 -162377
12044 -162377 123218 -128614 -20320 2240 -179941 116958 -329166 -180443 -30662 74242
12033 22708 -237936 -185723 -135802 -106158 -165808 -18089 296001 -98474 134241 -9707 -13109
12022 -13109 -78812 64177 480476 -190875 -30578 -10006 -105146 -94089 304580 -156267 50367
12010h099j39347k03152a53111F7326a12941d4481J1378C17247c04947A58642
11999i6890B8485b57171J24932F1880a44444O9486L0710C23946a47423J6692B81968
11987a5688I24J90435E2609K35870G1954J9559g4272n4530e2537H4173k9649k5798
11975B8726J45579b677j07931p545k0505A14049a0661l9126k43625A6778a73900
11963a67890j35114H5287P3502i9708r1225B13137B0988a64250h0746B52500b49693
11951i4880r7902K3533A44866e19121A75695l6675C8854J58102L7928a91133a0675
11939b2935m2895A31290M3743n8128J99082B9931J71475A0276J21063J49832B7503
11927b48291g7406a1748B8403a73740A24862J07175A820J15434d7367j99483g2968
$$ plain form
12010 -8099 -147446 -350598 -153111 67326 -112941 -44481 -33103 317247 -304947 158642
11999 -96890 28485 -257171 -132239 61880 -144444 -74958 -44248 323946 -147423 -130731 281968
11987 -15688 924 191359 52609 288479 71954 91513 -74272 -128802 -52537 84173 54524 28726
11975 28726 174305 -2677 -110608 -118153 -138658 114049 -10661 -49787 -293412 16778 -173900
11963 -167890 -303004 85287 158789 -99708 -190933 213137 20988 -164250 -80746 252500 -249693
11951 -94880 -192782 -169249 144866 -519121 175695 139020 38854 196956 234884 -191133 -10675
11939 -22935 -65830 131290 175033 116905 315987 29931 201406 10276 131339 281171 27503
11927 -248291 -77406 -11748 28403 -173740 124862 232037 1820 117254 -47367 -246850 -72968
11915C18b15385b0027A71723D5337I412a30278B42178a38849q0905G5977A7358
11903e6423A72248k053q2097C1101b03489G6153b72543a32529e4702r2549l3536
11892a80787M4482C89755G3796P7756a97024A47369e8059G9256M3291b91757g2865
11880b4123p4787A5958K49268b5973l16704B13421J32225a57361q7752E0950Q9723
11869A40673a0143l9790l7278B98230j36542a01583k27177G6736J8331g6787l3196
11858a09983l48969f7397B12712b71607q4343H4240J52978j02179P836A3165a57126
11846B57050J01324a3690j12723E8160i5788B00723a08268M993A3645a85425b4218
11834b08515c203l23547g3189j20598F470P2596c51037F9784O0808a38051B74550
$$ plain form
11915 318 -215385 -20027 171723 45337 9412 -130278 242178 -138849 -219754 75977 17358
11903 -56423 172248 170195 88098 31101 -203489 76153 -272543 -132529 -54702 -147251 -180787
11892 -180787 -136305 389755 73796 151552 -197024 147369 -58059 79256 122547 -291757 -72865
11880 -24123 -98910 15958 265226 -25973 -342677 213421 345646 -157361 -245113 50950 140673
11869 140673 -10143 -49933 -87211 298230 161688 -101583 -328760 76736 95067 -76787 -109983
11858 -109983 -458952 -67397 212712 -271607 -355950 84240 237218 135039 142875 13165 -157126
11846 257050 358374 -13690 -126413 58160 -95788 200723 -108268 -103275 13645 -185425 -24218
11834 -208515 -3203 -326750 -73189 -193787 6470 79066 -351037 69784 130592 -138051 274550
11822a48778r5219o4457g3231A13924C4365g5781k98556E0933f789A7746J2905
11811C0651J26929f1540K5570A51079g5239I9988i2391k39291G8182b51016G0277
11799a47161d1675j4213p8573A75856a4258C3318a14290D5174b40142d5006D3793
11787A4967J02968J43697j5190e1455A52209a10611a8782l08719k3502J48510
11777b02493A44396c09998J06986A05176P5828d99486D0014K38964a13281n1600
11767a64881j23084A11976f5413A1625J64154h3095b5847P359j07359A90380b39496
11755A93579a3919l318p1785m0657d7734k50960A99381c83766b0207o2649l5222
11744a18078n601I3260n260l7994J57455b19768P2898A60558E8863h9658o9602
$$ plain form
11822 -148778 -243997 -308454 -73231 113924 34365 -75781 -374337 50933 -6789 17746 30651
11811 30651 157580 -61540 -35970 151079 -75239 99988 -92391 -331682 78182 -251016 70277
11799 -147161 -41675 -55888 -134461 175856 -14258 33318 -114290 45174 -240142 -45006 43793
11787 14967 117935 261632 246442 -51455 152209 -110611 -18782 -327501 -351003 -202493
11777 -202493 144396 -309998 -203012 105176 181004 -499486 40014 278978 -113281 -164881
11767 -164881 -287965 111976 -65413 11625 175779 -83095 -25847 -18488 -125847 190380 -239496
11755 193579 -13919 -17237 -89022 -129679 -47734 -298694 199381 -383766 -20207 -82856 -118078
11744 -118078 -123679 93260 88000 50006 207461 -219768 -146870 160558 58863 -89658 -159260
11733a59260n5858M5158O4271j0162G2659j6855f5494m2731A10704j6418a7271
11721A44300R6028J08108C9790K1100P3218K07394i6986B33626b22733E7321K06609
11710B63930A19981b84852J36886A21948i8533B6912a53391G1620e8359j63570
11700b21929G7980J06426h1841o1147A51941d3828C6229J43062d8564K1610k57996
11689b84950H7818c4973k08128B54073f9272b4469H9290K7473b24432B60377a4781
11677a40790a1551j35366J5476k2588f0308k25284l0696A93931L9401A0044O3538
11666G3582b23752L1292D1897b71284B8996b43212A48610f7216A0686P8940K54022
11655C43648j59341n3310i4507K3375A1168A272b34392A40281B4029M7681K6049
$$ plain form
11733 -159260 -215118 -169960 -105689 -115851 72659 55804 -65494 -108225 110704 94286 -17271
11721 144300 240328 348436 39790 60890 134108 341502 -96986 233626 -222733 57321 263930
11710 263930 119981 -284852 -147966 121948 -98533 26912 -153391 71620 -58359 -221929
11700 -221929 77980 184406 -81841 -142988 151941 -43828 36229 179291 -48564 -26954 -284950
11689 -284950 87818 -34973 -243101 254073 -69272 -24469 89290 116763 -224432 260377 -14781
11677 -140790 -11551 -146917 -131441 -154029 -60308 -285592 -316288 193931 233332 10044 73582
11666 73582 -223752 -192460 41897 -271284 28996 -243212 148610 -67216 10686 89626 343648
11655 343648 184307 130997 -94507 -71132 11168 1272 -234392 140281 24029 71710 97759
11644I7759c4417k62242A57236e7983B8935J42243f3356C6028J65094a2333B44367
11632A48216N1834r0653c25414a5160A88759F891J82198e3013j80091C2436c7681
11620a60260A25869j5409a06232e2677C8314j8532a64103A60334C2372J81642
11610B14014G4756c8671A03138Q2139c60883A98986a68491a7771k6946F0206O3623
11599A23829O9265A5536a80603k2853A19682i1955A82104E972M5884K45075A14586
11587B14829I0114A747g7121C9664b18015A23892K69092A13634c10968B76485
11576i9368C44810j42485d2716b190j62526A52852a84955H8568h7274C6369Q4609
11565A20978i3339H8177K1795K8964A9757a34918A77496h4213L5305B44181e97320
$$ plain form
11644 97759 -34417 -296659 157236 -57983 28935 171178 -63356 36028 201122 -12333 244367
11632 148216 200050 109397 -325414 -15160 188759 6891 189089 -53013 -233104 32436 -37681
11620 -160260 125869 110460 -106232 -52677 38314 19782 -164103 160334 32372 214014
11610 214014 74756 -38671 103138 185277 -360883 198986 -168491 -17771 -44717 60206 123829
11599 123829 193094 15536 -180603 -203456 119682 -91955 182104 5972 51856 296931 114586
11587 214829 90114 1747 -77121 39664 -218015 123892 392984 113634 -310968 276485
11576 -99368 344810 202325 -42716 -2190 -164716 152852 -184955 88568 -87274 36369 120978
11565 120978 -93339 88177 109972 138936 19757 -134918 177496 -84213 -48908 244181 -597320
11553c11860A04380M58506a42206o1099b2551j59891I552J62084a88577B64782
11542b72145h7717C94066A84298a08873A35484K35359A35727j8182b47562I8855
11531c42627B64405H7866a6970A48347K04800m6946o7771d7854m7642r3816e3908
11519i7195m435E5417B2212O9135L9945O02663a15840C32505A05457i2350A06949
11507A96106a22436A96163b8041A07526A8055b5377H3724J98923M294j02778a15594
11495b957j76131A65899J14173i1490A5383M18147c3848E0562M8329C814L39623
11484C43437G9134e3098A26759k2221i894C16713A09623J28283O8684A04331a10802
11472a21849C95011j01924n4466q3778F4262L18521i3193I794K8260J33700L03820
$$ plain form
11553 -311860 104380 562886 -142206 -203305 -22551 -182442 9552 171636 -188577 264782
11542 -272145 -87717 394066 184298 -108873 135484 370843 135727 117545 -247562 98855
11531 -342627 264405 87866 -16970 148347 353147 306201 238430 -47854 -95496 -189312 -53908
11519 -97195 -101630 55417 22212 91347 131292 733955 -115840 332505 105457 -92350 106949
11507 196106 -122436 196163 -28041 107526 18055 -25377 83724 282647 286941 184163 -115594
11495 -2957 -179088 165899 280072 -91490 15383 433530 -33848 50562 98891 3814 343437
11484 343437 79134 -53098 126759 104538 -9894 316713 109623 237906 306590 104331 -110802
11472 -121849 395011 293087 238621 154843 64262 382783 -93193 9794 38054 171754 475574
11461D75574D4089a31883j12089B54394n6770f3526B08530C0436K8271a93633
11450a79515M7311D31015g500A96046a7399E6952h6178L1031B59954p4252D03
11438a01509o7933A22292Q5421G0927K18719E593K68660g9941g588B65601o5251
11427B00350q0746a64261C37J58136a44331j68363A8017K26126j18914a24280
11416A40341o4913a91673B39572J65469c4802k51886Q7114B41307l9691G7168
11405D05310m1009A41757n8203M6646a76038d4426j68298Q3919A12301j9774h0886
11393A47463c9797l39966c8957j67603d6934A53321a83242j64438A85614C4581
11382f9808J1674A71573b17692h184j20567A87977m4032a1852A63460J9376a13126
$$ plain form
11461 475574 44089 -131883 -243972 254394 197624 -63526 208530 30436 58707 -193633
11450 -179515 -132204 431015 -7500 196046 -17399 56952 -86178 -55147 259954 185702 403
11438 -101509 -169442 122292 207713 70927 289646 5593 274253 -79941 -7588 265601 200350
11427 200350 119604 -164261 337 158473 -144331 -312694 18017 244143 125229 -124280
11416 140341 75428 -191673 239572 405041 -34802 -286688 -199574 241307 201616 77168
11405 405310 364301 141757 83554 130200 -176038 -44426 -212724 -128805 112301 92527 -80886
11393 147463 -39797 -379763 -38957 -206560 -46934 153321 -183242 -347680 185614 34581
11382 -69808 -58134 171573 -217692 -8184 -128751 187977 143945 -11852 163460 182836 -113126
11370a22504B14519o8978R9707a99911L4686I863f4350a1718k3597p5969C12042
11358A51864f9297h798r5994n7853n9027A92081e9260j20620B5107N2130c97235
11346d0432q2799F6343Q1412a21483K1026l00927a68113c0068A6758M1521a93956
11334a73127b4850k44335a30062L2290j19717P2151e1649l867C5123K19016q7624
11323A66515o4428K44482a26032B5788J24156J61218p0709a52904B18327a05525
11312A372a93196i5822D7742e5070j49888A21673d7819j76928f6229a106A16670
11300H0645l4375b58074a28619H878J76313i1117B8601J01476N0316b73012C4432
11288A33768a16418B51968j2822E8723b6046A10481b74455E0527c9361A27677
$$ plain form
11370 -122504 214519 145541 245248 -199911 -165225 9863 -64350 -11718 -35315 -111284 312042
11358 151864 -69297 -8798 -104792 -162645 -221672 192081 -59260 -179880 25107 77237 -397235
11346 -40432 -123231 66343 147755 -121483 -100457 -401384 -168113 -30068 16758 58279 -193956
11334 -173127 -24850 -269185 -130062 -97772 -217489 -145338 -51649 -55516 35123 254139 166515
11323 166515 102087 346569 -126032 25788 149944 311162 240453 -152904 218327 -105525
11312 1372 -193196 -95822 47742 -55070 -204958 121673 -47819 -224747 -66229 -1106 116670
11300 80645 46270 -258074 -128619 8878 185191 -91117 28601 130077 180393 -273012 34432
11288 133768 -116418 251968 239146 58723 -26046 110481 -274455 50527 -39361 127677
11277e937k49440d5198A32236J92033G1228N8028e1496J7534n3589l3677d4264
11265I8914b28250E2749a71734q0876G3168a31928k6531j3674l7142j22526J07592
11254b24209A72448b1622k98923B6920a71126A76381c8761P040A29302b49862
11243I779Q0065J374B7103K7031Q5387J05233c17168a6199m4221C7006b6647A8413
11230A38274k6787a97700f8985j70378a02037j94133e2622q0980p0731g2369k89596
11219c61965a72605J1163A80024l8813F6424b6690A67298a56254C35239I371J93407
11208B02778A2757j027J18836d1174j80542G5050b489O01A32709C0639a53605
11196A62888f943j18677A47151b18762B84936k7814D9526b70451l5165A45546
$$ plain form
11277 -5937 -255377 -45198 132236 324269 71228 129256 -51496 -33962 -87551 -121228 -44264
11265 98914 -228250 52749 -171734 -252610 73168 -131928 -158459 -172133 -209275 -331801 -224209
11254 -224209 172448 -21622 -320545 26920 -171126 176381 -38761 -31721 129302 -249862
11243 9779 89844 91218 27103 54134 139521 244754 -317168 -16199 -60420 37006 -26647 18413
11230 138274 111487 -197700 -68985 -239363 -102037 -296170 -52622 -133602 -204333 -72369 -361965
11219 -361965 -172605 -161442 180024 141211 66424 -26690 167298 -156254 335239 9371 202778
11208 202778 12757 11730 130566 -41174 -221716 75050 -2489 -1888 132709 30639 -153605
11196 162888 -6943 -125620 147151 -218762 284936 257122 49526 -270451 -305616 145546
11185a30789k77769J81817i631A43513b56292J08539p5259B96692a78893J3798
11175a65095d5160q5068B42238F3003Q8527F4268a45819L305j70243a00807q4715
11164a85522c6036B37158E7301a78232A9911J0258J07371C3914a05133a3346B41330
11152a25576o0650p7149R7355L7009A07843a62401P2346j44574R7506j42243C02343
11140a23092B98134o1029a543n8487B41926m5140D8702a81644e8258E123J2094
11129A7217O5782b16092D6636J41455J18303D4157e9044A77798C6707a42689A96866
11117A51066a02538j04018A54381p7042c1516B87782q7253a70623g532j03318
11107a10850A36488J4650J11322k9266a06960B64499I9074J84327E2936q973K28249
$$ plain form
11185 -130789 -408558 -226741 -9631 143513 -256292 -147753 -223012 296692 -178893 -165095
11175 -165095 -45160 -130228 242238 63003 151530 64268 -145819 -142514 -312757 -100807 -185522
11164 -185522 -36036 237158 57301 -178232 19911 30169 137540 33914 -105133 -13346 241330
11152 -125576 -186226 -263375 -166020 -129011 107843 -162401 -90055 -234629 -137123 -279366 302343
11140 -123092 298134 237105 -1543 -60030 241926 196786 48702 -181644 -58258 5123 17217
11129 17217 82999 -216092 46636 188091 306394 44157 -59044 177798 36707 -142689 196866
11117 151066 -102538 -206556 154381 77339 -31516 287782 200529 -170623 -7532 -110850
11107 -110850 136488 151138 262460 233194 -106960 264499 99074 283401 52936 43963 272212
11096B72212j01426d4449B372J75653F6926a32708D922L67072j54828E5210J86541
11085B41751j06786J15063k5129J74728A14870Q0293L4680N5362H8017L61373
11075D49390A61392n9058K33742E2384J26252K55547A04225J75311Q6498R5630
11065D61664q0754M11764C78251J15964B32344N21694k72120R5178l1689M08289
11055I53696D74817J5099J30925j10006J43733n9434J08884m468j59629K59453
11045G99374k31054O8695m2738N9416L08235l32558P9189k22399J42692l6920
11035E91932J74380k7458k34665K15422K1740P1542m5751j22517r613P9808j69612
11024E45208K60186J9610C20479K47525j33796K15876K59150k9665B24939K68333
$$ plain form
11096 272212 170786 -44449 2372 178025 66926 -132708 4922 371994 217166 55210 241751
11085 241751 134965 250028 224899 399627 114870 195163 229843 285205 88017 449390
11075 449390 161392 102334 336076 52384 178636 434183 104225 279536 366034 461664
11065 461664 380910 792674 378251 494215 232344 754038 481918 577096 545407 953696
11055 953696 474817 489916 620841 510835 654568 595134 704018 699550 539921 799374
11045 799374 568320 637015 594277 653693 961928 629370 708559 486160 628852 591932
11035 591932 766312 738854 504189 719611 741351 812893 767142 644625 635012 714820 545208
11024 545208 805394 825004 320479 568004 434208 650084 909234 879569 224939 493272
11014D93272L34694B44348L84281L7779k33930L18655n421k42877p2125K16488
11004F47198L08959l59014j5138J79853M4838j71162J11934J2373L522j61576
10994F01787K03819O9129m5365j4707j32052J27615j85860P9225J92329J11767
10984A007687j39979L85370j71458K35907J2360K58334R9323P6749K89848R43140
10974B997281j26431p2665nM6938r2083J73381p67875j76633k04318n66907L703
10963A214386L9411J79795n1271l16724J12160M6327m56359K66696p3976l49339
10953F11106K28631k31847k1707Q26j31835j09566E1100J14690J36833E6402g904
10941G0181a06776B4866K9992P4807c3305H4703M9749a44612C85911e8819k1124
$$ plain form
11014 493272 827966 244348 628629 666408 432478 751133 745712 502835 430710 647198
11004 647198 956157 597143 582005 761858 806696 635534 747468 759841 763363 601787
10994 601787 805606 874735 829370 814663 682611 810226 624366 703591 895920 1007687
10984 1007687 867708 1253078 1081620 1317527 1329887 1588221 1687544 1764293 2054141 2997281
10974 2997281 2870850 2798185 2798180 2845118 2753035 2926416 2158541 1981908 1777590 1210683 1214386
10963 1214386 1253797 1433592 1382321 1065597 1177757 1224084 767725 1034421 960445 611106
10953 611106 839737 607890 586183 587009 455174 345608 51100 165790 302623 56402 -7904
10941 70181 -106776 24866 54858 129665 -33305 84703 134452 -144612 385911 -58819 -79943
10930g9943B34145A05953f5551A95448h441A4997c54855D4918i1993A41059K70431
10919D11490A06864a15972b4948L369K234j51386j23425G2841J16001J4585O3174
10908B66601A17112K84199I285R5473a81477p408L7394K9073D1950a38624k6723
10897a65347B87870a26195j59819C1697c46877d4718j84703Q7685q7249F1881
10886b33454C4321J35383N5235b50429Q8991j03176Q8805Q2664L0289A81219a24678
10874C2575a49061B48354d2711l49316c4937G1060C4196a50061A16729g9679B20008
10862C23632f5544I020a39839E3718b1078j50502k45117f8027H5631e0099A50322
10850a5382A87136d23727b03923I3436R2636j1065J42217c32022J45095E4487
$$ plain form
10930 -79943 234145 105953 -65551 195448 -8441 14997 -354855 44918 -91993 141059 411490
10919 411490 106864 -115972 -24948 -21579 -19345 -170731 -294156 72841 188842 203427 266601
10908 266601 117112 401311 9285 104758 -181477 -188885 -151491 -122418 41950 -138624 -165347
10897 -165347 287870 -126195 -286014 31697 -346877 -44718 -229421 -141736 -228985 61881
10886 -233454 34321 169704 224939 -250429 -161438 -264614 -175809 -93145 -62856 181219 -124678
10874 32575 -149061 248354 -42711 -392027 -34937 71060 34196 -150061 116729 -79679 220008
10862 323632 -65544 9020 -139839 53718 -21078 -171580 -416697 -68027 85631 -50099 150322
10850 -15382 187136 -423727 -203923 93436 186072 175007 317224 -332022 -186927 54487
10839B9191a27564E6568e2538r1658A48566n6511O29j6446c2688F6684J18747
10828A85431D0264N3365a84710A70157n9887a99956D2674J22100F1113b76281
10817b11497a01290A36247i1588m5968j93237F400b08628J9968A15927i110j37205
10806a46315A48975a17914E5376J93611b27520B05861a8181A07717b78321I8154
10795B43992C9282N288b0707A64031j6984b908k13960J07360C3769R3134b56985
10783C0935b91211a26625l7062E43136A47788b43429m1458d598j2851k86866Q4545
10772b19770F5932J38993b64218C669P6541a73695A31501c216m12541a3788p8915
10761i2703g688k6842A42064f1889p6613d2100k550A92510b71591i1455j29618
$$ plain form
10839 29191 -127564 56568 -52538 -144196 148566 92055 92684 76238 -32688 66684 185431
10828 185431 40264 93629 -184710 170157 110270 -199956 42674 164774 61113 -276281
10817 -211497 -101290 136247 -91588 -137556 -330793 6400 -208628 -188660 115927 -9110 -146315
10806 -146315 148975 -117914 55376 248987 -227520 205861 -18181 107717 -278321 98154
10795 243992 39282 44570 -20707 164031 147047 -2908 -216868 -109508 33769 126903 -256985
10783 30935 -291211 -126625 -163687 543136 147788 -243429 -284887 -4598 -17449 -304315 -219770
10772 -219770 65932 204925 -264218 3669 80210 -173695 131501 -3216 -415757 -13788 -92703
10761 -92703 -7688 -34530 142064 -61889 -138502 -42100 -44650 192510 -271591 -91455 -221073
10750b21073d350j96937A45473N4670e9204A20482g2354j72443A34128N9173c9619
10738d1305j73452a03724E3433b96170A77095a31916i142j71353A70270a61429
10727A63040H1269J68945A9642a48492j42324b0765C22916j48865e8917k08916
10717b67833D5457e00543e6272I8987a56308G1138b9071j71208P3142D81079A00433
10705h2107a4379H0712a62307e8456b1022j57820O4300N2224E7849J26247q1472
10694A02624d95219a98209c7700B53538E8457L6402J1695f6636E7650K1437J58011
10683B37098E1882K70035A48861c20897A52873c3499B13498h8372F3119h9678
10672e3345p8524d3273j45693A8959a37486L3986l02701b4700k8588l43471L5630
$$ plain form
10750 -221073 -4350 -201287 145473 200143 -59204 120482 -72354 -244797 134128 193301 -39619
10738 -41305 -214757 -103724 53433 -296170 177095 -131916 -9142 -180495 170270 -161429
10727 163040 81269 250214 19642 -148492 -290816 -20765 322916 174051 -58917 -267833
10717 -267833 45457 -500543 -56272 98987 -156308 71138 -29071 -200279 -127137 481079 100433
10705 -82107 -14379 80712 -162307 -58456 -21022 -178842 -114542 -62318 57849 184096 102624
10694 102624 -495219 -198209 -37700 253538 58457 94859 106554 -66636 57650 79087 237098
10683 237098 51882 321917 148861 -320897 152873 -33499 213498 -88372 63119 -89678
10672 -53345 -131869 -43273 -188966 18959 -137486 -103500 -406201 -24700 -53288 -396759 -361129
10661c61129J67511g0994L621A02978d7195k30319i5595G7256K07819A09951a63143
10649A6587g0175k58476J33302a4406p8196j58470R5817N0656D7285J755K00709
10638B49749a8450k2482B51459C8111J94955D8778L5887a19820j0018J3338j89647
10627c06147H6810l7096c5818l8710k73684a2953k88776b942n1738A11517D8293
10615a16345M0736l89033C07034b20604N9280O7929M3506R433A96296C8626J35707
10604A74333F1055a72410B6154a06870j3835e0149l22307R9952H4835O5152F9782
10592d2757j62448k22749A68603d3351B24123b91048I0725m4322a69633A30123
10581A8255a14183n0637G8094a2164o8866L7732k78197j41366A96361a18421A00538
$$ plain form
10661 -361129 -193618 -70994 -67373 102978 -47195 -277514 -95595 77256 285075 109951 -163143
10649 16587 -70175 -328651 -195349 -14406 -92602 -251072 -155255 -104599 47285 49040 249749
10638 249749 -18450 -40932 251459 38111 233066 48778 84665 -119820 -129838 -116500 -306147
10627 -306147 86810 49714 -35818 -74528 -348212 -12953 -301729 -2942 -54680 111517 48293
10615 -116345 -75609 -464642 307034 -220604 -161324 -93395 -49889 -40456 196296 38626 174333
10604 174333 61055 -172410 26154 -106870 -120705 -50149 -372456 -272504 84835 149987 69782
10592 -42757 -205205 -427954 168603 -43351 224123 -291048 90725 46403 -169633 130123
10581 18255 -114183 -164820 78094 -12164 -81030 -43298 -321495 -462861 196361 -118421 100538
10569a08835A5324R4984D3899c1131A05634a50566A98654f2009B76481a04289
10558a0301k2666A79706A7385P3801b64849b5607j24033A46338J63506C1533J52594
10547A84127a40494k72878j89276A48009A0109a61682B55438d76045A3373b05207
10536B63563a08957A88074C8059N2168b61585C8949a61736J49A77774D4486b29985
10524A89766L528h0747j48359c6359a5654C71646C9284M4886B5166a74999H3413
10512b12965C6518c25292a57443i563j11317B42206G4608a2973o6645A17652K04041
10501C21693a00898M5463c079j1300A07609f7870C27768a15835j1148A74886k6196
10490A48690I471J21804F2733N700K7528J19212J42150M32654c17005A26997f8467
$$ plain form
10569 -108835 15324 110308 43899 -31131 105634 -150566 198654 -62009 276481 -104289
10558 -10301 -32967 179706 17385 91186 -264849 -25607 -149640 146338 309844 31533 184127
10547 184127 -140494 -413372 -602648 148009 10109 -161682 255438 -476045 13373 -205207
10536 263563 -108957 188074 38059 90227 -261585 38949 -161736 -161587 177774 44486 -229985
10524 189766 193294 -80747 -229106 -36359 -15654 371646 39284 84170 25166 -174999 83413
10512 -212965 36518 -325292 -157443 -9563 -120880 242206 74608 -12973 -79618 117652 321693
10501 321693 -100898 -55435 -3079 -14379 107609 -67870 327768 -115835 -126983 174886 148690
10490 148690 9471 131275 62733 68433 95961 215173 357323 789977 -317005 126997 -68467
10478B62528a03352j2053A84598d3875A1441J02897K08419j47705G1458O6254
10468A37712a07584k15839f5419A37533g0380j48682O8521B33872f7363C27053
10457A15185a66694A81717g9303r5988l5530C5840J63458a51396O9473k58257
10447c40180g1058k18819A35694b25530F5167a72728A51055C1645O1423a50552
10436G8973b06764P8702A18493k2291g378n8125I404J30625b2574A20903m7508
10425G3395R3322J62884a54672g884A44677c5930H7945J4134K90611b82149i4985
10413e5800E3051J98843A01998a18230L5785K9679K1089j32431a671m8082j31614
10402a81367a2660k51259R446j16055B13264a91662E3316a12415H9178a84796
$$ plain form
10478 262528 -103352 -115405 184598 -43875 11441 114338 322757 175052 71458 137712
10468 137712 -107584 -323423 -65419 137533 -70380 -219062 -150541 233872 -67363 327053
10457 115185 -166694 181717 -79303 -175291 -210821 35840 199298 -151396 -81923 -340180
10447 -340180 -71058 -289877 135694 -225530 65167 -172728 151055 31645 93068 -150552
10436 78973 -206764 -128062 118493 96202 -7378 -65503 9404 140029 -22574 120903 73395
10425 73395 166717 329601 -154672 -7884 144677 -35930 87945 102079 392690 -282149 -94985
10413 -55800 53051 251894 101998 -118230 -82445 -52766 -31677 -164108 -1671 -49753 -181367
10402 -181367 -12660 -263919 -254473 -370528 213264 -191662 53316 -112415 89178 -184796
10391A57864L853N9274e4874j67708D33210A40669K28108a88395A15625A0512
10380C03178j42818P5890b1185D01217j41447r1320J46068G1664K37046L070o1992
10369B49788J81905K37404r8305m7727A28740K36387A69978J82338j52017J01533
10359C01832a8630j10319B31413f8355C6437N1361J52583L50227O4898r7189J54731
10348G13048H4795K06814J45862j52260O0566A19470e6725j1336L3376B56966
10337E3494J41613M2852a50568F5394O7292b09915C86629b49626A75036J9441
10327A94477n051g0839p2594E7481e4541L457A80851n1704K35892i450j39148
10316a48598K8930A94967c7461C04238d2434A67934C2994J47905b8809j52591
$$ plain form
10391 157864 161717 220991 -54874 -222582 433210 140669 368777 -188395 115625 10512
10380 303178 160360 236250 -21185 401217 259770 168450 314518 71664 308710 311780 249788
10369 249788 431693 669097 570792 523065 128740 365127 169978 352316 200299 301832
10359 301832 -18630 -128949 231413 -68355 36437 87798 240381 590608 655506 558317 713048
10348 713048 84795 291609 437471 285211 345777 119470 -56725 -68061 -34685 256966
10337 53494 195107 237959 -150568 65394 132686 -209915 386629 -249626 175036 194477
10327 194477 189426 -70839 -143433 57481 -54541 -51084 180851 129147 365039 -9450 -148598
10316 -148598 -119668 194967 -37461 304238 -42434 167934 32994 180899 -28809 -181400
10306a81400G5944b32903A28663b31547J07882E2440e5497p543e188E9367A7310
10294G1103j2590P8273K6027P22d4970j91846P8852B8079a51150I4568c54287
10282b19539L2435a1040l94477a21144j07794h0055k9019k4381C43473e060A38650
10270b45808A22529a23328q8215a5370A85640B6571K10747n8786a22183E30342
10259B11171b3230C72187d13352J51693D6040a31174j35101J24020K7054a0453
10248C4669a79550A58375e5216m8843i216k5254F4104K96016C9619b33819B34115
10236B20273a60378B95167A2287Q3607b23487J11630j17356j2019N4702L8011
10226a48519A8225b18816D1436a5498A7733K06494f9524k0146B2444M6162Q9241
$$ plain form
10306 -181400 75944 -232903 128663 -231547 -123665 52440 -55497 -63040 -5188 59367 17310
10294 71103 58513 136786 162813 163535 -44970 -236816 -157964 28079 -151150 94568 -354287
10282 -219539 -187104 -11040 -405517 -121144 -228938 -80055 -109074 -133455 343473 -5060 138650
10270 -245808 122529 -123328 -211543 -15370 185640 26571 237318 178532 -122183 530342
10259 211171 -23230 372187 -413352 -261659 46040 -131174 -266275 -142255 -115201 -10453
10248 34669 -179550 158375 -55216 -104059 -9216 -34470 64104 360120 39619 -233819 234115
10236 220273 -160378 295167 12287 95894 -223487 -111857 -229213 -241232 -186530 -148519
10226 -148519 18225 -218816 41436 -15498 17733 224227 -69524 -89670 22444 68606 157847
10215A57847o767B71K502a97145B2154J6408R5578e4497A29192a67403p5396C76074
10202a7241k58819e1050k13369b6797j77872a4228k8806A40834N7262d47000A05952
10190B4974M7320a40131g478m1642B07903a00571a9242I8799i4984J4799K7957
10179e2228q5649I9642K12041e9794A76792a8202j12737A44059L16067D1520a30074
10167g0893A89904J45899I9264a21340j10084a0521m07353B18872A02334a54552
10156a0124j76285A04108d2703J0164l46631a19038C22451f4135a6406k09853
10146b26259E5648a56016A56072F082M7304d3681A20357J14294k1158F3663A9392
10134i2662C6215j5101a29723A73144q2458a12151j90003N5602i351A61114a33643
$$ plain form
10215 157847 151080 271 2773 -197145 22154 38562 134140 -54497 129192 -167403 -242799 376074
10202 -17241 -276060 -51050 -264419 -26797 -204669 -14228 -43034 140834 198096 -447000 105952
10190 24974 72294 -140131 -7478 -49120 207903 -100571 -19242 98799 -94984 -80185 -52228
10179 -52228 -137877 99642 311683 -59794 176792 -18202 -130939 144059 460126 41520 -130074
10167 -70893 189904 335803 99264 -121340 -231424 -10521 -417874 218872 102334 -154552
10156 -10124 -186409 104108 -42703 -32539 -379170 -119038 322451 -64135 -16406 -226259
10146 -226259 55648 -156016 156072 6082 53386 -43681 120357 234651 213493 63663 19392
10134 -92662 36215 21114 -129723 173144 90686 -112151 -302154 -246552 -9351 161114 -133643
10122c4744C3943c31729H6167a74365k17619C38412a55303D4067d6684A36176
10111A81119d6149B61499a10452p0732k29398J88149q3038J1779c3255R274j01689
10100a25670b8426k7115r0125H8812b40986B71316a80068j07443R9144a6431I328
10088A41717d54969J78928k7554A32225a47434k9868G3513c06582d8611n6301
10078a04912D5927c6751m43297g2755j69822P4797C07190b21586R8665n058D0677
10066a72075j17573A19363e1121J3331A04931d29849B01749a68106A87723c8645
10055e4132C50050b20705A30312Q027L7370b71630j40409A1605i8890B39076d3316
10043C6996h2595C61004E4356a451m4312C0946O2321B5451h9194M2046B09186
$$ plain form
10122 -34744 33943 -331729 86167 -174365 -391984 338412 -155303 44067 -46684 136176
10111 181119 -46149 261499 -110452 -181184 -410582 -222433 -305471 -293692 -33255 -23981 -125670
10100 -125670 -28426 -55541 -145666 88812 -240986 271316 -180068 -287511 -188367 -16431 9328
10088 141717 -454969 -276041 -303595 132225 -147434 -177302 73513 -306582 -48611 -104912
10078 -104912 45927 -36751 -480048 -72755 -242577 -167780 307190 -221586 -122921 -127979 40677
10066 -172075 -289648 119363 -51121 -37790 104931 -429849 201749 -168106 187723 -38645
10055 -54132 350050 -220705 130312 138339 175709 -271630 -412039 11605 -98890 239076 -43316
10043 36996 -82595 361004 54356 -1451 -45763 30946 93267 25451 -89194 -47148 209186
10031A07220b86871e7043F0117n959a86427P4516d3691B47660b35951m575A10347
10019a4081B9908a32088b8489k7249j9751n7565k3231k9801m965d131j37619j43981
10007b85731a31897a2448j71359L8846N5244E5731a46244I985J34456e1021g017
9995A34605c4256j93459Q64j47658a04017B50409I616f2439J4591k6170F5495
9983F1509a13672L3390A31204b53886c4474j23277A69808a78077j30676a37104
9972E0538r476b24854f0258a3743A5646g6208D5182b78348J4490g0174C1886c55943
9959B4168i7148o0967B0694a23404C18314A9907b76256J07888M9015J4349k22391
9948c27395A9695d20345J39910p1851g5699k53852a50885D8317K11214a66969
$$ plain form
10031 107220 -286871 -57043 60117 54158 -186427 -111911 -43691 247660 -235951 -240526 110347
10019 -14081 29908 -132088 -28489 -55738 -75489 -133054 -156285 -186086 -191051 -4131 -141750 -285731
10007 -285731 -131897 -12448 -183807 -144961 -89717 55731 -146244 9985 144441 -51021 -7017
9995 134605 -34256 -227715 -226851 -374509 -104017 250409 9616 -62439 -47848 -74018 65495
9983 61509 -113672 -80282 131204 -253886 -34474 -157751 169808 -178077 -308753 -137104
9972 50538 41062 -224854 -60258 -13743 15646 -76208 45182 -278348 -263858 -70174 31886 -355943
9959 24168 -97148 -158115 20694 -123404 318314 19907 -276256 -168368 -119353 -105004 -327395
9948 -327395 19695 -420345 -280435 -352286 -75699 -329551 -150885 48317 259531 -166969
9937E9997a26639A23633m1333K5028M1630f2945j55431a2812n5354k5006G6686
9925A40725D5765b07623A63637J360b55680D13669E3331e7077E3623f0101l08555
9914c68656A21417J6249a14337a6701l33238E3362L0545b45221h7449A65842N7018
9903B22860a7m30457i3311k4540n9187D0905a26368B09454I7227d4513j82830
9892b27343o0965B79131a5597A5224L11436A18740a20849b7774D6557j9589f296
9880d3350j16092P9117A70305a52567k10930A84389c49198N1652B3613Q7071a89339
9868c7898G8293J85371a36099l2298f7555a1154k9638F0909a67879B2924K72614
9857B95538o5531h1191C30253E9757a69248m9490k0901G1974b7231k9057p1190
$$ plain form
9937 59997 -126639 123633 82300 107328 148958 -62945 -218376 -12812 -68166 -93172 76686
9925 140725 45765 -207623 163637 164997 -255680 413669 53331 -57077 53623 -60101 -368656
9914 -368656 121417 137666 -114337 -16701 -349939 53362 83907 -245221 -87449 165842 222860
9903 222860 -17 -430474 -93311 -117851 -177038 40905 -126368 209454 97227 -44513 -227343
9892 -227343 -288308 279131 -15597 15224 326660 118740 -120849 -27774 46557 26968 -6296
9880 -43350 -159442 -80325 170305 -152567 -363497 184389 -349198 -297546 23613 110684 -189339
9868 -37898 78293 263664 -136099 -168397 -67555 -11154 -40792 60909 -167879 22924 295538
9857 295538 230007 -81191 330253 59757 -169248 -218738 -239639 71974 -27231 -56288 -127478
9846a27478a3343A02721j0582b9115m4826j0801A23631b15388A40097F1974R6074
9835A58048a55918C23598a22922m8166D9308a31154k60032B79291a76491A29577
9824c97603R9127J43816A58669b01484n3616C9237D085K92562c07916H2487a21247
9812E01b42235p9517j06445f1391C08500D668J13117a35072k69448c3396r5307
9801a28703l4256F193a7439j5844k27378i1086A10257a26966l3743B50529a6153
9789a57910d8609B36447g8695C8895a98724Q8383D7973a84553p6137J19387J3749
9778a27554j04615i6475j2868A06670L565k9724c72322a30151A75784b9854k22753
9767b52607k18571a72815b327l8798o4974d7036o0565M4798A60489B6972e01034
$$ plain form
9846 -127478 -13343 102721 92139 -29115 -73941 -84742 123631 -215388 140097 61974 158048
9835 158048 -155918 323598 -122922 -171088 49308 -131154 -391186 279291 -176491 129577
9824 -397603 -298476 -154660 158669 -201484 -255100 39237 4085 296647 -307916 82487 -121247
9812 501 -242235 -321752 -428197 -61391 308500 4668 117785 -135072 -404520 -33396 -128703
9801 -128703 -162959 6193 -17439 -33283 -260661 -91086 110257 -126966 -160709 250529 -16153
9789 -157910 -48609 236447 -78695 38895 -198724 -110341 47973 -184553 -260690 -141303 -127554
9778 -127554 -232169 -96475 -109343 106670 110235 80511 -372322 -130151 175784 -29854 -252607
9767 -252607 -471178 -172815 -2327 -41125 -106099 -47036 -107601 -62803 160489 26972 -501034
9755a02281C31171r2757a93769f1247j29858B65188D0622b65451G11J77442c8469
9743c57305A45361h470o0104I5752k8784a07813l32724a72175K4322g3148D27693
9731b0892k7345j00896C3541J25603a57187M4968K7448j62277d9218o0414A01107
9719a77206j24025B9464A4624J16010c19371a33716E6840a1642A0160J6354O4528
9708I1042g9445o2320B05969i7841q707E9868K17970a50089k01397A3401N6419
9697F9820d63350e1472k28310Q4974A07687e8077A27828c25274J08995j27680
9687c43959B15952a37299n5999Q4777j85166P9034F5389J28566g3455P898B07215
9675b98999a08764A15258a56042A34912b88749C10617G667J6504L3282K29604
$$ plain form
9755 -102281 331171 238414 -193769 -61247 -191105 265188 40622 -265451 711 178153 -38469
9743 -357305 145361 -8470 -68574 95752 66968 -107813 -440537 -172175 -147853 -73148 427693
9731 -20892 -48237 -149133 33541 159144 -157187 -112219 -84771 -247048 -49218 -109632 101107
9719 -177206 -301231 29464 14624 130634 -319371 -133716 56840 -11642 10160 26514 91042
9708 91042 -79445 -141765 205969 -97841 -106548 59868 277838 -150089 -351486 13401 69820
9697 69820 -463350 -51472 -279782 -194808 107687 -58077 127828 -325274 -216279 -343959
9687 -343959 215952 -137299 -193298 -108521 -293687 -214653 65389 193955 -73455 -65557 207215
9675 -298999 -108764 115258 -156042 134912 -288749 310617 7667 24171 57453 287057
9665B87057a8360r4761A03793a33601j4421D4207a34289A20329h9434E4860g3001
9653a43868M1263j34453k05305A28239b06999A42195C6638a82602C1270d08015
9642a51576j0880J7387b896C5140K34940a69588B83919G1301c32450O4726C8603
9630f1939L0240j96637F7947A3945b07130A97295p4973a24670L4062B4540N9331
9619H3871D734J23419a00883k42125A07255d1653q1773o4274H9249J70962o7064
9608A93147b36581a05997j42269b8079j01320b4617l8082H8170a36182N656B8359
9596B8860B060J05922a47002k35617I2791L69274D5547j1985d59371E629a56159
9584g3458A09769b42858B5487c4171j06698j88996h7846H3295J09829L485l5228
$$ plain form
9665 287057 -18360 -113121 103793 -133601 -148022 44207 -134289 120329 -89434 54860 -73001
9653 -143868 -102605 -237058 -442363 128239 -206999 142195 36638 -182602 31270 -408015
9642 -151576 -162456 -145069 -2896 35140 270080 -169588 283919 71301 -332450 -267724 38603
9630 -61939 -31699 -228336 67947 13945 -207130 197295 122322 -124670 -90608 24540 83871
9619 83871 4734 128153 -100883 -343008 107255 -41653 -123426 -187700 89249 260211 193147
9608 193147 -236581 -105997 -248266 -28079 -129399 -24617 -62699 88170 -136182 -130526 28359
9596 28860 2060 107982 -147002 -382619 92791 462065 45547 33562 -459371 5629 -156159
9584 -73458 109769 -242858 25487 -34171 -140869 -329865 -87846 83295 193124 196609 161381
9573A61381c31138K0279l5108I6487I774N1513K20645i6894D4666P1029h7133
9561D7112i835A58398e0875o82a7180A3659a5450C7571f7017d664j12920j94234
9549c11818A5283b92434B0804b21518G361J46674C8003c26764k0997B9387J05008
9538A34395i4325m985A80829b51695Q7019A16682j0048d91771f0482l587j39867
9527b03936n2495a26628B3320M4885k9219b29110N802e7010A2033J43245a75372
9515C34608c04792H700e3926j59733j02082A28279f8780B7863K53925C0093b31616
9503A08939c2825k99431O7103J05388k6434g0273j19457e9533A53649d28933f8890
9491a47243A35817d57489B5802f976q9956k74632J48976E3030c55068B35351J91028
$$ plain form
9573 161381 -331138 -310859 -345967 96487 9774 61287 281932 -96894 44666 115695 -87133
9561 47112 -9835 158398 -50875 -51557 -17180 13659 -15450 37571 -67017 -4664 -117584 -311818
9549 -311818 15283 -292434 20804 -221518 7361 154035 38003 -326764 -347761 29387 134395
9538 134395 -94325 -99310 180829 -251695 -164676 116682 106634 -491771 -60482 -64069 -203936
9527 -203936 -256431 -126628 23320 68205 38986 -229110 -223308 -57010 12033 155278 -175372
9515 334608 -304792 8700 -53926 -213659 -315741 128279 -68780 27863 281788 30093 -231616
9503 108939 -32825 -332256 -265153 -159765 -186199 -70273 -189730 -59533 153649 -428933 -68890
9491 -147243 135817 -457489 25802 -6976 -96932 -371564 -222588 53030 -355068 235351 426379
9480D26379a63774j49479E0158b40559E6287j4477a36416k59546J39810A29616
9469A59152G7129g466B30565l1730n2805c6635o3518m1268j18134J22680A29082
9457a26969j8786i748j88819j48489a17493j0653m6841C00634e2150A57528B7988
9445a78082d7916j6998B38802F6712A000R4812o404R805a14568B25272K00868
9434D26140F614e0496j62846J00665N2024A25680A0506a56646O53A85905C630
9422i59A15875J05691h7315c4300k19685R2904C7709c2208A3768f3358j30536
9411a93894o3431J23930n8399A24211B0631K13680d3375B16714c81075B21589
9400D17382j12331b15718k32692h8144E9922J10985F0141b48554j02099H6683
$$ plain form
9480 426379 -163774 -313253 50158 -240559 56287 41810 -136416 -395962 -256152 129616
9469 159152 77129 -7466 230565 198835 146030 -36635 -100153 -141421 -259555 -136875 129082
9457 -126969 -145755 -9748 -198567 -347056 -117493 -128146 -174987 300634 -52150 157528 27988
9445 -178082 -47916 -64914 238802 66712 1000 95812 89408 99213 -114568 225272 426140
9434 426140 6614 -50496 -213342 -112677 -60653 125680 10506 -156646 -155993 185905 3630
9422 -959 115875 221566 -87315 -34300 -253985 -161081 37709 -32208 13768 -63358 -193894
9411 -193894 -257325 -133395 -191794 124211 20631 234311 -43375 216714 -381075 221589
9400 417382 305051 -215718 -448410 -88144 59922 170907 60141 -248554 -350653 86683
9389A54385B7299f3985a3691m1995j34411m1307A03377F205d92294g6277k9111
9378a05388b7277C707J98415a59752e0566Q402A73325a25055n0959Q3597k39579
9367c31996J53192A3872b55170J01320k58119A55275N1029o5871a19176j61718
9357b80894c5865p2522D4397J64494N1568a28314C202M3432a04543A43694b23317
9345B30106b15298N1214e5867l513B87157H393i108A11189k8943b77726A63958
9333C5822a6075k9899a2308A68250e5090B06902a71194P6188k7418F7634b66726
9321b42795b816D1908i6093A93774e7431A76873r038c30584H6801a54355j3449
9310a67804Q0504j12739P8662c681k46149j60769E2570c416j14463j50887J09815
$$ plain form
9389 154385 27299 -63985 -13691 -55686 -190097 -231404 103377 6205 -492294 -76277 -105388
9378 -105388 -27277 3707 202122 -159752 -50566 -42164 173325 -125055 -176014 -92417 -331996
9367 -331996 -178804 13872 -255170 -153850 -411969 155275 206304 140433 -119176 -280894
9357 -280894 -35865 -108387 44397 208891 260459 -128314 3202 46634 -104543 143694 -223317
9345 230106 -215298 -164084 -55867 -59380 287157 8393 -9108 111189 82246 -277726 163958
9333 35822 -16075 -45974 -12308 168250 -55090 206902 -171194 -95006 -122424 67634 -266726
9321 -242795 -2816 41908 -96093 193774 -57431 176873 167835 -330584 86801 -154355 -167804
9310 -167804 -87300 -200039 -121377 -3681 -249830 -410599 52570 -3416 -117879 -268766 -158951
9299a58951O9727j34534f080n05072a29683j07096j1091A40975d9789o749C0302
9287c2927k78038R4454O2378D46837E5684d6781A17096a95872h3522J6530q1755
9276a48747H0303b6999I8149a48460A00397a44518B44670e6208m5593E9317J7180
9265G6497M8978d58058D6429N0292q446d3899a9133k3470a8254A57618a32706
9253c51772A3300e24653A54125b1472j25364c7818J6953j74385j6059c6479A41817
9241d9768A19340a82848j83904J05514a1451B94890a85957A10876b20324A37303
9230A21450d2296q7138n4691a4578B99484E9417j4766a13285B29719i0337L3647
9219e6690A26222a81255H7888C7615J58400b33742H5805b51702a00104j27705
$$ plain form
9299 -158951 -89224 -223758 -6080 -511152 -129683 -236779 -247870 140975 -49789 -56538 30302
9287 -32927 -310965 -216511 -154133 446837 55684 -46781 117096 -195872 -83522 -66992 -148747
9276 -148747 80303 -26999 98149 -148460 100397 -144518 244670 -56208 -101801 59317 76497
9265 76497 125475 -458058 46429 96721 88275 -43899 -19133 -42603 -18254 157618 -132706
9253 -351772 13300 -524653 154125 -21472 -146836 -37818 -20865 -195250 -211309 -36479 141817
9241 -49768 119340 -182848 -366752 -261238 -11451 294890 -185957 110876 -220324 137303
9230 121450 -42296 -129434 -184125 -14578 299484 59417 44651 -113285 229719 -90337 -56690
9219 -56690 126222 -181255 87888 37615 196015 -233742 85805 -251702 -100104 -227809
9209b27809h9866H9480F331a49581j75625J54080N0922k02744r247C9700K40752
9198B80452j16882a64468f2157A02899a05570A18158a16275C93854a15300D1426
9187A88737r0375J48951E0122K0182c84004Q1580J00225D362e1383j18422j07903
9176b77708R3646C54O0003a47949j57900a41526j33342C80352h3779B06396b96738
9164A8668c67737a21285H2570d0460A69027o7810b58358J24857D5699a59925b363
9152c80092a77569E412h909j9465j23102b2914D6322i322B35044Q2986b4554m7682
9140g2236c5950A79890a93176j09528A58902b4218n9447C35757H6836c2849k46277
9129b79126A46951K4426J67334d83569J69855a43115A82745A9610d1807j35657
$$ plain form
9209 -227809 -89866 89480 6331 -149581 -325206 -171126 -120204 -322948 -332195 39700 280452
9198 280452 163570 -164468 -62157 102899 -105570 118158 -116275 393854 -115300 41426
9187 188737 98362 247313 50122 70304 -384004 -302424 -202199 4362 -51383 -169805 -277708
9176 -277708 -184062 354 60357 -147949 -305849 -141526 -274868 380352 -83779 206396 -296738
9164 18668 -367737 -121285 82570 -40460 169027 101217 -258358 -133501 45699 -159925 -2363
9152 -380092 -177569 5412 -8909 -28374 -151476 -22914 46322 -9322 235044 318030 -24554 -72236
9140 -72236 -35950 179890 -193176 -302704 158902 -24218 -83665 335757 86836 -32849 -279126
9129 -279126 146951 171377 338711 -483569 -313714 -143115 182745 19610 -41807 -177464
9119a77464Q4000E9969J92459F3698k985a5451A23319J02421h0014D7485b23388
9107a48943m5315b1694j58217Q9349J297G7531i033k26144B29304d1689k36202
9096b77891m6205f391H3010a2315j38745G4185a8451l60464a08179b9510A73663
9084a97232a7410G8295J36093C5693f9180j65118R3322j13671D1324J91889f8234
9072a50212b0049F366c12041E3140C235d5400B55710A25061F1687I599g6369A0940
9059A97053e7646K1541m9102k39556A09413A1105a45508B3116J24047b18146m5103
9048b63249M3779A4470a06881A79615o3028d9149a9007k9306j32222A48096a00588
9036d4510B645a23391D1056d79776J35046n9293B6585a92396Q8858M9293A96874
$$ plain form
9119 -177464 -93464 59969 252428 63698 60713 -15451 123319 225740 -80014 47485 -223388
9107 -148943 -194258 -21694 -179911 -90562 -89265 77531 -9033 -235177 229304 -41689 -277891
9096 -277891 -324096 -6391 83010 -12315 -151060 74185 -18451 -378915 -108179 -29510 173663
9084 -197232 -17410 78295 214388 35693 -69180 -234298 -140976 -254647 41324 233213 -68234
9072 -150212 -20049 6366 -312041 53140 3235 -45400 255710 125061 61687 9599 -76369 10940
9059 197053 -57646 -36105 -85207 -324763 109413 11105 -145508 23116 147163 -218146 -263249
9048 -263249 -219470 14470 -106881 179615 116587 -49149 -19007 -48313 -180535 148096 -100588
9036 -44510 2645 -123391 41056 -479776 -344730 -404023 26585 -192396 -103538 -54245 196874
9024c33843i7940J816b1461C54207E9304a48125M8924M2523j80576l3102N0868
9013b19488e2661i234F991a0225k73798C00369A12861c6044C109J72714a86591
9001A81475a94265A99730b40543B19654a96208K2163O1607A4359b9659l2470o2746
8990a24875A88132e0036B93996A13031b13324g1445A05463g6639D3153c70980
8979B57354a99329B5383J82003c71533C56499c03942d921j12699D5556a94563
8968a45008A8042J40331a60043J7673j37585E5642a78341A8275J11229a15755
8957a32850j2061I9146c65912a54292k3740K3952N40H6887Q994P1741f0553C5954
8944B33743a94972R1670C58583b04704C7276b4871j6837G2274g9736B99857a03451
$$ plain form
9024 -333843 -97940 -96124 -21461 354207 59304 -148125 -99201 -56678 -237254 -270356 -219488
9013 -219488 -52661 -9234 6991 -10225 -284023 300369 112861 -36044 3109 175823 -186591
9001 181475 -194265 199730 -240543 219654 -196208 -174045 -112438 14359 -29659 -62129 -124875
8990 -124875 188132 -50036 293996 113031 -213324 -71445 105463 -76639 43153 -370980
8979 257354 -199329 25383 207386 -371533 356499 -303942 -4921 -117620 45556 -194563
8968 -145008 18042 158373 -160043 -142370 -279955 55642 -178341 18275 129504 -115755
8957 -132850 -144911 99146 -365912 -154292 -178032 -154080 -153540 86887 95881 167622 -60553 35954
8944 233743 -194972 -103302 358583 -204704 37276 -24871 -41708 72274 -79736 299857 -103451
8932b67836N8498b5411B8923a11201M8386j17409A86658r0254J046596K920292
8922D063292M953391B167666E80569B60963j341b7734F047a42134B10124a97895
8911C78421F6094f509A00186A6971R620K6046B3138P0812g235j54823k19958a56840
8898B6682a48720k10924B28790a10917r2420N3846I3206J5222K85994b05628A3201
8886d75850C5687a00659j44255O6452D9429f2273n3610N3350P6M254A62803e6546
8873A34641e9893I1674J02236C6009m728c63730B0000a53773J8275O4137D4058
$$ plain form
8932 -267836 -209338 -25411 28923 -111201 -62815 -180224 186658 96404 1143000 4063292
8922 4063292 9016683 2167666 580569 260963 259622 -27734 6047 -142134 210124 -197895
8911 378421 66094 -6509 100186 16971 26591 52637 23138 93950 -7235 -162058 -382016 -156840
8898 26682 -148720 -359644 228790 -110917 -203337 -149491 93206 108428 394422 -205628 13201
8886 -475850 35687 -100659 -244914 -178462 49429 -62273 -115883 -62533 -62457 -58203 162803 -56546
8873 134641 -59893 91674 193910 36009 31281 -363730 20000 -153773 -135498 -71361 44058
$$ [...]
##END NTUPLES=NMR SPECTRUM
##END=
