
##TITLE=AC1371_2395_7221463_d1VE8KR3dx
##JCAMPDX= 6.0         $$ Bruker NMR JCAMP-DX V2.0
##DATA TYPE= NMR SPECTRUM
##DATA CLASS= NTUPLES
##ORIGIN= BRUKER
##OWNER= Administrator
$$ 1.72 TOPSPIN		Version 2.1
$$ 2012-12-14 00:59:40.974 -0500  Administrator@X
$$ Compression mode = diff/dup
##.OBSERVE FREQUENCY= 400.02188249412
##.OBSERVE NUCLEUS= ^1H
##.ACQUISITION MODE= SIMULTANEOUS (DQD)
##.ACQUISITION SCHEME= undefined
##.AVERAGES= 64
##.DIGITISER RES= 22
##SPECTROMETER/DATA SYSTEM= spect
##.PULSE SEQUENCE= noesygpps1d.comp
##.SOLVENT NAME= COFFEE_meoh
##.SHIFT REFERENCE= INTERNAL, COFFEE_meoh, 1, 14.96042
##AUDIT TRAIL= $$ (NUMBER, WHEN, WHO, WHERE, PROCESS, VERSION, WHAT)
$$ ##TITLE= Audit trail, TOPSPIN		Version 2.1
$$ ##JCAMPDX= 5.01
$$ ##ORIGIN= Bruker BioSpin GmbH
$$ ##OWNER= Administrator
$$ $$ E:\/data/COFFEE/nmr/AC1371_2395_7221463_d1VE8KR3dx/22/pdata/1/auditp.txt
$$ ##AUDIT TRAIL=  $$ (NUMBER, WHEN, WHO, WHERE, PROCESS, VERSION, WHAT)
(   1,<2012-12-14 00:59:35.146 -0500>,<Administrator>,<X>,<go>,<TOPSPIN 2.1>,
      <created by zg
	started at 2012-12-14 00:48:04.959 -0500,
	POWCHK enabled, PULCHK disabled,
       configuration hash MD5:
       86 BA 57 50 F2 9D 5C 9B 26 00 A9 28 5F 66 2E 89
       data hash MD5: 64K
       48 1A E3 91 C3 B0 7B 41 6C F8 5F F9 16 75 AF B8>)
(   2,<2012-12-14 00:59:38.193 -0500>,<Administrator>,<X>,<proc1d>,<TOPSPIN 2.1>,
      <Start of raw data processing
       efp LB = 0.3 FT_mod = 6 PKNL = 1 PHC0 = 0 PHC1 = 0 SI = 128K 
       data hash MD5: 128K
       01 33 14 A8 54 50 21 1A 33 2A D9 47 AE 85 DE 6D>)
(   3,<2012-12-14 00:59:39.287 -0500>,<Administrator>,<X>,<proc1d>,<TOPSPIN 2.1>,
      <pk PHC0 = -76.41541 PHC1 = 0 
       data hash MD5: 128K
       58 D7 C5 3A 3C 28 63 34 CF 22 A1 7F 38 C5 D8 C7>)
(   4,<2012-12-14 00:59:39.959 -0500>,<Administrator>,<X>,<proc1d>,<TOPSPIN 2.1>,
      <abs ABSG = 1 
       data hash MD5: 128K
       4D D4 86 10 44 E9 CA 70 22 CD 83 87 F9 DC 99 E7>)
(   5,<2012-12-14 00:59:40.131 -0500>,<Administrator>,<X>,<proc1d>,<TOPSPIN 2.1>,
      <abs ABSG = 2 
       data hash MD5: 128K
       BB 4B 7F 89 99 F9 73 8D 96 D3 50 AA B5 FC F3 BF>)
(   6,<2012-12-14 00:59:40.287 -0500>,<Administrator>,<X>,<proc1d>,<TOPSPIN 2.1>,
      <abs ABSG = 3 
       data hash MD5: 128K
       86 A4 F4 C8 DF 28 73 19 B8 52 C2 77 54 97 3C 1E>)
(   7,<2012-12-14 00:59:40.474 -0500>,<Administrator>,<X>,<proc1d>,<TOPSPIN 2.1>,
      <abs ABSG = 4 
       data hash MD5: 128K
       0A 17 64 46 78 A2 1A 21 34 CE 86 97 E7 7D 25 5F>)
(   8,<2012-12-14 00:59:40.646 -0500>,<Administrator>,<X>,<proc1d>,<TOPSPIN 2.1>,
      <abs ABSG = 5 
       data hash MD5: 128K
       52 1E 08 AA 30 CC E4 CD 23 7B 12 0C 6C 58 23 BF>)
$$ ##END=
$$ 
$$ $$ hash MD5
$$ $$ D2 93 1E D6 73 7B 86 FF 11 01 30 5A EC 43 D7 64
##$RELAX= 
##$RELAX= 
##$RELAX= 
##$RELAX= 
##$RELAX= 
##$RELAX= 
##$RELAX= 
##$RELAX= 
##$RELAX= 
$$ Bruker specific parameters
$$ --------------------------
##$DU= <E:\>
##$EXPNO= 22
$$ [...]
##$TP07= 0
##$TPNAME0= <>
##$TPNAME1= <>
##$TPNAME2= <>
##$TPNAME3= <>
##$TPNAME4= <>
##$TPNAME5= <>
##$TPNAME6= <>
##$TPNAME7= <>
##$TPOAL= (0..7)
0.5 0.5 0.5 0.5 0.5 0.5 0.5 0.5
##$TPOFFS= (0..7)
0 0 0 0 0 0 0 0
##$TUNHIN= 0
##$TUNHOUT= 0
##$TUNXOUT= 0
##$USERA1= <user>
##$USERA2= <user>
##$USERA3= <user>
##$USERA4= <user>
##$USERA5= <user>
##$V9= 5
##$VALIST= <valist>
##$VCLIST= <CCCCCCCCCCCCCCC>
##$VD= 0
##$VDLIST= <DDDDDDDDDDDDDDD>
##$VPLIST= <PPPPPPPPPPPPPPP>
##$VTLIST= <TTTTTTTTTTTTTTT>
##$WBST= 1024
##$WBSW= 4
##$XGAIN= (0..3)
0 0 0 0
##$XL= 0
##$YL= 0
##$YMAX_a= 5697940
##$YMIN_a= -10856905
##$ZGOPTNS= <>
##$ZL1= 120
##$ZL2= 120
##$ZL3= 120
##$ZL4= 120
##$ABSF1= 14.96042
##$ABSF2= -5.597762
##$ABSG= 5
##$ABSL= 3
##$ALPHA= 0
##$AQORDER= 0
##$ASSFAC= 0
##$ASSFACI= 0
##$ASSFACX= 0
##$ASSWID= 0
##$AUNMP= <proc_prof1d_extract.lims>
##$AXLEFT= 0
##$AXNAME= <>
##$AXNUC= <1H>
##$AXRIGHT= 0
##$AXTYPE= 0
##$AXUNIT= <>
##$AZFE= 0.1
##$AZFW= 0.1
##$BCFW= 0
##$BC_mod= 0
##$BYTORDP= 0
##$COROFFS= 0
##$CY= 15
##$DATMOD= 1
##$DC= 0
##$DFILT= <>
##$DTYPP= 0
##$F1P= 0
##$F2P= 0
##$FCOR= 0.5
##$FTSIZE= 131072
##$FT_mod= 6
##$GAMMA= 0
##$GB= 0
##$INTBC= 1
##$INTSCL= 1
##$ISEN= 128
##$LB= 0.3
##$LEV0= 0
##$LPBIN= 0
##$MAXI= 10000
##$MC2= 0
##$MEAN= 0
##$ME_mod= 0
##$MI= 0
##$NCOEF= 0
##$NC_proc= -2
##$NLEV= 6
##$NOISF1= 0
##$NOISF2= 0
##$NSP= 0
##$NTH_PI= 0
##$NZP= 0
##$OFFSET= 14.96042
##$PC= 1
##$PHC0= -76.41541
##$PHC1= 0
##$PH_mod= 1
##$PKNL= yes
##$PPARMOD= 0
##$PPDIAG= 0
##$PPIPTYP= 0
##$PPMPNUM= 2147483647
##$PPRESOL= 1
##$PSCAL= 4
##$PSIGN= 0
##$PYNMP= <proc.py>
##$REVERSE= no
##$SF= 400.020009867604
##$SI= 131072
##$SIGF1= 0
##$SIGF2= 0
##$SINO= 400
##$SIOLD= 131072
##$SPECTYP= <>
##$SREGLST= <1H.CDCl3>
##$SSB= 0
##$STSI= 131072
##$STSR= 0
##$SW_p= 8223.68421052631
##$SYMM= 0
##$S_DEV= 0
##$TDeff= 65536
##$TDoff= 0
##$TI= <>
##$TILT= no
##$TM1= 0
##$TM2= 0
##$TOPLEV= 0
##$USERP1= <user>
##$USERP2= <user>
##$USERP3= <user>
##$USERP4= <user>
##$USERP5= <user>
##$WDW= 1
##$XDIM= 131072
##$YMAX_p= 340165419
##$YMIN_p= -13932
##$CURPLOT= <Network HP LaserJet P1505>
##$CURPRIN= <$Network HP LaserJet P1505>
##$DFORMAT= <normdp>
##$LAYOUT= <+/1D_H.xwp>
##$LFORMAT= <normlp>
##$PFORMAT= <normpl>
##$SURQMSG= 1
$$ End of Bruker specific parameters
$$ ---------------------------------
##NTUPLES= NMR SPECTRUM
##VAR_NAME=  FREQUENCY,     SPECTRUM/REAL,   SPECTRUM/IMAG
##SYMBOL=    X,             R,               I
##VAR_TYPE=  INDEPENDENT,   DEPENDENT,       DEPENDENT
##VAR_FORM=  AFFN,          ASDF,            ASDF
##VAR_DIM=   131072,        131072,          131072
##UNITS=     HZ,            ARBITRARY UNITS, ARBITRARY UNITS
##FACTOR=    0.0627417313425164, 1,          1
##FIRST=     8223.62146879497, -265,         -54345
##LAST=      0,             2074,            -54777
##MIN=       0,             -13932,          0
##MAX=       8223.62146879497, 340165419,    0
$$ Real data points
##PAGE= N=1
##DATA TABLE= (X++(R..R)), XYDATA
$$ [...]
64039B13152j02l06m62r86j846k820l697m231m198l629k827k024j160n4J234K361
$$ 213152 213050 212744 212282 211296 209450 206630 202933 198702 194504 190875 188048 186024 184864 184810 186044 188405
64023A88405L041L293L327L245K958K356J434L31o54j217j371j539k070k668k626
$$ 188405 191446 194739 198066 201311 204269 206625 208059 208390 207736 206519 205148 203609 201539 198871 196245
64008A96245j707m94K34K26k85j033j793k240k075j342m57Q0on10q04l42O51J340
$$ 196245 194538 194044 194278 194504 194219 193186 191393 189153 187078 185736 185279 185359 185353 184843 184039 183697 184348 185688
63990A85688J269R33J126J990L069L948M450M454M061L822M234N030N486N451
$$ 185688 186957 187890 189016 191006 194075 198023 202473 206927 210988 214810 219044 224074 229560 235011
63976B35011N512O008O434O157N277M438M042M058M462N397O751P911Q274Q016
$$ 235011 240523 246531 252965 259122 264399 268837 272879 276937 281399 286796 293547 301458 309732 317748
63962C17748Q128R323J1117J2398J3033J4284J7265K1538K5853K9894L4451M0013
$$ 317748 325876 335199 346316 358714 371747 386031 403296 424834 450687 480581 515032 555045
63950E55045M6181N2614N9679O7752P6497Q5262R3645J01268J07591J12499J16602
$$ 555045 601226 653840 713519 781271 857768 943030 1036675 1137943 1245534 1358033 1474635
63939A474635J20377J23221J23795J21044J14587J04582R1813P7544O2574M6581
$$ 1474635 1595012 1718233 1842028 1963072 2077659 2182241 2274054 2351598 2414172 2460753
63929B460753K8980J0155q772k7254m5535o3503q0144r4293j05356j13024j17041
$$ 2460753 2489733 2499888 2491116 2463862 2418327 2354824 2274680 2180387 2075031 1962007 1844966
63918A844966j17761j16417j14272j11609j07920j02803r6326q8805q0652p2398
$$ 1844966 1727205 1610788 1496516 1384907 1276987 1174184 1077858 989053 908401 836003
63908H36003o4457n6894m9613m2711l6392l0635k5312k0567j6760j3977j1894
$$ 836003 771546 714652 665039 622328 585936 555301 529989 509422 492662 478685 466791
63897D66791j0228r043q356p650o202m013k020j093q85r2J999M606O402P067P503
$$ 466791 456563 447520 439164 431514 425312 421299 419279 418186 417301 417209 419208 423814 430216 437283 444786
63882D44786Q647J0658J3264J6229J9129K1250K2299K2997K4434K6843K9388L1175
$$ 444786 453433 464091 477355 493584 512713 533963 556262 579259 603693 630536 659924 691099
63870F91099L2090L2631L3220L3751L3649L2323K9762K6635K3660K0901J7899
$$ 691099 723189 755820 789040 822791 856440 888763 918525 945160 968820 989721 1007620
63859A007620J4281R977N068j51m998q904j2128j5502j9346k3143k6397k9224
$$ 1007620 1021901 1031878 1036946 1036795 1031797 1022893 1010765 995263 975917 952774 926377 897153
63847H97153l1790l3800l4967l5520l5705l5222l3841l2156l0966l0073k8571
$$ 897153 865363 831563 796596 761076 725371 690149 656308 624152 593186 563113 534542
63836E34542k6371k4534k3778k3397k2253k0328j8654j7863j7367j6163j4053
$$ 534542 508171 483637 459859 436462 414209 393881 375227 357364 339997 323834 309781
63825C09781j1846j0386r651q937p862o820o285o024n390m191k817j582m63M51
$$ 309781 297935 287549 277898 268961 261099 254279 247994 241970 236580 232389 229572 227990 227527 227978
63811B27978Q05M59k26q78j583k645m135n805p187p642o728m789k947k177k511
$$ 227978 228783 229242 229016 228138 226555 223910 219775 213970 206783 199141 192413 187624 184677 182500 179989
63796A79989l214l495k940j680l92J29l09j217k085k734k960k482j572j096j433
$$ 179989 176775 173280 170340 168660 168268 168397 168088 166871 164786 162052 159092 156610 155038 153942 152509
63781A52509j791j320l63J15K0J13O20Q58M27j70l87m16n90o39j38O32R45O16
$$ 152509 150718 149398 149035 149150 149170 149283 149903 150761 151188 151018 150631 150215 149625 148986 148848 149480 150425 151041
63763A51041J91J49L34L03J4j95j27k3j28k20J13P67J098P86K96K09L66K19k07
$$ 151041 151232 151381 151715 152018 152032 151837 151710 151687 151559 151339 151452 152219 153317 154103 154399 154608 154974 155193 154986
63744A54986k33N41J616K138J807J117Q64J357K189K748K965L250L682L806L515
$$ 154986 154753 155294 156910 159048 160855 161972 162836 164193 166382 169130 172095 175345 179027 182833 186348
63729A86348L531M441N703O331O267O247O489O405N624M531L570K763K050J453
$$ 186348 189879 194320 200023 206354 212621 218868 225357 231762 237386 241917 245487 248250 250300 251753
63715B51753O54q62k983m848n826o070n958n635n305n192m954l925k303j226j165
$$ 251753 252407 251545 248562 243714 237888 231818 225860 220225 214920 209728 204774 200849 198546 197320 196155
63700A96155j110j12J239J743J358R75R43R16R30J457K452L254L565L711L861
$$ 196155 195045 194933 196172 197915 199273 200248 201191 202107 203037 204494 206946 210200 213765 217476 221337
63685B21337L828L721L928M213L690K152P20N81J544K372K344J964K176L271M626
$$ 221337 225165 228886 232814 237027 240717 242869 243589 244170 245714 248086 250430 252394 254570 257841 262467
63670B62467N340N085M232L226K091P43m83j152j451k129l591n428o892p508p206
$$ 262467 267807 272892 277124 280350 282441 283184 282701 281549 280098 277969 274378 268950 262058 254550 247344
63655B47344o319n486n186n153m741l849k987k279j112P44K320K464J411N75Q62
$$ 247344 241025 235539 230353 225200 220459 216610 213623 211344 210232 210976 213296 215760 217171 217746 218608
63640B18608J797K452K582K566K709L008L424L975M628N345O186P210Q286R195
$$ 218608 220405 222857 225439 228005 230714 233722 237146 241121 245749 251094 257280 264490 272776 281971
63626B81971R884J0469J1032J1657J2594J4036J5638J6661J6912J7241J8752K1685
$$ 281971 291855 302324 313356 325013 337607 351643 367281 383942 400854 418095 436847 458532
63614D58532K5286K8571L0830L1704L1332L0356K9089K6744K2175J5516Q365K146
$$ 458532 483818 512389 543219 574923 606255 636611 665700 692444 714619 730135 738500 740646
63602G40646k886o710q689q511p293o617o759o912o953p905j0476j4065j7523
$$ 740646 737760 731050 722361 713850 706557 699940 693181 686269 679316 671411 660935 646870 629347
63589F29347k0190k1877k2543k2447k2114k1717k0826j9075j6771j4474j2360
$$ 629347 609157 587280 564737 542290 520176 498459 477633 458558 441787 427313 414953
63578D14953j0305q300o413m571k697q79P77K331L811N078O077P049Q208R496
$$ 414953 404648 396348 389935 385364 382667 381788 382565 384896 388707 393785 399862 406911 415119 424615
63564D24615J0818J2348J4170J5839J6740J6886J7096J8217K0346K2860K5168
$$ 424615 435433 447781 461951 477790 494530 511416 528512 546729 567075 589935 615103
63553F15103K7401L0433L5051M0820M5660M6752M2250L2469J9634O532m747j3077
$$ 615103 642504 672937 707988 748808 794468 841220 883470 915939 935573 942105 937358 924281
63541I24281j7861j8964j7164j4123j1339r172p219n479m662n385p587j0827j4720
$$ 924281 906420 887456 870292 856169 844830 835658 828439 822960 818298 812913 805326 794499 779779
63528G79779j8827k2529k5320k7141k8288k9131k9856l0221k9610k7682k5044
$$ 779779 760952 738423 713103 685962 657674 628543 598687 568466 538856 511174 486130
63517D86130k2763k1148j9485j7197j4706j2839j1748j0938r984q819p478o056
$$ 486130 463367 442219 422734 405537 390831 377992 366244 355306 345322 336503 329025 322969
63505C22969m811l947l370k906k579k431k304k050j857k029k560l098l165k346
$$ 322969 318158 314211 310841 307935 305356 302925 300621 298571 296714 294685 292125 289027 285862 283516
63491B83516o40J140J835J273O77J206K510L507M109N222P088Q652Q885P885O399
$$ 283516 282876 284016 285851 287124 287801 289007 291517 295024 299133 304355 311443 320095 328980 336865 343264
63476C43264M914L626K613J577m1k229m097m917n102n589o582p451p664p294o681
$$ 343264 348178 351804 354417 355994 355953 353724 349627 344710 339608 334019 327437 319986 312322 305028 298347
63461B98347o036n405m671l630k329j169m15J97J021J853K231K237K488L381M844
$$ 298347 292311 286906 282235 278605 276276 275107 274692 274889 275910 277763 279994 282231 284719 288100 292944
63446B92944O815R411J2421J5290J7870K0842K5000L0356L5934M0067M0860L7102
$$ 292944 299759 309170 321591 336881 354751 375593 400593 430949 466883 506950 547810 584912
63434E84912K9411K0101J1508M627l65k978k714j44L367P209J1933J7793K3778
$$ 584912 614323 634424 645932 650559 650194 647216 644502 644358 647725 654934 666867 684660 708438
63421G08438K8597L1992L4417L5792L5359L2574K7548K0663J2463M011l276q435
$$ 708438 737035 769027 803444 839236 874595 907169 934717 955380 967843 971854 968578 960143
63409I60143j1386j2486j2091j0772r483r137j0127j2531j6380k1328k6277k9907
$$ 960143 948757 936271 924180 913408 903925 894788 884661 872130 855750 834422 808145 778238
63397G78238l1740l2307l2181l1330k9584k7365k5400k3861k2215j9980j7269
$$ 778238 746498 714191 682010 650680 621096 593731 568331 544470 522255 502275 485006
63386D85006j4490j1885r507p455n760m254k759j294J23J744L815O098Q000R239
$$ 485006 470516 458631 449124 441669 435909 431655 428896 427602 427725 429469 433284 439382 447382 456621
63372D56621J0109J0988J1964J3051J4489J6548J9211K2280K5626K9105L2299
$$ 456621 466730 477718 489682 502733 517222 533770 552981 575261 600887 629992 662291
63361F62291L4637L5843L6158L6012L5475L4023L0858K5596J8656J0956L406l261
$$ 662291 696928 732771 768929 804941 840416 874439 905297 930893 949549 960505 963911 960650
63349I60650q393j1601j3025j3177j2525j1561j1077j1867j3991j6831j9894k3123
$$ 960650 952257 940656 927631 914454 901929 890368 879291 867424 853433 836602 816708 793585
63337G93585k6286k8764l0233l0943l0985k9836k7210k3771k0390j7072j3180
$$ 793585 767299 738535 708302 677359 646374 616538 589328 565557 545167 528095 514915
63326E14915q432l217J589M520L840r54q106j4840j9490k1795k1819j9807j6966
$$ 514915 506483 503266 504855 509375 513215 512261 504155 489315 469825 448030 426211 406404 389438
63313C89438j4924j4051j3307j1940j0337q902p372n771m946n318n945n683m622
$$ 389438 374514 360463 347156 335216 324879 315977 308605 302834 297888 292570 286625 280942 276320
63300B76320l656l209l138l371l698l423k097m34L33j73j284k280k858k903k520
$$ 276320 272664 269455 266317 262946 259248 255825 253728 253294 253627 253454 252170 249890 247032 244129 241609
63285B41609k241k528l070l106k434j511o49K42J067J344Q38l8p55j242j711k115
$$ 241609 239368 236840 233770 230664 228230 226719 226070 226312 227379 228723 229561 229523 228768 227526 225815 223700
63269B23700k104j458m42L64O25N54M87L40j18n53k18R98K274K902L052L167L231
$$ 223700 221596 220138 219696 220060 220685 221239 221726 222066 221948 221395 221177 222175 224449 227351 230403 233570 236801
63252B36801L192L461M237M846M624M126M509N903P311Q098Q687R595J0666J1512
$$ 236801 239993 243454 247691 252537 257161 261287 265796 271699 279010 287108 295795 305390 316056 327568
63238C27568J2121J2646J3030J3082J2690J1909J1137J1048J1930J3167J3885
$$ 327568 339689 352335 365365 378447 391137 403046 414183 425231 437161 450328 464213
63227D64213J4004J4071J4271J4328J4270J4499J4992J5201J4875J4174J2887
$$ 464213 478217 492288 506559 520887 535157 549656 564648 579849 594724 608898 621785
63216F21785J0441O969L439K52l363p880j2257j5046j6285j7259j8649j9750j9594
$$ 621785 632226 639195 642634 642886 639523 631643 619386 604340 588055 570796 552147 532397 512803
63203E12803j8107j5992j3917j2056j0169p974n565l387j669j8K177M986P790
$$ 512803 494696 478704 464787 452731 442562 434588 429023 425636 423967 423949 426126 431112 438902
63190D38902R948J1427J2704J4090J5360J6151J6562J7028J7518J7413J6459J5438
$$ 438902 448850 460277 472981 487071 502431 518582 535144 552172 569690 587103 603562 619000
63178F19000J5316J6047J6802J7108J7008J6346J4802J2609J0361P903M344n74
$$ 619000 634316 650363 667165 684273 701281 717627 732429 745038 755399 763302 767646 767072
63166G67072n993j1093j5848k0263k3816k6282k8165k9656l0027k8912k7288k6177
$$ 767072 761079 749986 734138 713875 690059 663777 635612 605956 575929 547017 519729 493552
63154D93552k5051k2840j9970j7981j7197j6293j4366j2172j0771r975q905p356
$$ 493552 468501 445661 425691 407710 390513 374220 359854 347682 336911 326936 318031 310675
63142C10675n829m594l490k548k203k719l655m133l595k291r77k28j14m57j072
$$ 310675 304846 300252 296762 294214 292011 289292 285637 281504 277909 275618 274641 274413 274299 273842 272770
63127B72770j636j677j053k17K81M49P06J281K026K726L266L609L821M003M132
$$ 272770 271134 269457 268404 268187 268468 268917 269623 270904 272930 275656 278922 282531 286352 290355 294487
63112B94487M125M179M641N333N555N117M768N080N521N339M897N086N732N707
$$ 294487 298612 302791 307432 312765 318320 323437 328205 333285 338806 344145 349042 354128 359860 365567
63098C65567M621L358K653K115J071l38j454k002k220k424k714k897k596j731
$$ 365567 370188 373546 376199 378314 379385 379047 377593 375591 373371 370947 368233 365336 362740 361009
63084C61009r14q31j299j498j173q94r22o45M31J815K738L204L764M670N779P048
$$ 361009 360095 359264 357965 356467 355294 354400 353478 352833 353264 355079 357817 361021 364785 369455 375234 382282
63068C82282Q530J0041J1279J2201J2988J3771J4621J5670J6935J8238J9518K0976
$$ 382282 390812 400853 412132 424333 437321 451092 465713 481383 498318 516556 536074 557050
63056E57050K2736K4622K6490K8425L0373L1832L2389L2258L2031L2040L2218
$$ 557050 579786 604408 630898 659323 689696 721528 753917 786175 818206 850246 882464
63045H82464L2386L2383L2156L1975L2352L3506L5112L6654L7665L7428L5119
$$ 882464 914850 947233 979389 1011364 1043716 1077222 1112334 1148988 1186653 1224081 1259200
63034A259200L0663K5040J9200J3003N789k417j0846j8786k5830l1562l5784l8880
$$ 1259200 1289863 1314903 1334103 1347106 1352895 1350478 1339632 1320846 1295016 1263454 1227670 1188790
63022A188790m1268m2583m2092l9837l6676l3194k9310k4997k0532j5885j0659
$$ 1188790 1147522 1104939 1062847 1023010 986334 953140 923830 898833 878301 862416 851757
63011H51757m946M69N132R434J3724J7571K0499K2832K5114K7172K8478K9195
$$ 851757 846811 847280 852412 861846 875570 893141 913640 936472 961586 988758 1017236 1046431
62999A046431K9953L0749L0897L0241K9673L0049L1039L1452L0449K8093K4899
$$ 1046431 1076384 1107133 1138030 1168271 1197944 1227993 1259032 1290484 1320933 1349026 1373925
62988A373925K1157J6724J1219M382l639j2270k0864k9085l6879m4079n0173n4579
$$ 1373925 1395082 1411806 1423025 1427407 1423768 1411498 1390634 1361549 1324670 1280591 1230418 1175839
62976A175839n7105n7951n7352n5450n2570m9348m6249m3147l9657l5799l2025
$$ 1175839 1118734 1060783 1003431 947981 895411 846063 799814 756667 717010 681211 649186
62965F49186k8618k5452k2416j9745j7740j6356j5222j3969j2474j0932r766r228
$$ 649186 620568 595116 572700 552955 535215 518859 503637 489668 477194 466262 456496 447268
62953D47268r067q803q392q258q513q539p757o496n674n693o117o378o380o177
$$ 447268 438201 429398 421006 412748 404235 395696 387939 381443 375769 370076 363959 357581 351201 345024
62939C45024n593m509l378k965l410l946l769l050k757l389m308m512l820k919
$$ 345024 339431 334922 331544 328579 325169 321223 317454 314404 311647 308258 303950 299438 295618 292699
62925B92699k418k298k205j895j298n25O6J76j7r8r6l64o91k32J237K667K940
$$ 292699 290281 287983 285778 283883 282585 282060 282126 282302 282285 282187 282091 281727 281036 280804 282041 284708 287648
62908B87648K304J790J652J300O30L82R14J594J829J962K522L108K779J386j00
$$ 287648 289952 291742 293394 294694 295324 295706 296620 298214 300043 302005 304527 307635 310414 311800 311700
62893C11700o93m23j06l18q34j135j272j839k951l687l107j565l24L1O4K56K16
$$ 311700 311007 310584 310478 310160 309326 308191 306919 305080 302129 298442 295335 293770 293446 293477 293541 293797 294013
62876B94013m18j131j232q59n95m89k19J10P4k94n89p11q21q20n43l48o84j189
$$ 294013 293595 292464 291232 290373 289778 289289 289070 289180 289254 288960 288371 287660 286839 286019 285476 285128 284444 283255
62858B83255j081m40j32l14j28P20J266Q22K30O33J667K003J282M52L37Q62J640
$$ 283255 282174 281734 281602 281288 281160 281880 283146 283968 284198 284831 286498 288501 289783 290235 290572 291434 293074
62841B93074K398K674J960N36n56o33m9N15Q70J171J425J563J672J792J729J373
$$ 293074 295472 298146 300106 300642 300086 299453 299404 299919 300789 301960 303385 304948 306620 308412 310141 311514
62825C11514R56P15M88j2o42q70l10R14K294L280L582L285K669J994J559J796
$$ 311514 312470 313185 313673 313661 313019 312149 311839 312753 315047 318327 321909 325194 327863 329857 331416 333212
62809C33212K859M131M615M068L369L508M536N827P000Q129R244J0132J0590J0654
$$ 333212 336071 340202 344817 348885 352254 355762 360298 366125 373125 381254 390498 400630 411220 421874
62795D21874J0652J1189J2854J5554J8401K0695K2824K5657K9257L2884L6241
$$ 421874 432526 443715 456569 472123 490524 511219 534043 559700 588957 621841 658082
62784F58082L9888M4231M8765N2697N5786N8041N9129N8630N6605N3351M8718
$$ 658082 697970 742201 790966 843663 899449 957490 1016619 1075249 1131854 1185205 1233923
62773A233923M2234L3870K4233J3975L404p307j7840k7743l6448m3292m7826n0251
$$ 1233923 1276157 1310027 1334260 1348235 1351639 1344332 1326492 1298749 1262301 1219009 1171183 1120932
62761A120932n1279n1550n1299n0562m9349m7567m5080m1991l8673l5465l2562
$$ 1120932 1069653 1018103 966804 916242 866893 819326 774246 732255 693582 658117 625555
62750F25555l0173k8381k6704k4334k1164j8210j6520j5894j5168j3619j1522
$$ 625555 595382 567001 540297 515963 494799 476589 460069 444175 429007 415388 403866
62739D03866r379p292n298l763k949k518j941j245q71q42n41M94J882K779K803
$$ 403866 394487 387195 381897 378134 375185 372667 370726 369481 368610 367768 367227 367721 369603 372382 375185
62724C75185K415K394L149M505N969P128P913Q611R630J1188J3184J5441J7957
$$ 375185 377600 379994 383143 387648 393617 400745 408658 417269 426899 438087 451271 466712 484669
62711D84669K0805K3788K6550K9108L2039L5803M0044M3973M7376N0836N4806
$$ 484669 505474 529262 555812 584920 616959 652762 692806 736779 784155 834991 889797
62700H89797N8924O2484O5134O6700O6673O4505O0276N4503M7240L7932K6388
$$ 889797 948721 1011205 1076339 1143039 1209712 1274217 1334493 1388996 1436236 1474168 1500556
62689A500556J3408K09j2469k4372l5238m4653n2242n7779o1322o3361o4491o4673
$$ 1500556 1513964 1514173 1501704 1477332 1442094 1397441 1345199 1287420 1226098 1162737 1098246 1033573
62677A033573o3198n9823n5551n1681m8399m4976m1163l7485l4146l0628k6743
$$ 1033573 970375 910552 855001 803320 754921 709945 668782 631297 597151 566523 539780
62666E39780k3252k0822j9080j7306j5583j4388j3474j2050r984q027o802o297
$$ 539780 516528 495706 476626 459320 443737 429349 415875 403825 393841 385814 379012 372715
62654C72715o334o761p053o560n476m816m968m978l871k113r81q25q46m44N6J14
$$ 372715 366381 359620 352567 346007 340531 335715 330747 325769 321898 319785 318804 317979 317133 316689 316745 316859
62638C16859k51o69r14r49p91n40l50k50k64o31j509k412k449j350J35J110J436
$$ 316859 316608 315939 315025 314076 313285 312745 312395 312145 311881 311250 309741 307329 304880 303530 303665 304775 306211
62621C06211J515J620J835K272K875L165K797K233K415L663N283O338O506O215
$$ 306211 307726 309346 311181 313453 316328 319493 322290 324523 326938 330601 335884 342222 348728 354943
62607C54943O314P504R757J2146J3707J4553J5744J7929K0658K3184K5410K7497
$$ 354943 361257 368761 378518 390664 404371 418924 434668 452597 473255 496439 521849 549346
62595E49346K9023K9270K8211K6575K4792K2431J8839J3943Q228K248l568q918
$$ 549346 578369 607639 635850 662425 687217 709648 728487 742430 750658 752906 749338 740420
62583G40420j3737j8146k2069k5006k6486k6640k6136k5528k4894k4026k2742
$$ 740420 726683 708537 686468 661462 634976 608336 582200 556672 531778 507752 485010
62572D85010k0986j8929j7061j5937j5540j5115j3882j1927j0107r063q506p683
$$ 485010 464024 445095 428034 412097 396557 381442 367560 355633 345526 336463 327957 320274
62560C20274o318m868l934l677l778l801l442k645j584n52J99M98K94j73l42J33
$$ 320274 313956 309088 305154 301477 297699 293898 290456 287811 286227 285675 285874 286372 286666 286493 286151 286284
62544B86284Q10Q53K28k2Q31J989K039R30J46P76K206L196L587M232N617P277
$$ 286284 287094 287947 288175 288153 288984 290973 293012 293942 294088 294864 297070 300266 303853 308085 313702 320979
62528C20979Q536R277R898J0893J2546J4780J7326K0091K3190K6347K8778L0195
$$ 320979 329515 338792 348690 359583 372129 386909 404235 424326 447516 473863 502641 532836
62516E32836L1555L3978L6906L8305L6990L3869L0451K6878K2248J6284R728L255
$$ 532836 564391 598369 635275 673580 710570 744439 774890 801768 824016 840300 850028 853283
62504H53283l125r476j5479k0823k5390k8875l0764l1017l0353k9417k8143k6344
$$ 853283 850158 840682 825203 804380 778990 750115 719351 688334 657981 628564 600421 574077
62492E74077k4477k3160k2047k0102j7053j3858j1373r283o949m766l679l530
$$ 574077 549600 526440 504393 484291 467238 453380 442007 432724 425775 421009 417330 413800
62480D13800k965j291M82J111R00J138K101K666J962M99o59j215j677k544l861
$$ 413800 410835 409544 410026 411137 412037 413175 415276 417942 419904 420403 419744 418529 416852 414308 410447
62465D10447n301o349o708o763p323q581r706r871r282q696q249p462o233n143
$$ 410447 405146 398797 392089 385326 378003 369422 359716 349845 340563 331867 323618 316156 309923 304780
62451C04780m640m566m629m788m940m650l643k238j055m55l96n98o22q7Q51J471
$$ 304780 300140 295574 290945 286157 281217 276567 272924 270686 269631 269176 268780 268182 267560 267473 268324 269795
62435B69795J211L63l00m25l30l78n48p26r74j217j041j99P41Q34n5r56j000n38
$$ 269795 271006 271369 271069 270644 270314 269936 269388 268662 267688 266471 265430 265231 265972 266806 266751 265795 264795 264257
62417B64257n51j197j564r50K23J022J044N15k03q20j069r06o10l84j5P13J504
$$ 264257 263706 262509 260945 259995 260218 261240 262284 262799 262596 261776 260707 259801 259191 258807 258792 259505 261009
62400B61009J829J591J181R66J087J541K083K231J756J108R19J278J891K693L666
$$ 261009 262838 264429 265610 266576 267663 269204 271287 273518 275274 276382 277301 278579 280470 283163 286829
62385B86829M305M013L105K686L384M743N978O726O992P018P383Q546J0118J1231
$$ 286829 291134 295147 298252 300938 304322 309065 315043 321769 328761 335779 343162 351708 361826 373057
62371C73057J1836J2861J4819J7109J9097K1039K3348K5809K8222L1138L5078
$$ 373057 384893 397754 412573 429682 448779 469818 493166 518975 547197 578335 613413
62360F13413L9590M3992M8491N3460N7979O0266N9561N6571N1987M5543L6958
$$ 613413 653003 696995 745486 798946 856925 917191 976752 1033323 1085310 1130853 1167811
62349A167811K6962J6933P896J40o666j3207j9961k6673l2667l7664m1902m5429
$$ 1167811 1194773 1211706 1219602 1219742 1213076 1199869 1179908 1153235 1120568 1082904 1041002 995573
62337I95573m7793m8644m8083m6273m3144l8867l4202l0009k6565k3608k0858
$$ 995573 947780 899136 851053 804780 761636 722769 688567 658558 631993 608385 587527
62326E87527j8219j5705j3463j1832j1094j1138j1464j1647j1744j2149j2910
$$ 587527 569308 553603 540140 528308 517214 506076 494612 482965 471221 459072 446162
62315D46162j3377j2824j1414j0135r618r461q944p978o964o110n406m938m679
$$ 446162 432785 419961 408547 398412 388794 379333 370389 362411 355447 349337 343931 338993 334314
62302C34314m224l350k594k623l180l335k697j684p07K32J107J691J975K129K102
$$ 334314 330090 326740 324146 321523 318343 315008 312311 310627 309920 310152 311259 312950 314925 317054 319156
62287C19156J839J789K422L301L554L356L846N304O517O513N897N797O302O779
$$ 319156 320995 322784 325206 328507 332061 335417 339263 344567 351084 357597 363494 369291 375593 382372
62273C82372P085P533Q143Q779R761J1503J3820J6227J8778K1881K5548K9465
$$ 382372 389457 396990 405133 413912 423673 435176 448996 465223 484001 505882 531430 560895
62261E60895L3679L8494M3763M8905N3537N7594O0774O2379O1757N8540N2601
$$ 560895 594574 633068 676831 725736 779273 836867 897641 960020 1021777 1080317 1132918
62250A132918M4197L4086K3176J2171J812p037j4118k0334k6875l3853m0383m5776
$$ 1132918 1177115 1211201 1234377 1246548 1248360 1241323 1227205 1206871 1179996 1146143 1105760 1059984
62238A059984m9949n2772n3912n3480n2081m9995m6947m2872l8349l4000k9992
$$ 1059984 1010035 957263 903351 849871 797790 747795 700848 657976 619627 585627 555635
62227E55635k6417k3602k1636j9985j8035j5776j3691j2191j1399j1085j0706
$$ 555635 529218 505616 483980 463995 445960 430184 416493 404302 392903 381818 371112
62216C71112r743q286o938n989n076l967l119k959l042k588j605p67l05K27R68
$$ 371112 361369 353083 346145 340156 335080 331113 327994 325035 321993 319405 317800 317033 316728 316955 317923
62201C17923J331R73N25Q16J746K653L546N125P530R834J1196J1892J2664J3539
$$ 317923 319254 320227 320752 321568 323314 325967 329513 334638 342168 352002 363198 375090 387754 401293
62187D01293J3981J3940J3887J3927J3675J3138J2863J2890J2266J0237P331M743
$$ 401293 415274 429214 443101 457028 470703 483841 496704 509594 521860 532097 539428 544171
62175E44171L123K597L513O282J0568J5413K0206K4944K9605L3925L7823M1386
$$ 544171 547294 549891 553404 559686 570254 585667 605873 630817 660422 694347 732170 773556
62163G73556M4174M5044M2971L7808L0237K1447J2829N390q22o433j1775j6685
$$ 773556 817730 862774 905745 943553 973790 995237 1008066 1013456 1012634 1006201 994426 977741
62151I77741k1221k5849l0626l4773l7571l9144l9846l9396l7373l4207l0941
$$ 977741 956520 930671 900045 865272 827701 788557 748711 709315 671942 637735 606794
62140F06794k7948k4710k0962j7387j4706j2560r954o673l770k393k446k699k092
$$ 606794 578846 554136 533174 515787 501081 488521 478567 471894 468124 465731 463285 460586 458494
62127D58494n92J254L138M973O387O826O348N759N773O301O815P129P404P668
$$ 458494 457902 459156 462294 467267 473654 480480 486828 492587 498360 504661 511476 518605 526009 533677
62113E33677P734P551P210O668N808M891M505M831N300N266M848M721N182N772
$$ 533677 541411 548962 556172 562840 568648 573539 578044 582875 588175 593441 598289 603010 608192 613964
62099F13964N987N944O115O610P046P119O960O850O831O716O381N912N596N779
$$ 613964 619951 625895 632010 638620 645666 652785 659745 666595 673426 680142 686523 692435 698031 703810
62085G03810O583P759Q970J0255J1980J4241J6610J8658K0456K2393K4639K6979
$$ 703810 710393 718152 727122 737377 749357 763598 780208 798866 819322 841715 866354 893333
62073H93333K8995L0224L0450L0050K9707K9539K8880K7354K5719K4965K4805
$$ 893333 922328 952552 983002 1013052 1042759 1072298 1101178 1128532 1154251 1179216 1204021
62062A204021K3837K1220J7392J3015Q018K206l744q591j1728j3741j5802j8702
$$ 1204021 1227858 1249078 1266470 1279485 1287503 1289709 1285965 1277374 1265646 1251905 1236103 1217401
62050A217401k2366k6072k9225l1879l4449l6982l8997m0037l9989l8888l6867
$$ 1217401 1195035 1168963 1139738 1107859 1073410 1036428 997431 957394 917405 878517 841650
62039H41650l4488l2622l1626l0933k9758k7998k6035k3960k1425j8263j4914
$$ 841650 807162 774540 742914 711981 682223 654225 628190 604230 582805 564542 549628
62028E49628j2089j0207r127q422p825p464p574q078q655r209r937j0831j1358
$$ 549628 537539 527332 518205 509783 501958 494494 486920 478842 470187 460978 451041 440210 428852
62015D28852j0889r324p201n274m031l368k637j168J110L668O030Q134J0003J1340
$$ 428852 417963 408639 401438 396164 392133 388765 386128 384960 386070 389738 395768 403902 413905 425245
62001D25245J1740J1167J0027Q756P418N608K899n05l637n622o564p287q259r234
$$ 425245 436985 448152 458179 466935 474353 479961 482860 482355 478718 473096 466532 459245 450986 441752
61987D41752r918j0392j0668j0467r776r164r091r181q701p542o285n394m684
$$ 441752 431834 421442 410774 400307 390531 381367 372276 363095 354394 346852 340567 335173 330489
61974C30489l712k466j483j220j335r21K46J100N63q50j528q42K45Q52J354K352
$$ 330489 326777 324311 322828 321608 320273 319352 319598 320698 321261 320411 318883 318041 318286 319138 320492 322844
61958C22844L431L818L631L532L711L991M614N936P646R088J0185J1354J2702
$$ 322844 326275 330093 333724 337256 340967 344958 349572 355508 363154 372242 382427 393781 406483
61945D06483J4135J5963J8581K1673K4585K7270L0000L2326L3375L3226L2921
$$ 406483 420618 436581 455162 476835 501420 528690 558690 591016 624391 657617 690538
61934F90538L2907L2491L1146K9396K7872K6316K4053K0892J7045J2625P754K744
$$ 690538 723445 755936 787082 816478 844350 870666 894719 915611 932656 945281 953035 955779
61922I55779k199p122j1858j5725j7984j8296j6652j3320q995m476N4M983J0338
$$ 955779 953580 946458 934600 918875 900891 882595 865943 852623 843628 839152 839206 844189 854527
61909H54527J5439J9673K2966K5176K5695K4131K0851J6446J1156N186r59o986
$$ 854527 869966 889639 912605 937781 963476 987607 1008458 1024904 1036060 1041246 1040287 1033301
61897A033301j3097j9229k4513k8091l0103l1270l1950l2192l2255l2254l1588
$$ 1033301 1020204 1000975 976462 948371 918268 886998 855048 822856 790601 758347 726759
61886G26759k9548k6417k3301k0950j9323j8208j7509j6963j6162j5055j3913
$$ 726759 697211 670794 647493 626543 607220 589012 571503 554540 538378 523323 509410
61875E09410j2874j1910j1095j0359r108o851m149k130j000J77K050M126N801
$$ 509410 496536 484626 473531 463172 454064 447213 443064 440934 439934 440111 442161 446287 452088
61862D52088P370R393J1707J3881J6258J9670K4157K8763L2786L6556M0680M5015
$$ 452088 459458 468851 480558 494439 510697 530367 554524 583287 616073 652629 693309 738324
61850G38324M8863N1874N4230N5962N6581N5546N2707M8072M1493L3029K3424
$$ 738324 787187 839061 893291 949253 1005834 1061380 1114087 1162159 1203652 1236681 1260105
61839A260105J3741M497m339j2443j8755k2425k3655k3203k1239j7226j0818k538
$$ 1260105 1273846 1278343 1274004 1261561 1242806 1220381 1196726 1173523 1152284 1135058 1124240 1121702
61827A121702O441J4815K1506K5851K7619K6855K3702J8394J1198K204q489k0155
$$ 1121702 1128143 1142958 1164464 1190315 1217934 1244789 1268491 1286885 1298083 1300287 1291798 1271643
61815A271643l1307m0630m7857n3437n7543n9841o0083n8457n5394n1445m7256
$$ 1271643 1240336 1199706 1151849 1098412 1040869 981028 920945 862488 807094 755649 708393
61804G08393m3231l9298l5327l1561k8251k5077k1609j8195j5681j4253j3200
$$ 708393 665162 625864 590537 558976 530725 505648 484039 465844 450163 435910 422710
61793D22710j1876j0249q427o453m729l870l790l648l019k437k382k534k500k520
$$ 422710 410834 400585 392158 385705 380976 377106 373316 369668 366649 364212 361830 359296 356796 354276
61779C54276k806k904k522k334l049m120m392l729l001k681k454k202k256k480
$$ 354276 351470 348566 346044 343710 340661 336541 332149 328420 325419 322738 320284 318082 315826 313346
61765C13346k174j226n58q32j449j394n79K38N06L46J60K36O00R89J046P25K98
$$ 313346 311172 309946 309388 308556 307107 305713 305134 305372 305878 306224 306384 306620 307220 308209 309255 309980 310278
61748C10278j64r30j983k678k443j593r49p91o49p6P89J511J818J684J239P78
$$ 310278 310114 309184 307201 304523 302080 300487 299538 298747 298098 298022 298811 300322 302140 303824 305063 305841
61732C05841O90J184K129L186M093M784N335N808O158O290O202O032N934N962
$$ 305841 306531 307715 309844 313030 317123 321907 327242 333050 339208 345498 351700 357732 363666 369628
61718C69628O063O131O078N903N648N210M341L014J652O69j96j642l807n839o774
$$ 369628 375691 381822 387900 393803 399451 404661 409002 412016 413668 414337 414141 412499 408692 402853 396079
61703C96079o508n638m669l776l139k944k981k714j900r20l18j85j71M6M14O85
$$ 396079 389571 383933 379264 375488 372349 369405 366424 363710 361810 360890 360572 360387 360216 360262 360676 361361
61687C61361P28O60N60K56m29j230j548j167n62k39p3L35Q30P73p2j149j709j456
$$ 361361 362089 362749 363309 363565 363136 361906 360358 359191 358629 358390 358317 358652 359482 360255 360183 359034 357325 355869
61669C55869n33O54J449J295M16k25j4N06L98l74r59q65n26n14p09o38k14K71
$$ 355869 355336 355990 357439 358734 359150 358925 358911 359417 359815 359441 358482 357617 357091 356577 355868 355230 355016 355287
61651C55287O69J083J520J805J957K305L216M757O604Q071Q370P263N496M120
$$ 355287 355956 357039 358559 360364 362321 364626 367842 372599 379203 387274 395644 402907 408403 412523
61637D12523L258K003k18k659m120m428m441m798n346n812o231o465n942m344
$$ 412523 415781 417784 417566 414907 410787 406359 401918 397120 391774 385962 379731 373266 367324 362980
61623C62980k240n69L33R14J819L326N145O588P034O431N236L830K258N45j153
$$ 362980 360740 360171 360504 361418 363237 366563 371708 378296 385330 391761 396997 400827 403085 403630 402477
61608D02477k855m734o602p902q470q772r026q735p636o474o100o287o285o110
$$ 402477 399622 394888 388286 380384 371914 363142 354116 345381 337745 331271 325171 318884 312599 306489
61594C06489o298o622o220n001l867l312k824j965j119p53p19p63j019j486j689
$$ 306489 300191 293569 287349 282348 278481 275169 272345 270380 269261 268508 267789 267026 266007 264521 262832
61579B62832j365q99o16k56L41P15N78M55Q04J087N48m96j088j018q29o51r2O89
$$ 262832 261467 260568 259952 259696 260037 260752 261330 261785 262589 263676 264224 263728 262640 261622 260793 260142 260050 260739
61561B60739Q52J18o95p84l97k34l76l17J56O79Q54O61K86j96p64j169j069n87
$$ 260739 261591 261709 261014 260230 259833 259599 259223 258906 259062 259741 260595 261256 261542 261346 260582 259413 258344 257757
61543B57757m22j015j765j637n91L05L84K86R00K041K865L102L043K638J515j71
$$ 257757 257335 256320 254555 252918 252327 252632 253016 253302 254202 256243 259108 262210 265253 267891 269406 269235
61527B69235j728k812l613m127l993l256k651k781l443l969l899l274k583k441
$$ 269235 267507 264695 261082 256955 252962 249706 247055 244274 240831 236862 232963 229689 227106 224665
61513B24665k999l588l396k445j473r51p44o40o17n56l28k19o34j332j578j168
$$ 224665 221666 218078 214682 212237 210764 209813 209069 208429 207812 207256 206928 206709 206075 204743 203165 201997
61497B01997o17k79m1k0n77j350j289j79P56M96l09m15J49L02l23q99o57J86Q60
$$ 201997 201380 201101 201060 201040 200463 199113 197824 197645 198401 198897 198588 198173 198322 198624 198301 197402 196745 196931 197791
61478A97791R12M86J21K46O93Q40M31l6j1M60J057J695K223K089J006l85j112
$$ 197791 198703 199189 199310 199556 200249 201089 201520 201484 201473 201933 202990 204685 206908 208997 210003 209618 208506
61461B08506r17k61M35R46R98O21M74J008J558J097k01j111j052o71n59l83L03
$$ 208506 207589 207328 207763 208709 209707 210328 210802 211810 213368 214465 214264 213153 212101 211430 210871 210488 210791
61444B10791J221J884K313K693K838K570K269K481L216M084M892N684O273O267
$$ 210791 212012 213896 216209 218902 221740 224310 226579 229060 232276 236360 241252 246936 253209 259476
61430B59476N501M238K913J800Q97j9j064j962k214j643n90N50J648K584K965
$$ 259476 264977 269215 272128 273928 274825 274806 273742 271780 269566 267923 267333 267883 269531 272115 275080
61415B75080K526J627J036J114J477J444P38l87j547k573l397l795l591l076k864
$$ 275080 277606 279233 280269 281383 282860 284304 285042 284655 283108 280535 277138 273343 269752 266676 263812
61400B63812l101l205k748k196k269k797k958k533k197k378k620k386j856j488
$$ 263812 260711 257506 254758 252562 250293 247496 244538 242005 239808 237430 234810 232424 230568 229080
61386B29080j325j240j360j713j738r27K43P24K47l16r2P88J549J758J584J304
$$ 229080 227755 226515 225155 223442 221704 220777 221020 221744 221991 221675 221583 222371 223920 225678 227262 228566
61370B28566R35M20j8PN89J314J752K007K548L399L912L551K642K059K316L210
$$ 228566 229501 229921 229903 229910 230499 231813 233565 235572 238120 241519 245431 248982 251624 253683 255999 259209
61354B59209M290N322O298P202P942Q432Q754R141R674R988R551Q336O951N932
$$ 259209 263499 268821 275119 282321 290263 298695 307449 316590 326264 336252 345803 354139 361090 367022
61340C67022N266M826M856N516O214O044M909L579K630J796O40o71j657k260k912
$$ 367022 372288 377114 381970 387486 393700 399744 404653 408232 410862 412658 413298 412627 410970 408710 405798
61325D05798l904m970n528n262m497l994m188m653m616m008l589l869m255l747
$$ 405798 401894 396924 391396 386134 381637 377643 373455 368802 364186 360178 356589 352720 348465 344718
61311C44718k223n95K73M24N34J196K512M128N436N930N502M359K676N99j373
$$ 344718 342495 341900 342173 342597 343131 344327 346839 350967 356403 362333 367835 372194 374870 375469 374096
61296C74096k444k311j728j822k814l836m105l888l928m259m117l061j633p27
$$ 374096 371652 369341 367613 365791 362977 359141 355036 351148 347220 342961 338844 335783 334150 333423
61282C33423o31j027j530j807j422j63J503K801L567M292N157N673N588N497N988
$$ 333423 332792 331765 330235 328428 327006 326843 328346 331147 334714 339006 344163 349836 355424 360921 366909
61267C66909O603O465N635N082N341O002O608P326Q407R684J0922J2049J2681
$$ 366909 373512 379977 385612 390694 396035 402037 408645 415971 424378 434062 444984 457033 469714
61254D69714J2101J0285Q401P586P582P255O164M801L567K356J141O6j117k933
$$ 469714 481815 492100 500501 508087 515669 522924 529088 533889 537456 539812 540953 541019 539902 536969
61240E36969n224p065p896q121q242q130p589p030o978p264p296o793n863m669
$$ 536969 531745 524680 516784 508663 500421 492291 484702 477672 470694 463430 456134 449341 443478 438809
61226D38809l495k773k532k175j336o30q31j649k032j610r91o09j67N79J229J378
$$ 438809 435314 432541 430009 427834 426498 425868 425037 423388 421356 419746 418755 418146 417979 418558 419787 421165
61210D21165J269J326J429J119K75p45j505j684j116R0J568L059M607O227P673
$$ 421165 422434 423760 425189 426308 426583 425838 424333 422649 421533 421623 423191 426250 430857 437084 444757
61195D44757Q783R914J1550J3531J5040J5435J4816J3657J2211J0494Q690P246
$$ 444757 453540 463454 475004 488535 503575 519010 533826 547483 559694 570188 578878 586124
61183E86124O489O376O635O962O961O230M823L469K874K826K437J355J78n46j187
$$ 586124 592613 598989 605624 612586 619547 625777 630600 634069 636943 639769 642206 643561 643739 643193 642006
61168F42006k350l782m655m760m749n223o120p181q393r802j1197j2220j2560
$$ 642006 639656 635874 631219 626459 621710 616487 610367 603186 594793 584991 573794 561574 549014
61155E49014j2006j0667r164q155p598o761n160l117j302j67N6p80k506m536o276
$$ 549014 537008 526341 517177 509022 501424 494663 489503 486386 485084 484917 484973 484193 481687 477151 470875
61140D70875p493q203q412q177p667p003o198n277m295l273k312j665j279m61
$$ 470875 463382 455179 446767 438590 430923 423920 417722 412445 408150 404877 402565 400900 399621 399160
61126C99160J373L708N355N994O554P838R522J0927J2023J3152J4354J5538J6801
$$ 399160 400533 404241 409596 415590 422144 429982 439504 450431 462454 475606 489960 505498 522299
61113E22299J8025J8668J8530J8227J8316J8524J8420J8232J8159J7527J5661
$$ 522299 540324 558992 577522 595749 614065 632589 651009 669241 687400 704927 720588
61102G20588J3221J1507J0619R387P046L943O22k725n766q081r906j1943j4137
$$ 720588 733809 745316 755935 765322 772368 776311 776933 774208 768442 760361 750455 738512 724375
61089G24375j5605j5979j5906j5938j5887j5720j5959j6677j7035j6489j5604
$$ 724375 708770 692791 676885 660947 645060 629340 613381 596704 579669 563180 547576
61078E47576j5032j4545j3855j3421j3592j3661j2870j1652j0808j0015q416o270
$$ 547576 532544 517999 504144 490723 477131 463470 450600 438948 428140 418125 409709 403439
61066D03439m736m134l721l113k662k353j531r1J192J885K500L435M262M579M723
$$ 403439 398703 394569 390848 387735 385073 382720 381189 381098 382290 384175 386675 390110 394372 398951 403674
61051D03674N099N528N859O484P667Q961R906J0719J1689J2555J3127J3946J5410
$$ 403674 408773 414301 420160 426644 434311 443272 453178 463897 475586 488141 501268 515214 530624
61038E30624J6890J7629J8128J9509K1723K3546K4389K5017K6242K7894K9581
$$ 530624 547514 565143 583271 602780 624503 648049 672438 697455 723697 751591 781172
61027G81172L1701L5221M0912M9160O0057P3512Q9739J09877J35514J67695K07327
$$ 781172 812873 848094 889006 938166 998223 1071735 1161474 1271351 1406865 1574560 1781887
61016A781887K56080L13438L69363M00937L82119L02997J81734N6409l6800p9912
$$ 1781887 2037967 2351405 2720768 3121705 3503824 3806821 3988555 4044964 4008164 3928252
61006C928252p3270k7520L9158R8582J17188P2987k8174j54176k66285l39536
$$ 3928252 3854982 3827462 3866620 3965202 4082390 4155377 4127203 3973027 3706742 3367206
60996C367206l68932l62783l33882k94378k53311k15372j81692j52124j26644
$$ 3367206 2998274 2635491 2301609 2007231 1753920 1538548 1356856 1204732 1078088
60987A078088j05078q6824p1437n8880m8980m1205l5205l0919k7936k5361k2713
$$ 1078088 973010 886186 814749 755869 706889 665684 630479 599560 571624 546263 523550
60976E23550k0354j8621j7117j5335j3543j2334j1596j0638r240p962p300p025
$$ 523550 503196 484575 467458 452123 438580 426246 414650 404012 394772 386810 379510 372485
60964C72485o544n613m438l363k579k084j768j463j005k34Q96K163L138L534L457
$$ 372485 365941 360328 355890 352527 349948 347864 346096 344633 343628 343394 344290 346453 349591 353125 356582
60949C56582L235L087L090L293L631L801L441K524J437N99R9k31n62r95j653k661
$$ 356582 359817 362904 365994 369287 372918 376719 380160 382684 384121 384720 384819 384588 384026 383031 381378 378717
60933C78717l940n185o074o489o466o156n930o260p166p894p660o703o050o139
$$ 378717 374777 369592 363518 357029 350563 344407 338477 332217 325051 317157 309497 302794 296744 290605
60919B90605o285n849n183m799m271k945j381r28j802k695k517j590o80J77J239
$$ 290605 284320 278471 273288 268489 264218 261273 259892 258964 257162 254467 251950 250360 249680 249857 251096
60904B51096K196K582K546K504K351J812J304J609K739L774L967L439K674J809
$$ 251096 253292 255874 258420 260924 263275 265087 266391 268000 270739 274513 278480 281919 284593 286402
60890B86402O82o46j612j503k51J153J502P27k9oK15j36o26k84P05J181P90M97
$$ 286402 287084 286438 284826 283323 283072 284225 285727 286454 286425 286419 286634 286498 285872 285588 286293 287474 288264 288761
60872B88761J043J861J983J344N90J59lj31m74j164j940k323k296k411k952l453
$$ 288761 289804 291665 293648 294992 295582 295741 295738 295607 295133 293969 292029 289706 287410 284999 282047 278594
60856B78594l404l006k710k354j462j91O30N91K23K52O74R21P14M43O22J224J717
$$ 278594 275190 272184 269474 267120 265658 265467 266097 266688 266911 267163 267837 268758 269472 269915 270537 271761 273478
60839B73478J690J273Q83P29P59R45J335J802K013J787J348J145J490K336L295
$$ 273478 275168 276441 277324 278053 278812 279757 281092 282894 284907 286694 288042 289187 290677 293013 296308
60824B96308L883L852L301K452J515Q61R24J556J823J038j61m80L49J214J107
$$ 296308 300191 304043 307344 309796 311311 312172 313096 314652 316475 317513 317352 316872 317221 318435 319542
60809C19542J80q81j735k254k259j993k268l405m536m682m173m139m879n627n827
$$ 319542 319722 318841 317106 314852 312593 310600 308332 304927 300391 295709 291536 287397 282518 276891 271064
60794B71064n645n187m175k777j899k056k607k591j883r99k17M46O55p2j529k660
$$ 271064 265419 260232 256057 253280 251381 249325 246718 244127 242244 241245 241028 241474 242129 242057 240528 237868
60778B37868k464q73J260K844L283K824K225J914J578Q05r1l12L52J266J819K071
$$ 237868 235404 234531 235791 238635 241918 244742 246967 248881 250459 251264 251173 250861 251213 252479 254298 256369
60762B56369K309K481K483K615L122L587L464L119L584N064O377O341N197M178
$$ 256369 258678 261159 263642 266257 269379 272966 276430 279549 283133 288197 294574 300915 306112 310290
60748C10290M020M432M905N269N396M972L885K550J498P57j02j353k716l651l914
$$ 310290 314310 318742 323647 328916 334312 339284 343169 345719 347217 347974 347872 346519 343803 340152 336238
60733C36238l740l427k933k103j243j109k085l682n087n975o506o699o308n306
$$ 336238 332498 329071 326138 324035 322792 321683 319598 315916 310829 304854 298348 291649 285341 280035
60719B80035m125l326l196l618m092m050l384k623k283k196j857j197n17J93J138
$$ 280035 275910 272584 269388 265770 261678 257628 254244 251621 249338 247142 245285 244088 243571 243764 244902
60704B44902J982K001J217O23R58J869K660L190L559L569L231L228M062N102N370
$$ 244902 246884 248885 250102 250725 251683 253552 256212 259402 262961 266530 269761 272989 277051 282153 287523
60689B87523N031N176O112O844O511N479M586L915K881J171q76k655l625l458
$$ 287523 292554 297730 303842 310686 317197 322676 327262 331177 334058 335229 334353 331698 328073 324615
60675C24615k320r84l24n11q92p28K1P23Q04M04K31Q48K141L503M464N082N749
$$ 324615 322295 321311 320987 320476 319584 318856 318877 319600 320404 320808 321039 321887 324028 327531 331995 337077 342826
60658C42826O683P666Q378Q995J0202J2380J4909J6690J7440J8033J9399K1512
$$ 342826 349509 357175 365553 374548 384750 397130 412039 428729 446169 464202 483601 505113
60646E05113K3704K5584K7118K8074K7931K6434K3823K0526J6847J2929Q696L881
$$ 505113 528817 554401 581519 609593 637524 663958 687781 708307 725154 738083 746779 750660
60634G50660j498o702j0728j3323j5214j7190j9204k0597k1009k0752k0330j9780
$$ 750660 749162 742460 731732 718409 703195 686005 666801 646204 625195 604443 584113 564333
60622E64333j8702j6922j4943j3491j2578j1473r749q001p130p160p205o565n450
$$ 564333 545631 528709 513766 500275 487697 476224 466475 458474 451344 444184 436979 430414 424964
60609D24964m603m537n145n810n915n461n182n729o844p621p546o917o294n901
$$ 424964 420361 415824 410679 404869 398954 393493 388311 382582 375738 368117 360571 353654 347360 341459
60595C41459n690n592n604n723n852n636m667l134j953j845k458k837k536j706
$$ 341459 335769 330177 324573 318850 312998 307362 302695 299561 297608 295763 293305 290468 287932 286226
60581B86226m64J029K110K258K080K695M055N094N677O930Q979R919Q268N257
$$ 286226 285762 286791 288901 291159 293239 295934 299989 305083 310760 317690 326669 336588 344856 350113
60567C50113L167K201O65k079m685n934o171o108n588m313k788j634o01R69L045
$$ 350113 353280 355481 356146 354067 349382 343448 337277 331169 325581 321268 318480 316846 316245 317214 320259
60552C20259M964O341P290Q010Q536Q879Q957Q521P388N686L686J497q73l255
$$ 320259 325223 331564 338854 346864 355400 364279 373236 381757 389145 394831 398517 400014 399141 395886
60538C95886n246o389o435n635m695m115l603k528r48L26P86P55O58M29R5K70
$$ 395886 390640 384251 377816 372181 367486 363371 359768 357240 356292 356618 357404 358159 358817 359246 359341 359611
60522C59611J378K749L295K901K481K653L105L399L755M651O043P411Q484R594
$$ 359611 360989 363738 367033 369934 372415 375068 378173 381572 385327 389978 396021 403432 411916 421510
60508D21510J1367J4132J7692K1516K5122K8232L0665L2201L2556L1315K7974
$$ 421510 432877 447009 464701 486217 511339 539571 570236 602437 634993 666308 694282
60497F94282K2310J4786O233k875j2391k1594k8986l3528l5636l6351l5933l4015
$$ 694282 716592 731378 737611 734736 722345 700751 671765 638237 602601 566250 530317 496302
60485D96302l0883k7590k4750k2014j8975j5835j2928j0301q111o801o447o431
$$ 496302 465419 437829 413079 391065 372090 356255 343327 333026 324915 318114 311667 305236
60473C05236o230o018o035n876n066l917l136k797k424j916j719j976k207j962
$$ 305236 299006 292988 286953 281077 276011 272094 268958 266161 263737 261821 260102 258126 255919 253957
60459B53957j359p77m19l72o91j206j465j120l23M02O39L91J7j36r2j30k96k40
$$ 253957 252598 251821 251402 251030 250339 249133 247668 246548 246225 246627 247266 247657 247674 247538 247446 247316 247020 246780
60441B46780K76Q89R55K45q70j802k091j570n91P4p6o99j067j023r74j071r65
$$ 246780 247056 247945 248900 249145 248275 246473 244382 242812 242221 242295 242219 241520 240453 239430 238456 237385 236420
60424B36420n66l41n73p63l32M48P78N26M60J168K134K306J398J60o28r40j054
$$ 236420 235854 235513 234940 234177 233845 234293 235071 235597 236057 237225 239359 241665 243063 243223 242595 241655 240601
60407B40601p78J44J122J127K49j45O76J574J162o0l91N26J327J110O73R82J627
$$ 240601 239823 239967 241089 242216 242465 242320 242996 244570 245732 245672 245281 245807 247134 248244 248917 249899 251526
60390B51526J606Q50P6l08l33M9P74J271J052N22M98J033J446J358J031P23M24
$$ 251526 253132 253982 254058 253750 253417 253466 254240 255511 256563 257085 257583 258616 260062 261420 262451 263174 263598
60373B63598K97O17J100R70O5p21m94N10J330J498J364J372J477J400J104Q45
$$ 263598 263895 264512 265612 266582 266647 265926 265432 265942 267272 268770 270134 271506 272983 274383 275487 276332
60357B76332Q68J217J778K358K741K807K671K593K648K609K239J608R59L58k79
$$ 276332 277200 278417 280195 282553 285294 288101 290772 293365 296013 298622 300861 302469 303428 303786 303507
60342C03507r11j406j803k216k511k443k103j840j656j184l84K23K92R1rq0k17
$$ 303507 302596 301190 299387 297171 294660 292217 290114 288274 286618 285434 285050 285273 285565 285656 285647 285567 285350
60325B85350j13M69J161J444J406J528J971K537L122L753M353M979O100Q092J0590
$$ 285350 285237 285706 286867 288311 289717 291245 293216 295753 298875 302628 306981 311960 318060 326152 336742
60310C36742J2889J4768J6344J7297J6937J5115J2375R097N056P1n375j0374j4134
$$ 336742 349631 364399 380743 398040 414977 430092 442467 451564 456620 456691 451316 440942 426808
60297D26808j6206j6550j5538j3650j1152q268n584l754k858k419k095j944k051
$$ 426808 410602 394052 378514 364864 353712 345444 339860 336106 333248 330829 328734 326790 324739
60284C24739k322k684l050l107k578j711j046p53o72q75j562k372k606k230j935
$$ 324739 322417 319733 316683 313576 310998 309287 308241 307488 306816 305941 304379 302007 299401 297171 295236
60269B95236j966j730r68m87j046k090k439j853j211j153j274q32J59Q63O03l28
$$ 295236 293270 291540 290572 290085 289039 286949 284510 282657 281446 280293 279019 278187 278346 279209 279812 279484
60253B79484r95r06n01l38k43K22P94Q12L80L26Q21J006M17j14L55J489K169K000
$$ 279484 278489 277583 277082 276744 276501 276723 277517 278329 278709 279035 279856 280862 281279 281165 281520 283009 285178 287178
60235B87178J563J475J788K205K348J971J282Q32Q40R43R06J023J427J572J090
$$ 287178 288741 290216 292004 294209 296557 298528 299810 300642 301482 302425 303331 304354 305781 307353 308443
60220C08443O25J020K024K632K500K117J767J281Q70J149K054K583K072J087O27
$$ 308443 309068 310088 312112 314744 317244 319361 321128 322409 323279 324428 326482 329065 331137 332224 332851
60205C32851R31J561K221K911L514L697L245K273J173N09P56J812K905L209K570
$$ 332851 333782 335343 337564 340475 343989 347686 350931 353204 354377 354886 355642 357454 360359 363568 366138
60190C66138J559Q13N47N18L61j67j088k166k994l239l023k930l408m073l957
$$ 366138 367697 368510 369057 369575 369936 369769 368681 366515 363521 360282 357259 354329 350921 346848 342891
60175C42891k605p19N57P83L85q1m07m95j73N26J180J324R21L24r3j88k1K74N08
$$ 342891 340286 339567 340124 340907 341292 341211 340804 340309 340136 340662 341842 343166 344087 344411 344318 344130 344109 344383 344891
60156C44891N15L15J76L56P59J072J291J785K659L309L139K523K505L541N023
$$ 344891 345406 345721 345897 346253 347012 348084 349375 351160 353819 357128 360267 362790 365295 368836 373859
60141C73859O128O564O389N764N147N089N393N057L493J377k72j309k175k870
$$ 373859 379987 386551 392940 398704 403851 408940 414333 419390 422883 424260 423988 422679 420504 417634
60127D17634l015k706k496k632k930l310l725l694k691j128j24j33m59l88j36
$$ 417634 414619 411913 409417 406785 403855 400545 396820 393126 390435 389307 389183 389050 388591 388203 388067
60112C88067k38o40q70p82o06m83l58k22j06J9J18ol82n60l2R96J598J159J86
$$ 388067 387829 387189 386319 385537 384931 384448 384090 383868 383762 383781 383899 383893 383511 382951 382919 383915 385513 386672 386858
60093C86858j96M32J407K070K710L883N095N051L413J477O66R75J428J546J578
$$ 386858 386662 387094 388501 390571 393281 397164 402259 407310 410723 412200 412866 413841 415269 416815 418393
60078D18393J670J661J661K037K694L018K638J801Q56j86j448k883m319n473o017
$$ 418393 420063 421724 423385 425422 428116 431134 433772 435573 436429 436243 434795 431912 427593 422120 416103
60063D16103n888n541n538n947o399o576o282n314l758k271j533j515j746j990
$$ 416103 410215 404674 399136 393189 386790 380214 373932 368618 364860 362589 361056 359541 357795 355805
60049C55805k127j728n82N55P33K37K63J118J807J593R17M44K11J66N23J057R69
$$ 355805 353678 351950 351368 351923 352656 352893 353156 354274 356081 357674 358591 359035 359246 359412 359935 360992 361961
60032C61961J00o28o25o12j377k447k968l168l772m559m716m318m253m762n143
$$ 361961 362061 361433 360808 360196 358819 356372 353404 350236 346464 341905 337189 332871 328618 323856 318713
60017C18713m937m486m201m071m017m005l763l074k348k183k429k414k116k128
$$ 318713 313776 309290 305089 301018 297001 292996 289233 286159 283811 281628 279199 276785 274669 272541
60003B72541k400k025o57P77J363J335J436J760J958K016K089K005J620J401J857
$$ 272541 270141 268116 267459 268236 269599 270934 272370 274130 276088 278104 280193 282198 283818 285219 287076
59988B87076K628K935K747K794L339L732L392K588J915J540J314J146R09L64m09
$$ 287076 289704 292639 295386 298180 301519 305251 308643 311231 313146 314686 316000 317146 318055 318419 318010
59973C18010q23n45r9k02o96q52n86n78j030j174m33N93R33N01p8n61j105j456
$$ 318010 317187 316642 316543 316341 315645 314793 314207 313629 312599 311425 310992 311585 312518 313019 312941 312380 311275 309819
59955C09819j007J73J065Q41k10j147j369q97j34L68K20m12r02r16p78r42j365
$$ 309819 308812 308985 310050 310891 310681 309534 308165 307268 307134 307502 307722 307310 306408 305492 304714 303772 302407
59938C02407j733j981k255k528k544k197j688j369j453j781j864j333l59N57J146
$$ 302407 300674 298693 296438 293910 291366 289169 287481 286112 284659 282878 281014 279681 279322 279879 281025
59923B81025J420J273O22p8m3P91J559J614J342J364J540J363R46Q79J364K081
$$ 281025 282445 283718 284340 284262 284219 285010 286569 288183 289525 290889 292429 293792 294738 295617 296981 299062
59907B99062K722L053K702J572L73K1N33J092J246J308J499J451Q81J65j32M0
$$ 299062 301784 304837 307539 309111 309484 309505 310038 311130 312376 313684 315183 316634 317515 317680 317548 317588
59891C17588L57O34R52J445K236L309M356M935M968M847M936N156N159M698L832
$$ 317588 317945 318579 319531 320976 323212 326521 330877 335812 340780 345627 350563 355719 360878 365576 369408
59876C69408K936K474K404J882J54k199l523k971j584j014j533k008j634r14p81
$$ 369408 372344 374818 377222 379104 379258 377059 373536 370565 368981 367967 366434 364426 362792 361878 361097
59861C61097j323j854j909j748j813k071k092j634r44m29k79n56j375k605l498
$$ 361097 359774 357920 356011 354263 352450 350379 348287 346653 345709 345280 345001 344445 343070 340465 336967
59846C36967l170j670k13Lr74k103k570k352j728q58JM04K78K65R75K084K655
$$ 336967 333797 332127 331914 331917 330943 328840 326270 323918 322190 321332 321333 321737 322015 322280 323255 325339 327994
59829C27994K381J854J534J022q1j220j575j403j794k940l604k834j442j047j961
$$ 327994 330375 332229 333763 334785 334704 333484 331909 330506 328712 325772 322168 319334 317892 316845 314884
59814C14884k907k770j882j331j562k029k000j357n98k23j94j15J30J54l44j064
$$ 314884 311977 309207 307325 305994 304432 302403 300403 299046 298448 298225 298031 297916 298046 298200 297856 296792
59798B96792j521j720j985k224j994j352j037j455k049k086j647j271r41j59R86
$$ 296792 295271 293551 291566 289342 287348 285996 284959 283504 281455 279369 277722 276451 275510 275351 276337
59783B76337J585J102K22j0M86Q87P08L04J73L53O96J194J632J465M83o57j171
$$ 276337 277922 279024 279246 279236 279722 280609 281317 281621 281794 282147 282843 284037 285669 287134 287617 286960 285789
59766B85789j086r38p76j94P32J375J494J510J648J576J210J079J434J661J250
$$ 285789 284703 283765 282989 282795 283527 284902 286396 287906 289554 291130 292340 293419 294853 296514 297764
59751B97764O66O20R62J095J085J468K209K650K496K101J830J808K141K690K768
$$ 297764 298430 299050 300012 301107 302192 303660 305869 308519 311015 313116 314946 316754 318895 321585 324353
59736C24353J904Q34P72J659K144J574R45J265J947J723M89o98j178j318j627
$$ 324353 326257 327091 327863 329522 331666 333240 334185 335450 337397 339120 339609 338911 337733 336415 334788
59721C34788j962j865j266n50j12L0J84M95O52L03k28j75O25J384J380R18P60
$$ 334788 332826 330961 329695 329145 329033 329063 329247 329742 330394 330697 330469 330294 330919 332303 333683 334601 335361
59704C35361J047J295J232J075R69P95O00P18J285J950K270K134J577N52q20j965
$$ 335361 336408 337703 338935 340010 340979 341774 342374 343092 344377 346327 348597 350731 352308 352860 352040 350075
59688C50075k266j779j216j055r62l96N02J005Q21M30K63L6o77j572j983j868
$$ 350075 347809 346030 344814 343759 342797 342401 342903 343908 344729 345159 345422 345458 344781 343209 341226 339358
59672C39358j872k355k924l055k694k136j716j709k098k386k072j391r68p57r8
$$ 339358 337486 335131 332207 329152 326458 324322 322606 320897 318799 316413 314341 312950 311982 311225 311127
59657C11127R41J270M28l12N13K477L736L413K408J870J863J870J734J572J263
$$ 311127 312068 313338 313766 313454 313967 316444 320180 323593 326001 327871 329734 331604 333338 334910 336173
59642C36173N90l57j233j784j930j791j663j780j958j779j207o12j46M65J190
$$ 336173 336763 336406 335173 333389 331459 329668 328005 326225 324267 322488 321281 320669 320523 320988 322178
59627C22178J357N27o87j269j101r65j336j828k048k309l073m053m417l733k349
$$ 322178 323535 324062 323375 322106 321005 320040 318704 316876 314828 312519 309446 305393 300976 297243 294894
59612B94894q87K45Q89J041Q88P27P37R58J417K040K458K307J793J527J640J505
$$ 294894 294007 294252 295141 296182 297070 297797 298534 299492 300909 302949 305407 307714 309507 311034 312674 314179
59596C14179O73l72q33o83m76m15k31L0k0l10k53K37M05k13j014j264j208j538
$$ 314179 314852 314480 313647 312964 312488 312073 311842 311872 311852 311542 311289 311526 311931 311718 310704 309440 308232 306694
59578C06694k174k477k402k553l005l035k272j302p88n69k52j06n90j276j087
$$ 306694 304520 302043 299641 297088 294083 291048 288776 287474 286686 286117 285865 285759 285169 283893 282806
59563B82806K62J670J887R52nj65K06L90K26J85O77J576K474L143L593L901M193
$$ 282806 283068 284738 286625 287577 287572 287407 287613 288003 288229 288414 289091 290667 293141 296284 299877 303778 307971
59546C07971M705N633O939Q586J0986J4738J9565K3548K3922J9055R866n54q777
$$ 307971 312676 318309 325248 333834 344820 359558 379123 402671 426593 445648 455514 454960 446183
59533D46183j2888j3188j1482r466p575n271k379K76J804K389K973L842M298L847
$$ 446183 433295 420107 408625 399159 391584 386313 383934 384210 386014 388403 391376 395218 399516 403363
59519D03363L055K745K828K519J454rj425k624l486l961m362n160o294p133p224
$$ 403363 406418 409163 411991 414510 415964 415955 414530 411906 408420 404459 400097 394937 388643 381510 374286
59504C74286o660n659m367l221k851l255l584l243k677k531k499j781m21O18P66
$$ 374286 367626 361967 357600 354379 351528 348273 344689 341446 338769 336238 333739 331958 331537 332155 332921
59489C32921M76L55L74K36Mq0k6R6N65J724L424N089O344P183P614P447O528M914
$$ 332921 333397 333752 334126 334362 334366 334286 334260 334356 334921 336645 340069 345158 351502 358685 366299 373746 380274 385188
59471C85188K763L68j599k373j876r72n31m51J4J160K555L768M834N874O775P518
$$ 385188 387951 388319 386720 384347 382471 381499 380968 380517 380531 381691 384246 388014 392848 398722 405497 413015
59455D13015Q361R357J0100J0314J0467J1289J2813J4163J4281J2580R188M838
$$ 413015 421376 430733 440833 451147 461614 472903 485716 499879 514160 526740 535928 540766
59443E40766M44l535p112j0085j1730j1652j0524r459q861q459q138q037p965
$$ 540766 541210 537675 530563 520478 508748 497096 486572 477113 468252 459793 451655 443618 435653
59430D35653p573p051o896o887o075m006j259J390L719N848P923J0209J2918J5890
$$ 435653 428080 421029 414133 407246 401171 397165 395906 397296 401015 406863 414786 424995 437913 453803
59416D53803J9079K3095K8004L1508K9854K1575R335k572j1505j6606j7469j4480
$$ 453803 472882 495977 523981 555489 585343 606918 616253 613681 602176 585570 568101 553621
59404E53621r587m660N70P055J2931J3730O935n001j6998k5557k9889l0402k7859
$$ 553621 544034 539374 539944 546999 559930 573660 580595 575594 558596 533039 503150 472748 444889
59391D44889k3715j9698j6588j3943j1202q551o474n046l947k974k265k012k169
$$ 444889 421174 401476 384888 370945 359743 351192 344718 339672 335725 332751 330486 328474 326305
59378C26305k474k658k523j895p79M65J257J335J025Q56J020J301J374J095N98
$$ 326305 323831 321173 318650 316755 315976 316441 317698 319033 320058 320914 321934 323235 324609 325704 326302
59363C26302K68M22R60J482J849K298K959L666M422N520O867P740P662P173P174
$$ 326302 326570 326992 327952 329434 331283 333581 336540 340206 344628 350148 357015 364755 372417 379590 386764
59348C86764P915R107J0592J2167J3166J3020J2127J1383J0970J0331R219P924
$$ 386764 394679 403786 414378 426545 439711 452731 464858 476241 487211 497542 506761 514685
59336E14685O450M389J755q00k821m480n964p145q022q844r595r900r690r280
$$ 514685 521135 525524 527279 526479 523658 519178 513214 506069 498047 489203 479608 469708 460018 450738
59322D50738q700p641o306n552n771o373o698o799o870o650n969n285n000m774
$$ 450738 442038 434397 428091 422539 416768 410395 403697 396898 390028 383378 377409 372124 367124 362350
59308C62350m117l196k419j707q62k42l02o68n08L49J247J657J590J161M28k39
$$ 362350 358233 355037 352618 350911 350049 349807 349505 348837 348329 348678 349925 351582 353172 354333 354761 354522
59292C54522k52M66J302J674J649J724K174K763K919K294J273Q05J454K749L768
$$ 354522 354270 354736 356038 357712 359361 361085 363259 366022 368941 371235 372508 373313 374767 377516 381284
59277C81284M205M531N183O070O866P455P891Q208Q378Q338Q122P975Q196Q628
$$ 381284 385489 390020 395203 401273 408139 415594 423485 431693 440071 448409 456531 464506 472702 481330
59263D81330Q507P216N028K748P15j283l229m615n126n090m986n008n308o115
$$ 481330 489837 497053 502081 504829 505544 504261 501032 496417 491291 486201 481215 476207 470899 464784
59249D64784p144p329n937l741k332k191k194j260K22J144J315J518K188K888
$$ 464784 457640 450311 444374 440633 438301 436110 433916 432656 432878 434022 435337 436855 439043 441931
59235D41931L182L238L231K884K012J051M31j10j030k152k989l622m515n602o358
$$ 441931 445113 448351 451582 454466 456478 457529 457960 457850 456820 454668 451679 448057 443542 437940 431582
59220D31582o684o982p289p166o610o256o395o599o579o597o599n877m281k933
$$ 431582 424898 417916 410627 403461 396851 390595 384200 377601 371022 364425 357826 351949 347668 344735
59206C44735k795l241l021k193j815k012j762o66L28N02N19J248K253K402J548
$$ 344735 341940 338699 335678 333485 331670 329658 327896 327230 327558 328060 328579 329827 332080 334482 336030
59191C36030P20P34J322J750J680J290R21Q23J057J470J895K386L101L874M156
$$ 336030 336750 337484 338806 340556 342236 343526 344447 345270 346327 347797 349692 352078 355179 359053 363209
59176C63209L654K874K798L957N854P369P695O952N997N617N814N944N536M891
$$ 363209 366863 369737 372535 376492 382346 389715 397410 404362 410359 415976 421790 427734 433270 438161
59162D38161M613M758M804M503M190M081L699K486O67r93k115k915l620m177m558
$$ 438161 442774 447532 452336 456839 461029 465110 468809 471295 471962 470969 468854 465939 462319 458142 453584
59147D53584m840m998m942m826m833m772m350l813l619l556k929j794j159j551
$$ 453584 448744 443746 438804 433978 429145 424373 420023 416210 412591 409035 406106 404312 403153 401602
59133D01602k142j913j068n42n61n06K4P38J296J754K278K846L339L710M062M672
$$ 401602 399460 397547 396479 395937 395376 394870 394894 395632 396928 398682 400960 403806 407145 410855 414917 419589
59117D19589N790P214Q302Q698Q786R090R512R603R382R348R787J0477J1073J1337
$$ 419589 425379 432593 440895 449593 458379 467469 476981 486584 495966 505314 515101 525578 536651 547988
59103E47988J1067J0203R044Q089P579P372P155O594N460L912K454J367L76p50
$$ 547988 559055 569258 578302 586391 593970 601342 608497 615091 620551 624463 626917 628284 628660 627910
59089F27910j631j798j594j807k491k870k606k499l529n566p542q624q905q908
$$ 627910 626279 624481 622887 621080 618589 615719 613113 610614 607085 601519 593977 585353 576448 567540
59075E67540q863q695q529q757r486j0209j0390j0147r840r249p867o072n058
$$ 567540 558677 549982 541453 532696 523210 513001 502611 492464 482624 473375 465508 459436 454378
59062D54378n299n827n623m891m359m029l573l273l551l885l423k473k141k537
$$ 454378 449079 443252 437629 432738 428379 424350 420777 417504 413953 410068 406645 404172 402031 399494
59048C99494k511j453k07J93j58n21n11j43M67J013J125J009J362K285K938K737
$$ 399494 396983 395530 395323 395516 395358 394837 394326 394183 394650 395663 396788 397797 399159 401444 404382 407119
59032D07119K276K480L352M136M425M468M691N366O595Q105R272R733R873J0443
$$ 407119 409395 411875 415227 419363 423788 428256 432947 438313 444908 453013 462285 472018 481891 492334
59018D92334J1760J3439J4628J4371J2228Q875N761L782K615J518K88r27k152
$$ 492334 504094 517533 532161 546532 558760 567635 573396 577178 579793 581311 581599 580672 578520
59005E78520l288l696k879j280J72J126J787K156K103K075K702L628L615K188
$$ 578520 575232 571536 568657 567377 567549 568675 570462 572618 574721 576796 579498 583126 586741 588929
58991E88929M04m92n01n01r77j844l062m684o388p628q294q659q727q199p191
$$ 588929 589333 588841 588340 587839 586862 585018 581956 577272 570884 563256 554962 546303 537576 529377 522186
58976E22186o305n729m843l216j431l95j17J30O00Q23O05N78J346K680L902M774
$$ 522186 515881 510152 505309 502093 500662 500267 500150 500280 500880 501703 502308 502886 504232 506912 510814 515588
58960E15588N552O407P119P283O605N208L668K503J488m5k102l832m761n536o727
$$ 515588 521140 527547 534666 541949 548554 553762 557430 559933 561421 561376 559274 555442 550681 545145 538418
58945E38418p541o715m459k472j991k677l611m492n526o766q087r383j0419j0747
$$ 538418 530877 524162 519703 517231 515240 512563 508952 504460 498934 492168 484081 474698 464279 453532
58931D53532j0112q720p024n379m002k921j984j166p88j071j567j604j209j012
$$ 453532 443420 434700 427676 422297 418295 415374 413390 412224 411436 410365 408798 407194 405985 404973
58917D04973j189j186o27J49P34J234J958K912L900M696N052N026N272O351P716
$$ 404973 403784 402598 401971 402120 402854 404088 406046 408958 412858 417554 422606 427632 432904 439255 446971
58902D46971Q153P385O335N584M602L074J946K246L641N032O024O909P731Q351
$$ 446971 455124 462509 468844 474428 479030 482104 484050 486296 489937 494969 500993 507902 515633 523984
58888E23984R132J0560J2408J4049J5392J6680J7517J7096J5359J3092J0824Q401
$$ 523984 533116 543676 556084 570133 585525 602205 619722 636818 652177 665269 676093 684494
58876F84494N737L109N22k487o085r684j2542j4424j5460j5802j5585j4955j3925
$$ 684494 690231 693340 693862 691375 685290 675606 663064 648640 633180 617378 601793 586838 572913
58863E72913j2452j0750r220q084p329o944o925p062p108p104p235p464p620p689
$$ 572913 560461 549711 540491 532407 525078 518134 511209 504147 497039 489935 482700 475236 467616 459927
58849D59927p570o860n419m024l661m182m415l741k832k584k969l329l246k722
$$ 459927 452357 445497 440078 436054 432393 428211 423796 420055 417223 414639 411670 408341 405095 402373
58835D02373j955j331j264j671j930j664j249j240j595j816j622j134o19l79o44
$$ 402373 400418 399087 397823 396152 394222 392558 391309 390069 388474 386658 385036 383902 383283 382904 382260
58820C82260j255j622j311n10L17J002J573J801J374M76k39l26LK93L45K18r3
$$ 382260 381005 379383 378072 377562 377879 378881 380454 382255 383629 384105 383866 383540 383543 383836 384181 384399 384306
58803C84306o75j415j868j578n45O22J177Q89J88k88k90jL75R14J735K600L019
$$ 384306 383631 382216 380348 378770 378225 378847 380024 380913 381101 380813 380523 380522 380897 381811 383546 386146 389165
58786C89165K815K420K314K426K386K272K585L366L862L452K502J883J873J989
$$ 389165 391980 394400 396714 399140 401526 403798 406383 409749 413611 417063 419565 421448 423321 425310
58772D25310J685P69p40k561l988m319l604k593j880j452j095q46q15r59j210
$$ 425310 426995 427764 427024 424463 420475 416156 412552 409959 408079 406627 405532 404686 403871 402912 401702
58757D01702j533j778j675j149l67N77J711K797L343L174K719K471K436K363K294
$$ 401702 400169 398391 396716 395567 395200 395777 397488 400285 403628 406802 409521 411992 414428 416791 419085
58742D19085K575L330M111M205L350K242K121L540N611O916P063O874P001P082
$$ 419085 421660 424990 429101 433306 436656 438898 441019 444559 450170 457086 464149 471023 478024 485106
58728D85106O514N472M612M181L978L887L871L620K777J516M21j63k97nQ23K037
$$ 485106 491620 497092 501704 505885 509863 513750 517621 521241 524018 525534 525955 525792 525495 525490 526313 528350
58712E28350L197M035M618M929M706L909L027K589K571K430J640N1k125m459o524
$$ 528350 531547 535582 540200 545129 549835 553744 556771 559360 561931 564361 566001 566052 563927 559468 552944
58697E52944q139r394j0388j1074j1397j1437j1272j0833j0098r185q161o915
$$ 552944 544805 535411 525023 513949 502552 491115 479843 469010 458912 449727 441566 434651
58685D34651n499m426m212m628m840m405l762l489l497l277k728k298k279k334
$$ 434651 429152 424726 420514 415886 411046 406641 402879 399390 395893 392616 389888 387590 385311 382977
58671C82977j812l71J617L215L604K960K511L317N029O280O354N904N797N890
$$ 382977 381165 380794 382411 385626 389230 392190 394701 398018 403047 409327 415681 421585 427382 433272
58657D33272N397M150K764J695O94n96j962k827k936k610k359k435k709k945l017
$$ 433272 438669 442819 445583 447278 447972 447376 445414 442587 439651 437041 434682 432247 429538 426593 423576
58642D23576k900k494j682n93L29O78M52N6n3L13R45J400J444J320J462J923K255
$$ 423576 420676 418182 416500 415907 416236 416914 417366 417422 417369 417682 418627 420027 421471 422791 424253 426176 428431
58625D28431K032J299M34k00m28l03p0J08M16J130K103K911L553M532O035P510
$$ 428431 430463 431762 432196 431996 431568 431265 431195 431303 431719 432849 434952 437863 441416 445948 451983 459493
58609D59493Q304Q343P913P216O464N883N248L965K097P43P21J291J058k23j606
$$ 459493 467797 476140 484053 491269 497733 503616 508864 512829 514926 515669 516390 517681 518739 518516 516910
58594E16910k503l191l793l789k892j623n89K35J112J953K511K825L142L696M656
$$ 516910 514407 511216 507423 503634 500742 499119 498530 498765 499877 501830 504341 507166 510308 514004 518660
58579E18660N934O934O996O297N800O038O370N837M419L037K614L329M636N691
$$ 518660 524594 531528 538524 544821 550621 556659 563029 568866 573285 576322 578936 582265 586901 592592
58565E92592O030O034O548P890R498J0696J1489J2284J3190J3910J4145J3745
$$ 592592 598622 604656 611204 619094 628592 639288 650777 663061 676251 690161 704306 718051
58553G18051J2597J0747Q575O501M535K412K39j333j846j818k372m019o082p583
$$ 718051 730648 741395 749970 756471 761006 763418 763657 762324 760478 758660 756288 752269 746187 738604
58539G38604q416r192j0077j0562j0473j0448j0906j1263j0818r842r053q420
$$ 738604 730188 720996 710919 700357 689884 679436 668530 657267 646449 636607 627554 619134
58527F19134p413o136n244m804m201l160k054j061j9Q05P74%n25k79J73L26N43
$$ 619134 611721 605585 600341 595537 591336 588176 586122 585061 585042 585847 586621 586621 586096 585817 585990 586316 586859
58510E86859J225K026K583L211M152M807M594M003L984M659N478O209O930P259
$$ 586859 588084 590110 592693 595904 600056 604863 609457 613460 617444 622103 627581 633790 640720 647979
58496F47979O537M795K803J145k25j508k749l975n149n975o158n874n484m858
$$ 647979 654516 659311 662114 663259 663034 661526 658777 654802 649653 643678 637520 631646 626162 621304
58482F21304l538j578K61J346J831K309L159M358N702O934P717P666O583M668
$$ 621304 617766 616188 616449 617795 619626 621935 625094 629452 635154 642088 649805 657471 664054 668722
58468F68722K500O38p61j798k451k623k533k646l103l538l602l290k633j459K46
$$ 668722 671222 671860 671099 669301 666850 664227 661694 659048 655945 652407 648805 645515 642882 641423 641669
58453F41669K052L454M279M616M567M228L640K683J318q0r92j388j605j655j310
$$ 641669 643721 647175 651454 656070 660637 664865 668505 671188 672506 672426 671434 670046 668441 666786 665476
58438F65476q44q01r07j60J503K714K516J813K010K991L499L122K767L308M705
$$ 665476 664632 663831 662924 662764 664267 666981 669497 671310 673320 676311 679810 682932 685699 689007 693712
58423F93712O463Q182R627J0755J1692J2259J1788R928P365N167L654K475J449
$$ 693712 700175 708357 717984 728739 740431 752690 764478 774406 781771 786938 790592 793067 794516
58410G94516O37j64j193k122k409k176k083k348k479j972p03J189L290M916N742
$$ 794516 795153 794989 793796 791674 789265 787089 785006 782658 780179 778207 777504 778693 781983 786899 792641
58395G92641O208O749O902N983M375L202K746K220J148N5n63j059j886k689k792
$$ 792641 798849 805598 812500 818483 822858 826060 828806 831026 832174 832229 831666 830607 828721 826032 823240
58380H23240k260j881k177k706k458r58J078K335K322J899K150L146M198M976
$$ 823240 820980 819099 816922 814216 811758 810800 811878 814213 816535 818434 820584 823730 827928 832904
58366H32904N716O572P384Q056Q630R051R319R696J0321J0797J0736J0462J0507
$$ 832904 838620 845192 852576 860632 869262 878313 887632 897328 907649 918446 929182 939644 950151
58353I50151J0632J0135R040Q138P791P437O532N384M732M950N824O840P562P937
$$ 950151 960783 970918 979958 988096 995887 1003324 1009856 1015240 1019972 1024922 1030746 1037586 1045148 1053085
58339A053085Q318R006R998J1266J2873J4534J5630J6083J6676J7925J9098J9167
$$ 1053085 1061403 1070409 1080407 1091673 1104546 1119080 1134710 1150793 1167469 1185394 1204492 1223659
58327A223659J8149J6720J4991J2707J0299Q625P771P136O564O464O847P245P570
$$ 1223659 1241808 1258528 1273519 1286226 1296525 1305150 1312921 1320057 1326621 1333085 1339932 1347177 1354747
58314A354747Q155Q964R654J0339J1411J2743J3952J5273J7104J8841J9408J8956
$$ 1354747 1362902 1371866 1381520 1391859 1403270 1416013 1429965 1445238 1462342 1481183 1500591 1519547
58302A519547J8854J9820K1259K2526K3612K4382K4329K3526K2809K2619K2620
$$ 1519547 1538401 1558221 1579480 1602006 1625618 1650000 1674329 1697855 1720664 1743283 1765903
58291A765903K2655K3021K3539K3482K2887K2850K4031K5772K7200K8313K9507
$$ 1765903 1788558 1811579 1835118 1858600 1881487 1904337 1928368 1954140 1981340 2009653 2039160
58280B039160L0836L2129L3257L4021L4438L5147L6731L8645L9838M0461M1756
$$ 2039160 2069996 2102125 2135382 2169403 2203841 2238988 2275719 2314364 2354202 2394663 2436419
58269B436419M4220M7045M9622N2268N5179N7855O0071O2348O5070O8091P1381
$$ 2436419 2480639 2527684 2577306 2629574 2684753 2742608 2802679 2865027 2930097 2998188 3069569
58258C069569P5018P8425Q0775Q2246Q3773Q5518Q6958Q8381R0692R3707R6425
$$ 3069569 3144587 3223012 3303787 3386033 3469806 3555324 3642282 3730663 3821355 3915062 4011487
58247D011487R9176J03567J09961J16844J23191J29588J36510J43479J50568J58843
$$ 4011487 4110663 4214230 4324191 4441035 4564226 4693814 4830324 4973803 5124371 5283214
58237E283214J68590J78918J89653K01667K14819K27829K40786K55472K72400
$$ 5283214 5451804 5630722 5820375 6022042 6236861 6464690 6705476 6960948 7233348
58228G233348K90016L07675L26765L47982L70261L93601M20125M51170M86226
$$ 7233348 7523364 7831039 8157804 8505786 8876047 9269648 9689773 10140943 10627169
58219A0627169N25915N72574O26627O86205P52049Q28545R17975J018822J132583
$$ 10627169 11153084 11725658 12352285 13038490 13790539 14619084 15537059 16555881 17688464
58210A7688464J266690J427135J615254J837315K107160K423435K744522L003121
$$ 17688464 18955154 20382289 21997543 23834858 25942018 28365453 31109975 34113096
58202C4113096L160701L251503L373549L637842M121092M853090N834953P064065
$$ 34113096 37273797 40525300 43898849 47536691 51657783 56510873 62345826 69409891
58194F9409891Q546783J0299067J2344598J4709656J7405339K0397935K3572149
$$ 69409891 77956674 88255741 100600339 115309995 132715334 153113269 176685418
58187A76685418K6668062K9177417L0277171K8969369K4501938J6869058P016986
$$ 176685418 203353480 232530897 262808068 291777437 316279375 333148433 340165419
58180C40165419l446672j2863858k0072035k4625466k6697931k6825081k5639784
$$ 340165419 336718747 323854889 303782854 279157388 252459457 225634376 199994592
58173A99994592k3691421k1378208j8963294j6615158j4434891j2472995j0746710
$$ 199994592 176303171 154924963 135961669 119346511 104911620 92438625 81691915
58166H1691915r253799p977869o892655n970521n188262m525233l960918l477628
$$ 81691915 72438116 64460247 57567592 51597071 46408809 41883576 37922658 34445030
58158C4445030l062982k707128k399797k132039j898457j695364j518368j363437
$$ 34445030 31382048 28674920 26275123 24143084 22244627 20549263 19030895 17667458
58150A7667458j228449j111678j010081r20453q41002p70548p07490o50619n99689
$$ 17667458 16439009 15327331 14317250 13396797 12555795 11785247 11077757 10427138 9827449
58141I827449n54092n12222m73026m36958m04578l75328l48334l23323l00143
$$ 9827449 9273357 8761135 8288109 7851151 7446573 7071245 6722911 6399588 6099445
58132F099445k78573k58982k41908k26652k11742j97095j84133j73316j63360
$$ 6099445 5820872 5561890 5319982 5093330 4881588 4684493 4500360 4327044 4163684
58123D163684j53513j44692j37483j30786j23644j16824j11241j06212j00650
$$ 4163684 4010171 3865479 3727996 3597210 3473566 3356742 3245501 3139289 3038639
58114C038639r4971r0382q7063q4249q1435p8488p5200p1611o8215o5143o1824
$$ 3038639 2943668 2853286 2766223 2681974 2600539 2522051 2446851 2375240 2307025 2241882 2180058
58103B180058n8107n4854n2650n0795m8450m6040m4505m3761m2878m1406l9677
$$ 2180058 2121951 2067097 2014447 1963652 1915202 1869162 1824657 1780896 1738018 1696612 1656935
58092A656935l8048l6543l5068l3467l1637k9824k8438k7366k6031k4391k3154
$$ 1656935 1618887 1582344 1547276 1513809 1482172 1452348 1423910 1396544 1370513 1346122 1322968
58081A322968k2719k2597k2233k1741k1442k1351k1507k2063k2717k2784k2255
$$ 1322968 1300249 1277652 1255419 1233678 1212236 1190885 1169378 1147315 1124598 1101814 1079559
58070A079559k1961k2228k2194k1031j9133j7462j6377j5639j5021j4355j3518
$$ 1079559 1057598 1035370 1013176 992145 973012 955550 939173 923534 908513 894158 880640
58059H80640j2775j2593j2822j2749j2232j1930j2015j1726j0780j0202j0835
$$ 880640 867865 855272 842450 829701 817469 805539 793524 781798 771018 760816 749981
58048G49981j1877j1896j0771r663r455j0001j0644j0776j0139r081q367q340
$$ 749981 738104 726208 715437 705774 696319 686318 675674 664898 654759 645678 637311 628971
58036F28971q649q879q915q489p266n723n013n491o242o625p174q240q826p935
$$ 628971 620322 611443 602528 594039 586773 581050 576037 570546 564304 557679 550505 542265 533439 525504
58022E25504o274n432n840o590o826o326n159l754k973l227l870m140m172m243
$$ 525504 519230 513798 507958 501368 494542 488216 483057 479303 476330 473103 469233 465093 460921 456678
58008D56678l843k557j290j230j989k099j193l45k68n03n15m45m61l64j81k94
$$ 456678 452835 450278 448988 447758 445769 443670 442477 442132 441864 441361 440846 440401 439940 439576 439395 439101
57992D39101p48j227j812k933m337m953m211k810j829j557j513j194n58j06m80
$$ 439101 438353 437126 435314 432381 428044 423091 418880 416070 414241 412684 411171 409977 409419 409313 408833
57977D08833j690k817k971k382k038k428l254m184n084n563n173m161l309k914
$$ 408833 407143 404326 401355 398973 396935 394507 391253 387069 381985 376422 371249 367088 363779 360865
57963C60865k572k033j592j474j535j670j825j582n45P27R76k09j894l042l496
$$ 360865 358293 356260 354668 353194 351659 349989 348164 346582 346037 346764 347740 347531 345637 342595 339099
57948C39099l439k804j752r76q61q68l33O57J709K825M068N041N413N629O336
$$ 339099 335660 332856 331104 330128 329267 328399 328066 328723 330432 333257 337325 342366 347779 353408 359744
57933C59744P355P949P911P621P139N961L833J182j470m002o384q244r192r360
$$ 359744 367099 375048 382959 390580 397719 403680 407513 408695 407225 403223 396839 388595 379403 370043
57919C70043r321r480r766r888r713r287q623p700o659n784n153m442l312j959
$$ 370043 360722 351242 341476 331588 321875 312588 303965 296265 289606 283822 278669 274227 270915 268956
57905B68956r91p80j135j681k326l104l744l750l023k209k088k589k744j882o21
$$ 268956 267965 267185 266050 264369 262043 258939 255195 251445 248422 246213 244125 241536 238792 236910 236289
57890B36289j26m84m84O93K283K921K348J471R77P22L98N0k35n95j075j509j877
$$ 236289 236163 235679 235195 235888 238171 241092 243440 244911 245888 246610 247008 247058 246823 246228 245153 243644 241767
57873B41767k418l150l658l561k972k240j541q68l00K6J55M33J210K440L539L922
$$ 241767 239349 236199 232541 228980 226008 223768 222227 221359 221059 221085 221240 221673 222883 225323 228862 232784
57857B32784L695L587M018M614M841M654M188L310K039J023Q11R40M53q00k165
$$ 232784 236479 240066 244084 248698 253539 258193 262381 265691 267730 268753 269564 270504 270957 270157 267992
57842B67992l292m327n131n286n015n033n271m810l461k280j933j583l61J012
$$ 267992 264700 260373 255242 249956 244941 239908 234637 229827 226366 224086 222153 220570 220209 221221
57828B21221J207L25k62R1O19N55J83K10P35J240J206N20m75j194j307j094j137
$$ 221221 222428 222753 222491 222582 223201 223756 223939 224149 224884 226124 227330 227850 227375 226181 224874 223780 222643
57811B22643j670k503l398m227m778m808m397l943l763l853l990l901l338k321
$$ 222643 220973 218470 215072 210845 206067 201259 196862 192919 189156 185303 181313 177412 174074 171753
57797A71753j295q05q92j015o78m6K05l42j294j801j472p48k48O4O74J644K471
$$ 171753 170458 169653 168761 167746 167068 167022 167227 166885 165591 163790 162318 161570 161322 161386 162060 163704 166175
57780A66175K852L040L262L327L131L008L134L030K214J012J37k81o21r59j042
$$ 166175 169027 172067 175329 178656 181787 184795 187929 190959 193173 194185 194322 194041 193420 192461 191419
57765A91419j045j587k768l840m128l874l770m043m311m220l833l423l118k840
$$ 191419 190374 188787 186019 182179 178051 174177 170407 166364 162053 157833 154000 150577 147459 144619
57751A44619k473k084j928k159k575k739k365j563p39l24m16o23m07K93R36J079
$$ 144619 142146 140062 138134 135975 133400 130661 128296 126733 125994 125670 125254 124631 124224 124517 125453 126532
57735A26532R46R61R90N41l27r09q17m95m59m39J25J005J265N03m92o63O8R07
$$ 126532 127478 128439 129429 129970 129643 128734 127917 127422 126963 126524 126649 127654 128919 129422 128930 128267 128335 129242
57717A29242J330J566J930K201J973J237K39r25k060k478j522M57K217K970L060
$$ 129242 130572 132138 134068 136269 138242 139479 139718 138793 136733 134255 132733 133190 135407 138377 141437
57702A41437L209L601M071M629N244N380M362K130o49l155m764n208m771m229
$$ 141437 144646 148247 152318 156947 162191 167571 171933 174063 173414 170259 165495 160287 155516 151287
57688A51287m092m048l500k489j604j052l97P90K442M267O105P911R719J1737
$$ 151287 147195 143147 139647 137158 135554 134502 134105 134895 137337 141604 147709 155620 165339 177076
57674A77076J4272J7514K1601K6843L3541M1457M9616N6218N8448N2983L8034
$$ 177076 191348 208862 230463 257306 290847 332304 381920 438138 496586 549569 587603
57663E87603J5552r021k9774m3340m9488m9910m6852m2225l7103l1872k6919k2777
$$ 587603 603155 594134 564360 521020 471532 421622 374770 332545 295442 263570 236651 213874
57651B13874j9489j6464j3389j0832r371q520p221n275l535k631k196j542n67
$$ 213874 194385 177921 164532 153700 144329 135809 128588 123313 119778 117147 114951 113409 112842
57638A12842K71O17N36L44K45P4n66j665k496k332j446r34j322j916j843j258
$$ 112842 113113 113730 114266 114610 114855 114929 114363 112698 110202 107870 106424 105490 104168 102252 100409 99151
57622I9151r71j153j165o53j92m90j406k126k130j666j313j409j853k293k355
$$ 99151 98180 97027 95862 95209 95017 94527 93121 90995 88865 87199 85886 84477 82624 80331 77976
57607G7976j851r00J25Q27R98P26L16O3N8J67K07P7j68l14r1M57Q32N11m06j288
$$ 77976 76125 75225 75350 76177 77175 77901 78217 78280 78338 78505 78712 78789 78621 78307 78216 78673 79505 80016 79610 78322
57587G8322j752j977k104j819r47j6L22K23L15O58P01K71j69l62o13j015j070
$$ 78322 76570 74593 72489 70670 69723 69707 70029 70252 70567 71225 71926 72197 72028 71666 71053 70038 68968
57570F8968n06J28K11j34m60p14r16p14L7O32L76k41j63N90Q92K10o35p11q6P06
$$ 68968 68462 68590 68801 68667 68207 67493 66577 65863 65900 66532 66908 66667 66504 67094 67986 68196 67561 66850 66764 67470
57550F7470J481K143K170J188k59j150j069m40J53M53M48K79J94L18M08R6o15
$$ 67470 68951 71094 73264 74452 74193 73043 71974 71534 71687 72140 72588 72867 73061 73379 73787 73883 73268
57533G3268j291j455r68q7P15J061J016R73J106J138P82K90K49Q57J643J947J594
$$ 73268 71977 70522 69554 69467 70182 71243 72259 73232 74338 75476 76258 76548 76797 77654 79297 81244 82838
57516H2838J034Q91J333J910K011J466O04j67o23o50l09m4m15j382k135j958j003
$$ 82838 83872 84763 86096 88006 90017 91483 92087 91920 91297 90647 90338 90294 89879 88497 86362 84404 83401
57499H3401J0O49R33R13N49lm24o07o69n91k56J29O9m98q75m16N40R90M84l39
$$ 83401 83411 84060 84993 85906 86455 86452 86028 85421 84752 84161 83905 84034 84103 83605 82730 82314 82854 83844 84328 83989
57479H3989o06k14J97R6m61j066j427j492j420j476j740j903j532o99nJ70J30
$$ 83989 83383 83169 83366 83462 83001 81935 80508 79016 77596 76120 74380 72477 70945 70246 70241 70411 70541
57462G0541L17O58Q26Q84J137J471J470J109Q30Q42Q95Q00O99O15L57N4K28R65
$$ 70541 70858 71516 72342 73226 74363 75834 77304 78413 79243 80085 80980 81780 82479 83094 83451 83505 83733 84698
57444H4698J572J461R55P15Q15Q99Q91R68J063R62P68P38P66N86L41M06P19Q13
$$ 84698 86270 87731 88686 89401 90216 91115 92006 92974 94037 94999 95767 96505 97271 97857 98198 98604 99323 100136
57426A00136M99L3l64p27r95j011q41o55l41L32J070J278R67Q17J111J230N76
$$ 100136 100635 100668 100304 99577 98582 97571 96730 96075 95734 96066 97136 98414 99381 100198 101309 102539 103115
57409A03115n39j310j367q46K8R59J475J338Q68M98K04k70q23j077r23n81j90
$$ 103115 102576 101266 99899 99053 99081 100040 101515 102853 103721 104219 104423 104153 103330 102253 101330 100749 100559
57392A00559K39O41R27J168J363J282Q98P77J418K325K464J671Q56O11M09k89
$$ 100559 100798 101439 102366 103534 104897 106179 107077 107854 109272 111597 114061 115732 116588 117199 117608 117319
57376A17319q65l30J082K001J660P94N41J024J416J074K21m26m27oK07r1m74k48
$$ 117319 116454 116124 117206 119207 120867 121661 122202 123226 124642 125716 125937 125511 125084 125078 125285 125194 124720 124472
57358A24472O46J443J422O98mj33K96Q74J122Q41L59K12M20L82j14k81O10J929
$$ 124472 125118 126561 127983 128681 128677 128544 128840 129714 130836 131677 132036 132248 132668 133050 132936 132655 133265 135194
57340A35194K295J491P49R55J553J684J489J458J303N40k97k20O22J018M87r6
$$ 135194 137489 138980 139729 140684 142237 143921 145410 146868 148171 148711 148414 148194 148816 149834 150321 150225
57324A50225Q4O92J071J246J518J700J507J211J190J187P11K1p6O67J634K179
$$ 150225 150309 151001 152072 153318 154836 156536 158043 159254 160444 161631 162342 162363 162287 162954 164588 166767
57308A66767K254K084J782J452J275J234J047O48M42Q50J733K517K801K669K349
$$ 166767 169021 171105 172887 174339 175614 176848 177895 178543 178985 179835 181568 184085 186886 189555 191904
57293A91904J876J244P88J077K152L131L040K006J151J193J651J800J730J918
$$ 191904 193780 195024 195812 196889 199041 202172 205212 207218 208369 209562 211213 213013 214743 216661
57279B16661K174J946J459J621K629L525L540L098L073L590M230M885N696O363
$$ 216661 218835 220781 222240 223861 226490 230015 233555 236653 239726 243316 247546 252431 258127 264490
57265B64490O315N551M732M363M349M519M934N563O009N954N655N650O046O364
$$ 264490 270805 276356 281088 285451 289800 294319 299253 304816 310825 316779 322434 328084 334130 340494
57251C40494O117N388M763M668M909M999M887N073N835O726P165P216P324P458
$$ 340494 346611 351999 356762 361430 366339 371338 376225 381298 387133 393859 401024 408240 415564 423022
57237D23022P172O561O406P133Q174Q739Q771Q662Q452P933P364P412Q296R423
$$ 423022 430194 436755 443161 450294 458468 467207 475978 484640 493092 501025 508389 515801 524097 533520
57223E33520J0015R882R555R772J0723J1697J1665J0549R515R614J0433J0764
$$ 533520 543535 553417 562972 572744 583467 595164 606829 617378 626893 636507 646940 657704
57211F57704J0340J0120J0689J1370J1271J0566J0142J0401J0992J1447J1647
$$ 657704 668044 678164 688853 700223 711494 722060 732202 742603 753595 765042 776689
57200G76689J1784J2146J2773J3189J2918J2460J3112J5299J7604J8284J7306
$$ 776689 788473 800619 813392 826581 839499 851959 865071 880370 897974 916258 933564
57189I33564J6186J6014J6567J7184J7526J7367J6575J5645J5449J6032J6381
$$ 933564 949750 965764 982331 999515 1017041 1034408 1050983 1066628 1082077 1098109 1114490
57178A114490J5832J4996J4793J5176J5445J5276J4712J3680J2339J1606J2318
$$ 1114490 1130322 1145318 1160111 1175287 1190732 1206008 1220720 1234400 1246739 1258345 1270663
57167A270663J3962J5040J4869J4195J3920J3942J3663J3020J2451J2199J2140
$$ 1270663 1284625 1299665 1314534 1328729 1342649 1356591 1370254 1383274 1395725 1407924 1420064
57156A420064J2154J2289J2584J2999J3495J4050J4560J4875J4868J4513J3979
$$ 1420064 1432218 1444507 1457091 1470090 1483585 1497635 1512195 1527070 1541938 1556451 1570430
57145A570430J3574J3425J3224J2576J1634J1063J1290J2018J2649J2915J2908
$$ 1570430 1584004 1597429 1610653 1623229 1634863 1645926 1657216 1669234 1681883 1694798 1707706
57134A707706J2730J2422J2126J2104J2532J3395J4403J5057J4967J4336J3915
$$ 1707706 1720436 1732858 1744984 1757088 1769620 1783015 1797418 1812475 1827442 1841778 1855693
57123A855693J4311J5503J7170J9219K1722K4511K7303L0133L3292L6759M0091
$$ 1855693 1870004 1885507 1902677 1921896 1943618 1968129 1995432 2025565 2058857 2095616 2135707
57112B135707M3037M6011M9654N4167N9315O5096P2147Q1413R3510J08574J26655
$$ 2135707 2178744 2224755 2274409 2328576 2387891 2452987 2525134 2606547 2700057 2808631 2935286
57101B935286J48146J73778K04381K40876K84546L37061M00114M74904N61859
$$ 2935286 3083432 3257210 3461591 3702467 3987013 4324074 4724188 5199092 5760951
57092E760951O60393P68607Q83242R99946J113545J218034J306740J372889J410225
$$ 5760951 6421344 7189951 8073193 9073139 10186684 11404718 12711458 14084347 15494572
57083A5494572J413027J376077J295432J170089J003605Q04398N84115L54349
$$ 15494572 16907599 18283676 19579108 20749197 21752802 22557200 23141315 23495664
57075B3495664J23465j04052l25161n35253p27708q95985j035463j143290j217513
$$ 23495664 23619129 23515077 23189916 22654663 21926955 21030970 19995507 18852217 17634704
57066A7634704j257332j264136j241731j195471j131228j054845r71756q86569
$$ 17634704 16377372 15113236 13871505 12676034 11544806 10489961 9518205 8631636
57058H631636q02833p23072o48742n80240n17252m59524m07296l60960l20399
$$ 8631636 7828803 7105731 6456989 5876749 5359497 4899973 4492677 4131717 3811318
57049C811318k84831k53424k25925k02568j83389j67792j54766j43416j33204
$$ 3811318 3526487 3273063 3047138 2844570 2661181 2493389 2338623 2195207 2062003
57040B062003j24007j16063j09648j04485r9640r4346q8813q3786p9360p4758
$$ 2062003 1937996 1821933 1712285 1607800 1508160 1413814 1325001 1241215 1161855 1087097
57030A087097o9457o3923n8860n4240m9541m4728m0346l6704l3486l0272k7052
$$ 1087097 1017640 953717 894857 840617 791076 746348 706002 669298 635812 605540 578488
57019E78488k4030k1259j8725j6602j5127j4251j3563j2676j1588j0646j0122
$$ 578488 554458 533199 514474 497872 482745 468494 454931 442255 430667 420021 409899
57008D09899r932r845r823r930r953r423q212o869o077n870n683n149m543m357
$$ 409899 399967 390122 380299 370369 360416 350993 342781 335912 329835 323965 318282 313133 308590 304233
56994C04233m551m511l693k243q24J37Q34J677K688L599M393N332O349O777N937
$$ 304233 299682 295171 291478 289235 288411 288548 289382 291059 293747 297346 301739 307071 313420 320197 326134
56979C26134L815J045j638l806n472o845p902q187p425o160n266m813m068k777
$$ 326134 329949 330994 329356 325550 320078 313233 305331 297144 289719 283559 278293 273480 269412 266635
56965B66635j595r02k0J673L628M962N863P097Q559R447R664R751R365P233L041
$$ 266635 265040 264138 264118 265791 269419 274381 280244 287341 295900 305347 315011 324762 334127 341360 344401
56950C44401j710n340p617r208j0292j0576j0102r195p915o191m319k691j239
$$ 344401 342691 337351 329734 320526 310234 299658 289556 280361 272446 266255 261936 259245 258006
56937B58006M21K411M556O789R137J1426J3328J4627J5160J4604J2570Q855L607
$$ 258006 258427 260838 265394 272183 281320 292746 306074 320701 335861 350465 363035 371890 375497
56924C75497k536q333j2454j4406j4771j4331j3364j1949j0462r292q362p385
$$ 375497 372961 364628 352174 337768 322997 308666 295302 283353 272891 263599 255237 247852
56912B47852o313n266m314l667l632m023l970k866j145L64J490K535L401L718
$$ 247852 241539 236273 231959 228292 224660 220637 216667 213801 212656 213020 214510 217045 220446 224164
56898B24164L668L922M723N646O317O779P113P246P283P541Q198R191J0447J1673
$$ 224164 227832 231754 236477 242123 248440 255219 262332 269578 276861 284402 292600 301791 312238 323911
56884C23911J2028J0602P415L395o87m732q594j1500j2672j2225j1046r841q587
$$ 323911 335939 346541 353956 357351 356664 351932 343338 331838 319166 306941 295895 286054 277467
56871B77467o794m130q01K607N656Q382J1186J4487J8525K3193K7881L1853L4875
$$ 277467 270673 266543 265742 268349 274005 282387 293573 308060 326585 349778 377659 409512 444387
56858D44387L7039L7660L4991K7856J7255N653n011j3864k0182k3207k3197k1509
$$ 444387 481426 519086 554077 581933 599188 604841 599830 585966 565784 542577 519380 497871
56846D97871j9177j6101j1977p173k218K908Q430J4290K0487K7348L4869M2332
$$ 497871 478694 462593 450616 443443 441225 444133 452563 466853 487340 514688 549557 591889
56834E91889M9107N5205O0175O1861N7406M5694K8368Q454j1286k8685m1901m9767
$$ 591889 640996 696201 756376 818237 875643 921337 949705 958159 946873 918188 876287 826520
56822H26520n2447n1318m7981m3330l7538l0754k3620j6878j0709m645J775Q572
$$ 826520 774073 722755 674774 631444 593906 563152 539532 522654 511945 507300 509075 517647
56810E17647J5575K2732K9916L6499M1322M3061M0633L3536K2035P174r201k4491
$$ 517647 533222 555954 585870 622369 663691 706752 747385 780921 802956 810130 800929 776438
56798G76438l6020m2433m4541m4321m2972m0326l6087l0833k5498k0391j5309
$$ 776438 740418 697985 653444 609123 566151 525825 489738 458905 433407 413016 397707
56787C97707j0208n330q12L451P632J1824J5852J9104K0756K0300J7549J2242
$$ 397707 387499 382169 381357 384808 392440 404264 420116 439220 459976 480276 497825 510067
56775E10067M275n381j4633k1662k6029k8138k8251k6699k4459k2596k1128j9275
$$ 510067 514342 508961 494328 472666 446637 418499 390248 363549 339090 316494 295366 276091
56763B76091j6828j4526j2904j1530r796q032p168p409p778p182n636m134l438
$$ 276091 259263 244737 231833 220303 210507 202475 195307 187898 180120 172938 167302 163168 159730
56750A59730l420l646m019m433m305l210j770j135j451j708j210m45j04j21j62
$$ 159730 156310 152664 148645 144212 139907 136697 134927 133792 132341 130633 129423 128978 128874 128753 128591
56735A28591l77r46j407j171m13K21M49M07J69k34n04l96o4K63O58J075J118P43
$$ 128591 128214 127268 125861 124690 124277 124498 124947 125354 125523 125289 124785 124389 124325 124588 125246 126321 127439 128182
56717A28182O79J366J983J448Q7p35m78L8m3o64j331j643j258j08J111J406O63
$$ 128182 128861 130227 132210 133658 133745 133010 132532 132570 132527 131863 130532 128889 127631 127523 128634 130040 130703
56700A30703k29n24l13K7L02K31m55j374j595q02K20N99L91J94K51L29J41l60
$$ 130703 130474 129950 129637 129664 129966 130197 129742 128368 126773 125971 126191 126790 127181 127375 127626 127955 128096 127736
56682A27736r09j009m20L93P31N55L90L92K06j89k84O1L65M66Q10J420J441M75
$$ 127736 126827 125818 125398 125791 126522 127077 127467 127859 128065 127876 127592 127653 128018 128484 129294 130714 132155 132630
56664A32630m75k47Q86J747J930J953K035J757R61J63j94k41l23n64r61j406j538
$$ 132630 132155 131908 132794 134541 136471 138424 140459 142216 143177 143340 143146 142905 142582 142018 141057 139651 138113
56647A38113r88M4Q19Q63M43J10K1j07m90r34j060p70l94k39j18L97J256J827
$$ 138113 137125 137169 137988 138851 139294 139404 139425 139318 138828 137894 136834 136064 135670 135431 135313 135710 136966 138793
56629A38793J696J173P80O14N08N75R74J428J423R32M39K56K33K07K99N37O10
$$ 138793 140489 141662 142442 143056 143564 144139 145113 146541 147964 148896 149335 149591 149824 150031 150330 150867 151477
56612A51477K13n05j088j196p40J61J173J771J591Q14J6m24o02p65q69o90k61
$$ 151477 151690 151185 150097 148901 148161 148322 149495 151266 152857 153671 153687 153263 152661 151896 151027 150337 150076
56595A50076N9M8j14j15J03L77N61N34J87l79p89q10o83p26p82m98n7n5n66r20
$$ 150076 150135 150183 150069 149954 150057 150434 150995 151529 151716 151337 150548 149738 149055 148329 147547 147049 146992 146937 146371 145451
56575A45451n71J89P38R32J090J423J842K153K221K040J865K122K957M017M838
$$ 145451 144880 145069 145807 146739 147829 149252 151094 153247 155468 157508 159373 161495 164452 168469 173307
56560A73307N373N890O500O949O899O272N360M650M423M566M775M921M958M660
$$ 173307 178680 184570 191070 198019 204918 211190 216550 221200 225623 230189 234964 239885 244843 249503
56546B49503L778K530J523J033O66j9q56j349j404j444j839k461k893l037l336
$$ 249503 253281 255811 257334 258367 259033 259014 258158 256809 255405 253961 252122 249661 246768 243731 240395
56531B40395m274n583o267n656m197k874k071j471r19p62j177j827k338k702k959
$$ 240395 236121 230538 224271 218615 214418 211544 209473 208002 207083 206321 205144 203317 200979 198277 195318
56516A95318k968k690k395k316k364k324k020j299k96L65R8p74j295j107p74p69
$$ 195318 192350 189660 187265 184949 182585 180261 178241 176942 176646 177011 177109 176335 175040 173933 173159 172390
56500A72390q71q05p04o08k42K81L18k68o90m24l1r5j76L65J128J271P92K54k68
$$ 172390 171519 170714 170010 169402 169160 169441 169759 169491 168801 168377 168346 168251 168075 168440 169568 170839 171631 171885 171617
56481A71617r51j352r39j97n0l56k45K32J39n03l65J155K775K958J828O45Q6j16
$$ 171617 170666 169314 168375 168178 168128 167772 167527 167759 167898 167395 167030 168185 170960 173918 175746 176391 176477 176361
56463A76361k21o4M61J084J414J272Q36N01M78N14K62j19j34K81O32O45O34R07
$$ 176361 176140 176076 176537 177621 179035 180307 181143 181644 182122 182636 182898 182779 182645 182926 183558 184203 184837 185744
56445A85744J260J369J273J142R08M34j12m10l47j05O7L1j04n5K80N88N06J72
$$ 185744 187004 188373 189646 190788 191696 192130 192018 191608 191261 191156 191223 191254 191150 191095 191375 191963 192469 192641
56427A92641K1J63L62N80R87J319R07k89j280j112o9P09O02N2j86R5N45P83P61
$$ 192641 192662 192825 193187 193767 194754 196073 196980 196691 195411 194299 194230 194939 195541 195593 195407 195502 196047 196830 197591
56408A97591O63O03N34M60N08O90P58N48L05L53N92O11K78j60m56n12j95N78J545
$$ 197591 198254 198857 199391 199851 200359 201049 201807 202355 202660 203013 203605 204216 204494 204334 203878 203366 203171 203749 205294
56389B05294K286K710K993L072K655J770Q52K03k26n26p11r15j242j415j137p78
$$ 205294 207580 210290 213283 216355 219010 220780 221632 221835 221609 221083 220372 219457 218215 216800 215663 214885
56373B14885r81j476j166K68J639J728Q49K83O28J457K201K523K067O98q54j368
$$ 214885 213904 212428 211262 211530 213169 214897 215746 216029 216657 218114 220315 222838 224905 225603 224749 223381
56357B23381m18J139K199K485K395K178J699R49K96J18L36N32M62L12L81O89J072
$$ 223381 222963 224102 226301 228786 231181 233359 235058 236007 236303 236421 236757 237289 237751 238063 238444 239133 240205
56340B40205J451J787J935J861J888K326K831K657J686Q53J143K384L378L151
$$ 240205 241656 243443 245378 247239 249127 251453 254284 256941 258627 259480 260623 263007 266385 269536
56326B69536J890N97P2K63N51N36L77L58M20L30Q0j74l58l09L02J385K004J321
$$ 269536 271426 272023 272095 272358 272909 273445 273822 274180 274600 274930 275010 274836 274478 274169 274471 275856 277860 279181
56308B79181l7m01Q51K412K733J948J437J894K629K739K209J691J577J688J656
$$ 279181 279144 278743 279594 282006 284739 286687 288124 290018 292647 295386 297595 299286 300863 302551 304207
56293C04207J374J014P86P64R31J256J671K082K523L072L525L372K402J152M52
$$ 304207 305581 306595 307381 308145 309076 310332 312003 314085 316608 319680 323205 326577 328979 330131 330583
56278C30583O48J490K522L232L182K526K158K786M013M973N526O089O492O165
$$ 330583 331231 332721 335243 338475 341657 344183 346341 349127 353140 358113 363639 369728 376220 382385
56264C82385N473N644P000Q265Q307P589P277P653Q322R280J0895J3093J5429
$$ 382385 387858 393502 400502 408767 417074 424663 431940 439593 447915 457195 468090 481183 496612
56251D96612J7810K0475K3310K5811K7641K8884K9806L0719L1892L3226L4152
$$ 496612 514422 534897 558207 584018 611659 640543 670349 701068 732960 766186 800338
56240H00338L4068L2736L0209K6690K2644J8516J4149R035L351j906o218j0218
$$ 800338 834406 867142 897351 924041 946685 965201 979350 988385 991736 989830 983612 973394
56228I73394j4491j8421k1041k2510k3784k5185k6137k6216k5583k4507k3126
$$ 973394 958903 940482 919441 896931 873147 847962 821825 795609 770026 745519 722393
56217G22393k1684k0371j8976j7227j5374j3946j3018j2305j1707j1241j0606
$$ 722393 700709 680338 661362 644135 628761 614815 601797 589492 577785 566544 555938
56206E55938r508q251p333o566n367l832k710k233j761q40J35N91O10O65R54J305
$$ 555938 546430 538179 530846 524280 518913 515081 512371 510138 508377 507537 507672 508263 508873 509538 510492 511797
56190E11797J516J496J322J206J270J300R74L15k71l54K98J680L271M148L812
$$ 511797 513313 514809 516131 517337 518607 519907 520881 521196 520925 520571 520869 522549 525820 529968 533780
56175E33780K898K522L013L765M235M462M570M505M425M752N526O222O553O962
$$ 533780 536678 539200 542213 545978 550213 554675 559245 563750 568175 572927 578453 584675 591228 598190
56161E98190P940R223J0109J0392J0451J0610J0793J0971J1473J2653J4366J6176
$$ 598190 606130 615353 625462 635854 646305 656915 667708 678679 690152 702805 717171 733347
56149G33347J8055K0637K4551K9738L5752M2549N0518N9764O9786P9900Q9337
$$ 733347 751402 772039 796590 826328 862080 904629 955147 1014911 1084697 1164597 1253934
56138A253934R6643R9684R6983Q8940P7575O5331N4441M6722M3043M2613M3149
$$ 1253934 1350577 1450261 1547244 1636184 1713759 1779090 1833531 1880253 1923296 1965909 2009058
56127B009058M1838L6468K6383J3048m77j1189j7679k0408k1216k2692k7252l5814
$$ 2009058 2050896 2087364 2113747 2126795 2126318 2115129 2097450 2077042 2055826 2033134 2005882 1970068
56115A970068m7316n9663p0940p9592q4264q4297q0223p3255o4545n5122m6024
$$ 1970068 1922752 1863089 1792149 1712557 1628293 1543996 1463773 1390518 1325973 1270851 1224827
56104A224827l7909l0744k4387j9023j4688j0915p430m657k909j649k20J151J924
$$ 1224827 1186918 1156174 1131787 1112764 1098076 1087161 1079731 1075074 1072165 1070516 1070296 1071447 1073371
56091A073371K255K661L113L412L943N130O455P098P260P778Q662R085Q822Q599
$$ 1073371 1075626 1078287 1081400 1084812 1088755 1093885 1100340 1107438 1114698 1122476 1131138 1140223 1149045 1157644
56077A157644Q982R760J0571J1361J2155J2962J3846J4668J5070J5185J5773J6985
$$ 1157644 1166626 1176386 1186957 1198318 1210473 1223435 1237281 1251949 1267019 1282204 1297977 1314962
56065A314962J7774J7485J7199J8229K0000K0997K1183K1786K2961K3558K3204
$$ 1314962 1332736 1350221 1367420 1385649 1405649 1426646 1447829 1469615 1492576 1516134 1539338
56054A539338K2923K3472K4560K5845K7187K7830K7005K5551K5299K6535K7675
$$ 1539338 1562261 1585733 1610293 1636138 1663325 1691155 1718160 1743711 1769010 1795545 1823220
56043A823220K7767K7631K8061K8693K9341L0756L3187L5613L7206L8351L9511
$$ 1823220 1850987 1878618 1906679 1935372 1964713 1995469 2028656 2064269 2101475 2139826 2179337
56032B179337M0436M1224M2708M5047M7198M8608N0061N2153N4239N5735N7154
$$ 2179337 2219773 2260997 2303705 2348752 2395950 2444558 2494619 2546772 2601011 2656746 2713900
56021B713900N9034O1119O3343O6335P0087P3535P6168P8772Q1796Q4571Q6987
$$ 2713900 2772934 2834053 2897396 2963731 3033818 3107353 3183521 3262293 3344089 3428660 3515647
56010C515647R0303R5140J00303J04737J09114J14255J19600J24652J30382J37599
$$ 3515647 3605950 3701090 3801393 3906130 4015244 4129499 4249099 4373751 4504133 4641732
56000D641732J45254J52000J58262J65238J73052J81410J90890K01987K13912
$$ 4641732 4786986 4938986 5097248 5262486 5435538 5616948 5807838 6009825 6223737
55991F223737K25856K38456K52643K68164K84652L02883L23489L45665L68734
$$ 6223737 6449593 6688049 6940692 7208856 7493508 7796391 8119880 8465545 8834279
55982H834279L93804M22394M54554M89862N28965N72623O20476O72398P29750
$$ 8834279 9228083 9650477 10105031 10594893 11123858 11696481 12316957 12989355 13719105
55973A3719105P93903Q65108R44307J034375J138025J256379J391364J547644
$$ 13719105 14513008 15378116 16322423 17356798 18494823 19751202 21142566 22690210
55965B2690210J730655J945043K196967K495683K851586L276211L786675M407044
$$ 22690210 24420865 26365908 28562875 31058558 33910144 37186355 40973030 45380074
55957D5380074N163391O081395P190791Q526447J0121331J2003196J4198874J6727837
$$ 45380074 50543465 56624860 63815651 72342098 82463429 94466625 108665499 125393336
55949A25393336J9574039K2647543K5731824K8390613K9876584K9204176K5515001
$$ 125393336 144967375 167614918 193346742 221737355 251613939 280818115 306333116
55942C06333116J8600111R204116j164871j0815315j8462270k3518709k6049417
$$ 306333116 324933227 334137343 332972472 322157157 303694887 280176178 254126761
55935B54126761k6533080k5593056k3797844k1571946j9199342j6862785j4674205
$$ 254126761 227593681 202000625 178202781 156630835 137431493 120568708 105894503
55928A05894503j2692398j0940057r418754q115613p006868o065129n265928m587778
$$ 105894503 93202105 82262048 72843294 64727681 57720813 51655684 46389756 41801978
55920D1801978m010347l516230l092670k729156k415182k142139j904867j699128
$$ 41801978 37791631 34275401 31182731 28453575 26038393 23896254 21991387 20292259
55912B0292259j519519j361721j224237j105622j002000r09559q27517p56196
$$ 20292259 18772740 17411019 16186782 15081160 14079160 13169601 12342084 11585888
55904A1585888o93931o38189n88193n43922n03854m66217m31456m00852l73426
$$ 11585888 10891957 10253768 9665575 9121653 8617799 8151582 7720126 7319274 6945848
55895F945848l46584l19563k93920k70736k49288k28634k08766j89897j71941
$$ 6945848 6599264 6279701 5985781 5715045 5465757 5237123 5028357 4838460 4666519
55886D666519j55048j39539j25348j12393j01643r4792r2735r4913j00070j06911
$$ 4666519 4511471 4371932 4246584 4134191 4032548 3937756 3845021 3750108 3650038 3543127
55876C543127j14096j20389j24938j27172j26595j23179j17667j11038j03808
$$ 3543127 3429031 3308642 3183704 3056532 2929937 2806758 2689091 2578053 2474245
55867B474245r6226q8765q1917p5776p0229o5302o0995n7140n3753n1079m9018
$$ 2474245 2378019 2289254 2207337 2131561 2061332 1996030 1935035 1877895 1824142 1773063 1724045
55856A724045m6941m4485m1982l9764l7628l5439l3619l2475l1586l0515k9565
$$ 1724045 1677104 1632619 1590637 1550873 1513245 1477806 1444187 1411712 1380126 1349611 1320046
55845A320046k9215k9191k8882k8334k8121k8346k8390k7652k6137k4389k3029
$$ 1320046 1290831 1261640 1232758 1204424 1176303 1147957 1119567 1091915 1065778 1041389 1018360
55834A018360k2221k1465k0202j8642j7477j6795j6011j4956j4149j3668j2809
$$ 1018360 996139 974674 954472 935830 918353 901558 885547 870591 856442 842774 829965
55823H29965j1483j0927j2086j4066j5199j5099j4644j4369j3980j3310j2683
$$ 829965 818482 807555 795469 781403 766204 751105 736461 722092 708112 694802 682119
55812F82119j2288j1931j1430j0692r549q136p124o999p309p301o972o715o291
$$ 682119 669831 657900 646470 635778 626229 618093 610969 603970 596661 589360 582388 575673 569382
55799E69382n098l337j892r80Q1J573K769L073L003L494M644N493M801J914k764
$$ 569382 564284 560947 559055 558075 558156 559729 562498 565571 568574 572068 576712 582205 587006 588920 586156
55784E86156p901j2066j4602j5567j5124j3478j1257r155p075m314r49J510J402
$$ 586156 578255 566189 551587 536020 520896 507418 496161 487006 479931 475617 474668 476178 477580
55771D77580j401n428r005j1353j2531j2779j2116j0526q299o070m353l124j999
$$ 477580 476179 470751 461746 450393 437862 425083 412967 402441 394142 388072 383719 380595 378596
55758C78596p56L86R26L56j510m223o841q642r670j0325j0617j0165q904p325
$$ 378596 377840 378226 379152 379508 377998 373775 366934 358292 348622 338297 327680 317515 308611 301286
55744C01286n899m661l483k556k295k898m072n228n893n910n311m108k445q92
$$ 301286 295387 290726 287243 284687 282392 279494 275422 270194 264301 258391 253080 248972 246527 245635
55730B45635j71m67j262k001k575l016l175l075l163l710m255m130l333k387j465
$$ 245635 245464 244997 243735 241734 239159 236143 232968 229893 226730 223020 218765 214635 211302 208915 207450
55715B07450l09J074K142K328J485p5j621k259j689o04J09M30Q65J274Q79m82
$$ 207450 207141 208215 210357 212685 214170 214095 212474 210215 208526 207922 208031 208461 209326 210600 211479 210997
55699B10997j903k607k935l687m934n945o089n410m468l779l398k976k375j991
$$ 210997 209094 206487 203552 199865 194931 188986 182897 177487 173019 169240 165842 162866 160491 158500
55685A58500k157k430k104j303q15p57l06R44K190K534K203J912J582N58j100
$$ 158500 156343 153913 151809 150506 149691 148934 148628 149572 151762 154296 156499 158411 159993 160551 159451
55670A59451k473k982l010l149l366l129k170q76o9k97j267j992j794r61k31K11
$$ 159451 156978 153996 150986 147837 144471 141342 139172 138296 138227 137930 136663 134671 132877 131916 131685 131896
55654A31896Q24J868K901L287K907K169J556J231J051P65L20q4k44k54m01q43
$$ 131896 132720 134588 137489 140776 143683 145852 147408 148639 149690 150455 150775 150691 150447 150193 149792 148949
55638A48949j519k303l050l473l347k855k523k615k789k628k270k199k396k183
$$ 148949 147430 145127 142077 138604 135257 132402 129879 127264 124475 121847 119577 117378 114982 112799
55624A12799j103L21J056O22o05j945k824k746j583j05M64k12j154j473j569k216
$$ 112799 111696 112017 113073 113695 113090 111145 108321 105575 103992 103887 104351 104139 102985 101512 99943 97727
55608I7727l039k981k081j592k069k584k174j146k84L16P57N44o88k075k334j491
$$ 97727 94688 91707 89626 88034 85965 83381 81207 80061 79777 80093 80850 81394 80706 78631 76297 74806
55592G4806p42o67o14n2N88Q73J214K050K824K709K034K115L546N347O185N977
$$ 74806 74064 73397 72783 72731 73319 74192 75406 77456 80280 82989 85023 87138 90684 96031 102216 108193
55576A08193N829O569P739Q323P940P000N749L833J041j985m346n914p244q524
$$ 108193 114022 120591 128330 136653 144593 151593 157342 161175 162216 160231 155885 149971 142727 134203
55562A34203r242q990q088p109o185n206m317l838l754l668l285k657j960j282
$$ 134203 124961 115971 107883 100774 94589 89383 85066 81228 77474 73806 70521 67864 65904 64622
55548F4622o89l33l21n21o27m55j83j90n91r98r48m65l4J3j81l01k77j54J50O78
$$ 64622 63933 63600 63279 62758 62131 61676 61493 61303 60712 59714 58766 58301 58267 58280 58099 57798 57521 57367 57517 58195
55528E8195J126J064M95o5j67J17M49O88R37J179J143O72M7k19K0K71j10j158
$$ 58195 59321 60385 60880 60815 60648 60765 61214 61902 62839 64018 65161 65833 65880 65661 65681 65952 65842 64684
55510F4684k202k588k342j999j906j994k144k373k485j993q03L75P88P17J113
$$ 64684 62482 59894 57552 55553 53647 51653 49509 47136 44651 42658 41855 42230 43018 43735 44848
55495D4848K129K704K000O27j23J74R17J524J872J798J076l2q93j375j915k450
$$ 44848 46977 49681 51681 52308 52185 52359 53276 54800 56672 58470 59546 59514 58621 57246 55331 52881
55479E2881k153p28P51J035K84l46l07n7l5j58l14n91p97n06J99N96K52l75o32
$$ 52881 50728 50000 50751 51786 52070 51724 51417 51360 51325 51167 50853 50262 49465 48959 49158 49754 50006 49631 48999
55460D8999n22n06p73j064j064o69o9K89L9o19r61n58J76M90K15j06M3N49Q41
$$ 48999 48477 47971 47198 46134 45070 44401 44332 44621 44660 44041 43080 42522 42698 43188 43403 43297 43340 43889 44730
55441D4730N37j22n06l37l1j61o51q86o22k84k33j64L45J069J357J060P11Q10
$$ 44730 45267 45145 44639 44302 44271 44110 43459 42573 41951 41667 41434 41270 41615 42684 44041 45101 45812 46622
55423D6622J238J539J487J287J280J538J667J137j04j337j666r44L4L75Rl88l83
$$ 46622 47860 49399 50886 52173 53453 54991 56658 57795 57691 56354 54688 53744 53778 54153 54162 53774 53391
55406E3391l54q88j815k298j934j227p23k12O73J525J608J059P41Q43N67n13j585
$$ 53391 53037 52149 50334 48036 46102 44875 44152 43940 44613 46138 47746 48805 49546 50389 50956 50443 48858
55389D8858j668q69L0O45J006R64L53m37p89o15k39K10P23R06L05p76j478j436
$$ 48858 47190 46321 46351 46996 48002 48966 49319 48882 48093 47478 47239 47449 48172 49078 49383 48607 47129 45693
55371D5693j034o83m71n40j070j685j576n95L77N06j5l92k22L34R39J284J149
$$ 45693 44659 43976 43505 42965 41895 40210 38634 38039 38416 38922 38907 38515 38293 38627 39566 40850 41999
55354D1999O77L40L64L80k4o85j045p63M7R19J174L56j074j884j388l67r7o75
$$ 41999 42676 43016 43380 43760 43736 43051 42006 41243 41290 42209 43383 43739 42665 40781 39393 39026 38929 38254
55336C8254r65j89J141K043K194J852J169J81p23r55m07L01N44L98M45R42J451
$$ 38254 37289 37100 38241 40284 42478 44330 45499 45680 44957 44002 43595 43896 44440 44838 45283 46225 47676
55319D7676J379P16N6j09N3K5l24n66l48N3M2m66r07q49n77o08q85q64l57J98
$$ 47676 49055 49771 49827 49718 49771 49796 49472 48906 48558 48611 48653 48187 47280 46431 45854 45246 44361 43497 43140 43338
55299D3338M13M61O81R70R42M47k99r20j028m33N31J117R57N47N27Q13Q81O66
$$ 43338 43751 44212 44893 45863 46805 47252 46953 46033 45005 44572 45103 46220 47177 47724 48251 49064 49945 50611
55281E0611N52N57K37n51j335j650j527j183p40l77l08l74j39M29P69M67j62n24
$$ 50611 51163 51720 51957 51406 50071 48421 46894 45711 44971 44594 44286 43912 43773 44202 44971 45438 45276 44752
55263D4752m38j37R1L2l73q23q37l21L09P07R36J054Q51K47l91o91o50l56J92
$$ 44752 44314 44177 44268 44300 43927 43104 42267 41946 42255 42962 43898 44952 45803 46050 45659 44968 44318 43962 44154
55244D4154P64Q14K28l43l17K8J00p7r3L1r3m64o55m67j11K03M45N16L25N7nK11
$$ 44154 44918 45732 45960 45617 45300 45328 45428 45351 45258 45289 45196 44732 44077 43610 43499 43702 44147 44663 44988 45045 45040 45251
55222D5251O62J396K170K248J215k03q08m45j54p05j650k015j482n20K40N34N12
$$ 45251 45913 47309 49479 51727 52942 52739 51931 51486 51332 50627 48977 46962 45480 44960 45200 45734 46246
55205D6246M72M88L42l9l39k81l4J87N19J016J056P0j351j911j282m73l05l73
$$ 46246 46718 47206 47548 47509 47170 46889 46855 47042 47561 48577 49633 49703 48352 46441 45159 44686 44381 44008
55187D4008P0Q37J081M40o06j358j489j139p03m49k62J11O14R82J195J446J692
$$ 44008 44078 44915 45996 46436 45830 44472 42983 41844 41141 40692 40430 40541 41155 42137 43332 44778 46470
55170D6470J753J770K021K234J781P14j14k67k96o85r37m02N62J016P21K20j36
$$ 46470 48223 49993 52014 54248 56029 56743 56629 56362 56066 55381 54444 54042 54604 55620 56341 56561 56425
55153E6425n30j083j547j692j534j135n61l1K03J87K29M85Q73J307J717J912J682
$$ 56425 55895 54812 53265 51573 50039 48904 48343 48312 48515 48702 48931 49416 50289 51596 53313 55225 56907
55136E6907J140O12J53m98j341j797j314k54K63m07j535j809r37L5J74j63j20
$$ 56907 58047 58659 58812 58314 56973 55176 53862 53608 53871 53464 51929 50120 49183 49218 49392 49229 49109
55119D9109K86L86J29J65N69N97m3n59k60L97O02M01L27L97K84J14L10O80N31
$$ 49109 49395 49781 49910 50075 50644 51241 51198 50639 50379 50776 51378 51779 52106 52503 52787 52901 53211 53891 54422
55100E4422l07j136j210n19L44P59N66K40M53J250J842J524N62j75k40J04M31
$$ 54422 54115 52979 51769 51250 51594 52353 52919 53159 53612 54862 56704 58228 58790 58615 58375 58479 58910
55083E8910N05K79j06l78n17p85j131r67l5R57J167P26L30R7l19p02m22L69O44
$$ 58910 59415 59694 59588 59210 58693 57908 56777 55810 55775 56732 57899 58625 58955 59052 58733 58031 57609 57978 58622
55064E8622p3j033j361j075o65k82J40M69N60N60O02M68m8p03j037r08n24r8L31
$$ 58622 58549 57516 56155 55080 54415 54133 54273 54742 55302 55862 56464 56932 56884 56181 55144 54236 53712 53614 53945
55045E3945P78J157J254R14L53R1L29N86L23k66n81n40n92q29q08l16K83O80J007
$$ 53945 54723 55880 57134 58048 58401 58492 58821 59407 59730 59464 58883 58343 57751 56922 56114 55798 56081 56761 57768
55026E7768J417J750J844J651J002j76j252j297l57M32M38L76J001J692J274k45
$$ 57768 59185 60935 62779 64430 65432 65256 64004 62707 62350 62782 63220 63596 64597 66289 67563 67318
55010F7318j703k235j985j449r50o88o77n75j02M66O85O92R46J334J269O98K84
$$ 67318 65615 63380 61395 59946 58996 58308 57631 57056 56954 57420 58105 58797 59743 61077 62346 63044 63328
54993F3328M06O09M02Jj04P2K10L39P90J561K158K144J628J058P34N20O0p69j595
$$ 63328 63734 64343 64745 64746 64642 64714 64924 65263 66053 67614 69772 71916 73544 74602 75336 75856 75916 75147 73552
54974G3552j813j217k69L52M10J97J6j46k50P5R94J772J276n02k063k058r27j33
$$ 73552 71739 70522 70253 70605 71015 71212 71228 71082 70832 70907 71901 73673 74949 74447 72384 70326 69399 69266
54956F9266j10P8R69J707J324K30m07k65o8l39p05n10L27J213J432Q68K54M18
$$ 69266 69156 69234 70203 71910 73234 73464 73057 72792 72724 72385 71680 71170 71497 72710 74142 75010 75264 75682
54938G5682J122J180R9r76p41L36N91m41j353r20K61Q27N61L63P18J146J223J358
$$ 75682 76804 77984 78083 77107 76366 76702 77293 76852 75499 74579 74840 75667 76228 76591 77309 78455 79678 81036
54920H1036K151L400M265M351M270M902O200P089O596M871K903J348Jj673l736
$$ 81036 83187 86587 90852 95203 99473 104375 110575 117664 124260 129131 132034 133382 133383 131710 127974
54905A27974n655o777o856o199n323m434l387k188j302j166j521j634j164m67
$$ 127974 122319 115542 108686 102487 97164 92730 89343 87155 85853 84687 83166 81532 80368 79901
54891G9901m3j3k26n28p84q08n01L5N63Q35P84P48J332K638L830L950L170K672
$$ 79901 79858 79845 79619 79091 78307 77499 76998 77033 77596 78431 79215 79963 81295 83933 87763 91713 94883 97555
54873I7555L217M404N484O184O374N643L894J940O83m4j160k924m564n375n509
$$ 97555 100772 105176 110660 116844 123218 128861 132755 134695 135378 135334 134174 131250 126686 121311 115802
54858A15802n492n466n195m471l298j976j106j176j922k461k215j437o23J10P74
$$ 115802 110310 104844 99649 95178 91880 89904 88798 87622 85700 83239 81024 79587 78964 79074 79848
54843G9848J003M14p09j596j876j845j804j564q61Q8P05O65J51l95o45n13j02
$$ 79848 80851 81265 80556 78960 77084 75239 73435 71871 71010 71098 71803 72468 72619 72224 71579 71066 70964
54826G0964L79P01P14M70K79M04O61M75l89j326j496r09m30n62p67k94O55J120
$$ 70964 71343 72044 72758 73228 73507 73911 74572 75047 74658 73332 71836 70927 70497 69935 69168 68874 69529 70649
54808G0649O29k58p17n47j69k9j95m28m46k41r4k20m04j76N83J424J801J613J126
$$ 70649 71278 71020 70303 69756 69587 69558 69363 68935 68489 68248 68154 67934 67530 67354 67937 69361 71162 72775 73901
54789G3901N89P3l35m34j18M05O75M40m5k56l2K89M23N98J137J853K236K204K145
$$ 73901 74490 74563 74228 73794 73676 74081 74756 75196 75151 74895 74863 75152 75575 76173 77310 79163 81399 83603 85748
54770H5748K212K089J667J511K219L590M843N527N858O156O282N784M544L059
$$ 85748 87960 90049 91716 93227 95446 99036 103879 109406 115264 121420 127702 133486 138030 141089
54756A41089J925J017m65k863n213o127n480m576m477m816m623l738k789k173
$$ 141089 143014 144031 143566 140703 135490 129363 123883 119307 114830 110014 105391 101653 98864 96691
54742I6691j769j466j345j297j022m57J00L54J76m65j338j804j302l4J197J840
$$ 96691 94922 93456 92111 90814 89792 89335 89435 89789 89965 89500 88162 86358 85056 85022 86219 88059
54726H8059J946J733J340J078J367K224L135L690M008M345M642M699M516M130
$$ 88059 90005 91738 93078 94156 95523 97747 100882 104572 108580 112925 117567 122266 126782 130912
54712A30912L326J832k08k233l688m393m524m398m290m301m305m014l222k114
$$ 130912 134238 136070 135862 133629 129941 125548 121024 116626 112336 108035 103730 99716 96494 94380
54698I4380j303j271j726j830j215m81l85r05j454j675j558j069l30R1j66l95
$$ 94380 93077 91806 90080 88250 87035 86554 86169 85264 83810 82135 80577 79508 79178 79269 79103 78708
54682G8708M23J997K731J745k4j182j553j755j880j504p04p5J76L93P58J030J103
$$ 78708 79131 81128 83859 85604 85580 84398 82845 81090 79210 77706 77002 76927 77103 77496 78254 79284 80387
54665H0387J107R31K08r48j783j748j126n56l08k82l86m81k51M64J270J567J272
$$ 80387 81494 82425 82633 81685 79902 78154 77028 76472 76164 75882 75496 75015 74764 75228 76498 78065 79337
54648G9337Q42N63K27k87n49q2Q57J461J338Q52M24l3o84j220j220q42o03n64
$$ 79337 80179 80742 80969 80682 80133 80051 80908 82369 83707 84559 84983 84950 84266 83046 81826 80984 80381 79817
54630G9817l29J38L19o8n39n20j12J84K63M58R20J340J327Q22J45l27m72n17p16
$$ 79817 79488 79626 79945 79877 79338 78818 78706 78890 79153 79611 80531 81871 83198 84020 84165 83838 83366 82849 82133
54611H2133r20p31n4P15J188J354J289Q86J27n93p85l98K12O66P27L53j67l13
$$ 82133 81213 80482 80428 81143 82331 83685 84974 85860 85987 85394 84609 84211 84423 85089 85816 86169 86002 85689
54593H5689N2M71N50N20P07P39Pj198j777j176p8N40M98K31M9j1J20M84P83O11
$$ 85689 85741 86212 86762 87282 87989 88728 88735 87537 85760 84584 84506 85046 85544 85775 85824 85813 85933 86417 87200 87811
54573H7811l2o98j016r80p50l54K03P45R53O53O8l00j15L67N32J26l70l50N2O6
$$ 87811 87779 87081 86065 85085 84335 83981 84184 84929 85882 86535 86603 86303 86188 86555 87087 87213 86843 86493 86545 86611
54553H6611o77j565j704r18L05J511K507K964K502J283P6n87p89o54OJ067J727
$$ 86611 85934 84369 82665 81747 82052 83563 86070 89034 91536 92819 92895 92308 91519 90865 90871 91938 93665
54536I3665J429O82L11K54o8n73o73m45n04p75m78L64O87O7n05j82M54M47j8j80
$$ 93665 95094 95776 96087 96341 96273 95700 95027 94582 94078 93303 92825 93189 93876 93943 93438 93256 93710 94157 94139 93959
54516I3959J3J61L17O72P47P2p76q22j82K40K52M79J009J163P00J57j38m47p59
$$ 93959 93972 94133 94450 95122 95869 95941 95165 94343 94161 94401 94653 95132 96141 97304 98004 98161 98023 97576 96817
54497I6817n41K75J003J210J166J006L73o78j300r87l04O3K88Q39J548J934J971
$$ 96817 96276 96551 97554 98764 99930 100936 101309 100631 99331 98344 98040 98103 98391 99230 100778 102712 104683
54480A04683J874J503P09j43n35n00m21l72j30L53Q52J133R97M11k43l85N7N67
$$ 104683 106557 108060 108769 108626 108091 107591 107170 106798 106668 107021 107873 109006 110003 110414 110171 109786 109843 110410
54462A10410Q08R22Q92L78m33o39K5N46J07n48k53O74R09J20p58j151j435j814
$$ 110410 111218 112140 113032 113410 112977 112338 112363 112909 113016 112468 112215 112889 113798 113918 113160 112009 110574 108760
54444A08760j797j172m61l0L78Q52Q85K69l57m17k08k67n02n72n93p57o82Q5J175
$$ 108760 106963 105791 105330 105300 105678 106530 107415 107684 107327 106910 106702 106435 105933 105361 104768 104011 103329 103414 104589
54425A04589J744J557J090N67k74j328j817j274l33j9m48p68l59L81O16J35m86
$$ 104589 106333 107890 108980 109547 109273 107945 106128 104854 104521 104502 104054 103286 102927 103308 103924 104059 103573
54408A03573o44l63p9k4P5O31J633K462K384J320O1m63j37L23K98m8j26K55O96
$$ 103573 102929 102566 102487 102463 102538 103169 104802 107264 109648 110968 111029 110566 110429 110752 111050 111002 110876 111131 111827
54389A11827P03J82m96q03m81K19P34P40L92Q9J03M69R49J078N41l51q32n29J35
$$ 111827 112530 112712 112216 111413 110932 111151 111885 112625 113017 113106 113209 113678 114627 115705 116246 115895 115063 114534 114669
54370A14669N18M82K91J32O2J60M22O47O95O40M24k50j366k206k054j108k52n5
$$ 114669 115187 115669 115960 116092 116154 116314 116736 117383 118078 118718 119142 118892 117526 115320 113266 112158 111906 111851
54352A11851l86q13r82p27k82k11p73j484j732j541j279r13k28M58N49N5m82q72
$$ 111851 111465 110652 109670 108943 108661 108450 107677 106193 104461 102920 101641 100728 100500 100958 101507 101562 101080 100208
54334A00208j307j570j114n7O90O05J45o9J3K21N13O89M25p7j78K17M44K41K44
$$ 100208 98901 97331 96217 96160 96850 97455 97600 97531 97544 97765 98278 98967 99392 99315 99137 99354 99798 100039 100283
54315A00283Q05J213Q27K11K81Q67J090P62M50M15M41N68J052J605J552Q48K44
$$ 100283 101088 102301 103128 103339 103620 104487 105577 106339 106789 107204 107645 108213 109265 110870 112422 113270 113514
54298A13514K04L88L58K32K84M40M43K38p2l79n32m10j95l32j004j843k279k068
$$ 113514 113718 114106 114464 114696 114980 115420 115863 116101 116029 115650 115118 114708 114513 114181 113177 111334 109055 106987
54280A06987j443q51o19p44r13p86k82L81Q06O35r5q01q46k71K58L62L33M84N75
$$ 106987 105544 104693 104074 103330 102417 101631 101349 101730 102536 103171 103076 102275 101429 101158 101416 101778 102111 102595 103170
54261A03170L10r3k32j37j0K13N82P56N37L90P63J169P61l53j269j610j813j995
$$ 103170 103480 103387 103155 103018 103008 103221 103803 104559 105096 105486 106249 107418 108179 107826 106557 104947 103134 101139
54243A01139j582l64Q54J225Q48L76J37N4O0J37J96J45n7m70j008j283j011n13
$$ 101139 99557 99193 100047 101272 102120 102496 102633 102687 102747 102884 103080 103225 103168 102698 101690 100407 99396 98883
54225I8883k84j84K67P94M85p80j946k135j604q99j4R90J424R21K75M03R77R74
$$ 98883 98599 98415 98682 99476 99961 99181 97235 95100 93496 92597 92583 93573 94997 95918 96193 96596 97573 98547
54207I8547K28n53r71j186j179p22n3L12M16P57J306J484J124O68L30j23n84n21
$$ 98547 98775 98222 97251 96065 94886 94164 94111 94423 94839 95596 96902 98386 99510 100178 100508 100385 99801 99280
54189I9280R0N55N02L36L05p6r80j510p98O62J557J427R23O46M50j3p10j375j788
$$ 99280 99370 99925 100427 100763 101068 100992 100012 98502 97704 98366 99923 101350 102273 102919 103369 103356 102646 101271 99483
54170I9483j805j440j018q73q49m19N50J538J948J743J268P10Kp57j179r60k83
$$ 99483 97678 96238 95220 94347 93498 93079 93629 95167 97115 98858 100126 100836 100838 100081 98902 97942 97659
54153I7659L42N76M70J48m52j327k033j958j011J93R41J046P89N42O14J110J712
$$ 97659 98001 98577 99047 99195 98743 97416 95383 93425 92414 92607 93548 94594 95383 95925 96539 97649 99361
54136I9361J800J139L38K26Q24J299R85R4o53q38n26K5N32O53J85o06j047p14
$$ 99361 101161 102300 102638 102864 103688 104987 105972 106066 105413 104575 104049 104074 104606 105259 105444 104838 103791 103077
54118A03077N9M97K43l08n70m15j35P2K50M47O03O22L42m30j514k099j517l03
$$ 103077 103136 103633 103876 103568 102998 102583 102448 102520 102770 103217 103820 104442 104784 104354 102840 100741 99224 98921
54100I8921J99m75j279j153m21l9k7L86J321J989J953J643J475J190N15k48o76
$$ 98921 99120 98645 97366 96213 95792 95753 95726 96112 97433 99422 101375 103018 104493 105683 106198 105950 105274
54083A05274p68o42k20L72O40L68j0o7k6k46n49o33p03j034j230o87L73J072J057
$$ 105274 104506 103864 103644 104016 104656 105024 105014 104947 104921 104675 104126 103493 102790 101756 100526 99839 100212 101284 102341
54064A02341P78O77O84O47O09N44L75K93N37Q26O09nk35K17P04O13K37J83M93
$$ 102341 103119 103796 104480 105127 105736 106280 106655 106948 107485 108311 108920 108915 108680 108897 109601 110214 110451 110634 111127
54045A11127Q17J047J301J523J549J382J074O48L36N15J099J406J023L77O4L2
$$ 111127 111944 112991 114292 115815 117364 118746 119820 120468 120804 121319 122418 123824 124847 125224 125288 125320
54029A25320q5k13p1J81J64o0j93l14o70j027r39n56m25n84n51k65k44o80j136
$$ 125320 125235 125022 124951 125132 125296 125236 125043 124729 124059 123032 122093 121537 121112 120528 119977 119712 119468 118788 117652
54010A17652j317j467j675j498p32P8L23J28l5p7j73k59j32R1Q1k49o77r51q82
$$ 117652 116335 114868 113193 111695 110963 111041 111364 111492 111457 111380 111207 110948 110816 110907 110988 110739 110062 109111 108229
53991A08229l98L42R98J352J419J172N42j41k22M61J222J371J029P07M19j24p37
$$ 108229 107831 108173 109171 110523 111942 113114 113656 113515 113293 113754 114976 116347 117376 118083 118502 118378 117641
53974A17641q27k14N46Q51O72M75P28J454K056J787O37m63o41p1M29N15N08O17
$$ 117641 116814 116600 117146 117997 118669 119144 119872 121326 123382 125169 125806 125343 124702 124631 125060 125575 126083 126700
53956A26700O76O52P83J070J178J047J114J581J972J775J240J087J569K232K576
$$ 126700 127376 128028 128811 129881 131059 132106 133220 134801 136773 138548 139788 140875 142444 144676 147252
53941A47252K685L114M284O102Q178J0356J2790J5430J7510J7927J6073J2177
$$ 147252 149937 153051 157335 163437 171615 181971 194761 210191 227701 245628 261701 273878
53929B73878O942J227m017q018j0566j1894j2132j1296r791q377p329o179m627
$$ 273878 280820 282047 278030 270012 259446 247552 235420 224124 214333 205956 198627 192448 187821
53916A87821l264k864l266l591l419l103k935k657k064j546j627k235k763k730
$$ 187821 184557 181693 178427 174836 171417 168314 165379 162722 160658 159112 157485 155250 152487 149757
53902A49757k151j367p60o59j176k048k739k817k288j562j081r68r54p17k81j3
$$ 149757 147606 146239 145479 144820 143644 141596 138857 136040 133752 132190 131109 130141 129187 128470 128189 128176
53886A28176j38m47n23k99r8j63l32l81m74r59j719k051j400r0Q83Q40L8o61o81
$$ 128176 128038 127591 127068 126769 126671 126508 126176 125795 125321 124362 122643 120592 119192 119102 119985 120825 120863 120202 119521
53867A19521j99K11K80K26L47N92O91N54L15J12J4J29N07R48J194J266J303J073
$$ 119521 119322 119533 119813 120039 120386 120978 121669 122223 122538 122650 122664 122793 123300 124248 125442 126708 128011 129084
53849A29084J41j250k054j592m99Q2j17m65n64o53q60q62n50l27l65j13Q30J824
$$ 129084 129225 127975 125921 124329 123830 123912 123795 123330 122766 122113 121253 120391 119841 119514 119149 119036 119866 121690
53831A21690J874R91J84K2k8n81j236j140l32J62l05j151j341o57K64R30J436
$$ 121690 123564 124555 124739 124761 124733 124152 122916 121776 121444 121606 121301 120150 118809 118152 118416 119346 120782
53814A20782J863J873J253M85L13Q58J566J919J832J391O63j45o53o77m15j21
$$ 120782 122645 124518 125771 126256 126569 127427 128993 130912 132744 134135 134798 134653 134000 133323 132908 132787
53798A32787K24P62J438J967K129J972J765J656J481J003M29L78J050J668J268
$$ 132787 133011 133773 135211 137178 139307 141279 143044 144700 146181 147184 147613 147991 149041 150709 151977
53783A51977j0q99n03N88R69lj554k336j695j44J315K115K409K503K477K432K762
$$ 151977 151967 151068 150565 151153 152122 152119 150565 148229 146534 146390 147705 149820 152229 154732 157209 159641 162403
53766A62403L727N066O462Q068R971J1345J0950Q521M933R54l200o923q947q774
$$ 162403 166130 171196 177658 185726 195697 207042 217992 226513 231446 232400 229200 222277 213330 204556
53752B04556p615p025p128o935n967m634l331k077j052o08o29n96l23j29j41j32
$$ 204556 196941 189916 182788 175853 169886 165252 161921 159844 158792 158184 157555 156959 156636 156507 156366 156234
53736A56234p2j99m37l10K67P52P61O52Q64J225J275R91P65Q58J229J736K187
$$ 156234 156162 155963 155526 155216 155483 156235 156996 157648 158512 159737 161012 162003 162768 163626 164855 166591 168778
53719A68778K342K126J747J469J351J352J441J535J562J652J996K425K484K133
$$ 168778 171120 173246 174993 176462 177813 179165 180606 182141 183703 185355 187351 189776 192260 194393
53705A94393J902K105K376K324K168K176J947J037K6K3J093K069K172J912J959
$$ 194393 196295 198400 200776 203100 205268 207444 209391 210428 210454 210477 211570 213639 215811 217723 219682
53690B19682J992J404N29J91L69K79k51m87k9M79L65j18l99n45r49j465j607j386
$$ 219682 221674 223078 223607 223798 224167 224446 224195 223708 223679 224158 224523 224405 224006 223461 222512 221047 219440 218054
53672B18054j217j136q49m87m85o25j01J152K004J591N08j27k07m23q63q52j21
$$ 218054 216837 215701 214852 214365 213880 213255 213154 214306 216310 217901 218409 218282 218075 217652 216789 215937 215816
53655B15816P79J423K062K930L666L833L658L721M213M802N044M579L156R16j381
$$ 215816 216595 218018 220080 223010 226676 230509 234167 237888 242101 246903 251947 256526 259682 260598 259217
53640B59217k803l040k622k323k466k776k720k013q72J55P14R61J311J914K484
$$ 259217 256414 253374 250752 248429 245963 243187 240467 238454 237582 237737 238451 239412 240723 242637 245121
53625B45121K708K607K384K100J710J441J738K655L492L480K738K161K277K680
$$ 245121 247829 250436 252820 254920 256630 258071 259809 262464 265956 269436 272174 274335 276612 279292
53611B79292K792K716K871L161L124K779K619K730K562J832J074Q36Q52N62J05
$$ 279292 282084 284800 287671 290832 293956 296735 299354 302084 304646 306478 307552 308388 309240 309802 309907
53596C09907Q8M64M11l83j024n44N91Q64l90k110k843k449j959j984k037j530
$$ 309907 309995 310459 310870 310487 309463 308919 309510 310374 309984 307874 305031 302582 300623 298639 296602 295072
53580B95072p98o56j267j929j927j234m24j66p35j743k356k078j291q19q86q90
$$ 295072 294274 293618 292351 290422 288495 287261 286837 286671 285936 284193 281837 279759 278468 277649 276763 275873
53564B75873l04N74J005P75M08M36P43Q05M41O9J10L54K45k37l52N58K251L858
$$ 275873 275569 276143 277148 277923 278331 278767 279510 280315 280756 280825 280935 281289 281534 281297 280945 281503 283754 287612
53546B87612M723M797M476M326M802N792O591O634O155N844O005O495P232Q217
$$ 287612 292335 297132 301608 305934 310736 316528 323119 329753 335908 341752 347757 354252 361484 369701
53532C69701R157R677R977J0609J1575J2308J2753J3654J5350J6932J7305J6742
$$ 369701 378858 388535 398512 409121 420696 433004 445757 459411 474761 491693 508998 525740
53520E25740J6647J8003K0561K3452K5876K7294K7527K7055K6805K7274K7977
$$ 525740 542387 560390 580951 604403 630279 657573 685100 712155 738960 766234 794211
53509G94211K7923K6608K4457K2347K0856K0012J9610J9504J9516J9448J9402
$$ 794211 822134 848742 873199 895546 916402 936414 956024 975528 995044 1014492 1033894
53498A033894J9895K1142K2366K2387K1019J9352J8452J8280J8118J7604J6863
$$ 1033894 1053789 1074931 1097297 1119684 1140703 1160055 1178507 1196787 1214905 1232509 1249372
53487A249372J6078J5416J5213J5661J6405J6803J6524J5610J4126J2161R994
$$ 1249372 1265450 1280866 1296079 1311740 1328145 1344948 1361472 1377082 1391208 1403369 1413363
53476A413363P855N561K804k39l023n376p731j0455j3246j5338j6207j5986j5357
$$ 1413363 1421218 1426779 1429583 1429344 1426321 1420945 1413214 1402759 1389513 1374175 1357968 1341982 1326625
53463A326625j5148j5873j7575j9932k2388k4239k5015k4908k4559k4208k3476
$$ 1326625 1311477 1295604 1278029 1258097 1235709 1211470 1186455 1161547 1136988 1112780 1089304
53452A089304k2210k1057k0653k0655k0263j9409j8664j8089j7083j5471j3883
$$ 1089304 1067094 1046037 1025384 1004729 984466 965057 946393 928304 911221 895750 881867
53441H81867j2646j1118q657n744l463k218j502o99M63K129M320O674Q619R961
$$ 881867 869221 858103 849446 843702 840239 838021 836519 835820 836283 838412 842732 849406 858025 867986
53427H67986J1008J2095J3301J4735J6660J9051K1282K2636K3078K3335K4153
$$ 867986 878994 891089 904390 919125 935785 954836 976118 998754 1021832 1045167 1069320
53416A069320K5675K7529K9308L0784L1852L2590L3492L5304L8351M2024M5241
$$ 1069320 1094995 1122524 1151832 1182616 1214468 1247058 1280550 1315854 1354205 1396229 1441470
53405A441470M7494M9279N1404N3978N6280N7541N7704N7362N7167N7447N8280
$$ 1441470 1488964 1538243 1589647 1643625 1699905 1757446 1815150 1872512 1929679 1987126 2045406
53394B045406N9562O0898O1585O1030N9169N6428N3291N0019M6716M3421M0141
$$ 2045406 2104968 2165866 2227451 2288481 2347650 2404078 2457369 2507388 2554104 2597525 2637666
53383B637666L6995L4248L1980K9759K6944K3390J9545J5760J1871P456K140m508
$$ 2637666 2674661 2708909 2740889 2770648 2797592 2820982 2840527 2856287 2868158 2875614 2877754 2873246
53371B873246j2792k2175l1222l8806m5113n0905n6105n9827o1722o2606o3389
$$ 2873246 2860454 2838279 2807057 2768251 2723138 2672233 2616128 2556301 2494579 2431973 2368584
53360B368584o4013o3754o2356o0422n8739n7452n6014n4039n2103n1389n2295
$$ 2368584 2304571 2240817 2178461 2118039 2059300 2001848 1945834 1891795 1839692 1788303 1736008
53349A736008n3770n4322n3493n1885n0031m7916m5531m3163m0874l8295l5264
$$ 1736008 1682238 1627916 1574423 1522538 1472507 1424591 1379060 1335897 1295023 1256728 1221464
53338A221464l2210k9530k6986k4156k1230j8853j7293j6091j4702j3221j2310
$$ 1221464 1189254 1159724 1132738 1108582 1087352 1068499 1051206 1035115 1020413 1007192 994882
53327I94882j2339j2695j2227j0531q473p123o456n633m300k876j578j02J550
$$ 994882 982543 969848 957621 947090 938617 931494 925038 919405 915105 912229 910651 910549 912099
53314I12099K765L334M044N620P680R370J0638J2092J3967J5966J7912J9897K1829
$$ 912099 914864 918198 922242 927862 935542 944912 955550 967642 981609 997575 1015487 1035384 1057213
53301A057213K3512K5081K6721K8087K8706K8947K9731L1164L2207L1967L0599
$$ 1057213 1080725 1105806 1132527 1160614 1189320 1218267 1247998 1279162 1311369 1343336 1373935
53290A373935K8617K6094K3106K0371J8641J7702J6639J4965J2974J0973Q784
$$ 1373935 1402552 1428646 1451752 1472123 1490764 1508466 1525105 1540070 1553044 1564017 1572801
53279A572801O080K924k06k825m869o867r510j2901j6374j9300k1821k4432k7100
$$ 1572801 1578881 1581805 1581599 1578774 1573905 1567038 1557528 1544627 1528253 1508953 1487132 1462700 1435600
53266A435600k9272l0718l1786l2800l3746l4667l5768l6815l6997l5839l3908
$$ 1435600 1406328 1375610 1343824 1311024 1277278 1242611 1206843 1170028 1133031 1097192 1063284
53255A063284l2141l0782k9507k8261k7394k7020k6901k6997k7480k8156k8404
$$ 1063284 1031143 1000361 970854 942593 915199 888179 861278 834281 806801 778645 750241
53244G50241k7968k7301k6893k6648k6136k5039k3162k0471j7462j5003j3302
$$ 750241 722273 694972 668079 641431 615295 590256 567094 546623 529161 514158 500856
53233E00856j1591r333p355o912p900q843q759q227q318r174j0080j0481j0403
$$ 500856 489265 479932 472577 465665 457765 448922 440163 431936 423618 414444 404364 393883 383480
53220C83480j0114r803r528r180q605p863p245o878o513n936n380n271n656o114
$$ 383480 373366 363563 354035 344855 336250 328387 321142 314264 307751 301815 296435 291164 285508 279394
53206B79394o179n719m852l810k899k439k574l064l407l223k688k404k833l826
$$ 279394 273215 267496 262644 258834 255935 253496 250922 247858 244451 241228 238540 236136 233303 229477
53192B29477m848n476n587n131m083k637j237k79J42J41j10m74q50j163j287j133
$$ 229477 224629 219153 213566 208435 204352 201715 200478 200199 200341 200482 200372 199898 199048 197885 196598 195465
53176A95465q21o09m93j34N77J126R45K48j88K0N18Q37Q52O20K50M2K94Q13J067
$$ 195465 194644 194035 193542 193408 193985 195111 196056 196304 196116 196136 196654 197491 198343 198963 199213 199255 199549 200362 201429
53157B01429R15P27O79M95J21K0M52R72J082Q55N42K2o47p48K04J380J350l6j363
$$ 201429 202344 203071 203750 204245 204366 204386 204838 205810 206892 207747 208289 208311 207664 206916 207120 208500 209850 209814 208451
53138B08451j446p05l54p80j301j207n05L72J037J173M20j194k798l105j768j2
$$ 208451 207005 206300 205946 205166 203865 202658 202153 202525 203562 204735 205155 203961 201163 198058 196290 196278
53122A96278N55l16j383j543r76n21n70r61j477j918j969j555j112j039j134r58
$$ 196278 196833 196517 195134 193591 192615 192094 191524 190563 189086 187168 185199 183644 182532 181493 180359 179401
53106A79401n97m41m56k40J96L53Km94p79r38j116j128p40j13L03K25k63q26j124
$$ 179401 178804 178363 177907 177667 177863 178216 178218 177724 176945 176007 174891 173763 173023 172910 173213 173438 173175 172349 171225
53087A71225r87n05Q6N78Q45P96M12k32r34j321r79L7R56R86L31m5J49R0p55j569
$$ 171225 170238 169733 169819 170397 171242 172038 172450 172218 171284 169963 168984 169021 169977 170963 171294 171249 171398 171488 170733 169164
53067A69164j317l68J4n07j028q69m02j70r4R0K86K62Lm47r94j193n60N99J209
$$ 169164 167847 167479 167493 166986 165958 165089 164687 164517 164423 164513 164799 165061 165064 164617 163623 162430 161870 162469 163678
53048A63678O82l19p02j37Q50J536J444O04k87l72L35Q21L33o17r89o10k29m27
$$ 163678 164360 164041 163339 163202 164052 165588 167032 167636 167349 166977 167312 168133 168466 167849 166860 166250 166021 165594
53030A65594j008j418j351q57k71m5l48p81p17K2Q97J159N70l45p63l32N31J187
$$ 165594 164586 163168 161817 160960 160689 160644 160296 159515 158798 158820 159717 160876 161446 161101 160338 160006 160537 161724
53012A61724J430J357R00J8p47n92M66J403J375N87k88r84j539j825j672j185
$$ 161724 163154 164511 165411 165429 164682 164090 164556 165959 167334 167921 167633 166649 165110 163285 161613 160428
52996A60428n11L72J246J493Q76J01k1L45M88L01K45L48J42l69n81l08j55n18
$$ 160428 159917 160289 161535 163028 163904 164005 163984 164329 164817 165118 165363 165711 165853 165484 164903 164595 164440 163922
52978A63922r12p12n4N08Q16J100J436J682J812J851J612R00n7o95p56n05k65
$$ 163922 163010 162298 162244 162752 163568 164668 166104 167786 169598 171449 173061 173961 173904 173209 172453 171948 171683
52961A71683k7L33O78O76K29m24r92j366j533j420j101r08j110j448j328o05J25
$$ 171683 171656 171989 172667 173343 173572 173148 172156 170790 169257 167837 166736 165828 164718 163270 161942 161337 161462
52944A61462K57n2j43K14N04J64o46j146p86J07N86J04q42j298j029p62j061j446
$$ 161462 161719 161667 161524 161738 162242 162406 161760 160614 159828 159935 160521 160625 159783 158485 157456 156694 155633 154187
52926A54187j045Q5R18P82J93J12O51R67L34r30j768j537o50nR7J88O82J103O39
$$ 154187 153142 153227 154145 154927 155120 155232 155883 156850 157184 156254 154486 152949 152299 152294 152391 152579 153261 154364 155003
52907A55003o93j873j969j062N4P81J067J056Q09L88L6K3K93M22M4o93j169r00
$$ 155003 154310 152437 150468 149406 149460 150241 151308 152364 153173 153561 153597 153620 153913 154335 154379 153686 152517 151617
52889A51617n5P03Q56N65M72J018J875K168J387k3j165j668j885k117k062j313
$$ 151617 151562 152265 153121 153686 154158 155176 157051 159219 160606 160583 159418 157750 155865 153748 151686 150373
52873A50373p3R72J388J306J068Q77Q07R32J277J717K012J945J512R15L63j07
$$ 150373 150300 151272 152660 153966 155034 155911 156718 157650 158927 160644 162656 164601 166113 167028 167391 167284
52857A67284n06p60r31j418k491l649l955l197k224j840j849j564q38j03L43N43
$$ 167284 166778 166018 165087 163669 161178 157529 153574 150377 148153 146313 144464 142900 142062 141959 142302 142845
52841A42845N15K16k05n14o18m40J74J028J413R09L7m61o81j117j448q11P26J937
$$ 142845 143360 143576 143371 142857 142239 141799 141973 143001 144414 145323 145360 144899 144218 143101 141653 140842 141568 143505
52823A43505J970J245N09j54q85j349j166n22K00J040K116L109L587L575L255
$$ 143505 145475 146720 147229 147075 146190 144841 143675 143153 143353 144393 146509 149618 153205 156780 160035
52808A60035K375O14j647l439m066l539k350j197o83q13r06m60J17P1n76j124
$$ 160035 162410 163024 161377 157938 153872 150333 147983 146786 146103 145290 144384 143924 144041 144112 143536 142412
52792A42412j245j288j473j460r52j73N16J066J502J607J235O76L56L16K73O4
$$ 142412 141167 139879 138406 136946 135994 135821 136337 137403 138905 140512 141747 142423 142779 143095 143368 143432
52776A43432j69k55k21k63n35r58j188q78m5Q61J386J416J120O49P2m61p02n35
$$ 143432 143263 143008 142787 142524 141989 141031 139843 138965 138920 139781 141167 142583 143703 144352 144424 143963 143261 142726
52758A42726j65M5k9j13P3L69L32j58p12r38q70o63k52L29O24K93k08p7O61J136
$$ 142726 142561 142606 142577 142464 142537 142906 143238 143080 142368 141430 140560 139897 139645 139974 140598 140891 140683 140606 141267 142403
52738A42403R10N71P41J165J317J335J585J700R13o69j871j790p23L78Q80O45
$$ 142403 143313 143884 144625 145790 147107 148442 150027 151727 152640 151971 150100 148310 147587 147965 148845 149490
52722A49490j88j135j493r96k12J03j16l88m75n99q57r42o15j57m7l43n77k75
$$ 149490 149302 148167 146674 145678 145466 145569 145453 145065 144590 143991 143134 142192 141577 141420 141373 141030 140453 140178
52704A40178N16J245J390R57L93O1p6j98k58q2L22P84J240J737K159K199J693
$$ 140178 140694 141939 143329 144286 144679 144740 144664 144466 144208 144126 144448 145232 146472 148209 150368 152567 154260
52687A54260Q35N6k54L4O11R34P49M01L58N46N11J44j57j54j15k93m59k71J70
$$ 154260 155095 155151 154897 154931 155542 156476 157225 157626 157984 158530 159041 159185 159028 158874 158759 158466 158007 157736 157906
52668A57906M79M89L66L25M39O21O61M18Q4M9M26R44J335J494J128j24j927l121
$$ 157906 158385 158874 159240 159565 160004 160625 161286 161704 161788 161837 162263 163207 164542 166036 167164 167040 165113 161992
52650A61992k891j707o38r3J48J03l92r47q00R7Q86R19M79J72J41J76K40M71R17
$$ 161992 159101 157394 156756 156663 156811 156914 156522 155575 154775 154872 155758 156677 157156 157328 157469 157645 157885 158356 159273
52631A59273J416J658J365P01L75R08J789J900Q85m57j219j303j138j007j004
$$ 159273 160689 162347 163712 164413 164788 165696 167485 169385 170270 169813 168594 167291 166153 165146 164142
52616A64142j089r52l15M02L51m60q05K33J936K829K440J479N77k48j016j448
$$ 164142 163053 162101 161786 162188 162539 162079 161274 161507 163443 166272 168712 170191 170768 170520 169504 168056
52600A68056j360q10J03J158J773J481O41J26K18M26M53O66J241J546R01l64j201
$$ 168056 166696 165886 165989 167147 168920 170401 171042 171168 171386 171812 172265 172931 174172 175718 176619 176255 175054
52583A75054j075m55r8j88l28j12M31R50J168J055O70M8o87j198j174o41O3N73
$$ 175054 173979 173524 173426 173238 172910 172798 173229 174179 175347 176402 177072 177120 176433 175235 174061 173420 173483 174056
52565A74056O38J52p02j411j541j176p42m15pN63J009R97O18L41M95Q49P49j28
$$ 174056 174694 174846 174144 172733 171192 170016 169274 168859 168852 169415 170424 171421 172039 172380 172875 173724 174473 174345
52547A74345j136j150R7J484J757J044N12O45O55j85j320j647r77j93q1n42j022
$$ 174345 173209 172059 172156 173640 175397 176441 176953 177598 178253 178068 176748 175101 174124 173931 173850 173308 172286
52530A72286j267j399j509j473j195p73l51Q4N55Q12N04k01n74j47O51J051R24
$$ 172286 171019 169620 168111 166638 165443 164670 164319 164403 164958 165770 166274 166073 165499 165352 166003 167054 167978
52513A67978P46P66P96Q21J162J839K371K483K458K432J953P43n47j038q63q84
$$ 167978 168724 169490 170286 171107 172269 174108 176479 178962 181420 183852 185805 186548 186001 184963 184100 183216
52497A83216j352j566j024k05J46J0j11o8k30p92j318j198l88M86P85M92R1j03
$$ 183216 181864 180298 179274 179069 179215 179225 179114 179046 178816 178024 176706 175508 175120 175606 176391 176883 176974 176871
52479A76871k37n07o45k10P90J735K018J567P75J02j73NM46Q26R75J079J498K351
$$ 176871 176634 176127 175482 175272 176062 177797 179815 181382 182157 182259 182086 182091 182537 183363 184338 185417 186915 189266
52461A89266L298L731L235J913L30q81j359j146o18l55p70j644k158j724p08q8
$$ 189266 192564 196295 199530 201443 201773 200892 199533 198387 197769 197414 196644 195000 192842 191118 190410 190322
52445A90322l58j102j712k036k125j757p83L33Q60P53O43Q07P41O5p01q16l70
$$ 190322 189964 188862 187150 185114 182989 181232 180449 180782 181642 182395 183038 183845 184586 184651 183950 183134 182764
52428A82764mK05P79J685K029J297L21L54J472K597L005L244M313O379Q510R564
$$ 182764 182760 182965 183744 185429 187458 188755 189076 189430 190902 193499 196504 199748 204061 210440 218950 228514
52412B28514R102P570N664L595J112j840m678o642p479p405o644n362l969k925
$$ 228514 237616 245186 250850 254445 255557 253717 249039 242397 234918 227513 220869 215507 211538 208613
52398B08613k197j389m65J05R7j2L05Q94J242J194R77P37N38N80J000J443J411
$$ 208613 206416 205027 204562 204667 204764 204752 205057 205951 207193 208387 209364 210101 210639 211219 212219 213662 215073
52381B15073J005Q45J162J451J301J129J648K862M006M447M225L723L178K735
$$ 215073 216078 216923 218085 219536 220837 221966 223614 226476 230482 234929 239154 242877 246055 248790
52367B48790K598K813L064L067L044L360L695L193J685K90K03J225K142K346K346
$$ 248790 251388 254201 257265 260332 263376 266736 270431 273624 275309 275599 275802 277027 279169 281515 283861
52352B83861K688L275L967N017O374P308P446P569Q573J0076J1005J1305J1911
$$ 283861 286549 289824 293791 298808 305182 312490 319936 327505 336078 346154 357159 368464 380375
52339C80375J3095J3995J4080J4023J4503J5049J4806J3878J3087J2838J2957
$$ 380375 393470 407465 421545 435568 450071 465120 479926 493804 506891 519729 532686
52328E32686J3330J3898J4202J3684J2491J1318J0445R529Q351P123N914M448
$$ 532686 546016 559914 574116 587800 600291 611609 622054 631583 639934 647057 652971 657419
52316F57419K715J187R2r96k470l989m957n365n648n896n732m979m040l500l517
$$ 657419 660134 661321 661413 660417 657947 653958 649001 643636 637988 632092 626360 621381 617341 613841 610324
52301F10324l612l008j336Q67K549L193L267L444L801M054M228M541M889N075
$$ 610324 606712 603704 602368 603235 605784 608977 612244 615688 619489 623543 627771 632312 637201 642276
52287F42276N421O468Q091R530J0454J1196J1820J1676J0404Q753P761P449P027
$$ 642276 647697 654165 662256 671786 682240 693436 705256 716932 727336 736089 743850 751299 758326
52274G58326O146N279M920M908M656L650J719q52l291m834n339n321n371n727
$$ 758326 764472 769751 774671 779579 784235 787885 789604 788752 785461 780627 775288 769967 764596 758869
52260G58869o321o877o972o340n271m448m203m124l509k147n32O09R05N04k17
$$ 758869 752548 745671 738699 732359 727088 722640 718437 714313 710804 708657 708125 708734 709639 710143 709926
52245G09926r37j408j338o31L31R89J327J854K735L386L368L176L495M121M328
$$ 709926 708989 707581 706243 705612 705943 706932 708259 710113 712848 716234 719602 722778 726273 730394 734722
52230G34722M090M034M261M170L647L469M080M872N158N189N497N909N994O039
$$ 734722 738812 742846 747107 751277 754924 758393 762473 767345 772503 777692 783189 789098 795092 801131
52216H01131O607P388P391O292M874L973L671L668L813L993L902L323K457J742
$$ 801131 807738 815126 822517 828809 833683 837656 841327 844995 848808 852801 856703 860026 862483 864225
52202H64225J419J355J159N71j62m12K8M66P5r19j467j155p88j201k061k419k099
$$ 864225 865644 866999 868158 868729 868567 868155 868183 868649 868724 867805 866338 865183 864395 863194 861133 858714 856615
52185H56615j890k399l301l906m032m043m166m160l643k613j513q33p21r45j170
$$ 856615 854725 852326 849025 845119 841087 837044 832878 828718 825075 822462 820949 820116 819395 818450 817280
52170H17280j230j175j122j084r19m39L75J329K164K749L078L140K903K443K022
$$ 817280 816050 814875 813753 812669 811750 811311 811686 813015 815179 817928 821006 824146 827049 829492 831514
52155H31514J895J997J981J693J498J856K654L307L684M380N775P287Q122Q315
$$ 831514 833409 835406 837387 839080 840578 842434 845088 848395 852079 856459 862234 869521 877643 885958
52141H85958Q364Q197P395O404O352P481Q755R379R701J0157J0375J0130J0168
$$ 885958 894322 902519 909914 916318 922670 930151 938906 948285 957986 968143 978518 988648 998816
52128I98816J1011J1820J1604J0870J0757J1030J0495R155Q256Q109P537N955
$$ 998816 1009827 1021647 1033251 1044121 1054878 1065908 1076403 1085558 1093814 1101923 1109460 1115415
52116A115415M436L905L559K103l47k627m114n041n703o281o993p756p905o932
$$ 1115415 1119851 1123756 1127315 1129418 1129071 1126444 1122330 1117289 1111586 1105305 1098312 1090556 1082651 1075719
52102A075719n203l404j630L65K438M175N512O681P707Q445Q863Q905Q402P504
$$ 1075719 1070516 1067112 1065482 1065847 1068285 1072460 1077972 1084653 1092360 1100805 1109668 1118573 1126975 1134479
52088A134479O791O598O726P193Q494J0489J1884J1792J1182J1571J2740J2990
$$ 1134479 1141270 1147868 1154594 1161787 1170281 1180770 1192654 1204446 1215628 1227199 1239939 1252929
52076A252929J1497R123O960N311M146L340K151l25l719o542q177r675j1939j4250
$$ 1252929 1264426 1273549 1280509 1285820 1289966 1293306 1295457 1295132 1291413 1284871 1276694 1267019 1255080 1240830
52062A240830j5451j5791j6454j7764j8900j9233j8990j8558j7891j6818j5508
$$ 1240830 1225379 1209588 1193134 1175370 1156470 1137237 1118247 1099689 1081798 1064980 1049472
52051A049472j4359j3595j3046j2380j1561j1033j1118j1330j0759r219p477o179
$$ 1049472 1035113 1021518 1008472 996092 984531 973498 962380 951050 940291 931072 923595 917416
52039I17416n064l623j918l31J084K426L373L274J832n76l070m732n271n517o725
$$ 917416 912352 908729 906811 906480 907564 909990 913363 916637 918469 917893 914823 910091 904820 899303 892578
52024H92578r153j1694j3256j3838j3869j3249j1826j0366r963j0724j1813j2726
$$ 892578 883425 871731 858475 844637 830768 817519 805693 795327 785364 774640 762827 750101
52012G50101j3618j4414j4521j3792j2939j2621j2593j2202j1282j0216r375q807
$$ 750101 736483 722069 707548 693756 680817 668196 655603 643401 632119 621903 612528 603721
52000F03721q381q012p799p939q367q564q056p000n953n121m346l728l707m261
$$ 603721 595340 587328 579529 571590 563223 554659 546603 539603 533650 528529 524183 520455 516748 512487
51986E12487m649m255l389k912l313m429n819p093q059q776r394r755r370q018
$$ 512487 507838 503583 500194 497282 493969 489540 483721 476628 468569 459793 450399 440644 431274 423256
51972D23256o248m958m481m274l560k124m78P23J341J817K554L419L918L789L213
$$ 423256 417008 412050 407569 403295 399735 397611 397133 397856 399197 401014 403568 406987 410905 414694 417907
51957D17907K506J787R57k01j807l650n187o000o165n937n213l670j423Q39K543
$$ 417907 420413 422200 423157 422956 421149 417499 412312 406312 400147 394210 388997 385327 383904 384743 387286
51942C87286L769M927O175P312Q075Q358Q158P428N975L701J004j322k862m028
$$ 387286 391055 395982 402157 409469 417544 425902 434060 441488 447463 451164 452168 450846 447984 443956
51928D43956n364o718p611q143q858r713j0069r800r595r766r553q226o253m798
$$ 443956 438592 431874 424263 416120 407262 397549 387480 377680 368085 358319 348766 340540 334287 329489
$$ [...]
##END NTUPLES=NMR SPECTRUM
##END=
