
##TITLE=AC1372_2418_7221647_llQExT8r8K
##JCAMPDX= 6.0         $$ Bruker NMR JCAMP-DX V2.0
##DATA TYPE= NMR SPECTRUM
##DATA CLASS= NTUPLES
##ORIGIN= BRUKER
##OWNER= Administrator
$$ 1.72 TOPSPIN		Version 2.1
$$ 2012-12-13 19:56:57.113 -0500  Administrator@X
$$ Compression mode = diff/dup
##.OBSERVE FREQUENCY= 400.02188249412
##.OBSERVE NUCLEUS= ^1H
##.ACQUISITION MODE= SIMULTANEOUS (DQD)
##.ACQUISITION SCHEME= undefined
##.AVERAGES= 8
##.DIGITISER RES= 22
##SPECTROMETER/DATA SYSTEM= spect
##.PULSE SEQUENCE= zg30
##.SOLVENT NAME= COFFEE_meoh
##.SHIFT REFERENCE= INTERNAL, COFFEE_meoh, 1, 14.98509
##AUDIT TRAIL= $$ (NUMBER, WHEN, WHO, WHERE, PROCESS, VERSION, WHAT)
$$ ##TITLE= Audit trail, TOPSPIN		Version 2.1
$$ ##JCAMPDX= 5.01
$$ ##ORIGIN= Bruker BioSpin GmbH
$$ ##OWNER= Administrator
$$ $$ E:\/data/COFFEE/nmr/AC1372_2418_7221647_llQExT8r8K/10/pdata/1/auditp.txt
$$ ##AUDIT TRAIL=  $$ (NUMBER, WHEN, WHO, WHERE, PROCESS, VERSION, WHAT)
(   1,<2012-12-13 19:56:48.879 -0500>,<Administrator>,<X>,<go>,<TOPSPIN 2.1>,
      <created by zg
	started at 2012-12-13 19:55:42.488 -0500,
	POWCHK enabled, PULCHK disabled,
       configuration hash MD5:
       86 BA 57 50 F2 9D 5C 9B 26 00 A9 28 5F 66 2E 89
       data hash MD5: 64K
       2B 57 A7 88 20 31 26 85 D6 56 22 F4 46 8C 9D DE>)
(   2,<2012-12-13 19:56:51.973 -0500>,<Administrator>,<X>,<proc1d>,<TOPSPIN 2.1>,
      <Start of raw data processing
       efp LB = 0 FT_mod = 6 PKNL = 1 PHC0 = 0 PHC1 = 0 SI = 32K 
       data hash MD5: 32K
       00 78 D0 5F 5F E8 2D EC D9 F4 DA 9F 72 FE 68 68>)
(   3,<2012-12-13 19:56:52.426 -0500>,<Administrator>,<X>,<proc1d>,<TOPSPIN 2.1>,
      <pk PHC0 = 101.7389 PHC1 = 0 
       data hash MD5: 32K
       3E 86 9B 3F 6F 63 3C 03 3C 6C 5C E3 AB 33 1A 5E>)
(   4,<2012-12-13 19:56:52.645 -0500>,<Administrator>,<X>,<proc1d>,<TOPSPIN 2.1>,
      <abs ABSG = 1 
       data hash MD5: 32K
       3F B4 67 F7 8C 12 C1 57 07 42 22 74 38 9F 03 AB>)
(   5,<2012-12-13 19:56:52.801 -0500>,<Administrator>,<X>,<proc1d>,<TOPSPIN 2.1>,
      <abs ABSG = 2 
       data hash MD5: 32K
       83 3C 78 18 68 62 67 3C C5 6F B8 F1 96 87 11 73>)
(   6,<2012-12-13 19:56:52.926 -0500>,<Administrator>,<X>,<proc1d>,<TOPSPIN 2.1>,
      <abs ABSG = 3 
       data hash MD5: 32K
       F2 84 97 BB 3E 6C E4 06 6E E9 AC 54 90 2C B4 66>)
(   7,<2012-12-13 19:56:53.082 -0500>,<Administrator>,<X>,<proc1d>,<TOPSPIN 2.1>,
      <abs ABSG = 4 
       data hash MD5: 32K
       BC CA D5 CD 88 B6 1C 8A 03 D2 9A 1B D3 EC DB DA>)
(   8,<2012-12-13 19:56:53.223 -0500>,<Administrator>,<X>,<proc1d>,<TOPSPIN 2.1>,
      <abs ABSG = 5 
       data hash MD5: 32K
       5A 8C 0E 2B D3 BD 1C 60 4F A9 41 A2 09 BF F1 BA>)
$$ ##END=
$$ 
$$ $$ hash MD5
$$ $$ D2 8E F1 1B CB 99 A6 4D 92 93 08 A6 77 80 EA 83
##$RELAX= 
##$RELAX= 
##$RELAX= 
##$RELAX= 
##$RELAX= 
##$RELAX= 
##$RELAX= 
##$RELAX= 
$$ Bruker specific parameters
$$ --------------------------
##$DU= <E:\>
##$EXPNO= 10
##$NAME= <AC1372_2418_7221647_llQExT8r8K>
$$ [...]
##$TP= (0..7)
150 150 150 150 150 150 150 150
##$TP07= 0
##$TPNAME0= <>
##$TPNAME1= <>
##$TPNAME2= <>
##$TPNAME3= <>
##$TPNAME4= <>
##$TPNAME5= <>
##$TPNAME6= <>
##$TPNAME7= <>
##$TPOAL= (0..7)
0.5 0.5 0.5 0.5 0.5 0.5 0.5 0.5
##$TPOFFS= (0..7)
0 0 0 0 0 0 0 0
##$TUNHIN= 0
##$TUNHOUT= 0
##$TUNXOUT= 0
##$USERA1= <user>
##$USERA2= <user>
##$USERA3= <user>
##$USERA4= <user>
##$USERA5= <user>
##$V9= 5
##$VALIST= <valist>
##$VCLIST= <CCCCCCCCCCCCCCC>
##$VD= 0
##$VDLIST= <DDDDDDDDDDDDDDD>
##$VPLIST= <PPPPPPPPPPPPPPP>
##$VTLIST= <TTTTTTTTTTTTTTT>
##$WBST= 1024
##$WBSW= 4
##$XGAIN= (0..3)
0 0 0 0
##$XL= 0
##$YL= 0
##$YMAX_a= 650823
##$YMIN_a= -556030
##$ZGOPTNS= <>
##$ZL1= 120
##$ZL2= 120
##$ZL3= 120
##$ZL4= 120
##$ABSF1= 14.98509
##$ABSF2= -5.573092
##$ABSG= 5
##$ABSL= 3
##$ALPHA= 0
##$AQORDER= 0
##$ASSFAC= 0
##$ASSFACI= 0
##$ASSFACX= 0
##$ASSWID= 0
##$AUNMP= <proc_prof1d_extract_pilot.lims>
##$AXLEFT= 0
##$AXNAME= <>
##$AXNUC= <1H>
##$AXRIGHT= 0
##$AXTYPE= 0
##$AXUNIT= <>
##$AZFE= 0.1
##$AZFW= 0.1
##$BCFW= 0
##$BC_mod= 0
##$BYTORDP= 0
##$COROFFS= 0
##$CY= 15
##$DATMOD= 1
##$DC= 0
##$DFILT= <>
##$DTYPP= 0
##$F1P= 0
##$F2P= 0
##$FCOR= 0.5
##$FTSIZE= 32768
##$FT_mod= 6
##$GAMMA= 0
##$GB= 0
##$INTBC= 1
##$INTSCL= 1
##$ISEN= 128
##$LB= 0
##$LEV0= 0
##$LPBIN= 0
##$MAXI= 10000
##$MC2= 0
##$MEAN= 0
##$ME_mod= 0
##$MI= 0
##$NCOEF= 0
##$NC_proc= -8
##$NLEV= 6
##$NOISF1= 0
##$NOISF2= 0
##$NSP= 0
##$NTH_PI= 0
##$NZP= 0
##$OFFSET= 14.98509
##$PC= 1
##$PHC0= 101.7389
##$PHC1= 0
##$PH_mod= 1
##$PKNL= yes
##$PPARMOD= 0
##$PPDIAG= 0
##$PPIPTYP= 0
##$PPMPNUM= 2147483647
##$PPRESOL= 1
##$PSCAL= 4
##$PSIGN= 0
##$PYNMP= <proc.py>
##$REVERSE= no
##$SF= 400.02
##$SI= 32768
##$SIGF1= 0
##$SIGF2= 0
##$SINO= 400
##$SIOLD= 32768
##$SPECTYP= <>
##$SREGLST= <1H.CDCl3>
##$SSB= 0
##$STSI= 32768
##$STSR= 0
##$SW_p= 8223.68421052631
##$SYMM= 0
##$S_DEV= 0
##$TDeff= 65536
##$TDoff= 0
##$TI= <>
##$TILT= no
##$TM1= 0
##$TM2= 0
##$TOPLEV= 0
##$USERP1= <user>
##$USERP2= <user>
##$USERP3= <user>
##$USERP4= <user>
##$USERP5= <user>
##$WDW= 1
##$XDIM= 32768
##$YMAX_p= 467630049
##$YMIN_p= -744517
##$CURPLOT= <Network HP LaserJet P1505>
##$CURPRIN= <$Network HP LaserJet P1505>
##$DFORMAT= <normdp>
##$LAYOUT= <+/1D_H.xwp>
##$LFORMAT= <normlp>
##$PFORMAT= <normpl>
##$SURQMSG= 1
$$ End of Bruker specific parameters
$$ ---------------------------------
##NTUPLES= NMR SPECTRUM
##VAR_NAME=  FREQUENCY,     SPECTRUM/REAL,   SPECTRUM/IMAG
##SYMBOL=    X,             R,               I
##VAR_TYPE=  INDEPENDENT,   DEPENDENT,       DEPENDENT
##VAR_FORM=  AFFN,          ASDF,            ASDF
##VAR_DIM=   32768,         32768,           32768
##UNITS=     HZ,            ARBITRARY UNITS, ARBITRARY UNITS
##FACTOR=    0.250966925370066, 1,           1
##FIRST=     8223.43324360094, 26104,        18778
##LAST=      0,             151871,          -88119
##MIN=       0,             -744517,         0
##MAX=       8223.43324360094, 467630049,    0
$$ Real data points
##PAGE= N=1
##DATA TABLE= (X++(R..R)), XYDATA
$$ [...]
19538a94177c0320E9833f32332K24185C8543a41047B23986A11806M8313a50295
19527A2064O8572J4343e2700m8669A13579j3223A9211b12011K2699g889k38602
19516b46491m5546q6355F1631N0048d1001M171j15328m8787o3273J01236d4583
19504b44005E4183N1375h9252C05034G778m72f8961K9527o9251F8781M3513K54410
19492C66704c5789A74700c2930m5603d011k30509B43757a43209C43108A47877
19481A84320b41719A4402K7312b84571A96845b47675n8336c3575D026P2323A7156
19469a8285j57231H5205i9426a7232k38154e2546j87102A20919a54921R52b4331
19457A44002G099b50551J2616A23133k2456A668c06458I4385e4182C1186o152
$$ plain form
19538 -194177 -30320 59833 -632332 -408147 38543 -141047 223986 111806 160119 -150295
19527 12064 80636 94979 -52700 -101369 113579 100356 19211 -212011 -189312 -7889 -246491
19516 -246491 -292037 -378392 61631 111679 -41001 -36830 -152158 -200945 -264218 -162982 -44583
19504 -244005 54183 105558 -89252 305034 7778 7306 -68961 -39434 -108685 68781 112294 366704
19492 366704 -35789 174700 -32930 -78533 -4011 -234520 243757 -143209 343108 147877
19481 184320 -241719 14402 41714 -284571 196845 -247675 -306011 -33575 4026 76349 17156
19469 -18285 -175516 85205 -99426 -17232 -255386 -52546 -239648 120919 -154921 -153969 -24331
19457 144002 7099 -250551 -237935 123133 100677 1668 -306458 94385 -54182 31186 25034
19446B5034a44503A41691b13039j19308e661k65630A65190n583d1245q9781o1950
19435a92976M1829j3428g0412l41381B61961H811b4081j40538e4841m2013k19471
19424c16325J52736j13880C8792a62256A31811m6278B2049J11784n7992e74470
19413b35809a12343O723H8409R8518a61416D206c05369i4034c2534j13670o7k201
19401a48472K5506A63534b9077A20732a05177I1425e2142A08233h6442n032j51709
19390b43183Q2258K2348k10361J49763F4316J83298a25615k3776l224G0460k2938
19379D7522a78005A06675d6133F156J21006c12805e2327F2306E410c15490a27607
19367a9559l22830A09229h0830M437F5175a07062c9463j45780A03599m3596q032
$$ plain form
19446 25034 -144503 141691 -213039 -332347 -5661 -271291 165190 159607 -41245 -131026 -192976
19435 -192976 -151147 -164575 -70412 -411793 261961 8811 -24081 -164619 -54841 -96854 -316325
19424 -316325 -163589 -277469 38792 -162256 131811 85533 22049 133833 75841 -574470
19413 -235809 -112343 -105620 88409 186927 -161416 4206 -305369 -94034 -32534 -146204 -146271 -148472
19401 -148472 -122966 163534 -29077 120732 -105177 91425 -52142 108233 -86442 -91474 -243183
19390 -243183 -160925 -138577 -348938 -199175 64316 247614 -125615 -149391 -152615 70460 47522
19379 47522 -178005 106675 -46133 6156 127162 -312805 -52327 62306 5410 -315490 -127607
19367 -19559 -342389 109229 -80830 -76393 65175 -107062 -39463 -185243 103599 60003 51971
19356E1971Q2551b13933A09092c7091A52274b49096A51865b90313B17720I9030
19345c6986m1700p8421e524m49423a2742B0556d04588J85511a2941H3563c10591
19333A85243F6945b95693I9181J95836a50929G036M2287L0322d0781n9064A13464
19321h4813c9706j2145a9062k4589d611G7922b71621d9034q9216N6804A34581
19309d0916m29267H6435A8260a28817n3636P2992j04080R8177D8610J5030q465
19298E5175a42003K3118r7979a01123A17161O9776H2387c3959j64467A15186b81397
19286C64592a08762e2683B4939h4163H7024c12611j60226A72473b59183K9304
19276b29879g9671A62505C9853b8362q6537F9578c1228j02528G256a56378c2809
$$ plain form
19356 51971 134522 -213933 109092 -37091 152274 -249096 151865 -290313 217720 99030
19345 -36986 -78686 -157107 -5524 -454947 -12742 20556 -404588 -219077 -12941 83563 -310591
19333 185243 66945 -295693 99181 295017 -150929 7036 49323 79645 -40781 -99845 113464
19321 -84813 -39706 -51851 -19062 -43651 -4611 77922 -271621 -49034 -138250 -81446 134581
19309 -40916 -470183 86435 18260 -128817 -182453 -109461 -213541 -115364 48610 63640 55175
19298 55175 -142003 -118885 -216864 -101123 117161 186937 82387 -33959 -198426 115186 -281397
19286 364592 -108762 -52683 24939 -84163 87024 -312611 -472837 172473 -259183 -229879
19276 -229879 -79671 162505 39853 -28362 -114899 69578 -31228 -133756 7256 -156378 -32809
19264c03991J33818A2647J3243L7181k021l514a85965d4161J1942n4394G1661
19252d90o9536C15076I4813A3038c68425o7478a16714B09372q4132a93395C45160
19240A48949f844j75544m8760c8075k2736j26175j93385L6711C2326J8287A5251
19228c9771F3807a02673o2886e8517f87m12873a15495l08142I8122J59190c71477
19216d3295B35034a79501F5962L7128P6092b88026I8199n86A6708a73423P6197
19205i7226H0653e417A54049a35524m6261f7969m4749o5411k3140G4938c16313
19193e7420l44368a84761a4307l99341J44557h8410c903j08743F7730b01100i7838
19181e3582l75141B75020j24539b9549j88700i7599A7103a48972d6380j07357
$$ plain form
19264 -303991 -170173 12647 25890 63071 61050 57536 -185965 -44161 -32219 -86613 71661
19252 -490 -70026 315076 94813 13038 -368425 -435903 -116714 209372 125240 -193395 345160
19240 148949 -6844 -182388 -231148 -38075 -60811 -186986 -380371 -343660 32326 50613 15251
19228 -39771 63807 -102673 -165559 -58517 -687 -413560 -115495 -423637 98122 257312 -371477
19216 -43295 235034 -179501 65962 103090 179182 -288026 98199 97613 16708 -173423 -97226
19205 -97226 80653 -5417 154049 -135524 -181785 -67969 -112718 -178129 -201269 74938 -316313
19193 -57420 -401788 -184761 -14307 -413648 -269091 -88410 -3903 -112646 67730 -201100 -97838
19181 -53582 -428723 275020 150481 -29549 -218249 -97599 17103 -148972 -46380 -153737
19171a53737E4679b65013e4050H745K37516b30331G1683d2618B3053K0798J12380
19160A56231q306E3192b02901B31681j02944M6783A3274a79755c8524E0057M937
19149E4994c43279O3080I4942j1255f7973E2688J63583a33051B21510B4032a6287
19137b31790A35063B5461i3835A11884n2200a11322A1092b09509A01258b72126
19126a66677B12932e06350B48903K06034j76739j07388B3307I892i9441f82A06563
19114b92004J17056K3661j25756A39165c90396J49918a02833B34679a12566q12
19104a13378j39788D3143i091k14984c1692k5517k48868H5161n297J52819b14777
19092b28241H3494c7864k20565n746J02712j01593K1659L1921j13247R6809A63689
$$ plain form
19171 -153737 54679 -265013 -54050 8745 246261 -230331 71683 -42618 23053 43851 156231
19160 156231 147925 53192 -202901 231681 128737 175520 13274 -179755 -38524 50057 54994
19149 54994 -343279 -280199 94942 83687 -67973 52688 216271 -133051 221510 24032 -16287
19137 -231790 135063 25461 -93835 111884 59684 -111322 11092 -209509 101258 -272126
19126 -166677 212932 -506350 248903 454937 278198 170810 23307 9892 -99441 -682 106563
19114 -292004 -174948 -151287 -277043 139165 -390396 -240478 -102833 234679 -112566 -113378
19104 -113378 -253166 43143 -9091 -224075 -31692 -57209 -306077 85161 79864 232683 -214777
19092 -228241 83494 -37864 -258429 -264175 -161463 -263056 -241397 -209476 -322723 -225914 163689
19080a86182e4902l22407B47663a68350n4103l2959A77183M7547J39914c0265
19069D1709b66077o2556B01866q8897a27050j36918A47306a41019L5487J4636
19059i0896A04557a98840e6124l9946a7990k74589a09901k07642a16073A25038
19048e2992j03433b4280n9886B07503c06253A92963E8896b78390B05982c958j17774
19037a21732A25437o0317a69793I0275B6561J23974r19J26640b23765a108A46932
19025b48217B14811E2505b76923A33566a4769D363c10019P2322B10308a6655A17961
19013h8254A40458h1034A12775a24132N9897A77855D95Q203a59482B20148j08549
19002A11599d9437j81773D975c38109O0157J15476c3804A7890b55787B6975a75066
$$ plain form
19080 -186182 -54902 -377309 247663 -168350 -222453 -255412 177183 224730 364644 -30265
19069 41709 -266077 -328633 201866 112969 -127050 -263968 147306 -141019 -105532 -90896
19059 -90896 104557 -198840 -56124 -96070 -17990 -292579 -109901 -317543 -116073 125038
19048 -52992 -156425 -24280 -84166 207503 -306253 192963 58896 -278390 205982 -3958 -121732
19037 -121732 125437 65120 -169793 90275 26561 150535 149616 276256 -223765 -1108 146932
19025 -248217 214811 52505 -276923 133566 -14769 4363 -310019 -237697 210308 -16655 117961
19013 -88254 140458 -81034 112775 -124132 -64235 177855 495 8698 -159482 220148 111599
19002 111599 -49437 -231210 4975 -338109 -277952 -162476 -33804 17890 -255787 26975 -175066
18990b72016b8455l68546A44287b56657J26177e3327o0402d2692j54160A07822
18979A98077k0343a0700A79177B0276K4546j514a52551A59017N6975a38671a9871
18967B0320e8939J6426A4305b46437B07977g3663A40659P8207F2391b62682R8700
18956a63982o8384A89916b9527j11997A47005F6759b4277A82598q0591m3556K0033
18945G8484a77785A28286J36480I0344a62019q9218B5674J4889L00037d1225l02314
18934c43539E05840g3180C5217a04497A22924c50791P1343a17756B07813D1043
18923A0281a4415m7444B55565D2506M3798N4810m9268d029G2292b91041B17030
18911H3340f0877q0365f2394j76523a2776l67414J36746K5171M9332a0091A58870
$$ plain form
18990 -272016 -28455 -397001 144287 -256657 -130480 -53327 -113729 -42692 -196852 107822
18979 198077 177734 -10700 179177 20276 44822 43308 -152551 159017 215992 -138671 -19871
18967 20320 -58939 -42513 14305 -246437 207977 -73663 140659 218866 62391 -262682 -163982
18956 -163982 -232366 189916 -29527 -141524 147005 66759 -24277 182598 102007 58451 78484
18945 78484 -177785 128286 264766 90344 -162019 -251237 25674 40563 340600 -41225 -343539
18934 -343539 505840 -73180 35217 -104497 122924 -350791 -279448 -117756 207813 41043
18923 10281 -14415 -61859 255565 42506 86304 141114 91846 -4029 72292 -291041 217030
18911 83340 -60877 -141242 -62394 -238917 -12776 -380190 -243444 -218273 -168941 -10091 158870
18899E0457b81456B18690b45968F2088a54682A18054f3347m3159M5134J8219B34216
18887b69917M4105A42804a28605j32982B27269c28228J58142K9506B0239g764
18876a01101l33719g4379A02607b0062A89349e0770k07279j02031F7354e7728
18865d2231k58743B06740c36057I2908b17390M6895b5841j52972p926F9878a39804
18853g9774a4170B17127d06696c0646k21273B29352M230b32790P0119N1874A07071
18841a53297j46122G7190b34638D8360a07982j20133D4368a17260D71066b7660
18830b11061C3595a66455b8483k56607d4522A46804k4428D3368J06982B6487M49
18819B6936f9883D6779K83308A19186m659e3660A27749a97989A31114K12423A70170
$$ plain form
18899 50457 -281456 218690 -245968 62088 -154682 118054 -63347 -106506 -61372 -43153 234216
18887 -269917 -225812 142804 -128605 -261587 227269 -328228 -170086 -140580 20239 -7764
18876 -101101 -434820 -74379 102607 -20062 189349 -50770 -258049 -360080 67354 -57728
18865 -42231 -300974 206740 -336057 92908 -217390 -170495 -25841 -178813 -186739 69878 -139804
18853 -79774 -14170 217127 -406696 -30646 -251919 229352 233582 -232790 -162671 -110797 107071
18841 -153297 -299419 77190 -234638 48360 -107982 -228115 44368 -117260 471066 -27660
18830 -211061 33595 -166455 -28483 -285090 -44522 146804 122376 43368 150350 26487 26936
18819 26936 -69883 46779 330087 119186 114527 -53660 127749 -197989 131114 343537 170170
18807D13750j60156A25664k9153K97859j42563C1496i2214H9903b04769P5204
18797a29565l7287k79747B38928a940E5990a15995K5611c9648A78694a00284H2884
18785b37027a14611l0811O0299C2067a36748b5900j91075L3909f8356b4854B56422
18773F6807J01843j5103e08611e5145A56721E620a97948r6808g7482o8916B00092
18761h8573C974a47768j10613i2610e534j28849l0430A04607r311e4216N863j157
18749d9510A10693a11911M3468m6567j5864n1734B72303a98025d0308k30527B40892
18737f8482k81939C5270P6449j9002e8988j32155K9537e1915m6B00661g9676m94078
18725e73754K35978H797Q737M4911L3147D3612b62349B77523d02445F4609R1508
$$ plain form
18807 413750 253594 125664 96511 394370 251807 31496 -92214 89903 -204769 -129565
18797 -129565 -166852 -446599 238928 -1940 55990 -115995 -90384 -39648 178694 -100284 82884
18785 -237027 -114611 -145422 -85123 32067 -136748 -25900 -216975 -183066 -68356 -24854 256422
18773 66807 168650 153547 -508611 -55145 156721 5620 -197948 -294756 -77482 -146398 200092
18761 -88573 3974 -147768 -258381 -92610 -5534 -134383 -164813 104607 95296 -54216 -48353 -49510
18749 -49510 110693 -111911 -68443 -115010 -130874 -182608 272303 -198025 -40308 -270835 240892
18737 -68482 -350421 35270 111719 92717 -58988 -191143 -161606 -51915 -51961 200661 -79676 -573754
18725 -573754 -337776 8797 17534 62445 95592 43612 -262349 277523 -402445 64609 156117
18714A56117a56825A8504J48643H2540a52948l9891A59546a45141A02767a48060
18703C84380a39626O4473A20560a30622E896a25243O2599l7198k19669G7404J56799
18692B34203a59721A71908D2926b58509M6670j60256a33656b0245r2345m0825
18682a53415O6226L732B9729M7632C042a60687g4757D06008G9178e46799D21767
18670d56589a65626A55308b27583B17649j07602a49155C04157a68824g3300j34133
18660b07433i644o8445C6990b88074a7487j09155M632n7752r9996n9568F8028
18648g5611o9557b6189P21A00561b47632C39365c03007N2987G8728B8916a43157
18636a42231p9804B01216c23288O0053g8806j52642a5286k80802A65763c11631
$$ plain form
18714 156117 -156825 18504 167147 82540 -152948 -192839 159546 -145141 102767 -148060
18703 384380 -139626 -75153 120560 -130622 5896 -125243 -62644 -99842 -319511 77404 234203
18692 234203 -159721 171908 42926 -258509 -211839 -372095 -133656 -20245 -112590 -153415
18682 -153415 -87189 -83457 29729 77361 3042 -160687 -74757 406008 79178 -546799 421767
18670 -456589 -165626 155308 -227583 217649 110047 -149155 304157 -168824 -73300 -207433
18660 -207433 -9644 -78089 36990 -288074 -17487 -126642 -122010 -179762 -279758 -339326 68028
18648 -75611 -145168 -26189 -25468 100561 -247632 339365 -303007 -250020 78728 28916 -143157
18636 -142231 -222035 201216 -323288 -263235 -78806 -231448 -15286 -296088 165763 -311631
18625b17742d839B05954a21143l0124m2908E9086k5135c01259a7093j38206k59533
18614d14832a97659j18544c0899B24164I7030d14536a91347L6322N4554A36188
18603g924B9347a02101j00569B9137J5707a38550k68153a83031Q3625k78852n9058
18592d37316N0352H0101L79655b75876A50061h9277b2804A23597a47417B5963
18581A49730J87612i7019B3404K2437J17308e3794j6661C6538K88831a34671m0434
18570a75105C84725A75123A3050a8032l1486j16950c1128B00887b37436A66220
18559a27312C8145a95315q2284B08195a87783C1649a47353H5712c99018a54170
18548c1138j71947C5108J37516d8680A04770J25605E5012R1061f3689B21523C9333
$$ plain form
18625 -217742 -4839 205954 -121143 -151267 -194175 59086 33951 -301259 -17093 -155299 -414832
18614 -414832 -197659 -316203 -30899 224164 97030 -414536 -191347 -155025 -100471 136188
18603 -7924 29347 -102101 -202670 29137 44844 -138550 -406703 -183031 -99406 -378258 -437316
18592 -437316 -386964 80101 459756 -275876 150061 -89277 -22804 123597 -147417 25963
18581 149730 337342 -97019 23404 45841 163149 -53794 -70455 36538 325369 -134671 -175105
18570 -175105 384725 175123 13050 -18032 -49518 -166468 -31128 200887 -237436 166220
18559 -127312 38145 -195315 -277599 208195 -187783 31649 -147353 85712 -399018 -154170
18548 -31138 -203085 35108 172624 -48680 104770 230375 55012 146073 -63689 221523 39333
18536G1381L3671A567a1043I1117b30092J3855a01295K0274B31367D5215i3607
18524a60361B12921a19212k03526j33439K25461D4649a54767c0881D8341a22883
18513c27211B0128a99789r5094h123j02890j00389h241D45032k19956a43013b3507
18501a32333k07222B62178F0976b17981h9341A68232m1189g1009E9811e55737
18490b3138M423k2131o356j19125G090N1755a15097m6180E3823a42600n6295N4125
18478a44770a5716A64473c56166J24200g6847j30122l1453J03503F7492l391b46000
18466A13217c48774A7855b517n2796A07914g4418A61868f5677G0909A3011K91835
18455C04846D709K53346c19388F03208A11544C5750a04263I4167a20105J1673
$$ plain form
18536 71381 105052 1567 -11043 91117 -230092 -216237 -101295 -81021 231367 45215 -93607
18524 -160361 212921 -119212 -322738 -456177 -230716 44649 -154767 -30881 48341 -122883
18513 -327211 20128 -199789 -294883 -8123 -111013 -211402 -8241 445032 225076 -143013 -23507
18501 -132333 -339555 262178 60976 -217981 -89341 168232 127043 -71009 59811 -555737
18490 -23138 -18715 -40846 -47202 -166327 7090 58845 -115097 -161277 53823 -142600 -198895 -144770
18478 -144770 -15716 164473 -356166 -231966 -76847 -206969 -238422 -134919 67492 64101 -246000
18466 113217 -348774 17855 -2517 -55313 107914 -74418 161868 -65677 70909 13011 304846
18455 304846 4709 258055 -319388 603208 111544 35750 -104263 94167 -120105 -108432
18445a08432j36932A54996M590m173b2248k64j43726d5027j7678A754a49264B68875
18432D1572J02096a07403b290k65055c5418j06533j75186C675a62457j71357A77455
18420B5475a79085C92723D4527A8239J64052i9607C14772A01552r993a59130F373
18408e8631E03416a23993L7255p8222B2979J85398e3301E5593m881F57P9437C9651
18395A38446A298a69403A21027a61525L6333J4022p6028N3877q9910h8235D1824
18383I7985l7792L4588e539F5083b71321b6713q4623A82627a70555d5889F6197
18371A78442b32624C6551J17545b84162i2104C31701q9602a56488E35494a766
18360d27057J74929c2461A38763b70260i1700c3259C3984d5345k03259C75897
$$ plain form
18445 -108432 -245364 154996 159586 155413 -22248 -22512 -166238 -45027 -62705 1754 -149264 268875
18432 41572 143668 -107403 -2290 -267345 -35418 -141951 -317137 3675 -162457 -333814 177455
18420 25475 -179085 392723 44527 18239 182291 -99607 314772 101552 91559 -159130 6373
18408 -58631 503416 -123993 -86738 -164960 22979 208377 -53301 55593 50712 657 80094 39651
18395 138446 1298 -169403 121027 -161525 -125192 -111170 -187198 -133321 -223231 -88235 41824
18383 97985 60193 94781 -5539 65083 -271321 -26713 -111336 182627 -170555 -45889 66197
18371 178442 -232624 36551 154096 -284162 -92104 331701 242099 -156488 535494 -1766
18360 -427057 -252128 -32461 138763 -270260 -91700 -33259 33984 -45345 -248604 375897
18349b9599o5305j64579G3929K35668c66255a70022k1445A79446M6879E1501a71000
18337a61649G5000b24085A27397b99329J45001F8072a457k93561H3959a07663
18326B5087a33272c1716j91944e6784d263B26240l4326a46360A9408K72490a39295
18314a15958j48030k3475a6336D863K51019A12469l9541a72922Q3784a9549j28540
18303a48089K0173e4069F3810h3839r8258A97430e2707B57641n7737a75519a692
18291F2658K8685m617d1396k39402g7900B4616a46715e5522D0705g8056l45586
18280d23642K04682h8771A59321a91440r37i0274A39842b08310A20746b73818
18269c20954N3324B27228A1577a32457J1733A20230b92689H0900d0720b0287B60886
$$ plain form
18349 -29599 -94904 -259483 73929 309597 -366255 -170022 -191467 179446 226325 51501 -171000
18337 -161649 75000 -224085 127397 -299329 -154328 68072 -1457 -295018 83959 -107663
18326 25087 -133272 -31716 -223660 -56784 -4263 226240 191914 -146360 19408 291898 -139295
18314 -115958 -263988 -287463 -16336 4863 255882 112469 72928 -172922 -89138 -19549 -148089
18303 -148089 -127916 -54069 63810 -83839 -182097 197430 -52707 257641 199904 -175519 -1692
18291 62658 91343 86726 -41396 -280798 -77900 24616 -146715 -55522 40705 -78056 -423642
18280 -423642 -218960 -88771 159321 -191440 -192377 -90274 139842 -208310 120746 -273818
18269 -320954 -267630 227228 11577 -132457 -120724 120230 -292689 80900 -40720 -20287 260886
18257a72966G8584b12904b0761j00887A46973B9886a56830d4787A27856b95182
18246a18740A56302a53248N0326B39700G220N3901b86803a29263J6679j23565
18236b36149k23076A22620a03613M8088k38736f6923D2525a92437a7874E5178
18225F6682f2579H3884K24458d3724A54566G3010d5878j04904F3182b559k77929
18214b80488J27696B49397F0091L19783D1992R3288e8966k2923l6150B49762K31890
18203D81652g2513A57005D8974c61090J80036o5058J4646D5757c60133c2388q1553
18192a13941a4648j70374o4094g1343p2063C27499E6455D958J72157G3474k0875
18181E2599P9312C2452k255a18710B79688D4505Q4620J38430a40784e1586j18324
$$ plain form
18257 -172966 78584 -212904 -20761 -121648 146973 29886 -156830 -44787 127856 -295182
18246 -118740 156302 -153248 -102922 239700 7220 61121 -286803 -129263 -112584 -236149
18236 -236149 -459225 122620 -103613 -55525 -294261 -66923 42525 -192437 -17874 55178
18225 66682 -62579 83884 308342 -43724 154566 73010 -45878 -150782 63182 -2559 -280488
18214 -280488 -152792 249397 60091 379874 41992 135280 -58966 -81889 -118039 249762 481652
18203 481652 -72513 157005 48974 -361090 -181054 -246112 -231466 45757 -360133 -32388 -113941
18192 -113941 -14648 -185022 -249116 -71343 -143406 327499 56455 4958 177115 73474 52599
18181 52599 131911 32452 30197 -118710 279688 44505 129125 267555 -140784 -51586 -169910
18170a69910D1168b8969C4167a62947f8488l76073f1597n2015N0432F3730J285
18159F5015h4612A05635J79652j09721b54563C61140d0621j32215O5465C8826
18148A80365a71232O8120A35789a20974L164J8356n0468l4694C3447O5215c4039
18136a96161g9442n2686B69455D6588g5338M95K547A56708a5751F0067N1698k3507
18124H8258f6183A36084J03820i8840b0761k6755j83199J12114j2208k95996d3716
18112H2806J15854a44252j21814O3797D33905b96793E6923a8295A81247i7512
18101i6602N104J3953E5201a04235b4237I527a51327K1023k9606o1719B90472
18089c58414A97193J9242a03455A43742J6872a66468n966n1466H6240k6020K9849
$$ plain form
18170 -169910 41168 -28969 34167 -162947 -68488 -444561 -61597 -113612 -63180 63730 65015
18159 65015 -84612 105635 285287 175566 -254563 361140 -40621 -172836 -107371 38826
18148 180365 -171232 -103112 135789 -120974 -117810 -99454 -149922 -184616 33447 98662 -34039
18136 -196161 -79442 -132128 269455 46588 -75338 -74843 -72296 156708 -15751 60067 111765 88258
18124 88258 -66183 136084 239904 -98840 -20761 -47516 -230715 -118601 -130809 -426805 -43716
18112 82806 198660 -144252 -266066 -202269 433905 -296793 56923 -18295 181247 -97512
18101 -96602 -91498 -77545 55201 -104235 -24237 9527 -151327 -130304 -159910 -221629 290472
18089 -358414 197193 216435 -103455 143742 160614 -166468 -172434 -223900 86240 60220 90069
18078I0069J1491d44580h2210B3507b10508e5637A5726d9424p5977J7551j45824
18067b53674J06560F347h2447k01549J25361k09560A29547J79206H6911c88051
18056a41503l81797a58718g139k67230C3262b63012A2421a85863A05363K140a44879
18044c11808A29943c06273B82999A8108B495a20183G4278B5712I144J49424a74283
18032a84697A51843g8280l0315K3573K031j82252p621D2386B0588f7249F7108
18020A01114g5769G860e483I9061a71082A07582a63566j7616A27218d7078C86697
18008f2346j25564A03402h8581j89878g3970A34713g2386j3355B85827o6431a01389
17996C36671E9987M9822D9389N0487i9311B05509J24575G7923b40918A41051e138
$$ plain form
18078 90069 101560 -444580 -82210 23507 -210508 -55637 15726 -49424 -125401 -107850 -253674
18067 -253674 -147114 6347 -82447 -283996 -158635 -368195 129547 308753 86911 -388051
18056 -141503 -523300 -158718 -7139 -274369 33262 -263012 12421 -185863 105363 107503 -144879
18044 -311808 129943 -306273 282999 18108 2495 -120183 74278 25712 9144 158568 -174283
18032 -184697 151843 -78280 -108595 -85022 -82991 -265243 -272864 42386 20588 -67249 67108
18020 101114 -75769 7860 -5483 99061 -171082 107582 -163566 -181182 127218 -47078 386697
18008 -62346 -187910 103402 -88581 -278459 -73970 134713 -72386 -85741 285827 219396 -101389
17996 336671 59987 109809 49389 99876 -99311 205509 330084 77923 -240918 141051 -5138
17984d7159k3567H3819m0723K3527P1114m0321m4697a53742C53561A03983P9376
17973A83359G092c5273k74538I618a47851j48127e9244j41188f4726b4554j78139
17962b02693d3691C0177J24314j8482d98522B989i672H3763d3550B65762J32846
17951C98608f2339j77803A99831A9406J80347A8115J72952b8039o8260A87387
17940a55526o3422F9861M9967i5159L5766F6722a83451J0330B09017b53197A03644
17928b49874D30679c2057A56852b14274A71475K5247J09385b60538J05319D1721
17917d94049C33342a36172B673K01619a53533m490C22331A00161b0791j42580
17907a63371p2132F4602h1679A88146a16002j30760B40724B0409a75050c1952
$$ plain form
17984 -47159 -70726 83819 43096 66623 137737 97416 52719 -153742 353561 103983 183359
17973 183359 7092 -35273 -309811 9618 -147851 -295978 -59244 -200432 -64726 -24554 -202693
17962 -202693 -43691 30177 154491 136009 -498522 2989 -9672 83763 -43550 265762 398608
17951 398608 -62339 -240142 199831 19406 199753 18115 191067 -28039 -96299 187387
17940 -155526 -218948 69861 119828 -95159 -59393 66722 -183451 -173121 209017 -253197 103644
17928 -249874 430679 -32057 156852 -214274 171475 196722 306107 -260538 -155219 41721
17917 -494049 333342 -136172 2673 204292 -153533 -158023 322331 100161 -20791 -163371
17907 -163371 -235503 64602 -81679 188146 -116002 -246762 240724 20409 -175050 -31952
17896a67185E2939K54726g3950k3415b937q5830b0919R084o8518m05535A54978
17884A14248D7459a88002R2076M2043m6151k2997L7435b047j9763j37791J2611
17873a46990E3095h996B41651r1759N5991c68615a83936j29002G412P3655f60560
17861E2653a05655B31386c8340N880A4235a18841M9987N618A4230b16688C05747
17849B20994f9716j97520A7596a09827G2184i9772I0439K05555b77117C824J37767
17838A41591L11564F9175K5565b3591k76903a07549A76393i3307j89135J3601
17828b68841A60937B1091i6039q1327B93821d7716k40830g6985A38841C6662J76286
17817B12948f3658A76749C674a14145q7139f7795D3293L7258K87077F902N5171
$$ plain form
17896 -167185 52939 307665 -73950 -97365 -2937 -88767 -20919 -11835 -80353 -485888 154978
17884 114248 47459 -188002 -95926 -53883 -100034 -123031 -85596 -2047 -21810 -159601 -146990
17873 -146990 53095 -8996 241651 149892 205883 -368615 -183936 -312938 7412 81067 -660560
17861 52653 -105655 231386 -38340 -32460 14235 -118841 -68854 -63236 14230 -216688 305747
17849 220994 -69716 -267236 17596 -109827 72184 -99772 90439 295994 -277117 3824 141591
17838 141591 453155 69175 94740 -23591 -300494 -107549 176393 -93307 -282442 -268841
17828 -268841 160937 21091 -96039 -177366 293821 -47716 -288546 -76985 138841 36662 212948
17817 212948 -63658 176749 3674 -114145 -201284 -67795 43293 80551 367628 6902 62073
17806F2073M9848K34391E0613a38434B28664G4764b5950A45369a18617A58594
17795c29449a40507O6601B01776G935P9095L02820D8802d39400A67430b0058j53528
17784a73586A10062J023L6233h7835c2542B37983j03627a29171d5659L262B2275
17772F5021R8598p9567a02520B3028b45642I1538c24994B1496a47731B6656C628
17760A14202M8054K8497g7424j75204A74554f4981J2758J1781J7119q2037j32998
17749b38358A62156i8574k74982h9865A07063K295j9726J43748a26335N8748m9708
17738a17295d2530k61859J50382E5084a86993B05833f0495A75433q03K0061M0182
17727B34873D6306L4439a20286a5449j70908K3992d7565I6310f6104B45420d8203
$$ plain form
17806 62073 111921 346312 50613 -138434 228664 74764 -25950 145369 -118617 158594
17795 -329449 -140507 -73906 201776 7935 87030 389850 48802 -439400 167430 -20058 -173586
17784 -173586 110062 111085 147318 -87835 -32542 237983 134356 -129171 -45659 -42397 22275
17772 65021 163619 84052 -102520 23028 -245642 91538 -324994 21496 -147731 26656 3628
17760 114202 162256 190753 -77424 -252628 174554 -64981 -52223 -40442 -23323 -105360 -238358
17749 -238358 162156 -98574 -373556 -89865 107063 109358 89632 233380 -126335 -67587 -117295
17738 -117295 -42530 -304389 -154007 55084 -186993 205833 -60495 175433 174630 194691 234873
17727 234873 46306 80745 -120286 -15449 -186357 -162365 -47565 96310 -66104 245420 -48203
17715a8160r2628i984k28990A14203M2349A7471K3352K27294n3830h3876c9044
17703d776E4818f5327j7029B73382j32429Q3600o6883e3755C19302h4801H6364
17691a69583j24843A36404a0151k36602f5411C9061b23246B39513c03584A15998
17680a53602j40647a45792o589F5788i5992n66B52791F9118R2339b22006b212
17668a34762d8202C15824I8180J3948J12201J4650f3750a9380o4425A21570m4115
17657G7455a3898C18158e9409a5497C17020E3233a83914c3413k11085c7853l5204
17646g3057A08972k5432c3271B48893a96836j27160C9227c42328B86032F0434
17635d8797A90423Q8968a95051C46381h0337F2479c28042B09164a81996B9071
$$ plain form
17715 -18160 -110788 -9984 -238974 114203 156552 17471 40823 268117 214287 -83876 -39044
17703 -4776 54818 -65327 -82356 273382 140953 224553 157670 -53755 319302 -84801 86364
17691 -169583 -294426 136404 -10151 -246753 -65411 39061 -223246 239513 -303584 115998
17680 -153602 -294249 -145792 -152381 65788 -95992 -96558 252791 69118 161457 -222006 -2212
17668 -134762 -48202 315824 98180 112128 224329 238979 -63750 -19380 -83805 121570 77455
17657 77455 -13898 318158 -59409 -15497 317020 53233 -183914 -33413 -244498 -37853 -73057
17646 -73057 108972 83540 -33271 248893 -196836 -323996 39227 -342328 286032 60434
17635 -48797 190423 279391 -195051 346381 -80337 62479 -328042 209164 -181996 29071
17624D98J76858D0907J64109i5062j69994a6827C307J04722i4890I9681c62695
17612I6715a84165C78826o5393a99375A9076d1063A73200L0553F4006O7018c5427
17600A85886H1066l0940a39769B41599E3680j1609P1943O372g2977p0697j50302
17589b93976G892c60657E6653a87623A27452b06577e8862A2339J40565e1576q0502
17578a32078A10671J09757g8286b1226k89077E7130K74759a43671B07718b33814
17567c40658L4749c3503D7370J65419J48639A10088a17285j05849E9292a04318
17556E2438a72520P7812c4520A28716a74310A71257d9495A78121b2205B95290
17545a61801f8740C07505a04711n374A78315K29117j99545a87537R0242j83950
$$ plain form
17624 498 177356 40907 205016 -95062 -265056 -16827 3307 108029 -94890 99681 -362695
17612 96715 -184165 378826 313433 -199375 19076 -41063 173200 203753 64006 131024 -35427
17600 185886 81066 50126 -139769 241599 53680 42071 114014 120386 -72977 -143674 -293976
17589 -293976 7892 -360657 56653 -187623 127452 -206577 -58862 12339 152904 -51576 -132078
17578 -132078 110671 220428 -78286 -21226 -310303 57130 331889 -143671 207718 -233814
17567 -340658 -305909 -33503 47370 212789 361428 110088 -117285 -223134 59292 -104318
17556 52438 -172520 -94708 -34520 128716 -174310 171257 -49495 178121 -22205 295290
17545 -161801 -68740 307505 -104711 -110085 178315 407432 207887 -187537 -97295 -281245
17535b81245B7344f8614m2752I8052J64156a44662b041A54845B2313a33665A60663
17523B592e4131C5090h1317A21250O6072m678a87686h8741A54404O0537L09612
17512E24553C4839L34408a03573A11293O2259h06E2603b53482A84457G6932l514
17501G3418Q0469J978n9076d6450C38126a27219B15210a34441C45838M4541e5128
17489B06056K71554p6108r9461E4974K6334c60851B14444E9339K70924j49836
17479A80427e3357m2098C71545b7952A28656K20157E4601a4068B09446Q1923C1993
17467A40257A7217J93954h502B94581B0205M08198l6967J6198F4148k9334J95455
17456B30269I4384J42008c9602D34449q6683o6840h8256A46873j2231K48258m3855
$$ plain form
17535 -281245 27344 -68614 -111366 98052 262208 -144662 -2041 154845 22313 -133665 160663
17523 2592 -54131 35090 -81317 121250 187322 182644 -187686 -88741 154404 214941 524553
17512 524553 34839 369247 -103573 111293 173552 -806 52603 -253482 184457 76932 73418
17501 73418 153887 155865 96789 -46450 338126 -127219 215210 -134441 345838 390379 -55128
17489 206056 477610 401502 302041 54974 81308 -360851 214444 59339 330263 180427
17479 180427 -53357 -95455 371545 -27952 128656 348813 54601 -14068 209446 291369 31993
17467 140257 17217 211171 -8502 294581 20205 428403 391436 407634 64148 34814 230269
17456 230269 94384 236392 -39602 434449 347766 280926 -88256 146873 134642 382900 339045
17445C39045l8322D6547J13058A4833J80794A4094d3746E7214L24186r3522K4037
17434C11915K622D572L46084j40293K24813o2001J0764G5787K3069K61334j3302
17423C46888E7524J54180J59480N3087j83120E5483j0966P3578J59081J27176
17413D04352F6730K81705j36563J32214Q8764A69902b4818C24628j20968L5970
17403B39630r6154f6757A56123Q581b4294B88170a61909A33245A0578O45175k64055
17392C91698A89049D8181a4451k28146A59376K71470k08914n6903f222k29657
17382b35879B62123F6283O2582d729j31907L5811E2905N1122J85401k7979b4944
17370h249D0862L1653Q9302K3711J4885B4496J09273R1668E9436K38813C3142
$$ plain form
17445 339045 300723 46547 159605 14833 195627 14094 -43746 57214 381400 287878 311915
17434 311915 314537 4572 350656 210363 435176 373175 383939 75787 98856 360190 346888
17423 346888 57524 211704 371184 424271 241151 55483 44517 118095 277176 404352
17413 404352 66730 348435 211872 344086 432850 169902 -24818 324628 203660 239630
17403 239630 143476 -66757 156123 164704 -24294 288170 -161909 133245 10578 655753 391698
17392 391698 189049 48181 -14451 -242597 159376 430846 221932 165029 -6222 -235879
17382 -235879 262123 66283 128865 -4729 -136636 -100825 52905 104027 289428 261449 -24944
17370 -8249 40862 72515 161817 185528 200413 24496 133769 225437 59436 298249 33142
17358b4687l2324A92890c29628C24589j5869g1781A39614k1432c7778A31024J07895
17347B38919g5322C03897I5954J29193R8385a34368C99516b568B12176F0099J63822
17336B23921q4062f481G8005K86760j49293j03372j4258k1343P1088a62486p36
17325a63222E75541k33330j07196g0658j879c6024m26605B26752j07799J32346
17315B51299A16278o713m3258J24726p8743M6552B0872K55700J70883e6904A58613
17303a64193C4359K28385L2630b5803A18860b78754A38980k1141a60319A89857
17292C51336F5493d3233B28469D5417J44547a71138B13246m9063b7103B07852
17281A52381K21128Q9442A17463J70027K4480A5074K91366j46626e3041H4231
$$ plain form
17358 -24687 -57011 192890 -329628 324589 308720 -71781 139614 118182 -37778 131024 238919
17347 238919 -75322 303897 95954 225147 323532 -134368 399516 -2568 212176 60099 223921
17336 223921 139859 -6481 78005 364765 215472 112100 97842 76499 147587 -162486 -163222
17325 -163222 575541 342211 235015 -70658 -72537 -36024 -462629 226752 118953 251299
17315 251299 116278 109565 66307 191033 112290 158842 20872 276572 447455 -56904 158613
17303 -164193 34359 262744 295374 -25803 118860 -278754 138980 117839 -160319 189857
17292 351336 65493 -43233 228469 45417 189964 -171138 213246 164183 -27103 207852
17281 152381 373509 462951 117463 287490 311970 15074 306440 159814 -53041 84231
17270A65517L74813E5766N5190c6921C58063D5260J74721P0815k6270P4412A21142
17258B37684K56353B37257b6467j35013A49663o6567P5768J48223q5402o9807
17248A51878A6481J66348K37992F7595R1684G7339L72425A6784R4944J77749A44048
17236d3976A01829c5205B44005I6771M2284J54323j0360A18295l2454k4198L56963
17225D18606C8651K81096C9054J2439L12318m1708J96640B20390R873f1184C78054
17213A74740J10241j19906a29541C17865A12442J27104J12994C6878K84399i6605
17202B3532M337L25160R8622K4123B13135p9193J72017Q2549j64164k8284J3501
17191B09561O9738C6488J40915J25099Q7752O0736A61883K90826j59276D5784
$$ plain form
17270 165517 540330 55766 110956 -36921 358063 45260 219981 290796 264526 338938 121142
17258 237684 494037 237257 -26467 -161480 149663 83096 158864 307087 221685 151878
17248 151878 16481 182829 420821 67595 159279 77339 449764 16784 111728 289477 144048
17236 -43976 101829 -35205 244005 96771 139055 293378 283018 118295 85841 61643 418606
17225 418606 38651 319747 39054 51493 363811 322103 518743 220390 230263 -61184 378054
17213 174740 284981 165075 -129541 317865 112442 239546 352540 36878 321277 -96605
17202 23532 27869 353029 451651 475774 213135 133942 305959 388508 224344 196060 209561
17191 209561 279299 36488 177403 302502 390254 450990 161883 452709 293433 45784
17180D88808j97804J86542p3625j17537B2510L20392j02213p7215J90g8885C18616
17168B14013J2476j05497J24389L73539k10298P366J4696o3191K62469A74389
17157c436B79049G4220L38675k4784G6848K66076l3152J00986q1485J64568j74071
17146C19770H4561k6984B5296N25265A30229n4732K37142r4367q2732K34999n0664
17135C19875j3479A16581C2211K67417J17190J82307j13225A88586H4168L82224
17125D66392j69436J36706b0389A33957K75343J15431k55293J29180J679A22159
17114C73106A05716M80396B41856m741q6720j1343K21880M4076J4820I7991K50592
17103C48583A70225F2774L79386j41507J39825A37169O92698B59483K37470J59138
$$ plain form
17180 488808 291004 477546 403921 286384 22510 342902 240689 163474 163664 -78885 318616
17168 214013 226489 120992 245381 618920 408622 415988 430684 367493 629962 174389
17157 -3436 279049 74220 412895 388111 76848 342924 309772 410758 329273 493841 319770
17146 319770 84561 57577 25296 550561 130229 75497 312639 218272 135540 370539 319875
17135 319875 306396 116581 32211 299628 416818 599125 485900 188586 84168 466392
17125 466392 296956 433662 -20389 133957 409300 524731 269438 398618 400297 122159
17114 373106 105716 586112 241856 237115 150395 139052 360932 405008 419828 97991 348583
17103 348583 170225 62774 442160 300653 440478 137169 829867 259483 496953 656091
17093F56091k27145N284j9367A71677R9518L2639j0026N25813l16910j65998J67492
17082E04205k43194J06894A03913K18020N5317J94121J7004j91335D1283j7213
17072B4070L93088J32961j32807P9966n7990J81683q1093j54349A45599J99108
17062C44707J73090r9588L30239l02782J43784K45393k35632j29534p5151j24209
17052B70317J30834j86635M87306k20934P2405J26223o2401l06045J15457N0343
17042D76870J58901k71043K23107j17039j66826A02705K88477J05753J94550B85781
17031E97839l0110L64338l27814p8390L7527m6396L05540l32853j0308L1001N8991
17020E69365P7905o0091j74914K70023J25727j18477o8964j69468J23877k24939
$$ plain form
17093 656091 428946 434230 414863 171677 271195 303834 293808 819621 502711 336713 504205
17082 504205 261011 367905 103913 321933 377250 571371 588375 397040 41283 24070
17072 24070 417158 550119 417312 497278 439288 620971 539878 385529 145599 344707
17062 344707 517797 418209 748448 445666 589450 834843 599211 469677 394526 270317
17052 270317 401151 214516 701822 480888 553293 679516 617115 311070 426527 476870
17042 476870 635771 364728 587835 470796 303970 102705 391182 496935 691485 285781
17031 597839 567729 932067 604253 525863 563390 516994 822534 489681 479373 510374 569365
17020 569365 647270 587179 412265 682288 808015 689538 620574 451106 574983 350044
17010C50044L91758K15952j26629l0037j89003J07392j34564j0136J01654L4631
17000G11062j87408B21415M74466K01720j88587P2485K65857j29629k11941j9203
16990F86583P9783C60593L59336M17549n18172L72136D41546M76971j12194r0041
16980G16282J33320J03346l28851M38134R381k02456k29560K48738K58220l97767
16970G48787K21357j99281O8208P4373p4727o0251R9591p8094K34395k00063J50620
16959I84915r9566j00190N86228l55911N3707l46495K14636J49662J54337n81373
16949F59950N68776l51573L16683j05086m5908J77214n1231o0958K31279j19835
16939A219311k12843q7166N3499L30273q7678J40882m0215K1719j80851o1259
$$ plain form
17010 350044 741802 957754 831125 801088 612085 719477 584913 574777 676431 711062
17000 711062 523654 221415 695881 897601 709014 781499 1047356 917727 705786 686583
16990 686583 766366 360593 719929 1137478 619306 991442 441546 918517 806323 716282
16980 716282 849602 952948 624097 1062231 1071612 869156 639596 888334 1146554 748787
16970 748787 970144 770863 839071 913444 838717 778466 878057 799963 1034358 834295 984915
16959 984915 885349 785159 1371387 1015476 1069183 722688 937324 1086986 1241323 659950
16949 659950 1228726 877153 1193836 1088750 1042842 1220056 1168825 1107867 1339146 1219311
16939 1219311 1006468 919302 972801 1303074 1215396 1356278 1316063 1337782 1156931 1095672
16929A095672M05383j92132j31289K13396j67928j4101J20518P0513k4965j61438
16919A213629J12018j26103l85K38480K0318j65948K53058J86906k51644J85679
16909A666008m60458K34549K0121L20018k93222K03141j10841j5612J31123j72526
16899A522301M56002k41251k00505L44439m7465k7368J54362J25537l21304J28229
16889A892977l00227N46273j47478k4537M75760o15850K01197m90474M04509m0609
16879A901541M10290j24330l9335M19350k22198p0925j4722J46335o2256J72422
16869B516172j15243Q7538L29860l96728L76948k86111K75083j23524L31088m02537
16859B592546M1003j1296J76338j60598L31865J63205j01548n4246J36206K7352
$$ plain form
16929 1095672 1501055 1308923 1177634 1391030 1223102 1209001 1329519 1400032 1375067 1213629
16919 1213629 1325647 1199544 1199159 1437639 1457957 1292009 1545067 1731973 1480329 1666008
16909 1666008 1205550 1440099 1460220 1780238 1487016 1690157 1579316 1563704 1694827 1522301
16899 1522301 1978303 1737052 1536547 1880986 1833521 1806153 1960515 2086052 1764748 1892977
16889 1892977 1592750 2139023 1991545 1967008 2442768 1826918 2028115 1537641 1942150 1901541
16879 1901541 2311831 2187501 2148166 2567516 2345318 2274393 2259671 2406006 2343750 2516172
16869 2516172 2400929 2488467 2818327 2421599 2798547 2512436 2787519 2663995 2995083 2592546
16859 2592546 2633549 2622253 2798591 2637993 2969858 3133063 3031515 2977269 3113475 3140827
16849C140827K24407j58271M85106j42960J29126l60546J51777p334K09203K43566
16839C914901J55907k4346j96872J28297R0233R9670M8112Q5384k21062M32551
16829D512775n9666j60589N54585p8758J20893p6253L58424J34452j84723J87937
16819E309077j64145K2257P09563n6963j5738M1795M06337m8453M40011k55919
16809F387822L12951J15112K00183M6178K01573J89902k6787M03744M1194k32010
16799G639862K87414L53754L37261L1264J68575L40687J69931K61179M56063p8570
16789I967420N13210N95575m8296k368K98176O67145J13451O69968J67146L65669
16779A3307096K25092M91662K08267Q54344L49517M1313Q78725Q26778L29713
$$ plain form
16849 3140827 3365234 3206963 3692069 3549109 3678235 3317689 3469466 3462132 3671335 3914901
16839 3914901 4070808 4046462 3849590 3977887 4068120 4167790 4215902 4301286 4080224 4512775
16829 4512775 4453109 4292520 4847105 4768347 4889240 4812987 5171411 5305863 5121140 5309077
16819 5309077 5144932 5167189 5876752 5819789 5804051 5845846 6252183 6203730 6643741 6387822
16809 6387822 6700773 6815885 7016068 7062246 7263819 7453721 7426934 7830678 7871872 7639862
16799 7639862 7927276 8281030 8618291 8649555 8818130 9158817 9328748 9589927 10045990 9967420
16789 9967420 10480630 11076205 11027909 11025541 11323717 11990862 12104313 12774281 12941427 13307096
16779 13307096 13532188 14023850 14232117 15086461 15435978 15477291 16356016 17182794 17512507
16770A7512507N30662Q61741N41246P46197N24110O81794P22723J002684R66025
16761B4089689R80224P47573J423540J167650J355203J033369J193126J673275
16753C3663649J228734J838593J665618J706515J754101J949469K532780K506716
16745D8846175K350712K893209K925646K835946L403161L739398L709752M266326
16737G4970325M476164M904466N051096N362161N887034O255823O689970O900919
16729A20497958P363985P417053P688899P801795P826150P505848P319520P220420
16721A80641628N720492N642923L803489K867157J202107o77292j458553k803428
16713A94938523m703599n585292o235383p055385p836637p879397q071356q244416
$$ plain form
16770 17512507 18043169 18904910 19446156 20192353 20716463 21398257 22120980 23123664 24089689
16761 24089689 25069913 25817486 27241026 28408676 29763879 30797248 31990374 33663649
16753 33663649 34892383 36730976 38396594 40103109 41857210 43806679 46339459 48846175
16745 48846175 51196887 54090096 57015742 59851688 63254849 66994247 70703999 74970325
16737 74970325 79446489 84350955 89402051 94764212 100651246 106907069 113597039 120497958
16729 120497958 127861943 135278996 142967895 150769690 158595840 166101688 173421208 180641628
16721 180641628 186362120 192005043 195808532 198675689 199877796 199200504 197741951 194938523
16713 194938523 190234924 184649632 178414249 171358864 163522227 155642830 147571474 139327058
16705A39327058p962358p537406p515808p282444o374155o502424n948459n367024
16697H4836980n136504m846477m634989m168143l272380m029120l026414l290392
16689E2432561k326216l127830k314488k107557k544747j821733k067213j644062
16681C4478715j315551j480394j562788j547209j117065j189206j100128j084152
16673B4082222q59936j179762j052995n73851m27268j136236m62492r06421l10280
16664A7172981j047413j29170r26402k77841n17233m66418o64443n48575m28852
16655A2166634J13399k26301p10557k25263o96286J55763l33089m94347k56719
16646I493234l23597l55535j99886k62270m53010K09806m04901k32083j41389
$$ plain form
16705 139327058 131364700 123827294 116311486 109029042 102654887 96152463 90204004 84836980
16697 84836980 79700476 74853999 70219010 66050867 62778487 58749367 55722953 52432561
16689 52432561 50106345 46978515 44664027 42556470 40011723 38189990 36122777 34478715
16681 34478715 33163164 31682770 30119982 28572773 27455708 26266502 25166374 24082222
16673 24082222 23222286 22042524 20989529 20415678 19988410 18852174 18389682 17483261 17172981
16664 17172981 16125568 15996398 15069996 14792155 14274922 13808504 13144061 12595486 12166634
16655 12166634 12280033 12053732 11343175 11117912 10421626 10577389 10244300 9749953 9493234
16646 9493234 9169637 8814102 8614216 8351946 7898936 8108742 7703841 7471758 7330369
16637G330369o9114r4919k20258l42561P1792l48518P7413K73038r65403k81534
16627E430305J64013k52239J07246k52053j9539k03318L2216J22911j12799k06996
16617D809747j07574m24730K73068k30900r7422n38958L85527j74918q8812j80195
16607C624833K18101m98392J65057J12687k80876P4140r3067r1687N9511m27496
16597B862811m4180J7909J74064k1126j19690q3171M15034p72332n7706L49246
16587B720859P7377l60036J98315j69672j08276N1696K77054m26737O4735j86644
16577B138671J87657n6291k30116J97401j77588l78505O52270m59462K03910m7434
16567B030513n0164j37925K42030n3415l43577J12694k23088L94910k20205l02085
$$ plain form
16637 7330369 7261255 7166336 6946078 6603517 6675309 6326791 6404204 6677242 5711839 5430305
16627 5430305 5594318 5342079 5449325 5197272 5177733 4974415 5006631 5129542 5016743 4809747
16617 4809747 4702173 4277443 4550511 4319611 4222189 3683231 4068758 3893840 3805028 3624833
16607 3624833 3842934 3344542 3509599 3622286 3341410 3415550 3322483 3230796 3290307 2862811
16597 2862811 2818631 2836540 3010604 2989478 2869788 2786617 3201651 2429319 2371613 2720859
16587 2720859 2798236 2438200 2636515 2466843 2358567 2410263 2687317 2260580 2325315 2138671
16577 2138671 2326328 2270037 2039921 2237322 2059734 1681229 2333499 1874037 2077947 2030513
16567 2030513 1980349 1842424 2084454 2031039 1687462 1800156 1577068 1971978 1751773 1449688
16557A449688L50280m57851K97588J45633j41492k54034J41303K11539j98285
16548A544369j71575j88369M69727m08495K33768n2539j85104M14613k72783J9862
16538A403474p1497j85258K55750j61235j71766J15938L35314l1124n58537J09019
16528A040078R6107K72938m88871J70761J26462l28625J32781J24235k4340Q8995
16518A210521q144l14547J47325J04862m21846M12977l14034L75603l06017L9197
16508I25897J48919R4094m33711K50903j37048K37519p5069k55479q7789J02336
16498G70572J27477l25865J95095R2950k2553l70523N57615k01021j46255L11751
16488I89243k51040J578J00615m09508K98642j00150N6675J5044j98347j6122
$$ plain form
16557 1449688 1799968 1342117 1639705 1785338 1643846 1389812 1531115 1742654 1544369
16548 1544369 1372794 1184425 1654152 1245657 1479425 1426886 1241782 1656395 1383612 1403474
16538 1403474 1331977 1146719 1402469 1241234 1069468 1185406 1520720 1489596 931059 1040078
16528 1040078 1136185 1409123 920252 1091013 1217475 888850 1021631 1145866 1121526 1210521
16518 1210521 1202377 887830 1035155 1140017 718171 1131148 817114 1192717 886700 925897
16508 925897 1074816 1168910 735199 986102 849054 1086573 1011504 756025 668236 770572
16498 770572 898049 572184 767279 860229 837676 467153 1024768 823747 677492 989243
16488 989243 738203 739781 840396 430888 729530 629380 686055 701099 502752 486630
16478D86630P6244j14463r0413L15815o5483J16406M32687C99407M7668M27879
16468H74954l38513j05758Q070m1060N10868l28147Q0501L5928J73887k34198
16458F36532j14530B38127L37848k59505K06494j14751J41213j43526j18134L29855
16448F17621K3147n8485K5712k06819J09994J31822B97616K88212k44865L75374
16438G16337L970j61579j99403L3350M59699k88811j637B70841M41755A96317
16427E62725k5325J04131N1277B96313N1737J54652L6346J78347j28217k38678
16417C50500j71943L19219j62773K88447C1223M28956j28952J37029q1037P6526
16407D63745L3352m0069J25310A85426L9471p649j00802K47515n8103J61231p0917
$$ plain form
16478 486630 562874 448411 357998 673813 608330 724736 1157423 399407 447075 874954
16468 874954 536441 430683 438753 397693 908561 580414 660915 696843 870730 636532
16458 636532 522002 238127 575975 316470 522964 408213 549426 405900 287766 617621
16448 617621 640768 582283 607995 401176 511170 642992 297616 585828 340963 716337
16438 716337 720307 558728 359325 392675 852374 563563 561926 270841 712596 196317
16427 562725 537400 641531 692808 296313 348050 502702 539048 717395 589178 350500
16417 350500 178557 497776 335003 623450 31223 460179 331227 468256 387219 463745
16407 463745 497097 457028 582338 185426 224897 217248 116446 363961 305858 467089 396172
16396C96172E6213L52914J1929p3360J96269B29765J17370j46913L33935o5817
16386D68340j51647C3918M2002J58222m1101R4497B8291K09986K15252B25215
16375B27913l0817h8240D81229k36562C2852O6945b7456B36108L3121n9912J61829
16364C71146K6713G670L79743p0235r6718R5631J49450R9831F1861L93328j69390
16353B85799I4711K10638r5823J02197a4583A95999I5636J07878b2617l719j1169
16342c7505A51515C6974L12758a3206B06626k5650L49563A41610N838L32358a5455
16330C61224A58104J09748c1880C05960J10434A5827M44170F3739M5141K38121
16320C47001j55957c7266j8434H8604R5281H6198J39819F9086K61491C1170L55721
$$ plain form
16396 396172 56213 409127 421056 347696 543965 229765 347135 200222 534157 468340
16386 468340 316693 33918 75920 234142 193041 287538 28291 238277 453529 225215
16375 227913 197096 -88240 481229 244667 32852 99797 -27456 236108 269229 209317 371146
16364 371146 397859 7670 387413 317178 220460 316091 465541 565372 61861 455189 285799
16353 285799 94711 305349 209526 311723 -14583 195999 95636 203514 -22617 -26336 -37505
16342 -37505 151515 36974 349732 -13206 206626 180976 530539 141610 147448 479806 -15455
16330 361224 158104 267852 -31880 305960 416394 15827 459997 63739 108880 347001
16320 347001 191044 -37266 -55700 88604 183885 86198 226017 69086 330577 31170 386891
16309C86891K29033I8034J25939K56227A22680L00108A4634J51127K91801j30229
16299C27333A09211n0946d9207o5379g860n7352C55313j38777L14434A27478P4917
16288B02395C714R2232a42516D74747j93721a70017G8624J07042g5057L5488G5673
16276c3247E4295L38265A15654Q4744m6038a62585b4995D6399L20867A02209e2342
16264b7895C04296K4349r8974a44888A9720J11744L5674O9760C5897e2605j37832
16253a90437A13918d14938C57096J26878B07690g5199B85822c298C24762A38646
16242c54501F1774c45560a24817k48207G0163P2640n5248k6278a95806A61229
16231e4919C53282a39452B41317j14233c99933a87042a5734B68064a16432D7080
$$ plain form
16309 386891 615924 98034 223973 480200 122680 422788 14634 165761 457562 327333
16299 327333 109211 58265 -49207 -114586 -7860 -65212 355313 216536 530970 127478 202395
16288 202395 3714 95946 -142516 474747 281026 -170017 78624 185666 -75057 -39569 75673
16276 -33247 54295 392560 115654 200398 154360 -162585 -24995 46399 367266 102209 -52342
16264 -27895 304296 328645 229671 -144888 19720 131464 167138 236898 35897 -52605 -190437
16253 -190437 113918 -414938 357096 483974 207690 -75199 285822 -3298 324762 138646
16242 -354501 61774 -345560 -124817 -373024 70163 142803 87555 61277 -195806 161229
16231 -54919 353282 -139452 241317 127084 -399933 -187042 -15734 268064 -116432 47080
16220C4442O2160L8737j6313J60264L1383A39369K4420h3546k81194E0644J25766
16209A76410p417J94199A57920C2133J34983K8289q6770A9459J04258K5940c661
16197h4961F5808C2788J2363K23352E7375J61987h575A46239J25609a5591A07318
16185A69928C0992C981d8139C06672A04150J89460B1575J07731e4242C9113D494
16173e6187A5466L31516j49217a35023B57247A12871n5049d2169E9082A1507a34632
16161b48133c5539I0138b55450B0606K52226G0462e8323r1383q2205A1606a01431
16149a49720l2706D38440E1439K45971L2554a36415m0001C60127c45251f6651
16138A26115f1070A28689f0684B71019o1036J32142n6280d62582I6767c56263
$$ plain form
16220 34442 96602 135339 119026 279290 310673 139369 163789 -83546 -364740 50644 176410
16209 176410 168993 363192 157920 32133 167116 195405 108635 19459 123717 149657 -3661
16197 -84961 65808 32788 45151 268503 57375 219362 -8575 146239 271848 -15591 107318
16185 169928 30992 3981 -48139 306672 104150 293610 21575 129306 -54242 39113 4494
16173 -56187 15466 346982 197765 -135023 257247 112871 57822 -42169 59082 11507 -134632
16161 -248133 -35539 90138 -255450 20606 272832 70462 -58323 -149706 -231911 11606 -101431
16149 -149720 -182426 438440 51439 297410 329964 -136415 -176416 360127 -345251 -66651
16138 126115 -61070 128689 -60684 271019 209983 342125 285845 -462582 96767 -356263
16127A27447m5227Q3613c79211A01190d38071A25021b4764l9651A74830e9518
16116F17227j95939A26145E1010b530B87959b97222c1457C42330A39415L3465
16106A72880d9361J4289B07242E7350b1320B91174H3380a1084j6577m9341B85300
16094a10432m6609O999j25460A49809i6507i560C12881E0604N7265A0294J95303
16083B05597I9259O0013I562J59969b5700O280j76828A894a26008a9360k3313
16072d2673j47476I6970b62746P7542K139D0443N5284D5917j9664P3379B1138
16060b15358I9974j9303J70615b57496J04693J7806E5153e9795k30732a01058
16049a36055G492e7391B47546H2309A070N7505a5680G2313j7857b6419n7477K8278
$$ plain form
16127 127447 82220 165833 -379211 101190 -438071 125021 -24764 -64415 174830 -59518
16116 617227 421288 126145 51010 -2530 287959 -297222 -31457 342330 139415 172880
16106 172880 -49361 -35072 207242 57350 -21320 291174 83380 -11084 -27661 -77002 285300
16094 -110432 -157041 -150042 -275502 149809 -96507 -9560 312881 50604 107869 10294 205597
16083 205597 99259 159272 9562 169531 -25700 -19420 -196248 1894 -126008 -19360 -42673
16072 -42673 -190149 96970 -262746 -185204 -183065 40443 95727 45917 26253 99632 21138
16060 -215358 99974 80671 251286 -257496 -152803 -134997 55153 -59795 -290527 -101058
16049 -136055 7492 -57391 247546 82309 1070 58575 -15680 72313 54456 -26419 -83896 -55618
16037e5618B190a5393k32357d7274A66580a37164p4053R4820B8850J86201C1604
16025A21999b37110h9930C02739a64262j17466K0722F0134c24796A39515e0281
16014b54873A15167K20503g4410N467l28515a74034l2689a02353G511K30479a72303
16002A07437J06629f3228A59421G8402b60851A97231B1986a23095j11801P1323
15992a63573P2232a3862m8644k58228i1802B43541b67883B4826L1420J53506N07437
15981G17189A99577r0425L41520F0799J8884K18474j45632a44627I0986J11115
15971B02101a4868j8525a893j54970n2200B28448I2672d872m384j6968D81229
15959b18066l9149G2225M2520K7499m1695K86066a96870A24436c4036l04443a06891
$$ plain form
16037 -55618 2190 -15393 -247750 -47274 166580 -137164 -211217 -116397 28850 215051 31604
16025 121999 -237110 -89930 302739 -164262 -281728 -261006 60134 -324796 139515 -50281
16014 -254873 115167 335670 -74410 -68943 -397458 -174034 -206723 -102353 7511 237990 -172303
16002 107437 214066 -63228 159421 78402 -260851 197231 21986 -123095 -234896 -163573
15992 -163573 -91341 -13862 -62506 -320734 -91802 243541 -267883 24826 56246 209752 717189
15981 717189 199577 109152 450672 60799 79683 298157 152525 -144627 90986 202101
15971 202101 -14868 -33393 -1893 -156863 -209063 228448 92672 -4872 -9256 -26224 481229
15959 -218066 -257215 72225 114745 142244 100549 386615 -196870 124436 -34036 -338479 -106891
15947c18346P9669F7769a89010Q0082C9086J17356h4667p3766a6346k80214C6039
15935a33462j34920b3233A73389a8489A29113a7398m2748j29508R2456E7960K99238
15924C57198A21272d7726k84509a08340r5677i8612D767b06111B5259c82203m7824
15913d30027A21882D801c01510J11741p9701a11922k9213E7340M0674a23928p2366
15902a96294c4481m376A8681R289K24437a03812j3874B47714A03927l655a25296
15890d9711A89245a79471C3961e7323B1846c30148A16784J44093a73931d3378
15879a79111e8496r4231j59899A10429a12471b1425n3317k51025m6767i1917A37878
15867b45204i686q2867A37174D0902a56992k26397C70876A57261a23958M7918
$$ plain form
15947 -318346 -238677 67769 -189010 -108928 39086 156442 -84667 -158433 -16346 -296560 36039
15935 -133462 -268382 -23233 173389 -18489 129113 -17398 -60146 -189654 -97198 57960 357198
15924 357198 121272 -47726 -332235 -108340 -204017 -98612 4767 -206111 25259 -382203 -430027
15913 -430027 121882 4801 -301510 -189769 -269470 -111922 -141135 57340 98014 -123928 -196294
15902 -196294 -34481 -38857 18681 27970 252407 -103812 -117686 247714 103927 100272 -125296
15890 -49711 189245 -179471 33961 -57323 21846 -330148 116784 260877 -173931 -43378
15879 -179111 -58496 -152727 -312626 110429 -112471 -21425 -74742 -325767 -372534 -91917 137878
15867 -245204 -9686 -92553 137174 40902 -156992 -383389 370876 157261 -123958 -76040
15857g6040C6901h8550A54371J07768g7295j24794h3305A63718q1739b30691B39778
15845I8279A0730K46390B5827a04665A14742A9131J35089d069I1358O6050O1170
15834B18578g2196n984j0281k23463D8756M19982g4520B56978p8846b20552O0404
15823a60148A91974n8167e0748j32084A7129a73474L8008A47626d31107a37473
15812A30050f9356G8215e702l6905j30654C15423b01001c2992o4625B65072i8160
15800e6630a6421I0190a7288q5281j86443A23674m6236h2928C06195c40325A4227
15788a6633B48678C7969a17820j40020d1978F3137a09085L2041F3408b48866e4616
15776B05128A02286c44999G2318B5075a30138M6631F7924b66576P5866Q1404G2114
$$ plain form
15857 -76040 36901 -88550 154371 262139 -77295 -202089 -83305 163718 81979 -230691 239778
15845 98279 10730 257120 25827 -104665 114742 19131 154220 -4069 91358 157408 218578
15834 218578 -72196 -78180 -88461 -311924 48756 468738 -74520 256978 178132 -220552 -160148
15823 -160148 191974 133807 -50748 -182832 17129 -173474 -135466 147626 -431107 -137473
15812 130050 -69356 78215 -5702 -42607 -173261 315423 -201001 -32992 -97617 265072 -98160
15800 -56630 -16421 90190 -17288 -102569 -289012 123674 77438 -82928 306195 -340325 14227
15788 -16633 248678 37969 -117820 -257840 -41978 63137 -109085 -77044 63408 -248866 -54616
15776 205128 102286 -344999 72318 25075 -130138 -83507 67924 -266576 -190710 -109306 72114
15764f4539B90658a34097j82350J37943G9041k5311a97217A58585m9443j818i0532
15752A08601Q4158c01278d7962k09405Q3723j7052C237a26559k03619a46004j3104
15741a59108q3804j64516i1100H7457K73076c5794A67427B8542b1646a368k55196
15730b56564b9584l63162A69043C5110J45721a82245f8980c683n2173j45736A7393
15718B82277A2439L1905h0632A0453M7037b79101a0198j5940E9226a47111A43490
15706B68894a65741j64949B26772b2096B5099d28067a21872j10395D3741P0585
15696A14326k6296b10582B9354D868N4785p494K58768j36460k4698a8950C4658
15684A05304O6287a30105m1853F9279b18620J3851G5792a99472G1040b8889l03435
$$ plain form
15764 -64539 290658 -134097 -316447 -178504 79041 53730 -197217 158585 109142 107324 -90532
15752 108601 192759 -301278 -47962 -257367 -173644 -190696 3237 -126559 -330178 -146004 -159108
15741 -159108 -242912 -407428 -91100 87457 360533 -35794 167427 28542 -21646 -1368 -256564
15730 -256564 -29584 -392746 169043 35110 180831 -182245 -68980 -3683 -55856 -201592 17393
15718 282277 12439 44344 -80632 10453 57490 -279101 -10198 -26138 59226 -147111 143490
15706 268894 -165741 -330690 226772 -22096 25099 -428067 -121872 -232267 43741 114326
15696 114326 88030 -210582 29354 4868 59653 52159 310927 174467 149769 -18950 34658
15684 105304 171591 -130105 -171958 69279 -218620 -204769 75792 -199472 71040 -28889 -332324
15673c32324B17870B870L42556g6685B801b1258F2833i6481F537a26021A73866
15661g1411j5653n912p1634e1146a6421j89473H5398g9184A51094J11177b44188
15649c55454m432A05567a36972D2830R0070a62964p3406A69603a29696B39026
15638a83050b5586C15841f2610A85322B0979c80536B1443J03991f5088C0365b01341
15626B25590a15810A35887B349a48318G5699L6006a2569l9791J4749j94533D4560
15614a56523C90821G6585b37502A6696b71897g5849C6777b30337J09598k75823
15604c96562A15330a47571k35474e818j06443j19365Q0941e9328A8591e6941A76352
15592b38393f4284k76113C1770Q9490a56643A00275b43645M3097h9791E1004b13573
$$ plain form
15673 -332324 217870 2870 345426 -76685 2801 -21258 62833 -96481 6537 -126021 173866
15661 -71411 -87064 -92976 -164610 -51146 -16421 -205894 85398 -79184 151094 262271 -244188
15649 -355454 -359886 105567 -136972 42830 132900 -162964 -236370 169603 -129696 239026
15638 -183050 -25586 315841 -62610 185322 20979 -380536 21443 125434 -65088 30365 -201341
15626 225590 -115810 135887 2349 -148318 75699 111705 -12569 -52360 -37611 -232144 44560
15614 -156523 390821 76585 -237502 16696 -271897 -75849 36777 -230337 -120739 -396562
15604 -396562 115330 -147571 -383045 -5818 -112261 -231626 -150685 -59328 18591 -56941 176352
15592 -238393 -64284 -340397 31770 121260 -156643 100275 -243645 -200548 -89791 51004 -213573
15580f2147J9961D834a05195m04346e4339k7161A29313k9136i5465q5399P0584
15569a10280r1489A44152h6621k9492B43715b6075C28218i0514j0065C87739b8177
15557b68585B03621a49678A88347a61970A24451m7430a98511A10024d5490A39437
15546a09659I0039f2173b5349A63253a39568N9381J6785o4649p0795B21732q5491
15535A36241a49266f3846E1473a46965r008N4608l5324k72250H2200a16391B29041
15523h4041A38857b7801B89367A04f5158A59079a39602k6170o8101C4073i5533
15511b8495H1701c0539n2613a4475j49747k09294f1352E4887a94392B2232a32233
15499a6283A30425M0737J65597a9357k10120A06830P8555J92603A2082h3955k6665
$$ plain form
15580 -62147 -42186 4834 -105195 -509541 -54339 -81500 129313 100177 -95465 -180864 -110280
15569 -110280 -201769 144152 -86621 -116113 243715 -26075 328218 -90514 -100579 387739 -28177
15557 -268585 203621 -149678 188347 -161970 124451 77021 -198511 110024 -45490 139437
15546 -109659 90039 -62173 -25349 163253 -139568 -80187 -63402 -128051 -198846 221732 136241
15535 136241 -149266 -63846 51473 -146965 -155973 -101365 -136689 -408939 82200 -116391 229041
15523 -84041 138857 -27801 289367 104 -65158 159079 -139602 -165772 -233873 34073 -95533
15511 -28495 81701 -30539 -83152 -14475 -164222 -373516 -61352 54887 -194392 22232 -132233
15499 -16283 130425 171162 336759 -19357 -229477 106830 185385 377988 12082 -83955 -110620
15488a10620A53668d37185A4483J26523a10883j54613k3468B43598b2734C7830
15477A46745j0444J59262J19306j82647q4668K1905a87352I5109c2003m59244
15467d91247C01140o0884J53307b26847E7917M380c1896A16924b53934e4130k9796
15456h3926E25690f1746E06368h0942E0016c81970a2567D06259A68859c43862
15445E3720c42795a7774n486A3771J36813a72690B34905b14223b2947j15405N2417
15434h5935c959A18580f9655a9538A9890a93513H9300d4242E0935b91949E2069
15422a42409g1068A45815F8782i1758B6364i3631L8361G8172b53284A78556i8396
15410A01555M2319l4169a62831J7045O9320j88482A97146J20007G7922M5429a75612
$$ plain form
15488 -110620 153668 -437185 14483 141006 -110883 -265496 -288964 243598 -22734 37830
15477 146745 136301 295563 414869 232222 147554 169459 -187352 95109 -32003 -491247
15467 -491247 301140 240256 393563 -226847 57917 62297 -31896 116924 -253934 -54130 -83926
15456 -83926 525690 -61746 506368 -80942 50016 -381970 -12567 406259 168859 -343862
15445 53720 -342795 -17774 -23260 13771 150584 -172690 234905 -214223 -22947 -138352 -85935
15434 -85935 -3959 118580 -69655 -19538 19890 -193513 89300 -44242 50935 -291949 52069
15422 -142409 -71068 145815 68782 -91758 26364 -93631 -55270 78172 -253284 178556 -98396
15410 101555 143874 109705 -162831 -145786 -76466 -264948 197146 317153 77922 123351 -175612
15398H9588c01193A14664g3986G2160c91283M5364G8452b17005f4185E881J60185
15387A66066b24545D96572e9041C63568p9111a88607l7649B45895c7891B73114
15376i3695l4399A55943a59646g4742B6443b32216c8987A62695b88928A28218
15365b3245k24288f7276r6967M0779J7033l04610J44288D1477O0594a34676I0847
15353c12072a30174p6716h540m0027k99553I3833e5903k05611B93141a42024m4183
15342a86207F3947c5400k05137e3207B59166j07190b2919K422l613q4555B78569
15330A80366q2916o544j9740J56651c7874C31580A13104N7777b96168A00523O27
15319A01150g050m5251n2031A21674j9548J46093Q8870a11954C23920a70622A78250
$$ plain form
15398 89588 -301193 114664 -73986 72160 -391283 -345919 78452 -217005 -64185 5881 166066
15387 166066 -224545 496572 -59041 363568 284457 -188607 -226256 245895 -37891 273114
15376 -93695 -128094 155943 -159646 -74742 26443 -232216 -38987 162695 -288928 128218
15365 -23245 -247533 -67276 -164243 -123464 -106431 -411041 -266753 41477 102071 -134676 90847
15353 -312072 -130174 -206890 -8540 -48567 -348120 93833 -55903 -261514 293141 -142024 -186207
15342 -186207 63947 -35400 -240537 -53207 259166 151976 -22919 -20497 -24110 -108665 278569
15330 180366 97450 90906 71166 227817 -37874 331580 113104 170881 -296168 100523 101150
15319 101150 -7050 -52301 -104332 121674 102126 248219 337089 -111954 323920 -170622 178250
15307b84417E4044J36227B3357J67278c10320r4766A83318H4864j0535a03708
15296A51862J13409a0888B49640f6385k61028J06741a03233H6132J9357C3351
15285D6347M8816J02030B1147M6961C1504J00655K44339A34411b333H6028a11730
15273A2359a24695C15892A05343b01462B95582b24338g9509A22599K4675c5675
15262B941a359o7891m04323e0500j48577i048j38138A20103K76248C4607M4120
15251G8727b44077E91955M71645j6842l19864M29043B01850J5458d2021D44352
15240F2276J2709b4995f31I4072A2257K45234a8714E66730b11524A36101J91421
15229C27522A9060L60062A0117K60719E7379M2621i0521A13761a1921A45002d2441
$$ plain form
15307 -284417 54044 190271 23357 190635 -310320 -405086 183318 84864 74329 -103708
15296 151862 265271 -10888 249640 -66385 -327413 -220672 -103233 86132 105489 33351
15285 46347 95163 197193 21147 68108 31504 132159 376498 134411 -2333 86028 -111730
15273 12359 -124695 315892 105343 -201462 295582 -224338 -79509 122599 147274 -35675
15262 2941 -1359 -69250 -473573 -50500 -199077 -9048 -147186 120103 396351 34607 78727
15251 78727 -244077 591955 1063600 1046758 726894 1155937 201850 217308 -42021 444352
15240 62276 74985 -24995 -631 94072 12257 257491 -18714 566730 -211524 136101 327522
15229 327522 19060 379122 10117 270836 57379 100000 -90521 113761 -11921 145002 -42441
15217C04806A47368A3471K31626I9163C8672a5794H5798k5943M4972c51783B56230
15205D22138c7116B81440j6577c304A37608B6543D672J28618J99126j58948Q9724
15194B63192A08516a97432F4822R845A7563J00903a90994B98843H9520G035M63079
15183D70114b24347F3295a88171c4835q3010d3915G1439J12146E4497N7225b82921
15171A94440K45961d4896A53012E4083J67227J02075r4368a06426C33456A02417
15160A58424m6535J57836B9332H590J5635a13185B7611e57706h8688A18803j4872
15149A03931M28879A2334K39983D7842J94119a3027A81242O6760c85695A08309
15138A01750O526B0671J92458O8644B1632b37349A83759J51292H1980L4679O5018
$$ plain form
15217 304806 147368 13471 245097 99163 38672 -15794 85798 59855 104827 -351783 256230
15205 422138 -37116 281440 264863 -3304 137608 26543 4672 133290 332416 173468 263192
15194 263192 108516 -197432 64822 74667 17563 118466 -190994 298843 89520 7035 470114
15183 470114 -224347 63295 -188171 -34835 -117845 -43915 71439 183585 54497 111722 -282921
15171 194440 440401 -44896 153012 54083 221310 323385 229017 -106426 333456 102417
15160 158424 111889 269725 29332 8590 24225 -113185 27611 -557706 -88688 118803 103931
15149 103931 532810 12334 252317 47842 241961 -13027 181242 248002 -385695 108309
15138 101750 108276 20671 213129 281773 21632 -237349 183759 335051 81980 116659 181677
15127A81677o1804L33319b04103A0018c7025D2433b6594D6879b84403A62451J51529
15116C13980c1418A48698l7463P8243L2408c54392g8298q2543A7855a16310C22061
15104G1901c2090B46960a3997C21804B4583L807L8324h6573B99801O3234c03631
15092B65770m0971I5498L53744a04480j54834R4368A36410a57059L9335G7685
15081A30440N43312C14462b20866C21768E1775K73301A58227a46014H0625L48251
15071D28876o6502C7098M8966j6516f1590m74j06612A98261c2105A83039N4557
15060B37596r3786O8921J45270j58211H5021J17172p410q7234a31289A79991L7056
15049B17047b03387C02241r4728a53071j5020A63036J04288r27L2636J8406n5318
$$ plain form
15127 181677 119873 453192 -204103 10018 -37025 42433 -26594 46879 -284403 162451 313980
15116 313980 -31418 148698 111235 189478 221886 -354392 -78298 -160841 17855 -116310 322061
15104 71901 -32090 246960 -13997 321804 24583 28390 66714 -86573 299801 363035 -303631
15092 265770 224799 95498 449242 -104480 -259314 -164946 136410 -157059 -117724 77685
15081 130440 673752 314462 -220866 321768 51775 325076 158227 -146014 80625 428876
15071 428876 362374 37098 86064 69548 -61590 -62064 -168676 198261 -32105 183039 237596
15060 237596 143810 212731 358001 199790 85021 202193 194783 107549 -131289 179991 217047
15049 217047 -203387 302241 207513 -153071 -168091 163036 267324 266397 299033 317439 262121
15038B62121n933C9512R2350J85475C5388L26737f3812A89302o7872q702K0661
15027A33389F852J84027k8215l2413m9478L10274n9525I1743J35180a0002A78586
15015B16771J13918A33841J7364J72865q3878a3667A48903h4391A24157K05945
15005C30102H3172J68583J92746G3702J26891O1677a13695a2392D72563r8203
14995C74360m8074n1151d0935C35599j33679B4605R0595L76923A19955J31536
14985B51491k4125d4907F9136J53421a29553C87211j90123a8472B41792m0277
14975B01515K66317A55961R3556j6688I6247j6021L31284B6059K51634Q6557A52778
14963A0566a3541B13247Q99K9628I6434K06049m9675G687K28005j03633J02919
$$ plain form
15038 262121 256188 39512 131862 317337 35388 362125 -63812 189302 121430 112728 133389
15027 133389 6852 190879 162664 130251 80773 391047 331522 91743 226923 -10002 178586
15015 216771 330689 133841 151205 324070 240192 -13667 148903 -84391 124157 330102
15005 330102 83172 251755 444501 73702 200593 262270 -113695 -12392 472563 374360
14995 374360 326286 275135 -40935 335599 201920 24605 115200 492123 119955 251491
14985 251491 227366 -44907 69136 222557 -129553 387211 197088 -18472 241792 201515
14975 201515 467832 155961 249517 232829 96247 80226 411510 26059 277693 364250 152778
14963 10566 -13541 213247 214146 243774 96434 302483 252808 7687 235692 132059 234978
14952B34978I0643R4284k1530J40514j36681L76605R3132E0668e687A52460Q9185
14941B41645A00477K09985P0133j81709B3168R8601K35835n1410R2785Q6083J19184
14930F04246B08062J88938c5401B49427J22109o7915j46767J61230j09893H4058
14919C77705j36986j05365K77178K0414j28217J08917r5186J50918A13616R9444
14909B13060P2653A18971P3199I2900K61550A08318K10970L62716l05390L3715
14899D10329J84563j58697j29552L4896j66543L08559q3753K6998A00648K49149
14889C49797K7027J0499k1997J48621j22826j68426J61094K0728K14044F0143
14878A86029J44233A60322E2072M73847j88959q195o8829J10948K09068f2474
$$ plain form
14952 234978 90643 184927 163397 303911 167230 543835 636967 50668 -5687 152460 241645
14941 241645 100477 310462 380595 198886 23168 121769 357604 306194 398979 485062 604246
14930 604246 208062 397000 -35401 249427 371536 303621 156854 318084 208191 84058
14919 377705 240719 135354 412532 432946 304729 413646 318460 469378 113616 213060
14909 213060 285713 118971 192170 92900 354450 108318 319288 682004 376614 410329
14899 410329 594892 436195 306643 341539 174996 483555 399802 426800 100648 349797
14889 349797 376824 387323 365326 513947 391121 222695 383789 404517 618561 60143
14878 186029 330262 160322 52072 525919 336960 328765 259936 370884 579952 -62474
14867C88397O6372B24802k8324L97796B34974j5046J19736O5127A42448K85920
14857D28368J38362A26259L08357K7169k30266Q4605O7584k0224J09251j0630
14847D62105A18583J2792M89229k63005J57068b8983A08521M07357j28374K49890
14837F37394j15258j78237A64670L55910A46331M04903K74510C23286J85749B28015
14826B71740L393K50500j06986O0749J72244B71018M91177l72608J38995L79285
14816I07867D04611j95571K29409j56318M87614B91947L44071J14082k79429O933
14806D77604j47394O8426L601N4888l2179J25033B44719L16942j94761J50120
14796E17020K3912k43121L03860A85037L36512O6802N1292k0392q7575k03918
$$ plain form
14867 388397 454769 224802 196478 594274 234974 219928 339664 404791 142448 428368
14857 428368 566730 126259 434616 461785 231519 316124 383708 363484 472735 462105
14847 462105 118583 131375 620604 357599 514667 -28983 108521 515878 387504 637394
14837 637394 522136 343899 164670 520580 146331 551234 825744 323286 509035 228015
14826 271740 275133 525633 418647 479396 651640 271018 762195 389587 528582 907867
14816 907867 404611 209040 438449 282131 769745 291947 636018 750100 470671 477604
14806 477604 330210 398636 402237 457125 424946 549979 244719 561661 366900 517020
14796 517020 540932 297811 601671 185037 521549 588351 639643 619251 531676 327758
14786C27758O1742K14571J75923j59003k28581K00423B70771K34570o7750K87864
14776G25455k04354k3344L24275k51626J97248k86568r7203K27575N2577B52196
14765C23888J70036J83413K1880M1801k10407j4001m8028R0328L7064B12078M58376
14754F70454R8344o5328B65979O48392C67910L45355L9547j52168L95970D79692
14743F26820P9419j54569q6146q5387O63082l26771l09293K33692J92660j41478
14733F92029r6219J31874C32486M62950j60599L48349k6828l53021L84064j91123
14723G96278P9073k91515K66620P8450k07256m3348j71674O54613l81092J8416
14713G98565J14558o8327q9503j92269N25137m60779J74222k18308K21787J11444
$$ plain form
14786 327758 389500 604071 779994 620991 392410 592833 270771 505341 437591 725455
14776 725455 521101 497757 822032 570406 767654 481086 383883 611458 664035 252196
14765 323888 493924 677337 699217 741018 530611 516610 468582 558910 595974 212078 670454
14754 670454 768798 703470 265979 914371 367910 713265 752812 600644 996614 479692
14743 626820 706239 551670 465524 380137 1043219 716448 407155 640847 833507 692029
14733 692029 595810 727684 332486 795436 634837 983186 956358 603337 987401 796278
14723 796278 875351 583836 850456 928906 721650 678302 506628 1161241 780149 798565
14713 798565 913123 844796 755293 563024 1088161 627382 801604 583296 805083 916527
14703I16527j42131K5215K697j355j03768M54560k88807r2190K29443n2527j57756
14692G89908J7545n9904N25455o08643o6131M38914j83742q695m8250K80686l75124
14681G02019Q2424J42622j33285J02658q2226J34982J32458p2774J39545j15600
14671A032823p4782J43185P1329l17373O1392j54196K51350j19386J31351q0085
14661I45608q6737K08660J30318l23431M06392l89278P8946J18842K18238N6966
14651A364524k35267J439j25071k40051L59811l4047j26089M1443l4786L93849
14641A365755j75599J43501k97575L44376k03319J47672P932K20454l26118o8910
14631A158169o6820J27993j56023L13679n9903Q1922j31349j61370K48036Q0722
$$ plain form
14703 916527 774396 799611 802308 800953 697185 1151745 862938 770748 1000191 947664 789908
14692 789908 807453 747549 1273004 664361 598230 1037144 853402 844707 796457 1077143 702019
14681 702019 784443 927065 793780 896438 814212 949194 1081652 1008878 1148423 1032823
14671 1032823 958041 1101226 1172555 855182 916574 762378 1013728 894342 1025693 945608
14661 945608 858871 1067531 1197849 874418 1280810 891532 970478 1089320 1307558 1364524
14651 1364524 1129257 1130696 1005625 765574 1125385 1091338 965249 1006692 971906 1365755
14641 1365755 1190156 1333657 1036082 1380458 1177139 1324811 1332743 1553197 1227079 1158169
14631 1158169 1091349 1219342 1063319 1376998 1317095 1399017 1267668 1106298 1354334 1435056
14621A435056p9002K15978l42952L33623J01445k61714l13570M83762P0186J11572
14611A754384k93935R8974L91644o12524j3100L82930n37570K97012L23168q8964
14601A702019J40719n51609J21533J32708J0926P7912p5193j7696J91960j85779
14591A547500L86818n55892M20180J55743k88461j58457K76331L68269j93224
14582A958807j61950k00492J51102J25234J2125L2596L16213k26167M31863m75134
14572A964197L0433M57913n20724M09552O9347j11133j1709Q23L69685k16024
14562B442360n3717r7735L58134L43009k04607K95905j17567L63688K67329K61570
14552C858369M49712M89870J020218J373064M135066R895433K1488835L446577
$$ plain form
14621 1435056 1356054 1572032 1229080 1562703 1664148 1402434 1088864 1572626 1642812 1754384
14611 1754384 1460449 1559423 1951067 1338543 1325443 1708373 1170803 1467815 1790983 1702019
14601 1702019 1842738 1291129 1412662 1545370 1556296 1634208 1559015 1541319 1733279 1547500
14591 1547500 1934318 1378426 1798606 1954349 1665888 1507431 1783762 2152031 1958807
14582 1958807 1796857 1596365 1747467 1872701 1884826 1917422 2233635 2007468 2439331 1964197
14572 1964197 1994630 2452543 1931819 2341371 2410718 2299585 2287876 2288699 2658384 2442360
14562 2442360 2388643 2290908 2649042 2992051 2787444 3083349 2965782 3329470 3596799 3858369
14552 3858369 4308081 4797951 5818169 7191233 11326299 21221732 42710567 46157144
14544D6157144A7080923F580684l044446j100174j53283m13865n0675L55173k61444
14535A911970M32454k71037j66303R2875o9537K46734J62227L5527K7176r7132
14525B304954n3030L88099m9446j86690J33185m5082p5468K12017n1130k8445
14515B548964L6245n7991J69126j25820K7730K37892k29651K82585j81508N58513
14505C266085K53385m61991J39623K13881j85632r6025j46514J52858L34457m69306
14495C000821J4686J89667N02431r21655N91085J27156j5506k83837M72858r8665
14485C579041j58959J92031J24921n7044J40510m0105K70691j2384l18821M11029
14475D130910j27671L20698n4174o2287j63349J50859L44602J85085k56905J38082
$$ plain form
14544 46157144 17080923 6580684 3536238 2436064 2282781 1868916 1818241 2173414 1911970
14535 1911970 2344424 2073387 1907084 1999959 1930422 2177156 2339383 2374910 2402086 2304954
14525 2304954 2251924 2640023 2590577 2403887 2537072 2491990 2416522 2628539 2577409 2548964
14515 2548964 2585209 2527218 2696344 2570524 2598254 2836146 2606495 2889080 2707572 3266085
14505 3266085 3519470 3057479 3197102 3410983 3225351 3129326 2982812 3135670 3470127 3000821
14495 3000821 3015507 3205174 3707605 2785950 3377035 3504191 3488685 3204848 3677706 3579041
14485 3579041 3420082 3612113 3737034 3679990 3820500 3780395 4051086 4038702 3719881 4130910
14475 4130910 4003239 4323937 4269763 4207476 4044127 4194986 4539588 4724673 4467768 4605850
14465D605850j16327K00364l59319M43379k02290J76935Q534J83099q9555J56601
14455E007271J91582l09513J79105K49114j45594K37929R4229o76O2331K8533
14445E594311K50875l00754J34020J70365J25272K38323j06541m5951M31691j96071
14435F295540M24561m24532L82915M6541L49426r4309K87645m96549L42930L86588
14425G500756k78649M70588l80270K76971L41025m9944J41083K61558P8244K32132
14415H593494O4059j60029M2558K38923K22612K39930J18897O8447K24174r522
14405I643543J93800K78064K90531L38216k74270M33383J24155J63252K26324
14396A1416998Q8243J20131M41184M3662K16884K54005j19202N56563N6004J44913
$$ plain form
14465 4605850 4489523 4689887 4330568 4773947 4571657 4748592 4757126 4940225 4850670 5007271
14455 5007271 5198853 4889340 5068445 5317559 5171965 5409894 5504123 5503447 5565778 5594311
14445 5594311 5845186 5544432 5678452 5848817 5974089 6212412 6105871 6059920 6491611 6295540
14435 6295540 6720101 6295569 6678484 6725025 7074451 6980142 7267787 6771238 7114168 7500756
14425 7500756 7222107 7692695 7312425 7589396 7930421 7880477 8021560 8283118 8361362 8593494
14415 8593494 8657553 8497524 8540082 8779005 9001617 9241547 9360444 9428891 9653065 9643543
14405 9643543 9837343 10115407 10405938 10744154 10469884 10903267 11027422 11190674 11416998
14396 11416998 11505241 11625372 12066556 12110218 12327102 12581107 12461905 13018468 13074472 13219385
14386A3219385L10735L72360Q9248L86331P2450J1313N65058L80857K75408L16939
14376A6000084l6290N18894M66182j80856O62633N72540k0011L43134M86261M57822
14366A9270393O14733N34338R9037K14470O34807K58399M29979Q30983M20870
14357B3308009O55509R620Q26661O48003R24026K81758N13490N29879K37425J187865
14347B9122245J079397L70326J149914O09978Q61488P90542R28776O29965J379105
14338C6921736Q14097J134919J293489O21199J307497J224664J945450J006949
14330D6270000J342395J475714J376968J914945J461991J914558J737134J696507
14322E9190212K090012K142326J960241K400783K423786K599029K522266L033979
$$ plain form
14386 13219385 13530120 13902480 13991728 14378059 14450509 14461822 15026880 15407737 15683145 16000084
14376 16000084 15963794 16482688 16948870 16768014 17430647 18003187 17983176 18326310 18812571 19270393
14366 19270393 19885126 20419464 20518501 20732971 21367778 21626177 22056156 22887139 23308009
14357 23308009 23963518 23973138 24799799 25447802 26371828 26653586 27167076 27696955 27934380 29122245
14347 29122245 30201642 30571968 31721882 32331860 33193348 33983890 34912666 35542631 36921736
14338 36921736 37735833 38870752 40164241 40785440 42092937 43317601 45263051 46270000
14330 46270000 47612395 49088109 50465077 52380022 53842013 55756571 57493705 59190212
14322 59190212 61280224 63422550 65382791 67783574 70207360 72806389 75328655 78362634
14314G8362634K807488L113925L376595L309633K984638M686157L936310M114988
14306A06692368M578221M794094M802283N133045O174157N994818N767986P373070
14298A51310042O993839P445904P698754Q617477Q900626R475791J0236898J0083291
14290B20762622J0838292J1825061J1857898J3166034J3456746J3454732J4365407
14283C09726792J4865096J5052469J5186351J5230855J4932671J4960856J4235449
14276D14190539J3297259J2236927J0663514Q358960M571308J527634J844897
14269D66691038R39011j918776l390811n317870q742886j0789620j2888968j4057485
14261D10523633j5109844j5733808j5962914j6285972j5742421j5100297j5335119
$$ plain form
14314 78362634 81170122 84284047 87660642 90970275 93954913 98641070 102577380 106692368
14306 106692368 111270589 116064683 120866966 126000011 132174168 138168986 143936972 151310042
14298 151310042 158303881 165749785 173448539 182066016 190966642 200442433 210679331 220762622
14290 220762622 231600914 243425975 255283873 268449907 281906653 295361385 309726792
14283 309726792 324591888 339644357 354830708 370061563 384994234 399955090 414190539
14276 414190539 427487798 439724725 450388239 458747199 463318507 464846141 466691038
14269 466691038 467630049 465711273 462320462 457002592 448259706 437470086 424581118 410523633
14261 410523633 395413789 379679981 363717067 347431095 331688674 316588377 301253258
14254C01253258j4646428j4330852j3853130j2607314j2730363j1356130j1158763
14247B10570278j0790485r646989r373065q258519q225422q201717p303713p061904
14239A41708464o295210n774678n429196n419379n725756m853650m746520l531262
14231I9932813l561440m346301l700324l214720l868010k724982k855404k708284
14223G2953348l079608k226507k225712k071076k388679j986354j902120k207191
14215E4866101j253665j725511j056581k125048j472367j652668j057077j351932
14207D3171252m10270j288668j370146j601148j320504j013416l12399o49763
14199C5204938j244636r47651r17769j050951m49185r21062k98525j233409m47177
$$ plain form
14254 301253258 286606830 272275978 258422848 245815534 233085171 221729041 210570278
14247 210570278 199779793 190132804 180759739 172501220 164275798 156074081 148770368 141708464
14239 141708464 135413254 129638576 124209380 118790001 113064245 108210595 103464075 99932813
14231 99932813 96371373 92025072 88324748 85110028 81242018 78517036 75661632 72953348
14223 72953348 69873740 67647233 65421521 63350445 60961766 58975412 57073292 54866101
14215 54866101 53612436 51886925 50830344 48705296 47232929 45580261 44523184 43171252
14207 43171252 42760982 41472314 40102168 38501020 37180516 36167100 35854701 35204938
14199 35204938 33960302 33012651 32094882 31043931 30594746 29673684 29375159 28141750 27694573
14190B7694573r86053o21383o45049n88856k49676r00400j79837n34525m41244
14181B2547550m76599o80880m08729n21030k01306o09275p13377l12493k55492
14172A8368369j62805m32584j81261m80793p66900J00997k70064n21145l84035
14163A5269779j33692n22065J92613m28115m34241r3992m30256N8834j58733m53277
14153A2866855j24757k43510J42049m84939l77853k84470j74442j48177p0005
14144A1100751l38382K87413n07509n0971k66981M0126l24993Q0594J33848l96310
14134I757586n62829J69537j40948k7089j93501K8825l55960q5453q149m2471
14124H539548k20914k91327M5903j10138q1596o2713k12577J2585j96872J86615
$$ plain form
14190 27694573 26708520 26087137 25442088 24853232 24603556 23703156 23523319 22988794 22547550
14181 22547550 22070951 21390071 20981342 20460312 20259006 19649731 18936354 18623861 18368369
14172 18368369 18205564 17772980 17591719 17110926 16344026 16445023 16174959 15653814 15269779
14163 15269779 15136087 14614022 14806635 14378520 13944279 13850287 13420031 13478865 13320132 12866855
14153 12866855 12742098 12498588 12640637 12155698 11777845 11493375 11318933 11170756 11100751
14144 11100751 10762369 11049782 10542273 10491302 10224321 10264447 9939454 10020048 10153896 9757586
14134 9757586 9194757 9364294 9223346 9196257 9002756 9031581 8675621 8590168 8582019 8539548
14124 8539548 8318634 8027307 8073210 7963072 7881476 7818763 7606186 7618771 7421899 7608514
14114G608514l98071j44444L44131n24498o1827R9726N1787o2127m57562K16453
14104F672082m9965l656l07760L49775n81256M6201l74046M50992m80092N4126
14094E776401L81514n23745o6082k93835O2787L61797m28176M79552m38290j35724
14084E176199R4020l39316J72002l01944K7898J08663O0908q1139l20976K75597
14074D871912j36957j87263k64759J16072J09294l8900O3243l32260J55564l18957
14064D036989J18594p7417J53523P9834n08149L13542l8181R1194j55639N6896
14054D071186o42582P7445N523J96139J38680m14228J3390M6566j21421l12876
14044C057822L01655Q8182m6709M5853j36502j15384j78356K40050k1922J6577
$$ plain form
14114 7608514 7210443 7065999 7410130 6885632 6823805 6923531 6975318 6913191 6455629 6672082
14104 6672082 6622117 6618461 6310701 6660476 6079220 6125421 5751375 6202367 5722275 5776401
14094 5776401 6157915 5634170 5568088 5274253 5337040 5698837 5270661 5750213 5311923 5176199
14084 5176199 5270219 4930903 5102905 4800961 4828859 4937522 4998430 4917291 4596315 4871912
14074 4871912 4734955 4547692 4282933 4399005 4508299 4469399 4532642 4200382 4355946 4036989
14064 4036989 4155583 4078166 4231689 4311523 3803374 4116916 4078735 4169929 4014290 4071186
14054 4071186 3428604 3506049 3511572 3707711 3846391 3432163 3445553 3492119 3370698 3057822
14044 3057822 3359477 3447659 3400950 3446803 3310301 3194917 3016561 3256611 3234689 3251266
14034C251266n05713N74039j71815l43176K66298K37076m84695J31006L2977J4429
14024C001692o0245j11370K89096k22714j51192K31667k13207K4263n8303j05691
14014B623996j56178J28939k2299n0245J34805l29179K74997n25684L26216j82087
14004B223281J12169m2250J4559J23806k27517j97997j49227O60604k43422N7353
13994B331359N1157j33706J82405K15048J66281J020342K566517P591711K0790494
13985C4781608J3883954B3951272A1705712m561675j523784j217167l81697m67718
13977C553671l47316m4124j25351m03321J78890j06278j06396J26572Q7112k33901
13967B579558l29424J18742j50780N9498j78738L74982n62531L98728m28955L19758
$$ plain form
14034 3251266 2745553 3319592 3147777 2804601 3070899 3307975 2823280 2954286 2987263 3001692
14024 3001692 2941447 2830077 3119173 2896459 2745267 2976934 2763727 2787990 2729687 2623996
14014 2623996 2467818 2596757 2574458 2524213 2659018 2329839 2604836 2079152 2405368 2223281
14004 2223281 2335450 2293200 2307759 2431565 2204048 2006051 1856824 2517428 2274006 2331359
13994 2331359 2382516 2248810 2431215 2646263 2812544 3832886 6399403 13991114 34781608
13985 34781608 48665562 23951272 11705712 7144037 5620253 4403086 4021389 3553671
13977 3553671 3206355 3162231 3036880 2633559 2812449 2706171 2599775 2726347 2813459 2579558
13967 2579558 2250134 2368876 2218096 2277594 2098856 2473838 1911307 2310035 1881080 2200838
13957B200838M775j01089O0047k11547P472L57835l63250j66359o8212L2167N31399
13946B284076l81081p999k7681J23756k24352J52081L1302j0205j16673k48189
13936A575035J86651j7931M81460k81534q0554j96493J16174l03291J1135K98028
13926A788680p0410l16655M62686N3721l70194J21698l14007L56618J22648k26863
13916A607922L4158K38530k70952P1819j14009l4252r693O7674l30511L09178
13906A569864J77112k65044K3196N5698j52153k17048R3002q5892J51858J66887
13896A517480j5176l96969J42513J33754k06770n6069J86794L26682n08920J14945
13886A238264J07316J45045K21054n41699K23730K90276m23736j14757j22208
$$ plain form
13957 2200838 2205613 2104524 2164571 1953024 1960496 2318331 1955081 1788722 1720510 1752677 2284076
13946 2284076 1902995 1894996 1867315 1991071 1766719 1918800 1950102 1939897 1823224 1575035
13936 1575035 1761686 1743755 2225215 1943681 1863127 1666634 1782808 1479517 1490652 1788680
13926 1788680 1718270 1401615 1864301 1918022 1547828 1669526 1355519 1712137 1834785 1607922
13916 1607922 1642080 1880610 1609658 1681477 1567468 1533216 1523523 1591197 1260686 1569864
13906 1569864 1746976 1481932 1505128 1560826 1408673 1191625 1284627 1198735 1350593 1517480
13896 1517480 1502304 1105335 1247848 1381602 1174832 1118763 1305557 1632239 1123319 1238264
13886 1238264 1345580 1490625 1711679 1169980 1393710 1683986 1260250 1145493 1023285
13877A023285l4861M84009j30111m43267N93812l95600l01661L94824p3348k05114
13867I11968K17770K25615n52051L28115J27595j05278k2999n4083j17094L4728
13857I94286M80946m60708J15533j4548K1149k55493J96159M6584m8257R3018
13847A168669j63333j19642R6839j5522j75265Q7930N0869M0065N12324n29490
13837I53444O3359j14600K25346l54235M99893k99027J30333j23659J13780l23518
13827G71116J33148K08056k72913M4346K62614j19592j64358p2744K51658J43401
13817A184732N799j41562m25300N58867m85467j42493M39901n891l67458J85868
13807H06996J97455l64129L32224q4269o8383j20011L36947k39859J901M2169
$$ plain form
13877 1023285 988424 1472433 1342322 899055 1492867 1097267 795606 1190430 1117082 911968
13867 911968 1129738 1355353 803302 1131417 1259012 1153734 1130735 1076652 959558 994286
13857 994286 1475232 1014524 1130057 1115509 1136658 881165 1077324 1123908 1075651 1168669
13847 1168669 1005336 885694 982533 967011 791746 879676 930545 970610 1482934 953444
13837 953444 1016803 902203 1127549 773314 1273207 974180 1104513 980854 1094634 771116
13827 771116 904264 1112320 839407 883753 1146367 1026775 862417 789673 1041331 1184732
13817 1184732 1190531 1048969 623669 1182536 697069 554576 994477 988586 621128 806996
13807 806996 1004451 640322 972546 888277 819894 699883 1036830 796971 798872 841041
13797H41041L54720j65247k45450k90767K68938j08896N8309R1238k71420R5058
13787F27524L84300k13489m5046J41576j19232j777l7020C45020P81143j98565
13777I27598k56881J92937J10938l04222L03083j26701p9580n9979J00733l61157
13767D46769P5991L37553j19359q7495o9995K03613P9301K82162l59578j20593
13757F68369J0439L7633K45274r1004l12528L2603K03604j75704J58550o9725
13747G07511B24569N80724m6976m4387k648R0110j66282L60595l59766n5625J22865
13736G03179p5521K37888k09573r6557J68744R5130l37786J40030K1130L4236
13726F80900j3672j97381j3146J20650N1680p834Q4823n6447O3577J81609l34639
$$ plain form
13797 841041 1195761 1030514 785064 494297 763235 654339 712648 803886 532466 627524
13787 627524 1011824 798335 753289 894865 775633 773856 736836 345020 1126163 927598
13777 927598 670717 863654 974592 670370 973453 846752 767172 707193 807926 446769
13767 446769 522760 860313 740954 653459 583464 787077 866378 1148540 788962 668369
13757 668369 678808 716441 961715 870711 558183 590786 794390 618686 777236 707511
13747 707511 224569 805293 758317 713930 711282 801392 635110 995705 635939 580314 703179
13736 703179 627658 865546 655973 559416 728160 823290 485504 625534 646664 680900
13726 680900 667228 469847 456701 577351 629031 621197 706020 649573 713150 894759 560120
13715E60120n5163o733k07312M7879L97813N9987l89413N22520k8034k94171j13912
13704D93581K70049B88704L43236j99176L3976J06103j66481K78957l29735K67314
13694F22898k66346n966J90436k55905K61823j54478L48453K02300l67861j30814
13684D44540P935J38059J81203l44935J65936K79436k28477B83328O75512B76480
13673G25460l41930R9164k15830J26429K9825K26663K369B06910K33458O7116
13663E07484B20960K5880K97313o7482j12880k8262J37712K03313j94596r6294
13653C85664M2235A49844J34100N0002l8644L78449k48825J13717Q9534k81407
13643C46770L15669j20943k33433J64912k07678J59184j54646D9960M75535q602
$$ plain form
13715 560120 504957 498224 290912 338791 736604 796591 407178 929698 901664 607493 493581
13704 493581 763630 288704 631940 432764 466740 572843 406362 685319 355584 622898
13694 622898 356552 350586 541022 285117 546940 392462 740915 943215 575354 444540
13684 444540 452475 590534 771737 426802 592738 872174 643697 283328 958840 276480
13673 725460 383530 482694 266864 393293 423118 649781 652150 206910 440368 507484
13663 507484 220960 246840 544153 476671 363791 335529 473241 676554 481958 385664
13653 385664 427899 149844 283944 333946 295302 673751 424926 538643 628177 346770
13643 346770 662439 541496 308063 472975 265297 424481 269835 49960 525495 516893
13633E16893K45677k01901j12580A38494K10984J64700j33677L75414B41205K5693
13623B66898K57832j2080o1786A22635J14667J25178L16294j71096O4940A85020
13612B53654K24749N10643D17647A01113N07451n5385k1642k5518k12917L4636
13602C27738K42205Q514j72908C8144L12698L36832C30181J30438n59j21407J67371
13591E06024B08940J02343J5342P938k485j46358K38544d6230E18325B32679Q6181
13580C18860j58639O6825J34401O4897J36618K09261C20946J77624A13619M6829
13570A60448K76134M8157K9904j00387H6801M63982A26066K47910K54141k36509
13560C91608J90934B55193K29722C1929K02869J58660A29085K25155q0314L3952
$$ plain form
13633 516893 762570 560669 448089 138494 349478 514178 380501 755915 241205 266898
13623 266898 524730 512650 450864 122635 237302 362480 678774 507678 572618 185020
13612 253654 478403 989046 417647 101113 608564 553179 531537 506019 293102 327738
13602 327738 569943 578457 405549 38144 350842 687674 330181 460619 460060 338653 506024
13591 506024 208940 311283 326625 334563 332078 185720 424264 -46230 518325 232679 318860
13580 318860 160221 227046 361447 426344 562962 772223 320946 498570 113619 160448
13570 160448 436582 484739 514643 414256 86801 550783 126066 373976 628117 391608
13560 391608 582542 255193 484915 31929 234798 393458 129085 354240 273926 307878
13550C07878Q0171k5674Q6460P1407E3253L86351j18442N130F4191J57414a40484
13538C70747n817j24342g7785B99572I0066L87292c3545B08151n4680J88593j35008
13527B07056J35254A35554j6045K56067K6745A80421h9676E04314A63552J16158
13517B79710J820J65359I5961J5565O3590K89128A91922m4319N155K25552A41749
13505A01221K81344r6985A11633K02868O7186j61154K41208A49835J76556I8773
13494E20998B14848D0990L18381j35168M2364G0416J90256F9259K56345l3620
13484B91984B0225K49196J067J32131L4067P8239B13035M6522k8598J31280m1894
13473C20345d1666A24379a07995I0823J54898H9048M8080J64817J13570j51236
$$ plain form
13550 307878 388049 362375 448835 520242 53253 439604 321162 326292 64191 221605 -140484
13538 370747 364930 240588 -77785 299572 90066 477358 -33545 208151 153471 342064 207056
13527 207056 342310 135554 119509 375576 402321 180421 -89676 504314 163552 279710
13517 279710 281530 446889 95961 111526 175116 464244 191922 147603 152758 378310 141749
13505 101221 382565 285580 111633 314501 381687 220533 461741 149835 326391 98773
13494 520998 214848 40990 359371 224203 266567 70416 260672 69259 325604 291984
13484 291984 20225 269421 270488 402619 436686 514925 213035 259557 230959 362239 320345
13473 320345 -41666 124379 -107995 90823 245721 89048 137128 301945 415515 264279
13463B64279A19860Q8647a18520A49849L0117p5615O69629B77562K98581j38225
13453D37918l4385F0866L00143E277M76497A82752J88488j116j41001j12807J42297
13442B58613J07575A00348b2040A01618j9467N71554k63862J64196a92784D78402
13431D23543A2636O9342K85882n5504A33332K90222a43362C71362B5285J46133
13421A71418O0495j14231g7176D67264K188j32535R5866f191B60382R1778j04974
13410B47186F8573K529N65370A30215e5112A03759J33965K4211q7365J6074d5407
13398D24790o2661h0970A76962J84092A1090K36150r6385o4457L9473K11346j42651
13387A94566a5155B35115K35905P9299B61494J10584i794B53519J33271j87541
$$ plain form
13463 264279 119860 208507 -118520 149849 179966 104351 773980 277562 576143 437918
13453 437918 403533 60866 361009 5277 481774 182752 371240 370124 229123 116316 258613
13442 258613 366188 100348 -22040 101618 82151 653705 389843 554039 -192784 478402
13431 423543 12636 81978 367860 312356 133332 423554 -143362 371362 25285 171418
13421 171418 231913 117682 -77176 467264 469452 336917 432783 -6191 260382 352160 247186
13410 247186 68573 71102 636472 130215 -55112 103759 237724 261935 174570 190644 -45407
13398 424790 362129 -80970 176962 361054 11090 247240 150855 86398 125871 337217 194566
13387 194566 -15155 235115 471020 550319 261494 372078 -9794 253519 386790 199249
13377A99249a95680B92234h7352c2677D35668I0182J09195L87413B61452k0480
13367B40972J40695j51649D9701P1613K0119J06779J50595M9040B00396g281I5875
13355C84865j26853p9034m1028P6195J17862p0658J53666B00380K5485m0807J99275
13344C84333j68088L34644O4532k08904A75690J26001m2052a980E21052j96262
13334C24790b6461D73029l2310j31979J49075j62613J95517A1566J26450K585
13324A40601F0059B8939e037C64264J49166F0484C0181e2788B55986l294J61896
13313D14588A55511J31849o1972J47475q7736k0532A31270a53819K8805A03506
13302B15188n8651h4177A70506Q7592J45323d2958H1701N0026J17543g2696B53272
$$ plain form
13377 199249 -195680 292234 -87352 -32677 435668 90182 199377 586790 261452 240972
13367 240972 381667 230018 49701 121314 141433 248212 398807 447847 200396 -7281 95875
13355 384865 258012 178978 137950 214145 332007 261349 415015 200380 225865 185058 384333
13344 384333 216245 550889 615421 406517 175690 301691 259639 -1980 521052 324790
13334 324790 -26461 473029 440719 308740 457815 295202 490719 11566 138016 140601
13324 140601 60059 28939 -5037 364264 513430 60484 30181 -52788 255986 252692 414588
13313 414588 155511 287360 225388 372863 285127 264595 131270 -153819 -125014 103506
13302 215188 156537 -84177 170506 258098 403421 -42958 81701 131727 249270 -72696 253272
13290B54278j15314g3738f043m3556A39859c3549l0647B00735r6199M4962A3700
13278A57798G2695K31185k4743n3892J6661a0113H8761l5434L37864J33545A32340
13266g3025A8613K61832c9111E2221a37569A77254M77127G5319j006e0880B45847
13254A77127q7160J51378a3039o3842A25550J57395H6460J13058p0677L28883
13244D57724B17660j7450k5555H4590b26986J10334B14435a58294g7924C88741
13233B24193o3038E8488J07252J05341a1988A53908K64669A84915L7049K2534
13223B44498M21223l23208o4351D2265L43836h4156C70143l840d1126A69443J05386
13212B74829d2500J5881A58866a52532D3453K38739I139i5586B17310p6346J13821
$$ plain form
13290 254278 138964 -73738 -6043 -49599 139859 -33549 -64196 200735 104536 149498 13700
13278 157798 72695 303880 279137 225245 241906 -10113 88761 53327 391191 524736 132340
13266 -73025 18613 280445 -39111 52221 -137569 177254 654381 75319 74313 -50880 245847
13254 177127 89967 241345 -13039 -76881 125550 282945 86460 199518 128841 457724
13244 457724 217660 200210 174655 84590 -226986 -116652 214435 -158294 -77924 388741
13233 224193 161155 58488 165740 271081 -11988 153908 418577 184915 221964 244498
13223 244498 665721 342513 278162 42265 386101 -84156 370143 366303 -41126 169443 274829
13212 274829 -42500 -26619 158866 -152532 43453 282192 9139 -95586 217310 140964 254785
13201B54785E0555J70987c6379B6287K1098K0611K38071j39421G639a83779N9588
13190a24191B86216A38314i0343J0114H2607J39638G6984A2944c5015A79372J36111
13179C15483K7357j47289a63450B40615p192o6107b47443c6801F1596M1301J122
13168A04019K68257f0741F863g8221F8230c20672D90277c273B23929J76492b39928
13156a50339k487j6266A8770b25137P2321I132a31173n2013B43679A04915e9477
13144B60787J00898b458l8206A51167e5492o60B00007a58476G2974a60624g7885
13132C475a79972A71557J01220a80310D5274P1112a18630j6411G0607b81873B82501
13120B19249p3604k4085k3622K43283A70251A077J19782J26157C6552K36582P0087
$$ plain form
13201 254785 50555 221542 -36379 26287 47385 67996 306067 166646 7639 -183779 -124191
13190 -124191 286216 138314 -90343 -80229 82607 222245 76984 12944 -35015 179372 315483
13179 315483 342840 195551 -163450 240615 233423 167316 -247443 -36801 61596 102897 104019
13168 104019 372276 -60741 6863 -78221 68230 -320672 490277 -3273 223929 400421 -239928
13156 -150339 -152826 -169092 18770 -225137 -152816 9132 -131173 -183186 243679 104915 -59477
13144 260787 361685 -2458 -40664 151167 -55492 -56152 200007 -158476 72974 -160624 -77885
13132 3475 -179972 171557 272777 -180310 45274 116386 -118630 -135041 70607 -281873 282501
13120 219249 145645 121560 97938 341221 170251 1077 120859 247016 36552 273134 343221
13109C43221q2193J98085i2454A88284J3837C2136a00311D396M7041N6976k4337
13098H4076a79443A53854l9311o538A7792P1776K80895i0005C03950C0059f3819
13086E9269J93545o8465Q6486D6728N7432R786a65892B07026o5707N2706r2405
13075A01620K0808J27447h853D3557l487J08093Q1939G2444j5459P0767A8857
13063B20975r4577e3737J1732D77102g6104E1461K04285b9062l0244B60385k4986
13052B35399b9473B17890m6768e761r8705C48001E1038b9270A25815J87819J20163
13041D33797A61263o8226K46085E8547L3461J96444J4094b10607G05096A21970
13030B20296a39549C17071J27420B00031L90024k67153e6742B39903q2940I157
$$ plain form
13109 343221 261028 459113 -92454 188284 202121 32136 -100311 4396 51437 108413 84076
13098 84076 -179443 153854 114543 108005 17792 89568 370463 -90005 303950 30059 -63819
13086 59269 252814 184349 270835 46728 104160 113946 -165892 207026 141319 194025 101620
13075 101620 122428 249875 -8853 43557 40070 148163 230102 72444 56985 127752 18857
13063 220975 126398 -53737 -42005 477102 -76104 51461 255746 -29062 -59306 260385 235399
13052 235399 -29473 217890 171122 -5761 -104466 348001 51038 -29270 125815 313634 433797
13041 433797 161263 93037 339122 58547 92008 288452 302546 -210607 705096 121970
13030 220296 -139549 317071 444491 200031 590055 322902 -56742 239903 156963 9157
13019B12082C0045a93905J4434B75453Q3712b89128D89893G0919h6037j31155
13009b17192a481j83253A40043c8411B16222q9514b9210j28365k9130C91107B9083
12997C54294o0365A17677L4780G2869J3804K58398A55228L28997A91051b27675
12986f8834B71017e3825H7666b76599J35483B59231l5393G287g2464r8685B015
12974b41835G3194i007k3169A83233b06203Q3785l7744B11453k28B2307J01676
12963A23983i0000C44279i9636d9425H3208j5883a33926A55580C6749a79470C43396
12951C89822A26975f4838F7555N5460D627K08418E7848a40261F8763d2143E4387
12939B63859l2656H6673j6471a8488j10095B76080j13696P962a48848O2134M1445
$$ plain form
13019 212082 30045 -193905 -179471 275453 359165 -289128 489893 70919 -86037 -217192
13009 -217192 -1481 -184734 140043 -38411 216222 126708 -29210 -157575 -186705 391107 29083
12997 354294 293929 117677 152457 72869 86673 345071 155228 484225 191051 -227675
12986 -68834 271017 -53825 87666 -276599 -141116 259231 223838 7287 -72464 -171149 2015
12974 -241835 73194 -9007 -32176 183233 -206203 -122418 -160162 211453 211225 22307 123983
12963 123983 -90000 344279 -99636 -49425 83208 67325 -133926 155580 36749 -179470 343396
12951 389822 126975 -64838 67555 123015 4627 213045 57848 -140261 68763 -42143 54387
12939 263859 231203 86673 70202 -18488 -128583 276080 162384 170346 -148848 -86714 -45269
12928d5269A89203a78352P5095A77955m3815J23188G8113b89195A64254E2606
12917d4996C7493b20482e3109D41608B8095N5000J28612A04640C1851O6600b26103
12905A8117g7726F7710l508J05382G215Q7170J4599f9471B17327j01615M0990
12894A56702C7492M7868J99617b3919C06998l4181a9471m3879E1186L43829b01049
12882G5043L29520i7716H5730J03585F4195K05513A01622J9400N0382A2540J50893
12871A63433G4903c04278H8370J7276b01732M7371F2398N5280g1880c2295G2879
12859a77333A81340B4803D15K73201D3365k756K29050k1866i3091B46567j4537
12848B32030n2072d5348B29907j09270g0088j42489B00489b0001k8917A96876
$$ plain form
12928 -45269 189203 -178352 -103257 177955 134140 257328 78113 -289195 164254 52606
12917 -44996 37493 -220482 -53109 441608 28095 83095 211707 104640 31851 98451 -226103
12905 18117 -77726 67710 64202 169584 7215 94385 108984 -69471 217327 115712 156702
12894 156702 37492 85360 284977 -23919 306998 272817 -19471 -63350 51186 395015 -201049
12882 75043 404563 -97716 85730 189315 64195 269708 101622 121022 171404 12540 163433
12871 163433 74903 -304278 88370 105646 -201732 -154361 62398 117678 -71880 -32295 72879
12859 -177333 181340 24803 415 273616 43365 40609 269659 247793 -93091 246567 232030
12848 232030 179958 -45348 229907 120637 -70088 -212577 200489 -20001 -48918 196876
12837A46112b61884i8965A34800e4685D3893a60578A9911J17507O9793F5515a34617
12825i0908B60370G6722d6522n1319c1374A41614E8417J403a77412B2752b15079
12813a85689b9355A33098a43636C6974K87839a34729M7799q3451A32907P3176
12803B06083a32424F2857a5181j30064k42879E7020A8004J33407J8464r490B9885
12791I2763A451b08863B93073F5449b38682j08982B20448J05223A55841M4720
12781B00561a12959h827A67814G6159b9898C011M8608R1689J46759b61597a7917
12769B8236M9125d18171C810a77296j42919J37749b2358j0086A47784J08383c2578
12757B57201A08001E1645d4494k12179A800a8640E4617J62675a70147N1938B79336
$$ plain form
12837 146112 -261884 -98965 134800 -54685 43893 -160578 19911 137418 207211 65515 -134617
12825 -90908 260370 76722 -46522 -97841 -31374 141614 58417 59820 -177412 22752 -215079
12813 -185689 -29355 133098 -143636 36974 324813 -134729 -86930 -170381 132907 206083
12803 206083 -132424 62857 -15181 -145245 -388124 57020 18004 151411 169875 160385 29885
12791 92763 1451 -208863 293073 65449 -238682 -347664 220448 325671 155841 200561
12781 200561 -112959 -8827 167814 76159 -29898 3011 51619 143308 290067 -261597 -17917
12769 28236 77361 -418171 3810 -177296 -320215 -182466 -22358 -32444 147784 256167 -32578
12757 257201 108001 51645 -44494 -256673 1800 -18640 54617 217292 -170147 -118209 279336
12745h5987K2329A96948J11681j03655c4683j69203A34249O5781J26172A0274
12734h0416p8267H6950J66040n6044r1938R2419p3577b1995A83097J54670j38621
12723A99146A6084J21881A7226N25998B37227h0311j69159B36250N2662p2968
12713B15944h7892C73252j12604B2947c069l0439D76517e3493C60684A11313P4351
12702A85664l4520E9911M6900J8933B43R5183h6255A87249J22346E1410i6603
12690C53510j16764a93653E1655e94322A39098F0107j09J6985K48845a63441A14721
12678b9961A51727h3447L8785q1083B43826H6371K56626m6560f8790c1869j3513
12667d5382H631g0804C70900i2459E01009b11614E02860c5137B38965J17593E5787
$$ plain form
12745 -85987 -63658 196948 308629 204974 -34683 -203886 134249 200030 326202 10274
12734 -80416 -158683 86950 252990 196946 105008 197427 123850 -21995 183097 337767 199146
12723 199146 16084 137965 17226 543224 237227 -80311 -249470 236250 288912 215944
12713 215944 -87892 373252 260648 22947 -3069 -33508 476517 -53493 360684 111313 185664
12702 185664 151144 59911 106811 125744 243 95426 -86255 187249 309595 51410 -96603
12690 353510 236746 -193653 51655 -594322 139098 60107 59998 76983 325828 -163441 114721
12678 -29961 151727 -83447 -44662 -125745 243826 86371 342997 296437 -68790 -31869 -45382
12667 -45382 8631 -70804 370900 -92459 501009 -211614 502860 -35137 238965 356558 55787
12655e3411a0677D21646p9262H272L92244B987J32278J2331a6760B44727D3641
12643a9765B01520i772n886B4722e3116A20084J08873d0619B93002G3705K75930
12632C49635N3241A28474l8690J0637L82789j74428K27491A67129l4866D9683
12621I0827K38512a57808I6042m4164a62229C0687O2810a54138G1956j6270f5248
12609b5570j72843B46885a48585A89897b76629H5086K6884K6281p769R821J51360
12598B91663m4039J65778j28990n0284J34403A14913J6240o5424M400c0637A26235
12586E1754c15092N8873A09329J09372m2976a12143A48947e7697B34375C1892
12575A69579a50398g2129j35483h4723l200B53907a09765B13706H2433j3433b8946
$$ plain form
12655 -53411 -10677 421646 342384 8272 400516 2987 135265 147596 -16760 244727 43641
12643 -19765 201520 -9772 -15658 24722 -53116 120084 228957 -40619 293002 73705 349635
12632 349635 402876 128474 89784 100421 483210 308782 536273 167129 132263 49683
12621 90827 329339 -157808 96042 51878 -162229 30687 93497 -154138 71956 55686 -65248
12609 -25570 -198413 246885 -148585 189897 -276629 85086 111970 138251 130482 140303 291663
12598 291663 247624 413402 284412 234128 368531 114913 131153 65729 70129 -30637 126235
12586 51754 -315092 -256219 109329 218701 175725 -112143 148947 -57697 234375 31892
12575 169579 -150398 -72129 -207612 -84723 -87923 253907 -109765 213706 82433 69000 -28946
12563I2836a98168A70644A4411O24636A77094a56899A67053b38823g9912A80407
12552a08358A71771J87035A10510l8628a54584G6783a45625c1194j88404I8961
12541A29752b08097G083h6689E579R6625d30116A00578M8479J06175A13551g1806
12529b6300C32417h2311b6455A67844F8592K32081G0788J22227P7886J74831a51995
12517b64766I0182l3962J62055a61774A36694b11098J01577c4452C8912A026K88255
12506B89281H6252L3187a93566C22735D1473a60768H9960a89902M860B9407L77025
12495D06432f5435B69547C3774K88090G9158J7296K71J05436a29845k15922E5973
12483g2768b944r0774A26789K0880b35093N7073A62592J46594b41659A66953P5896
$$ plain form
12563 92836 -198168 170644 14411 639047 177094 -156899 167053 -238823 -79912 180407
12552 -108358 171771 358806 110510 71882 -154584 76783 -145625 -31194 -219598 98961
12541 129752 -208097 7083 -86689 5579 102204 -430116 100578 149057 255232 113551 -71806
12529 -26300 332417 -82311 -26455 167844 68592 300673 70788 193015 270901 445732 -151995
12517 -264766 90182 56220 218275 -161774 136694 -211098 -109521 -34452 38912 1026 289281
12506 289281 86252 119439 -193566 322735 41473 -160768 89960 -189902 -185042 29407 406432
12495 406432 -65435 269547 33774 321864 79158 96454 96725 202161 -129845 -345767 55973
12483 -72768 -2944 -93718 126789 147669 -235093 -178020 162592 309186 -241659 166953 242849
12472B42849b14375A03633K92987A14200a70446b8163k3238n2635i517j03710
12462a13227q2853N4994j4213I1330Q4220H5604O3460J97934D5558J52706b10082
12450a34460N0773m512c3954A3137e1044G1966a06904j04803B99326I3466K5208
12439A18674a5186k413B6841K18075a00272m1066l7214j34547H6402a7142A74812
12427A07623J60685a20497a2944A10786K7518e3747b3305A14517O8037A6662a24917
12415b82915b6434j08611A18426Q7433Q9207c16485e8318B52792j03680E5955
12404A63374F8738J6076a30515p2270c4344G1417e6807r6151O2427D00924i7777
12392a9907B19088a00158E6199c4413B66401L6021f8011H7288C7954b33178B84406
$$ plain form
12472 242849 -214375 103633 396620 114200 -170446 -28163 -51401 -104036 -9517 -113227
12462 -113227 -196080 -141086 -155299 91330 175550 85604 149064 346998 45558 198264 -210082
12450 -134460 -83687 -88199 -33954 13137 -51044 71966 -106904 -211707 299326 93466 118674
12439 118674 -15186 -17599 26841 244916 -100272 -141338 -178552 -313099 86402 -17142 174812
12427 107623 268308 -120497 -12944 110786 138304 -53747 -23305 114517 182554 16662 -124917
12415 -282915 -26434 -135045 118426 205859 295066 -316485 -58318 252792 149112 55955
12404 163374 68738 84814 -130515 -202785 -34344 71417 -56807 -152958 -90531 400924 -97777
12392 -19907 219088 -100158 56199 -34413 266401 302422 -68011 87288 37954 -233178 284406
12380b61408P7569k1617A72413H0581a62882A01423b3744R498j61048C2078c04468
12368A61486K5019g1572j8731j82605P9107k588C382a83101A0425K19638C0832
12356A1005L01473M13210f7953B19318H9615b41445I1178M3810q70g3002c5356
12344A77293J52595a45801B28378q5367a01718c989k97346d6174H231J76337o6507
12333A18061J22353f7062B6714a1754D42161I3607c5418j77732O8864C77682A24935
12321a91829Q3721a1349k29194j9906e3767k2266J9036A48930e7197G4183J54571
12310B28754h1299j12472L064j23986b7265k6047R631j50113g5173l7701B56685
12298A11597l3866i0277p664A41916a00746B38623a62242D9238J05769a98240
$$ plain form
12380 -261408 -183839 -205456 172413 80581 -162882 101423 -23744 -14246 -175294 32078 -304468
12368 161486 186505 -71572 -90303 -272908 -193801 -196389 3382 -183101 10425 230063 30832
12356 11005 312478 725688 -67953 219318 89615 -241445 91178 134988 134118 -73002 -35356
12344 177293 329888 -145801 228378 143011 -101718 -3989 -301335 -46174 8231 184568 118061
12333 118061 240414 -67062 26714 -11754 442161 93607 -35418 -213150 -144286 377682 124935
12321 -191829 -108108 -11349 -240543 -260449 -53767 -76033 -56997 148930 -57197 74183 228754
12310 228754 -81299 -193771 -190707 -314693 -27265 -53312 -43681 -193794 -75173 -112874 256685
12298 111597 77731 -90277 -97941 141916 -100746 238623 -162242 49238 155007 -198240
12287a81734N6864I209b99129A62950K51648a8490B15918H6739J25202I6281R0004
12276A86285K8535n2819c1678A21106J24907H977Q5797e2151B15916D356O3889
12265F8245J73475a05122H7278h6216a9687C05413A10341J09866d6393A63982
12254A57057E2008Q7286J17399E1963d0407C22168h5697B3187a27843B03089J11097
12243C14186j00228a79939B6060K69007c65150C62366j31966k4030J39367A8792
12232A6440g1643A49178M7112E7558h569m8745D32085F93a64354B0727L7472K52411
12220C10610A32650N6476i3460E50403k48905A19697J53480g457G7293L9681J92517
12209C09491j7868d1013E8259q487R2518f2753D80687j19191Q1592j26631j31432
$$ plain form
12287 -181734 -124870 9209 -299129 162950 414598 -18490 215918 86739 211941 96281 186285
12276 186285 214820 162001 -31678 121106 246013 8977 94774 -52151 215916 4356 68245
12265 68245 241720 -105122 87278 -86216 -19687 305413 110341 220207 -46393 163982
12254 157057 52008 139294 256693 51963 -40407 322168 -85697 23187 -127843 203089 314186
12243 314186 213958 -179939 26060 295067 -365150 362366 230400 206370 345737 18792
12232 16440 -71643 149178 196290 57558 -8569 -57314 432085 693 -164354 20727 58199 310610
12220 310610 132650 189126 -93460 550403 301498 119697 273177 -7457 77293 116974 309491
12209 309491 291623 -41013 58259 49772 142290 -62753 480687 361496 443088 316457 185025
12198A85025N6176A7891K89478J45855B08105c4679k9657A19965b8442D16397
12187D9859J8177e7319A57559J01481g342j2257A63636j6071F6305L80654B00188
12175D53525A45107F3656N3033J73170F8730J72739J4306b0329A40486K26233
12165C66719j74387K9023J09065a47596d8174I5275J6472J2275J36328a98463
12154C27559F6120i546j73696A75815B5576N12737a7294j6818A40494a36689B22216
12142I8071L20290A59399J4452n3663P3845F4252F596J78370b59918B6492M57310
12131D83802B4497B465J89064q5153J67159b32087B12584g9342A01320b319I3039
12119a28976D06050a71664a0735l7071q0732B58091b17674A74714b60956p32e7862
$$ plain form
12198 185025 241201 17891 307369 453224 208105 -34679 -64336 119965 -28442 416397
12187 49859 68036 -57319 157559 259040 -7342 -19599 163636 147565 66305 446959 200188
12175 453525 145107 63656 116689 289859 68730 241469 255775 -20329 140486 366719
12165 366719 192332 221355 330420 -147596 -48174 95275 111747 124022 260350 -198463
12154 327559 66120 -9546 -183242 175815 25576 538313 -17294 -34112 140494 -136689 222216
12142 98071 418361 159399 173851 120188 194033 64252 6596 184966 -259918 26492 483802
12131 483802 24497 2465 191529 106376 273535 -232087 212584 -79342 101320 -2319 93039
12119 -128976 406050 -171664 -10735 -47806 -128538 258091 -217674 174714 -260956 -261688 -57862
12107D6560A8956M0331L13219g0818J9273n5031B90438a82565c2829q2352o0533
12096a75714f728k63924A06882a41189b9063j5122q29D92782G7968O50L6756L7792
12084A53166g8525b8216k25651a02538L1673A25556h1892j0298q5663D2950N8994
12073A01944J24033A04016J33817j04955P60593J125104I52884C13804A01315
12063A74361a93600G9653L0852a36682B48804C0062q495O8710J9453a44037A00584
12051b54255P8992a0515l16383a11877m8000o9334H5853O9985a24711q5851E6031
12039I1292a3514k64164B72547b0604j63833r5357D3442A9846a24888D4916L29134
12028C74050A58882d4300D1532M0358b83545g9029J7689A10046a25494k77059
$$ plain form
12107 46560 18956 59287 372506 -70818 -51545 -106576 290438 -182565 -32829 -115181 -175714
12096 -175714 -6728 -270652 106882 -141189 -29063 -44185 -45014 492782 77968 78618 115374 153166
12084 153166 -78525 -28216 -253867 -102538 -70865 125556 -81892 -92190 -177853 42950 101944
12073 101944 225977 104016 237833 132878 893471 2018575 952884 313804 101315
12063 174361 -193600 79653 110505 -136682 248804 30062 21567 90277 109730 -144037 100584
12051 -254255 -175263 -10515 -326898 -111877 -159877 -229211 85853 155838 -124711 -210562 56031
12039 91292 -13514 -277678 272547 -20604 -184437 -279794 43442 19846 -124888 44916 374050
12028 374050 158882 -44300 41532 81890 -283545 -79029 -61340 110046 -125494 -402553
12018d02553J51235K9789H6994f2442E2561b23874B02724e628j544m6483l9862
12007i3517B47854d8621p6787L5902k6135a938k22022M1296b0477C7784g5609
11995a65890B96109A27712k8377b16726A96035F1384a56293d8389n6303E0770
11984d9405O434A40814b79161e4914B2239R2834E6631A6656i1825k93444A34839
11972B62842a5525j95968F3952K57799b01868N8117C87292j68678d7909a3294
11961G1282A0581i9407L9717g221r4056n1914j3209e5537G7283a93483B8945J02586
11949A31531d07625C01165Q5604b03080B55460a57928B94407D0166a52623B4604
11938d2027E0573J4827a16732b0715A10157j6545c7955E2206R0528R989a4231
$$ plain form
12018 -402553 -251318 -221529 86994 -62442 52561 -223874 202724 -5628 -7172 -53655 -93517
12007 -93517 247854 -48621 -125408 -89506 -115641 -1938 -223960 -182664 -20477 37784 -75609
11995 -165890 296109 127712 99335 -216726 196035 61384 -156293 -48389 -104692 50770
11984 -49405 -42971 140814 -279161 -54914 22239 115073 56631 16656 -91825 -385269 134839
11972 262842 -15525 -211493 63952 321751 -201868 -143751 387292 218614 -47909 -13294
11961 71282 10581 -99407 -59690 -7221 -101277 -153191 -166400 -55537 77283 -193483 28945 131531
11949 131531 -407625 301165 386769 -203080 255460 -157928 294407 40166 -152623 24604
11938 -42027 50573 65400 -116732 -20715 110157 93612 -37955 52206 142734 152723 -14231
11926d4922C55098a87900b8800n7944l42338A04413C8192a36488B40344b22955
11915e922k4378D43713A694i3690A72071n9253a88101C16687b83546A48085m9502
11904I8583d89940a72288B1098K22015q5638a03856F6891a81171j6135k40251
11894d37557D1398b13370M4586d8767B75998a23217b2545I7974D4897J04613p3410
11883G6100C1498N6510c50981A92781R4260A4258e5873K7142p4215I8347K1565
11872A19912a26625G4016i2993j6496d4084n8845n33A02996R7377a35084j56533
11861b91617A84521d935B15141I4960D2683a68489J2419m7857A91996i3017J0493
11850h2524j56431j5842A28445a1497m4462F1230a3963F4686a0648j77162E6650
$$ plain form
11926 -44922 355098 -187900 -28800 -86744 -429082 104413 38192 -136488 240344 -222955
11915 -5922 -30300 443713 1694 -93690 172071 112818 -188101 316687 -283546 148085 98583
11904 98583 -489940 -172288 21098 243113 157475 -103856 66891 -181171 -197306 -437557
11894 -437557 41398 -213370 -168784 -48767 275998 -123217 -22545 97974 44897 149510 76100
11883 76100 31498 88008 -350981 192781 287041 14258 -55873 -28731 -102946 98347 119912
11872 119912 -126625 74016 -92993 -109489 -44084 -102929 -103462 102996 200373 -135084 -291617
11861 -291617 184521 -4935 215141 94960 42683 -168489 -156070 -203927 191996 -93017 -82524
11850 -82524 -238955 -254797 128445 -11497 -55959 61230 -13963 64686 -10648 -187810 56650
11838C26343E6497c5875k9309A53291a15400j25517D3896J28008d1919j44937
11828a86856h7063A11249b1359k49040A33032c00223J00175H7148J9693C9447
11817c17485C4562J30086D2480c28472J54950A2298a41484A97084b77697E6976
11806c6281D0190Q6570J08857L4675A2277j162J18536b47947e1368k61449I019
11794c1355k8229r0011c8253j55733A51578a29150L8804k5692j90870i4948A17491
11782G2551a27672J9101a2353j39575F14183e5561A26448g2223B3151f5628n931
11771g1559r7299N3439C4539a29947f1893G361M0891a4568j09914E2160b10863
11759h7393m7765B4873b13077c9181p8920b2142D17352d35484a05499a9682l0078
$$ plain form
11838 326343 56497 -35875 -65184 153291 -115400 -240917 43896 171904 -41919 -186856
11828 -186856 -87063 111249 -21359 -270399 133032 -300223 -200048 87148 106841 39447
11817 -317485 34562 164648 42480 -328472 -173522 12298 -141484 197084 -277697 56976
11806 -36281 40190 126760 235617 270292 12277 11115 129651 -247947 -51368 -312817 9019
11794 -31355 -59584 -149595 -38253 -193986 151578 -129150 -90346 -116038 -306908 -94948 117491
11782 72551 -127672 -108571 -12353 -151928 614183 -55561 126448 -72223 23151 -65628 -71559
11771 -71559 -168858 -115419 34539 -129947 -61893 7361 48252 -14568 -124482 52160 -210863
11759 -87393 -135158 24873 -213077 -39181 -118101 -22142 417352 -435484 -105499 -19682 -49760
11748d9760R491C2729e7302B01628b06541k0793A1923a9027r379j91757C47476
11736d3616j42388B8067L664J18826n7843m5205A9103J64466O3990a52791A6585
11724b12724C30711c4034F8418J76351b13240B95386D5400b11880A87486A7764
11713A05253e8690b891B36609o7564b25174g663j6133B42299q8888b64603N2410
11702b12193C88147c3086m27731B34212Q6071n2799A24219J59382A36664O9711
11692B06375a60350j05806e2218p8875b5151n2068A73784J44954a1237E64445
11681B59587a39887B74228r9077l523J44880E1479a53372H898K87218A0639K60463
11670B71102a71238g6727C21819B9251b22374B68792A995L64906c1138A64220
$$ plain form
11748 -49760 -40269 32729 -57302 201628 -206541 -227334 11923 -19027 -28406 -220163 347476
11736 -43616 -186004 28067 31731 150557 92714 47509 19103 183569 247559 -152791 16585
11724 -212724 330711 -34034 68418 244769 -213240 295386 45400 -211880 187486 17764
11713 105253 -58690 -2891 236609 169045 -225174 -7663 -23796 242299 153411 -264603 -212193
11702 -212193 388147 -33086 -460817 234212 320283 267484 124219 283601 136664 206375
11692 206375 -160350 -266156 -52218 -131093 -25151 -77219 173784 318738 -11237 564445
11681 259587 -139887 274228 175151 171628 316508 51479 -153372 8898 296116 10639 271102
11670 271102 -171238 -76727 321819 29251 -222374 268792 1995 366901 -31138 164220
11659a803B66999D2032e9191A13569f2002A43454h1786B35120l8049a0906J652
11648i254k51966a27819A74619G7478K9862O025a20263A47249k5449d39681H4328
11636B76218d5204q1948o2214A99275a03697A06108N8542L5811K8715p0289F6804
11624g1566d697m3117B09253o3469a65768D4938L6448a01013A55344b05303A64530
11612A38205J2095k5873D4457K1036a14204B33964h1781B0640N4819c02702B45427
11600C22818a79580c5056C693g9544A14279a93041b1552I8150a15421A75346n8624
11589A16722c8699B98276D1246K8050Q9140k575J6201b1125F473c2808j5190p9173
11577a27171G3306N0710n7761a47683N3640L9416B87274J65210a76736E6624K27760
$$ plain form
11659 -1803 266999 42032 -59191 113569 -62002 143454 -81786 235120 197071 -10906 -9254
11648 -9254 -261220 -127819 174619 77478 107340 113365 -120263 147249 121800 -439681 84328
11636 276218 -45204 -127152 -189366 199275 -103697 106108 164650 200461 229176 158887 66804
11624 -71566 -4697 -47814 209253 145784 -165768 44938 81386 -101013 155344 -205303 164530
11612 138205 150300 124427 44457 65493 -114204 233964 -81781 20640 75459 -302702 245427
11600 322818 -179580 -35056 3693 -79544 114279 -193041 -21552 98150 -115421 175346 116722
11589 116722 -38699 298276 41246 69296 158436 155861 172062 -21125 6473 -32808 -47998 -127171
11577 -127171 73306 124016 66255 -147683 -94043 -54627 287274 452484 -176736 56624 284384
11566B84384g072C73956i7487B41423p942n897F150O5131g7031B03178K02592
11555D05770C5530A2306i8887D28399g5964B42416d5272m4742B71626P4575d5314
11543A65815D2884J16006L53829B49583A08763J8782f0081k2145b9256B11496
11532a05058C8464R3865L0857C2225h2069k61524b6720C0270J05574K35847A36882
11520A31927O8633a11361B45089c7513l8297q2133d9661A19882a15907B47013
11509A30091g9043b1793B44003C9848L2578O9959k6407J34693G1268K97809a81399
11497B04564B5553a5262A88166J4308p7751R3147b8461A55894d907B16938m0286
11486A76652P5494g5859B03952q0862C1370e698I0548j6759J90172G2562K05009
$$ plain form
11566 284384 -7072 373956 -97487 241423 233481 227584 6150 71281 -77031 203178 405770
11555 405770 35530 12306 -98887 428399 -75964 242416 -45272 -90014 271626 346201 -45314
11543 165815 42884 158890 512719 249583 108763 127545 -60081 -82226 -29256 211496
11532 -105058 38464 132329 163186 32225 -82069 -343593 -26720 30270 135844 371691 136882
11520 131927 200560 -111361 245089 -37513 -75810 -157943 -49661 119882 -115907 247013
11509 130091 -79043 -21793 244003 39848 72426 142385 115978 250671 71268 369077 -181399
11497 204564 25553 -15262 188166 202474 124723 217870 -28461 155894 -4907 216938 176652
11486 176652 252146 -75859 203952 123090 31370 -5698 90548 73789 263961 72562 277571
11475B77571A29838j6030a17815I8954m5734j0151c64185G3005g5337B26545N3126
11464B79671j17464O3831L7359F9458K05120a52420C3059k145N2923o9L1816K56848
11452C72432G4419b01897C28205a88325C19535J60954G2266e3170D6880L35716
11442C82596b5177A13230a9345B18102C3915J11398M5384c73893D03349a59916
11431f3517A40036K76578C3693Q7867e0969A05391K45579a9481C52482j74903
11421A77579D725i3045K9062B1941M399b8977g070j1512F2238L1590e2937A96913
11408C0438i4748B4580M3737K5760K87977a14825I4815m6875d6978o1239B12200
11396E8545a62268E0350h3954A24814e0339n4906c3635r6176F2229f6311F7856
$$ plain form
11475 277571 129838 113808 -117815 98954 53220 43069 -364185 73005 -75337 226545 279671
11464 279671 162207 226038 263397 69458 274578 -152420 33059 30914 83837 83768 115584 372432
11452 372432 74419 -201897 328205 -188325 319535 480489 72266 -53170 46880 382596
11442 382596 -25177 113230 -19345 218102 33915 145313 190697 -373893 403349 -159916
11431 -63517 140036 416614 33693 121560 -50969 105391 350970 -19481 352482 177579
11421 177579 4725 -93045 -63983 21941 26340 -28977 -7070 -18582 62238 93828 -52937 196913
11408 30438 -94748 24580 68317 94077 382054 -114825 94815 47940 -46978 -108217 212200
11396 58545 -162268 50350 -83954 124814 -50339 -105245 -33635 -129811 62229 -66311 67856
11384h2809A77828n5301l8850C1571b20200A336b15321N0248B59758a12929K6701
11373h6228A66080e5259D04379j88613E2674a80105E2158b42469a7893F2125k7266
11362C4859h8146D15605E5999R0583a25697P643e4005j35508a935k49036e3557
11350A0810a5654B85195h9123j30480o4972a2842B81372A05418H805K04058e770
11338B76303B9121P3417A466i2700J9808o52m2986A37560C2983a11656D8576a75392
11325i076k41054I1204a35576A35955a86624A90262g7906L0498o619H9415l7585
11314E1830n402R9142L8182a40658A96579a06462j21283m033B16962F0362J32450
11303A92812k4948H1971a55012J7401I6002d12798J81249H3210j7275a40213j6332
$$ plain form
11384 -82809 177828 122527 83677 31571 -220200 1336 -215321 -165073 259758 -112929 -86228
11373 -86228 166080 -55259 404379 215766 52674 -180105 52158 -242469 -17893 62125 34859
11362 34859 -88146 415605 55999 146582 -125697 -118054 -54005 -189513 -1935 -250971 -53557
11350 10810 -15654 285195 -89123 -219603 -284575 -12842 281372 105418 8805 212863 -5770
11338 276303 29121 102538 1466 -92700 -72892 -73544 -116530 137560 32983 -111656 48576 -175392
11325 -9076 -250130 91204 -135576 135955 -186624 190262 -77906 -47408 -54027 89415 51830
11314 51830 46428 145570 183752 -140658 196579 -106462 -227745 -231778 216962 60362 192812
11303 192812 167864 81971 -155012 -137611 96002 -412798 -231549 83210 65935 -140213 -156545
11292a56545C13588b20545i6371j9c2316j40933A00737l2889Q4120a93405A62144
11280d0272E2908c2640A4470a92910F6241J76250C3898c18939j8982a9770F6697
11268B73256a59738O5544L7961Q578a3598p9089E4012a56794N8141j19133B26470
11256a90198C7198a72548a331k06316m8890L3442f7345A16317f9239A51570a41480
11244A35561c6775j14157j03224L7254e4014D31630B1627a1481n1776C77369C2737
11232b91074F9153b61370d7267j0029j76814B47315b6304k88511A88565f7772
11221f1535k02869J17620K7235A62036a99763j01520G1421a49630A58608a00841
11210E297g0716j23438j64017A99701q5173a57472J2692j22075n9446a06493l4547
$$ plain form
11292 -156545 313588 -220545 -96371 -96390 -32316 -173249 100737 67848 151968 -193405 162144
11280 -40272 52908 -32640 14470 -192910 66241 242491 33898 -318939 -337921 -19770 66697
11268 273256 -159738 -94194 -56233 -47655 -13598 -92687 54012 -156794 -98653 -217786 226470
11256 -190198 37198 -172548 -1331 -207647 -256537 -223095 -67345 116317 -69239 151570 -141480
11244 135561 -36775 -150932 -254156 -216902 -54014 431630 21627 -11481 -63257 377369 32737
11232 -291074 69153 -261370 -47267 -57296 -234110 247315 -26304 -314815 188565 -67772
11221 -61535 -264404 -146784 -119549 162036 -199763 -301283 71421 -149630 158608 -100841
11210 5297 -70716 -194154 -358171 199701 114528 -157472 -144780 -266855 -326301 -106493 -141040
11199a41040A82750I1301i7335B042e1029l3384A65529a47952C5165h4632j05044
11188a89676B81766G3216a84509l10954C9481a67878h1526o3005j41296A31151
11177c60585B9187P3238a36597J83d0488B45568j19475a03665J3981J7819h763
11165c28225g9767A0038d86608D4338K17381l8735b37461G4020K80131A5369L4213
11154D9582f4980A1927J98394J8110J95406B6443Q78c71311L1889D3014K12606
11143B55620D5626b26059E70880I6033c09172A20449b46753A5944J96708b34840
11132a10889A34207g6992a354A4516c0318B13613J4868c4450n5849L5861Q098
11121d6340I3238f558A45386a74823b117o288C20372N3960a19925C61781j32843
$$ plain form
11199 -141040 182750 91301 -97335 2042 -51029 -84413 165529 -147952 35165 -84632 -189676
11188 -189676 281766 73216 -184509 -495463 39481 -167878 -81526 -144531 -285827 131151
11177 -360585 29187 102425 -136597 -136414 -40488 245568 126093 -103665 -89684 -71865 -8763
11165 -328225 -79767 10038 -486608 44338 261719 222984 -237461 74020 354151 15369 49582
11154 49582 -64980 11927 210321 228431 423837 26443 27321 -371311 -339422 43014 255620
11143 255620 45626 -226059 570880 96033 -309172 120449 -246753 15944 212652 -234840
11132 -110889 134207 -76992 -1354 14516 -30318 213613 228481 -34450 -90299 -54438 -46340
11121 -46340 93238 -6558 145386 -174823 -2117 -8405 320372 374332 -119925 361781 228938
11110B28938a15020A33986d8080B62539A18189j8210a6995B82283j35160D5661
11099A45554f0874D60469j00470j04304j5914f4809A87234Q4396B2709K70014
11089B92723C9227K44708M5416A13986J14945A02785J70560O6865j24985H4552
11078A07206J00239M8967k6853a67467A93944J16683J75235B07191K77907j38933
11068C46165J63225j83009J10413j65225M20985B11662P96929k22469l12024M40860
11058I14958C05069L10539r8207K49603j18973J33465j44712m4643J84793j2967
11048G63967j38846L56308l90687J07989k95284K76846P0847L8064k86709J89383
11038F91878L20383D80492K063M36359l55703J87094j6193J95523q8444l53771
$$ plain form
11110 228938 -115020 133986 -48080 262539 118189 99979 -16995 282283 147123 45661
11099 145554 -60874 460469 359999 255695 239781 -64809 187234 271630 22709 292723
11089 292723 39227 283935 329351 113986 228931 102785 273345 340210 215225 84552
11078 107206 207445 256412 229559 -167467 193944 310627 485862 207191 485098 346165
11068 346165 509390 326381 436794 271569 692554 211662 1008591 786122 474098 914958
11058 914958 305069 615608 517401 767004 648031 781496 636784 592141 776934 763967
11048 763967 625121 981429 590742 698731 403447 680293 751140 789204 502495 691878
11038 691878 1012261 480492 482555 918914 563211 750305 734112 929635 841191 487420
11028D87420M98825l12065o8716M9645N7740j01815J66221K60293D32647P2673
11018E05320j22140K26291M07017l70198j56568j03564J83118k3501k60468Q0704
11008C66011N34695m16280J24853Q4621p4716A50042N07977j24345J72347l04801
10998D01220N69015k70575O1007j7514P0003Q8521J64291k54308j7936J61421
10988I55145n5582r5719N7558K33857j8710J05899J6988K00388k12014M09568
10978A597378p0740J98067R3116K47582M76131K68490L17323n18137J34301J55796
10968B899307k91306j71622k94496k35305l49391J60579q2981k17054J01839j95793
10958A323777O2698M75864m79752l19108K68753j67446m46609j99585J82168A77363
$$ plain form
11028 487420 986245 674180 605464 655109 712849 611034 777255 1037548 432647 505320
11018 505320 383180 609471 1016488 646290 489722 386158 569276 545775 285307 366011
11008 366011 900706 484426 609279 693900 619184 150042 658019 533674 706021 401220
10998 401220 970235 699660 760667 743153 813156 901677 1065968 811660 793724 955145
10988 955145 899563 803844 861402 1095259 1076549 1182448 1199436 1399824 1187810 1597378
10978 1597378 1526638 1724705 1817821 2065403 2541534 2810024 3127347 2609210 2743511 2899307
10968 2899307 2608001 2436379 2141883 1906578 1557187 1717766 1634785 1417731 1519570 1323777
10958 1323777 1386475 1862339 1382587 1063479 1332232 1164786 718177 518592 700760 177363
10947C9372M06297L5393B03325K11671j54492o4271F4330b29935A89597a32336
10936A03600J39405N1232G0350j4023a69660H7860b1080B49219G6332L93404b36362
10924A08393c72049A56697a54672A1810L68815D276b05074B29140q8842b47008
10913G6347e8487j49067a01852A35786L5706m9815a00135A37045C0985P7833a17402
10901A9156c00238A0989K59337a64145k23560F0391b27414D0832a81601Q6461
10891i5140j63390P9864g9655B02064b41216i7487A46950o0873J01127b4052B5392
10879b31616L4909J5931C18021a11045o4662e0943B12040L0563A17460R3432o1146
10868A49746J43761I8745P938a05519d9988A98726a11586k19296a29523A03969
$$ plain form
10947 39372 445669 481062 203325 414996 260504 196233 64330 -229935 189597 -132336
10936 103600 243005 294237 70350 56327 -169660 87860 -21080 249219 76332 469736 -236362
10924 108393 -372049 156697 -154672 11810 380625 4276 -205074 229140 140298 -247008
10913 76347 -58487 -207554 -101852 135786 171492 121677 -100135 137045 30985 108818 -117402
10901 19156 -300238 10989 270326 -164145 -387705 60391 -227414 40832 -181601 -95140
10891 -95140 -258530 -178666 -79655 202064 -241216 -97487 146950 86077 187204 -24052 25392
10879 -231616 -196707 -180776 318021 -111045 -175707 -50943 212040 242603 117460 210892 149746
10868 149746 293507 98745 106683 -105519 -49988 198726 -111586 -330882 -129523 103969
10857b4905l86034B1586J45780h7619k67457E5548R8356o0470c9591A05395a37815
10845b39491h8161I617g4440m463H1922J70533E1927J88015a04480j81038m4088
10834c29606A82328F7517K5336b2996P398n0661l21215I8498a49848j36809d8097
10822a20501A83172A5408b30022c016G2564Q4727a52773A09308n42g2861A08853
10810b64861a10089A18113l0507K066a73814A21828N9910a21140c5422o1328A84284
10798A45438k8623b64634A45398a41152k9266I7890K2041b5601l9545A7068K38436
10787B55504n6400e8451J9342j8891B25430a91374A10605a54668O5496M3227j52961
10776a98906A15864b15066A47780f0314K1743H8490O1826a71999e2739b0613B0359
$$ plain form
10857 -24905 -410939 21586 167366 -87619 -355076 55548 153904 93434 -39591 105395 -137815
10845 -239491 -88161 9617 -74440 -78903 81922 252455 51927 239942 -104480 -285518 -329606
10834 -329606 182328 67517 92853 -22996 -15598 -66259 -387474 98498 -149848 -286657 -48097
10822 -120501 183172 15408 -230022 -3016 72564 157291 -152773 109308 108766 -72861 108853
10810 -264861 -110089 118113 87606 89672 -173814 121828 181738 -121140 -35422 -96750 184284
10798 145438 116815 -264634 145398 -141152 -170418 97890 119931 -25601 -65146 17068 255504
10787 255504 199104 -58451 -39109 -58000 225430 -191374 110605 -154668 -89172 -45945 -198906
10776 -198906 115864 -215066 147780 -60314 -38571 88490 150316 -171999 -52739 -20613 20359
10764h8485A37828a96060e1885H3476c19794k6055e1238o3943a7748j25579A90904
10752C39929A69253b39051A64896b70A23351g2357B56618D4376j5671R5669g1506
10740B38138C3735a76108f1680o7304c3454E6584k4144h4880H4422M6333b04369
10728b08864f5167A79245a35536r9925E5560i0673A24740a7631j01590k88017
10718d07238b02839F1295a02598e0539e205A70318K0650d1815j31445O2255M8221
10707f2784E9003L07904i6154j8695F0885N2849d105o462k6847l42627a20797
10695B81615B1782a86615i2164J8282k28277B52904j16675a65521D05162a06777
10684A5711P0329c5911J102j34613p9908A96190c44668e8915M789C3527a0753
$$ plain form
10764 -88485 137828 -196060 -51885 83476 -319794 -345849 -51238 -115181 -17748 -143327 190904
10752 339929 169253 -239051 164896 -270 123351 -72357 256618 44376 28705 124374 -71506
10740 238138 33735 -176108 -61680 -128984 -33454 56584 32440 -84880 84422 130755 -204369
10728 -208864 -65167 179245 -135536 -235461 55560 -90673 124740 -17631 -119221 -407238
10718 -407238 -202839 61295 -102598 -50539 -5205 170318 190968 -41815 -173260 -111005 -62784
10707 -62784 59003 366907 -96154 -114849 60885 113734 -4105 -10567 -37414 -380041 -120797
10695 281615 21782 -186615 -92164 -73882 -302159 252904 136229 -165521 405162 -106777
10684 15711 86040 -35911 -34809 -169422 -249330 196190 -344668 -58915 -54126 33527 -10753
10672C2764L46527D6320d42A76193a1252k94342i8336B1946K47818a66177a0256
10660b52761D62123b69171C8069Q415a84704a6209k40024B89573G3287d6968j17217
10649a64185K0063a9630A75442b88259a07912K7342a3604p7401j68838J15444
10639a44399M2632r6628P6475n3459G780a09622a2252n0818H4250O1513a26001
10627d0497H016O4344K72421c7681q3135D14179c67505a60277A01578a66252C23044
10615a33028j38636I5977e7775A58777a81663e3771j04342K0751E36468H0152
10604a36590e1906K5552n6473q3049A45375d59140A28834B2566e6268E97330A43782
10592c27716a09292G297d50981G8966B3244d2466j13471A0427g7447a08A00588
$$ plain form
10672 32764 379291 46320 -442 176193 -11252 -305594 -98336 21946 269764 -166177 -10256
10660 -252761 462123 -269171 38069 46484 -184704 -16209 -256233 289573 73287 -46968 -164185
10649 -164185 -144122 -19630 175442 -288259 -107912 -80570 -13604 -91005 -259843 -144399
10639 -144399 -101767 -198395 -121920 -175379 7780 -109622 -12252 -63070 84250 145763 -126001
10627 -40497 8016 72360 344781 -37681 -120816 414179 -367505 -160277 101578 -166252 323044
10615 -133028 -271664 95977 -57775 158777 -181663 -53771 -158113 -137362 536468 80152
10604 -136590 -51906 -26354 -82827 -165876 145375 -459140 128834 22566 -56268 597330 143782
10592 -327716 -109292 7297 -450981 78966 23244 -42466 -155937 10427 -77447 -108 100588
10580H8948a36827L5844G5122c13460C1956K1806d93805A30537J00262b74199
10569I7072C9269c66693c652j69769G3211J33997b14170B67047a4904A64529n3653
10558A10876c5025A86896b38228g457j03722F6344a55700A18652b3031A3935a52247
10546d4737k21175o5554Q3117A38657b87275J34710k94535b6744q0157M0323r5349
10535a61927j61360J55471f4609o6014b0662I3539J79797i9981o1548A89662G4352
10523H7b94755A3805b20891D1841c55603A05768h5506A01128k1384A4907J21550
10512A36457f9652k25323a5902A40261g2858A62467k620k3363O8317q3487b36587
10500a27913b6066n4178A57010d32385A14356h3918C6253b31606A79834b44260
$$ plain form
10580 88948 -136827 -100983 75122 -313460 31956 53762 -493805 130537 230799 -274199
10569 97072 39269 -366693 -3652 -173421 73211 207208 -214170 267047 -14904 164529 110876
10558 110876 -35025 186896 -238228 -7457 -111179 66344 -155700 118652 -23031 13935 -152247
10546 -44737 -265912 -331466 -248349 138657 -287275 -152565 -447100 -26744 -106901 -66578 -161927
10535 -161927 -323287 -167816 -64609 -130623 -20662 93539 273336 -99981 -161529 189662 74352
10523 87 -294755 13805 -220891 41841 -355603 105768 -85506 101128 79744 14907 136457
10512 136457 -69652 -294975 -15902 140261 -72858 162467 159847 136484 204801 121314 -236587
10500 -127913 -26066 -80244 157010 -432385 114356 -83918 36253 -231606 179834 -244260
10489a56212B40440h0227A46829N2102e3673J1782D9579M96430n6840C6391O4016
10478A00407A9919a01836C27639D9380M0886c30458A09012a9608A33968a71990
10467B4545f5387A2247L5521b38651f6736J3789A05029c9454l5862n1580n2719
10456a79615A02504l1617J81169O4093j07301l2505F536g125C9864c7628O332
10445c1296E736a58617A4038a16884E8482e5713q981I3649a62913a4614L466k60643
10433b71791f2903B82277I562g960D0792i6168G165d8035A68697k4638l5029a20624
10420B00872b16766A45364c0748o6934A9213J04285c6998A5786J04469a25883
10409A8951c22896A55912g2353a9693C12744E9640J966M5090f5824C3144c51106
$$ plain form
10489 -156212 240440 -80227 146829 198931 -53673 -41891 49579 546009 489169 36391 100407
10478 100407 19919 -101836 327639 49380 90266 -330458 109012 -19608 133968 -171990
10467 24545 -65387 12247 47768 -238651 -66736 -52947 105029 -39454 -75316 -126896 -179615
10456 -179615 102504 70887 252056 316149 208848 176343 6536 -7125 39864 -37628 -31296
10445 -31296 5736 -158617 14038 -116884 58482 -55713 -64694 93649 -162913 -14614 -11148 -271791
10433 -271791 -62903 282277 9562 -7960 40792 -96168 7165 -48035 168697 144059 109030 -120624
10420 200872 -216766 145364 -30748 -97682 19213 123498 -36998 15786 120255 -125883
10409 18951 -322896 155912 -72353 -19693 312744 59640 61606 106696 -65824 33144 -351106
10397c45346G1676J18793O9729J3463d0116C8561K76847q6586a76177A84859C7691
10385A78142J6310O7591D840M5275i7221A90812h950A50975J93949P2779R050
10374D26753A05555J1616M43522d5420B88422K58478j77784J69812M9627q0886
10364E07669O6852J3336p0476B50129J28751C6871d2582C42729A02173R5972L95736
10353E93881B86299J7834O9514L70541j83698k52919o2156o8750O12805k70247
10343E19223o1159B4950J41166J54304A0870c56537B85929q6184J85645M8009
10333D33399j32236H1161J46247c37179G5064a41259J5799a6690D064K38327J49672
10322C92063o1717K3266a37887C3664a50854A62588h323B5798M84931B00821h8038
$$ plain form
10397 -345346 71676 190469 260198 273661 -40116 38561 315408 228822 -176177 184859 37691
10385 178142 194452 262043 4840 50115 -97221 190812 -8950 150975 344924 417703 426753
10374 426753 105555 117171 560693 -45420 288422 546900 369116 538928 588555 507669
10364 507669 574521 587857 517381 250129 378880 36871 -42582 342729 102173 198145 593881
10353 593881 286299 304133 373647 744188 560490 307571 245415 176665 789470 519223
10343 519223 458064 24950 166116 320420 10870 -356537 285929 199745 385390 433399
10333 433399 301163 81161 227408 -337179 75064 -141259 -125460 -16690 4064 242391 392063
10322 392063 330346 353612 -137887 33664 -150854 162588 -8323 25798 510729 200821 -88038
10310A10128a49714A20942i1704D9587a8750j03378C76803j4327A33388J6678
10300A50066f4049A57701h8682k17064h7320k04474I367a11593C6310O6120b8077
10288d05275F8752j0479L0284A2495a68308F3592a57401B28407E6779a25563k18500
10277c44063g3703A61007c46332G0926d0708I9990R8777b55949h2094A87964B2029
10265d9746n2990A46787b8260D1743K66193M1048A40500k1625C5059J92721o2510
10254A65270J19877c34022G5237K4241l2318B6P7504b66286k4728l6102F6673
10242c55630f6372o7117K3037h997A53001b36765B60999O4873a40597o5965A04522
10230b78879B87971f3908j8244E1772K970c7661B35838a57008M2271A73048a7174
$$ plain form
10310 110128 -149714 120942 -91704 49587 -18750 -122128 376803 362476 133388 150066
10300 150066 -64049 157701 -88682 -305746 -87320 -291794 9367 -111593 36310 102430 -28077
10288 -405275 68752 58273 88557 12495 -168308 63592 -157401 228407 56779 -125563 -344063
10277 -344063 -73703 161007 -346332 70926 -40708 99990 198767 -255949 -82094 187964 22029
10265 -49746 -102736 146787 -28260 41743 307936 348984 140500 118875 35059 227780 165270
10254 165270 285147 -334022 75237 99478 67160 26 77530 -266286 -291014 -327116 66673
10242 -355630 -66372 -133489 -110452 -8997 153001 -236765 260999 325872 -140597 -206562 104522
10230 -278879 287971 -63908 -82152 51772 54742 -37661 235838 -157008 -114737 173048 -17174
10218c8817A9549c6606G3419B8895d0978k21088Q8633I3333a52385j16576C8032
10206a66688A90221D2241A6264J13032D3912a04505A79010d3191G7347B394a69943
10194b1536j99633d2566k82730a16602k04219k37953B07616c17361g4209B19702
10183F9925n904a53408m1311C0367f0959A71383l481c39050J07611o0538R3059
10172a98918k08205F1569a35698e7304r1178e2211A26066e6074k91395n647A58781
10160e9623B7179c9891A0277K2228e5813j07122m1944j59198P2368F0916a81177
10148a28392A64170b05066i6683m7520j52661a7415j74909g904j9292n3846j18187
10137a99229E8456g5259G2345c6155l4274n2155j04848A89499d6815p7714N164
$$ plain form
10218 -38817 19549 -36606 73419 28895 -40978 -262066 -173433 93333 -152385 -268961 38032
10206 -166688 190221 42241 16264 129296 43912 -104505 179010 -43191 77347 2394 -169943
10194 -21536 -221169 -42566 -325296 -116602 -320821 -558774 207616 -317361 -74209 219702
10183 69925 64021 -153408 -194719 30367 -60959 171383 167902 -339050 -231439 -291977 -198918
10172 -198918 -407123 61569 -135698 -57304 -148482 -52211 126066 -56074 -347469 -353116 158781
10160 -59623 27179 -39891 10277 32505 -55813 -162935 -204879 -364077 -291709 60916 -181177
10148 -128392 164170 -205066 -96683 -144203 -296864 -17415 -192324 -7904 -27196 -81042 -199229
10137 -199229 58456 -75259 72345 -36155 -70429 -122584 -227432 189499 -46815 -124529 -119365
10126a19365B46003a55331A55769a31386j5876e1523k47164m3979a29782p1251
10116b01033N005I4326b19238R1652J0468b7684F9326a17517d8448j19545D3384
10104H908a74598D1448K25164d277k24175C04630a78993d1308D1802R26b2773
10092c88744j2331I4882C7961b50433g1406D68128i0328M4538D6230d62082f2881
10080c3620j46574F9227k6060J36651f2147B79206B3218a82568J0216P531C1460
10068A14653c563A06958c00813A38063J22931g0559m6550H22e0739k16201B09128
10056D6502J76219A1220J22210J07733l8879J5455n9207b16425g1513n2271A82448
10044D8020a50983A8618K20047c04798J47738G7889G478b58286J09348G971J53640
$$ plain form
10126 -119365 246003 -155331 155769 -131386 -147262 -51523 -298687 -342666 -129782 -201033
10116 -201033 -196028 94326 -219238 -127586 -117118 -27684 69326 -117517 -48448 -167993 43384
10104 8908 -174598 41448 266612 -4277 -228452 304630 -178993 -41308 41802 42728 -22773
10092 -388744 -401075 94882 37961 -250433 -71406 468128 -90328 -45790 46230 -462082 -62881
10080 -33620 -180194 69227 43167 179818 -62147 279206 23218 -182568 -172352 -164821 31460
10068 114653 -3563 106958 -300813 138063 260994 -70559 -117109 822 -50739 -266940 209128
10056 46502 222721 11220 133430 241163 202284 217739 158532 -216425 -71513 -123784 182448
10044 48020 -150983 18618 238665 -304798 -157060 77889 7478 -258286 -148938 7971 161611
10033A61611E3603g6028l10644A98954d73869A11663K0740D9468A0280Q6658H12
10021f1681j65143D75282H2480p469b3420A20933k041b1714j66666L7620l5354
10010a86114P2557B86279a13949m9844H7957N6132c88474f8644j60456A77504
9999a61367C2677a84311A12741a73599C21813a33474p1238j1765l2590j17616
9989c66683C21263q5467C2185a50148A42472P8874a24590c8134I0064d5389j13256
9978a58645b1704k40792f3533p5650C13441j36358g438j10460L7546B14799J6626
9967B31425A04944b91546l9826C4513a65636f1395B44542p8697f9797A32631A2133
9955a61253O7251B93117b15627F0516b50341b5665A92046b22391o5715a10988
$$ plain form
10033 161611 53603 -76028 -386672 198954 -473869 111663 132403 49468 10280 96938 812
10021 -61681 -226824 475282 82480 75011 -23420 120933 118892 -21714 -188380 -150760 -186114
10010 -186114 -113557 286279 -113949 -163793 87957 144089 -388474 -68644 -229100 177504
9999 -161367 32677 -184311 112741 -173599 321813 -133474 -204712 -216477 -249067 -366683
9989 -366683 321263 235796 32185 -150148 142472 221346 -124590 -38134 90064 -45389 -158645
9978 -158645 -21704 -262496 -63533 -139183 313441 177083 -7438 -117898 -80352 214799 231425
9967 231425 104944 -291546 -331372 34513 -165636 -61395 244542 165845 -69797 132631 12133
9955 -161253 -94002 293117 -215627 60516 -250341 -25665 192046 -222391 -288106 -110988
9944a93300N4982c6889j41169n1627F1279a25524J4235r0646A16590c4937r2011
9933a26948j55225h9451k02316a22828C1237d4516G0502R9438o8638a00729J9397
9922h1332l0641d5142q5896e630A50487a144A25968R8006a63724d1983J0337p9373
9910a11019b5561k53061g1198j50240i8812B7404b98647L9736E8405J98972k6445
9899B30932a38511e0955k78756K6412D2373a56912c4939A49232b0560B29254H1681
9887B72857b66504A45782a11859j19484a12533c6874A36150a19460j56706o9169
9877c45335G912a35090A18527a5790j63149H6895e5123A83679a70485b4999l7207
9866f2206a8754p9321A69297c17016d8828E4773Q6546o0238J03496q6662c58436
$$ plain form
9944 -193300 -138318 -36889 -178058 -229685 61279 -125524 -111289 -201935 116590 -34937 -126948
9933 -126948 -282173 -89451 -291767 -122828 31237 -44516 70502 169940 101302 -100729 -81332
9922 -81332 -111973 -45142 -131038 -5630 150487 -1144 125968 223974 -163724 -41983 -31646 -111019
9910 -111019 -25561 -278622 -71198 -221438 -98812 27404 -298647 -258911 58405 257377 230932
9899 230932 -138511 -50955 -329711 -303299 42373 -156912 -34939 149232 -20560 229254 81681
9887 272857 -266504 145782 -111859 -231343 -112533 -36874 136150 -119460 -276166 -345335
9877 -345335 7912 -135090 118527 -15790 -178939 86895 -55123 183679 -170485 -24999 -62206
9866 -62206 -18754 -98075 169297 -317016 -48828 54773 141319 81081 184577 97915 -358436
9854A68278a21238J5877G7120h6617j41074a1807j5398i107j07345p8978A49369
9842c02372J11769A37475c49789J64727m3891J0570G4795f6370r3102B56160j03611
9831A52549B2292r092c3442p11075c5158k300b279j52355d6240j45062M6239b729
9818d1696a8484j93847K5583A77698g3511B1960J19816L1606J31438g8092l31180
9807d09272M4871e4470H0843a20290B54378e6151B7054h4175p9240D0257b28926
9795a14738k127p4474o5194B76638c48236D7822a10450k0869j5496b2551n52229
9784e74780B67481a50669d199j33648A43837a63685j83762O0673I2270b44095
9773C6756P8637Q9160O663D8937J3222d29299D34867A19540b05328b8035H5364
$$ plain form
9854 168278 -121238 -105361 77120 -86617 -227691 -11807 -27205 -9107 -116452 -195430 149369
9842 -302372 -190603 137475 -349789 -185062 -228953 -218383 74795 -66370 -159472 256160 152549
9831 152549 22292 13200 -33442 -744517 -35158 -37458 -2279 -154634 -46240 -191302 -145063 -2729
9818 -41696 -18484 -212331 -186748 177698 -73511 21960 141776 173382 304820 -78092 -409272
9807 -409272 -364401 -54470 80843 -120290 254378 -56151 27054 -84175 -163415 40257 -228926
9795 -114738 -116865 -191339 -256533 276638 -348236 47822 -110450 -131319 -146815 -22551 -574780
9784 -574780 267481 -150669 -4199 -137847 143837 -163685 -347447 -286774 92270 -244095
9773 36756 115393 204553 211216 48937 62159 -429299 434867 119540 -205328 -28035 85364
9761H6515J8429J07841b6918A28035i9752B4776b14661M7542e9113B19895a90307
9749a50043A05970J90366b2647j81243e284A70810c2906A2324K07365c79661B14130
9737c62364q4113A43892K5847e3468l57220D2972a9168k35922A63404A8006J75414
9726A93420c7870n2728G1215d0020j78439A05912M5401B1060J59535A0537a55048
9714b22414j12835P0882F7063r090d417j4483l0097n5296d1329A74925o8113c0667
9701c50367D0068b07715R894B0564d3753I8705l8293a73233I3584a36428j44150
9690b80578J11296j3564A56758M6151b3817A76998c1234l0560p5544O6667A56590
9678c12691Q6076c2232B83141A00872a30397e0712r4755l44199K43440a15476
$$ plain form
9761 86515 104944 212785 -26918 128035 -99752 24776 -214661 -167119 -59113 219895 -190307
9749 -150043 105970 296336 -22647 -203890 -5284 170810 -32906 12324 219689 -379661 214130
9737 -362364 -446477 143892 169739 -53468 -410688 42972 -19168 -255090 163404 18006 193420
9726 193420 -37870 -90598 71215 -40020 -218459 105912 151313 21060 180595 10537 -155048
9714 -222414 -335249 -264367 67063 57973 -4417 -18900 -48997 -104293 -41329 174925 106812 -30667
9701 -350367 40068 -207715 -197821 20564 -43753 98705 60412 -173233 93584 -136428 -280578
9690 -280578 -169282 -182846 156758 202909 -23817 176998 -31234 -61794 -137338 -70671 156590
9678 -312691 -226615 -32232 283141 100872 -130397 -50712 -145467 -489666 -246226 -115476
9667I5465C5594a08433b5306k41916F9489a07972a0908H463J53763h9394c3518
9655A49616h2085F052J05691a13197k60059g4430e587l3716A7040J03355a16163
9643a11679A3812J39758C4432b52686g1678p3466a2106k02512P5824j83501A54858
9631C6057a84119j90313I4086h6336l1117j33180j04147c0105j34248d8780j74760
9620b23540e7248j28350B62548c13530E6997d62164a31821f0518G2520a28124
9609a13112B22342c87933a4978A07764m7135a31397j6674A83266p092a37776k52796
9598c90572p880D8185O0869c8966l2507I9138a2509k95381g5637j38205e6026
9586c12972J52019O1142B51983b00111d0662k92086f1726m2868D2238O58304a47222
$$ plain form
9667 95465 35594 -108433 -25306 -267222 69489 -107972 -10908 8463 162226 -89394 -33518
9655 149616 -82085 6052 111743 -113197 -373256 -74430 -5587 -39303 17040 120395 -116163
9643 -111679 13812 153570 34432 -252686 -71678 -145144 -12106 -214618 -138794 -322295 154858
9631 36057 -184119 -374432 94086 -86336 -117453 -250633 -354780 -30105 -164353 -48780 -223540
9620 -223540 -57248 -185598 262548 -313530 56997 -462164 -131821 -60518 72520 -128124
9609 -113112 222342 -387933 -14978 107764 60629 -131397 -148071 183266 176174 -137776 -390572
9598 -390572 -398452 48185 109054 -38966 -71473 99138 -12509 -307890 -75637 -213842 -56026
9586 -312972 -160953 -99811 251983 -200111 -40662 -332748 -61726 -104594 42238 700542 -147222
9574H9837O492D1607a95002c4194B15604b67727p6444h9385A57937G5455j4824
9563F0631N2284m8851b27589g1827j98367g3836k49411c4173r2255M0546j66986
9552b52868c063o2657A31589a3749k71013R0767A44566b5163j34407B923a82725
9540A93912a83043d4682F7593a58788o8602A45274J174b52844k40445a34410F6448
9528H6231a9202j35605g0068k52938A83234L3453e8243j43049A643a4087j665
9517a5752A52157d2256m05121B99101n4743A7376L7245a91942r1903C0514a70176
9505b33749h8133k7514A3400O6994i7002a8973A28791A6306M2707a32742j88297
9494c21039i3094o0987m4129f9313j4113j8589o4182j46851g1997A68857O0616
$$ plain form
9574 89837 96329 41607 -195002 -34194 215604 -267727 -344171 -89385 157937 75455 60631
9563 60631 112915 64064 -227589 -71827 -270194 -73836 -323247 -34173 -126428 -85882 -252868
9552 -252868 -3063 -65720 131589 -13749 -284762 -193995 144566 -25163 -159570 2923 -182725
9540 193912 -183043 -44682 67593 -158788 -227390 145274 146448 -252844 -493289 -134410 66448
9528 86231 -19202 -154807 -70068 -323006 183234 216687 -58243 -201292 1643 -14087 -15752
9517 -15752 152157 -42256 -447377 299101 244358 17376 54621 -191942 -283845 30514 -170176
9505 -233749 -88133 -115647 13400 80394 -97002 -18973 128791 16306 59013 -132742 -321039
9494 -321039 -93094 -154081 -198210 -69313 -83426 -102015 -166197 -313048 -71997 168857 229473
9483B29473b47515h7146D1163a26330m3524P4161A45713a30176n6728f3285m558
9472f7843j30533E0377a96033O3009k20334R1197N0052A21655b74658A03321c6612
9460F7846J61325c3462B92618b01622k93980d1936C59389J7505C3492J1787e9898
9448a43763O2677A37713i7825A26898a07399o2109A8307a86545j11681h2580m83233
9437e65813h0024j5573K7905p401n5376A04580J81148J8875a37021N4169k09932
9426b92784a06217j5365A11575h4571A61198K5890F6338f1188A67668J71573c2694
9414b89855k8767a55106C02318a04470C46564B9766m415a56999n8380N9604n6223
9403b11998g7841J2193A19795a61406A90372c65205H2337a12656J8917m07123
$$ plain form
9483 229473 -247515 -87146 41163 -126330 -169854 -95693 145713 -130176 -186904 -63285 -67843
9472 -67843 -198376 50377 -196033 -133024 -353358 -262161 -212109 121655 -274658 103321 -36612
9460 67846 229171 -33462 292618 -201622 -495602 -41936 359389 376894 33492 45279 -59898
9448 -143763 -81086 137713 -97825 126898 -107399 -169508 18307 -186545 -298226 -82580 -565813
9437 -565813 -80024 -95597 -67692 -75093 -130469 104580 285728 304603 -137021 -82852 -292784
9426 -292784 -106217 -121582 111575 -84571 161198 187088 66338 -61188 167668 339241 -32694
9414 -289855 -318622 -155106 302318 -104470 346564 29766 25351 -156999 -215379 -155775 -211998
9403 -211998 -77841 -65648 119795 -161406 190372 -365205 82337 -112656 -93739 -500862
9393e00862a65242A10741a1179E9529a21801j1836B5043b06692B27595a69132
9382b25604B35685B3795K9167O1233G484J43741b21667g050j04685j3643e0532
9370b87700a24527b9937A91714J29150c72271M2985a16758j73300J28098A46428
9359A53039b22817A84556a87083O4229C56268c3321p4275D7755K4543c510k93589
9348b97099d2575l51347a71204e0443l96194Q6626i2332D8485j4494J05306a54652
9336h5454p5097I9870e9478A85670b40398D7737K70652c8686m9022L5322a2523
9324B27745a40280j86452J61861n4017b3359k947n1695B57346c58061A64178a37212
9312c92592f8j27018A16391b75092d6340K916C3501f2077A0459h9296A87239e7420
$$ plain form
9393 -500862 -165242 110741 -11179 59529 -121801 -133637 25043 -206692 227595 -169132
9382 -225604 235685 23795 52962 114195 7484 151225 -221667 -7050 -111735 -125378 -50532
9370 -287700 -124527 -29937 191714 320864 -372271 -329286 -116758 -290058 -161960 146428
9359 153039 -222817 184556 -187083 -122854 356268 -33321 -107596 47755 72298 -3510 -297099
9348 -297099 -42575 -393922 -171204 -50443 -446637 -360011 -92332 48485 33991 139297 -154652
9336 -85454 -160551 99870 -59478 185670 -240398 47737 318389 -38686 -87708 -52386 -12523
9324 227745 -140280 -326732 -164871 -218888 -23359 -26306 -78001 257346 -358061 164178 -137212
9312 -392592 -68 -127086 116391 -275092 -46340 -43424 33501 -62077 10459 -89296 187239 -57420
9299a65008k0152H8928K2804E2250c12940A72530B0667c48134G8498d2108j6159
9288e8267j51919B1514O1668K91666a2617j9411j36890D18459h9867F665J8861
9277B5526b5538o3795p5653I966h3347K1135A80826e7134A13284n6214a10625
9265D7127b03087B39410K9719i1031K695j0793A29798a62425j31411N2635g7802
9253g5742A69083b629j78319H8707a12442E214c43965o4680C254c22331J0167
9242c12164J42617A0644d28058c5983k2489l95304E1385c9635H8380a21450L2331
9231h9119A45263o4354P6510c2952L06j0182A3985b87978h7049c0959j6319A19335
9218c29038B71894d3041C7023P8778a1641A24550R1642a09881F8159K8433k598
$$ plain form
9299 -165008 -185160 88928 111732 52250 -312940 172530 20667 -348134 78498 -42108 -58267
9288 -58267 -210186 21514 83182 374848 -12617 -32028 -168918 418459 -89867 6665 25526
9277 25526 -25538 -89333 -164986 9966 -83347 -62212 180826 -57134 113284 57070 -110625
9265 47127 -203087 239410 269129 -91031 -88336 -99129 129798 -162425 -293836 -241201 -77802
9253 -75742 169083 -2629 -180948 88707 -112442 5214 -343965 -408645 3254 -322331 -312164
9242 -312164 -169547 10644 -428058 -35983 -58472 -453776 51385 -39635 88380 -121450 -89119
9231 -89119 145263 80909 157419 -32952 -32646 -42828 13985 -287978 -87049 -30959 -47278 119335
9218 -329038 271894 -43041 37023 115801 -11641 124550 216192 -109881 68159 96592 93994
9207I3994b83507K7963g5535k09069m3315a29896H0535e8927k71052I971d08926
9195a44418n8736B26844a41028k2154P2550c8275B90304b16571K7513C53481a28164
9183C1128a29787j1315j1607j7229A69111b79979A69817B0194i2976k14925f911
9171d5960A66827b52129e6705E174c65333G2413l1832b25794A00510Q3756b7068
9159A00023e6452a2535D8703a99229b3802B46090d4328j3762D29203g4799k22848
9148b97647A38076b30933B08710a78847B43163j5658e13556B06737b04412B4985
9137a74434g6413J0477K7721l11536A61948N54c21230J49744A18216a97611P1471
9126a26140j05329e4605l3976b6623B6981P1665C0421c78001b1038j00797d3501
$$ plain form
9207 93994 -283507 -255544 -75535 -284604 -327919 -129896 80535 -58927 -329979 9971 -408926
9195 -144418 -203154 226844 -141028 -163182 -90632 -38275 290304 -216571 -189058 353481 -128164
9183 31128 -129787 -141102 -152709 -169938 169111 -279979 169817 20194 -92976 -307901 -6911
9171 -45960 166827 -252129 -56705 5174 -365333 72413 40581 -225794 100510 184266 -27068
9159 100023 -56452 -12535 48703 -199229 -23802 246090 -44328 -58090 429203 -74799 -297647
9148 -297647 138076 -230933 208710 -178847 243163 227505 -513556 206737 -204412 24985
9137 -174434 -76413 -65936 -38215 -349751 161948 162502 -321230 -171486 118216 -197611 -126140
9126 -126140 -231469 -54605 -88581 -26623 26981 98646 30421 -378001 -21038 -121835 -43501
9114h1753a3074F1586a56488k7082A16888a72804J4133j65396J06960q5494k7078
9103c29679a0948l30244C66751A36670L17658a13122p7438b9529C6225K0796J08871
9092A65892c3403B52915l4071k7025a14840D7049k0323a17569N2316B75864i784
9080a07908D17305c51995a64436B1293J48111b090l28644K7143E93036H6925J04794
9069A91719k5053j5311b05681m1054K6515Q8109j54180R5225L8100j38735K0932
9058b70769r7625d0850k54612G4913j9096b49575R4707A7749c77920B04621b63800
9046d67097B17204C3352a59711R75j15603a31018i246A74671d45663a56575A0677
9034b0853k09840J05313G4654L0026c63523B43066b81300C06383b7421D7960J6592
$$ plain form
9114 -81753 -13074 61586 -156488 -183570 116888 -172804 -158671 -324067 -217107 -302601 -329679
9103 -329679 -10948 -341192 366751 136670 454328 -113122 -190560 -29529 36225 57021 165892
9092 165892 -33403 252915 218844 191819 -114840 47049 26726 -117569 -65253 275864 -9784
9080 -107908 417305 -351995 -164436 21293 169404 -2090 -330734 -303591 593036 86925 191719
9069 191719 166666 151355 -205681 -246735 -220220 -132111 -286291 -191066 -152966 -291701 -270769
9058 -270769 -368394 -40850 -295462 74913 55817 -249575 -154868 17749 -377920 204621 -263800
9046 -467097 217204 33352 -159711 -158736 -274339 -131018 -9246 174671 -445663 -156575 10677
9034 -20853 -230693 -125380 74654 104680 -363523 243066 -281300 306383 -27421 47960 64552
9023F4552J06475a85373j90112I0483n815A7726e6166r4366c6047q1816D1921
9011b93721f9305A4994a70792k18549f2151q1990c7832E0108b27912q2879g7782
8999d17545J92036A635a93249A58903C8773j6851J44518a70166A5687J00824c31884
8987b49369J9055M7305j03331a1866N283F2657b07005A48099a30943l6708g1410
8975a79695C3556b9172n8874D0225i0082A59441j2771O9389a40392N7539k7943
8964a10796j6930d8742A3274c17646A7239c8852k5996j69927a13996D1295a77625
8952B00374p4356n0210a61471e7761j42136N8741G051K41686i443j09005C61285
8940H8124b62744q7340A37882b5671p4939A76616p8867J30277g7130D24673a35871
$$ plain form
9023 64552 171027 -185373 -375485 90483 84668 17726 -56166 -150532 -36047 -117863 41921
9011 -293721 -69305 14994 -170792 -389341 -62151 -144141 -37832 50108 -227912 -310791 -77782
8999 -417545 -225509 1635 -193249 158903 38773 21922 166440 -170166 15687 116511 -331884
8987 -249369 -230314 -183009 -286340 -11866 -6583 62657 -207005 148099 -130943 -167651 -71410
8975 -179695 33556 -29172 -88046 40225 -90082 159441 146670 216059 -140392 -82853 -110796
8964 -110796 -127726 -48742 13274 -317646 17239 -38852 -64848 -234775 -113996 41295 -177625
8952 200374 126018 75808 -161471 -57761 -199897 -141156 7051 248737 -9443 -118448 361285
8940 88124 -262744 -350084 137882 -25671 -100610 176616 97749 228026 -77130 424673 -135871
8928c3345C79054b95523C08021J39458O09303L406125N624056A978501E52346
8918A58588L4231P658q1268j7407J09808p5244a16645L7550I3892a51530P1954
8907g9576n2687a8721B3707L8441i9404c2441G4473A7395M2764k5632O7170c89792
8894A50302a07884G9334a76188C14515r7224c0185k25516A35394a9598j55069
8884a74667A667K4407a55804A47783j6344c08240A13038b78997A46487q568n2960
$$ plain form
8928 -33345 379054 -295523 308021 447479 1056782 4462907 10086963 1978501 552346
8918 158588 192819 200477 119209 101802 211610 136366 -116645 -79095 93892 -151530 -79576
8907 -79576 -132263 -18721 23707 62148 -99404 -32441 74473 17395 60159 34527 101697 -389792
8894 150302 -107884 79334 -176188 314515 217291 -30185 -255701 135394 -19598 -174667
8884 -174667 1667 26074 -155804 147783 131439 -308240 113038 -278997 146487 137919 84959
$$ [...]
##END NTUPLES=NMR SPECTRUM
##END=
