
##TITLE=AC1372_2418_7221647_llQExT8r8K
##JCAMPDX= 6.0         $$ Bruker NMR JCAMP-DX V2.0
##DATA TYPE= NMR SPECTRUM
##DATA CLASS= NTUPLES
##ORIGIN= BRUKER
##OWNER= Administrator
$$ 1.72 TOPSPIN		Version 2.1
$$ 2012-12-14 01:58:53.542 -0500  Administrator@X
$$ Compression mode = diff/dup
##.OBSERVE FREQUENCY= 400.02188249412
##.OBSERVE NUCLEUS= ^1H
##.ACQUISITION MODE= SIMULTANEOUS (DQD)
##.ACQUISITION SCHEME= undefined
##.AVERAGES= 8
##.DIGITISER RES= 22
##SPECTROMETER/DATA SYSTEM= spect
##.PULSE SEQUENCE= zg30
##.SOLVENT NAME= COFFEE_meoh
##.SHIFT REFERENCE= INTERNAL, COFFEE_meoh, 1, 14.98509
##AUDIT TRAIL= $$ (NUMBER, WHEN, WHO, WHERE, PROCESS, VERSION, WHAT)
$$ ##TITLE= Audit trail, TOPSPIN		Version 2.1
$$ ##JCAMPDX= 5.01
$$ ##ORIGIN= Bruker BioSpin GmbH
$$ ##OWNER= Administrator
$$ $$ E:\/data/COFFEE/nmr/AC1372_2418_7221647_llQExT8r8K/20/pdata/1/auditp.txt
$$ ##AUDIT TRAIL=  $$ (NUMBER, WHEN, WHO, WHERE, PROCESS, VERSION, WHAT)
(   1,<2012-12-14 01:58:44.742 -0500>,<Administrator>,<X>,<go>,<TOPSPIN 2.1>,
      <created by zg
	started at 2012-12-14 01:57:38.601 -0500,
	POWCHK enabled, PULCHK disabled,
       configuration hash MD5:
       86 BA 57 50 F2 9D 5C 9B 26 00 A9 28 5F 66 2E 89
       data hash MD5: 64K
       39 0C 06 38 04 10 3C 27 F3 68 0D EA 14 2D 6A 3F>)
(   2,<2012-12-14 01:58:48.336 -0500>,<Administrator>,<X>,<proc1d>,<TOPSPIN 2.1>,
      <Start of raw data processing
       efp LB = 0 FT_mod = 6 PKNL = 1 PHC0 = 0 PHC1 = 0 SI = 32K 
       data hash MD5: 32K
       41 BE F5 40 10 75 A6 BC AD B7 8C 70 F9 30 B1 44>)
(   3,<2012-12-14 01:58:48.789 -0500>,<Administrator>,<X>,<proc1d>,<TOPSPIN 2.1>,
      <pk PHC0 = 99.11316 PHC1 = 0 
       data hash MD5: 32K
       1C 90 F9 EB C0 F0 F6 1F 3D 06 8D 87 6A C9 0E 0F>)
(   4,<2012-12-14 01:58:49.023 -0500>,<Administrator>,<X>,<proc1d>,<TOPSPIN 2.1>,
      <abs ABSG = 1 
       data hash MD5: 32K
       78 1B 8E 78 85 7C E8 9F A7 07 55 1F 1E 3B 26 85>)
(   5,<2012-12-14 01:58:49.179 -0500>,<Administrator>,<X>,<proc1d>,<TOPSPIN 2.1>,
      <abs ABSG = 2 
       data hash MD5: 32K
       A0 64 6A 9F 90 E6 60 E0 BA 3D BE 7D 91 75 DF 73>)
(   6,<2012-12-14 01:58:49.320 -0500>,<Administrator>,<X>,<proc1d>,<TOPSPIN 2.1>,
      <abs ABSG = 3 
       data hash MD5: 32K
       45 FA E7 11 B5 00 93 52 3B CE 15 B5 BA A9 9A C4>)
(   7,<2012-12-14 01:58:49.476 -0500>,<Administrator>,<X>,<proc1d>,<TOPSPIN 2.1>,
      <abs ABSG = 4 
       data hash MD5: 32K
       D8 77 71 40 A6 DC B6 89 54 A7 9F CC C6 1A E3 B4>)
(   8,<2012-12-14 01:58:49.617 -0500>,<Administrator>,<X>,<proc1d>,<TOPSPIN 2.1>,
      <abs ABSG = 5 
       data hash MD5: 32K
       E9 B6 7D 79 71 D9 84 CB 3D E3 0E F5 E7 E7 DA E4>)
$$ ##END=
$$ 
$$ $$ hash MD5
$$ $$ B6 3C 8D BF CA C2 C6 BF 80 F3 58 03 2C C8 BD 89
##$RELAX= 
##$RELAX= 
##$RELAX= 
##$RELAX= 
##$RELAX= 
##$RELAX= 
##$RELAX= 
##$RELAX= 
$$ Bruker specific parameters
$$ --------------------------
##$DU= <E:\>
##$EXPNO= 20
##$NAME= <AC1372_2418_7221647_llQExT8r8K>
$$ [...]
##$TP= (0..7)
150 150 150 150 150 150 150 150
##$TP07= 0
##$TPNAME0= <>
##$TPNAME1= <>
##$TPNAME2= <>
##$TPNAME3= <>
##$TPNAME4= <>
##$TPNAME5= <>
##$TPNAME6= <>
##$TPNAME7= <>
##$TPOAL= (0..7)
0.5 0.5 0.5 0.5 0.5 0.5 0.5 0.5
##$TPOFFS= (0..7)
0 0 0 0 0 0 0 0
##$TUNHIN= 0
##$TUNHOUT= 0
##$TUNXOUT= 0
##$USERA1= <user>
##$USERA2= <user>
##$USERA3= <user>
##$USERA4= <user>
##$USERA5= <user>
##$V9= 5
##$VALIST= <valist>
##$VCLIST= <CCCCCCCCCCCCCCC>
##$VD= 0
##$VDLIST= <DDDDDDDDDDDDDDD>
##$VPLIST= <PPPPPPPPPPPPPPP>
##$VTLIST= <TTTTTTTTTTTTTTT>
##$WBST= 1024
##$WBSW= 4
##$XGAIN= (0..3)
0 0 0 0
##$XL= 0
##$YL= 0
##$YMAX_a= 676002
##$YMIN_a= -575321
##$ZGOPTNS= <>
##$ZL1= 120
##$ZL2= 120
##$ZL3= 120
##$ZL4= 120
##$ABSF1= 14.98509
##$ABSF2= -5.573092
##$ABSG= 5
##$ABSL= 3
##$ALPHA= 0
##$AQORDER= 0
##$ASSFAC= 0
##$ASSFACI= 0
##$ASSFACX= 0
##$ASSWID= 0
##$AUNMP= <proc_prof1d_extract_pilot.lims>
##$AXLEFT= 0
##$AXNAME= <>
##$AXNUC= <1H>
##$AXRIGHT= 0
##$AXTYPE= 0
##$AXUNIT= <>
##$AZFE= 0.1
##$AZFW= 0.1
##$BCFW= 0
##$BC_mod= 0
##$BYTORDP= 0
##$COROFFS= 0
##$CY= 15
##$DATMOD= 1
##$DC= 0
##$DFILT= <>
##$DTYPP= 0
##$F1P= 0
##$F2P= 0
##$FCOR= 0.5
##$FTSIZE= 32768
##$FT_mod= 6
##$GAMMA= 0
##$GB= 0
##$INTBC= 1
##$INTSCL= 1
##$ISEN= 128
##$LB= 0
##$LEV0= 0
##$LPBIN= 0
##$MAXI= 10000
##$MC2= 0
##$MEAN= 0
##$ME_mod= 0
##$MI= 0
##$NCOEF= 0
##$NC_proc= -8
##$NLEV= 6
##$NOISF1= 0
##$NOISF2= 0
##$NSP= 0
##$NTH_PI= 0
##$NZP= 0
##$OFFSET= 14.98509
##$PC= 1
##$PHC0= 99.11316
##$PHC1= 0
##$PH_mod= 1
##$PKNL= yes
##$PPARMOD= 0
##$PPDIAG= 0
##$PPIPTYP= 0
##$PPMPNUM= 2147483647
##$PPRESOL= 1
##$PSCAL= 4
##$PSIGN= 0
##$PYNMP= <proc.py>
##$REVERSE= no
##$SF= 400.02
##$SI= 32768
##$SIGF1= 0
##$SIGF2= 0
##$SINO= 400
##$SIOLD= 32768
##$SPECTYP= <>
##$SREGLST= <1H.CDCl3>
##$SSB= 0
##$STSI= 32768
##$STSR= 0
##$SW_p= 8223.68421052631
##$SYMM= 0
##$S_DEV= 0
##$TDeff= 65536
##$TDoff= 0
##$TI= <>
##$TILT= no
##$TM1= 0
##$TM2= 0
##$TOPLEV= 0
##$USERP1= <user>
##$USERP2= <user>
##$USERP3= <user>
##$USERP4= <user>
##$USERP5= <user>
##$WDW= 1
##$XDIM= 32768
##$YMAX_p= 472689195
##$YMIN_p= -685520
##$CURPLOT= <Network HP LaserJet P1505>
##$CURPRIN= <$Network HP LaserJet P1505>
##$DFORMAT= <normdp>
##$LAYOUT= <+/1D_H.xwp>
##$LFORMAT= <normlp>
##$PFORMAT= <normpl>
##$SURQMSG= 1
$$ End of Bruker specific parameters
$$ ---------------------------------
##NTUPLES= NMR SPECTRUM
##VAR_NAME=  FREQUENCY,     SPECTRUM/REAL,   SPECTRUM/IMAG
##SYMBOL=    X,             R,               I
##VAR_TYPE=  INDEPENDENT,   DEPENDENT,       DEPENDENT
##VAR_FORM=  AFFN,          ASDF,            ASDF
##VAR_DIM=   32768,         32768,           32768
##UNITS=     HZ,            ARBITRARY UNITS, ARBITRARY UNITS
##FACTOR=    0.250966925370066, 1,           1
##FIRST=     8223.43324360094, -32910,       12922
##LAST=      0,             173829,          -93745
##MIN=       0,             -685520,         0
##MAX=       8223.43324360094, 472689195,    0
$$ Real data points
##PAGE= N=1
##DATA TABLE= (X++(R..R)), XYDATA
$$ [...]
19524a32448B3785a71646K319A76846D5032a42767N9796l18029J05528A78836
$$ -132448 23785 -171646 -169327 176846 45032 -142767 -82971 -401000 -295472 178836
19513B1269L3631c17546E4450c19593I1303a44328j30268A09118b21562d4271
$$ 21269 54900 -317546 54450 -319593 91303 -144328 -274596 109118 -221562 -44271
19502a80966B2402f5034C15882A27853a54183j0209L4593k02506k9444H774a86205
$$ -180966 22402 -65034 315882 127853 -154183 -164392 -129799 -332305 -361749 8774 -186205
19490d35393c3785p849A55125b12771E9000j3838K9701b10459c3981G3273Q2519
$$ -435393 -33785 -41634 155125 -212771 59000 45162 74863 -210459 -33981 73273 155792
19479A55792a17952M9880m2746l65944a26971n0631A12281k9850f1025l6821I6087
$$ 155792 -117952 -68072 -110818 -476762 -126971 -177602 112281 82431 -61025 -97846 96087
19467a38254j8280A80230b20640A93688a84957j0568D4582g6732c6921m28658
$$ -138254 -156534 180230 -220640 193688 -184957 -195525 44582 -76732 -36921 -465579
19457d65579L6014b3961B5783K13076a26376B61700a08026A16907e013k68459
$$ -465579 -429565 -23961 25783 238859 -126376 261700 -108026 116907 -5013 -273472
19447b73472B36867r7631c98413e1296q1095r9981H6563C6148a3382k24961B49458
$$ -273472 236867 139236 -398413 -51296 -132391 -232372 86563 36148 -13382 -238343 249458
19435f5114j54309G1969k0953J37751h9269D0468b43542h5780l6347c1147q2141
$$ -65114 -219423 71969 51016 188767 -89269 40468 -243542 -85780 -122127 -31147 -113288
19424a13288o9323q8285D4351c72386B79978a23477B22245b92752A96845a44965
$$ -113288 -182611 -270896 44351 -372386 279978 -123477 222245 -292752 196845 -144965
19413b37308i7493M6343A55625m7827i7152j2127E1235c03683J35476C3973i0731
$$ -237308 -97493 -51150 155625 107798 -97152 -109279 51235 -303683 -168207 33973 -90731
19401i5517l5325j21396E9363B0711P0426J02279o2584d59282e7032H390e00011
$$ -95517 -130842 -252238 59363 20711 91137 193416 130832 -459282 -57032 8390 -500011
19389a7307B0657c02741A37884e0039B47977a10744k7495m8384d6627n4454D1410
$$ -17307 20657 -302741 137884 -50039 247977 -110744 -138239 -186623 -46627 -101081 41410
19377b63069P6038l40359A79334m2987n2194c32007N2313A73509J61233D9494
$$ -263069 -187031 -527390 179334 136347 84153 -332007 -279694 173509 334742 49494
19366c29492B72874H0474b28123C29136a03514A57214E6662f596k6096l8786r5918
$$ -329492 272874 80474 -228123 329136 -103514 157214 56662 -6596 -32692 -71478 -167396
19355a67396l1708B18751a68717n4607b5385k6996l6921C38216e3517n8398r8328
$$ -167396 -199104 218751 -168717 -223324 -25385 -52381 -89302 338216 -53517 -111915 -210243
19344b10243G6421J23976a12860m5653E6121c88505a69795e5190k87879R0525
$$ -210243 76421 200397 -112860 -158513 56121 -388505 -169795 -55190 -343069 -252544
19334b52544f84k09067f5957k2759j6655A46373F7549J24669j2263d71523I277
$$ -252544 -684 -209751 -65957 -88716 -105371 146373 67549 192218 179955 -471523 9277
19322b08003R2939r7042b8955k10425a8289C5586a62455A31760a68028r8317I4585
$$ -208003 -115064 -212106 -28955 -239380 -18289 35586 -162455 131760 -168028 -266345 94585
19310A80799c46874j3226J78353K0431e4960l362I8798a79928d2413j58034b0879
$$ 180799 -346874 -360100 -181747 -161316 -54960 -58322 98798 -179928 -42413 -200447 -20879
19298B2721c40690a58507j91985c9009j56602D1020a38864D3824e7291C00782
$$ 22721 -340690 -158507 -350492 -39009 -195611 41020 -138864 43824 -57291 300782
19287a52765E4210b40177l4441i0063j6757j32296a10977k37103P7345L8863A22231
$$ -152765 54210 -240177 -274618 -90063 -106820 -239116 -110977 -348080 -270735 -231872 122231
19275d9714j67645E13893G6182a59901k93126F896J87602b86237d2873E4853b26789
$$ -49714 -217359 513893 76182 -159901 -453027 6896 194498 -286237 -42873 54853 -226789
19263B07022c9609q2601j26380A46839a52329C5533a86166h0228B51499e0668
$$ 207022 -39609 -122210 -248590 146839 -152329 35533 -186166 -80228 251499 -50668
19252I4551C4511a26622A99616b00564k2145C22785F4628e357j48724E7646a60746
$$ 94551 34511 -126622 199616 -200564 -222709 322785 64628 -5357 -154081 57646 -160746
19240b02740d2415A9153c03293j9066P4413J14027L2887j718k40387A35674a61889
$$ -202740 -42415 19153 -303293 -322359 -247946 -133919 -101032 -102750 -343137 135674 -161889
19228d9448A04111a55888j35627A06653J325c76666B28088H1574J22727p4080
$$ -49448 104111 -155888 -291515 106653 107978 -376666 228088 81574 204301 130221
19218A30221h3977K0399j70877a13455B14332q3698a89895j4615f2912B0610c94157
$$ 130221 -83977 -63578 -234455 -113455 214332 130634 -189895 -204510 -62912 20610 -394157
19206B62070a70828p9230A5965d92780a78122q154E0578J87048a59659q3638J16209
$$ 262070 -170828 -250058 15965 -492780 -178122 -186276 50578 237626 -159659 -243297 -127088
19195a27088N2712c5467A50402J8092K7290c45602a37054A74837P2072o7459i2801
$$ -127088 -74376 -35467 150402 168494 195784 -345602 -137054 174837 246909 179450 -92801
19183B06607m765b32798c4006H370b32546A02636b40133A05566h6270j16708C8946
$$ 206607 201842 -232798 -34006 8370 -232546 102636 -240133 105566 -86270 -202978 38946
19171a54700A32622a26182A53750J49939a56993A13906d78904e1786j27266N7584
$$ -154700 132622 -126182 153750 303689 -156993 113906 -478904 -51786 -179052 -121468
19161a21468f79C2167a07600k59841A71135I723d48930C5279K49628a11012b5986
$$ -121468 -679 32167 -107600 -367441 171135 9723 -448930 35279 284907 -111012 -25986
19149b30265E783i0920j13705B04670o9030m4285c30624J14329H861M6611b25684
$$ -230265 5783 -90920 -204625 204670 135640 91355 -330624 -216295 8861 55472 -225684
19137C8892d51346a50484k2371A34610A4191b8847A6054J73478c81760a2473D88760
$$ 38892 -451346 -150484 -172855 134610 14191 -28847 16054 189532 -381760 -12473 488760
19125c8874A01053f467j32551G6594d10496J13263G5578j1338a08662I3442J41859
$$ -38874 101053 -6467 -139018 76594 -410496 -297233 75578 64240 -108662 93442 235301
19114B35301q4358g6430L2184l32290e5645j1819m489j6336B66898F7197M9205
$$ 235301 150943 -76430 -44246 -376536 -55645 -67464 -71953 -88289 266898 67197 116402
19103A16402a68911k69304A19700b94922J6899A36098c60933J34485j4817J11871
$$ 116402 -168911 -438215 119700 -294922 -278023 136098 -360933 -226448 -241265 -129394
19093a29394F223J6204R0020b02851j44222N9469A437P4998b83094j63110a40318
$$ -129394 6223 22427 112447 -202851 -347073 -287604 1437 76435 -283094 -446204 -140318
19081B46479g0616B33628a12338m0322a8144k946P442j67756f4521b3739B14189
$$ 246479 -70616 233628 -112338 -152660 -18144 -21090 -13648 -181404 -64521 -23739 214189
19069c09389g3903A32688F1512i3337A9716J97668I105b8835j88721L49I7738
$$ -309389 -73903 132688 61512 -93337 19716 217384 9105 -28835 -217556 -217207 97738
19057e0512k81196M9712h4118a9275E781a08234A45662a40847N54F7707K7131
$$ -50512 -331708 -281996 -84118 -19275 5781 -108234 145662 -140847 -140293 67707 94838
19046I4838N5238f7099M355E5804a57181O496A4033b96133f6775l1425d5176j4375
$$ 94838 150076 -67099 -62744 55804 -157181 -150685 14033 -296133 -66775 -98200 -45176 -59551
19034e9551r4433H6931l8026J85176a02444j46709E725a317E05921G6783F537
$$ -59551 -153984 86931 48905 234081 -102444 -249153 5725 -1317 505921 76783 6537
19022C6980J78253I2549b02424A37829i6498k5082I6278f2670B36233b82380G3136
$$ 36980 215233 92549 -202424 137829 -96498 -121580 96278 -62670 236233 -282380 73136
19010A31255i2212A48036E1135p255a80895r7842c0831j8946l983j02024f8407
$$ 131255 -92212 148036 51135 43880 -180895 -278737 -30831 -49777 -53760 -155784 -68407
18998a08066B7064b25859I9431N0439O4813h3355M918J2200D4434b8283P664l82955
$$ -108066 27064 -225859 99431 149870 214683 -83355 -78437 -66237 44434 -28283 -20619 -403574
18986d03574L5142b9080D3472N9374b55852G0451J9446b06753A20283a60284k05051
$$ -403574 -368432 -29080 43472 102846 -255852 70451 89897 -206753 120283 -160284 -365335
18975c65335a0046j98998Q985C31575c9264J1174A80739F2751e1204I4660J07924
$$ -365335 -10046 -209044 -200059 331575 -39264 -28090 180739 62751 -51204 94660 202584
18964B02584F9058f7529b3009j28187D26057d81146b30568P3646A32222K14502
$$ 202584 69058 -67529 -23009 -151196 426057 -481146 -230568 -156922 132222 346724
18954C46724a5837q8479d3222q6695J9373F0968h4626R502c7249B03760a19197
$$ 346724 -15837 -104316 -43222 -129917 -110544 60968 -84626 -75124 -37249 203760 -119197
18942b73301C19455j38728b38598A07190a44222E4791b43267a9520k18086Q3258
$$ -273301 319455 180727 -238598 107190 -144222 54791 -243267 -19520 -237606 -154348
18932a54348j09136a2649C30028G530b39258B2038a50348e0398j15290B65397
$$ -154348 -263484 -12649 330028 7530 -239258 22038 -150348 -50398 -165688 265397
18921f0628A04202A9755d8858j45010n6331Q4985n3071c497A98318b55283I8135
$$ -60628 104202 19755 -48858 -193868 -250199 -165214 -218285 -3497 198318 -255283 98135
18909c59389D36992A51149g4014j15194A60341b23526R2858B89955b3291C412
$$ -359389 436992 151149 -74014 -189208 160341 -223526 -130668 289955 -23291 3412
18898c08526E4828N6801j1457D0233K0514J76357j11688K04774C5443J63924b82225
$$ -308526 54828 111629 100172 40233 60747 237104 125416 330190 35443 199367 -282225
18886A4781c515r0127j58589j08860a8356k69272q6873A1292b88079k2807a47753
$$ 14781 -3515 -93642 -252231 -361091 -18356 -287628 -374501 11292 -288079 -310886 -147753
18874c8923o5080m01135b50881K1807d901j4313k17824c0114p9356A11969K30099
$$ -38923 -104003 -505138 -250881 -229074 -4901 -19214 -237038 -30114 -109470 111969 342068
18863C42068D3751b48955J19102D8231d1069l15597A39626f2977B78338j32248
$$ 342068 43751 -248955 -129853 48231 -41069 -356666 139626 -62977 278338 146090
18853A46090a62481A56345E4488B748M45482E0794h889C01292A41367b20968M7640
$$ 146090 -162481 156345 54488 2748 448230 50794 -8889 301292 141367 -220968 -173328
18842a73328A0045h762A39577b13424j19046J47089k23173A14591b12367C44548
$$ -173328 10045 -8762 139577 -213424 -332470 -185381 -408554 114591 -212367 344548
18831C28253b21964h132A6554a38347K0113h78q4003k99385J12263c8737k92730
$$ 328253 -221964 -8132 16554 -138347 -118234 -878 -84881 -384266 -272003 -38737 -331467
18820c31467o6449a52705J7656B09014a41051C52045q5213k7322p4375J31517
$$ -331467 -397916 -152705 -135049 209014 -141051 352045 266832 239510 165135 296652
18810B96652e5688A62911J36247A17661a87224B8918a87241H2769K27876a00961
$$ 296652 -55688 162911 299158 117661 -187224 28918 -187241 82769 310645 -100961
18799d80206I9888Q0863f5692I0216g1271p8767I6119l4395b2440k39251H8584
$$ -480206 99888 180751 -65692 90216 -71271 -150038 96119 61724 -22440 -261691 88584
18787a74581D5607d5302C29097a22664A67157e95285A12787c72323B84260a94268
$$ -174581 45607 -45302 329097 -122664 167157 -595285 112787 -372323 284260 -194268
18776c16985l5458f1464l06696a7532B4731K09697a00960A57150b55205i5696
$$ -316985 -352443 -61464 -368160 -17532 24731 234428 -100960 157150 -255205 -95696
18765a91478B53344a53348j2411A49357b71428H4955b19874J8867b4433m05808
$$ -191478 253344 -153348 -165759 149357 -271428 84955 -219874 -201007 -24433 -430241
18755d30241B01016b68874j85019e98j20700B28110j12906D2757a72683k43056
$$ -430241 201016 -268874 -453893 -598 -121298 228110 115204 42757 -172683 -415739
18745d15739c1597j75361k09588a5783C01362b00778m84742A79267c5963j88996
$$ -415739 -31597 -206958 -416546 -15783 301362 -200778 -685520 179267 -35963 -224959
18735b24959e2420N912j35777D3478d90311a75932L3386f2960G2202b24335A48776
$$ -224959 -52420 -46508 -182285 43478 -490311 -175932 -142546 -62960 72202 -224335 148776
18723b50748A76015b14756Q5672B34162b06148M5792f2289l3878k4262J4939B86785
$$ -250748 176015 -214756 -129084 234162 -206148 -160356 -62289 -96167 -120429 -105490 286785
18711D0774a79130j3449k28349a17936n1580P7808j29956A487b47932p6218C8287
$$ 40774 -179130 -192579 -420928 -117936 -169516 -91708 -221664 1487 -247932 -324150 38287
18699g9796p9977l4012j38195J40601p6204J6033J24067F8483c7794D0484c76303
$$ -79796 -159773 -193785 -331980 -191379 -267583 -251550 -127483 68483 -37794 40484 -376303
18687F5987c09067o1390D5579J6115K42046A30837n3957J23987b6982B85352E4850
$$ 65987 -309067 -370457 45579 61694 303740 130837 76880 200867 -26982 285352 54850
18675A60376a21146N0005L3285A54401c9654A01196A6184J28619B8195c7946A39387
$$ 160376 -121146 -71141 -37856 154401 -39654 101196 16184 144803 28195 -37946 139387
18663h9026D3274J9104A9898a42583d7575G854b4543l79404o7872C33536a94256
$$ -89026 43274 62378 19898 -142583 -47575 7854 -24543 -403947 -471819 333536 -194256
18651A47629i0431B7897a56352b9403j27795m5887j1679i6447k67994a48976F6454
$$ 147629 -90431 27897 -156352 -29403 -157198 -203085 -214764 -96447 -364441 -148976 66454
18639a66425G3794a92857p6574j35733J94325a6868A23644N1640m0586a36413
$$ -166425 73794 -192857 -269431 -405164 -210839 -16868 123644 175284 134698 -136413
18628a27641K0816K5993J8019A0296Q153R2994n5451J75110Q6268b41679i9618
$$ -127641 -106825 -80832 -62813 10296 18449 111443 55992 231102 317370 -241679 -99618
18616b646A25083h9884B5450a15419j54490N5480A98832f5302j70549g8313j02577
$$ -2646 125083 -89884 25450 -115419 -269909 -214429 198832 -65302 -235851 -78313 -180890
18605a80890A51879D8399f5040k30899C6665a89687R0747l07240J89131P8002
$$ -180890 151879 48399 -65040 -295939 36665 -189687 -98940 -406180 -217049 -139047
18595a39047m9322O515p8509K8937j00515B50045h2055I7093d1340q8289e7452
$$ -139047 -188369 -181854 -260363 -231426 -331941 250045 -82055 97093 -41340 -129629 -57452
18583b2846j01875B67432a02651B8653a02877E6295A6849b91072J05288b903j08476
$$ -22846 -124721 267432 -102651 28653 -102877 56295 16849 -291072 -185784 -2903 -111379
18572a11379k40304a34700H8460N1090a75665l78664c5529j76256G1208C2911
$$ -111379 -351683 -134700 88460 139550 -175665 -554329 -35529 -211785 71208 32911
18561B04419d81926c7518p7146C5620b62260B36574b84830a32729m9685k92907
$$ 204419 -481926 -37518 -114664 35620 -262260 236574 -284830 -132729 -182414 -475321
18551d75321a36202P105D6560J35472q1612a09395M9233C72316j39352b3026B4537
$$ -475321 -136202 -129097 46560 182032 100420 -109395 -60162 372316 232964 -23026 24537
18539a93739R0112j30426D9812d3545k87013e1679B07371a42552B11588a48512
$$ -193739 -103627 -234053 49812 -43545 -330558 -51679 207371 -142552 211588 -148512
18528B8087M5636Q3844b99889J32404g8979k54835J31083L2317P8607A42826g0779
$$ 28087 73723 157567 -299889 -167485 -78979 -333814 -202731 -170414 -91807 142826 -70779
18516A37842E8633A9530a14817k43911a48978A5876J15441b02696D0807P1877
$$ 137842 58633 19530 -114817 -358728 -148978 15876 131317 -202696 40807 112684
18506A12684b32505D1760c2705o3208k30126E4433g1238i889l74426J31965b0158
$$ 112684 -232505 41760 -32705 -95913 -326039 54433 -71238 -9889 -384315 -252350 -20158
18494C7385i5026n8911I0690A6599d02050e0825l7838B16484h3904B991d0133
$$ 37385 -95026 -153937 90690 16599 -402050 -50825 -88663 216484 -83904 2991 -40133
18482C7679c80497B1865l037b06283c3905J6825m2720B4238h5342p4285o3722
$$ 37679 -380497 21865 18828 -206283 -33905 -17080 -59800 24238 -85342 -159627 -223349
18471b23349I8006R072g7274J9537p9395f0203j24619j29076e9090C23201p6108
$$ -223349 98006 107078 -77274 -57737 -137132 -60203 -184822 -313898 -59090 323201 247093
18460B47093a22450L2883A74820a59259p2667i1475d5361M120B4031c15665L9454
$$ 247093 -122450 -89567 174820 -159259 -231926 -91475 -45361 -41241 24031 -315665 -276211
18449b76211M7596Q2641C0808a73851e0766l614k32438H7670B2795O3756O5270
$$ -276211 -228615 -145974 30808 -173851 -50766 -54380 -286818 87670 22795 86551 151821
18438A51821n0619d1654B04758h4332b9112o6889j30843A54588c45351J35595
$$ 151821 101202 -41654 204758 -84332 -29112 -96001 -226844 154588 -345351 -209756
18428b09756i9964Q385H6170f4803L1638j42356A08044a48722C54154G9191C8493
$$ -209756 -99964 -91579 86170 -64803 -33165 -175521 108044 -148722 354154 79191 38493
18416c00604B3498d26580A76789b66588a13303A14247b10322B80458r2884n1387
$$ -300604 23498 -426580 176789 -266588 -113303 114247 -210322 280458 187574 136187
18406A36187i1568C19204I4337C5003O3342a41150k3016m5619o2808b8528r4985
$$ 136187 -91568 319204 94337 35003 98345 -141150 -164166 -209785 -272593 -28528 -123513
18395a23513A95727d03581I9663b49988B17464a3415A60747a76547b9202l13821
$$ -123513 195727 -403581 99663 -249988 217464 -13415 160747 -176547 -29202 -343023
18385c43023A09205b5880E4205d1935j59132J00032A51309g9175A34996B1581
$$ -343023 109205 -25880 54205 -41935 -201067 -101035 151309 -79175 134996 21581
18374a64038e4247o6758K3345j35933O7899d7017j82095h3584H8443j4433R0407
$$ -164038 -54247 -121005 -97660 -233593 -165694 -47017 -229112 -83584 88443 74010 164417
18363A64417f573G1887b35126E6503L1033R893d6396o043r5011F861a523I8281
$$ 164417 -6573 71887 -235126 56503 87536 97429 -46396 -52439 -147450 6861 -1523 98281
18350d5363r8893c852B6763c49635A16585c3431I8718d03464A51433a19541A3761
$$ -45363 -144256 -3852 26763 -349635 116585 -33431 98718 -403464 151433 -119541 13761
18338e966n6673k24359a11323H5980a18553n4136j00332D5465l03b98037J10476
$$ -5966 -62639 -286998 -111323 85980 -118553 -172689 -273021 45465 45162 -298037 -187561
18327a87561a7765E7709J24826b15796k1010j27500j7801a04689E282g1351r160
$$ -187561 -17765 57709 182535 -215796 -236806 -364306 -382107 -104689 5282 -71351 -80511
18316h0511B69102b50689K9598A98533n9520F6085b3842A49431b77149b4789j3737
$$ -80511 269102 -250689 -221091 198533 139013 66085 -23842 149431 -277149 -24789 -38526
18305c8526o0260N299c3690r7695D4383d37211a3132l35577J70097A54330a02481
$$ -38526 -98786 -93487 -33690 -131385 44383 -437211 -13132 -348709 -178612 154330 -102481
18293a84227D1718c22485a53778k8624b4359l22474b1786H4918J73430d5103l5374
$$ -184227 41718 -322485 -153778 -182402 -24359 -346833 -21786 84918 258348 -45103 -80477
18282h0477j78424J23457o4407g2355j23939A81575b6802G1323d7192l6943m2704
$$ -80477 -258901 -135444 -199851 -72355 -196294 181575 -26802 71323 -47192 -84135 -126839
18271a26839G478f0411D437a88067d9529j45738A40883n8619c24832A56922m1406
$$ -126839 7478 -60411 4437 -188067 -49529 -195267 140883 82264 -324832 156922 115516
18260A15516R2416B2704F765a21161F0123a78175k80906e6296D4916k403i9930
$$ 115516 207932 22704 6765 -121161 60123 -178175 -459081 -56296 44916 42513 -99930
18248b3514j73229L4878K6179E4185b77304a00873k615K8212D6532b36059l9295
$$ -23514 -196743 -161865 -135686 54185 -277304 -100873 -103488 -75276 46532 -236059 -275354
18237b75354C2227b9813D4529Q4687C2947K81762G3349b20016R7385A12784b12044
$$ -275354 32227 -29813 44529 129216 32947 314709 73349 -220016 -122631 112784 -212044
18225a53489B503K15988j05885b88245L2124J16154H3818c12433N3170l0552G2043
$$ -153489 2503 218491 112606 -288245 -256121 -139967 83818 -312433 -259263 -289815 72043
18213B18335H8218a40791J4165p2065H5896g8959k17904J18212A6927b53893E5239
$$ 218335 88218 -140791 -126626 -198691 85896 -78959 -296863 -178651 16927 -253893 55239
18201B92388j595a69263N8471L284M2795l4502m6201J9421p3142h5291P436b6890
$$ 292388 290793 -169263 -110792 -107508 -64713 -99215 -145416 -125995 -199137 -85291 -77855 -26890
18188c6060j56603a8263B6106g0508j3992A49710n8393a37577j98766P7336D7033
$$ -36060 -192663 -18263 26106 -70508 -84500 149710 91317 -137577 -336343 -259007 47033
18176A36194h8150l04710a17438l14579K08594B86166A22656b22789o9263A07781
$$ 136194 -88150 -392860 -117438 -432017 -223423 286166 122656 -222789 -292052 107781
18165h9324j16982Q1902A61352B2526K31702A7707J25319a67477A53124d9004
$$ -89324 -206306 -124404 161352 22526 254228 17707 143026 -167477 153124 -49004
18154c083B17124C296K52786B9790b63094P1150m0438A5057K02678a86454O7904
$$ -3083 217124 3296 256082 29790 -263094 -191944 -232382 15057 217735 -186454 -118550
18143a18550J0433o262F989a41630l66378A7449a80912g6976j36013c2712n6935
$$ -118550 -108117 -114379 6989 -141630 -508008 17449 -180912 -76976 -212989 -32712 -89647
18132h9647B16835c2813q2882B08991b48967j38145c0308A10691a00648J5941
$$ -89647 216835 -32813 -115695 208991 -248967 -387112 -30308 110691 -100648 -84707
18122h4707k13658A90204A9261b74050i5981C6959Q4492a23287n5887A00946b98810
$$ -84707 -298365 190204 19261 -274050 -95981 36959 121451 -123287 -179174 100946 -298810
18110b00346n1450A03959c29248J43097k48944B56052F2974J88516I022d92945
$$ -200346 -251796 103959 -329248 -186151 -435095 256052 62974 251490 9022 -492945
18099A85684o9763a73841j8932P3996A29456h5377G744b55953r961j74250a9158
$$ 185684 115921 -173841 -192773 -118777 129456 -85377 7744 -255953 -265914 -440164 -19158
18087B90838H3927a214l08224B04622g0532q0531G2610b77088E9289i71l30163
$$ 290838 83927 -1214 -309438 204622 -70532 -151063 72610 -277088 59289 -971 -331134
18076c31134o798F8730J5563b906B15244A00096J9308c38256A91728E2241a22666
$$ -331134 -337932 68730 84293 -2906 215244 100096 119404 -338256 191728 52241 -122666
18064D2553M5564K38974H2816e1234k36262R8327k85977b8233j91180A21090K73767
$$ 42553 88117 327091 82816 -51234 -287496 -189169 -475146 -28233 -219413 121090 394857
18053C94857i7899n17j97550A19122J29442c62730d8556C4641a26516j4283l57891
$$ 394857 -97899 -98416 -295966 119122 248564 -362730 -48556 34641 -126516 -140799 -498690
18042d98690e5822j10270J7780f8005a1249m03372a18291J97A56071f876A001
$$ -498690 -55822 -166092 -148312 -68005 -11249 -414621 -118291 -118094 156071 -6876 1001
18030G1624g7033k09180g7806J055A1635K30057b78494g781j96717l4709A3101
$$ 71624 -77033 -286213 -77806 -76751 11635 241692 -278494 -7781 -204498 -239207 13101
18018I7492N8721c5112B70267e5293j64422A2031g459B47358d65632K25465R8932
$$ 97492 156213 -35112 270267 -55293 -219715 12031 -7459 247358 -465632 -240167 -141235
18007a41235A80089A5485c24028a1261l2013F9451h7269j15765B78849E2211b25137
$$ -141235 180089 15485 -324028 -11261 -43274 69451 -87269 -203034 278849 52211 -225137
17995G0621a37670A5d8155A87179A1241h8858B15639b6218j22044e4952k05462
$$ 70621 -137670 15 -48155 187179 11241 -88858 215639 -26218 -148262 -54952 -260414
17984b60414A76266b8487A20992A4753L49303h2435g935B05494c30573r1188d536
$$ -260414 176266 -28487 120992 14753 364056 -82435 -7935 205494 -330573 -421761 -4536
17972a6518l6090H9681b66165C2504K48071c7966j2643n5305j18490A1511b12121
$$ -16518 -52608 89681 -266165 32504 280575 -37966 -50609 -105914 -224404 11511 -212121
17960b82148A1976d67806i5442B02224a95692A76130J8525J28399A51254b58597
$$ -282148 11976 -467806 -95442 202224 -195692 176130 194655 323054 151254 -258597
17949A53074d51651c5494C04166E7752M7925C4503d3070j3202J3213k48763n2223
$$ 153074 -451651 -35494 304166 57752 105677 34503 -43070 -56272 -43059 -291822 -344045
17938c44045A4194N6356a79691e3536a9349k2050r9577P0239l88018b11756H6190
$$ -344045 14194 70550 -179691 -53536 -19349 -41399 -140976 -70737 -458755 -211756 86190
17926I1295R8088F0406B3146P8322B0042L215J70745F428c5139A08098L09881
$$ 91295 189383 60406 23146 101468 20042 23257 194002 6428 -35139 108098 417979
17915D17979A68831c17867b8736B47907E8227a98824B0447L7497K7339l4719H037
$$ 417979 168831 -317867 -28736 247907 58227 -198824 20447 57944 85283 50564 8037
17903a42506L9244A42298J89652C323K1035a0247A73337j5399c91678d5002j74550
$$ -142506 -103262 142298 331950 3323 24358 -10247 173337 157938 -391678 -45002 -219552
17892b19552A0466a70301H1998f9778H8371P8185a13245C4596J39795b93873C78185
$$ -219552 10466 -170301 81998 -69778 88371 166556 -113245 34596 174391 -293873 378185
17880H8012e0004F2392a51598A05925N505J8896Q4048a5060n44780J11162b0917
$$ 88012 -50004 62392 -151598 105925 111430 130326 214374 -15060 -559840 -448678 -20917
17868b83614Q0786o0121N459Q7157A32289f2740A23776D4489a48143J9848K0150
$$ -283614 -202828 -262949 -257490 -170333 132289 -62740 123776 44489 -148143 -128295 -108145
17857a08145K2928C1771b48808b6222D681j257a98540k07490c5888k44642B4442
$$ -108145 -85217 31771 -248808 -26222 4681 3424 -198540 -406030 -35888 -280530 24442
17845A76760b43597b8321r6891A09290a65500j49883e144j93154k1384A80654
$$ 176760 -243597 -28321 -125212 109290 -165500 -315383 -5144 -198298 -219682 180654
17834a33131k15895a59313A78244J84203a82429A82142b71380A4169J13714a1737
$$ -133131 -349026 -159313 178244 362447 -182429 182142 -271380 14169 127883 -11737
17823B20520A5456b26438I914b39378A56603C5345b2463C7418M1892b5287l59255
$$ 220520 15456 -226438 9914 -239378 156603 35345 -22463 37418 79310 -25287 -384542
17812c84542a42867g1374K7963j78691B60230e789k43766f1984k13228J16985
$$ -384542 -142867 -71374 -43411 -222102 260230 -5789 -249555 -61984 -275212 -158227
17802a58227j73374A37452a32367B03955a63441M9146j12233B8564h4653A12166
$$ -158227 -331601 137452 -132367 203955 -163441 -114295 -226528 28564 -84653 112166
17791g704c163j07522A75827d85084a22638j94163D53269d07303A80534L702a08304
$$ -7704 -3163 -110685 175827 -485084 -122638 -316801 453269 -407303 180534 184236 -108304
17779c87630a9004J431r5625G9328J32106h3081j13969A76O323a01242B99857
$$ -387630 -19004 -17573 -113198 79328 211434 -83081 -197050 176 6499 -101242 299857
17767A45685i9287J4359A44247d83784a47308A30527h8196K1284A3108c7732A39258
$$ 145685 -99287 -84928 144247 -483784 -147308 130527 -88196 -66912 13108 -37732 139258
17755A14218B8141R0645Q6152p1479b03972F6853i5320o4357E15171a85547N1060
$$ 114218 28141 118786 204938 133459 -203972 66853 -95320 -159677 515171 -185547 -134487
17744a34487k12301g1006E9426N4875L74112F4358Q6532L0873f6490I4569h1452
$$ -134487 -346788 -71006 59426 114301 488413 64358 150890 181763 -66490 94569 -81452
17732A8258a94829g9461k96344B08126H334c45565J58321h8350H672M8108Q0478
$$ 18258 -194829 -79461 -375805 208126 8334 -345565 -187244 -88350 8672 56780 137258
17721A37258a862m2077r6324k4083M1704j66280B41805r7659B0099Q8070a25571
$$ 137258 -1862 -43939 -140263 -164346 -122642 -288922 241805 144146 20099 108169 -125571
17709f973H9541J49115F5220K69850A49469O233b09587A00526e5019k36512f2206
$$ -6973 89541 238656 65220 335070 149469 155702 -209587 100526 -55019 -291531 -62206
17697B24271I6854a12221j85563C9797a13272D5882M9017J9078b92261A69127
$$ 224271 96854 -112221 -297784 39797 -113272 45882 94899 113977 -292261 169127
17686E1181a43000A67325g9002A57070a01013k43691b1103o3501l1669D9564a61419
$$ 51181 -143000 167325 -79002 157070 -101013 -344704 -21103 -84604 -116273 49564 -161419
17674A67953a28070B41320D7964J65646f7562H7223K92198a08664o8072D6649
$$ 167953 -128070 241320 47964 213610 -67562 87223 379421 -108664 -176736 46649
17663C7931a12866n3960g3237b070j0247A73238a44981A67956a04096d7156A82174
$$ 37931 -112866 -166826 -73237 -2070 -12317 173238 -144981 167956 -104096 -47156 182174
17651B73013a47155J9913A32200a42985B79738o9272A8401R1198a97868B10260
$$ 273013 -147155 -127242 132200 -142985 279738 210466 18401 109599 -197868 210260
17640B88609A8224L23000c4680C0970J06287b61122B49694p7500P3254g8538j64259
$$ 288609 18224 341224 -34680 30970 137257 -261122 249694 172194 245448 -78538 -242797
17629b42797A27720i1389H9076N5684J63425a42237C24337G1182P1064J97778
$$ -242797 127720 -91389 89076 144760 308185 -142237 324337 71182 142246 340024
17619C40024A53907a75907A31904K54504A26946b93125J41506I9324R0968C4523
$$ 340024 153907 -175907 131904 386408 126946 -293125 -151619 99324 190292 34523
17608H3673b92775B3477d3839A32750J448a17694J3310B36669d7909c070j4084
$$ 83673 -292775 23477 -43839 132750 134198 -117694 -104384 236669 -47909 -3070 -17154
17597a7154A94535E2747k537J46169g2196J9386j36151I3865J7253c24446C72683
$$ -17154 194535 52747 50210 196379 -72196 -52810 -188961 93865 111118 -324446 372683
17585C34605F5972K72010m7358H6174d3140B58559a67217J0591I1955C1032g669
$$ 334605 65972 337982 290624 86174 -43140 258559 -167217 -156626 91955 31032 -7669
17573b72024g8882A49660j1081d77871A72714a25498J9238J2895q9826D1268A2085
$$ -272024 -78882 149660 138579 -477871 172714 -125498 -106260 -93365 -183191 41268 12085
17561a18009D6218b03996F0044K49407c16498A3603a51212F8032e8645o7169D0698
$$ -118009 46218 -203996 60044 309451 -316498 13603 -151212 68032 -58645 -125814 40698
17549A42212h7764A00924a23474A75682e8311C13061F2163a37484A27723K55052
$$ 142212 -87764 100924 -123474 175682 -58311 313061 62163 -137484 127723 382775
17539C82775A63290a52635C1531R893B537J10712a49530C34403d05462E3904i4891
$$ 382775 163290 -152635 31531 41424 2537 113249 -149530 334403 -405462 53904 -94891
17527B62937f8056C47378j04541a62689o705n4642E2872K52888d46290A61242
$$ 262937 -68056 347378 242837 -162689 -169394 -224036 52872 305760 -446290 161242
17516A05635J5189c07177i1014A18449K97719H5317N0009G607f5373C54476a55286
$$ 105635 120824 -307177 -91014 118449 416168 85317 135326 7607 -65373 354476 -155286
17504c7242A31478K35995r2314e9700C18024I0711b61685C67567D2943a40809
$$ -37242 131478 367473 275159 -59700 318024 90711 -261685 367567 42943 -140809
17493a88985B19094c2286B90758f719C77069i5357A71989J31085j44256J82539
$$ -188985 219094 -32286 290758 -6719 377069 -95357 171989 303074 158818 341357
17483C41357a68139A84510q007n471b2612C9996Q646e761C97590A32064J4250
$$ 341357 -168139 184510 176503 171032 -22612 39996 48642 -5761 397590 132064 146314
17472A46314N4873K3257C5358e509C9716J16783d220j8944B31453M1679p6992
$$ 146314 201187 224444 35358 -5509 39716 156499 -4220 -23164 231453 273132 196140
17461A96140B0413J98005R4701j36500c6412G717L75531Q9433J72558A19601O2947
$$ 196140 20413 218418 313119 176619 -36412 7717 383248 472681 645239 119601 182548
17450A82548J21847r9997G3229J66606N1030i8361D27153b02109C16808A26139
$$ 182548 304395 204398 73229 239835 290865 -98361 427153 -202109 316808 126139
17439h8535A842K65909J01907m72j30580J7863o1550K1207J957P6695j36432l7030
$$ -88535 1842 267751 369658 369186 238606 256469 194919 216126 218083 294778 158346 121316
17427A21316K26460C4144b3299D60227A85424J65650A06838k3580M25931Q5661
$$ 121316 347776 34144 -23299 460227 185424 351074 106838 83258 509189 594850
17417E94850k39695j70693q9976J19681J52112I6097K45470n2907j43944F0165
$$ 594850 355155 184462 94486 214167 366279 96097 341567 288660 144716 60165
17406c0748E7931R8552N7888i6235A7733L4378K45938A19148i1406B88822J3897
$$ -30748 57931 156483 214371 -96235 17733 52111 298049 119148 -91406 288822 302719
17395C02719P0054l4937A47114a2193n40A90224h9243A00863M5236Q5198o7236
$$ 302719 372773 337836 147114 -12193 -12733 190224 -89243 100863 146099 231297 164061
17384A64061a63764B4024K47155j16327I103R6148Q6803l1190p8539J43643A1446
$$ 164061 -163764 24024 271179 154852 9103 105251 192054 160864 82325 225968 11446
17372A70790M8535I0935N5780A3807J64701Q9117G0811b4118G7710m423J06408
$$ 170790 219325 90935 146715 13807 178508 267625 70811 -24118 77710 73287 179695
17361A79695j6239N1314l0812R5828H1247a21821J2791A8776a4828H4970a35921
$$ 179695 163456 214770 183958 279786 81247 -121821 -109030 18776 -14828 84970 -135921
17349A42242J9445A1056K05810h2296A27916g0808C3133K75202d4122A49669f7599
$$ 142242 161687 11056 216866 -82296 127916 -70808 33133 308335 -44122 149669 -67599
17337C72082A35876l5117J81574M0146G8365J08931O3320J4397h4597J2423r1629
$$ 372082 135876 100759 282333 322479 78365 187296 250616 265013 -84597 -72174 -163803
17326a63803A39649h329B32396C2766c4672j16271C1205M5134N7738F331K04466
$$ -163803 139649 -8329 232396 32766 -34672 -150943 31205 76339 134077 6331 210797
17315B10797a44198H1945N123L28652a19850B09913K09121l2612C0281K8072a72173
$$ 210797 -144198 81945 87068 415720 -119850 209913 419034 386422 30281 58353 -172173
17303A39855e2070D32576A29250c291o4389A53055p2578J35746j4064J61140A34400
$$ 139855 -52070 432576 129250 -3291 -67680 153055 80477 216223 202159 363299 134400
17291D76317A99677L8427A16341j7944J75677J22159j84380N6349A23873M7282
$$ 476317 199677 238104 116341 98397 274074 396233 211853 268202 123873 171155
17281A71155E0149J52266F5723h0548q3288l3992A26225M0050J01183D7290L13312
$$ 171155 50149 202415 65723 -80548 -163836 -197828 126225 166275 267458 47290 360602
17270C60602A23084D2396L11060e4399B53595j9810n2728l2194L45140A1735a52093
$$ 360602 123084 42396 353456 -54399 253595 233785 181057 148863 494003 11735 -152093
17258b50130I1908d5475r41C67383g1599A12467J13163J50045B9726K18192J837
$$ -250130 91908 -45475 -46416 367383 -71599 112467 225630 375675 29726 247918 249755
17247B49755F8258a9499B31143C7877J26835n4740C7227K18279K26958r0609H0367
$$ 249755 68258 -19499 231143 37877 164712 109972 37227 255506 482464 391855 80367
17235A22023E429L30235o3101l5580j792k8253q0456d2858B29302H3898L17316
$$ 122023 5429 335664 272563 236983 235191 206938 126482 -42858 229302 83898 401214
17224D01214A1970O5915K00574J8702B2900K59650J81977a1019D36134k9187k03001
$$ 401214 11970 77885 278459 297161 22900 282550 464527 -11019 436134 406947 203946
17213B03946q4425J93050j48578J25077i468A73199b37065H6633J32544p8019
$$ 203946 119521 312571 163993 289070 -9468 173199 -237065 86633 219177 141158
17203A41158M3083b763C52296b7917E10733k04938J9653A47186J66176C8523O6110
$$ 141158 184241 -2763 352296 -27917 510733 305795 325448 147186 313362 38523 104633
17192A04633L04064A40431C0712J48663a05763B43394a01252A90486b39937B62058
$$ 104633 408697 140431 30712 179375 -105763 243394 -101252 190486 -239937 262058
17181A63742D1178J81393R558J73864o5369q1546J15426J9035j68461l5370q5326
$$ 163742 41178 222571 232129 405993 340624 259078 374504 393539 225078 189708 104382
17170A04382L71966o1348r9861I8211J14497H8396L0099J32258o2336J90937r5605
$$ 104382 476348 415000 315139 98211 212708 88396 118495 250753 188417 379354 283749
17159B83749A00278M44838B53306K6383O8253J6406p3195r7698K21676A26080
$$ 283749 100278 545116 253306 279689 347942 364348 291153 193455 415131 126080
17148B1626J15343J5494L78748n6017j53529c0474B34340L04885k13080H1586
$$ 21626 136969 152463 531211 475194 321665 -30474 234340 539225 326145 81586
17137E30682q70j91814K2173J7861J9327O7688A84758K54397B17188K02944j96250
$$ 530682 529812 337998 360171 378032 397359 465047 184758 439155 217188 420132 223882
17126B23882J67428K33636k34729m438J22513j89274p78p1690J5439p5626n5266
$$ 223882 391310 624946 390217 385779 508292 319018 318240 246550 261989 186363 131097
17115A31097K68110A02981O7764O1927K27832j54165K330k4360j31731J89313
$$ 131097 399207 102981 170745 232672 460504 306339 308669 284309 152578 341891
17105C41891P55K16359K7702J42032C22392K13912A46701a9073D32953O6516j06403
$$ 341891 342646 559005 586707 728739 322392 536304 146701 -19073 432953 499469 393066
17094C93066j57904P687J55886A62638G6377J97441J68621J52946l5751k38712
$$ 393066 235162 242849 398735 162638 76377 273818 442439 595385 559634 320922
17084C20922K93332k77736J36088K28672C16504J56997A86882L66503J30902R127
$$ 320922 614254 336518 472606 701278 316504 473501 186882 553385 684287 693414
17074F93414j3164k38470L16987k87429P852J19898m0225B61278K14681j87738
$$ 693414 680250 441780 758767 471338 479190 599088 558863 261278 475959 288221
17064B88221K37010p135J74665C02450J21211J57363j674k05136M09264k83481
$$ 288221 525231 518096 692761 302450 423661 581024 579350 374214 783478 499997
17054D99997j17432J36543J9522J70428J20354k68769j72211Q6092K42337k82647
$$ 499997 382565 519108 538630 709058 829412 560643 388432 474524 716861 434214
17044D34214j6084O5617n5500K05206k26836o7027K40485K15340J3544j87568
$$ 434214 418130 483747 428247 633453 406617 339590 580075 795415 808959 621391
17034F21391n7847K80336m01090O0583J43251O1234j90216J30610l121p5491L04811
$$ 621391 563544 843880 442790 503373 646624 707858 517642 648252 645131 569640 874451
17023H74451j40546q5206n166J59904l59404J8223O129J24198r5185K30503r9533
$$ 874451 733905 648699 643533 803437 444033 462256 468385 592583 497398 727901 628368
17012F28368B39217K53332J69647J88261j99267O3454o412J89645k39336j08951
$$ 628368 239217 492549 662196 850457 651190 714644 708232 897877 658541 549590
17002E49590r0688L66655j61031M74871k97950k82396j79862L93955j13023k88774
$$ 549590 458902 825557 664526 1139397 841447 559051 379189 773144 660121 371347
16992C71347M38338J52358k25132N2839K65052m07897K32471r9539L7269J69963
$$ 371347 809685 962043 736911 789750 1054802 646905 879376 779837 817106 987069
16982I87069j59642j26426J42401K46617k85100k33751L71126r2219k8601K41977
$$ 987069 827427 701001 843402 1090019 804919 571168 942294 850075 821474 1063451
16972A063451M366M6123o17j54864m1276J2967m3304L42410k11502J43509K5k41245
$$ 1063451 1067817 1113940 1113323 958459 917183 930150 886846 1229256 1017754 1161263 1161288 920043
16960I20043L12046l19376R4944p6582J71752n328P6278r7661J05896k24484M6002
$$ 920043 1232089 912713 1007657 931075 1102827 1097499 1173777 1076116 1182012 957528 1003530
16949A003530k97886J47014L10211O1493l8917p017m03312M1809O17905k64329
$$ 1003530 705644 852658 1162869 1224362 1185445 1178428 775116 816925 1434830 1170501
16939A170501K48944l71788K30178J52533j94949o3391Q4690j08907o4681Q5432
$$ 1170501 1419445 1047657 1277835 1430368 1235419 1172028 1256718 1147811 1083130 1168562
16929A168562L00744J12291m58575j3716P0044l7971R3709M56427m63943L54091
$$ 1168562 1469306 1581597 1123022 1109306 1179350 1141379 1235088 1691515 1227572 1581663
16919A581663J6623k08428J74539k05243M64070k2930m19735R6549m6037K04437
$$ 1581663 1598286 1389858 1564397 1359154 1823224 1800294 1380559 1477108 1431071 1635508
16909A635508j34364M8954M9034l60121O26154j38514J44353j4106m10053M13018
$$ 1635508 1501144 1550098 1599132 1239011 1865165 1726651 1871004 1856898 1446845 1859863
16899A859863l81613J90389j82233M53362J50078L4168j83183J36472j59666J28449
$$ 1859863 1478250 1668639 1486406 1939768 2089846 2124014 1940831 2077303 1917637 2046086
16889B046086J5755k0311K22186K4947k37083K61913k61885L5308M26417m04661
$$ 2046086 2061841 2041530 2263716 2288663 2051580 2313493 2051608 2086916 2513333 2108672
16879B108672K84991j74412K16952q5072J39340N2766p2771K72344k49830j32130
$$ 2108672 2393663 2219251 2436203 2351131 2490471 2543237 2470466 2742810 2492980 2360850
16869B360850K04347l31388M80677k18442O6210K57736J69557p7721J32148l91280
$$ 2360850 2565197 2233809 2714486 2496044 2562254 2819990 2989547 2911826 3043974 2652694
16859B652694L45650O5836j31603J84448k2314j46801L32184J04066k92163M12749
$$ 2652694 2998344 3064180 2932577 3117025 3094711 2947910 3280094 3384160 3091997 3504746
16849C504746j29908O38102o21130J98147k15789K25451J07464l03398M67606
$$ 3504746 3374838 4012940 3391810 3589957 3374168 3599619 3707083 3403685 3871291
16840C871291m63841L12960L70823p9337L20557o4015k4362J2698J58941k9537
$$ 3871291 3407450 3720410 4091233 4011896 4332453 4268438 4244076 4256774 4415715 4386178
16830D386178K46540j53079J80742J42874j17201M59360J51315O1148k20146R4990
$$ 4386178 4632718 4479639 4660381 4803255 4686054 5145414 5296729 5357877 5137731 5232721
16820E232721L90012k4630O1129K83781k00415L16529j34676M77394j3835L23938
$$ 5232721 5622733 5598103 5659232 5943013 5742598 6059127 5924451 6401845 6388010 6711948
16810F711948j99825L45897M07319q3058L56206k93864K66667K93470J04655k4177
$$ 6711948 6512123 6858020 7265339 7182281 7538487 7244623 7511290 7804760 7909415 7885238
16800G885238J99477N91393m22285Q12131P1431l4314L99248J49391M65240L50152
$$ 7885238 8084715 8676108 8253823 9065954 9137385 9103071 9502319 9651710 10116950 10467102
16790A0467102m28422J055573l28116P42788j4379N81412L27196L46849J90521
$$ 10467102 10038680 11094253 10766137 11508925 11494546 12075958 12403154 12750003 12940524
16781A2940524N50757L09492N11067M23313M08351L38959O24832N22087K38570
$$ 12940524 13491281 13800773 14311840 14735153 15143504 15482463 16107295 16629382 16867952
16772A6867952Q30924N70392Q39238M21797M26857Q13583P66669J209166P46022
$$ 16867952 17698876 18269268 19108506 19530303 19957160 20770743 21537412 22746578 23492600
16763B3492600O73698J169223J039099P53293J155344J288542J460103J108455
$$ 23492600 24166298 25335521 26374620 27127913 28283257 29571799 31031902 32140357
16755C2140357J483086J533700J697375J886611J510611J754269K310423K135364
$$ 32140357 33623443 35157143 36854518 38741129 40251740 42006009 44316432 46451796
16747D6451796K178358K821227K492127K880808K915269L341014L570659M019015
$$ 46451796 48630154 51451381 53943508 56824316 59739585 63080599 66651258 70670273
16739G0670273M126967M260586M739812M848808M870585O171259N466526O500943
$$ 70670273 74797240 79057826 83797638 88646446 93517031 99688290 105154816 111655759
16731A11655759O596797O872665P226703P658432P348093P735509P447390P008814
$$ 111655759 118252556 125125221 132351924 140010356 147358449 155093958 162541348 169550162
16723A69550162P089395O250190N524717M728350L693135K152090J541044m25017
$$ 169550162 176639557 182889747 188414464 193142814 196835949 198988039 200529083 200104066
16715B00104066j369336k733505m536198m791117n625331o779315p499160p020694
$$ 200104066 198734730 196001225 191465027 186673910 181048579 174269264 166770104 159749410
16707A59749410p651525p784143p547186p827785o860370p028676o619843o054748
$$ 159749410 152097885 144313742 136766556 128938771 122078401 115049725 108429882 102375134
16699A02375134o062710n698579n332960m777971m789859m176603l947546l855080
$$ 102375134 96312424 90613845 85280885 80502914 75713055 71536452 67588906 63733826
16691F3733826l476827l048612l282416k661231k554333k255916k281218k407332
$$ 63733826 60256999 57208387 53925971 51264740 48710407 46454491 44173273 41765941
16683D1765941j958635j994173j614812j523557j674431j571366j258544j028556
$$ 41765941 39807306 37813133 36198321 34674764 33000333 31428967 30170423 29141867
16675B9141867j516452j217854q27873q51619j512895k94376j429682l88918j215063
$$ 29141867 27625415 26407561 25579688 24728069 23215174 22920798 21491116 21102198 19887135
16666A9887135o23225l57538j064494n34154m54232l74631l83291p22990m20467
$$ 19887135 19263910 18906372 17841878 17307724 16853492 16478861 16095570 15372580 14952113
16657A4952113r17963j29841n71661l31951l07835k26872l12126p74115l57422
$$ 14952113 14034150 13904309 13332648 13000697 12692862 12465990 12153864 11379749 11022327
16648A1022327k57992p6103j53707n41354l87429k52208n26156J47919l60155
$$ 11022327 10764335 10688232 10534525 9993171 9605742 9353534 8827378 8975297 8615142
16639H615142k01083j90891k03429j89583k00361k86825j18143q8855j10955j12983
$$ 8615142 8414059 8223168 8019739 7830156 7629795 7342970 7224827 7135972 7025017 6912034
16629F912034m70165P2762j14072j95423k39458P2236l13370K30991k95947j82402
$$ 6912034 6441869 6514631 6400559 6205136 5965678 6037914 5724544 5955535 5659588 5477186
16619E477186R0688k91816r6896j07274o9690m6084j1468j47160p6731q4345k36791
$$ 5477186 5567874 5276058 5179162 5071888 5002198 4956114 4944646 4797486 4720755 4636410 4399619
16608D399619j41378J37360k11503j15362k13624n6705K65079l43720r1054K79799
$$ 4399619 4258241 4395601 4184098 4068736 3855112 3798407 4063486 3719766 3628712 3908511
16598C908511m37098K43262l57319J47204m38347R5624J89938l96659L25226n24331
$$ 3908511 3471413 3714675 3357356 3504560 3066213 3161837 3351775 2955116 3280342 2756011
16588B756011L55467l08335K7905l0866j98363l0346L94132l16820J66378j83465
$$ 2756011 3111478 2803143 2831048 2800182 2601819 2571473 2965605 2648785 2815163 2631698
16578B631698m81884L76103N8766l26425J44261N7553k29826L6113K89530k13871
$$ 2631698 2149814 2525917 2584683 2258258 2402519 2460072 2230246 2266359 2555889 2342018
16568B342018k32241K64925l08694j52519M91837m89158J16619Q9411l83330Q5294
$$ 2342018 2109777 2374702 2066008 1913489 2405326 1916168 2032787 2122198 1738868 1824162
16558A824162R555K03150r6395k99683L6249o8646K6287j38584K58391k08231
$$ 1824162 1833717 2036867 1940472 1640789 1677038 1608392 1634679 1496095 1754486 1546255
16548A546255k29048M52709k95319L92259o04470K63965n1538O5752j94882K05661
$$ 1546255 1317207 1769916 1474597 1866856 1262386 1526351 1474813 1540565 1345683 1551344
16538A551344J96310m91785M30179j99065K48585n79746K70445k73421J11957
$$ 1551344 1747654 1255869 1686048 1486983 1735568 1155822 1426267 1152846 1264803
16529A264803J1385K58518q2311N2021j65208r7351k61175M46695k84739j0186
$$ 1264803 1276188 1534706 1452395 1504416 1339208 1241857 980682 1427377 1142638 1132452
16519A132452j81281K97497L6955p1143K35671m93944J07725K797R6794Q4068
$$ 1132452 951171 1248668 1285623 1214480 1450151 956207 1063932 1066729 1163523 1247591
16509A247591j00915k59146K13775j45308m7043J52955j59172M6952j47602q1551
$$ 1247591 1146676 887530 1101305 955997 908954 1061909 902737 949689 802087 720536
16499G20536J32769j23838j87983L36121J18011j39282J86513k82457K2536M22112
$$ 720536 853305 729467 541484 877605 995616 856334 1042847 760390 782926 1205038
16489A205038l06240j42974K56191j96572k52496R8590j2151j72415P8015K72716
$$ 1205038 898798 755824 1012015 815443 562947 661537 649386 476971 554986 827702
16479H27702k89728K11863Q0335j18515L95559l24863J41596n7496k09161J59834
$$ 827702 537974 749837 830172 711657 1107216 782353 923949 866453 657292 817126
16469H17126K6817J61586l74687K38689k36428l7415J88513A80313L13432K01949
$$ 817126 843943 1005529 630842 869531 633103 595688 784201 180313 493745 695694
16459F95694k2902m0069N44143A92781N74352j94500O6007R6505j686k46249j46163
$$ 695694 672792 632723 1176866 192781 767133 572633 638640 735145 733459 487210 341047
16448C41047L50926J07226q3035j04503k3888j65288o7463L51810O1205P6796
$$ 341047 691973 799199 716164 611661 587773 422485 355022 706832 768037 844833
16438H44833C68323M33705l16671P9032L75891m02158J62580k43715J9792K98688
$$ 844833 368323 802028 485357 564389 940280 538122 700702 456987 476779 775467
16428G75467k77557J95022k51839B15367L50230B59049L43551A24429M32511A32761
$$ 775467 497910 692932 441093 215367 565597 259049 602600 124429 556940 132761
16417F44406j61162J60671j7652j62337k06728J76546j94320A13839O6645K43543
$$ 644406 483244 643915 626263 463926 257198 433744 239424 113839 180484 424027
16407D24027J66671K76167C20300J83873j32945j57709J40152J70692M1684o6945
$$ 424027 590698 866865 320300 504173 371228 213519 353671 524363 566047 499102
16397D99102q3859o5173J3188K33157I5879J13624Q9997J63465l2767L3798K19041
$$ 499102 415243 350070 363258 596415 95879 209503 299500 462965 430198 463996 683037
16386F83037A30447J78700p167m0579R1702j46722A01544J27662o0064K8760Q6222
$$ 683037 130447 309147 301980 261401 353103 206381 101544 229206 169142 197902 284124
16375B84124I4051J25399K72877A13490l2939R8384K36307G4051J54789R5494
$$ 284124 94051 219450 492327 113490 80551 178935 415242 74051 228840 324334
16365C24334R192N0085K50804A56054N305E0336A0472L57878A03039p969M17394
$$ 324334 333526 383611 634415 156054 161359 50336 10472 368350 103039 95070 512464
16354E12464r6983r2959l0348P7616A64749J48894i098C16940J5656J96219A78644
$$ 512464 415481 322522 292174 369790 164749 313643 -9098 316940 332596 528815 178644
16342A72499N5862J05057e492C45257K9331B6834K19992k3660a02683B50762L07433
$$ 172499 228361 333418 -5492 345257 374588 26834 246826 223166 -102683 250762 558195
16331E58195O6769A86303J3543K89704b050A01858i8571E8741K28605I1671J8090
$$ 558195 624964 186303 199846 489550 -2050 101858 -98571 58741 287346 91671 109761
16320A09761M5718J45143A06234K81147j53264l5439Q0773m848h750F8540K61579
$$ 109761 155479 300622 106234 387381 234117 198678 279451 274603 -8750 68540 330119
16309C30119b6842n1595B6017J75279f8370I7970J15381R1063r4762e0704A46975
$$ 330119 -26842 -78437 26017 201296 -68370 97970 213351 304414 209652 -50704 146975
16297C41773o5686O8617c55127A56728Q3010j6099r655e0191B64964c5424C25485
$$ 341773 276087 344704 -355127 156728 239738 223639 213984 -50191 264964 -35424 325485
16285A88541J36831C8921a47663D04659A10185a9134A46084Q0411I7008K69975
$$ 188541 325372 38921 -147663 404659 110185 -19134 146084 226495 97008 366983
16275C66983n4856q3586b0466G725K42747j24695a58520A11662f479F0916L68221
$$ 366983 312127 228541 -20466 7725 250472 125777 -158520 111662 -6479 60916 429137
16264D29137i4146A89684n320J69093C5452c7922A64636N4785j09310L09432g4061
$$ 429137 -94146 189684 184364 353457 35452 -37922 164636 219421 110111 419543 -74061
16252B91960j05402m7263j4389d552A07333J97076i0732B4011b77532j70755B24777
$$ 291960 186558 139295 124906 -4552 107333 304409 -90732 24011 -277532 -448287 224777
16240a16963K1328A51741G2469d07689B21857L8898r8172f4353B67017b0618l4373
$$ -116963 -95635 151741 72469 -407689 221857 260755 162583 -64353 267017 -20618 -54991
16229e4991j5960A38448e3265C05731A22088A4419a57422J1434A67529e1257B47696
$$ -54991 -70951 138448 -53265 305731 122088 14419 -157422 -145988 167529 -51257 247696
16217C11878d939l1210B71027b4209k17724M8979q2580A44022a69182r1798f7090
$$ 311878 -4939 -36149 271027 -24209 -241933 -192954 -275534 144022 -169182 -260980 -67090
16205C47086j68030a08775C7901b3512n2806b0205C32677a44589A83287C8800
$$ 347086 179056 -108775 37901 -23512 -76318 -20205 332677 -144589 183287 38800
16194g6190j13145B07004K18718A58200J06223E4381e3390j69514A76071q6018
$$ -76190 -189335 207004 425722 158200 264423 54381 -53390 -222904 176071 90053
16184I0053a13310I7458B0463d6062n2381A4625J82769B0892K38148b51077a11621
$$ 90053 -113310 97458 20463 -46062 -98443 14625 197394 20892 259040 -251077 -111621
16172A24019a14419B99024c323H4352M0701c05403A72001G8638b55835B45268
$$ 124019 -114419 299024 -3323 84352 125053 -305403 172001 78638 -255835 245268
16161e9051J7089l09633D9701K4156K270j9087g5044G2024b59856Ah5420m30927
$$ -59051 -41962 -351595 49701 73857 76127 57040 -75044 72024 -259856 1 -85420 -516347
16149e16347A28506J79945C7632J84563a73332h1242C06113b2597j44040C2486
$$ -516347 128506 308451 37632 222195 -173332 -81242 306113 -22597 -166637 32486
16138A25502C7908J25665a0126j73497A90982m2070c73626D7117M0381N560a16938
$$ 125502 37908 163573 -10126 -183623 190982 148912 -373626 47117 87498 93058 -116938
16126b0092C4801f6640j77272F7556i1049G2055L276b7826D2290m420b6738G285
$$ -20092 34801 -66640 -243912 67556 -91049 72055 75331 -27826 42290 37870 -26738 7285
16113d0701I890J46356b99554Q343C62611r4998g6359A92265M0816H4715J4192
$$ -40701 9890 156246 -299554 -291211 362611 267613 -76359 192265 233081 84715 98907
16102I8907f7187K5731A98599m5724C2812a30413B51233C4253J82717E9994N2769
$$ 98907 -67187 -41456 198599 152875 32812 -130413 251233 34253 216970 59994 112763
16091A12763a31660k89973a18034c2555p0580B04204a37670o0001P084k1794e0884
$$ 112763 -131660 -421633 -118034 -32555 -103135 204204 -137670 -197671 -190587 -212381 -50884
16079B59599C077a32878a2694A22077c993C4698O0574P9599N3272J33023A10268
$$ 259599 3077 -132878 -12694 122077 -3993 34698 95272 174871 228143 361166 110268
16067i5335l81854A31204l8739N1401a4956j23881O5122A28876c2868a684k06869
$$ -95335 -477189 131204 92465 143866 -14956 -138837 -73715 128876 -32868 -1684 -208553
16056b08553L2688O437j88085i3405c3907F0496d00291P7553B43309c06026A91727
$$ -208553 -175865 -169428 -357513 -93405 -33907 60496 -400291 -322738 243309 -306026 191727
16044a00848F2932a84042E4402K8804i7773F5830L6840e4315m75313g8423c6369
$$ -100848 62932 -184042 54402 83206 -97773 65830 102670 -54315 -529628 -78423 -36369
16032B73333H3735j3452f6313F4116d4978K2484A07535c6404k70790i7852j80146
$$ 273333 83735 70283 -66313 64116 -44978 -22494 107535 -36404 -307194 -97852 -277998
16021b77998K7074a0199j06711J6273D2752A3998P4873J33849p6772a00704C7248
$$ -277998 -250924 -10199 -116910 -100637 42752 13998 88871 222720 145948 -100704 37248
16009a16078j87686L1300i3165L8118k77357A62536b69896a02601m0835C3451
$$ -116078 -303764 -272464 -93165 -55047 -332404 162536 -269896 -102601 -143436 33451
15998e6013l09659C9079A3080Q7269O969l7255a17155C46170a69549e5511o18939
$$ -56013 -365672 39079 13080 100349 107318 70063 -117155 346170 -169549 -55511 -674450
15987f74450a19311A44106P9759a88701A66348a8860B98838J6342l887a74519
$$ -674450 -119311 144106 223865 -188701 166348 -18860 298838 315180 311293 -174519
15976a48459C2378J15550b07287a5969l12056e0748G5401i0495k68163J17702
$$ -148459 32378 147928 -207287 -15969 -328025 -50748 75401 -90495 -358658 -240956
15966b40956f0484A48062L48800b10420B76985a54780f8786b3709A9471a02033
$$ -240956 -60484 148062 496862 -210420 276985 -154780 -68786 -23709 19471 -102033
15955c7575A21094E2091a40737H712a37427A25894i3374A21237E5300J9663a55479
$$ -37575 121094 52091 -140737 8712 -137427 125894 -93374 121237 55300 74963 -155479
15943C1917J77499G5390c3236A02419a75068e5629C1860L9784J35381f2465f838
$$ 31917 209416 75390 -33236 102419 -175068 -55629 31860 71644 207025 -62465 -6838
15931d8486I9657a51412A10383K4808f8019M909D53502b0498k18096o3715B6759
$$ -48486 99657 -151412 110383 135191 -68019 -63110 453502 -20498 -238594 -302309 26759
15919A93738p2833c56204D3465a68601j03733M3995Q1349P1479A5683K41439c04577
$$ 193738 120905 -356204 43465 -168601 -272334 -228339 -146990 -75511 15683 257122 -304577
15907c8952k934j09637f0620m5073A28419e0732j16330a7546E0435J17635M788
$$ -38952 -41886 -151523 -60620 -105693 128419 -50732 -167062 -17546 50435 168070 172858
15896A72858g0064A61306h4738C06008a40810j10686F3532J08474e0068M525A73110
$$ 172858 -70064 161306 -84738 306008 -140810 -251496 63532 172006 -50068 -45543 173110
15884f9842C1691b59724E5151M5673a29445I1604i6125A61067a15068A27675e3068
$$ -69842 31691 -259724 55151 100824 -129445 91604 -96125 161067 -115068 127675 -53068
15872a56332B31082F0747e2921j20644l9490A18916C0387b31321A14599J5577
$$ -156332 231082 60747 -52921 -173565 -213055 118916 30387 -231321 114599 130176
15862A30176l8135a49882P2926F5584b50727d865j41661A65611c77108d0214a8514
$$ 130176 92041 -149882 -76956 65584 -250727 -4865 -146526 165611 -377108 -40214 -18514
15850F1558O0771g9520j02838K1197B53652P0273a1660F1320a16545e5203k16174
$$ 61558 122329 -79520 -182358 -161161 253652 323925 -11660 61320 -116545 -55203 -271377
15839b71377C44932j25982a68886I6113g2192k07144c9022j73654A55902a94217
$$ -271377 344932 218950 -168886 96113 -72192 -279336 -39022 -212676 155902 -194217
15828e1429q9320j46720j10055B12672a6045D5172A9575e8392A16722P7281I3184
$$ -51429 -140749 -287469 -397524 212672 -16045 45172 19575 -58392 116722 194003 93184
15816c80004a57172A13352g9843A05181c88867A14692b6018p8407j41917c7066
$$ -380004 -157172 113352 -79843 105181 -388867 114692 -26018 -104425 -246342 -37066
15805a22558B7167a5032A70170d1564A81899f1068j10125A79665E7413a76459
$$ -122558 27167 -15032 170170 -41564 181899 -61068 -171193 179665 57413 -176459
15794a90378P0513j11296A38950g0115j04878A32517b72324B25149g3207E4564
$$ -190378 -119865 -231161 138950 -70115 -174993 132517 -272324 225149 -73207 54564
15783B40998e4398A4978c9728G0397a42236o6860D0891e2304A36283f1649A85777
$$ 240998 -54398 14978 -39728 70397 -142236 -209096 40891 -52304 136283 -61649 185777
15771d6486j95925B30532E1226L09630a04323C36315d3656A66054m063g7756G5206
$$ -46486 -242411 230532 51226 360856 -104323 336315 -43656 166054 161991 -77756 75206
15759e7233A48535O4481i3269C18092B1217J97887a95445k63876c8527A04411
$$ -57233 148535 213016 -93269 318092 21217 219104 -195445 -459321 -38527 104411
15748c10860e8231B87585p7190J23291b22776r7070A56107a94953h1297G8789
$$ -310860 -58231 287585 210395 333686 -222776 -319846 156107 -194953 -81297 78789
15737a86519p493P5756M6553j90204c6334j44526A74463b14213C4496a0353o0152
$$ -186519 -194012 -118256 -71703 -261907 -36334 -180860 174463 -214213 34496 -10353 -70505
15726g0505j09627j01933a23870j4879j20742A0855q36d59393h751r9318L4483
$$ -70505 -180132 -282065 -123870 -138749 -259491 10855 10019 -459393 -8751 -108069 -73586
15715g3586j22301A68701b64289A01229b45014F4026L526h611B848a3474j26095
$$ -73586 -195887 168701 -264289 101229 -245014 64026 67552 -8611 2848 -13474 -139569
15704a39569A75998d7692o3756N1426l5890D9593a54569j15532I1798m2233J05401
$$ -139569 175998 -47692 -111448 -60022 -95912 49593 -154569 -270101 91798 49565 154966
15693A54966O369D090a03339C10712q4053F5761Q3572a62435E7144a50383A99388
$$ 154966 161335 4090 -103339 310712 226659 65761 149333 -162435 57144 -150383 199388
15681a20832n864G1448e9631F8923N4514c18756a43573q7009D7459a52649e2562
$$ -120832 -126696 71448 -59631 68923 123437 -318756 -143573 -230582 47459 -152649 -52562
15669b5859J0433A31329d3650k4714H7062d2054H2154b83678B4481J82622B2654
$$ -25859 -15426 131329 -43650 -68364 87062 -42054 82154 -283678 24481 207103 22654
15657b71138l6947a30797A47092Q5386b53342H6932i336k13496I1479a87396j07989
$$ -271138 -308085 -130797 147092 232478 -253342 86932 -9336 -222832 91479 -187396 -295385
15646b95385q9812A24866F180a06614Q075o7821O4135H732M3872a81335g8988
$$ -295385 -385197 124866 6180 -106614 -98539 -166360 -102225 8732 52604 -181335 -78988
15634b28022p6941J37663f514q7714m9988a4580l1980b3009C6706a62541O6274
$$ -228022 -304963 -167300 -6514 -94228 -144216 -14580 -46560 -23009 36706 -162541 -96267
15623i6267c3272m1442A97744L4178F7872J39431N5440a07285E7130b6406j07295
$$ -96267 -33272 -74714 197744 231922 67872 207303 262743 -107285 57130 -26406 -133701
15612a33701b976j9813F2177g7239j62644K4600e5830A76650B1517J03178a80058
$$ -133701 -2976 -22789 62177 -77239 -239883 -215283 -55830 176650 21517 124695 -180058
15600b6777l18577a11925A4646R0068d04753f8640m4600A85773b0578I7373G756
$$ -26777 -345354 -111925 14646 104714 -404753 -68640 -113240 185773 -20578 97373 7756
15588A71753O2580f912j85130A27321C4439b05267P6670B23083c16647h7786A32359
$$ 171753 234333 -6912 -192042 127321 34439 -205267 -128597 223083 -316647 -87786 132359
15576d75857g7425A3510c28952E1979N5117j7460o884b88327c5534B1884f2254
$$ -475857 -77425 13510 -328952 51979 107096 89636 82752 -288327 -35534 21884 -62254
15564B62834d7648j95314e3728A67207B7260c2771l757B07930p1517b78048a29355
$$ 262834 -47648 -242962 -53728 167207 27260 -32771 -36528 207930 136413 -278048 -129355
15552a4985p5264I7977b52795C40995A32517a94915Q4348j83748A36847n6032
$$ -14985 -90249 97977 -252795 340995 132517 -194915 -110567 -294315 136847 80815
15542H0815K32767i5338C56502a23605j05101C33306H223J14976i4689B33797
$$ 80815 313582 -95338 356502 -123605 -228706 333306 8223 123199 -94689 233797
15531b29231E4379K42992g6373a359k54968C13777a67904j19707B4029J9733J08513
$$ -229231 54379 297371 -76373 -1359 -256327 313777 -167904 -287611 24029 43762 152275
15520A52275p4025B0474d22977A87718l6639C9291A3843J7103J35120O21a08204
$$ 152275 78250 20474 -422977 187718 151079 39291 13843 30946 166066 166687 -108204
15508g3086I218b68324J14560G9734h9995j4319G9843g3043j054A10654b5961
$$ -73086 9218 -268324 -153764 79734 -89995 -104314 79843 -73043 -74097 110654 -25961
15496g4783A66433a53767m5917A16129L63542B8234b92887g5362b7655C4530K00315
$$ -74783 166433 -153767 -199684 116129 479671 28234 -292887 -75362 -27655 34530 234845
15485B34845c0881F6206a34415j87917M91C4252d3745m31637b34654b5743G655
$$ 234845 -30881 66206 -134415 -322332 -321841 34252 -43745 -475382 -234654 -25743 7655
15473a69019c1272j62435Q8592c0683A28268d1818B15501D2555R9361d35011C15636
$$ -169019 -31272 -193707 -105115 -30683 128268 -41818 215501 42555 141916 -435011 315636
15461B17175q9354b63291A55536E6175a42503c8149F7638c68015A03852J22037
$$ 217175 127821 -263291 155536 56175 -142503 -38149 67638 -368015 103852 225889
15451B25889E7060i0023I2656N5983o7781b43687m0763A06846c6817A3799d6582
$$ 225889 57060 -90023 92656 148639 80858 -243687 -284450 106846 -36817 13799 -46582
15439f0647G7824b7697I3008i1687B21921a25162J6609A34159b42043e5733K6731
$$ -60647 77824 -27697 93008 -91687 221921 -125162 -108553 134159 -242043 -55733 -29002
15428b9002c591r893A47913a50779L7600N4062B28598f0270j85492b5346F6619
$$ -29002 -3591 -13484 147913 -150779 -113179 -59117 228598 -60270 -245762 -25346 66619
15416f6095A03884H555g8162j74214g4242J5801n6952E8843b23009A78233B187
$$ -66095 103884 8555 -78162 -252376 -74242 -58441 -115393 58843 -223009 178233 2187
15404b23082j98487B07370b68377G0511c4891k04239g1390A20080K9333i9960
$$ -223082 -421569 207370 -268377 70511 -34891 -239130 -71390 120080 149413 -99960
15393C1297J29020a23186k29388G9733J56592b62733D4163J47680E9681J24127
$$ 31297 160317 -123186 -352574 79733 236325 -262733 44163 191843 59681 183808
15383A83808J01173c795E5000a9498A6492a78432A6116K60894B3312a62025M4934
$$ 183808 284981 -3795 55000 -19498 16492 -178432 16116 277010 23312 -162025 -117091
15372a17091E5037A4456J87348j3701a08526G8858c75269J37681P2400e6995j11218
$$ -117091 55037 14456 201804 188103 -108526 78858 -375269 -237588 -165188 -56995 -168213
15361a68213A33436n922P1008E007c6938q5908D4620g4339f007j4786A87215a46361
$$ -168213 133436 127514 198522 5007 -36938 -122846 44620 -74339 -6007 -20793 187215 -146361
15348b2221j89480e3452A03086D87d34074b4578B04281C9130c4103l72953J53885
$$ -22221 -211701 -53452 103086 487 -434074 -24578 204281 39130 -34103 -407056 -253171
15337b53171C05143H5995c1391A75478a21846A25406J71038C4474b56415D9604
$$ -253171 305143 85995 -31391 175478 -121846 125406 296444 34474 -256415 49604
15326A33484I993a11257B08914J50655j69795a45421B48727E9104J54685a76197
$$ 133484 9993 -111257 208914 359569 189774 -145421 248727 59104 213789 -176197
15315b20485j8576B15521a09796m96472C21925n8661a31235d8785k05758i3858
$$ -220485 -239061 215521 -109796 -606268 321925 263264 -131235 -48785 -254543 -93858
15304c7946A2682R1670a92845H9123a14147l2062A38131F3644B6396I908d2125
$$ -37946 12682 104352 -192845 89123 -114147 -146209 138131 63644 26396 9908 -42125
15292B7712b78143J20778O6924B30288a7919H8766E221b34275Q5498B00089a35382
$$ 27712 -278143 -157365 -90441 230288 -17919 88766 5221 -234275 -148777 200089 -135382
15280b22195E1605O9272J11093c112D7535h3353A33196a51457H6255r105l5513
$$ -222195 51605 120877 231970 -3112 47535 -83353 133196 -151457 86255 77150 41637
15269D1637L279j6419f2929A48119L5066E1284K66408c08481C16777a41435N7905
$$ 41637 44916 28497 -62929 148119 183185 51284 317692 -308481 316777 -141435 -83530
15258h3530c7176A77932a66114M4085I7438J09121J28562A898J03863N3877Q97046
$$ -83530 -37176 177932 -166114 -122029 97438 206559 335121 1898 105761 159638 1056684
15247A056684l0391j06419K6749l27902A2100a82830A0483N0934n742j4709Q9623
$$ 1056684 1026293 919874 946623 618721 12100 -182830 10483 61417 55675 40966 130589
15236A30589c4941E8346J2689C0024J28902i5767B35539a89755g991q9382l68575
$$ 130589 -34941 58346 71035 30024 158926 -95767 235539 -189755 -7991 -97373 -465948
15225d65948b1582j4126A41394m7242c3861l25823A12333C4782J48858R7322o4573
$$ -465948 -21582 -35708 141394 94152 -33861 -359684 112333 34782 183640 280962 216389
15214B16389n3905a78541B78291e8693p2235C23681o4437b33800C82368A90000
$$ 216389 162484 -178541 278291 -58693 -130928 323681 259244 -233800 382368 190000
15203A51241L2887l6695j7239a00139A775J51361h7205l1259E1301b8354A66820
$$ 151241 184128 147433 130194 -100139 1775 153136 -87205 -118464 51301 -28354 166820
15191a41332A01679L3617m1622J55657a1940A62256J6608g9400J106A42832c5944
$$ -141332 101679 135296 93674 249331 -11940 162256 178864 -79400 -78294 142832 -35944
15179h9633A72437E2958M9686J18742K65263g7800C56118Q9961b7300a0426j36328
$$ -89633 172437 52958 102644 221386 486649 -77800 356118 446079 -27300 -10426 -146754
15168a46754B59819a7587A34212K9760J18619i493B60854g6984H1414a32776l3733
$$ -146754 259819 -17587 134212 163972 282591 -9493 260854 -76984 81414 -132776 -166509
15157a66509A49469J68073a27357F6411J68331m396n9781J71185f4621A49735
$$ -166509 149469 317542 -127357 66411 234742 230346 170565 341750 -64621 149735
15146A56115C8187R4838a72004A10929K16811j14996m2678A89K3685K2909J08766
$$ 156115 38187 133025 -172004 110929 327740 212744 170066 189 23874 46783 155549
15135A55549J05084j2697D910L55040a531A20121J34883p6896C6602J03338b50294
$$ 155549 260633 247936 4910 359950 -1531 120121 255004 178108 36602 139940 -250294
15123B66812G904J6553K15407a85490B10808Q2513K44834f5530k39912H709N077
$$ 266812 7904 24457 239864 -185490 210808 293321 538155 -65530 -305442 8709 13786
15112A3786J11372g6396E0460L44081e0517A18147j2580C626b61737b2759F5513
$$ 13786 125158 -76396 50460 394541 -50517 118147 105567 3626 -261737 -22759 65513
15100B06881K92764k13366j36756j1231K8968b31426A40480c11448B9438J10263
$$ 206881 499645 286279 149523 138292 167260 -231426 140480 -311448 29438 139701
15090A39701a47096P1615G4699L0925K26943b36025B59653j26963j9346K65223
$$ 139701 -147096 -75481 74699 105624 332567 -236025 259653 132690 113344 378567
15080C78567j76567a41489B99993m5289o4866M40569A06607e7468m446C46435
$$ 378567 202000 -141489 299993 254704 189838 630407 106607 -57468 -61914 346435
15069A29848a73499J8354A42242J13679r2780J37344P8647j77202I593K45804
$$ 129848 -173499 -155145 142242 255921 163141 300485 379132 201930 9593 255397
15059B55397a7024j10020G4972Q3592a767A47373G1410K81996g6347k47862J24210
$$ 255397 -17024 -127044 74972 158564 -1767 147373 71410 353406 -76347 -324209 -199999
15048a99999H2375L8678n410D9443J60649f0707A00518Q1672A6615Q5671M8404
$$ -199999 82375 121053 115643 49443 210092 -60707 100518 182190 16615 102286 150690
15037A50690l1995b306B64188o3908K93118k05811J7970A22591J01876N1954K5347
$$ 150690 118695 -2306 264188 200280 493398 287587 305557 122591 224467 276421 301768
15026C01768e2680C70534j04915Q041k8333L6168M7177i6196B10692J59062A61817
$$ 301768 -52680 370534 265619 273660 245327 281495 328672 -96196 210692 369754 161817
15014g3615A58494L8548a67798D8402J86783e4470l709C0060J99768r9685J2330
$$ -73615 158494 197042 -167798 48402 235185 -54470 -58179 30060 229828 130143 142473
15003A42473D4808J92605a08250D45932C7363H717J0045L7856M4663J16722m4689
$$ 142473 44808 237413 -108250 445932 37363 8717 18762 56618 101281 218003 173314
14992A73314E408a05378B19986K2548k348P7961j29858n9854L45239A32231N0528
$$ 173314 5408 -105378 219986 242534 240186 318147 188289 128435 473674 132231 182759
14981A82759P1066g7661q9147o3482C49932K7556P3569B7564J20839Q5163J13875
$$ 182759 253825 -77661 -166808 -230290 349932 377488 451057 27564 148403 233566 347441
14970C47441b3990B89546n7295J5372l5022M3070P5359R3318j7201A88762M3883
$$ 347441 -23990 289546 232251 247623 212601 255671 331030 424348 407147 188762 232645
14959B32645q2702J54110j14052R3813G5215J3022J66410Q8701l4243M7402J27088
$$ 232645 149943 304053 190001 283814 75215 88237 254647 343348 309105 356507 483595
14948D83595m9017M0433F5301g7503I1627j4810M21982A82280f5004D8147L80668
$$ 483595 434578 475011 65301 -77503 91627 76817 498799 182280 -65004 48147 428815
14937D28815B05325O5814j10302l4688J79033l7880L0382J38841A81259R362o7237
$$ 428815 205325 271139 160837 126149 305182 267302 297684 436525 181259 190621 123384
14926A23384l2114J53622J10869A45108F0727N30677k52158a80401D28539D9545
$$ 123384 91270 244892 355761 145108 60727 591404 339246 -180401 428539 49545
14915C39191q066A54959K0519J1357D134L80834P1917j17532L51928A42620R9328
$$ 339191 331125 154959 175478 186835 4134 384968 456885 339353 691281 142620 241948
14904B41948o1521L10854A82226K96418B21015m5243K89076K00217A43282K37549
$$ 241948 180427 491281 182226 478644 221015 175772 464848 665065 143282 380831
14894C80831p5836J10072k02684K20466j80309K13167j09193j4519E5413J04484
$$ 380831 304995 415067 212383 432849 252540 465707 356514 341995 55413 159897
14884A59897J53210J85306A92619J09941J20929r9602o7788o1857J50294j55851
$$ 159897 313107 498413 192619 302560 423489 323887 256099 194242 344536 188685
14874A88685K96026N7401k06766r4120J58957j43937K16448j81806K5142J3551
$$ 188685 484711 542112 335346 241226 400183 256246 472694 290888 316030 329581
14864C29581A22323N8213P1157J51940J91607o8754K394p6116f5718C33058N23
$$ 329581 122323 180536 251693 403633 595240 526486 528880 452764 -65718 333058 333581
14853C33581A46338L40163j76528K49669N67788C80078P877J09662j36643A52686
$$ 333581 146338 486501 309973 559642 1127430 380078 387955 497617 360974 152686
14842C50832M5982l1454j58772K20199j75305K09922j04693K38805j46790m8995
$$ 350832 396814 365360 206588 426787 251482 461404 356711 595516 448726 399731
14832C99731J7214m3140R5780j87988p0206M81596B54447M33712k55292K51688
$$ 399731 416945 373805 469585 281597 211391 692987 254447 688159 432867 684555
14822F84555j28834j18242J834q9800j7297K84031L2273Q3168k77626K31766o732
$$ 684555 555721 437479 439313 349513 332216 616247 648520 731688 454062 685828 679096
14811F79096k32771A99024B7504L10470J3075K26034j60328J31799j10633K21027
$$ 679096 446325 199024 27504 337974 351049 577083 416755 548554 437921 658948
14801F58948j06851j41160j11183K01698L36790A41802M04848k52358K57660L62212
$$ 658948 552097 410937 299754 501452 838242 141802 546650 294292 551952 914164
14791I14164C00873L88183J14408k82032K85590l77119J24816o7865Q2008j68557
$$ 914164 300873 689056 803464 521432 807022 429903 554719 486854 568862 400305
14781D00305P213N22076C81400k7773K13606l2302k30242L23091J15744j91039
$$ 400305 407518 929594 381400 353627 567233 534931 304689 627780 743524 552485
14771E52485J19709j64314k29361J05032l7714K00920N58126C29879M07195j50337
$$ 552485 672194 507880 278519 383551 345837 546757 1104883 329879 737074 586737
14761E86737j84759L0014k5353K35205j6804j34246p4346M46716k45213j19224
$$ 586737 401978 431992 406639 641844 625040 490794 416448 863164 617951 498727
14751D98727J11579M518J2867j30673J79775j65417P6320Q6590L61868l85807
$$ 498727 610306 614824 627691 497018 676793 511376 587696 674286 1036154 650347
14741F50347M44513k99902j2649k84340M29033K9841k59628o3427O9682K24963
$$ 650347 1094860 794958 782309 497969 927002 956843 697215 633788 703470 928433
14731I28433j33602j28442J74070k34769K28386K33666k73111k1427p8755J29939
$$ 928433 794831 666389 840459 605690 834076 1067742 794631 773204 694449 824388
14721H24388k75555B66805K00925J26549K08334N1620K58300k27573J66554m42192
$$ 824388 548833 266805 467730 594279 802613 854233 1112533 884960 1051514 609322
14711F09322L03630l52243K84853j31254R9379j86362K78439L72375l88902J5247
$$ 609322 912952 560709 845562 714308 813687 627325 905764 1278139 889237 904484
14701I04484k03250O1839j66374M8460P6394n6289K99431J10387J34725k99549
$$ 904484 701234 763073 596699 645159 721553 665264 964695 1075082 1209807 910258
14691I10258j31389J5063j06341k89714N42397P9752k55033K2304M46193j98263
$$ 910258 778869 793932 687591 397877 940274 1020026 764993 787297 1233490 1035227
14681A035227j88243N1161l7593K07468m14356L23379L7149J91731l20412J8470
$$ 1035227 846984 898145 860552 1068020 653664 977043 1014192 1205923 885511 903981
14671I03981k01678M39094k67894P2081j37874L82530j50194k2278j87740J74849
$$ 903981 702303 1141397 873503 945584 807710 1190240 1040046 1017768 830028 1004877
14661A004877J81035j00756j27395K4858J11056L7706j12742l6190N4440J71425
$$ 1004877 1185912 1085156 957761 982619 1093675 1131381 1018639 982449 1036889 1208314
14651A208314Q9878j30163J19312k14911m6142R2114O4806L9304p3526j56590
$$ 1208314 1298192 1168029 1287341 1072430 1026288 1118402 1183208 1222512 1148986 992396
14641I92396J99334J81784m5979k42402Q8588L9627K89773k74675L55105m00543
$$ 992396 1191730 1373514 1327535 1085133 1173721 1213348 1503121 1228446 1583551 1183008
14631A183008J04381m3069K52770J3088k36871o9492P8834N92726o00631n5606
$$ 1183008 1287389 1244320 1497090 1510178 1273307 1203815 1282649 1875375 1274744 1219138
14621A219138J17558j24533K17838L31551k75452j29621J13165R2839k49768L92098
$$ 1219138 1336696 1212163 1430001 1761552 1486100 1356479 1469644 1562483 1312715 1704813
14611A704813k53330J52453j36107J1722L93857l02326L47799k27895k23552K02081
$$ 1704813 1451483 1603936 1467829 1479551 1873408 1571082 1918881 1690986 1467434 1669515
14601A669515l25956J32222K90545j79469J02559M0248j29271m3255J57057K1084
$$ 1669515 1343559 1475781 1766326 1586857 1689416 1729664 1600393 1557138 1714195 1735279
14591A735279J76815j51509L15663j27439j18074k92241N48618m9655J92193m62473
$$ 1735279 1912094 1760585 2076248 1948809 1830735 1538494 2087112 2037457 2229650 1767177
14581A767177j20576N20337k93450J89495l0413J80516q3380J22858j03308l9938
$$ 1767177 1646601 2166938 1873488 2062983 2032570 2213086 2129706 2252564 2149256 2109318
14571B109318J42003l56831J41521M86925q1625k40410N20633j62462l9811k66123
$$ 2109318 2251321 1894490 2036011 2522936 2441311 2200901 2721534 2559072 2519261 2253138
14561B253138J25302L08574J03677P2910j50551M11658n7588J49877J06374O17126
$$ 2253138 2378440 2687014 2790691 2863601 2713050 3124708 3067120 3216997 3323371 3940497
14551C940497N94860P05671J802837M218031Q791932J9234228J5050760B2864348
$$ 3940497 4535357 5241028 7043865 11261896 20053828 39288056 54338816 22864348
14542H579341m179412j317292o83855J73811l04965k95498j07216k58838L32423
$$ 8579341 4399929 3082637 2398782 2572593 2267628 1972130 1864914 1606076 1938499
14533A938499K25386n09366M89900Q3234M2855j85050L03607J55045j44336J4285
$$ 1938499 2163885 1654519 2144419 2227653 2270508 2085458 2389065 2544110 2399774 2414059
14523B414059k50609M66200j61797J499K8785K34463l72669K72396J9852m4426
$$ 2414059 2163450 2629650 2467853 2469352 2498137 2732600 2359931 2632327 2652179 2607753
14513B607753k1766J21512K1263P3831N9479N641M7916L3170P8876r4248J97293
$$ 2607753 2585987 2707499 2728762 2802593 2862072 2867713 2915629 2948799 3027675 2933427 3130720
14502C130720j40626Q3750K18133j40322M28858j29105J17691l65748K11337R6200
$$ 3130720 2990094 3073844 3291977 3151655 3580513 3451408 3569099 3203351 3414688 3510888
14492C510888J51940q7016M39823l09674n4706j37762K81771J15935k41606J07615
$$ 3510888 3662828 3575812 4015635 3705961 3651255 3513493 3795264 3911199 3669593 3777208
14482C777208L11986l30965J87524j55875K47496K04994l22871k9470N2477M54677
$$ 3777208 4089194 3758229 3945753 3789878 4037374 4242368 3919497 3890027 3942504 4397181
14472D397181Q0001p7812L0150k80786Q36852j45550l44207N12985l36923O715
$$ 4397181 4477182 4399370 4429520 4148734 4985586 4840036 4495829 5008814 4671891 4678606
14462D678606L68415J32436K3194r28770P08989K89421M3877r5228J09022j95558
$$ 4678606 5047021 5179457 5202651 4273881 4982870 5272291 5316168 5220940 5329962 5134404
14452E134404M58680q7828M7993J48305J79413m5735l23463N2150N02724M5875
$$ 5134404 5593084 5505256 5553249 5701554 5880967 5835232 5511769 5563919 6066643 6112518
14442F112518k87640N38279j24419k36064K39779L28201j58550J93972k91944
$$ 6112518 5824878 6363157 6238738 6002674 6242453 6570654 6412104 6606076 6314132
14433F314132N03455L78336l17813L85432k27182K79877J45653J38334j39523
$$ 6314132 6817587 7195923 6878110 7263542 7036360 7316237 7461890 7600224 7460701
14424G460701j26647M15783K5250M09397j79404N30316n03786J36808M72269L29280
$$ 7460701 7334054 7749837 7775087 8184484 8005080 8535396 8031610 8168418 8640687 8969967
14414H969967o3056j24593L78932N7331L38791j93345M93883j00239o7392N49210
$$ 8969967 8906911 8782318 9161250 9218581 9557372 9364027 9857910 9757671 9690279 10239489
14404A0239489N2220j10391J29669K67670K43182J43314j05716M47915M04178
$$ 10239489 10291709 10181318 10310987 10578657 10821839 10965153 10859437 11307352 11711530
14395A1711530O5052J75213K91632m11202P15918k24966N25595K63025M54493
$$ 11711530 11776582 11951795 12243427 11832225 12548143 12323177 12848772 13111797 13566290
14386A3566290P9261J65910L6898L86016L19651M20306k4411K57087M08913P52018
$$ 13566290 13645551 13811461 13848359 14234375 14554026 14974332 14949921 15207008 15615921 16367939
14376A6367939j23510K12654N84623K03538M01071Q4749K96036P93917L8113N41852
$$ 16367939 16244429 16457083 17041706 17245244 17646315 17731064 18027100 18821017 18859130 19400982
14366A9400982N14464N20717K41353M25341J08631Q56742M46548M11598O41819
$$ 19400982 19915446 20436163 20677516 21102857 21211488 22068230 22514778 22926376 23568195
14357B3568195K04068Q65639N77134O12009M33004P24790M12033P75524Q95659
$$ 23568195 23772263 24637902 25215036 25827045 26260049 26984839 27396872 28172396 29068055
14348B9068055O93853P97299P88272P89753O58653O73687J115081J090586O76486
$$ 29068055 29761908 30559207 31347479 32137232 32795885 33469572 34584653 35675239 36351725
14339C6351725J167911J157112J380683Q09231J210734J228314J344077J465601
$$ 36351725 37519636 38676748 40057431 40866662 42077396 43305710 44649787 46115388
14331D6115388J361856J206181J813654J406509J509798J906750J593869K159012
$$ 46115388 47477244 48683425 50497079 51903588 53413386 55320136 56914005 59073017
14323E9073017K145795J902241K098403K463955K202014K620281L090293K578234
$$ 59073017 61218812 63121053 65219456 67683411 69885425 72505706 75595999 78174233
14315G8174233L046024K939026L106449L626692M035771L530365M353602M538789
$$ 78174233 81220257 84159283 87265732 90892424 94928195 98458560 102812162 107350951
14307A07350951M029895N120085N332119N330923N848701O145000O542338O971557
$$ 107350951 111380846 116500931 121833050 127163973 133012674 139157674 145700012 152671569
14299A52671569P141745P678570Q278714Q642747R066360R935878J0150721J0715063
$$ 152671569 159813314 167491884 175770598 184413345 193479705 203415583 213566304 224281367
14291B24281367J1748655J2083613J2491335J3297044J3809509J3917937J4683634
$$ 224281367 236030022 248113635 260604970 273902014 287711523 301629460 316313094
14284C16313094J4919502J5600141J5429341J5485386J5515770J4920146J3772134
$$ 316313094 331232596 346832737 362262078 377747464 393263234 408183380 421955514
14277D21955514J3032142J2111285J0348233Q501001N446684J294336o85697q7078
$$ 421955514 434987656 447098941 457447174 465948175 471394859 472689195 472003498 471916420
14269D71916420O39152l235861m999734p291846q268431r879218j1729318j3288642
$$ 471916420 472555572 469319711 464319977 457028131 448759700 438880482 427151164 413862522
14261D13862522j4084731j5199347j5416209j5707070j5797724j5250866j4412440
$$ 413862522 399777791 384578444 369162235 353455165 337657441 322406575 307994135
14254C07994135j4277531j4189833j3536506j2887260j2051729j2192486j0660920
$$ 307994135 293716604 279526771 265990265 253103005 241051276 228858790 218197870
14247B18197870j0761492j0188086r386975q091265q679374p880763p516006p401779
$$ 218197870 207436378 197248292 187861317 179770052 171090678 163209915 155693909 148292130
14239A48292130o501401n885223n816220n493046n462613n125275n150155l896551
$$ 148292130 141790729 135905506 130089286 124596240 119133627 114008352 108858197 104961646
14231A04961646l496813m195192m312304l137333l719794k947170l141884k941947
$$ 104961646 101464833 97269641 92957337 89820004 86100210 83153040 80011156 77069209
14223G7069209k735622k763849k281983j968906k437103k339520k192580j981194
$$ 77069209 74333587 71569738 69287755 67318849 64881746 62542226 60349646 58368452
14215E8368452j223435k117867j508141j476349j812197j448507j323256j554437
$$ 58368452 57145017 55027150 53519009 52042660 50230463 48781956 47458700 45904263
14207D5904263o32192j146632j688503j355962r73174j377863r81661k66638j061445
$$ 45904263 45272071 44125439 42436936 41080974 40107800 38729937 37748276 37481638 36420193
14198C6420193j505650n84849j212112l78322p86440q04147r24626p86884n08915
$$ 36420193 34914543 34329694 33117582 32739260 31952820 31148673 30224047 29437163 28928248
14189B8928248p08990p89709o50494p71564l52664p53197o39741o13531J85659
$$ 28928248 28219258 27429549 26779055 26007491 25654827 24901630 24261889 23648358 23834017
14180B3834017p58497o56053m23345j04774o55231l43572p07841l76913j33238
$$ 23834017 23075520 22419467 21996122 21891348 21236117 20892545 20184704 19807791 19674553
14171A9674553o03840j30114n67026k18039k26869p51343J05478n40048n68960
$$ 19674553 19070713 18940599 18373573 18155534 17928665 17177322 17282800 16742752 16173792
14162A6173792J0254l0421k73790n64889k81547K08778l10290j42735q41936k0059
$$ 16173792 16184046 16153625 15879835 15314946 15033399 15242177 14931887 14789152 13947216 13927157
14152A3927157p2896m72237m433l88488n5446j25875m55772P6587m71355j11889
$$ 13927157 13854261 13382024 13377591 12989103 12933657 12807782 12352010 12428597 11957242 11845353
14142A1845353k35566J6173n02045M908p4303l90969p9199k10229j87313l7981
$$ 11845353 11609787 11625960 11123915 11128823 11054520 10663551 10584352 10374123 10186810 10148829
14132A0148829k29827k08627L49379o77874J1532R7680L2938p35091K83829j09996
$$ 10148829 9919002 9710375 10059754 9381880 9393412 9491092 9524030 8788939 9072768 8962772
14122H962772j48965l29749J02151m87293L9198j96907L20258k62914k81193J71695
$$ 8962772 8813807 8484058 8586209 8098916 8138114 7941207 8261465 7998551 7717358 7889053
14112G889053m26898k31390O06660l59534j31594k24202p2491j50829R1184j9010
$$ 7889053 7462155 7230765 7837425 7477891 7346297 7122095 7049604 6898775 6989959 6970949
14102F970949n17150M28587m29681J77858l37684N0676k89894L36661j63220k71997
$$ 6970949 6453799 6882386 6452705 6630563 6292879 6343555 6053661 6390322 6227102 5955105
14092E955105L73353l08347p5603N6781j86784r1754L42771n06257j0674N9144
$$ 5955105 6328458 6020111 5944508 6001289 5814505 5722751 6065522 5559265 5548591 5607735
14082E607735l47718n1042J93762k44344j97817L92643l91671j38829J17667R6075
$$ 5607735 5260017 5208975 5402737 5158393 4960576 5353219 4961548 4822719 4940386 5036461
14072E036461l59862n591R2215j1202J15826l07851n11488M14875L03310n31762
$$ 5036461 4676599 4671008 4763223 4752021 4867847 4559996 4048508 4463383 4766693 4234931
14062D234931M20938m32696J25330J29639J11990n47373K72201j17584m4575j83725
$$ 4234931 4655869 4223173 4348503 4478142 4590132 4042759 4314960 4197376 4152801 3969076
14052C969076J26810m5427k51520K11533l29915L14488k85746r8341J35679n1746
$$ 3969076 4095886 4050459 3798939 4010472 3680557 3995045 3709299 3610958 3746637 3694891
14042C694891m10386M00821k63643L7518K63943k51275j85348O6553J70569k88944
$$ 3694891 3284505 3685326 3421683 3459201 3723144 3471869 3286521 3353074 3523643 3234699
14032C234699q6431K20520J50318p504k90827j78993L2807K35269j92769m1811
$$ 3234699 3148268 3368788 3519106 3511602 3220775 3041782 3074589 3309858 3117089 3075278
14022C075278L00990k20222J7669L1726k38683J01955k93611r8503J56458o9826
$$ 3075278 3376268 3156046 3173715 3205441 2966758 3068713 2775102 2676599 2833057 2763231
14012B763231o14685K43098M47438M3892k33397p9191n3315O1140J40776m53602
$$ 2763231 2148546 2391644 2839082 2882974 2649577 2570386 2517071 2578211 2718987 2265385
14002B265385M32718j98216L2764k28850O0109Q9556j22819k59245L59178J29334
$$ 2265385 2698103 2499887 2532651 2303801 2363910 2453466 2330647 2071402 2430580 2559914
13992B559914m59560J80166J86033Q13852K743950O746726J7843811K5021352
$$ 2559914 2100354 2280520 2466553 3280405 6024355 12771081 30614892 55636244
13984E5636244k6342252A4191575n536828k327422r24719n75540p95559n36597
$$ 55636244 29293992 14191575 8654747 6327325 5402606 4827066 4031507 3494910
13976C494910j2807m65600j7455j46515L09745l50751R3089o3388L05156n18294
$$ 3494910 3482103 3016503 2999048 2852533 3162278 2811527 2904616 2841228 3146384 2628090
13966B628090J7060l2375K9456k45383k26608O42465j26372k49490k63332L29788
$$ 2628090 2645150 2612775 2642231 2396848 2170240 2812705 2686333 2436843 2173511 2503299
13956B503299k97243K6599L1605o7774r1112o81K30186j24088j15342j30977k1544
$$ 2503299 2206056 2232655 2264260 2196486 2105374 2104693 2334879 2210791 2095449 1964472 1942928
13945A942928J00137P0301J9479j03298l6272j2816N8868J27598l92940p1949
$$ 1942928 2043065 2113366 2132845 2029547 1993275 1980459 2039327 2166925 1773985 1702036
13935A702036J38648j43243q9659N1966N36112n18065L81280j57884j73412K86623
$$ 1702036 1840684 1697441 1607782 1659748 2195860 1677795 2059075 1901191 1727779 2014402
13925B014402k96082L9822L8170K02696j36621j30859j4175k98058R2353L1246
$$ 2014402 1718320 1758142 1796312 1999008 1862387 1731528 1717353 1419295 1511648 1542894
13915A542894J43490j75470k52495K49175J499J98818J3798P4165l77589O8738
$$ 1542894 1686384 1510914 1258419 1507594 1509093 1707911 1721709 1795874 1418285 1487023
13905A487023M23878j92289q6969m26148M69899J07696l19390K36106p7407k61536
$$ 1487023 1910901 1718612 1631643 1205495 1675394 1783090 1463700 1699806 1622399 1360863
13895A360863L93436j87954j20230J6610J59167k90162J3385R7848n3460p0876
$$ 1360863 1754299 1566345 1446115 1462725 1621892 1331730 1345115 1442963 1389503 1318627
13885A318627r1827J45902K20720j66177k3313j97034K00599j01661j53456J17406
$$ 1318627 1226800 1372702 1593422 1427245 1403932 1206898 1407497 1305836 1152380 1269786
13875A269786j7193J17163J39834k95088N3885J60345n5493J06719k28875J1017
$$ 1269786 1252593 1369756 1509590 1214502 1268387 1428732 1373239 1479958 1251083 1262100
13865A262100R614K01604n3425O8359j49837j21624K3529j90900L11986j26774
$$ 1262100 1271714 1473318 1419893 1488252 1338415 1216791 1240320 1049420 1361406 1234632
13855A234632j16940J26020j53561K29888n91620K31209J82924k90294M58521
$$ 1234632 1117692 1243712 1090151 1320039 728419 959628 1142552 852258 1310779
13846A310779k79661l6831K60666j98627K41457o7886k46413j76354j3275K67462
$$ 1310779 1031118 994287 1254953 1056326 1297783 1229897 983484 807130 793855 1061317
13836A061317J52700l02769N50983k22653M9956l58914J43040Q1245m13523L36049
$$ 1061317 1214017 911248 1462231 1239578 1289534 930620 1073660 1154905 741382 1077431
13826A077431j44199L06302l45191J27667J47763l96491L73889l36738L27457
$$ 1077431 933232 1239534 894343 1022010 1169773 773282 1147171 810433 1137890
13817A137890j46839j777n7745j32264J49999J41696K58944m81156K825L2707
$$ 1137890 991051 989274 931529 799265 949264 1090960 1349904 868748 871573 904280
13807I04280J79074j89148J05904j02955Q4982j64541L2054M83766n10612K30009
$$ 904280 1083354 894206 1000110 897155 982137 817596 849650 1333416 822804 1052813
13797A052813m24264L33436J29160l06840J38910j03473K39840m38470M96696
$$ 1052813 628549 961985 1091145 784305 923215 819742 1059582 621112 1117808
13788A117808k72567P6027J0399j08167l66723K1773M44793N7842j63143k0923
$$ 1117808 845241 921268 931667 823500 456777 478550 923343 981185 818042 797119
13778G97119o4387j13798q0942M79116j59414k28356q3730K57134L6628L70700
$$ 797119 732732 618934 537992 1017108 857694 629338 545608 802742 839370 1210070
13768A210070n67692M02450K9200k33978j57123p3918o849K24641P6306l97224
$$ 1210070 642378 1044828 1074028 840050 682927 609009 602160 826801 903107 505883
13758E05883J16622L66775k06026J09545m9098l78502L76648k32834B89513P18191
$$ 505883 622505 989280 783254 892799 843701 465199 841847 609013 289513 1007704
13748A007704o2827j37565k54270O8105L91413l70011J23072A74232O64104j56267
$$ 1007704 944877 807312 553042 621147 1012560 642549 765621 174232 838336 682069
13738F82069j37923J74400k77422M39908J38944j81355m5587J81537l37749J38069
$$ 682069 544146 718546 441124 881032 1019976 838621 793034 974571 636822 774891
13728G74891n3601j35095J16718j2838j8905o7034j0445K36660j60431j98008
$$ 774891 721290 586195 702913 690075 671170 604136 593691 830351 669920 471912
13718D71912K39391l4416j23761L13982k54810K97245k14513j0760n6344J21707
$$ 471912 711303 676887 553126 867108 612298 909543 695030 684270 627926 749633
13708G49633j01039L31283l41670J39827k20487j43794J19054j5964Q249K23915
$$ 749633 648594 979877 638207 778034 557547 413753 532807 516843 525092 749007
13698G49007B91302L43802j26852L10478C09090K66794k41091K05099M00685k45155
$$ 749007 291302 635104 508252 818730 309090 575884 334793 539892 940577 695422
13688F95422N5352C04211K17700K7640l5336j87386M23581k12741r6087A63450
$$ 695422 750774 304211 521911 549551 514215 326829 750410 537669 441582 163450
13677I3204L13579K06017J18173k64248N4449J31460j2094J57127B99528K60283
$$ 93204 406783 612800 730973 466725 521174 652634 640540 797667 299528 559811
13667E59811j7711J33907k82145j8882J02008m685j86075K67414j07250J72837
$$ 559811 542100 676007 393862 374980 476988 472303 286228 553642 446392 619229
13657F19229K06797l89996M17426C81851j1875k617j12918N54353B97724J91070
$$ 619229 826026 436030 853456 381851 369976 367359 254441 808794 297724 488794
13647D88794p0963K53258J26210l25698j80964M68160C59323k6576o5884M80627
$$ 488794 417831 671089 797299 471601 290637 758797 359323 332747 266863 747490
13637G47490k76172J37644n1322p0037K59931B50409L36456r0358j80024j01223
$$ 747490 471318 608962 557640 487603 747534 250409 586865 496507 316483 215260
13627B15260M08006j34768k00467J41168K9215J51738k26613j33063l4997K14685
$$ 215260 623266 488498 288031 429199 458414 610152 383539 250476 215479 430164
13617D30164L33249B29338J82090j14825K57134k70214J49619K18569k81951Q1023
$$ 430164 763413 229338 411428 296603 553737 283523 433142 651711 369760 450783
13607D50783o7165q4879L87458J27359l35550p0528K44761A96226K8688K18563
$$ 450783 383618 298739 686197 813556 478006 407478 652239 196226 224914 443477
13597D43477j93924p1925M88146l16719P81R0395j35488m4536L63279n2056D9276
$$ 443477 249553 177628 665774 349055 349836 440231 304743 260207 623486 571430 49276
13585B94481m9503K71428o1913q3172J2855j61227L0097J24752p1883q0905J98580
$$ 294481 244978 516406 454493 371321 384176 222949 253046 377798 305915 225010 423590
13574D23590j45307P6085N9974r1967J66456j1168B33034K70737A59156J02361
$$ 423590 278283 354368 414342 322375 488831 477663 233034 503771 159156 261517
13564B61517N2201N7507j82886L09328E7755L42419O1929m4787n8739O7708F8887
$$ 261517 313718 371225 188339 497667 57755 400174 462103 417316 358577 426285 68887
13552B36054J02201j07718l8030K12994n3606n3559k5546K31435j24755m539J10706
$$ 236054 338255 230537 192507 405501 351895 298336 272790 504225 379470 374931 485637
13541D85637L265j42171J51300j97325K7969r4808j6211K48321A93047L29837
$$ 485637 488902 346731 498031 300706 328675 233867 217656 465977 193047 522884
13531E22884A30347J44283N9911B6717J66984K9816J56872O8817A58304c2156
$$ 522884 130347 274630 334541 26717 193701 223517 380389 449206 158304 -32156
13520C56394o0081l5621P5250K64321i920C09097p7468l8232L08594k5224J1027
$$ 356394 296313 260692 335942 600263 -9920 309097 231629 193397 501991 476767 487794
13509D87794b52025A74224P6313R453G3206L25762p9957P9370J6529j31747K8554
$$ 487794 -252025 174224 250537 259990 73206 398968 319011 398381 414910 283163 311717
13498C11717a28559A52492M31625k31414I7336M25323A60957l8797J60980k8757
$$ 311717 -128559 152492 584117 352703 97336 522659 160957 122160 283140 254383
13488B54383j14359J53394o4392R8621J32039A30556o1139c2196A74426M43705
$$ 254383 140024 293418 229026 327647 459686 130556 69417 -32196 174426 618131
13478F18131B84056M53314C10675f8540B83180k0275p7388O2554J29148j73006
$$ 618131 284056 737370 310675 -68540 283180 262905 185517 248071 377219 204213
13468B04213J34893J18821O3345L4142a09565B65609K1716M3918J13438j90746
$$ 204213 339106 457927 521272 555414 -109565 265609 287325 331243 444681 253935
13458B53935o8043K3064b2811B54220b2412A63158p2515C8612L10765O4460K8200
$$ 253935 185892 208956 -22811 254220 -22412 163158 90643 38612 349377 413837 442037
13447D42037a8638C93828j70867d1509A25520L36461k20371m3166J22526j15567
$$ 442037 -18638 393828 222961 -41509 125520 461981 241610 198444 320970 205403
13437B05403J63767m4906r4896q1924M6380K27514k2185R1808A83945L64688m4555
$$ 205403 369170 324264 229368 147444 193824 421338 399153 490961 183945 548633 504078
13426E04078B29993k1250k8380f3518C38073p4224i3918B12265J03291A03081
$$ 504078 229993 208743 180363 -63518 338073 263849 -93918 212265 315556 103081
13415F9179M1072K17935A21708M31091k03539k8092n8390h3439C74674A11116
$$ 69179 110251 328186 121708 552799 349260 321168 262778 -83439 374674 111116
13404B62280A17555R4257n8365j6695A6510N7035K10148j880o0347L01686l84
$$ 262280 117555 211812 153447 136752 16510 73545 283693 281813 221466 523152 522768
13393E22768I0971N3084m8235L41915I1381L23567J47345B57133i639A72146J40246
$$ 522768 90971 144055 95820 437735 91381 414948 562293 257133 -9639 172146 312392
13382C12392O550l8401p9919R883L47876A88643J72661A56776G6741b2843A97884
$$ 312392 318942 280541 200622 210505 558381 188643 361304 156776 76741 -22843 197884
13370A95319Q3388r4550J54239J6899M4513A95578K42621q3732n2782A45661J36450
$$ 195319 278707 184157 338396 355295 399808 195578 438199 354467 301685 145661 282111
13359B82111j16513b8932G4951L64377k4446I0540J76390a21687F0937K82492
$$ 282111 165598 -28932 74951 439328 414882 90540 266930 -121687 60937 343429
13349C43429A48603o327K04784N3263j55584J03182J18651J63558r5639Q1065
$$ 343429 148603 142276 347060 400323 244739 347921 466572 630130 534491 615556
13339F15556C06529D5080J76045K20605J20478B67006K62470B59837I5758K89638
$$ 615556 306529 45080 221125 441730 562208 267006 529476 259837 95758 385396
13329C85396I1148K8253L7148J28162L59005k98941A23899R8327K63072P6850
$$ 385396 91148 119401 156549 284711 643716 344775 123899 222226 485298 562148
13319E62148H6921D0112A4969L50057j40785a25627A42360n7738J77548L5591
$$ 562148 86921 40112 14969 365026 224241 -125627 142360 84622 262170 297761
13309B97761j26977A3854R9577C0993K79492j52097k9665D1966K9822J24736k9544
$$ 297761 170784 13854 113431 30993 310485 158388 128723 41966 71788 196524 166980
13298A66980J15361f6225A84172J1924l1847E7222K68256l6568K41518j76844
$$ 166980 282341 -66225 184172 196096 164249 57222 325478 288910 530428 353584
13288C53584A02085M8387J08605M2647k4366F5837P1850K08908A06324A3645J21138
$$ 353584 102085 150472 259077 301724 277358 65837 137687 346595 106324 13645 134783
13277A34783J72169r9897F9295M54093j97790A40858j3621k233f83j09856B586
$$ 134783 306952 207055 69295 523388 325598 140858 127237 125004 -683 -110539 2586
13265f4343D56782I165O1254K32420A42599J12494K01968a00614A80583c5644
$$ -64343 456782 9165 70419 302839 142599 255093 457061 -100614 180583 -35644
13254A55484L2753K04099G8785e5029F6469L41937j77131m4233h396D6085J39496
$$ 155484 188237 392336 78785 -55029 66469 408406 231275 187042 -8396 46085 185581
13243A85581c075A58992a28981B91666A04157j5456Q5457M6966E7235j5846A2978
$$ 185581 -3075 158992 -128981 291666 104157 88701 174158 221124 57235 41389 12978
13231f2239K9714A95069h1902A86217i9311B5884L63770j26340C6424A4943K02665
$$ -62239 -32525 195069 -81902 186217 -99311 25884 389654 263314 36424 14943 217608
13220B17608j4178m7455a6514A52536R8490j02215a61923D73760a00142D64835
$$ 217608 203430 155975 -16514 152536 251026 148811 -161923 473760 -100142 464835
13209C31953a96927j09481H1798L04700j60839g3845A70806k9334b06721i42A14868
$$ 331953 -196927 -306408 81798 386498 225659 -73845 170806 141472 -206721 -942 114868
13197E7799J37642k8699g2346B20954j3340k5474C2871J39101J3549i5726C32408
$$ 57799 195441 166742 -72346 220954 207614 182140 32871 171972 185521 -95726 332408
13185e0699A1962J15176L2421a08651E9549J06822J45851P4119j57374r1263B8576
$$ -50699 11962 127138 159559 -108651 59549 166371 312222 386341 228967 137704 28576
13173d8994l7830a1536B11439K39107a23824C22173L9359g8463B0925K4311a50004
$$ -48994 -86824 -11536 211439 450546 -123824 322173 361532 -78463 20925 45236 -150004
13161a37182o6865B16046j01749M5064d1247C552c0276B31093p9045J68590a2942
$$ -137182 -204047 216046 114297 159361 -41247 3552 -30276 231093 152048 320638 -12942
13149G1718J11670i7144n249a4154B45918r0590a75764B62034j19701K46803b4029
$$ 71718 183388 -97144 -102393 -14154 245918 155328 -175764 262034 142333 389136 -24029
13137B56672C370K97319a78537B22575f1122C38646A65883B5454J86826a17940
$$ 256672 3370 300689 -178537 222575 -61122 338646 165883 25454 212280 -117940
13126b25278A2307M72607B5335K56894a6955C74106a80345a484I3818K52607a97474
$$ -225278 12307 484914 25335 282229 -16955 374106 -180345 -1484 93818 346425 -197474
13114A82272L10287k04278M9516I0386L30676B2697K17338E4135a30659C22531
$$ 182272 492559 288281 337797 90386 421062 22697 240035 54135 -130659 322531
13103A81499H6836p602b0885m0274b0868A83892b67797C03845d0368m0414A36285
$$ 181499 86836 79234 -20885 -61159 -20868 183892 -267797 303845 -40368 -80782 136285
13091F5477J79344A0357f3562A48091m9492J18853b0427A16341c9891j72654A90480
$$ 65477 244821 10357 -63562 148091 98599 217452 -20427 116341 -39891 -212545 190480
13079D1493a07362j5688I6968m6567f8929r5157H0823A6003K51267b43297D66349
$$ 41493 -107362 -123050 96968 50401 -68929 -164086 80823 16003 267270 -243297 466349
13067f4370C49013A23265R4736l6427F3188P7215a77618H5168g204C0944K5774
$$ -64370 349013 123265 218001 181574 63188 140403 -177618 85168 -7204 30944 56718
13056E6718G173a53100J4137p0007I3730a09670A05782K53759F1310A3350J55832
$$ 56718 7173 -153100 -138963 -208970 93730 -109670 105782 359541 61310 13350 169182
13045A69182J96584A10737l4793J96931J6787n9353J09734K29421j55660A69753
$$ 169182 365766 110737 75944 272875 289662 230309 340043 569464 413804 169753
13034a03477B74658d6999j4218C37809j30713m0539O0545k1301H6954C5803J13661
$$ -103477 274658 -46999 -61217 337809 207096 166557 227102 205801 86954 35803 149464
13023A49464a52446A27656N9524e1432B79628A12554l9260N3335K47106A04912
$$ 149464 -152446 127656 187180 -51432 279628 112554 73294 126629 373735 104912
13012a45116C75865a8595l093A74739P9215c4547A08056J86751l4546j04039H730
$$ -145116 375865 -18595 -21688 174739 253954 -34547 108056 294807 260261 156222 8730
13000C4817P1501J61222H8646M35986e1847E4597k1648a63108E021d526B33174
$$ 34817 106318 267540 88646 524632 -51847 54597 32949 -163108 5021 -4526 233174
12988B79841P0268A23593A707d1679J4414B27063B974L83011d1028A52261b64589
$$ 279841 350109 123593 1707 -41679 -27265 227063 2974 385985 -41028 152261 -264589
12976C8749J93383A15296J48261F6457L82941c7798A51145l8307a27332E7446
$$ 38749 232132 115296 263557 66457 449398 -37798 151145 112838 -127332 57446
12965a07513r5703i897m0516a5872j25516E1182J97418N475a50510B6097b34463
$$ -107513 -203216 -9897 -50413 -15872 -141388 51182 248600 254075 -150510 26097 -234463
12953B93849A33068M5766b38787C09029a26712C11132b65415B54209J92099c4857
$$ 293849 133068 178834 -238787 309029 -126712 311132 -265415 254209 446308 -34857
12942A83727j2387K20584I5080a64223k62950A2755a17352B54686j18098a88174
$$ 183727 171340 391924 95080 -164223 -427173 12755 -117352 254686 136588 -188174
12931A06030P8681p7137a28737A17538D6680a70484B08841D3917a72653O0240
$$ 106030 184711 107574 -128737 117538 46680 -170484 208841 43917 -172653 -112413
12921a12413l8788D4447K66043B1286J31445c1583j36421D6199P1007N2732D095
$$ -112413 -151201 44447 310490 21286 152731 -31583 -168004 46199 117206 169938 4095
12909b28054B04138B3153Q21K33264c63682F15172e0536l821A65366B3278J62437
$$ -228054 204138 23153 23974 257238 -363682 615172 -50536 -54357 165366 23278 185715
12898A85715e49930B11583J66536H2945O2891K3712c5180B69565H5456h53H5107
$$ 185715 -549930 211583 378119 82945 145836 169548 -35180 269565 85456 -853 85107
12886h9217h328H1661N4737a49325B17816b61202h4314K4927j7127r1588O5774
$$ -89217 -8328 81661 136398 -149325 217816 -261202 -84314 -59387 -76514 -168102 -102328
12875a02328B79884J65290H1383N1597L42395A59584N4277E6851J06410C3494
$$ -102328 279884 445174 81383 132980 475375 159584 213861 56851 163261 33494
12864a6729n5810F7551a77019L7611B62502E3363c56377A04360J08932L6692f2247
$$ -16729 -72539 67551 -177019 -139408 262502 53363 -356377 104360 213292 249984 -62247
12852A39758J4112m5808A1890a81586A03439L6091b06967C01448A18072K5718
$$ 139758 153870 108062 11890 -181586 103439 139530 -206967 301448 118072 143790
12842A43790K37918J36202A8563M7322J50186a50303A50377f9892B11948c29235
$$ 143790 381708 517910 18563 65885 216071 -150303 150377 -69892 211948 -329235
12831G7564c51580A44671J52996D9128e5676C5965P0421l2388J09110g0309B73900
$$ 77564 -351580 144671 297667 49128 -55676 35965 106386 73998 183108 -70309 273900
12819F6143J69849E1259h8830A96058A3548J50789h7116b5111F1188a87381C0597
$$ 66143 235992 51259 -88830 196058 13548 164337 -87116 -25111 61188 -187381 30597
12807h9415k1293M9610j58314B8527P6121l047B4640L8945c0917l0943B40017
$$ -89415 -110708 -61098 -219412 28527 104648 101601 24640 63585 -30917 -61860 240017
12795A75881J00139l3396I4293L3381o3625L3080c33600A2512b07116A31501B5617
$$ 175881 276020 242624 94293 127674 64049 97129 -333600 12512 -207116 131501 25617
12783b17529B86718A25852D9209i9506p7931A19016O7669J13638E5597K10238
$$ -217529 286718 125852 49209 -99506 -177437 119016 186685 300323 55597 265835
12773B65835A8566a99485A35311a02394B23489b4133A99483E7339R33a25957r876
$$ 265835 18566 -199485 135311 -102394 223489 -24133 199483 57339 58272 -125957 -135833
12762a35833B76003j35640m314N698P0434b4967H5423k7730P3572J04795a4433
$$ -135833 276003 140363 136049 141747 212181 -24967 85423 57693 131265 236060 -14433
12750A42722J91781i2897A70972c4872A8721J37333K33P5555j14389a34293A16066
$$ 142722 334503 -92897 170972 -34872 18721 156054 156287 231842 117453 -134293 116066
12738A25289J45323K54129A76802D2908J60898a28263A24190J46016a25361I0454
$$ 125289 270612 524741 176802 42908 203806 -128263 124190 270206 -125361 90454
12727G6672b62953J14681J2241G624a75874k99824C04096A26796a79102j33767
$$ 76672 -262953 -148272 -136031 7624 -175874 -475698 304096 126796 -179102 -312869
12717c12869B4180L3141e8173K6296C22769l1847j3885k0844J55732k543P4458
$$ -312869 24180 57321 -58173 -31877 322769 290922 277037 256193 411925 409382 483840
12706D83840a371A70511d1365C18633A14941J2829J24133C350J97186K7874J17666
$$ 483840 -1371 170511 -41365 318633 114941 127770 251903 3350 200536 228410 346076
12695C46076H1234I464K07663G9017J111a02346L0177I2512K2582k4907A8930
$$ 346076 81234 9464 217127 79017 80128 -102346 -72169 92512 115094 90187 18930
12683i8997M4212j56788b2060B34551K7790L5101j01009J47663Q8108D2881N7002
$$ -98997 -54785 -211573 -22060 234551 262341 297442 196433 344096 432204 42881 99883
12672I9883k9792A6513a59999E9953N3665j4018e8273A07000h3665n6087F0731
$$ 99883 70091 16513 -159999 59953 113618 99600 -58273 107000 -83665 -139752 60731
12660B11021r2582M9917G8820d5903A979J69559b12456C24093l5596F4758k0904
$$ 211021 118439 168356 78820 -45903 1979 171538 -212456 324093 288497 64758 43854
12649D3854K00603A1638d9141j59753i2483A0968R9427g2660A16396c2424a2756
$$ 43854 244457 11638 -49141 -208894 -92483 10968 110395 -72660 116396 -32424 -12756
12637H3229a19770A19035C7536J16040L9526F4967K1171K04604j0009L1263P9285
$$ 83229 -119770 119035 37536 153576 193102 64967 86138 290742 280733 311996 391281
12626C91281j35142Q4298A57962e6420A9672L23621C1592K55089a90304D2645
$$ 391281 256139 340437 157962 -56420 19672 343293 31592 286681 -190304 42645
12615A20912b69307i3837L6054A81199F0274K9623j1183b2743A5766e6053l3479
$$ 120912 -269307 -93837 -57783 181199 60274 89897 78714 -22743 15766 -56053 -89532
12604h9532l7131m58j5414E31535a849A4581K1569J35120J22636A37554m9011
$$ -89532 -126663 -127121 -142535 531535 -1849 14581 36150 171270 293906 137554 88543
12593H8543K4961K3284k4474m9101L54310A20308c8326q4547M7992r2150E5299
$$ 88543 113504 136788 112314 63213 417523 120308 -38326 -122873 -74881 -167031 55299
12581i224A24589l8790a1633A03972J59591A1668P4561a37121k564H825J95165
$$ -9224 124589 85799 -11633 103972 263563 11668 86229 -137121 -139685 8825 203990
12570B03990m7938a12059A55479o5850b94256A36166E2903L07831f9574G7042
$$ 203990 156052 -112059 155479 89629 -294256 136166 52903 360734 -69574 77042
12559b32988q3696c8833j30768f9304I192L4812N601g4829C2387a25488A77577
$$ -232988 -316684 -38833 -169601 -69304 9192 44004 49605 -74829 32387 -125488 177577
12547A14801k4560J47789a96827a8516A55305a93080Q9237C23646A21381J78302
$$ 114801 90241 238030 -196827 -18516 155305 -193080 -103843 323646 121381 299683
12537B99683j18033B5305K30927b43633A48574c29339D6135J52460G2236K28868
$$ 299683 181650 25305 256232 -243633 148574 -329339 46135 198595 72236 301104
12527C01104n9842j15627J36860g411j74172D3348J54111p1241Q4421I079M2666
$$ 301104 241262 125635 262495 -7411 -181583 43348 197459 126218 210639 9079 51745
12516E1745O8445K10355I6528d50545g0828B74111P3331j3840A2737b67301B23870
$$ 51745 120190 330545 96528 -450545 -70828 274111 347442 333602 12737 -267301 223870
12504h0050J8689C555c1077o3431A25022R8500A9779R1262d7341D79613k23442
$$ -80050 -61361 3555 -31077 -94508 125022 223522 19779 111041 -47341 479613 256171
12493B56171j6404b88914A03257b89683J11681j59492E7956b88341a33243n8723
$$ 256171 239767 -288914 103257 -289683 -178002 -337494 57956 -288341 -133243 -191966
12483a91966C32655a48437A3064a29584C5769M7309L1539a26621B68279b9629
$$ -191966 332655 -148437 13064 -129584 35769 83078 114617 -126621 268279 -29629
12472E8866R7673n566K10271D2066L8294a02844B04919E6682e7400q9586k8977
$$ 58866 156539 150973 361244 42066 80360 -102844 204919 56682 -57400 -146986 -175963
12461a75963j53822E9418a78506M5230C05464b52461l5576H526L04664A5375a19241
$$ -175963 -329785 59418 -178506 -133276 305464 -252461 -288037 8526 313190 15375 -119241
12449a47484j661A55681b10787k1795C18194a39769B7383a41285A3078P4418J34426
$$ -147484 -149145 155681 -210787 -232582 318194 -139769 27383 -141285 13078 87496 221922
12438B21922B9002a32494G0462d7307r9646d2400A25861O361C8841a52451A29297
$$ 221922 29002 -132494 70462 -47307 -146953 -42400 125861 132222 38841 -152451 129297
12426A97997i9693L754L1059D548h895B05814F6478f1612B54433c25820A17738
$$ 197997 -99693 -95939 -64880 4548 -8895 205814 66478 -61612 254433 -325820 117738
12414E78941E0038g7900c3035A44154a6160A63580G5002i7843k52902A61267d9845
$$ 578941 50038 -77900 -33035 144154 -16160 163580 75002 -97843 -350745 161267 -49845
12402A14451f7239H577P5120J07280g1012m4523B33539b03315c7404A0365a54005
$$ 114451 -67239 8577 83697 190977 -71012 -115535 233539 -203315 -37404 10365 -154005
12390a20751G0655R1635e1120Q890n220j4681A65729J74256a4700E3468a68869
$$ -120751 70655 162290 -51120 -42230 -47450 -62131 165729 339985 -14700 53468 -168869
12378I0112k8212R2622P529i9491i476l0577C1405J79257a73773C0631j1415J95995
$$ 90112 61900 154522 162051 -99491 -9476 -40053 31405 210662 -173773 30631 19216 215211
12366B15211J14299b92607I0073a74512Q4768B05140a71524H8607a45763A92154
$$ 215211 329510 -292607 90073 -174512 -89744 205140 -171524 88607 -145763 192154
12355B64117g1096A11309a10758F5646k2706f5465A00569a92089J148A54327F6171
$$ 264117 -71096 111309 -110758 65646 42940 -65465 100569 -192089 -190941 154327 66171
12343F8153g7416A09955d27175b1008p1357G8166a09483k9888A88272c25640g4255
$$ 68153 -77416 109955 -427175 -21008 -92365 78166 -109483 -139371 188272 -325640 -74255
12331H2537J17493o7448a68000C74492b64939c0770A13464K25366j38800A5310
$$ 82537 200030 132582 -168000 374492 -264939 -30770 113464 338830 200030 15310
12320B05215a4332C2886J04903g680j96998B238K53678j15729h633A18582c39039
$$ 205215 -14332 32886 137789 -7680 -204678 2238 255916 140187 -8633 118582 -339039
12308C261a48433A33498b69223B17873b62252b7374B6205R4726P0202m7950O7810
$$ 3261 -148433 133498 -269223 217873 -262252 -27374 26205 120931 191133 143183 210993
12297B10993a62960E290R3044J05302b1132C14880a0840C08909H0718c36337C16349
$$ 210993 -162960 5290 98334 203636 -21132 314880 -10840 308909 80718 -336337 316349
12285B66843C4207d2919g685F6485b4148A46519a39880G6998a00339C29118J9185
$$ 266843 34207 -42919 -7685 66485 -24148 146519 -139880 76998 -100339 329118 348303
12274C48303f3795C6249K35632o9386a23854B80088A10669B2068e305H2337J79642
$$ 348303 -63795 36249 271881 202495 -123854 280088 110669 22068 -5305 82337 261979
12263B61979b13198l3549D3477J19817K1653i5944B4322a6183k40825C37164b20569
$$ 261979 -213198 -246747 43477 163294 184947 -95944 24322 -16183 -257008 337164 -220569
12251D40954I5917b05987C5099J46943J08033o1502o4450k7221L47043b3067B44435
$$ 440954 95917 -205987 35099 182042 290075 228573 164123 136902 483945 -23067 244435
12239A30637f6621B07558j9381E4526J45419o7298J49873b25924C81531K61208
$$ 130637 -66621 207558 188177 54526 199945 132647 282520 -225924 381531 642739
12229F42739l19045A4869L34371o1798h9990A88422F8584L09188j11870m6953
$$ 642739 323694 14869 349240 287442 -89990 188422 68584 377772 265902 218949
12219B18949A04977J00416J1011J87499j53286j12385J33916m4198m8961l020
$$ 218949 104977 205393 216404 403903 250617 138232 272148 227950 178989 175969
12209A75969p5795Q4784l2088J96539j27809J86371A86318m6756C8768K24961
$$ 175969 100174 184958 152870 349409 221600 407971 186318 139562 38768 263729
12199B63729j08879K25381j57660p8646K52146j65891Q9035a29845A32918A293
$$ 263729 154850 380231 222571 143925 396071 230180 319215 -129845 132918 1293
12188G2062J45881m9124A2619j994J9138K0519J35636j2175p370J56444J9617
$$ 72062 217943 168819 12619 10625 29763 50282 185918 173743 166373 322817 342434
12177C42434K4809l4770A3742L18827c7413C8819a1477A43664L6883f6811B84857
$$ 342434 367243 332473 13742 332569 -37413 38819 -11477 143664 180547 -66811 284857
12165C18532J24625L7226E5965K67763E2157L87697A90525p8968J92897D2836
$$ 318532 443157 480383 55965 323728 52157 439854 190525 111557 304454 42836
12154A06717g3144E2384d9608B11915i9467J7454c0320k3839D28482A35181b6489
$$ 106717 -73144 52384 -49608 211915 -99467 -82013 -30320 -54159 428482 135181 -26489
12142A68105g1371m1215g481k2201A37160d62630D75747b17501J05899G2589b08763
$$ 168105 -71371 -112586 -7481 -29682 137160 -462630 475747 -217501 -111602 72589 -208763
12130A76446h1300Q856j29710J808O3409A3640J55611F4873J2777c7606D4292
$$ 176446 -81300 -72444 -202154 -200346 -136937 13640 169251 64873 77650 -37606 44292
12118B60122j06242a40944A75105m5938g5362A46851n1249C7792a48983m8089
$$ 260122 153880 -140944 175105 129167 -75362 146851 95602 37792 -148983 -197072
12108a97072m6974E5772M2390c7131H0123b66694J2117a10438c2526A09792L4673
$$ -197072 -244046 55772 98162 -37131 80123 -266694 -254577 -110438 -32526 109792 144465
12097A44465g1506B20453b88106A8178R7186a778j5746q2660C5510a94997J8511
$$ 144465 -71506 220453 -288106 18178 115364 -1778 -17524 -100184 35510 -194997 -176486
12086a76486q0216B4045M3522k3843a64632A75641p8436d8787k22456A11640c34572
$$ -176486 -256702 24045 67567 43724 -164632 175641 97205 -48787 -271243 111640 -334572
12074a86438o6752c8135J1281I0059J15537R46250J350094j125531A85115a21656
$$ -186438 -253190 -38135 -26854 90059 205596 1151846 2501940 1376409 185115 -121656
12063B85164A23106K47184b94780C07M732J83845l1094b87994A91418B6306b21083
$$ 285164 123106 370290 -294780 307 5039 188884 157790 -287994 191418 26306 -221083
12051a86805A3187a61261B86670A13522G654f2474J4593r0011l0850f0312C06335
$$ -186805 13187 -161261 286670 113522 7654 -62474 -47881 -137892 -168742 -60312 306335
12039d48086e9578G2506d5973j699a8298p5426q1844H4987K29701j28320O1699
$$ -448086 -59578 72506 -45973 -47672 -18298 -93724 -175568 84987 314688 186368 248067
12028B48067g8114c6042j47894A21297J08652a75850K0819I7651j1154K24349
$$ 248067 -78114 -36042 -183936 121297 229949 -175850 -155031 97651 86497 310846
12018C10846a60321A65144B7293J44713b09284b0592B45827c2742F6548B5485
$$ 310846 -160321 165144 27293 172006 -209284 -20592 245827 -32742 66548 25485
12007B55139c19141b0648G9683a39833k49373D8868J17569a42975F5805a17859
$$ 255139 -319141 -20648 79683 -139833 -389206 48868 166437 -142975 65805 -117859
11996a0278j46521G9400a65802h2283B17963a04596o4129A71893L00165a37997
$$ -10278 -156799 79400 -165802 -82283 217963 -104596 -168725 171893 472058 -137997
11985b17111A48701K09450a40947n1689m4008e213r6718O388B83300j4611M4732
$$ -217111 148701 358151 -140947 -192636 -236644 -5213 -101931 -95543 283300 268689 313421
11974C13421F3414L525k0672b69355c4488j67767I3062Q6757g0185r3391k31512
$$ 313421 63414 66939 46267 -269355 -34488 -202255 93062 179819 -70185 -163576 -395088
11963c95088d9546k14130A11251C4908A4362a46932B73204h9138C22409a05834
$$ -395088 -49546 -263676 111251 34908 14362 -146932 273204 -89138 322409 -105834
11952I4627j3397B5464J83762g8900A81140a7276p1342c8063I2278a44762o8033
$$ 94627 81230 25464 209226 -78900 181140 -17276 -88618 -38063 92278 -144762 -212795
11941b12795A61776a16148p5575h8187k6995j7864O5138j04666H0516r260a0723
$$ -212795 161776 -116148 -191723 -88187 -115182 -133046 -67908 -172574 80516 71256 -10723
11929f1093j88807i0047A92268c38067m2648J21738h2914g38l5468B52515A02639
$$ -61093 -249900 -90047 192268 -338067 -380715 -258977 -82914 -738 -36206 252515 102639
11917B85041b54582J07817A02053m0280O8632g2725n3043A04664f8560B0169K42876
$$ 285041 -254582 -146765 102053 61773 130405 -72725 -125768 104664 -68560 20169 263045
11906B63045c3628p8834A54203k3835g4677B6408d1219l32298e456A11591Q8343
$$ 263045 -33628 -112462 154203 130368 -74677 26408 -41219 -373517 -5456 111591 199934
11895A99934a97230b6846o3658J0527A07756K49080A56631l7274b0086A42233
$$ 199934 -197230 -26846 -90504 -79977 107756 356836 156631 119357 -20086 142233
11884C00393e22121J40803a78978j51227d6575o9214C89583A94236a7287l4203
$$ 300393 -522121 -381318 -178978 -330205 -46575 -115789 389583 194236 -17287 -51490
11874e1490I0997a01943B000R4690a98795A25351a07205C28484I6507a61115N0339
$$ -51490 90997 -101943 2000 96690 -198795 125351 -107205 328484 96507 -161115 -110776
11863a10776A50325b95890G075J18203c05016H0934k4589A8002O7713M3950a19080
$$ -110776 150325 -295890 7075 125278 -305016 80934 56345 18002 85715 129665 -119080
11851a75730B67329H5806b54128a05085a4804k02520h3347A1045J79475D9008
$$ -175730 267329 85806 -254128 -105085 -14804 -217324 -83347 11045 190520 49008
11840D36011b13466K7948B5533c39778I6713a48427A5819a3279k43019a1669m25218
$$ 436011 -213466 -185518 25533 -339778 96713 -148427 15819 -13279 -256298 -11669 -436887
11829d36887A97435R4070d36408K03390A56294c2566H8856K36599j57330a35805
$$ -436887 197435 291505 -436408 -233018 156294 -32566 88856 325455 168125 -135805
11818B6465c1476B42701A09462c73084g7455A44025b1159B58198I0089R0295F2879
$$ 26465 -31476 242701 109462 -373084 -77455 144025 -21159 258198 90089 180384 62879
11806d767A32664A9865a08436M867b8399l0488j49574A32023j8790a98753j00059
$$ -4767 132664 19865 -108436 -103569 -28399 -58887 -208461 132023 113233 -198753 -298812
11795b98812m8596b5918j04902G7430g9856A68453A3786J89648o121a7958j66746
$$ -298812 -347408 -25918 -130820 77430 -79856 168453 13786 203434 197313 -17958 -184704
11784a84704M0153B15420c39165h0742n4769O3500A75817Q4741A1391P3076j1479
$$ -184704 -144551 215420 -339165 -80742 -135511 -72011 175817 260558 11391 84467 72988
11773G2988b63749R8018A45861g6156j63150B76022a78121B16130c43775C80700
$$ 72988 -263749 -165731 145861 -76156 -239306 276022 -178121 216130 -343775 380700
11762a37042a3165C05365d0192j55351B5842K36864a15929B03095b91090A05807
$$ -137042 -13165 305365 -40192 -195543 25842 262706 -115929 203095 -291090 105807
11751A31937J94471g8204j15567p0798A30762c09806l01204a93706H8798A7325
$$ 131937 326408 -78204 -193771 -264569 130762 -309806 -611010 -193706 88798 17325
11740a13657D4333a60842j10922A151a1250j3503C43904j27740a89645B7073K41703
$$ -113657 44333 -160842 -271764 1151 -11250 -24753 343904 216164 -189645 27073 268776
11729B68776g5505N21r9417E0667L02405a62249I2951a49722B52129B5605K6731
$$ 268776 -75505 -74984 -174401 50667 353072 -162249 92951 -149722 252129 25605 52336
11718E2336b82673J16070M8364B02278n3579J35610b75956l1890J33101b556I5438
$$ 52336 -282673 -166603 -118239 202278 148699 284309 -275956 -307846 -174745 -2556 95438
11706I7708A8601J59494h2799n6942f6840l42403C22586o0778a3957j99604e2262
$$ 97708 18601 178095 -82799 -139741 -66840 -409243 322586 261808 -13957 -213561 -52262
11694D93970A79851D6181i8539j0793A72828C5863a50749G7276J55727f3932A38467
$$ 493970 179851 46181 -98539 -109332 172828 35863 -150749 77276 233003 -63932 138467
11682b1232E2110O4636b36195C1878J67499R044c8100C13387Q2247D4942J21792
$$ -21232 52110 116746 -236195 31878 199377 208421 -38100 313387 395634 44942 166734
11671A66734N6024D1550h623k61406a693l9591a3494F9572L95026b06421C32974
$$ 166734 222758 41550 -8623 -270029 -1693 -41284 -13494 69572 464598 -206421 332974
11659a5004D3466c9352B50044k8761a94932B67479a24383I5233D2455a44142c5246
$$ -15004 43466 -39352 250044 221283 -194932 267479 -124383 95233 42455 -144142 -35246
11647c8286q0192J3689I4218P7537c01633a31659l5234B13463p0235a76099A80432
$$ -38286 -118478 -104789 94218 171755 -301633 -131659 -166893 213463 143228 -176099 180432
11635A36706q191j1617J38876d1703j234B08161J80556j39349E4995j8463J05926
$$ 136706 128515 116898 255774 -41703 -42937 208161 388717 249368 54995 36532 142458
11624A42458J31778a9159k0870C00350j30961E9925a06546p3637A63059J22224
$$ 142458 274236 -19159 -40029 300350 169389 59925 -106546 -180183 163059 285283
11614B85283F5710J50395a45218A78722F6191a21445K0439C24440L9202G3325
$$ 285283 65710 216105 -145218 178722 66191 -121445 -101006 324440 363642 73325
11603d04437D7529e1245C0860K54089P6080l2533b95656A9521J54492d5485A46875
$$ -404437 47529 -51245 30860 284949 361029 328496 -295656 19521 174013 -45485 146875
11591I4299A8970O2569L14493C9448J98208a6798A97178O862O7000F5405R6717
$$ 94299 18970 81539 396032 39448 237656 -16798 197178 204040 271040 65405 162122
11580A62122q0761L18902b48706f5467D5785M8222J43783n9611g4001A73757d5882
$$ 162122 81361 400263 -248706 -65467 45785 94007 237790 178179 -74001 173757 -45882
11568I5771K79531J10972I0772J47636c3154l23794a9433A64979a79794A16973
$$ 95771 375302 486274 90772 238408 -33154 -356948 -19433 164979 -179794 116973
11557A93138Q6557a29852M2356c1385C42023f7360A91159C347c08n4274K4331
$$ 193138 279695 -129852 -87496 -31385 342023 -67360 191159 3347 -308 -54582 -30251
11546c0251I887k420i6812A27590N2285Q1177p5107D1044K45487H1030O4772K63973
$$ -30251 9887 7467 -96812 127590 179875 261052 185945 41044 286531 81030 145802 409775
11534D09775A61381a3982f429A04786K9777n3057c7883n0587B8263E47e523A75600
$$ 409775 161381 -13982 -6429 104786 134563 81506 -37883 -88470 28263 547 -5523 175600
11521f1253m2311A63331p1652J63203e7303p7761A02097J07051F2753O7668b66334
$$ -61253 -103564 163331 91679 254882 -57303 -135064 102097 209148 62753 130421 -266334
11509A46703A2486M9805J15236e086B79923F3877O3244J1453m6792M7776l1366
$$ 146703 12486 62291 177527 -5086 279923 63877 127121 138574 91782 139558 108192
11498A08192e3854j71139C29962C9923J26423a7975A65539J4269J23617A15647
$$ 108192 -53854 -224993 329962 39923 166346 -17975 165539 179808 303425 115647
11487e4584B55120h2383A33223a04249I8156g7556B73348m0114b25849G0935b34001
$$ -54584 255120 -82383 133223 -104249 98156 -77556 273348 233234 -225849 70935 -234001
11475B76577a58748I0751J36545K9012Q385C4369J42776J63512n6208A10409J72408
$$ 276577 -158748 90751 227296 256308 264693 34369 177145 340657 284449 110409 282817
11464B82817N8696b277B04705f774k43391A333L4467b6683n494l9960b8683B96959
$$ 282817 341513 -2277 204705 -6774 -250165 1333 35800 -26683 -32177 -72137 -28683 296959
11451B91256J03064I7875K12090A52277C9547f839j0697I510a77974A45169R0161
$$ 291256 394320 97875 309965 152277 39547 -6839 -17536 9510 -177974 145169 235330
11440B35330L6003g6486b6462j18573j7498G5453k5163R4997a84102h9564C85974
$$ 235330 271333 -76486 -26462 -145035 -162533 75453 50290 145287 -184102 -89564 385974
11428A11300L41683G6833P662Q7397i7623I7985Q2812E3757B3887g3091B1750
$$ 111300 452983 76833 84495 171892 -97623 97985 180797 53757 23887 -73091 21750
11416H5539C4355J06635J19252j6136A06220b54438J02460k475A06484J50116
$$ 85539 34355 140990 260242 244106 106220 -254438 -151978 -154453 106484 256600
11406B56600e021A69619N35071A51479o8488K32552I1838d4572j49752c7071B11097
$$ 256600 -5021 169619 704690 151479 82991 315543 91838 -44572 -194324 -37071 211097
11394D33866h0986A44928e04567b5435k45017a24623A76047a60178L9699M9561
$$ 433866 -80986 144928 -504567 -25435 -270452 -124623 176047 -160178 -120479 -70918
11384g0918Q095D85290C3258M4374B498J42216i8836B20167H079L7529R3428J01594
$$ -70918 -62823 485290 33258 77632 2498 144714 -98836 220167 8079 45608 139036 240630
11372B40630a78711O0183D2857J7150L10146a33451A7185i911p8909a0840F7711
$$ 240630 -178711 -118528 42857 60007 370153 -133451 17185 -9911 -88820 -10840 67711
11360g8722A56501p3846B2425d0688D06017a2374A0656f2576a9314l55226a17371
$$ -78722 156501 82655 22425 -40688 406017 -12374 10656 -62576 -19314 -374540 -117371
11348A03181K1357J50323M8623e7755q2449A74473J18748j05710j6625e1007B55081
$$ 103181 124538 274861 323484 -57755 -140204 174473 293221 187511 170886 -51007 255081
11336A2464b5618o1835A64509P9555h8576B4007b3348A78029i4038A05904a11304
$$ 12464 -25618 -87453 164509 244064 -88576 24007 -23348 178029 -94038 105904 -111304
11324b26212A17371a16677C69046g3770A34279e2719A59608J19114a36002k07697
$$ -226212 117371 -116677 369046 -73770 134279 -52719 159608 278722 -136002 -343699
11314c43699e0700A49936a23985R288d5287B34028q6307l265b4653A88772K00
$$ -343699 -50700 149936 -123985 -114697 -45287 234028 147721 144456 -24653 188772 188972
11303A88972C5312d3349m4326A95133o085c79936g3169k2694K4356A50730b22921
$$ 188972 35312 -43349 -87675 195133 189048 -379936 -73169 -95863 -71507 150730 -222921
11291E3139a22656l71164g5368k945j42107B6407K07038g6496l14183J19051D0780
$$ 53139 -122656 -493820 -75368 -78313 -220420 26407 233445 -76496 -390679 -271628 40780
11279e27970A75381G6898d9823l2046c8784A36182B6547b22919A86356g1264j15578
$$ -527970 175381 76898 -49823 -81869 -38784 136182 26547 -222919 186356 -71264 -186842
11268a86842J6765H1466b06616d2906I7882a34524A87049a03130A32457o3617
$$ -186842 -170077 81466 -206616 -42906 97882 -134524 187049 -103130 132457 68840
11258F8840a61167g5563A72196a62831B61006a80418b1892A3541f884l08621g3109
$$ 68840 -161167 -75563 172196 -162831 261006 -180418 -21892 13541 -6884 -315505 -73109
11246A0848P908d32266J17417b6506B29110b06952F2613B8279d514j32053M8354
$$ 10848 18756 -432266 -314849 -26506 229110 -206952 62613 28279 -4514 -136567 -88213
11235h8213B99397i0722q3245B0753L0073a11519A69188H0701C1849a09661k08518
$$ -88213 299397 -90722 -173967 20753 50826 -111519 169188 80701 31849 -109661 -318179
11224c18179J37188j09872B75242c53127C4635c3428l6662j44146A57169F441
$$ -318179 -180991 -290863 275242 -353127 34635 -33428 -70090 -214236 157169 6441
11213b81583C22695c10874a04216J7784A208J57748A5833J0708g9413A7340a82489
$$ -281583 322695 -310874 -104216 -86432 1208 158956 15833 26541 -79413 17340 -182489
11201h2169B97042A3571h4250q4662C95167d14667D278e3327j45766A4732L2591
$$ -82169 297042 13571 -84250 -168912 395167 -414667 4278 -53327 -199093 14732 47323
11190D7323B2120b31665R4194J4194F163a60487o6606J01844G3268a13349n1110
$$ 47323 22120 -231665 -137471 -123277 6163 -160487 -227093 -125249 73268 -113349 -164459
11179a64459L2056k5864e8098m1270k60283a28550A37102g9090j55552L3755A18370
$$ -164459 -132403 -158267 -58098 -99368 -359651 -128550 137102 -79090 -234642 -200887 118370
11167e6492n4235j26558C68608i9832j24233A50857D8007c35985e1555h28j34604
$$ -56492 -110727 -237285 368608 -99832 -224065 150857 48007 -335985 -51555 -828 -135432
11156a35432b9947A11766f5265j71437I8712K22747P740A32422E4690d7094B68904
$$ -135432 -29947 111766 -65265 -236702 98712 321459 329199 132422 54690 -47094 268904
11144b4185o304j86009H4413P816K21047g5854d540q7894e961j68685Q4547p9217
$$ -24185 -30489 -216498 84413 92229 313276 -75854 -4540 -92434 -5961 -174646 -90099 -169316
11132a69316C45859A39507c07248D30041B5544R4858c7466k09585i0430j19797
$$ -169316 345859 139507 -307248 430041 25544 120402 -37466 -247051 -90430 -210227
11122b10227A88784G2610J88663g0306Q342N095j4856C83787C1227O8258L48621
$$ -210227 188784 72610 261273 -70306 -61964 -56869 -71725 383787 31227 99485 448106
11111D48106j68173F6818J92082r6199e9028p9434J4130B78776a88209d4850G8321
$$ 448106 279933 66818 258900 162701 -59028 -138462 -124332 278776 -188209 -44850 78321
11099I1461J19912D2216K43286B467L9218Q1081J95780J369d8337C22689G2936
$$ 91461 211373 42216 285502 2467 41685 122766 318546 319915 -48337 322689 72936
11087f144A39812k3830J23918m3546J99316A96510a12104B6717L78683L22685
$$ -6144 139812 115982 239900 196354 395670 196510 -112104 26717 405400 728085
11077G28085l16205A90432A6356O54714I1159a11771E39824j02797j57136N5955
$$ 728085 411880 190432 16356 671070 91159 -111771 539824 437027 279891 335846
11067C35846A33450M99721B67343K07385k36054Q1155J45726m9355Q1588L80352
$$ 335846 133450 633171 267343 474728 238674 319829 465555 416200 497788 878140
11057H78140j63429J92211k30974O9058J22415m1558j35870J46961L4090j54441
$$ 878140 714711 906922 675948 745006 867421 825863 689993 836954 871044 716603
11047G16603J89314P0749j22260k63315L87406k22219j03440L45279j32946l23631
$$ 716603 905917 976666 854406 591091 978497 756278 652838 998117 865171 541540
11037E41540L58136k6528k4652J19763j10965j78737j22906P8649j07671R8346
$$ 541540 899676 873148 848496 968259 857294 678557 555651 634300 526629 624975
11027F24975L82192N6872l80350L59587m55416L40494J9678k64128L99693m74502
$$ 624975 1007167 1064039 683689 1043276 587860 928354 948032 683904 1083597 609095
11017F09095j5489N6941J49907k33459K05829p8393K26002l31061P5864k58541
$$ 609095 593606 650547 800454 566995 772824 694431 920433 589372 665236 406695
11007D06695N63730l23673M5266j87560m8756M36641j59774L23658k66217k57013
$$ 406695 970425 646752 692018 504458 455702 892343 732569 1056227 790010 532997
10997E32997r2841L41413J80748R5672l49869j9298K60655l17114L68541j93832
$$ 532997 440156 781569 962317 1057989 708120 688822 949477 632363 1000904 807072
10987H07072M29154n3271o8075J74964Q7638J20384l85141Q3649K86199r2608
$$ 807072 1236226 1182955 1114880 1289844 1377482 1497866 1112725 1196374 1482573 1389965
10977A389965O30887J91954j30341M85961L11211J2077O62877j20122N1426j03485
$$ 1389965 2020852 2212806 2082465 2568426 2879637 2891714 3554591 3434469 3485895 3382410
10967C382410n36649m28751r4565m29147j27770k4774r9233J04295k0669j42857
$$ 3382410 2845761 2417010 2322445 1893298 1765528 1740754 1641521 1745816 1725147 1582290
10957A582290K84283p7831j10225k84802m0761J05545n18075j28496j1872l72319
$$ 1582290 1866573 1788742 1678517 1393715 1352954 1458499 940424 811928 800056 427737
10947D27737J26237j99316j71802M2314K75632A65617G5748J27995L353m1155
$$ 427737 553974 354658 182856 225170 500802 165617 75748 203743 207096 165941
10937A65941P2844N3626F6224c17210i0975C4927a85379B82733p502l3997g3119
$$ 165941 238785 292411 66224 -317210 -90975 34927 -185379 282733 275231 241234 -73119
10925a01986A05233E887K3322b98029A87866j3518l7829J1887K15244o408D457
$$ -101986 105233 5887 29209 -298029 187866 174348 136519 148406 363650 357242 4457
10913e2485A27282k6964b11305G4818a43556q0346A23043N8732A7342O9533D1549
$$ -52485 127282 100318 -211305 74818 -143556 -223902 123043 181775 17342 86875 41549
10901A94608j7104K4625b7896A28790d12380A93035p0324b2940r5135F4154R1344
$$ 194608 177504 202129 -27896 128790 -412380 193035 122711 -22940 -118075 64154 155498
10890A55498J15911G1811M6266J25300G2867J29988m1966m2543L9359b5471A26409
$$ 155498 271409 71811 118077 243377 72867 202855 160889 118346 157705 -25471 126409
10878a23189r1426a948j38204N2216J9900A75006d8262J9595A53611P5815q0658
$$ -123189 -214615 -1948 -140152 -87936 -68036 175006 -48262 -28667 153611 229426 148768
10867A48768c9421B01554g0529A66442H0292i6905p2223A04181b30784M7775d1707
$$ 148768 -39421 201554 -70529 166442 80292 -96905 -169128 104181 -230784 -183009 -41707
10855c07738O2050A48598m475b55903E7327A5655i8130B2259R9207m5815b96314
$$ -307738 -245688 148598 144123 -255903 57327 15655 -98130 22259 121466 75651 -296314
10843A94095a09250j3282K2046A45783a99908m1658G2067a2311C93772b05178
$$ 194095 -109250 -122532 -100486 145783 -199908 -241566 72067 -12311 393772 -205178
10832B36505F8216b62891A6716J9717H209h925j4531H0447d6793l50088d3792
$$ 236505 68216 -262891 16716 36433 8209 -8925 -23456 80447 -46793 -396881 -43792
10820B4583b4554J624H4991J8383a37234A92941H9085a15717A46313H057M0414
$$ 24583 -24554 -22930 84991 103374 -137234 192941 89085 -115717 146313 8057 48471
10809D8471c167G4163d5960j71811H4303h5545K6871B55298a8431E8284C009K6961
$$ 48471 -3167 74163 -45960 -217771 84303 -85545 -58674 255298 -18431 58284 3009 29970
10797B9970J58956b11494m3839d9358j81265H395L0998L94327C002b08422M1217
$$ 29970 188926 -211494 -255333 -49358 -230623 8395 39393 433720 3002 -208422 -167205
10786a67205j8520A50745C7925d62160I0248a52595q5437B6553r249b42646F4423
$$ -167205 -185725 150745 37925 -462160 90248 -152595 -238032 26553 17304 -242646 64423
10774A34702M0762a53224l8629Q866B61477E039b1925k53127a20736A25366a74154
$$ 134702 175464 -153224 -191853 -182987 261477 5039 -21925 -275052 -120736 125366 -174154
10762A7247L57177q2366a35310A31825c00481m1713b9258k42235a06397D3758
$$ 17247 374424 292058 -135310 131825 -300481 -342194 -29258 -271493 -106397 43758
10751c73133a45393G9019h9500C2163J34659J4183A6113a21504I3330j1860j3648
$$ -373133 -145393 79019 -89500 32163 166822 181005 16113 -121504 93330 81470 67822
10740F7822J43798f3894j60504i4088L1261K2949n1630c8276j68325P0452A61156
$$ 67822 211620 -63894 -224398 -94088 -62827 -39878 -91508 -38276 -206601 -136149 161156
10728b71647j78462a20977j79523B62846A18238d9484A5103b02424I9196o265
$$ -271647 -450109 -120977 -300500 262846 118238 -49484 15103 -202424 99196 92931
10718I2931b17896j87618c6928j39528B95870D899a07405l3728D5813i5439e318
$$ 92931 -217896 -405514 -36928 -176456 295870 4899 -107405 -141133 45813 -95439 -5318
10706a43454a574l30214J21583g9135B050a25366A1587M0712O7122E2913a08287
$$ -143454 -1574 -331788 -210205 -79135 2050 -125366 11587 52299 119421 52913 -108287
10694A23581C1798e4870j5724j09221Q1970B76495A12820a83040A00363l3720
$$ 123581 31798 -54870 -70594 -179815 -97845 276495 112820 -183040 100363 66643
10684F6643g8223j31034B77885F5543i5248L5450B54340c2439j22973D437N8725
$$ 66643 -78223 -209257 277885 65543 -95248 -59798 254340 -32439 -155412 4437 63162
10673F3162e0987n0542A76879f6487A5435l776a39722j04498a06703j30233A99336
$$ 63162 -50987 -101529 176879 -66487 15435 11659 -139722 -244220 -106703 -236936 199336
10661a1138F0519e4610p6258L3653j92526k47J38428j24667f8432A0522e8968
$$ -11138 60519 -54610 -130868 -97215 -289741 -289988 -151560 -276227 -68432 10522 -58968
10649H2720a76420L0281M3013j47858C4945K35489B1675N8567c84250H7575O6647
$$ 82720 -176420 -146139 -103126 -250984 34945 270434 21675 80242 -384250 87575 154222
10638A54222G3664P5630l0279c98826r8506B93132k2737e9056m2809B42586G6356
$$ 154222 73664 149294 119015 -398826 -497332 293132 270395 -59056 -101865 242586 76356
10626b39114I8168l4599j4282c3880R233j09025F1401N3494C723a12481G9563
$$ -239114 98168 63569 49287 -33880 -24647 -133672 61401 114895 3723 -112481 79563
10614a48775n753j35620g7719E22679d30137b03559G2592a90494L9427C29088
$$ -148775 -154528 -290148 -77719 522679 -430137 -203559 72592 -190494 -151067 329088
10603H1005J09535a17538q2065A6931c25882L8168Q8587A13734b9238a395k06319
$$ 81005 190540 -117538 -199603 16931 -325882 -287714 -199127 113734 -29238 -1395 -207714
10592b07714R8587G4500c77447a03629p5961A09122i6547c3334j0182m908j35358
$$ -207714 -109127 74500 -377447 -103629 -179590 109122 -96547 -33334 -43516 -48424 -183782
10581a83782A17544l015Q578b62282B4071a47194O1257A46537a21956k0309N7573
$$ -183782 117544 114529 123107 -262282 24071 -147194 -85937 146537 -121956 -142265 -84692
10570h4692j04540E7306L0608c06986o4721c9619A39173J658b07240b3419a1409
$$ -84692 -189232 57306 87914 -306986 -371707 -39619 139173 140831 -207240 -23419 -11409
10558D8603j3035h8007A17162C2470b38201I8929R9171a22193N5708l1668C3932
$$ 48603 35568 -88007 117162 32470 -238201 98929 198100 -122193 -66485 -98153 33932
10546A13963N0880k1314j5988O2216c8490A69799b76066b8417l20251N4187i3069
$$ 113963 164843 143529 127541 189757 -38490 169799 -276066 -28417 -348668 -294481 -93069
10534a69539b6660q7218q8574N5150G0669a74143M8818A30710m0700J07272o0324
$$ -169539 -26660 -113878 -202452 -147302 70669 -174143 -125325 130710 90010 197282 136958
10523A36958b16773A41513o1057c99247C43526b3668n6861A72146J71195a46059
$$ 136958 -216773 141513 80456 -399247 343526 -23668 -80529 172146 343341 -146059
10512B52543h7081A39590b4387r4089D0330J03337b38995P8223M3784B82643l432
$$ 252543 -87081 139590 -24387 -118476 40330 143667 -238995 -160772 -116988 282643 279211
10501B79211A25354b88189B40976h422j10384j07226j62637i6025A59636o7386
$$ 279211 125354 -288189 240976 -8422 -118806 -226032 -388669 -96025 159636 92250
10491I2250a62835h702o3760G4938l0846P6170g7063C30719p4297n8880N07221
$$ 92250 -162835 -8702 -72462 74938 44092 120262 -77063 330719 256422 197542 704763
10480G04763j94171j8326A80523P9463e1115F7324J98694D4555j9807a43003d5344
$$ 704763 510592 492266 180523 259986 -51115 67324 266018 44555 24748 -143003 -45344
10468b29595a1920B97072F1539L03153b89342a17195r8413M8052O2970A4937d0910
$$ -229595 -11920 297072 61539 364692 -289342 -117195 -215608 -167556 -104586 14937 -40910
10456a99826j6440D1806c45600C7182d61366E6400P8091F5585c2909A10477a61600
$$ -199826 -216266 41806 -345600 37182 -461366 56400 134491 65585 -32909 110477 -161600
10444c2950A74421C3798K12091b72020A51513J54315G1602k4416K8991A8893N8174
$$ -32950 174421 33798 245889 -272020 151513 305828 71602 47186 76177 18893 77067
10433G7067K0371r382b7376j08201J7047j22098c9180r703A44521c7882O298p1990
$$ 77067 97438 88056 -27376 -135577 -118530 -240628 -39180 -48883 144521 -37882 -31584 -103574
10421a03574A48745o4051i2998j23744A92198C3394J33943L6700e5121j62207
$$ -103574 148745 84694 -92998 -216742 192198 33394 167337 204037 -55121 -217328
10411b17328B8060O6169a16553B20948J28973A63048a32043k18146J85a28541
$$ -217328 28060 94229 -116553 220948 349921 163048 -132043 -350189 -350004 -128541
10400a57324D05216H7007K9255a03113b8400r6345B24606i1378A97752f5785E6592
$$ -157324 405216 87007 116262 -103113 -28400 -124745 224606 -91378 197752 -65785 56592
10388A26157J45932A2200K19289J74766a2071C0624O2368J28612E486J62326R8126
$$ 126157 272089 12200 231489 406255 -12071 30624 92992 221604 5486 167812 265938
10377B65938h1409D44776I0569h8256E43610j16519k4267A87578L48770j85817
$$ 265938 -81409 444776 90569 -88256 543610 427091 402824 187578 536348 350531
10367C50531A35430M14223J02781j09107j55952E7732M43683L9889a67922F47224
$$ 350531 135430 549653 652434 543327 387375 57732 501415 541304 -167922 647224
10356C32597l971j42748K34113j89165R7384K03125n1443K57197j43812k27182
$$ 332597 328626 185878 419991 230826 328210 531335 479892 737089 593277 366095
10346C66095j28909A04460J39283L58287k90844G3810J00050f4383G6772J64962
$$ 366095 237186 104460 243743 602030 311186 73810 173860 -64383 76772 241734
10336B41734D5803M7676C9002c4604A05217m0193R2861p5580J45195O519a083
$$ 241734 45803 93479 39002 -34604 105217 65024 157885 82305 227500 234019 -1083
10324C63995A2979K70590J07584j20414q3669J00556d4848B25204K5906g8348
$$ 363995 12979 283569 391153 270739 187070 287626 -44848 225204 251110 -78348
10313A63771l4444d2682G6727P12a6211A34812b19581J0290l8817j70092c3389
$$ 163771 129327 -42682 76727 77439 -16211 134812 -219581 -209291 -248108 -418200 -33389
10301c1825k22603b2356l56514J12916D61543A01644J19265d46781B77121a57424
$$ -31825 -254428 -22356 -378870 -265954 461543 101644 220909 -446781 277121 -157424
10290G3111A5004J30742K82979a70579A87911j1962h2652o2966c3953m5545A94832
$$ 73111 15004 145746 428725 -170579 187911 175949 -82652 -145618 -33953 -79498 194832
10278c80550D71865C4943G713l105d10686B7869O0454a04109K5910k55599E9154
$$ -380550 471865 34943 7713 4608 -410686 27869 88323 -104109 -78199 -333798 59154
10266A02293a29648K6665E60127C0404Q3782F692a43177A96136K95547j42097
$$ 102293 -129648 -102983 560127 30404 114186 6692 -143177 196136 491683 349586
10256C49586l7166j8417K461a4593j95076A91984L14207a11836A05536d7301k9233
$$ 349586 312420 294003 296464 -14593 -209669 191984 506191 -111836 105536 -47301 -76534
10245g6534E3074K27412B3437K22508a39347B1495Q2244B7199J29343b60376j8513
$$ -76534 53074 280486 23437 245945 -139347 21495 103739 27199 156542 -260376 -278889
10234b78889C87229A6758f4950j19082B0316P1752C8387a42955B0591c0032k39929
$$ -278889 387229 16758 -64950 -184032 20316 92068 38387 -142955 20591 -30032 -269961
10223b69961h7925c6679j28562k2749B11365j04256b26021A79717D4137a58176
$$ -269961 -87925 -36679 -165241 -187990 211365 107109 -226021 179717 44137 -158176
10212B70687j15425g9423J7957H7408a22228f0744A6818a88172J7579A4235d0532
$$ 270687 155262 -79423 -61466 87408 -122228 -60744 16818 -188172 -170593 14235 -40532
10200B10007D7425b47373B84094a26397A6487a75978K5789M7832l06139a61436
$$ 210007 47425 -247373 284094 -126397 16487 -175978 -150189 -102357 -408496 -161436
10189a65680e8926B8401a04056r2066i175q540m3906G727O0176L1260b45594A4437
$$ -165680 -58926 28401 -104056 -196122 -9175 -17715 -61621 7727 67903 99163 -245594 14437
10176d00812e7553R229k70046H4342a87431N1069j99604n0462g4965A63638E626
$$ -400812 -57553 -48324 -318370 84342 -187431 -136362 -335966 -386428 -74965 163638 5626
10164B43175b03979k14624O3465H2558i8175G5718d77426a57553E0788J16247
$$ 243175 -203979 -418603 -355138 82558 -98175 75718 -477426 -157553 50788 167035
10154A67035c94093E3341O0716C2379J36503A2897Q323J54579c00399a0581l0133
$$ 167035 -394093 53341 114057 32379 168882 12897 21220 175799 -300399 -10581 -40714
10143d0714m8763B71199a2920H2954a74254K3352D5313b29489C6130a73808A28319
$$ -40714 -89477 271199 -12920 82954 -174254 -150902 45313 -229489 36130 -173808 128319
10131f2278F2958a66992B34163p0379d92378B22077a95003L2159M3427k9790L5727
$$ -62278 62958 -166992 234163 163784 -492378 222077 -195003 -162844 -119417 -149207 -113480
10120a13480j56828I6885a64976j09004a22144r8244g8111p3256A18065K9669
$$ -113480 -270308 96885 -164976 -273980 -122144 -220388 -78111 -151367 118065 147734
10110A47734J33629a44897A8587C371c60843A37591a76805B09091b86312L6583
$$ 147734 281363 -144897 18587 3371 -360843 137591 -176805 209091 -286312 -249729
10100b49729m3595A4748d1526D65013d18459A48698a68104n4854a9075l13860
$$ -249729 -293324 14748 -41526 465013 -418459 148698 -168104 -222958 -19075 -332935
10090c32935a44957j5406r1172B8567j2461a40690k4910c2610l82489A92057m4096
$$ -332935 -144957 -160363 -251535 28567 16106 -140690 -165600 -32610 -415099 192057 147961
10079A47961a66318I2785c8460j4163B9710a47975r2832A34689A3370a26282k12316
$$ 147961 -166318 92785 -38460 -52623 29710 -147975 -240807 134689 13370 -126282 -338598
10068c38598A10342N0345a8555A13250a90829C6346j5424R9718D0661a70454C4907
$$ -338598 110342 160687 -18555 113250 -190829 36346 20922 120640 40661 -170454 34907
10056A62089l7653n9220c9450A64553E3118i4786E9720b26044A91754a32033B13139
$$ 162089 124436 65216 -39450 164553 53118 -94786 59720 -226044 191754 -132033 213139
10044C3160e5045k2365H5863D35N4625j7429c0926q6427L5451I6981a68533c6351
$$ 33160 -55045 -77410 85863 435 55060 37631 -30926 -117353 -81902 96981 -168533 -36351
10031B4109b96636i2861E7316R0309b17805N828k06502h8439l31867A98306q8211
$$ 24109 -296636 -92861 57316 147625 -217805 -211977 -418479 -88439 -420306 198306 110095
10020A10095L13325a65046A93144E4160e0182J7219j17122P0709A3882R8096a70547
$$ 110095 423420 -165046 193144 54160 -50182 -32963 -150085 -79376 13882 111978 -170547
10008c1800j10442A28134b18287c2887k00169m4874J17942B13889a43300F227
$$ -31800 -142242 128134 -218287 -32887 -233056 -277930 -159988 213889 -143300 6227
9997H744b5539E8880e7498A07944b28728H0855a9909j26434M1649o6175a7011
$$ 8744 -25539 58880 -57498 107944 -228728 80855 -19909 -146343 -104694 -170869 -17011
9985d4854C2457b76560C5504a90270E2874c52385F287J6921d1667j93838a17693
$$ -44854 32457 -276560 35504 -190270 52874 -352385 6287 23208 -41667 -235505 -117693
9973A72449f9464n0837j20367J3280H1632a03910l014N0313n124j00453q3178
$$ 172449 -69464 -120301 -240668 -227388 81632 -103910 -106924 -56611 -61735 -162188 -245366
9962b45366b0392C70477A60706i2812l2829o7098d102n1564A37723b64782J06689
$$ -245366 -20392 370477 160706 -92812 -125641 -192739 -4102 -55666 137723 -264782 -158093
9951a58093B37960h3696J8785k06580c148I5908h7050C378L15891a72028A88600
$$ -158093 237960 -83696 -64911 -271491 -3148 95908 -87050 3378 319269 -172028 188600
9939a63730a365B1080a00063A87117a39479c7570j24594B99688F7820c4127e344
$$ -163730 -1365 21080 -100063 187117 -139479 -37570 -162164 299688 67820 -34127 -5344
9927a29594B11008d416j69490a6403k47667j00117N2774K5929A35450J1612E2376
$$ -129594 211008 -4416 -173906 -16403 -264070 -364187 -311413 -285484 135450 147062 52376
9915a81613l1598d4392B9412h6916B3883N200e3795b4496H9799L6962a95276j7161
$$ -181613 -213211 -44392 29412 -86916 23883 29083 -53795 -24496 89799 126761 -195276 -212437
9903b12437P0794K6183F4098A58b06557I3917K03148a04936j96500f1126m3873
$$ -212437 -141643 -115460 64098 158 -206557 93917 297065 -104936 -301436 -61126 -104999
9892a04999A07381b37116H0576b87661J23776a4721D1648c8234A11973a5221f417
$$ -104999 107381 -237116 80576 -287661 -163885 -14721 41648 -38234 111973 -15221 -6417
9880a86885r8673A5410b24734g1531l55770J19403G7975Q0009c10295F719R4007
$$ -186885 -285558 15410 -224734 -71531 -427301 -307898 77975 157984 -310295 6719 100726
9869A00726d64127f5139P770A79947a66626L3740D5690a84417O5400B23405a66794
$$ 100726 -464127 -65139 -57369 179947 -166626 -132886 45690 -184417 -119017 223405 -166794
9857b03365k4025h8592A54375b43919g4060j70354A43050o6102a40439b0706B22630
$$ -203365 -227390 -88592 154375 -243919 -74060 -244414 143050 76948 -140439 -20706 222630
9845B8166a76264q3322B13439a3248H6655g4584n1212c9713k08462n2408P0651
$$ 28166 -176264 -259586 213439 -13248 86655 -74584 -125796 -39713 -248175 -300583 -229932
9834b29932A44309a29830B68263a96937p5083A6146J13046M5942a13288M2204
$$ -229932 144309 -129830 268263 -196937 -272020 16146 129192 175134 -113288 -71084
9824g1084n4692m5312N7800E6358K48223B355J43397c23656P2078a1281A30653
$$ -71084 -125776 -171088 -113288 56358 304581 2355 145752 -323656 -251578 -11281 130653
9812a16770L2213G6848B9110a8349A00419A6552b23274P9984d2528B4737b48576
$$ -116770 -84557 76848 29110 -18349 100419 16552 -223274 -143290 -42528 24737 -248576
9800a40347n1031D7178b8506k52093J40266o6311A72074J01991I0431b08114c0748
$$ -140347 -191378 47178 -28506 -280599 -140333 -206644 172074 274065 90431 -208114 -30748
9788a83492B79240A08526C1190H008c0536n24902A47579b41707j79701i2024j7461
$$ -183492 279240 108526 31190 8008 -30536 -555438 147579 -241707 -421408 -92024 -109485
9777a09485A26918M9004P8088d07652C3155N662a42246A00142b05794i6203k20189
$$ -109485 126918 175922 254010 -407652 33155 38817 -142246 100142 -205794 -96203 -316392
9766c16392B37389b43525A32794J8805a40430r6321M7959c1290C1839K33433a67473
$$ -316392 237389 -243525 132794 151599 -140430 -236751 -188792 -31290 31839 265272 -167473
9754C974a03629a5808l71383a21612l5451m2208b9954h344q2985C05781a9718
$$ 3974 -103629 -15808 -387191 -121612 -157063 -199271 -29954 -8344 -91329 305781 -19718
9742B17274c5283G7859a06372j59977J2439m2129f936l7727j95723A28264a43102
$$ 217274 -35283 77859 -106372 -266349 -253910 -296039 -6936 -44663 -240386 128264 -143102
9730e43613B525N0616b25929Q3852j32715J13160g6414A5110a31478A1295c06507
$$ -543613 2525 53141 -225929 -142077 -274792 -161632 -76414 15110 -131478 11295 -306507
9718E608M3666b68263F5778b48394a5033D9822a38546j72983a19513I0082C6938
$$ 5608 49274 -268263 65778 -248394 -15033 49822 -138546 -311529 -119513 90082 36938
9706A7209j872i022k59343a29929f339j35090K6104A04076B4643c61205M5795
$$ 17209 15337 -9022 -268365 -129929 -6339 -141429 -115325 104076 24643 -361205 -315410
9695c15410C55163a71993j7060H5835A1336a78771N0511e3273B06927b32281F7436
$$ -315410 355163 -171993 -189053 85835 11336 -178771 -128260 -53273 206927 -232281 67436
9683d13098a15083k83257e595o6164A43431a34602l3745h3373C1545a37416B05831
$$ -413098 -115083 -398340 -5595 -71759 143431 -134602 -168347 -83373 31545 -137416 205831
9671c37596b7819j52801r0933e2081o993j6379B4489a11966H7325a34412N207
$$ -337596 -27819 -180620 -271553 -52081 -59074 -75453 24489 -111966 87325 -134412 -129205
9660a29205G543f6497o9834G9921a69637e7684o6001k8800K6629l98801g3966
$$ -129205 7543 -66497 -136331 79921 -169637 -57684 -123685 -152485 -125856 -524657 -73966
9648C0982b12777k4056k41073e9269j7161K8163A0200a59554g3612m6584d7113
$$ 30982 -212777 -236833 -477906 -59269 -76430 -48267 10200 -159554 -73612 -120196 -47113
9636f8418E7941r704e2325A7777L258J2305P0609d8246q8764O5795A31353L9120
$$ -68418 57941 48237 -52325 17777 21035 33340 103949 -48246 -137010 -71215 131353 170473
9624A70473c11894a33472b2709B445b36262B01175J77839A19210e8220m8287E4904
$$ 170473 -311894 -133472 -22709 2445 -236262 201175 379014 119210 -58220 -106507 54904
9612a97818k8181a3586j3816q2140A05908a45836f5726m3440m21815A67270l3780
$$ -197818 -225999 -13586 -27402 -109542 105908 -145836 -65726 -109166 -530981 167270 133490
9601A33490J45336D7270K4878k3765b8948l57569a6759k9468r9153C7358b53772
$$ 133490 278826 47270 72148 48383 -28948 -386517 -16759 -46227 -145380 37358 -253772
9589b0676C4495b61416A27059b93425a22749j11605R9490j21763f1859p0896G8759
$$ -20676 34495 -261416 127059 -293425 -122749 -234354 -134864 -256627 -61859 -132755 78759
9577b88879G0119b97029d2189j57808i0613o5921P7249l9302e7550A18290E1278
$$ -288879 70119 -297029 -42189 -199997 -90613 -156534 -79285 -118587 -57550 118290 51278
9565A00371a74347G8197a26380A28888b49567J13772J2442e6811A61750E8410
$$ 100371 -174347 78197 -126380 128888 -249567 -135795 -123353 -56811 161750 58410
9554F3028K0003b07372j56934C44912a71424O2502B505K01904c7539r5867A08959
$$ 63028 83031 -207372 -364306 344912 -171424 -108922 2505 204409 -37539 -133406 108959
9542B5684i0799j46347H7838i6326o4779O6440m5004d9842j96584A05430b75358
$$ 25684 -90799 -237146 87838 -96326 -161105 -94665 -139669 -49842 -246426 105430 -275358
9530a2186m2189l08644d9107j21537D7909c1880k5550j73902K8553B92620g4797
$$ -12186 -54375 -363019 -49107 -170644 47909 -31880 -57430 -231332 -202779 292620 -74797
9518A5440c06747k9473O5280a8112n0450B3281J25766c77895J21616a4457I9152
$$ 15440 -306747 -336220 -270940 -18112 -68562 23281 149047 -377895 -256279 -14457 99152
9506b25897A01366D4796a28752q5052a5253C8489d2768k77228N0839J31638a706
$$ -225897 101366 44796 -128752 -213804 -15253 38489 -42768 -319996 -269157 -137519 -1706
9494A2752a05900j93982a32384q7893I9770k0130f1932L0897j23888D5223g230
$$ 12752 -105900 -299882 -132384 -220277 99770 79640 -61932 -31035 -154923 45223 -7230
9482D8382N0057j4331h1606p5182K9628J3537j86230i011r2138m91519b8935k69160
$$ 48382 98439 84108 -81606 -156788 -127160 -113623 -299853 -9011 -101149 -592668 -28935 -298095
9470b98095j9001E5001a1195E617a01842n1190A75392b07115D625R8091i1264
$$ -298095 -317096 55001 -11195 5617 -101842 -153032 175392 -207115 4625 102716 -91264
9458b44373c9579j32841f1669j0909o6460O8552j47916E2263l417K9854K4100
$$ -244373 -39579 -172420 -61669 -72578 -139038 -70486 -218402 52263 48846 78700 102800
9447A02800O8429J28117G3224h9751j0469D6832c71623Q0686J13006h1650q1098
$$ 102800 171229 299346 73224 -89751 -100220 46832 -371623 -290937 -177931 -81650 -162748
9436a62748C1473J95734G6251J51464d8244F9873A5075a40226C008L19439d24426
$$ -162748 31473 227207 76251 227715 -48244 69873 15075 -140226 3008 322447 -424426
9424g6388k28960A88090a37581l3328A25358f9158J1791D47b20930b3141q4422
$$ -76388 -305348 188090 -137581 -170909 125358 -69158 -57367 447 -220930 -23141 -107563
9413a07563d6467K2896r0474H0867O4424a77541Q4302d4623B26975a33560M8841
$$ -107563 -46467 -23571 -114045 80867 145291 -177541 -93239 -44623 226975 -133560 -84719
9402h4719A40004J07198C5402b65412A89971b32990M0579B266M6410c01559a27420
$$ -84719 140004 247202 35402 -265412 189971 -232990 -192411 2266 48676 -301559 -127420
9390A46315b27464r9119B10032f2317G8171a77973B245a95328A25090A111a11498
$$ 146315 -227464 -326583 210032 -62317 78171 -177973 2245 -195328 125090 1111 -111498
9378B39066j06232K2223a93430a8729F906f6576m6695l2622C35038j34714A3358
$$ 239066 132834 155057 -193430 -18729 6906 -66576 -113271 -145893 335038 200324 13358
9366h4704A1821K43249p1141B688f7973E6431J38619b17804A35682L2241b56460
$$ -84704 11821 255070 183929 2688 -67973 56431 195050 -217804 135682 167923 -256460
9354a14569A01717a56075Q955B27271F8531a49918k16714R1509A33859a31355
$$ -114569 101717 -156075 -147120 227271 68531 -149918 -366632 -275123 133859 -131355
9343c7554j75580h8707A48056A2849J57117D7037M1536J9260J6842b54494N7701
$$ -37554 -213134 -88707 148056 12849 169966 47037 88573 107833 124675 -254494 -196793
9332a96793a033p7566r1474L6826l1273A8646a01005o8091B0184e8936k5063j71467
$$ -196793 -1033 -78599 -170073 -133247 -164520 18646 -101005 -169096 20184 -58936 -83999 -255466
9320b55466G693b76920N0745J01982k3461k33842L2072a380j79504A1257i5228
$$ -255466 7693 -276920 -226175 -124193 -147654 -381496 -349424 -1380 -180884 11257 -95228
9308a10320k5844J2933k60172a32924r086G9172b95210L6491L9334A38296b58502
$$ -110320 -136164 -123231 -383403 -132924 -142010 79172 -295210 -258719 -219385 138296 -258502
9296b85240a12619c4459k18231a3890C7508b35462C8591L9932l3117k408k0105
$$ -285240 -112619 -34459 -252690 -13890 37508 -235462 38591 78523 45406 42998 22893
9285B2893K73235D3319O3197a24927F7438D122c51572A1256K90447e9151k5279
$$ 22893 296128 43319 106516 -124927 67438 4122 -351572 11256 301703 -59151 -84430
9274h4430q4314I3506l0153c79136D4808a09232A7767b14428A09522O7145H6119
$$ -84430 -168744 93506 63353 -379136 44808 -109232 17767 -214428 109522 176667 86119
9262i1117a2819B77096j22696b74406A04725d46628A32721a6121j4985r2974b3220
$$ -91117 -12819 277096 154400 -274406 104725 -446628 132721 -16121 -31106 -124080 -23220
9250A90984a37589a4506j80888E3167c5438n1561p0994b0661B55845D2909J69942
$$ 190984 -137589 -14506 -195394 53167 -35438 -86999 -157993 -20661 255845 42909 212851
9239B12851c2454A21316L17578c95705a21250n76j86144a27060a0125q2706B2895
$$ 212851 -32454 121316 438894 -395705 -121250 -121826 -307970 -127060 -10125 -92831 22895
9227c89092J83012a9128p2001l55203C901c91717b8145B09701h1808o7838A25749
$$ -389092 -206080 -19128 -91129 -446332 3901 -391717 -28145 209701 -81808 -149646 125749
9215a87531f8181j18424A18793a93042j39163b378j1731o7734A4931N431f2104
$$ -187531 -68181 -186605 118793 -193042 -332205 -2378 -14109 -81843 14931 20362 -62104
9203e9325o2661L3033j00533Q2500F2923g0466B30985J28383A15493c24651d5607
$$ -59325 -121986 -88953 -189486 -106986 62923 -70466 230985 359368 115493 -324651 -45607
9191c78789P5706J06960A07122d5068B03192H1061c63931a6671q6127b9754j76610
$$ -378789 -303083 -196123 107122 -45068 203192 81061 -363931 -16671 -102798 -29754 -206364
9180b06364f5844k0320D8224j0056d9173j62105B56679b57100a23065B27507a3436
$$ -206364 -65844 -86164 48224 38168 -49173 -211278 256679 -257100 -123065 227507 -13436
9168a57311j544f4902j02502M0584B96273a76275A17152e5710j14695B25877b36157
$$ -157311 -158855 -64902 -167404 -126820 296273 -176275 117152 -55710 -170405 225877 -236157
9156b71729B5350e2095A81447b87985R1314e2661k6629B25282f7277A33095K2575
$$ -271729 25350 -52095 181447 -287985 -196671 -52661 -79290 225282 -67277 133095 155670
9145A55670c1710j13727L397B5706c76197B57354D0643Q9959e6134r4200p9505
$$ 155670 -31710 -145437 -142040 25706 -376197 257354 40643 130602 -56134 -150334 -229839
9134b29839j14377j17066G5045a8411l70157B4810a47356O2407B16574b06484
$$ -229839 -344216 -461282 75045 -18411 -388568 24810 -147356 -84949 216574 -206484
9123A22464B0424d7693a8240k47074R1843j15409A69163i5145G4919K3054Q2840
$$ 122464 20424 -47693 -18240 -265314 -173471 -288880 169163 -95145 74919 97973 180813
9112A80813m8113b7749l74041J78712c8710q8406j00055j0163c482A62343b41257
$$ 180813 132700 -27749 -401790 -223078 -38710 -127116 -227171 -237334 -3482 162343 -241257
9100a07023M1820j33940K353G4912d0850m8358k7128k83895c9762a1560k01018
$$ -107023 -65203 -199143 -196790 74912 -40850 -89208 -116336 -400231 -39762 -11560 -212578
9089b12578d4503r8839j68249a19021B94676a33192k44205i3448E0278b02182
$$ -212578 -44503 -143342 -311591 -119021 294676 -133192 -377397 -93448 50278 -202182
9078c29992F8392c7866J587A38627g2635m09109B98686a99045f9444C4677L2961
$$ -329992 68392 -37866 -36279 138627 -72635 -481744 298686 -199045 -69444 34677 67638
9067F7638J70241I9518R995b81798n0124c070p3273A60580N1294b8922j23501
$$ 67638 237879 99518 109513 -281798 -331922 -3070 -76343 160580 211874 -28922 -152423
9056a52423N4386B45742d2615j41128k9630j55810I8898c52073B53053a74305
$$ -152423 -98037 245742 -42615 -183743 -213373 -369183 98898 -352073 253053 -174305
9045c28880L4325a46397L7056L0866l35037C135h5468i347j13817j44135o9137
$$ -328880 -294555 -146397 -109341 -78475 -413512 3135 -85468 -9347 -123164 -267299 -336436
9034c36436f4771J830L0736H5083J37992a19057m22874a07779j69393b4925j66862
$$ -336436 -64771 -62941 -32205 85083 223075 -119057 -541931 -107779 -277172 -24925 -191787
9023a91787c505j6698m6870B9835g1064A70180b3140l63744a38634A53031c75766
$$ -191787 -3505 -20203 -67073 29835 -71064 170180 -23140 -386884 -138634 153031 -375766
9011a44664O1579i227D5639L7550B8180J12819a81966b2889q1798A12851B3779
$$ -144664 -83085 -9227 45639 83189 28180 140999 -181966 -22889 -104687 112851 23779
8999C06093a59187P5656k18608h1091k83679j40840C38377A54087K14514c01255
$$ 306093 -159187 -83531 -302139 -81091 -364770 -505610 338377 154087 368601 -301255
8988a29482B97463I0458N6319J59590p4381c16357A01124b86965j2483J16691
$$ -129482 297463 90458 146777 306367 231986 -316357 101124 -286965 -299448 -182757
8978a82757n4231M3104c2334C7717H81b88691D9784n510Q799j6338a32829r775
$$ -182757 -236988 -193884 -32334 37717 881 -288691 49784 44274 53073 36735 -132829 -142604
8966a42604j58831a00286j19855J08882J1724q5293B46655j18109a22614A2723
$$ -142604 -301435 -100286 -220141 -111259 -99535 -184828 246655 128546 -122614 12723
8955B5073P2295i8758I1703c5342q3695i427j37423d4862k16274J00622j02400
$$ 25073 97368 -98758 91703 -35342 -119037 -9427 -146850 -44862 -261136 -160514 -262914
8944b62914Q5297o8067H9381d16246N8589C15K70054j07585A2618n116J15593
$$ -262914 -177617 -245684 89381 -416246 -357657 315 270369 162784 12618 7502 123095
8933A23095c6517A4754b42146d1870k63837i8882L1667A80641M1135L8481P63617
$$ 123095 -36517 14754 -242146 -41870 -305707 -98882 -67215 180641 221776 260257 1023874
8922A023874K664249M223388A987890H11867C01804j33240R3958J48559h2106
$$ 1023874 3688123 7911511 1987890 811867 301804 168564 262522 411081 -82106
8912b43779f6645A6392N7604L7710b6795k01522G206a26186o2447A8094M5987
$$ -243779 -66645 16392 73996 111706 -26795 -228317 7206 -126186 -188633 18094 64081
8901F4081k7633c34602B51866e0193r9873C42278a87329M6505A6670K74996a41442
$$ 64081 36448 -334602 251866 -50193 -150066 342278 -187329 -140824 16670 291666 -141442
$$ [...]
##END NTUPLES=NMR SPECTRUM
##END=
