
##TITLE=AC1372_2418_7221647_llQExT8r8K
##JCAMPDX= 6.0         $$ Bruker NMR JCAMP-DX V2.0
##DATA TYPE= NMR SPECTRUM
##DATA CLASS= NTUPLES
##ORIGIN= BRUKER
##OWNER= Administrator
$$ 1.72 TOPSPIN		Version 2.1
$$ 2012-12-14 02:11:57.040 -0500  Administrator@X
$$ Compression mode = diff/dup
##.OBSERVE FREQUENCY= 400.02188249412
##.OBSERVE NUCLEUS= ^1H
##.ACQUISITION MODE= SIMULTANEOUS (DQD)
##.ACQUISITION SCHEME= undefined
##.AVERAGES= 64
##.DIGITISER RES= 22
##SPECTROMETER/DATA SYSTEM= spect
##.PULSE SEQUENCE= noesygpps1d.comp
##.SOLVENT NAME= COFFEE_meoh
##.SHIFT REFERENCE= INTERNAL, COFFEE_meoh, 1, 14.96098
##AUDIT TRAIL= $$ (NUMBER, WHEN, WHO, WHERE, PROCESS, VERSION, WHAT)
$$ ##TITLE= Audit trail, TOPSPIN		Version 2.1
$$ ##JCAMPDX= 5.01
$$ ##ORIGIN= Bruker BioSpin GmbH
$$ ##OWNER= Administrator
$$ $$ E:\/data/COFFEE/nmr/AC1372_2418_7221647_llQExT8r8K/22/pdata/1/auditp.txt
$$ ##AUDIT TRAIL=  $$ (NUMBER, WHEN, WHO, WHERE, PROCESS, VERSION, WHAT)
(   1,<2012-12-14 02:11:51.228 -0500>,<Administrator>,<X>,<go>,<TOPSPIN 2.1>,
      <created by zg
	started at 2012-12-14 02:00:19.947 -0500,
	POWCHK enabled, PULCHK disabled,
       configuration hash MD5:
       86 BA 57 50 F2 9D 5C 9B 26 00 A9 28 5F 66 2E 89
       data hash MD5: 64K
       78 26 0F 8B CB B7 B8 76 E0 37 60 80 B4 34 17 1A>)
(   2,<2012-12-14 02:11:54.244 -0500>,<Administrator>,<X>,<proc1d>,<TOPSPIN 2.1>,
      <Start of raw data processing
       efp LB = 0.3 FT_mod = 6 PKNL = 1 PHC0 = 0 PHC1 = 0 SI = 128K 
       data hash MD5: 128K
       CC C6 12 BF 51 DC 80 45 A4 BB 0B 3D FF 3A 7C 14>)
(   3,<2012-12-14 02:11:55.306 -0500>,<Administrator>,<X>,<proc1d>,<TOPSPIN 2.1>,
      <pk PHC0 = -79.06311 PHC1 = 0 
       data hash MD5: 128K
       E6 9D 5E E9 84 96 43 08 20 92 40 FA 00 EB C7 F8>)
(   4,<2012-12-14 02:11:55.994 -0500>,<Administrator>,<X>,<proc1d>,<TOPSPIN 2.1>,
      <abs ABSG = 1 
       data hash MD5: 128K
       D7 8B 11 F7 8B 9A 86 23 1E 30 C1 FD AE 52 A5 78>)
(   5,<2012-12-14 02:11:56.165 -0500>,<Administrator>,<X>,<proc1d>,<TOPSPIN 2.1>,
      <abs ABSG = 2 
       data hash MD5: 128K
       EF 08 CB EE F2 DF DF A4 F5 F2 06 9D D7 03 BE 7E>)
(   6,<2012-12-14 02:11:56.322 -0500>,<Administrator>,<X>,<proc1d>,<TOPSPIN 2.1>,
      <abs ABSG = 3 
       data hash MD5: 128K
       28 FA 1D 7E 30 21 23 86 2F 45 D6 51 E4 52 7A 29>)
(   7,<2012-12-14 02:11:56.509 -0500>,<Administrator>,<X>,<proc1d>,<TOPSPIN 2.1>,
      <abs ABSG = 4 
       data hash MD5: 128K
       E6 FC FE 84 B8 C0 DB C9 CD 6D C1 57 BF 01 90 2D>)
(   8,<2012-12-14 02:11:56.697 -0500>,<Administrator>,<X>,<proc1d>,<TOPSPIN 2.1>,
      <abs ABSG = 5 
       data hash MD5: 128K
       9B C1 88 46 5B 08 02 C1 20 30 10 2F 49 C0 1C 77>)
$$ ##END=
$$ 
$$ $$ hash MD5
$$ $$ 69 2B BE 80 4B 7C E0 01 19 26 1F 56 85 69 09 8E
##$RELAX= 
##$RELAX= 
##$RELAX= 
##$RELAX= 
##$RELAX= 
##$RELAX= 
##$RELAX= 
##$RELAX= 
##$RELAX= 
$$ Bruker specific parameters
$$ --------------------------
##$DU= <E:\>
##$EXPNO= 22
$$ [...]
##$TP07= 0
##$TPNAME0= <>
##$TPNAME1= <>
##$TPNAME2= <>
##$TPNAME3= <>
##$TPNAME4= <>
##$TPNAME5= <>
##$TPNAME6= <>
##$TPNAME7= <>
##$TPOAL= (0..7)
0.5 0.5 0.5 0.5 0.5 0.5 0.5 0.5
##$TPOFFS= (0..7)
0 0 0 0 0 0 0 0
##$TUNHIN= 0
##$TUNHOUT= 0
##$TUNXOUT= 0
##$USERA1= <user>
##$USERA2= <user>
##$USERA3= <user>
##$USERA4= <user>
##$USERA5= <user>
##$V9= 5
##$VALIST= <valist>
##$VCLIST= <CCCCCCCCCCCCCCC>
##$VD= 0
##$VDLIST= <DDDDDDDDDDDDDDD>
##$VPLIST= <PPPPPPPPPPPPPPP>
##$VTLIST= <TTTTTTTTTTTTTTT>
##$WBST= 1024
##$WBSW= 4
##$XGAIN= (0..3)
0 0 0 0
##$XL= 0
##$YL= 0
##$YMAX_a= 6333324
##$YMIN_a= -13998351
##$ZGOPTNS= <>
##$ZL1= 120
##$ZL2= 120
##$ZL3= 120
##$ZL4= 120
##$ABSF1= 14.96098
##$ABSF2= -5.597201
##$ABSG= 5
##$ABSL= 3
##$ALPHA= 0
##$AQORDER= 0
##$ASSFAC= 0
##$ASSFACI= 0
##$ASSFACX= 0
##$ASSWID= 0
##$AUNMP= <proc_prof1d_extract.lims>
##$AXLEFT= 0
##$AXNAME= <>
##$AXNUC= <1H>
##$AXRIGHT= 0
##$AXTYPE= 0
##$AXUNIT= <>
##$AZFE= 0.1
##$AZFW= 0.1
##$BCFW= 0
##$BC_mod= 0
##$BYTORDP= 0
##$COROFFS= 0
##$CY= 15
##$DATMOD= 1
##$DC= 0
##$DFILT= <>
##$DTYPP= 0
##$F1P= 0
##$F2P= 0
##$FCOR= 0.5
##$FTSIZE= 131072
##$FT_mod= 6
##$GAMMA= 0
##$GB= 0
##$INTBC= 1
##$INTSCL= 1
##$ISEN= 128
##$LB= 0.3
##$LEV0= 0
##$LPBIN= 0
##$MAXI= 10000
##$MC2= 0
##$MEAN= 0
##$ME_mod= 0
##$MI= 0
##$NCOEF= 0
##$NC_proc= -2
##$NLEV= 6
##$NOISF1= 0
##$NOISF2= 0
##$NSP= 0
##$NTH_PI= 0
##$NZP= 0
##$OFFSET= 14.96098
##$PC= 1
##$PHC0= -79.06311
##$PHC1= 0
##$PH_mod= 1
##$PKNL= yes
##$PPARMOD= 0
##$PPDIAG= 0
##$PPIPTYP= 0
##$PPMPNUM= 2147483647
##$PPRESOL= 1
##$PSCAL= 4
##$PSIGN= 0
##$PYNMP= <proc.py>
##$REVERSE= no
##$SF= 400.020009645067
##$SI= 131072
##$SIGF1= 0
##$SIGF2= 0
##$SINO= 400
##$SIOLD= 131072
##$SPECTYP= <>
##$SREGLST= <1H.CDCl3>
##$SSB= 0
##$STSI= 131072
##$STSR= 0
##$SW_p= 8223.68421052631
##$SYMM= 0
##$S_DEV= 0
##$TDeff= 65536
##$TDoff= 0
##$TI= <>
##$TILT= no
##$TM1= 0
##$TM2= 0
##$TOPLEV= 0
##$USERP1= <user>
##$USERP2= <user>
##$USERP3= <user>
##$USERP4= <user>
##$USERP5= <user>
##$WDW= 1
##$XDIM= 131072
##$YMAX_p= 460339435
##$YMIN_p= -19078
##$CURPLOT= <Network HP LaserJet P1505>
##$CURPRIN= <$Network HP LaserJet P1505>
##$DFORMAT= <normdp>
##$LAYOUT= <+/1D_H.xwp>
##$LFORMAT= <normlp>
##$PFORMAT= <normpl>
##$SURQMSG= 1
$$ End of Bruker specific parameters
$$ ---------------------------------
##NTUPLES= NMR SPECTRUM
##VAR_NAME=  FREQUENCY,     SPECTRUM/REAL,   SPECTRUM/IMAG
##SYMBOL=    X,             R,               I
##VAR_TYPE=  INDEPENDENT,   DEPENDENT,       DEPENDENT
##VAR_FORM=  AFFN,          ASDF,            ASDF
##VAR_DIM=   131072,        131072,          131072
##UNITS=     HZ,            ARBITRARY UNITS, ARBITRARY UNITS
##FACTOR=    0.0627417313425164, 1,          1
##FIRST=     8223.62146879497, 2270,         -62676
##LAST=      0,             2968,            -62971
##MIN=       0,             -19078,          0
##MAX=       8223.62146879497, 460339435,    0
$$ Real data points
##PAGE= N=1
##DATA TABLE= (X++(R..R)), XYDATA
$$ [...]
63822E17907k0396j8107j6732j5577j3826j1850j0692j0508j0380r542q150o758
63810C65389n626m710l930l263k694k184j708j451j848l083m513n086m514l570
63796C17209l028k856k773k937l492l914l594k773k226k142k060j866k033k725
63782B78790l289l051k178j362q92m29L39J140J384Q42j18r41j349j339r57l54
63766B66236P8m4o24j159j282j008n12M2L74J98l96r87j285j327j164p27j36K30
63748B56507J63j29k75o8N32J341J948K060J989K302L052L707L968M100M276M184
63732B89657L549K708K247K417L080L927M534M554M126L875M257N145O078O622
63718C46776O517N843N113M720M256K967R41p85j540j772k181k765l164l365l515
$$ plain form
63822 517907 497511 479404 462672 447095 433269 421419 410727 400219 389839 380297 372147 365389
63810 365389 359763 355053 351123 347860 345166 342982 341274 339823 337975 334892 330379 325293 320779 317209
63796 317209 314181 311325 308552 305615 302123 298209 294615 291842 289616 287474 285414 283548 281515 278790
63782 278790 275501 272450 270272 268910 268018 267589 267928 269068 270452 271294 271176 270235 268886 267547 266590 266236
63766 266236 266314 266270 265646 264487 263205 262197 261685 261727 262101 262299 261903 260916 259631 258304 257140 256413 256277 256507
63748 256507 256670 256541 256266 256198 256730 258071 260019 262079 264068 266370 269422 273129 277097 281197 285473 289657
63732 289657 293206 295914 298161 300578 303658 307585 312119 316673 320799 324674 328931 334076 340154 346776
63718 346776 353293 359136 364249 368969 373225 376192 377133 376348 374808 373036 370855 368090 364926 361561 358046
63703C58046l468k983k153j289o42l86m72l62N18J884K672K410J795J653J928
63688C59151K160K258K305K166J849J722J789J395K50q01q13k7O10P91R10J058
63672C76773Q90L99J09M71J483K791L789L878L084K144J577J022n4j467k699l750
63656C90440m830n640n727n367n268n554n721n470m937m175l136k043j192m58
63642C30922M01J125J260R43P30P81R28J390K556M028M760M461M097M642N843
63627C68867O733O897O820P120P874Q784R781J1132J2854J4332J5056J5554J6883
63614E08687J9109K1127K2366K3735K6227K9304L1646L2902L3744L4490L4681
63603H18018L3784L1408K6984K0286J2329M911q87n175q297j0215j0918j0711
$$ plain form
63703 358046 354578 351595 349442 348153 347511 347125 346653 346291 346809 348693 351365 353775 355570 357223 359151
63688 359151 361311 363569 365874 368040 369889 371611 373400 374795 375045 374244 373431 373404 374014 374805 375715 376773
63672 376773 377663 378062 378171 378642 380125 382916 386705 390583 393667 395811 397388 398410 398356 396889 394190 390440
63656 390440 385610 379970 374243 368876 363608 358054 352333 346863 341926 337751 334615 332572 331380 330922
63642 330922 331323 332448 333708 334651 335381 336162 337090 338480 341036 345064 349824 354285 358382 363024 368867
63627 368867 375600 382497 389317 396437 404311 413095 422876 434008 446862 461194 476250 491804 508687
63614 508687 527796 548923 571289 595024 621251 650555 682201 715103 748847 783337 818018
63603 818018 851802 883210 910194 930480 942809 947720 946833 941658 933361 923146 912228 901517
63591I01517r950r013q548r216j1087j3779j7063k0770k4269k6697k7692k7392
63579F96041k5878k3258k0110j7074j4157j1143q462o732n599m056j909P7J541
63566E59281K925M318N118N262N706P065Q587R226R085R081R667J0626J1808J3490
63552F71245J6010J9322K2919K6237K9335L2999L7767M3104M8079N2399N5554
63541A054970N5100M7527L1897J1827o940k0459k7775k9533k6907k1642j5884
63530A052181j1294q533p560q106r985j3222j7798k3180k8358l2540l5558l7406
63518H18641l7842l6753l4583l1992k9334k6723k4319k2185k0060j7712j5358
63507E21780j3435j2010j0755r449q205p187o343n479m604m013l886l832l220
$$ plain form
63591 901517 891567 882554 874006 864790 853703 839924 822861 802091 777822 751125 723433 696041
63579 696041 670163 646905 626795 609721 595564 584421 575959 569227 563628 559572 557663 557740 559281
63566 559281 562206 566524 571642 576904 582610 589675 598262 607488 616573 625654 635321 645947 657755 671245
63552 671245 687255 706577 729496 755733 785068 818067 855834 898938 947017 999416 1054970
63541 1054970 1110070 1157597 1189494 1201321 1194381 1173922 1146147 1116614 1089707 1068065 1052181
63530 1052181 1040887 1032354 1024794 1016688 1006703 993481 975683 952503 924145 891605 856047 818641
63518 818641 780799 744046 709463 677471 648137 621414 597095 574910 554850 537138 521780
63507 521780 508345 496335 485580 476131 467926 460739 454396 448917 444313 440300 436414 432582 429362
63494D29362k124j523k003k724k352r34P5k47j161j350m68Q49J887K315K194K056
63478D23852K617L976N316N799N516N157M984M577L498J831K2j606l086m574n940
63463D51939o706o654o255o137o203n829m865l875l155k243p58P95J691K034K611
63448D06390L781N078N908O271O664P587R210J1354J3559J5283J6331J7299J9419
63435E44134K3602K9584L6241M2630M8141N1474N0428M3626L2276J9602Q594O97
63423I31029l873n490m793k267K109Q314J5514K2457K8473L3456L6915L7906L5957
63410A135707L1345K4438J5574N772l250j0145j4480j6326j6082j4811j3822j3626
63398A110294j3948j4880j7093k0715k4903k8908l2615l5739l7492l7573l6606
$$ plain form
63494 429362 427238 425715 423712 420988 418636 417702 417777 417530 416369 415019 414551 415400 417287 419602 421796 423852
63478 423852 426469 430445 435761 441560 447076 452233 457217 461794 465292 467123 467145 465539 462453 457879 451939
63463 451939 445233 438579 432324 426187 419984 414155 409290 405415 402260 400017 399259 400054 401745 403779 406390
63448 406390 410171 415249 421157 427428 434092 441679 450889 462243 475802 491085 507416 524715 544134
63435 544134 567736 597320 633561 676191 724332 775806 826234 869860 902136 921738 930332 931029
63423 931029 927156 921666 916873 914606 916715 925029 940543 963000 991473 1024929 1061844 1099750 1135707
63410 1135707 1167052 1191490 1207064 1212836 1209586 1199441 1184961 1168635 1152553 1137742 1123920 1110294
63398 1110294 1096346 1081466 1064373 1043658 1018755 989847 957232 921493 884001 846428 809822
63387H09822l5045l2614k9340k6101k3402k0560j7015j3535j1054r100o561l523
63375E81972j076L80J568L166N201P474R716J1377J2113J2517J3657J5791J8137
63362F91993J9878K0945K1889K3478K6258L0000L3701L6556L8684M0405M1261
63351A025048M0374L7410L2477K5447J6370O449k334q768j2876j4986j5242j4213
63339A115156j3036j2511j2657j3499j5667j9566k4419k8709l1565l3285l4426
63328H75816l4779l3468l0147k5732k1581j8049j4322r804m973m40M010Q415J1003
63315G05949Q805O19j1143k1934k8397l0205k9173k7021k4162k0427j6413j3442
63303D93056j2061j1268r729p337n027l435k484k083k417l402m501n248n521n283
$$ plain form
63387 809822 774777 742163 712823 686722 663320 642760 625745 612210 601156 592056 585495 581972
63375 581972 580896 581276 582844 586010 591211 598685 608401 619778 631891 644408 658065 673856 691993
63362 691993 711871 732816 754705 778183 804441 834441 868142 904698 943382 983787 1025048
63351 1025048 1065422 1102832 1135309 1160756 1177126 1183575 1181241 1172473 1159597 1144611 1129369 1115156
63339 1115156 1102120 1089609 1076952 1063453 1047786 1028220 1003801 975092 943527 910242 875816
63328 875816 841037 807569 777422 751690 730109 712060 697738 687934 682961 682521 686531 694946 705949
63315 705949 714754 715373 704230 682296 653899 623694 594521 567500 543338 522911 506498 493056
63303 493056 480995 469727 459998 452661 447634 444199 441715 439632 437215 433813 429312 424064 418543 413260
63289D13260m563l815l711m306m874m795m236l690l267k746k025j197l74K74M98
63274C70433K52j29k51j04O5K11N24R97J266J037N26K81O41J471K394L055L232
63257C85901K904K325J874J769J974K428L105L871M542N178N967O751P104P112
63243D42805P454Q385R316R957J1092J3326J5692J6764J6872J7755K0023K2395
63231F11836K3714K4355K5055K5625K5646K5385K5177K4659K3560K2522K2274
63220H79808K2607K3011K3610K4628K5410K5075K3752K2275K0891J9117J6555
63209A126739J3045Q299K321m039r834j5142k0618k6072l0426l2982l3942l3675
63197I43674l2343l0271k7891k5168k1795j8054j4750j2167r719o861l733p16
$$ plain form
63289 413260 408697 404882 401171 396865 391991 387196 382960 379270 376003 373257 371232 370035 369661 369935 370433
63274 370433 370685 370556 370305 370201 370266 370477 371001 371998 373264 374301 374827 375108 375749 377220 379614 382669 385901
63257 385901 388805 391130 393004 394773 396747 399175 402280 406151 410693 415871 421838 428589 435693 442805
63243 442805 450259 458644 467960 477917 489009 502335 518027 534791 551663 569418 589441 611836
63231 611836 635550 659905 684960 710585 736231 761616 786793 811452 835012 857534 879808
63220 879808 902415 925426 949036 973664 999074 1024149 1047901 1070176 1091067 1110184 1126739
63209 1126739 1139784 1148083 1150404 1146365 1136531 1121389 1100771 1074699 1044273 1011291 977349 943674
63197 943674 911331 881060 853169 828001 806206 788152 773402 761235 751516 744655 740922 740206
63185G40206K116M851P483R981J2339J4412J6013J7202J8168J8875J9115J8894
63173H99655J8452J7989J7656J7605J7692J7341J6089J4088J1706Q837N112N75
63161A062797m283r080j3702j8119k2346k6363k9731l1738l2351l2494l2782l2557
63149G77251l0970k8423k5986k3779k1163j8259j5995j4553j2985j0717q416o903
63137E59102o065n282m304l288k518k274k541k673j934m65Q61J643K317L197L939
63122E39715M238M313M413M412M280M302M468M256L371K298J703J676J874K064
63108E87383K206K280K279K120J615P82J52K40P32P94J46o91j297j754k043j822
63092E93122j058k52K65O85J139J359J218J020R68Q82O87O13P18Q32J179K266
$$ plain form
63185 740206 742322 747173 754656 764637 776976 791388 807401 824603 842771 861646 880761 899655
63173 899655 918107 936096 953752 971357 989049 1006390 1022479 1036567 1048273 1057110 1062222 1062797
63161 1062797 1058514 1049434 1035732 1017613 995267 968904 939173 907435 875084 842590 809808 777251
63149 777251 746281 717858 691872 668093 646930 628671 612676 598123 585138 574421 566005 559102
63137 559102 553037 547755 543451 540163 537645 535371 532830 530157 528223 527758 528619 530262 532579 535776 539715
63122 539715 543953 548266 552679 557091 561371 565673 570141 574397 577768 580066 581769 583445 585319 587383
63108 587383 589589 591869 594148 596268 597883 598665 598817 599057 599789 600583 600729 600038 598741 596987 594944 593122
63092 593122 592064 591812 592077 592762 593901 595260 596478 597498 598466 599348 600035 600648 601366 602198 603377 605643
63076F05643L883M966N001M826N455O806Q121R106R895J0380J0405J0345J0814
63063G05646J1952J3536J5547J8079K0891K3616K6308K9281L2543L5819L9025
63052I72243M2290M5570M8666N1565N4450N7378O0114O2249O3327O3091O1797
63041A582740O0122N8549N7062N5634N4694N4716N5559N6459N6662N5824N3985
63030B202006N1306M7689M2471L4722K4101J1263k679j6850l0645m3515n5083
63019B264786o5255p3863q0271q3641q3626q0691p5891p0406o4966n9467n3240
63008A473469m5854l7623k9244k1221j3702o678l6O372J2481J7891K2132K5054
62996A403041K6923K8251K9525L0925L2225L3076L3375L3299L3077L2834L2500
$$ plain form
63076 605643 609526 614492 619493 624319 629774 636580 644701 653807 663702 674082 684487 694832 705646
63063 705646 717598 731134 746681 764760 785651 809267 835575 864856 897399 933218 972243
63052 972243 1014533 1060103 1108769 1160334 1214784 1272162 1332276 1394525 1457852 1520943 1582740
63041 1582740 1642862 1701411 1758473 1814107 1868801 1923517 1979076 2035535 2092197 2148021 2202006
63030 2202006 2253312 2301001 2343472 2378194 2402295 2413558 2410879 2394029 2363384 2319869 2264786
63019 2264786 2199531 2125668 2045397 1961756 1878130 1797439 1721548 1651142 1586176 1526709 1473469
63008 1473469 1427615 1389992 1360748 1339527 1325825 1319147 1319111 1325483 1337964 1355855 1377987 1403041
62996 1403041 1429964 1458215 1487740 1518665 1550890 1583966 1617341 1650640 1683717 1716551 1749051
62985A749051L1612K9414K5547K0500J5038R228K439n746j5025k4660l3915m2262
62973A761221m9585n6017o1265o4407o4952o3763o2113o0077n6811n2307m7770
62962A122154m4090m1041l8180l5512l2893k9850k6579k4108k2859k1911k0406
62951G84725j8788j7827j7267j6487j5803j5945j6600j6597j5449j3791j2375
62940F07796j1349j0554r808q994q266q042q288q198p169n728m755m166l339k498
62926E06642k546l459m011l476k592k353k665k824k675k571k572k435k187k080
62912D68196j983j469n97j07n20j394j865j670j260r38m45L83J056J033O37P87
62896D59844J740K713K879K355J857J674J394N50p31j836k309k279k148j906j076
$$ plain form
62985 1749051 1780663 1810077 1835624 1856124 1871162 1880390 1882829 1877083 1862058 1837398 1803483 1761221
62973 1761221 1711636 1655619 1594354 1529947 1464995 1401232 1339119 1279042 1222231 1169924 1122154
62962 1122154 1078064 1037023 998843 963331 930438 900588 874009 849901 827042 805131 784725
62951 784725 765937 748110 730843 714356 698553 682608 666008 649411 633962 620171 607796
62940 607796 596447 585893 576085 567091 558825 550783 542495 534297 527128 521400 516645 512479 509140 506642
62926 506642 504096 500637 496626 493150 490558 488205 485540 482716 480041 477470 474898 472463 470276 468196
62912 468196 466213 464744 464147 464040 463520 462126 460261 458591 457331 456393 455948 456331 457387 458420 459057 459844
62896 459844 461584 464297 467176 469531 471388 473062 474456 475006 474275 472439 470130 467851 465703 463797 462721
62881D62721M84K115L052L288L201K672J334l78j341j073k78J66L8n70j605k618
62865D71208k778j928j032r53j325j301q57n44l36L54J604K692L013K693K170
62850D72680J633J056M65Q1J62P04J234J191O36K40L26M28O0m94o58m35j84J72
62832D79297J006K098K566J962R40N22R61J547J569J191J262K197L326L644L035
62817E07123K331K276K862L729M585N084M880M132L497L345L423L538M028N145
62803E59978O541P741Q685R420R752R757J0068J1104J2384J3210J3673J4383J5618
62790G02314J7302J9600K2783K6687L0819L4902L8973M3216M8047N3923O0572
62779A099138O6849P2029P6836Q2434Q8656R4053R7519R9034R8762R6350R1361
$$ plain form
62881 462721 463205 465320 468372 471660 474861 477533 478867 478489 477148 476075 475797 475963 476001 475431 473826 471208
62865 471208 468430 466502 465470 464517 463192 461891 461034 460490 460154 460508 462112 464804 467817 470510 472680
62850 472680 474313 475369 475834 475915 476077 476781 478015 479206 479842 480082 480408 480836 480896 480402 479744 479309 479125 479297
62832 479297 480303 482401 484967 486929 487869 488391 489352 490899 492468 493659 494921 497118 500444 504088 507123
62817 507123 509454 511730 514592 518321 522906 527990 532870 537002 540499 543844 547267 550805 554833 559978
62803 559978 566519 574260 582945 592365 602117 611874 621942 633046 645430 658640 672313 686696 702314
62790 702314 719616 739216 761999 788686 819505 854407 893380 936596 984643 1038566 1099138
62779 1099138 1165987 1238016 1314852 1397286 1485942 1579995 1677514 1776548 1875310 1971660 2063021
62768B063021Q3795P3881O1747M7544L1666J4695k691j9731l5698n0068o2579
62757B205582p3160q1874q8616r2963r4641r4239r2851r0869q7685q2896p7087
62746A248701p1128o5376o0001n5297n1006m6179m0484l5025l0953k7968k5137
62735G40147k2515k0683j9195j6908j3754j0889r046p884o911n993m855l290j872
62722E96352j304j033K16K352L777L797L702M765O507P907R165J1031J3252J4993
62708F75479J6400J8416K1255K4198K6915K9906L3472L7186M0737M4547M8997
62697A017508N3579N7451O0612O3847O7511P0856P2787P2915P1435O8321O3125
62686A739947N5584M5886L4234K0770O167q267k1662l4247m6426n7429o5734p0720
$$ plain form
62768 2063021 2146816 2220697 2282444 2329988 2361654 2376349 2373658 2353927 2318229 2268161 2205582
62757 2205582 2132422 2050548 1961932 1868969 1774328 1680089 1587238 1496369 1408684 1325788 1248701
62746 1248701 1177573 1112197 1052196 996899 945893 899714 859230 824205 793252 765284 740147
62735 740147 717632 696949 677754 660846 647092 636203 627157 619273 612362 606369 601514 598224 596352
62722 596352 595048 594015 594231 596583 600360 604157 607859 612624 619131 627038 636203 647234 660486 675479
62708 675479 691879 710295 731550 755748 782663 812569 846041 883227 923964 968511 1017508
62697 1017508 1071087 1128538 1189150 1252997 1320508 1391364 1464151 1537066 1608501 1676822 1739947
62686 1739947 1795531 1841417 1875651 1896421 1902588 1894321 1872659 1838412 1791986 1734557 1668823 1598103
62674A598103p3259p4528p4832p3803p1298o7751o3788n9722n5415n0692m5831
62663H87184m1414l7579l3825k9851k6106k3178k0977j9055j7324j5852j4319
62652F07704j2450j0718r845r632r192q234p331o790o184n279m556m371m207l321
62638E05594j724j08R45J318J246J155J419J952K148J492J41j173j829j785j509
62623E09282j440j590j684j591j317o44P30K523L873M332M350M440M481M387M721
62608E34853N870P135P613P599Q153R514J1024J2455J4249J6466J8586K0590K3225
62595F97332K6842L0831L4597L8249M1992M5527M8407N0308N0702M9038M5558
62584A159383M1180L6160K9708K1344J1870K350p074j6577k5486l2612l7576m0966
$$ plain form
62674 1598103 1524844 1450316 1375484 1301681 1230383 1162632 1098844 1039122 983707 933015 887184
62663 887184 845770 808191 774366 744515 718409 695231 674254 655199 637875 622023 607704
62652 607704 595254 584536 574691 565059 555867 547633 540302 533512 527328 522049 517493 513122 508915 505594
62638 505594 503870 503762 504707 506025 507271 508426 509845 511797 513945 515437 515578 514405 512576 510791 509282
62623 509282 507842 506252 504568 502977 501660 501016 501746 504269 508142 512474 516824 521264 525745 530132 534853
62608 534853 540723 547858 555471 563070 571223 580737 591761 604216 618465 634931 653517 674107 697332
62595 697332 724174 755005 789602 827851 869843 915370 963777 1014085 1064787 1113825 1159383
62584 1159383 1200563 1236723 1266431 1287775 1299645 1301995 1294921 1278344 1252858 1220246 1182670 1141704
62572A141704m3346m4717m4998m4438m3350m1798l9740l7320l4825l2333k9617
62561G05222k6514k3305k0487j8109j5749j3306j1298j0039r031p739o511n993
62549E37141n978n706n040m475m072l350k274j464j180r68m11L85J176J757J741
62534E07282R96K72M93J425K011K063K396L224L776M009N201P990J1007J2671
62520E64816J3385J4733J7228K0073K2783K5722K9110L2487L5397L7907M0297
62509H53938M2647M4761M6238M6658M5999M4555M2295L8650L3273K6684J9715
62498A285413J2686N623r94o217r257r833q117m670k01M965J1057J8222K5947
62485A324624L3364L9958M5731N0997N6141O1282O5681O7463O4308N4795L9731
$$ plain form
62572 1141704 1098358 1053641 1008643 964205 920855 879057 839317 801997 767172 734839 705222
62561 705222 678708 655403 634916 616807 601058 587752 576454 566415 557384 549645 543134 537141
62549 537141 531163 525457 520417 515942 511870 508520 506246 504782 503602 502634 502223 502608 503784 505541 507282
62534 507282 508278 508550 509043 510468 512479 514542 516938 520162 523938 527947 533148 541138 552145 564816
62520 564816 578201 592934 610162 630235 653018 678740 707850 740337 775734 813641 853938
62509 853938 896585 941346 987584 1034242 1080241 1124796 1167091 1205741 1239014 1265698 1285413
62498 1285413 1298099 1303722 1302728 1296511 1287254 1277421 1269304 1264634 1264433 1269398 1280455 1298677 1324624
62485 1324624 1357988 1397946 1443677 1494674 1550815 1612097 1677778 1745241 1809549 1864344 1904075
62474A904075K2534P733k261r436j8633l3051n1304o8794q1452q8124r0277r0255
62462A400755q9596q8443q6218q2577p7462p0613o1972n2534m4055l7541l2595
62451F77149k8324k4227k0101j5969j2443j0362r640r103p878o243m828l706k739
62438E21586k014j451o65K77O52J64n27q84j313k217k935k538j267l53o36j925
62422E03954l466m553m939m985n123n095m318l107k592l098l648l559l468l980
62408D48023m408l873k795k104j715r82q6K47N7J1K94O62J352K750M329N054M838
62391D51654M598M817M969M592M000L733L880M195M456M635N008N931P208Q023
62377E21699P939P572P734Q338Q780Q990R353R908J0417J1026J2015J3159J4056
$$ plain form
62474 1904075 1926609 1934342 1932081 1922645 1904012 1870961 1819657 1750863 1669411 1581287 1491010 1400755
62462 1400755 1311159 1222716 1136498 1053921 976459 905846 843874 791340 747285 709744 677149
62451 677149 648825 624598 604497 588528 576085 565723 556083 546980 539102 532859 528031 524325 521586
62438 521586 519572 518121 517456 517733 518385 518549 518022 517138 515825 513608 510673 508135 506868 506515 505879 503954
62422 503954 500488 495935 490996 486011 480888 475793 471475 468368 465776 462678 459030 455471 452003 448023
62408 448023 443615 439742 436947 434843 433128 432146 432060 432307 432364 432375 432669 433331 434683 437433 441762 446816 451654
62391 451654 456252 461069 466038 470630 474630 478363 482243 486438 490894 495529 500537 506468 513676 521699
62377 521699 529638 537210 544944 553282 562062 571052 580405 590313 600730 611756 623771 636930 650986
62364F50986J4977J6695J9542K3194K7201L1253L5235L9563M4939N1159N6739
62353A011483O0549O3093O5138O5707O2937N6644M8501L9681K9835J8821P975
62342A530364j189q579j5040k0954k6093l0441l4486l8676m2869m6287m8019m7792
62330A169939m6199m4045m1588l8787l5930l3539l1732l0215k8718k7134k5468
62319G86584k3999k3186k2857k2009k0026j7709j6207j5416j4259j2353j0357
62308E88206q787p480o281n334m636m010l602l620l620k884j468j85M84O82N44
62293E38009J70J45J053K438L218L249L466M305N073N189N046N055M827L923K753
62278E87919K097K165K626L170L671M125M712N556O351O688O811P482Q964J0763
$$ plain form
62364 650986 665963 682658 702200 725394 752595 783848 819083 858646 903585 954744 1011483
62353 1011483 1072032 1135125 1200263 1265970 1328907 1385551 1434052 1473733 1503568 1522389 1530364
62342 1530364 1529175 1520596 1505556 1484602 1458509 1428068 1393582 1354906 1312037 1265750 1217731 1169939
62330 1169939 1123740 1079695 1038107 999320 963390 929851 898119 867904 839186 812052 786584
62319 786584 762585 739399 716542 694533 674507 656798 640591 625175 610916 598563 588206
62308 588206 579419 571939 565658 560324 555688 551678 548076 544456 540836 537952 536484 536299 536783 537465 538009
62293 538009 538179 538324 539377 541815 545033 548282 551748 556053 561126 566315 571361 576416 581243 585166 587919
62278 587919 590016 592181 594807 597977 601648 605773 610485 616041 622392 629080 635891 643373 652337 663100
62264F63100J2544J4633J7391K0732K4516K8850L3647L8510M3296M8305N3584
62253I99108N8579O2702O5757O7448O6932O3280N6151M6030L4093K1841J0311
62242A552232m14j0514j9479k6685l2771l9277m6521n2882n6829n8709n9765o0130
62230A088256n8849n5575n1153m6540m1899l7014l2069k7623k3961k0786j7634
62219F75153j4555j2123j0618r480p907n829l865k386j161J01J388K688M144N723
62205F21273O997P569P482P251P547Q678J0014J0277Q889O865N704N580N342M277
62191G23745L020K480K626K807K705K566K744L361M218M930N298N502N660N405
62177G77067M357K909J925J692J766J987K990N403Q994J2907J6611K0426K5134
$$ plain form
62264 663100 675644 690277 707668 728400 752916 781766 815413 853923 897219 945524 999108
62253 999108 1057687 1120389 1186146 1253594 1320526 1383806 1439957 1485987 1520080 1541921 1552232
62242 1552232 1551818 1541304 1521825 1495140 1462369 1423092 1376571 1323689 1266860 1208151 1148386 1088256
62230 1088256 1029407 973832 922679 876139 834240 797226 765157 737534 713573 692787 675153
62219 675153 660598 648475 637857 628377 620470 614641 610776 608390 607229 607330 608718 611406 615550 621273
62205 621273 628270 635839 643321 650572 658119 666797 676811 687088 695977 702842 708546 714126 719468 723745
62191 723745 726765 729245 731871 734678 737383 739949 742693 746054 750272 755202 760500 766002 771662 777067
62177 777067 781424 784333 786258 787950 789716 791703 794693 800096 809090 821997 838608 859034 884168
62164H84168L1029L7248M2389M5868M8165M9457M8732M4981L8687L1210K3194
62153A325128J4564N835j842p929j2910j7431k1871k6626l1756l6371l9395m0982
62141A108414m2127m2887m2101l9134l4729k9922k5143k0687j6979j3910j0851
62130G89944p769n431m119l054j507L97K397M649P106R256J0931J2597J4422J5854
62116H45673J6515J6574J5815J3455R471N168J704j047l505n227n636n189m918
62103H98853n333o399p965r466r821q441n924l210n35K192M673O566Q065R473
62089H72728J0593J1127J1253J1292J1241J1107J1136J1304J1189J0810J0989
62078I94769J2276J4201J6124J8182K0711K3338K5368K6545K6869K6214K4774
$$ plain form
62164 884168 915197 952445 994834 1040702 1088867 1138324 1187056 1232037 1270724 1301934 1325128
62153 1325128 1339692 1345527 1343685 1335756 1322846 1305415 1283544 1256918 1225162 1188791 1149396 1108414
62141 1108414 1066287 1023400 981299 942165 907436 877514 852371 831684 814705 800795 789944
62130 789944 782175 776744 772625 769571 768064 768461 770858 775507 782613 791869 802800 815397 829819 845673
62116 845673 862188 878762 894577 908032 917503 922671 924375 923328 919823 914596 908960 903771 898853
62103 898853 893520 887121 879156 869690 859869 851428 845504 842294 841759 843951 848624 855190 863255 872728
62089 872728 883321 894448 905701 916993 928234 939341 950477 961781 972970 983780 994769
62078 994769 1007045 1021246 1037370 1055552 1076263 1099601 1124969 1151514 1178383 1204597 1229371
62067A229371K3370K2655K2497K2646K3349K4696K6031K6763K7129K7374K6773
62056A502654K4399K0338J5272R445K980l126p560j0260j2571j5790k0120k5065
62044A480596l0174l5167l9723m3366m5669m6734m7248m7578m7022m4653m0973
62033A012289l7655l5472l3500l0752k7477k4369k1561j9157j7593j6617j4995
62022G33141j2263r821r208j0112j1204j2066j2995j3688j3504j2618j1635j0456
62010E93571q693o747n295m146k729j257j35J213L495N936P064O875O734P119
61996F03005P033N791L886J911o3j739k615l138m543o953q921r395r132r417j0309
61981E55401j0990j0995j0349r088p469o262n994o092n480l997k665k416k951
$$ plain form
62067 1229371 1252741 1275396 1297893 1320539 1343888 1368584 1394615 1421378 1448507 1475881 1502654
62056 1502654 1527053 1547391 1562663 1572108 1575088 1571962 1564402 1554142 1541571 1525781 1505661 1480596
62044 1480596 1450422 1415255 1375532 1332166 1286497 1239763 1192515 1144937 1097915 1053262 1012289
62033 1012289 974634 939162 905662 874910 847433 823064 801503 782346 764753 748136 733141
62022 733141 720878 711057 701849 691737 680533 668467 655472 641784 628280 615662 604027 593571
62010 593571 584878 578131 572836 568690 565961 564704 564569 565782 569277 575213 582277 589152 595886 603005
61996 603005 610038 615829 619715 621626 621563 619824 617209 614071 609528 602575 593654 584259 575127 565710 555401
61981 555401 544411 533416 523067 513979 506510 500248 494254 488162 482682 478685 476020 473604 470653
61968D70653l134k337j074j30N46J587K950L749L645L577M485N904O641O455O150
61953E09667O301O714P107P502P902Q293Q989J0389J2321J4153J5620J7112J9082
61940F51152K1482K3838K5637K6783K7740K8912K9836K9610K8351K7321K7144
61929I47806K6784K5130K2658K0462J8334J5198J0909O353J949k587p071j0700
61917A075225j3141j4712j5300j4252j1458p633l306J564O806J1781J6115J9926
61905A051615K3103K5163K5934K5604K3933K0210J4307P194J38o131j1436j5952
61893A183682k0028k3726k6598k8291k9106k9379k8789k7107k5201k4183k3749
61882H97525k2629k0580j8772j8066j8091j8185j8152j7804j6831j5427j4177
$$ plain form
61968 470653 467519 465182 464108 463978 464524 466111 469061 472810 476455 480032 484517 490421 497062 503517 509667
61953 509667 515968 522682 529789 537291 545193 553486 562475 572864 585185 599338 614958 632070 651152
61940 651152 672634 696472 722109 748892 776632 805544 835380 864990 893341 920662 947806
61929 947806 974590 999720 1022378 1042840 1061174 1076372 1087281 1093634 1095583 1092996 1085925 1075225
61917 1075225 1062084 1047372 1032072 1017820 1006362 998729 995423 996987 1003793 1015574 1031689 1051615
61905 1051615 1074718 1099881 1125815 1151419 1175352 1195562 1209869 1217063 1217201 1211070 1199634 1183682
61893 1183682 1163654 1139928 1113330 1085039 1055933 1026554 997765 970658 945457 921274 897525
61882 897525 874896 854316 835544 817478 799387 781202 763050 745246 728415 712988 698811
61871F98811j3068j1507r458p514n708l414p54J150J855K458M162O885R895J2931
61857F86724J6010J8974K1865K5189K9129L3187L6935M0516M3911M6606M8491
61846A047537N0278N2247N3356N2393M9421M5247L9962L2981K4273J4663N014
61835A467372m227j2606j9309k3434k4436k2426j8180j2718o671j63O751J3778
61823A343731K0480K6183K9768L0174K7353K2274J5776P824j801j2497k2924l1855
61811A454486l8764m3791m7330m9574n0368m9585m7498m4616m1444l8532l6359
61800I66625l4740l2823l0217k7632k5719k3885k1294j8490j6694j5785j4385
61789G04961j2047r903q783q086p068o045n608n566n409n105m817m436l866l293
$$ plain form
61871 698811 685743 674236 664778 657264 651556 648142 647388 648538 650393 652851 657013 663898 673793 686724
61857 686724 702734 721708 743573 768762 797891 831078 868013 908529 952440 999046 1047537
61846 1047537 1097815 1150062 1203418 1255811 1305232 1350479 1390441 1423422 1447695 1462358 1467372
61835 1467372 1463145 1450539 1431230 1407796 1383360 1360934 1342754 1330036 1323365 1323202 1329953 1343731
61823 1343731 1364211 1390394 1420162 1450336 1477689 1499963 1515739 1523563 1521762 1509265 1486341 1454486
61811 1454486 1415722 1371931 1324601 1275027 1224659 1175074 1127576 1082960 1041516 1002984 966625
61800 966625 931885 899062 868845 841213 815494 791609 770315 751825 735131 719346 704961
61789 704961 692914 683011 674228 666142 659074 653029 647421 641855 636446 631341 626524 622088 618222 614929
61775F14929k734j969j156q39j117j462j580j633j511q20J53O17P41J714L801
61760F07134N563N811N243N149N565N776N830O273O849O665N364L271O31k400
61746F72724n197o947p457p212o782o574o780p066o692n436m008l129k581j771
61732E95092p20N7K97J03k98l76N70K522M349M951M477L857L551L403L371L639
61716F28845M142M480M276L336J779K22o07q03j312k619m014m700m989n610o402
61701F16024o530n751m660l857l511l604l949m107l813l373l240l340l305l049
61687E59935k675k123j422j004j214j710j913j807j745j741j602j589k179l165
61673E34046l619k951j607n11j78n01j128j789k319k507k184j509r85q93r17o16
$$ plain form
61775 614929 612195 610226 609070 608231 607114 605652 604072 602439 600928 600108 600261 600878 601619 603333 607134
61760 607134 612697 618508 623751 628900 634465 640241 646071 652344 659193 665858 671222 674493 675124 672724
61746 672724 667527 660580 653123 645911 639129 632555 625775 618709 612017 606581 602573 599444 596863 595092
61732 595092 594372 594429 594726 594829 594531 594155 594725 597247 601596 606547 611024 614881 618432 621835 625206 628845
61716 628845 632987 637467 641743 645079 646858 647080 646473 645670 644358 641739 637725 633025 628036 622426 616024
61701 616024 609494 603743 599083 595226 591715 588111 584162 580055 576242 572869 569629 566289 562984 559935
61687 559935 557260 555137 553715 552711 551497 549787 547874 546067 544322 542581 540979 539390 537211 534046
61673 534046 530427 527476 525869 525358 525180 524679 523551 521762 519443 516936 514752 513243 512258 511365 510448 509832
61657E09832j04K26M97J175K112K489J924R57K93J51N51J477K542L167L353L651
61641E34293M126M208L784L564L799L576K056k44k036k628k245j586j482k367
61627E46818l653m238m037m117m979n701n438m646m021l197j633P8R03P94L39
61612E03272m19j733l234m383n448o948q486r206r121q884q465p242n375l994
61598D20334l872m679n639o265o305n693m633l456k419j859k102k867l232k737
61584C64576j972j575j316q49o05j034j567j465j108j327j894j915j419j299j748
61569C43483k016j723j327j121p79j02N96J018J116Q20J97j82J42P12P20K48O5
61552C41867L21M73L98N94J107J306Q67J80l77p70q10j80Q48J543J753K079K850
$$ plain form
61657 509832 509728 509954 510451 511626 513738 516227 518151 519108 519401 519552 520103 521580 524122 527289 530642 534293
61641 534293 538419 542627 546411 549975 553774 557350 559406 559162 557126 554498 552253 550667 549185 546818
61627 546818 543165 538927 534890 530773 525794 520093 514655 510009 505988 502791 501158 501236 502139 502933 503272
61612 503272 502853 501120 497886 493503 488055 481107 472621 463415 454294 445410 436945 429703 424328 420334
61598 420334 416462 411783 406144 399879 393574 387881 383248 379792 377373 375514 373412 370545 367313 364576
61584 364576 362604 361029 359713 358864 358259 357225 355658 354193 353085 351758 349864 347949 346530 345231 343483
61569 343483 341467 339744 338417 337296 336517 336415 337011 338029 339145 339965 340162 339980 340122 340834 341554 341802 341867
61552 341867 342188 342661 343059 343653 344760 346066 346933 347113 346736 345966 345156 344976 345824 347367 349120 351199 354049
61535C54049L706M387N114N892O171N555M273K680Q53j040k542l377l699l735
61521C78287l581l476l729m178m164l268j740j92P94Q24n4j133j523r76QQ05J066
61504C53770P02j14r68j552j824j680q44M68J384J398J183J632K527K996K866
61489C61944K664K502K008J306J052J449J924J902J281K45p04p29M84K006K577
61474C81911K156J696J588J344P63L82N02P36P16N29K54j96o34p40p26j117j820
61457C87344k070j504n82Q9K43j34o63m69R36K692L419K909K161J802J511J105
61441C98789J048J658K678L857N054N724N301M273L832M236M524M088L398K896
61427D51356K258J307O28O64J086J504K075K875L536L941M466N010M717L224J381
$$ plain form
61535 354049 357755 362142 367256 373148 379319 384874 389147 391827 392680 391640 389098 385721 382022 378287
61521 378287 374706 371230 367501 363323 359159 355891 354151 353959 354753 355577 355523 354390 352867 351891 351899 352704 353770
61504 353770 354472 354358 353390 351838 350014 348334 347490 347958 349342 350740 351923 353555 356082 359078 361944
61489 361944 364608 367110 369118 370424 371476 372925 374849 376751 378032 378277 377573 376844 377328 379334 381911
61474 381911 384067 385763 387351 388695 389458 389840 390342 391078 391794 392323 392577 392381 391747 391007 390281 389164 387344
61457 387344 385274 383770 383188 383277 383520 383386 382723 382254 383190 385882 389301 392210 394371 396173 397684 398789
61441 398789 399837 401495 404173 408030 413084 418808 424109 428382 432214 436450 440974 445062 448460 451356
61427 451356 453614 454921 455549 456213 457299 458803 460878 463753 467289 471230 475696 480706 485423 488647 490028
61412D90028N8r43k139l215l523l255l227l751m347m480m089l510l118l001k872
61397D44616k505k156k126k110j650j020q68j048p16K66J060J235J368J863K158
61382D38367J715J009Q23J189J601J777J679J346J057J300K116K958L418L620
61368D63975L697L487K993K505K043J303L87j18M3N54J251K274L338L810L849
61353D95391M474O100P945R296J0420J1687J2791J3473J4113J4833J4918J3811
61341F29252J1971J0044Q028N915M322L633L212K335J236L54p16k475m339n344
61327F67428n677o425p869r031q954p667n844m123k857k076j606j343j315j277
61313F01364p31L95J369J452Q24M60J236L255N778P781Q993J0281J2430J4622
$$ plain form
61412 490028 490086 489143 487004 483789 480266 477011 473784 470033 465686 461206 457117 453607 450489 447488 444616
61397 444616 442111 439955 437829 435719 434069 433049 432181 431133 430417 430683 431743 432978 434346 436209 438367
61382 438367 440082 441091 441914 443103 444704 446481 448160 449506 450563 451863 453979 456937 460355 463975
61368 463975 467672 471159 474152 476657 478700 480003 480390 480272 480315 480869 482120 484394 487732 491542 495391
61353 495391 499865 505965 513910 523206 533626 545313 558104 571577 585690 600523 615441 629252
61341 629252 641223 651267 659295 665210 669532 673165 676377 678712 679948 680302 679586 677111 672772 667428
61327 667428 661751 655326 647457 638426 629472 621805 615961 611838 608981 606905 605299 603956 602641 601364
61313 601364 600633 601028 602397 603849 604673 605133 606369 609624 615402 623183 632176 642457 654887 669509
61299F69509J5007J2875R320N530J593k584o252q582r660j0010r755q921p913
61286F50157p020o012m807l882l493l175k522j793j166k24J163K351L024L932
61272F26533N627P360Q193Q342Q371P838O185M335L963N250O718P334P608Q547
61258G22204J0466J3118J6136J8970K0831K1021J9253J5826J1629P668M240R07
61246H82269k543n635p992r884j1579j2841j3559j4117j4542j4031j2121r630
61234G53795p676o409n515n187n558n817m995l269j514L9J687L304M508N367N917
61219G28677N422L377R10j51M64J359J615J757K349K864K498J331O6q28j373j785
61203G48552k162k304j723j19K268M911P455R775J1917J4248J7220K0706K3990
$$ plain form
61299 669509 684516 697391 706711 712241 713834 711250 704998 696416 686756 676746 666991 658070 650157
61286 650157 643137 637125 632318 628436 624943 621768 619246 617453 616287 616063 617226 619577 622601 626533
61272 626533 632160 639520 647713 656055 664426 672264 678449 682784 686747 691997 698715 706049 713657 722204
61258 722204 732670 745788 761924 780894 801725 822746 841999 857825 869454 877122 881362 882269
61246 882269 879726 874091 866099 856215 844636 831795 818236 804119 789577 775546 763425 753795
61234 753795 746119 739710 734195 729008 723450 717633 712638 709369 707855 707894 709581 712885 717393 722760 728677
61219 728677 734099 737476 738386 738235 738699 740058 741673 743430 745779 748643 751141 752472 752538 751710 750337 748552
61203 748552 746390 744086 742363 742244 744512 749423 756878 766653 778570 792818 810038 830744 854734
61190H54734K6600K8515K9261K7759K3738J8534J3773R882O623M321L525L945
61178A051210M580M539L228M62k895n263o209p136r174j1434j2571j3011j4028
61165I82298j5476j6283j6680j7981k0231k1885k2001k1186k0129j8739j6998
61154G74709j5357j3831j1801r064o183l639j450L32J715L193N039O199N059J383
61140G36304l422p844j1068j2567j2228j0872r428p741n250k510n78Q40K910N490
61126F62036P287Q349J0339J3846J7314J9362K0514K1776K3154K4517K6376K8754
61114H83624L0528L0975L0815L0764L0276K8806K7097K5955K4799K2696K0041
61103A186376J7840J6011J3685J0676P393L646j227p118j3069j8358k2925k6715
$$ plain form
61190 854734 881334 909849 939110 966869 990607 1009141 1022914 1032796 1039419 1043740 1047265 1051210
61178 1051210 1055790 1060329 1063557 1064019 1061124 1055861 1049652 1042516 1033342 1021908 1009337 996326 982298
61165 982298 966822 950539 933859 915878 895647 873762 851761 830575 810446 791707 774709
61154 774709 759352 745521 733720 724656 718473 714834 713384 713716 715431 718624 723663 729862 734921 736304
61140 736304 732882 725038 713970 701403 689175 678303 668875 661134 655884 653374 652796 653636 656546 662036
61126 662036 669323 677672 688011 701857 719171 738533 759047 780823 803977 828494 854870 883624
61114 883624 914152 945127 975942 1006706 1036982 1065788 1092885 1118840 1143639 1166335 1186376
61103 1186376 1204216 1220227 1233912 1244588 1251981 1255627 1254400 1247282 1234213 1215855 1192930 1166215
61091A166215k9436l0977l1659l1988l2357l2812l2881l1923k9912k7546k5463
61080H29261k3722k2186k0789j9308j7463j5486j3945j2767j1278r350p759o915
61068F48293o173m946l662k881k229j042M24J272J255J088J639L120M974O381
61054F47513P030P502Q528J0040J1432J2578J3872J5405J7012J8980K1581K3976
61042H15449K4972K4992K5778K7798K9510K9804K9490K9554K9569K9011K8669
61031A124596K9321L0271L0649L1100L2586L4426L5046L4069L2304L0463K9296
61020A474127L0185L3915L9417M5166N1228N8462O6529P4498Q2742R2439J04075
61009B152783J18585J39081J68722K07351K53244L07872L75327M57063N51877
$$ plain form
61091 1166215 1136779 1105802 1074143 1042155 1009798 976986 944105 912182 882270 854724 829261
61080 829261 805539 783353 762564 743256 725793 710307 696362 683595 672317 662967 655208 648293
61068 648293 642120 637174 633512 630631 628402 627360 627784 629056 630311 631399 633038 636158 641132 647513
61054 647513 654543 662045 670573 680613 692045 704623 718495 733900 750912 769892 791473 815449
61042 815449 840421 865413 891191 918989 948499 978303 1007793 1037347 1066916 1095927 1124596
61031 1124596 1153917 1184188 1214837 1245937 1278523 1312949 1347995 1382064 1414368 1444831 1474127
61020 1474127 1504312 1538227 1577644 1622810 1674038 1732500 1799029 1873527 1956269 2048708 2152783
61009 2152783 2271368 2410449 2579171 2786522 3039766 3347638 3722965 4180028 4731905
61000D731905O62496P97217R62079J155236J368687J581497J736822J735348J486360
60991A6217647R95134L99538j00960l68789l89773k32154K1402K84731M41165
60982A7267941L63828K194n53422j114241j512168j685790j671743j541584j355694
60973H199321j155225r67092q04202o67052n51721m55983l77949l13681k59570
60964B646846k15071j80687j54739j34106j17018j03102r1492q0806p0677o1694
60954A437454n3810m6158l8436l1257k5108k0103j6900j6494j8533k0884k1674
60943A128097k1120k0665k0867k1046k0592j9781j9220j9107j9196j9091j8478
60932I08934j7328j5947j4706j3771j3101j2528j1738j0452q909p828p588p690
$$ plain form
61000 4731905 5394401 6191618 7153697 8308933 9677620 11259117 12995939 14731287 16217647
60991 16217647 17212781 17612319 17511359 17142570 16752797 16520643 16542045 16826776 17267941
60982 17267941 17631769 17633963 17080541 15966300 14454132 12768342 11096599 9555015 8199321
60973 8199321 7044096 6077004 5272802 4605750 4054029 3598046 3220097 2906416 2646846
60964 2646846 2431775 2251088 2096349 1962243 1845225 1742123 1650631 1569825 1499148 1437454
60954 1437454 1383644 1337486 1299050 1267793 1242685 1222582 1205682 1189188 1170655 1149771 1128097
60943 1128097 1106977 1086312 1065445 1044399 1023807 1004026 984806 965699 946503 927412 908934
60932 908934 891606 875659 860953 847182 834081 821553 809815 799363 790454 782626 775038 767348
60920G67348p383o549n586m716l890l195k711k133j090K33J380K463M026O052
60906G44249P816Q925R749J0541J0906J0609J0284J0642J1389J1678J1399J1214
60894H69401J1365J1236J0403R487R485J0608J2248J3906J5597J7304J8632J9367
60882A029039J9918K0745K1589K1829K1454K1065K0914K0622K0006J9439J9071
60871A255691J8333J6725J4569J2364R990P151M132J354j462m796q213j0677j1968
60858A303193j3013j4718j7164j9945k2631k4740k5935k6420k6648k6615k5930
60847A059434k4644k3440k2877k2910k3162k3211k2689k1667k0820k0665k0736
60836H12613k0214j9238j8708j8794j8558j7215j5025j2720j0813r645r293r199
$$ plain form
60920 767348 759965 753416 747830 743114 739224 736029 733318 731185 730095 730328 731708 734171 738197 744249
60906 744249 752065 760990 770739 781280 792186 802795 813079 823721 835110 846788 858187 869401
60894 869401 880766 892002 902405 911892 921377 931985 944233 958139 973736 991040 1009672 1029039
60882 1029039 1048957 1069702 1091291 1113120 1134574 1155639 1176553 1197175 1217181 1236620 1255691
60871 1255691 1274024 1290749 1305318 1317682 1327672 1334823 1338955 1340309 1338847 1334051 1325838 1315161 1303193
60858 1303193 1290180 1275462 1258298 1238353 1215722 1190982 1165047 1138627 1111979 1085364 1059434
60847 1059434 1034790 1011350 988473 965563 942401 919190 896501 874834 854014 833349 812613
60836 812613 792399 773161 754453 735659 717101 699886 684861 672141 661328 651683 642390 633191
60824F33191q575p437o535o127n602m566l422k559j832j210j071j377j400q44
60810E80634m67r03j616j717j223o74k0J207K801L797L577K521J481Q89M74k54
60794E90507j292k104k351k317k289j969j157n80j082k280l110l501m291n445
60780E56739n844n146m394m318m403m285m564n418n752m926m100m551n669n923
60766D87446n062l937k903j759q35o94j038j087p77m68N3J084J845J232m05j497
60750D71198j299n04K43J152K428L674M569N216N539N188M261L360K604J429l15
60735E08743j883k622k851l224l756l929l500k750k174k154k743l573m086m055
60721D65443l756l582l647l741l613l286l071l219l539l619l439l383l570l625
$$ plain form
60824 633191 624616 617179 610644 604517 598915 594349 590927 588368 586536 585326 584255 582878 581478 580634
60810 580634 580167 579264 577648 575931 574708 574034 574014 575221 578022 581819 585396 587917 589398 590287 590761 590507
60794 590507 589215 587111 584760 582443 580154 578185 577028 576448 575366 573086 569976 566475 562184 556739
60780 556739 550895 545749 541355 537037 532634 528349 523785 518367 512615 507689 503589 499038 493369 487446
60766 487446 482384 478447 475544 473785 472950 472256 471218 470131 469354 468886 468939 470023 471868 473100 472695 471198
60750 471198 469899 469395 469638 470790 473218 476892 481461 486677 492216 497404 501665 505025 507629 509058 508743
60735 508743 506860 504238 501387 498163 494407 490478 486978 484228 482054 479900 477157 473584 469498 465443
60721 465443 461687 458105 454458 450717 447104 443818 440747 437528 433989 430370 426931 423548 419978 416353
60707D16353l336k990k849k733k446k119j741r58J84Q81N37l35q06o69k87J59
60691C96845N73N36j30p08l81N38J007P72O35J193K088K627K584K221K072K696
60675D15168M125N559O031N465M677M399M683N113N181M546L349K242J700J470
60661D73708J016L44m7J41O91J144J062L07o53r46j84J113K148K590K414J613
60645D86461M32o15j428k488l933n095n486n583n993o428o252n468m502l509k682
60630D27431k524l078l441k928k041j446q03K48Q38P1j162j207j41L92k58j052
60614D08899j149q80n68J33J149J605J077K92L7K10L54K53j74p95r55j19J025
60597D10394J150J53o50m09K95O62P65R40J125J330J811K312K019Q01l69p06m81
$$ plain form
60707 416353 413017 410027 407178 404445 401999 399880 398139 397181 397365 398246 398783 398448 397642 396973 396686 396845
60691 396845 397418 397954 397824 397116 396735 397273 398280 399052 399687 400880 402968 405595 408179 410400 412472 415168
60675 415168 419293 424852 430883 436348 441025 445424 450107 455220 460401 464947 468296 470538 472238 473708
60661 473708 474724 475068 475021 475162 475853 476997 478059 478366 477713 476767 476583 477696 479844 482434 484848 486461
60645 486461 486893 486278 484850 482362 478429 473334 467848 462265 456272 449844 443592 438124 433622 430113 427431
60630 427431 424907 421829 418388 415460 413419 411973 411170 411418 412256 412327 411165 409958 409817 410209 409951 408899
60614 408899 407750 406870 406302 406435 407584 409189 410266 410558 410595 410805 411159 411412 411238 410443 409488 409369 410394
60597 410394 411544 411697 411047 410638 410933 411595 412360 413300 414425 415755 417566 419878 421897 422698 422329 421623 421142
60580D21142j54M18J311J995K102K061K307K606K748L191M356N898P317Q696J0233
60565D76227J1636J2623J3412J4107J4112J2826J0479P674M601J298j822m369
60553E72804o425p996q401p052m475j897M0J581L049M439N608O441O946P581R182
60538E81425J1991J5003J6885J7397J7290J6961J5852J3349R594N186N43m038
60526G17438p979j0559j1546j1366j0526r109p115n171m252m581n192n048m191
60513F20803l306k505j269M98K128L069L523M026M839N988P480R328J1653J4747
60499F81002J8738K3207K7618L2041L6938M2176M6880N0306N2310N2796N1361
60488A115373M7717M1860L3625K2674R345n002j8841l1353m2129n0507n5728n7578
$$ plain form
60580 421142 420988 421406 422717 424712 426814 428875 431182 433788 436536 439727 444083 449981 457298 465994 476227
60565 476227 487863 500486 513898 528005 542117 554943 565422 573096 577697 578995 577173 572804
60553 572804 566379 558383 549982 542930 538455 536558 536598 538179 541228 545667 551275 557716 564662 572243 581425
60538 581425 593416 608419 625304 642701 659991 676952 692804 706153 715747 720933 721476 717438
60526 717438 709459 698900 687354 675988 665462 656353 649238 644067 639815 635234 630042 624994 620803
60513 620803 617497 614992 613723 614221 616349 619418 622941 626967 631806 637794 645274 654602 666255 681002
60499 681002 699740 722947 750565 782606 819544 861720 908600 958906 1011216 1064012 1115373
60488 1115373 1163090 1204950 1238575 1261249 1270594 1265592 1246751 1215398 1173269 1122762 1067034 1009456
60476A009456n6569n3578m9507m5084m0731l6563l2542k8530k4396k0396j7239
60465F04321j5373j4278j2944j1035r143p894p296p057o948o745o254n599n158
60452D88597n066n065m813m105k927j656j000j295j963k165j806j352q95j42P81
60437D55128J310J272R64M51m85j636k399k669k931l346l450k963k183j414o73
60422D34976q0K01M98J298K224K255J217J94J01O49J130J343J296Q06mm12O4R73
60404D48729J591J786J833J847J816J813J766J438R04P04J199K133L044L668L857
60389D78128L565L118K966L046K929K650K703L127L367L226L162L326L192K494
60375E20999J840J887K543L352M012M187L492K184J221J207J725K068K054J801
$$ plain form
60476 1009456 952887 899309 849802 804718 763987 727424 694882 666352 641956 621560 604321
60465 604321 588948 574670 561726 550691 541548 533654 526358 519301 512353 505608 499354 493755 488597
60452 488597 483531 478466 473653 469548 466621 464965 463965 462670 460707 458542 456736 455384 454489 454347 455128
60437 455128 456438 457710 458674 459125 458640 457004 454605 451936 449005 445659 442209 439246 437063 435649 434976
60422 434976 434896 435097 435595 436893 439117 441372 442589 442783 442884 443533 444663 446006 447302 448108 448104 447692 447756 448729
60404 448729 450320 452106 453939 455786 457602 459415 461181 462619 463523 464227 465426 467559 470603 474271 478128
60389 478128 481693 484811 487777 490823 493752 496402 499105 502232 505599 508825 511987 515313 518505 520999
60375 520999 522839 524726 527269 530621 534633 538820 542312 544496 545717 546924 548649 550717 552771 554572
60361E54572J342Q53O75P94Q64R95J804L319M629N087N192N820P185Q924J0550
60346F12605J1463J1145R832Q351P005N265K827J33k470n109p476q567p994o739
60332F30271n904n560n375n516o033o234n576m558l876l386k715k224k375k772
60318E68167k755k520k545k395j213Q08K527L443M209N540P382R407J1652J4349
60304F16056J7528K1050K4909K9183L3463L6327L5847L1176K3470J4624N347m652
60292H84328j4816k3351k8910l1554l1710k9454k5395k1035j7403j4219j1167
60281F35314q936q067p704o722n400m820n130n468n338n052m952n024n132n093
60267E52476m720m154l781l543k922j927j296j214p89M78J616J430J49j118j866
$$ plain form
60361 554572 555914 556767 557442 558236 559100 560095 561899 565218 569847 574934 580126 585946 593131 602055 612605
60346 612605 624068 635213 645045 653396 660401 665666 668493 668626 666156 661047 653571 645004 637010 630271
60332 630271 624367 618807 613432 607916 601883 595649 590073 585515 581639 578253 575538 573314 570939 568167
60318 568167 565412 562892 560347 557952 556739 557547 560074 563517 567726 573266 580648 590055 601707 616056
60304 616056 633584 654634 679543 708726 742189 778516 814363 845539 869009 883633 888980 884328
60292 884328 869512 846161 817251 785697 753987 724533 699138 678103 660700 646481 635314
60281 635314 626378 618311 610607 603885 598485 593665 588535 583067 577729 572677 567725 562701 557569 552476
60267 552476 547756 543602 539821 536278 533356 531429 530133 528919 528130 528608 530224 531654 531803 530685 528819
60252E28819k216k118j534r64q79r69p03k01J66M33O75N51Ll12j1K99J50K13J136
60233E22538K233K504K320K808M061N190N763N960N605M375K842K137K581L473
60219E74390M171M602M850N021N388O060O735P230P747Q149P757O639O125P034
60205F61898Q181P866O173M603L990M054M521N274N736N334M419L696L050K059
60191G30854J136R61J138O45o20j903k907l826m462m499m355m584m847m596m254
60176F93881m380m281l023j353r22j748k249j676q70n18m02m84j135k028k252
60161F66560j786j458j342o47O07J463J750K313L160L112J917J043J509K455K758
60146F83414K752L251M027M393M488M833N262N271N048N284O192P281P977Q106
$$ plain form
60252 528819 526603 524485 522951 521987 521108 520139 519436 519235 519401 519834 520509 521060 521063 520751 520740 521039 521189 521402 522538
60233 522538 524771 527275 529595 532403 536464 541654 547417 553377 558982 563357 566199 568336 570917 574390
60219 574390 578561 583163 588013 593034 598422 604482 611217 618447 626194 634343 642100 648739 654864 661898
60205 661898 670079 677945 684118 688721 692711 696765 701286 706560 712296 717630 722049 725745 728795 730854
60191 730854 731990 732951 734089 734734 734114 732211 729304 725478 721016 716517 712162 707578 702731 698135 693881
60176 693881 689501 685220 682197 680844 679922 678174 675925 674249 673379 672861 672459 671975 670840 668812 666560
60161 666560 664774 663316 661974 661327 661934 663397 665147 667460 670620 673732 675649 676692 678201 680656 683414
60146 683414 686166 689417 693444 697837 702325 707158 712420 717691 722739 728023 734215 741496 749473 757579
60132G57579P898P740P725P495O673N253L227L97k806m913m842l406k340k123
60118G83557j894j185l96L60J385K321K345J638J312J623J587P21k84j046k182
60103G89862l924n240n245m415l661l061k285j497j046q19m38L12J540L195M676
60088G67954N205M734L925L182K471K014K176K599K443J612P79J27q05j894k455
60073G94067k730l982o591r253j0752j1393j1975j2434j2338j1826j1291j0725
60061F78777j0024r343q656p613o220n042m386l983l668l564l374k463r74Q3K95
60046F09845M91J535L297N160O757P782P962P577P270P071O424N249M093L051
60032F83564J674R0j036j791l029m785o033o483p160q614r968j0431j0418j0394
$$ plain form
60132 757579 765477 773217 780942 788437 795110 800363 803590 803987 801181 796268 791426 788020 785680 783557
60118 783557 781663 780478 780082 780442 781827 784148 786493 788131 789443 791066 792653 793374 793090 792044 789862
60103 789862 785938 780698 775453 771038 767377 764316 762031 760534 759488 758669 758231 758543 760083 763278 767954
60088 767954 773159 777893 781818 785000 787471 789485 791661 794260 796703 798315 799094 799221 798416 796522 794067
60073 794067 791337 787355 780764 771511 760759 749366 737391 724957 712619 700793 689502 678777
60061 678777 668753 659410 650754 643141 636921 631879 627493 623510 619842 616278 612904 610441 609467 609550 609845
60046 609845 610336 611871 615168 620328 627085 634867 642829 650406 657676 664747 671171 676420 680513 683564
60032 683564 685238 685328 684292 682501 679472 674687 668654 662171 655011 646397 636429 625998 615580 605186
60018F05186r874q528p051n977m768l049j702j600k169k191j375k74O07Q27l2
60003E58030j567k534k305j688j550j630j390j054r43o35K50J278K032K873M067
59988E53234N014N255N319N670N742N025M176L955L810K748R01q70k263l305l524
59973E90887k648j630j680k558k997k497j658r15l3J126K254L049L521L845M339
59958E92405N240O134O074M778L155K196J839J482R65M45r8n38m13L91J228J514
59942F26797J352Q79j37j534k449k477k338k641k928k687k425k698k980k523j606
59927E99605q33M5J445K693K814K123J908K664L719M380M552M444M480N262O957
59912F46258Q905J0415J1504J2301J2384J1414R825Q109O015L259L54k015l844
$$ plain form
60018 605186 595312 586784 579733 573756 568988 565939 564237 562637 560468 558277 556902 556628 557235 558062 558030
60003 558030 556463 553929 551624 549936 548386 546756 545366 544312 543369 542734 542984 544262 546294 549167 553234
59988 553234 558248 563503 568822 574492 580234 585259 589435 593390 597200 599948 600849 599979 597716 594411 590887
59973 590887 588239 586609 584929 582371 579374 576877 575219 574304 574271 575397 577651 580700 584221 588066 592405
59958 592405 597645 603779 609853 614631 617786 619982 621821 623303 624268 624713 624615 624077 623664 624055 625283 626797
59942 626797 628149 629028 628891 627357 624908 622431 620093 617452 614524 611837 609412 606714 603734 601211 599605
59927 599605 598772 598817 600262 602955 605769 607892 609800 612464 616183 620563 625115 629559 634039 639301 646258
59912 646258 655163 665578 677082 689383 701767 713181 723006 731115 737130 740389 740743 738728 734884
59899G34884n236n742n171m341m002l714k828j806j391j157j90J296K354K872
59885G05828L435L966L859L312L248L950M912N894O978P677P168N550L806K380
59871G71963P70j372l579n234o175o553o644o836p295p641p446o777n870m652
59857F96659l179k051j643j280q2J707L059L679M264N334O590P476P789P625P129
59842G43076O280M760K378k01j722j648p15J57P39R40L43j018k239k715k944l466
59826G42005l861l735l793m792o116o594o198n765n492m886l844k707j506q6J261
59811F83891K100K477K543K049R92J17n2p5n69j113j136j155j911k954l382l393
59795F78429l828m615m952m668m196l637l001k901l665m278l623k359k106l015
$$ plain form
59899 734884 729648 723906 718735 714394 710392 706678 703850 702044 700653 699496 699306 700602 702956 705828
59885 705828 709263 713229 717088 720400 723648 727598 732510 738404 745382 753059 760227 765777 769583 771963
59871 771963 772733 771361 767782 762548 756373 749820 743176 736340 729045 721404 713958 707181 701311 696659
59857 696659 693480 691429 689786 688506 688424 690131 693190 696869 701133 706467 713057 720533 728322 735947 743076
59842 743076 749356 754116 756494 756293 754571 752923 752208 752365 753104 754044 754387 753369 751130 748415 745471 742005
59826 742005 738144 734409 730616 725824 719708 713114 706916 701151 695659 690773 686929 684222 682716 682630 683891
59811 683891 685991 688468 691011 693060 694052 694169 694117 694042 693473 692360 691224 690069 688158 685204 681822 678429
59795 678429 674601 669986 665034 660366 656170 652533 649532 646631 642966 638688 635065 632706 630600 627585
59781F27585l684l307k470j820j350j109j350j809j906j679j553j331m94O70J363
59766F05756J573J961K548K699K392K312K722L220L648M223M813M999M920N145
59752F52931N870O917Q220R476R840Q982P970P980Q543Q311P130N989N242M290
59738G57691K894J440Pj575k818l019k543k427k844l059k808k500k183j527q01
59723G33928o62r72r58m32J14M40N94L31l69p00q3O78N85K26Q57K199K899K819
59705G41494L104M120N011N358N539N519M857L989L901M493M810M850N482O550
59691H09077O806N787M218K441K20j843k496j754r20m72L88J790K554J866J04
59676H27766k315n246p816q823q524q362q717q633p947p595p488o228l645j556
$$ plain form
59781 627585 623901 620594 618124 616304 614954 613845 612495 610686 608780 607101 605548 604217 603723 604393 605756
59766 605756 607329 609290 611838 614537 616929 619241 621963 625183 628831 633054 637867 642866 647786 652931
59752 652931 658801 665718 673938 683414 693254 702236 710206 718186 726729 735040 742170 748159 753401 757691
59738 757691 760585 762025 762032 760457 757639 754620 752077 749650 746806 743747 740939 738439 736256 734729 733928
59723 733928 733266 732294 731336 730904 731018 731458 732052 732383 732014 731314 731231 731909 732494 732720 733577 735776 738675 741494
59705 741494 744598 748718 753729 759087 764626 770145 775002 778991 782892 787385 792195 797045 802527 809077
59691 809077 815883 821670 825888 828329 828549 826706 824210 822456 821536 821064 821452 823242 825796 827662 827766
59676 827766 825451 820205 812389 803566 795042 786680 777963 769330 761383 753788 746300 740072 736427 734871
59662G34871j112j269q87m47n93o36K20J495K449L249M241N116N653O134O290
59647G64774N146K657J61j471k895m771o567p717q560r297r333q521p744p361
59633F98501o419m369k307j439j460j552j815k658l738m559n300o143o597o360
59619F43785n952n795n479m696l970l714l430k576j398l75M47J081J480K096L475
59604F14979N018N354M335L299K921K357J048k03p75j257j980k005p52P14J130
59589F34183P17L08Mk89o8P76J181K56j376k570l164l638m096m506n134n891o052
59572F00641n382m659m362l868k694j521j097j080q37n35n45n41r5N54R63J026
59556E75968P02m0n95r2J288K430L036L947N352O180N871N294N247N393N474O124
$$ plain form
59662 734871 733759 732490 731603 731156 730563 729927 730147 731642 734091 737340 741581 746697 752350 758484 764774
59647 764774 769920 772577 772738 771267 768372 763601 757034 749317 740757 731460 722127 713606 705862 698501
59633 698501 692082 687713 685406 683967 682507 680955 679140 676482 672744 668185 662885 656742 650145 643785
59619 643785 637833 632038 626559 621863 617893 614179 610749 608173 606775 606400 606847 607928 609408 611504 614979
59604 614979 619997 625351 629686 632985 635906 638263 639311 639108 638333 637076 635096 633091 632339 633053 634183
59589 634183 634900 635208 635212 634923 634855 635631 636812 637068 635692 633122 629958 626320 622224 617718 612584 606693 600641
59572 600641 595259 590600 586238 582370 579676 578155 577058 575978 575141 574606 574061 573520 573425 573979 574942 575968
59556 575968 576670 576630 576035 575943 577231 579661 582697 586644 591996 598176 604047 609341 614588 619981 625455 631579
59540F31579P701R622J1556J4070J7485K1267K4804K7104K5693J8382P040k758
59528H13545p155p186n582l096L61L472M987N718O779P176N446K293n64l127o430
59513H16637j0050j2564j3872j5048j6298j6840j6418j5370j3699j1499r678q869
59501F56432q277o968n447m553l760k126j74Q83J107J435J917J914J545J507J851
59486F37286K218K736L527M003L787L639M327N397O156O912Q066R056R391R664
59472G16165J0191R946Q229O094M516K567o31l529m032k700j807j847j342L94
59458G42214K497M437O576Q938J1050J2919J4692J5690J5246J4057J3288J2832
59446H74436J1839J0327Q657O150J953l274q130j2356j6282j9139j9797j8637
$$ plain form
59540 631579 639280 648902 660458 674528 692013 713280 738084 765188 790881 809263 816303 813545
59528 813545 806390 799204 793622 790526 790887 794359 799346 805064 811843 819019 824465 826758 826194 823067 816637
59513 816637 806587 794023 780151 765103 748805 731965 715547 700177 686478 674979 665301 656432
59501 656432 648155 641187 635740 631187 627427 625301 625127 626010 627117 628552 630469 632383 633928 635435 637286
59486 637286 639504 642240 645767 649770 653557 657196 661523 666920 673076 679988 688054 697110 706501 716165
59472 716165 726356 736302 744531 750625 755141 757708 757077 753548 749516 746816 745009 743162 741820 742214
59458 742214 744711 749148 755724 764662 775712 788631 803323 819013 834259 848316 861604 874436
59446 874436 886275 896602 905259 911409 913362 910088 901958 889602 873320 854181 834384 815747
59434H15747j6909j4746j1665q543p074p342p768p266n950l988j346J480L904
59421G28534O160Q658J1025J2954J5090J7765J9887K0562K0687K1406K2434K3533
59409I28695K5568K7479K4263J1922o262k1929k9872l0992k7863k1575j3431n635
59397H60368J313Q717J5468J6664Q672o003k0725l0323l3638l2218k8335k3745
59385G36215j9167j4828j1282q941p120m854k479j000j20J369L339M316L882L302
59371F82632L436L754L826M115M823N428N765O264O804O759O329O474P303P957
59357G61669Q328R342J1304J3365J4928J6274J7580J8656J9740K1299K2957K3920
59345I59362K4369K5048K5627K5022K3164K0882J8147J4167R130M134n70n570
$$ plain form
59434 815747 798838 784092 772427 763884 756810 749468 741700 734434 728484 724496 723150 724630 728534
59421 728534 734694 743352 754377 767331 782421 800186 820073 840635 861322 882728 905162 928695
59409 928695 954263 981742 1006005 1017927 1011665 989736 959864 928872 901009 879434 866003 860368
59397 860368 861681 870398 885866 902530 911202 905199 884474 854151 820513 788295 759960 736215
59385 736215 717048 702220 690938 681997 674877 670023 667544 666544 666424 667793 671132 675448 679330 682632
59371 682632 686068 689822 693648 697763 702586 708014 713779 720043 726847 733606 739935 746409 753712 761669
59357 761669 769997 779339 790643 804008 818936 835210 852790 871446 891186 912485 935442 959362
59345 959362 983731 1008779 1034406 1059428 1082592 1103474 1121621 1135788 1144918 1149052 1148482 1142912
59333A142912j0584j4556j7422j9998k2173k3130k3237k3713k4342k3626k1357
59322I18774j8965j7118j5071j2718j1109j0425r555q182p275o947n871l564j394
59309G90580n62o38p07m34M22K040L782M950O308R075J2508J4409J3973J1911
59295H67617P958J067p494j4123j6869j7094j6483j4954j2425j0028q296o349
59283G52527m035k623k380j720M7J512J988L126O115R493J1529J2783J4495J6237
59269H19094J7030J7111J6856J5459J2465R212P021N199K455r67m128p069j0090
59256H99648j2504j3713j4506j5703j6499j5652j3478j1296r645q271p114o146
59244G55121m915l199j436J93K166M457O092O631O919P535P794P040N706M255
$$ plain form
59333 1142912 1132328 1117772 1100350 1080352 1058179 1035049 1011812 988099 963757 940131 918774
59322 918774 899809 882691 867620 854902 843793 833368 823813 815631 808356 801409 795538 791974 790580
59309 790580 790018 789380 788673 788239 788661 790701 794483 799433 805741 814816 827324 841733 855706 867617
59295 867617 875575 876642 869148 855025 838156 821062 804579 789625 777200 767172 758876 752527
59283 752527 748492 745869 743489 741769 741816 743328 745316 748442 754557 764050 775579 788362 802857 819094
59269 819094 836124 853235 870091 885550 898015 907227 914248 919447 921902 920935 916807 909738 899648
59256 899648 887144 873431 858925 843222 826723 811071 797593 786297 776652 768381 761267 755121
59244 755121 750206 747007 745571 745764 747930 752387 758479 765110 772029 779564 787358 794398 800104 804359
59230H04359K369P9j772l041m813p446r594j0290j0507j1375j2225j1745r951
59217G14048p758n657l945l076k766j847jJ548K004K255L170L996L715K675J648
59202G10009N95m75p10K04J058Q26K50M96J415K270L029L735L787L075K698L323
59186G35585M003L766L175L072L056K531K003J996J812Q70R2N82J847K718L096
59171G70204L504L902M231N146O932Q632R430R961J1035J2140J2382J1876J0979
59158H80354R173O048K420p47l550o233q148q911r428j0439j1096j0352q881q189
59144H12021q584r243r566r495r149q985r421r762q777o865o019o780p167n791
59130F96417m017l499l483k441p75K43Q91K183L739M535M957O146P998R544J0734
$$ plain form
59230 804359 806728 806807 805035 801994 797181 789735 780141 769851 759344 747969 735744 723999 714048
59217 714048 706290 700633 696688 693612 690846 688999 688998 690546 692550 694805 697975 701971 705686 708361 710009
59202 710009 710604 710129 709419 709623 710681 711507 711757 712253 713668 715938 718967 722702 726489 729564 732262 735585
59186 735585 739588 743354 746529 749601 752657 755188 757191 759187 760999 761869 761961 762543 764390 767108 770204
59171 770204 773708 777610 781841 786987 793919 802551 811981 821942 832977 845117 857499 869375 880354
59158 880354 889527 895575 897995 897248 893698 887465 879317 870406 860978 850539 839443 829091 820210 812021
59144 812021 803437 794194 784628 775133 765984 756999 747578 737816 729039 722174 716155 709375 702208 696417
59130 696417 692400 688901 685418 682977 682202 682445 683336 685519 689258 693793 698750 704896 712894 722438 733172
59115G33172J2181J3743J4843J5591J6221J6178J5103J3860J3304J2891J1799
59104H88886J0456R544Q565O828M931L694K562N58j982m081n668p080p894p570
59090I01749o534n392l970k198r26p39j112j748l364o003q153q915r459j0801
59076H32435j1838j1307j0075r539r238q137o795o238n851m665l500l700m702
59063G36850m998m554m260m010l397l225m285n518n542m975n138n454m477k643
59049F74374j645j655j466q50o31q57q77p90j117j470j234q35p61k59J337K985
59033F64249L455L389M021M972N360N874P562R681J1016J2252J4683J7580J9215
59020G83309J9645K0083K0360J9395J7343J4983J1771O969J817j814m132o415
$$ plain form
59115 733172 745353 759096 773939 789530 805751 821929 837032 850892 864196 877087 888886
59104 888886 899342 908886 917451 924279 929210 932904 935466 936024 934042 929961 924293 917213 909319 901749
59090 901749 895215 889823 885853 883655 882729 881990 880878 879130 875766 869763 861610 852695 843236 832435
59076 832435 820597 809290 799215 789676 780438 772301 765506 759268 753417 748752 745252 741552 736850
59063 736850 731852 727298 723038 719028 715631 712406 708121 702603 697061 692086 686948 681494 677017 674374
59049 674374 672729 671074 669608 668758 668127 667270 666393 665603 664486 663016 661782 660947 660186 659927 661264 664249
59033 664249 667704 671093 675114 680086 685446 691320 698882 708563 719579 731831 746514 764094 783309
59020 783309 802954 823037 843397 862792 880135 895118 906889 913858 915675 913861 909729 903314
59008I03314q302q600p828p299o526m223j057J409L484O252Q627Q752P551P501
58994I03055Q382P725N224L204K575J756l1j647k745m587p451r849j0938j1326
58980H83347j1184r933q020o571n176k533P89K838L642N158P748R655J0364J1429
58966H91553J3305J4284J3595J2857J3411J4460J4795J4269J2798R979O371L179
58954A034856J32m277j0068j5349j9026k1721k3673k4054k3006k2049k1701k0658
58942H29406j8029j4496j0838p140l931k135j467o53M11N89l47j367k106l093
58928G64804m036m012l490m001n625o849o962o524n648m073k792l075l929l089
58914G00699n17J673K684L608M590M524L890M747P287R299R778J0180J1456J2641
$$ plain form
59008 903314 895012 886412 878584 871285 864759 860536 859479 860888 864372 870624 879251 888003 895554 903055
58994 903055 911437 919162 924386 927590 930165 931921 931890 930243 927498 922911 915460 905611 894673 883347
58980 883347 872163 862230 854210 847639 842463 839930 840719 843557 847199 852357 860105 869760 880124 891553
58966 891553 904858 919142 932737 945594 959005 973465 988260 1002529 1015327 1025306 1031677 1034856
58954 1034856 1034988 1030711 1020643 1005294 986268 964547 940874 916820 893814 871765 850064 829406
58942 829406 811377 796881 786043 778903 774972 772837 771370 770717 771128 771717 771370 770003 767897 764804
58928 764804 760768 756756 753266 749265 743640 736791 729829 723305 717657 713584 710792 707717 703788 700699
58914 700699 700182 701855 704539 708147 712737 717261 721151 725898 733185 742484 752262 762442 773898 786539
58900G86539J3282J4442J6308J7439J7346J7330J7932J8045J7417J7492J8916
58889I72488K0690K2591K5782L0198L3843L5653L6406L6031L2812K6494J9493
58878A292481J3677Q351K580k916p593j2444j8139k3628k7758l0456l1531l0390
58866A132234k7638k4913k2413j8858j4489j1604j1298j2058j2456j2859j3659
58855I49989j4252j4579j5358j6080j5225j3028j1433j0792r509p511o941q399
58843H06882r676r413r037r800j0810j1314j1977j2705j2069j0216r260r504q509
58830F72592n391k750k484k971k398j797k417l025k303j304j149o81J212L148
58816F48282L414K612K106J869J690K393L923M408K970J403J251J451O97k13k99
$$ plain form
58900 786539 799821 814263 830571 848010 865356 882686 900618 918663 936080 953572 972488
58889 972488 993178 1015769 1041551 1071749 1105592 1141245 1177651 1213682 1246494 1272988 1292481
58878 1292481 1306158 1314509 1317089 1314173 1306580 1294136 1275997 1252369 1224611 1194155 1162624 1132234
58866 1132234 1104596 1079683 1057270 1038412 1023923 1012319 1001021 988963 976507 963648 949989
58855 949989 935737 921158 905800 889720 874495 861467 850034 839242 829733 822222 815281 806882
58843 806882 797206 787793 778756 768956 758146 746832 734855 722150 710081 699865 690605 681101 672592
58830 672592 667201 664451 661967 658996 656598 654801 652384 649359 647056 645752 644603 643922 645134 648282
58816 648282 651696 654308 656414 658283 659973 662366 666289 670697 673667 675070 676321 677772 678469 678256 677957
58801F77957l85j183j513n20M22J3q31r80j118j873k103j015O4N2K15J896M116
58784F73214N387O112P265Q511R271R940J0529J0053Q632P951Q278P521M722J787
58770G79173N5j968n378q187q335o962o321o563o786p120p588o985m975l223k648
58755F96189j753M81K546L116L237L856L860K605J710K168K504J982K621N508
58741G30630Q119Q147P133P449Q439Q571Q732J0212J1847J2332J3034J5305J7333
58728H67283J6934J5254J4487J4033J2157R409P155M746J395j022l60K328M744
58715I68543O905R702J1896J1898J0806J0484J0145P935M277P08k944p318j1335
58702A031702j4088j7074k1657k6257k8939l0578l2482l3209l1103k7746k5451
$$ plain form
58801 677957 677572 676389 674876 674356 674778 674791 673960 672980 671862 669989 667886 666871 666935 666987 667202 669098 673214
58784 673214 678601 684713 691978 700489 709760 719700 730229 740282 748914 756865 765143 772664 777386 779173
58770 779173 779228 777260 771882 763695 755360 748398 742077 735514 728728 721608 714020 707035 702060 698837 696189
58755 696189 694436 694917 697463 700579 703816 707672 711532 714137 715847 718015 720519 722501 725122 730630
58741 730630 738749 746896 754029 761478 769917 778488 787220 797432 809279 821611 834645 849950 867283
58728 867283 884217 899471 913958 927991 940148 949557 956712 961458 962853 961831 961471 963799 968543
58715 968543 975448 985150 997046 1008944 1019750 1030234 1040379 1048314 1052591 1053299 1050355 1043037 1031702
58702 1031702 1017614 1000540 978883 952626 923687 893109 860627 827418 796315 768569 743118
58691G43118k3401j9862j6063j4101j2943j0403p393o322o761o543n738n848o346
58678F01394n722m656m652m803l294q52O60J613L310M966N346N748P870J0490
58664F17418J1747J2883J5866J9063J9261J6480J2913Q750L096k461n431o400
58652G23185p610q859q674q024q799r953r225p405o788o780n257k943k178k498
58638F28192j729l02j80o01O90K996L752L110L164L627K606O62j46k38j283k225
58622F42095r70J188J469P53K014M782O158O411Q341J1666J3295J2785J2488J2463
58608G34938J0363O317L024J008j545m357n206m434m618n849n911m959n249o436
58594G07086o012m269l887m660l683p92J264K217M712Q965J2115J3404J5038J7364
$$ plain form
58691 743118 719717 699855 683792 669691 656748 646345 638952 632630 625869 619326 613588 607740 601394
58678 601394 595672 591016 586364 581561 578267 577415 578075 579688 582998 587964 593310 599058 606928 617418
58664 617418 629165 642048 657914 676977 696238 712718 725631 734381 737477 735016 729585 723185
58652 723185 715575 706716 698042 690018 681219 671266 662041 654636 647848 641068 635811 632868 630690 628192
58638 628192 626463 626161 625981 625380 626070 629066 632818 635928 639092 642719 645325 645987 645841 645603 644320 642095
58622 642095 641125 642313 643782 644535 646549 651331 657489 663900 672241 683907 697202 709987 722475 734938
58608 734938 745301 751618 754642 755650 754105 749748 744542 740108 735490 729641 723730 718771 713522 707086
58594 707086 701074 696805 692918 688258 684575 683783 685047 687264 691976 700941 713056 726460 741498 758862
58580G58862J8049J6712J5628J5231J3576J0764R173Q873P567N597O020R083J1606
58567I06741J2594J4603J8658K2713K6096L0644L6296M0182M1185M1020L9985
58556A230717L6190K9831K3626J8153J1246K898l899q089j1753j5518j7406j7208
58544A278788j7438j8951j9883j9863k0889k3390k5630k7460l0199l2591l1782
58533A010712k8527k6423k5657k2919j7886j4145j2754j0632o488k841r15J107
58521H42632L476L921K572K511M160M490K916K389L357K505r34l439l544m146
58507H62866o528p826o635n607o169o029m164l101l935m239l000k591l802m087
58493G95153k741k525m119m330j899K93Q88K453O035Q888R877J1675J5226J7545
$$ plain form
58580 758862 776911 793623 809251 824482 838058 848822 857995 866868 874435 880032 886052 895135 906741
58567 906741 919335 933938 952596 975309 1001405 1032049 1068345 1108527 1149712 1190732 1230717
58556 1230717 1266907 1296738 1320364 1338517 1349763 1352661 1348762 1340673 1328920 1313402 1295996 1278788
58544 1278788 1261350 1242399 1222516 1202653 1181764 1158374 1132744 1105284 1075085 1042494 1010712
58533 1010712 982185 955762 930105 907186 889300 875155 862401 851769 845281 842440 841525 842632
58521 842632 846108 850029 852601 855112 859272 863762 866678 869067 872424 874929 873995 870556 867012 862866
58507 862866 856338 848512 841877 836270 830101 824072 819908 816807 812872 808633 805633 803042 799240 795153
58493 795153 792412 789887 785768 781438 779539 779832 780720 783173 789208 798096 807973 819648 834874 852419
58479H52419J7556J8509K1974K4783K4572K3042K1232J6962R712K721k390p908
58467A023184j4540j9127k0252k0641k1524k0207j5835j1791r675o613j291L126
58455H64814M949P003J0857J3705J3916J3866J4435J2527P020J313k769p512j3134
58442I40990j5578j3603j1540j1745j0886p033l679k993j887J344L224K021J795
58429H70430N221Q887J0038J1523J5602J9276K0234K0974K2669K1449J5385Q625
58417A050313M122r92q233j3177j3129j2385j4478j6089j4179j2233j3534j4939
58405I21067j3330j1760j3014j3561j0148o157n177m403o92K884K962K382M470
58392H55523O691O046M963N654M832K18l877l816l184n733q191o762m375m612
$$ plain form
58479 852419 869975 888484 910458 935241 959813 982855 1004087 1021049 1030761 1033482 1031092 1023184
58467 1023184 1008644 989517 969265 948624 927100 906893 891058 879267 869592 862979 861688 864814
58455 864814 869763 876766 887623 901328 915244 929110 943545 956072 963092 964405 961636 954124 940990
58442 940990 925412 911809 900269 888524 877638 870605 866926 863933 862046 863390 866614 868635 870430
58429 870430 875651 884538 894576 906099 921701 940977 961211 982185 1004854 1026303 1041688 1050313
58417 1050313 1054435 1053443 1045210 1032033 1018904 1006519 992041 975952 961773 949540 936006 921067
58405 921067 907737 895977 882963 869402 859254 853097 847920 843517 842825 845709 848671 851053 855523
58392 855523 862214 868260 873223 878877 883709 883927 880050 876234 873050 867317 859126 852364 847989 843377
58378H43377m781j986K49j435l208q01K914M115N352R476J2694J1346R320J1058
58364H97690J3513J2690J1734J4573J7850J7387J6267J8286J9658J5805J0227
58353A065680Q067O948K848j133p09R56o17k471l49K554J901J035M446Q646Q799
58338A106601Q148J1477J5513J5393J4395J7458K1272K0660J8478J9259J9551
58327A288205J4754R050Q060Q145L659j803k258p47k762n008k052K359K282J228
58313A323112N054R931R432P058R371J3299J2745J1083J4311J8485J7126J4323
58301A465330J7093K1404J9612J5070J5287J7331J4422J0324J2368J6671J5356
58290A640268J1913J4165J8598J7389J4330J7653K3568K3383K0504K3535K9046
$$ plain form
58378 843377 838596 836610 836859 835424 832216 831415 834329 838444 843796 853272 865966 877312 886632 897690
58364 897690 911203 923893 935627 950200 968050 985437 1001704 1019990 1039648 1055453 1065680
58353 1065680 1073747 1080695 1083543 1082410 1081701 1082657 1082040 1079569 1079220 1081774 1083675 1084710 1089156 1097802 1106601
58338 1106601 1114749 1126226 1141739 1157132 1171527 1188985 1210257 1230917 1249395 1268654 1288205
58327 1288205 1302959 1312009 1320069 1328214 1331873 1330070 1327812 1327065 1324303 1319295 1317243 1319602 1321884 1323112
58313 1323112 1328166 1338097 1347529 1354587 1363958 1377257 1390002 1401085 1415396 1433881 1451007 1465330
58301 1465330 1482423 1503827 1523439 1538509 1553796 1571127 1585549 1595873 1608241 1624912 1640268
58290 1640268 1652181 1666346 1684944 1702333 1716663 1734316 1757884 1781267 1801771 1825306 1854352
58279A854352K8442K5467K9227L6044L6332L3240L6130M1847M1245L8028M1863
58268B242217M8941M9096M6060N0525N9232O1406N9814O4483P1787P1244O6688
58257B891493O8725P2758O7214N6913N4842N7625N3383M6801N0934O1070O3170
58246C544928O1428P0117Q4801R0096Q9517R8267J12755J17775J17657J28623
58236D515964J46205J53026J53120J64700J84486J94373J97892K13503K37174
58227F160443K49691K55859K76899L09008L30738L46213L77789M20990M52335
58218I179965M77050N21283N81748O33276O81368P54006Q46357R30315J014050
58209A5619418J131760J279563J426812J586072J801487K072615K366727K702867
$$ plain form
58279 1854352 1882794 1908261 1937488 1973532 2009864 2043104 2079234 2121081 2162326 2200354 2242217
58268 2242217 2291158 2340254 2386314 2436839 2496071 2557477 2617291 2681774 2753561 2824805 2891493
58257 2891493 2960218 3032976 3100190 3157103 3211945 3269570 3322953 3369754 3420688 3481758 3544928
58246 3544928 3606356 3676473 3761274 3851370 3940887 4039154 4151909 4269684 4387341 4515964
58236 4515964 4662169 4815195 4968315 5133015 5317501 5511874 5709766 5923269 6160443
58227 6160443 6410134 6665993 6942892 7251900 7582638 7928851 8306640 8727630 9179965
58218 9179965 9657015 10178298 10760046 11393322 12074690 12828696 13675053 14605368 15619418
58209 15619418 16751178 18030741 19457553 21043625 22845112 24917727 27284454 29987321
58201B9987321L141126L693871M340207N124153O135635P398979Q896994J0700153
58193G9418439J2936306J5639341J8794358K2530790K7055744L2345976L8064108
58186B46785062M3629798M7816476M8138357M1501122K6589433N879187j5242717
58179D45096718l1761954m1579502m5340317m4720230m1293707l6404913l1164534
58172A72831561k6241794k1864006j8094288j4978066j2462249j0395572q675946
58165F0119640p287427o185767n270030m484104l840745l328878k889549k496613
58157B4336527k175193j925282j703405j492695j320194j191786j074846r57166
58149A2495960q62209p94287p25217o46626n82573n39529m93689m37999l94308
$$ plain form
58201 29987321 33128447 36822318 41162525 46286678 52422313 59821292 68718286 79418439
58193 79418439 92354745 107994086 126788444 149319234 176374978 208720954 246785062
58186 246785062 290414860 338231336 386369693 427870815 454460248 460339435 445096718
58179 445096718 413334764 371755262 326414945 281694715 240401008 203996095 172831561
58172 172831561 146589767 124725761 106631473 91653407 79191158 68795586 60119640
58165 60119640 52832213 46646446 41376416 36892312 33051567 29722689 26833140 24336527
58157 24336527 22161334 20236052 18532647 17039952 15719758 14527972 13453126 12495960
58149 12495960 11633751 10839464 10114247 9467621 8885048 8345519 7851830 7413831 7019523
58140G019523l68872l40893l04920k81371k74968k63870k40113k21869k15922
58131D506725k05524j85182j71484j69387j62052j43953j31327j30116j25092
58122C082608j10365j00367j00960r8636q7881q1289q3413q1462p0985o4765o7456
58111B135029o6562n7208n1250n3448n2551m4427m0595m5304m6907m0519l7008
58100A599250m1179m2658l6995l4523l9581m1446l4809k9398l0614k9871k2826
58089A215350j8403k0877k1190j4758j0368j2866j4178r905q059j2918j6554j4714
58077A040560j5038k1264k5039k1789j9386k2725k4669k0616j7429j9474k0022
58066H13109j4836j0545j1450j1474p088m790p826q848l875n00m012q040p179
$$ plain form
58140 7019523 6650651 6309758 6004838 5723467 5448499 5184629 4944516 4722647 4506725
58131 4506725 4301201 4116019 3944535 3775148 3613096 3469143 3337816 3207700 3082608
58122 3082608 2972243 2871876 2770916 2672280 2584399 2503110 2419697 2338235 2267250 2202485 2135029
58111 2135029 2068467 2011259 1960009 1906561 1854010 1809583 1768988 1723684 1676777 1636258 1599250
58100 1599250 1558071 1515413 1478418 1443895 1404314 1362868 1328059 1298661 1268047 1238176 1215350
58089 1215350 1196947 1176070 1154880 1140122 1129754 1116888 1102710 1092805 1084746 1071828 1055274 1040560
58077 1040560 1025522 1004258 979219 957430 938044 915319 890650 870034 852605 833131 813109
58066 813109 798273 787728 776278 764804 757716 752926 745100 736252 732377 731877 727865 719825 712646
58053G12646o458r906j1952q696o121q632j0614p598m825o580p826m614k309n264
58039F11251q354o878n112p271r358p689o248q147r009n987m161o950r318p550
58025E09219o379r343j1458q821o262p857q944n281j408k056l609j937m99k908
58011D32457n236l519j358k526l461o18J993J95k445j370J079J551K479O001Q017
57996D33239N460K817M349O468M868K503L262M269J900q14j06J167p02k982k103
57981D63595q69k977n784n564m607o242q030o678m607n014n518l175p35j332k142
57966D00321J74K759J850k29J27R56q35k945k072k51n62j228k9L14k589n109l561
57949C87091r65j417k652q69J940K317K310N088Q065P546O055P922J1429J2437
$$ plain form
58053 712646 706188 696282 684330 675634 669513 660881 650267 642669 637844 631264 623438 618824 616515 611251
58039 611251 602897 596019 590907 583636 574278 566589 560341 552194 543185 537198 533037 526087 516769 509219
58025 509219 502840 493497 482039 473218 466956 459099 450155 444874 443466 441410 437801 435864 435365 432457
58011 432457 427221 423702 422344 419818 416357 415739 417732 417927 415482 414112 415191 416742 419221 425222 433239
57996 433239 438699 441516 445865 452333 457201 459704 462966 467235 469135 468321 468215 469382 468680 465698 463595
57981 463595 462726 459749 453965 448401 443794 437552 429522 422844 418237 413223 407705 404530 403795 402463 400321
57966 400321 400495 403254 405104 404875 405002 405958 405123 402178 400106 399855 399293 398065 398036 398350 395761 390652 387091
57949 387091 386126 384709 382057 381188 383128 385445 387755 392843 400908 408454 414509 422431 433860 446297
57935D46297J2097J3956J6864J7684J7716J9596K1063J8499J3657J0360P670K769
57923F18228k509m774n644q740j2882j4623j4749j5951j6887j4956j2227j2216
57911D82070j3400j2164r591q965r148o923l576k747l811l621k768l938o044o062
57897C89312m832n133n880m144j042J49KJ315L414L780L510N435Q398Q987P416
57882D10687O359N683L652J544J690K617J352j237k420k847m652o577o359n642
57868D03850p038q629p161m386m185n552m744k423k174l455k600K32J541J017
57854C54293J540L304L840L256L837N100M623L027K800L096J163k055l318l072
57840C81434m390o943p720o918p302q429p398m802m011m858l916r42P24K74M41
$$ plain form
57935 446297 458394 472350 489214 506898 524614 544210 565273 583772 597429 607789 615459 618228
57923 618228 615719 610945 605301 596561 583679 569056 554307 538356 521469 506513 494286 482070
57911 482070 468670 456506 446915 437950 428802 421879 418303 415556 411745 408124 405356 401418 395374 389312
57897 389312 384480 379347 373467 369323 368281 368430 368432 369747 373161 376941 380451 385886 394284 403271 410687
57882 410687 417046 422729 426381 427925 429615 432232 433584 432347 429927 427080 422428 415851 409492 403850
57868 403850 396812 388183 381022 376636 372451 366899 362155 359732 357558 354103 351503 351735 353276 354293
57854 354293 355833 359137 362977 366233 370070 375170 379793 382820 385620 388716 389879 387824 384506 381434
57840 381434 377044 370101 362381 355463 348161 339732 332334 327532 323521 318663 314747 313805 314529 314803 315244
57825C15244K112L301L657M908O623O488M952M764N988O152N183N198N689M016
57811C84275N66j618k256l855o410p228o075n452n675m646k595j971k523j575
57797C32962O30R78q83j993j512j669k905l056j925j739k595k203n89k06r93k28
57781C12074K172L270K592K948M998O057N265N071O450P280O612O026N761L958
57767C80534P68j192j478k535m963o449o283o463p391o964m973l967m651m813
57753C19180l760l456m211l807k016j480k843l453k261j563k462k919j899j271
57739B81779k043k654k457k940m237m357l129k855l872l653j620n24j674k907
57725B42857k832k879l616l250j432m61j074j104J30K95j421k481j588q52j551
$$ plain form
57825 315244 317356 320657 324314 329222 335845 342333 347285 352049 358037 364189 369372 374570 380259 384275
57811 384275 384841 383223 380967 377112 370702 363474 357399 351947 346272 341626 339031 337060 334537 332962
57797 332962 333592 334570 333687 331694 330182 328513 325608 322552 320627 318888 316293 314090 313501 313295 312302 312074
57781 312074 314246 317516 320108 323056 328054 334111 339376 344447 350897 358177 364789 370815 376576 380534
57767 380534 381302 380110 378632 376097 371134 364685 358402 351939 344548 337584 332611 328644 323993 319180
57753 319180 315420 311964 307753 303946 301930 300450 297607 294154 291893 290330 287868 284949 283050 281779
57739 281779 279736 277082 274625 271685 267448 263091 259962 257107 253235 249582 247962 247438 245764 242857
57725 242857 240025 237146 233530 230280 228848 228387 227313 226209 226339 226634 225213 222732 221144 220292 218741
57710B18741j853q48o68k331l444k456j339j731k037q66K31m8k01J069K350K282
57694B06851J849J836J097p22j811j439j435k633l148j937p96q37l83J628L506
57679B01626M194N436Q433J1566J3641J6300K0981K6456L1622L7762M5980N5224
57667D79221O4697P5117Q5411R0897Q6660P0476M2077L767l6523o7498q3135q6499
57655G24668q3449p6380o6147n5473m6666l9001l1477k5461k1918j9017j5247
57644B44432j2012j0542r233o722m624m474m838m138l461l843l795k355j565k918
57630A69912m243l269j514j472k494k688k467l001l396k506j499j727k185j672
57616A35779j231j826k033p48L21l94j407j046n98j610k677k026q89j048j482
$$ plain form
57710 218741 216888 216040 215372 213041 209597 207141 205802 204071 202034 201168 201399 201351 201150 202219 204569 206851
57694 206851 208700 210536 211633 210911 209100 207661 206226 203593 200445 198508 197712 196875 196492 198120 201626
57679 201626 205820 211256 219689 231255 244896 261196 282177 308633 340255 378017 423997 479221
57667 479221 543918 619035 704446 795343 882003 952479 994556 998323 961800 894302 811167 724668
57655 724668 641219 564839 498692 443219 396553 357552 326075 300614 278696 259679 244432
57644 244432 232420 221878 212645 205923 201299 196825 191987 187849 184388 180545 176750 174395 172830 169912
57630 169912 165669 162400 160886 159414 156920 154232 151765 148764 145368 142862 141363 139636 137451 135779
57616 135779 134548 132722 130689 129941 130262 129868 128461 127415 126817 125207 122530 120504 119615 118567 117085
57601A17085o21L77p1p21J32J252Q05j15K88Q91j50j648j437l44m95j377j184
57584A12667m86r01j670j111r6n41j757j795j134j501k302j757m96n00j398j323
57568I3899n59r01k113k346j594j492k237k561k289k172j842o50K90m07j659j400
57552F9967Q1R69J125J690K390K143J565K054L044K844J552O23L10K3K71J659
57536I2310K890K399J106R40J623J516O50J93r6j106k042j638p78j139k090j811
57520I2927n37P3PM24R71M27o58p71k38m15r28m33O10P47L19O42J176M18j060
57501I3701j396o56m51r44j047r62j691k594k238j122q58j300j155o46p99r99
57485G4843j60N91n47k620l261k621k630l113k224k78M55l54q61o00r38j980k270
$$ plain form
57601 117085 116464 116841 116770 116049 116181 117433 118238 118123 118411 119302 119152 117504 116067 115723 115228 113851 112667
57584 112667 112181 111280 109610 108499 108403 107862 106105 104310 103176 101675 99373 97616 97120 96620 95222 93899
57568 93899 93340 92439 90326 87980 86386 84894 82657 80096 77807 75635 73793 73143 73433 73026 71367 69967
57552 69967 70048 71017 72142 73832 76222 78365 79930 81984 85028 87872 89424 90047 90357 90380 90651 92310
57536 92310 95200 97599 98705 99645 101268 102784 103434 103627 103531 102425 100383 98745 97967 96828 94738 92927
57520 92927 92390 92463 92470 92894 93865 94292 93634 92863 92625 92210 91282 90849 91459 92206 92525 93167 94343 94761 93701
57501 93701 92305 91649 91198 90254 89207 88245 86554 83960 81722 80600 79742 78442 77287 76641 75842 74843
57485 74843 74683 75274 74727 72107 68846 66225 63595 60482 58258 57980 58435 58081 57220 56620 55682 53702 51432
57468E1432j716j695k137j589j77M62K35N45J290R94q4j84O28N59l79k65J028
57451D8947J447M69l9O65R73O0p15m08J46L55Q23J580J686J127R05R82L76n95
57433E8784o49j25n71j716j592P6J414J570J574J797J309K11k01J0n90j910k186
57416E7205j119l87n78m72K07J72o61o67N47J360R85M37M3j222l120l634k075
57399D7021k40L98L30Q9p84k042k305j321m47l04J4P80J032O41P68J690K270K076
57381D9666J909J976J690J303J559J751N96j110j454p44r64k066k158j308j580
57366D9066l039l441k429k163k996k501n7J459L16j287r59N11J412J846K323K209
57350D0270J391J088J520J251J4m00N89J091J55n21J66O32l98j540j297n33n15
$$ plain form
57468 51432 49716 48021 45884 44295 44118 44580 44815 45360 46650 47644 47560 47376 48004 48563 48184 47919 48947
57451 48947 50394 50863 50824 51489 52462 52522 51807 51399 51545 51900 52723 54303 55989 57116 58021 59003 59379 58784
57433 58784 58135 58010 57439 55723 54131 54207 55621 57191 58765 60562 61871 62082 61881 61891 61301 59391 57205
57416 57205 56086 55699 55121 54649 54856 55028 54367 53700 54247 55607 56592 57029 57072 55850 52730 49096 47021
57399 47021 46781 47179 47509 47598 46814 44772 42467 41146 40699 40395 40409 41189 42221 42862 43630 45320 47590 49666
57381 49666 51575 53551 55241 56544 58103 59854 60450 59340 57886 57142 56178 54112 51954 50646 49066
57366 49066 46027 42586 40157 37994 34998 32497 32440 33899 34215 32928 31969 32480 33892 35738 38061 40270
57350 40270 41661 42749 44269 45520 45534 45134 45723 46814 46969 46448 46614 47246 46848 45308 44011 43478 42963
57333D2963q13q67j339k255k118n16O30L4j048j256j105j052j68J597K321J038
57317C6046m86o41k57m14l72M87J007L41m68n62o94j139o75Q06J322J86m28Q44
57299C4903K078J447K86M09R83O77N24J842L274K799R91j78l57l89l72k86j017
57282D7614k770m044l947l790m619n176m240l003k950l382l189l111f13m692l903
57267i208k647k398k515j739n71J1O02J924K965K729K277K810b382B62J484J500
57251C246K448L099L364L591L222K009J155J433J802J517J740L205M368L893K951
57236D3043K911K850J658N67J096K292K580K588L658N157N726N618N579N044L676
57221I4043K861L420L729K487J274J887L171L289L009L879M998M775M055M528
$$ plain form
57333 42963 42150 41283 39944 37689 35571 35055 35685 35719 34671 33415 32310 31258 31090 32687 35008 36046
57317 36046 35560 34919 34662 34248 33876 34363 35370 35711 35243 34681 33987 32848 32173 32979 34301 34487 34059 34903
57299 34903 36981 38428 38714 39123 40106 40783 41307 43149 46423 49222 50213 50035 49678 49289 48917 48631 47614
57282 47614 44844 40800 36853 33063 28444 23268 19028 16025 13075 9693 6504 3393 -613 -5305 -9208
57267 -9208 -11855 -14253 -16768 -18507 -19078 -19067 -18465 -16541 -13576 -10847 -8570 -5760 -2382 262 1746 3246
57251 3246 5694 8793 12157 15748 18970 20979 22134 23567 25369 26886 28626 31831 36199 40092 43043
57236 43043 45954 48804 50462 51029 52125 54417 56997 59585 63243 68400 74126 79744 85323 90367 94043
57221 94043 96904 100324 104053 106540 107814 109701 112872 116161 119170 123049 128047 132822 136877 141405
57207A41405N590N799N821O839P682O761N353N673P013P084O032N851O757P330
57193B30990P437Q037Q874R074R179J0029J0718J0145R374R895J0894J0823J0240
57180C55709J0476J1041J1014J1292J2749J4091J4377J5498J8861K1913K1659
57169E18680J9537J8870J9437J8835J7482J7709J9070J9157J8142J8245J9446
57158G24610J9875J9672K0388K1358K0750J9373J9314J9789J8656J6987J7614
57147I38386J9841K0529J9715K0268K2281K2927K1910K2046K4037K5476K5589
57136A183005K6320K8138K9161K9188L0275L2702L4479L5464L7733M1409M4212
57125A552086M5754M8232N2368N6785O1644O8774P7826Q6551R5080J05642J17974
$$ plain form
57207 141405 146995 152794 158615 165454 173136 179897 185250 190923 197936 205020 211052 216903 223660 230990
57193 230990 238427 246464 255338 264412 273591 283620 294338 304483 313857 323752 334646 345469 355709
57180 355709 366185 377226 388240 399532 412281 426372 440749 456247 475108 497021 518680
57169 518680 538217 557087 576524 595359 612841 630550 649620 668777 686919 705164 724610
57158 724610 744485 764157 784545 805903 826653 846026 865340 885129 903785 920772 938386
57147 938386 958227 978756 998471 1018739 1041020 1063947 1085857 1107903 1131940 1157416 1183005
57136 1183005 1209325 1237463 1266624 1295812 1326087 1358789 1393268 1428732 1466465 1507874 1552086
57125 1552086 1597840 1646072 1698440 1755225 1816869 1885643 1963469 2050020 2145100 2250742 2368716
57114B368716J29545J40482J53605J69492J86367K04913K28060K56022K86892
57105D124094L22325L67015M22589M88017N66161O63463P83129R25734J097040
57096I759567J307557J563230J863745K209966K603536L037386L495634L963632
57088B9804253M427427M862316N235285N521116N701272N746698N629041N362783
57080G2290191N005789M581391M010457L162905J992745O05359q13199k112799
57072H8722839l223807m125558m810878n280797n547441n629095n547799n333478
57064D9223986n022802m650217m242862l823265l411044l019982k657154k326594
57056B0070066k031562j772784j547453j351562j181979j035952r10273q01869
$$ plain form
57114 2368716 2498261 2638743 2792348 2961840 3148207 3353120 3581180 3837202 4124094
57105 4124094 4446419 4813434 5236023 5724040 6290201 6953664 7736793 8662527 9759567
57096 9759567 11067124 12630354 14494099 16704065 19307601 22344987 25840621 29804253
57088 29804253 34231680 39093996 44329281 49850397 55551669 61298367 66927408 72290191
57080 72290191 77295980 81877371 85887828 89050733 91043478 91648837 90835638 88722839
57072 88722839 85499032 81373474 76562596 71281799 65734358 60105263 54557464 49223986
57064 49223986 44201184 39550967 35308105 31484840 28073796 25053814 22396660 20070066
57056 20070066 18038504 16265720 14718267 13366705 12184726 11148774 10238501 9436632
57048I436632p08431o28160n59518n01098m51019m06690l66060l29050k96862
57039E189744k69964k47292k27298k08990j91882j75570j59549j43140j25601
57030C440458j06659q6922o7248m7762k8547j2288n491j4771m0352p3680j02740
57019B853998j19979j25076j21671j13428j03075r2613q2996p4331o6908o1214
57009A892707n6815n2490m7970m4301m2001m0109l7722l5190l3104l1343k9904
56998A441758k9428k9991l0472k9976k8862k7603k5812k3287k0831j9010j7057
56987A159429j4024j0125n977j536L238P388R467Q391L378n652j6811k6606l2553
56974A078007l4783l4569l2635k9540k6246k3210j9997j6602j3822j1543q296
$$ plain form
57048 9436632 8728201 8100041 7540523 7039425 6588406 6181716 5815656 5486606 5189744
57039 5189744 4919780 4672488 4445190 4236200 4044318 3868748 3709199 3566059 3440458
57030 3440458 3333799 3246877 3179629 3131867 3103320 3091032 3085541 3070770 3030418 2956738 2853998
57019 2853998 2734019 2608943 2487272 2373844 2270769 2178156 2095160 2020829 1953921 1892707
57009 1892707 1835892 1783402 1735432 1691131 1649130 1609021 1571299 1536109 1503005 1471662 1441758
56998 1441758 1412330 1382339 1351867 1321891 1293029 1265426 1239614 1216327 1195496 1176486 1159429
56987 1159429 1145405 1135280 1129303 1127767 1131005 1138393 1147860 1156251 1159629 1153977 1137166 1110560 1078007
56974 1078007 1043224 1008655 976020 946480 920234 897024 877027 860425 846603 835060 826764
56963H26764l571J020M177P019J1268J6673K1769K5855K8361K7263K0256P399
56951I94253q488k3634l4790m0102m0026l6993l3173k8970k4147j9259j4997j1202
56939F78472p534m132p54L573R110J4744J9770K5117L1685L8450M3025M2893L5652
56926I30071K0138j070k1831l6734m4522m6713m4917m0846l6844l4054l1224k7087
56914E84367k2689j9666j7729j5749j4022j3350j2961j1541r462p964o926n401
56902D26907l650k640k121j052N57J914L039M455N914O969Q221J0425J3079J5399
56888D87416J8006K2015K7104L1815L5001L5444L1228K1514Q496m089j4004k0870
56876F79076k4514k4846k2783j9593j5640j1005o501k690J318O503J2227J7398
$$ plain form
56963 826764 823193 824213 828390 835409 846677 863350 885119 910974 939335 966598 986854 994253
56951 994253 985765 962131 927341 887239 847213 810220 777047 748077 723930 704671 689674 678472
56939 678472 670938 666806 666052 669625 678735 693479 713249 738366 770051 808501 851526 894419 930071
56926 930071 950209 949139 927308 890574 846052 799339 754422 713576 676732 642678 611454 584367
56914 584367 561678 542012 524283 508534 494512 481162 468201 456660 447198 439234 432308 426907
56902 426907 423257 420617 418496 417444 418001 419915 422954 427409 433323 440292 448513 458938 472017 487416
56888 487416 505422 527437 554541 586356 621357 656801 688029 709543 718039 713950 699946 679076
56876 679076 654562 629716 606933 587340 571700 560695 554194 551504 552822 559325 571552 588950
56864E88950K2495K8856L6761M5766N5976O7113P6690Q0451P4398N6178K6676
56853A160310q035l8265n6927o3938o3385n8256m9868m0234l1471k3373j4332
56842G12226m249N620J5062K4873L5090M5612N7789P3033R0325J07129J21422
56831A283932J29777J24678R8477N1703m733n6494r3798j13640j18053j11898
56821A189951j00352q6619p2044n7846m5290l4343k3814j3050k242Q682K0119
56810G83152L1912M3727N5938O8826Q1009Q9293Q9287P5879M6009L602l9765p2237
56798A256632q9693r5136r2411q3725p1889o0456n0770m1631l2380k3939j6674
56787E97928r692k638L988J0483J7827K5796L3108L9326M4284M5676L9712K4900
$$ plain form
56864 588950 611445 640301 677062 722828 778804 845917 922607 1003058 1077456 1133634 1160310
56853 1160310 1152275 1114010 1057083 993145 929760 871504 821636 781402 749931 726558 712226
56842 712226 707977 713597 728659 753532 788622 834234 892023 965056 1055381 1162510 1283932
56831 1283932 1413709 1538387 1636864 1688567 1683834 1627340 1533542 1419902 1301849 1189951
56821 1189951 1089599 1002980 930936 873090 827800 793457 769643 756593 754351 763033 783152
56810 783152 815064 858791 914729 983555 1064564 1153857 1243144 1319023 1365032 1368634 1328869 1256632
56798 1256632 1166939 1071803 979392 895667 823778 763322 712552 670921 638541 614602 597928
56787 597928 588236 585598 589586 600069 617896 643692 676800 716126 760410 806086 845798 870698
56775H70698L798j8852l8231n0568n4840n3569n0175m5770m0086l4252k9933k6482
56763D31738k2011j7011j3865j2854j1738r482p464o610o187n867o251o838o159
56750B99401m423l544l934l958k997k418k791k825j926j319j712k070j657j215
56736B62612j322j475j414j560j752j375q32r06q32N89K232J821j56p95O57J800
56720B57292J322R03J824K820K675K258K466K633K285K216K569K168Q94M38J416
56705B86179K079J136k80p81p26p94n75J38N55M42O67J278J030k49r83m95j86
56688B88435j041k081k301k143k018j428n10m45j314j637q59j94k30L6R57J354
56672B74581P98L61K76o54k303k586p38J250J732J440J257O96j79N8J582K499
$$ plain form
56775 870698 874496 855644 817413 766845 712005 658436 608261 562491 522405 488153 458220 431738
56763 431738 409727 392716 378851 365997 354259 344777 337313 330703 324516 318649 312398 305560 299401
56750 299401 294978 291434 287500 283542 280545 278127 275336 272511 270585 269266 267554 265484 263827 262612
56736 262612 261290 259815 258401 256841 255089 253714 252882 251976 251144 251733 253965 255786 255630 254835 255492 257292
56720 257292 258614 259517 261341 264161 266836 269094 271560 274193 276478 278694 281263 283431 284325 284763 286179
56705 286179 288258 289394 289114 288333 287607 286813 286238 286376 286931 287373 288040 289318 290348 290099 289116 288621 288435
56688 288435 287394 285313 283012 280869 278851 277423 276913 276468 275154 273517 272658 272464 272234 272270 273227 274581
56672 274581 275379 275740 276016 275362 273059 270473 269735 270985 272717 274157 275414 276110 275931 275989 277571 280070
56656B80070K068K083L567M822M517L964M357M441L023J388R67Q78l6q17k46Q60
56640C15906J222J199J382J049j00o67J15P28k0q30k79O60N26j80n00j018k232
56623C16961k873k066j348k341m046m624m178l739l142k063j510k159k719k010
56609B78143j044j105j441r50m38j072k072k136j704j774j934j492j089j304j264
56594B57324m64k63j555k713j934L1J457K271K988K926J687P07J137J828J517
56579B66944J136J737K095R40l06K96J967K777K854L287L428K185P47J120K950
56564B94157M476N586P366R550J1069J2321J4443J6926J8058J7007J3773Q370
56552D33102J946k703l972l492l467l523k412j024j063k148k873l433m678n818
$$ plain form
56656 280070 282138 284221 287788 292610 297127 301091 305448 309889 312912 314300 315267 316145 316109 315292 315046 315906
56640 315906 317128 318327 319709 320758 320658 319991 320106 320834 320814 319984 319705 320365 320891 320711 320211 319193 316961
56623 316961 314088 312022 310674 308333 304287 299663 295485 291746 288604 286541 285031 282872 280153 278143
56609 278143 277099 275994 274553 273603 273165 272093 270021 267885 266181 264407 262473 260981 259892 258588 257324
56594 257324 256860 256597 255042 252329 250395 250426 251883 254154 257142 260068 261755 262462 263599 265427 266944
56579 266944 268080 269817 271912 272852 272546 272842 274809 277586 280440 283727 287155 289340 290087 291207 294157
56564 294157 298633 304219 311585 321135 332204 344525 358968 375894 393952 410959 424732 433102
56552 433102 435048 432345 428373 424881 421414 417891 415479 414455 413392 411244 408371 404938 400260 394442
56538C94442n589m579m018l551k510j942k862l986l735l016l418m249m071l599
56524C43317m141m680l594j924j788k772l063k924l816n103m962l747l291l615
56510B93897l380k803l034l404k463r89r12j858j868r22o48j104q83oK79J26O77
56493B70705J484J189K26J27P11O67K04M02O90r1r99l02J249J563P69N83Q65K27
56475B80269o66J50K165K821J558L59L00N62P27J221J643J304J082K058L014K093
56459C00660J36o11k43m86j116n83M96J02j408j846j168j293k243k059n29N69
56443B88378Q04J270J571K55j793j988k69P57J03o11n15m84n48K51J287Q66n18
56426B88816p68M9j20j314j382QQ11L73L14J093J192K59k17J21n1q94j055m59
$$ plain form
56538 394442 388853 384274 380256 376705 374195 372253 369391 365405 361670 358654 355236 350987 346916 343317
56524 343317 339176 334496 330902 328978 327190 324418 321355 318431 314615 309512 304550 300803 297512 293897
56510 293897 290517 287714 284680 281276 278813 277824 276912 275054 273186 272264 271616 270512 269629 269623 269902 270028 270705
56493 270705 272189 273378 273604 273731 274442 275109 275313 275715 276405 276314 275315 275013 276262 277825 278594 279177 280042 280269
56475 280269 279603 279753 281918 284739 286297 286656 286956 287518 288245 289466 291109 292413 293495 295553 298567 300660
56459 300660 300796 300185 299942 299456 298340 297757 298253 298355 296947 295101 293933 292640 290397 288338 287809 288378
56443 288378 289182 290452 292023 292278 290485 288497 288228 288985 289088 288477 287962 287478 286930 287181 288468 289334 288816
56426 288816 288048 288097 287977 286663 285281 285289 286100 286473 286787 287880 289072 289331 289114 289235 289184 288290 287235 286776
56408B86776m22q06j71J225J687J278J502J992R97r68j536n60j29n99l85M48L64
56391B90693N9J751M569N042K664O60N49L65q31j120L45J595J497J431K101K161
56375C13531J178N55N72j04j260r61P67J628J049P71J102N01o56n3K053K673J148
56358C24494J26N92M16j065j551j98Q14N68R87K643L304K149J296J614J163o38
56342C36714j531o46m3n52k81J201J616N30N73K451L300J979J282K701L623K244
56326C55161R07J788L401L941M250M917M337K078M59N42L32j027j375N9O42r11
56310C79501k032j040m8n80n73J390L087K754K253L295M402M394M887O510O728
56295D14928M312J999J816J813L38o04N85J814J285P90J804K362J091L49J928
$$ plain form
56408 286776 286354 285548 285377 286602 288289 289567 291069 293061 294058 293090 291554 290994 290865 290266 289881 290329 290693
56391 290693 290752 292503 297072 302114 304778 305438 305987 306352 305521 304401 304746 306341 307838 309269 311370 313531
56375 313531 314709 315264 315836 315732 314472 313511 314278 315906 316955 317726 318828 319329 318673 318620 320673 323346 324494
56358 324494 324620 325212 325628 324563 323012 322814 323628 324196 325183 327826 331130 333279 334575 336189 337352 336714
56342 336714 335183 334537 334494 333942 333661 334862 336478 337008 337581 340032 343332 345311 346593 349294 352917 355161
56326 355161 356068 357856 361257 365198 369448 374365 378702 380780 381239 381781 382113 381086 379711 379770 380412 379501
56310 379501 377469 376429 376381 375801 375228 376618 379705 382459 384712 388007 392409 396803 401690 408200 414928
56295 414928 419240 421239 423055 424868 425206 424602 425187 427001 428286 429076 430880 433242 434333 434682 436610
56280D36610L518K972K194L277M556M080L370M109M714L748L167M639O195N993
56266D93142N778P191Q381P816P631R528J1195J0567R933J1853J4694J6141J7570
56253F31420K0865K4463K6575K8943L3334L7704L9843M1559M5271M9629N2409
56242A032015N4421N6824N7889N6228N3825N2170M8956M2332L4659K8250K1239
56231A538808J1621J438p053j5325k4538l1787l4890l6816m0692m4422m4974m3935
56219A227435m3942m3594m0987l8384l8147l7824l4547l0555k9061k8400k5714
56208H36280k2747k2308k2548k0489j7776j7264j7214j4705j1513j0721j0727
56197F48268q479n580n205n918m551k320k214l101k288j114k109l422j953P25
$$ plain form
56280 436610 440128 443100 445294 448571 453127 457207 460577 464686 469400 473148 476315 480954 487149 493142
56266 493142 498920 506111 514492 522308 529939 539467 550662 561229 571162 583015 597709 613850 631420
56253 631420 652285 676748 703323 732266 765600 803304 843147 884706 929977 979606 1032015
56242 1032015 1086436 1143260 1201149 1257377 1311202 1363372 1412328 1454660 1489319 1517569 1538808
56231 1538808 1550429 1551867 1544814 1529489 1504951 1473164 1438274 1401458 1360766 1316344 1271370 1227435
56219 1227435 1183493 1139899 1098912 1060528 1022381 984557 950010 919455 890394 861994 836280
56208 836280 813533 791225 768677 748188 730412 713148 695934 681229 669716 658995 648268
56197 648268 639789 634209 629004 623086 618535 616215 614001 610900 608612 607498 605389 601967 600014 600739
56183F00739J295P21J598K468P79j437p87J390J932J819L380M796L554K123L870
56168F28240O515O093M198M655O242N690M709O875J0318J0823R548J0526J2994
56155G27426J3426J2725J4160J6589J6851J6562J9309K3573K5604K6948L1783
56144I44956L9133M5104N0561N9131O9894P9458Q9105J02439J18180J32543J46076
56133A876580J60394J70638J69366J56359J37377J15837R3248P4829O5832O3801
56123C084261O1904N7622N1030L8309J6225r500k9208m0811m8379n2854n3614
56112C074985n6349o9016r0957j14584j35702j53570j63873j61936j51198j39062
56102A838738j26245j09317r0849p6825o6386n4479m2452l5497l1897k5653j7782
$$ plain form
56183 600739 602034 602755 604353 606821 607600 606163 605376 606766 608698 610517 613897 618693 622247 624370 628240
56168 628240 634755 640848 645046 649701 655943 661633 666342 673217 683535 694358 703906 714432 727426
56155 727426 740852 753577 767737 784326 801177 817739 837048 860621 886225 913173 944956
56144 944956 984089 1029193 1079754 1138885 1208779 1288237 1377342 1479781 1597961 1730504 1876580
56133 1876580 2036974 2207612 2376978 2533337 2670714 2786551 2879799 2954628 3020460 3084261
56123 3084261 3146165 3203787 3254817 3293126 3309351 3299851 3270643 3229832 3181453 3128599 3074985
56112 3074985 3018636 2949620 2858663 2744079 2608377 2454807 2290934 2128998 1977800 1838738
56102 1838738 1712493 1603176 1512327 1435502 1369116 1314637 1272185 1236688 1204791 1179138 1161356
56091A161356j4059j3475j0095m581k605l444j576K016J660j444j097K003K051
56078A116710M2J922O383O940M646O174J0685J1475R282J0767J5074J5439J2955
56065A228494J4760J9593J9535J5358J5424J9741K0129J6118J5419J8321J7101
56054A419993J1602R903J2608J2051Q072Q757J4265J5875J2581J2681J7355J8855
56042A574598J6545J8313K4288K5835K2530K3295K8882L0446K7321K8516L4511
56031A855080L5833L1936L2886L9727M2205L8838L9843M6905M9663M5820M5026
56020B303762M9344M9922M6416M8954N7395N9947N5943N7891O7316P1547O8461
56009B936898P0533P9812Q3568P9844Q1999R2392R7601R5545J00446J14503J22505
$$ plain form
56091 1161356 1147297 1133822 1123727 1119146 1116541 1113097 1111521 1113537 1115197 1113753 1112656 1114659 1116710
56078 1116710 1116752 1118674 1125057 1131997 1136643 1142817 1153502 1164977 1174259 1185026 1200100 1215539 1228494
56065 1228494 1243254 1262847 1282382 1297740 1313164 1332905 1353034 1369152 1384571 1402892 1419993
56054 1419993 1431595 1441498 1454106 1466157 1474229 1482986 1497251 1513126 1525707 1538388 1555743 1574598
56042 1574598 1591143 1609456 1633744 1659579 1682109 1705404 1734286 1764732 1792053 1820569 1855080
56031 1855080 1890913 1922849 1955735 1995462 2037667 2076505 2116348 2163253 2212916 2258736 2303762
56020 2303762 2353106 2403028 2449444 2498398 2555793 2615740 2671683 2729574 2796890 2868437 2936898
56009 2936898 3007431 3087243 3170811 3250655 3332654 3425046 3522647 3618192 3718638 3833141 3955646
55998C955646J21491J26963J42302J51792J52047J59490J77778J89811J91587
55989E368907K01052K23033K39628K46345K62236K92283L16725L30434L54419
55980G835062L94591M29412M53192M89491N45712N98755O42569P03242P88545
55971A2880571Q72202R48238J048336J183813J326804J472876J661958J911310
55963B3306108K193463K509892K916201L442813M069088M811940N753808O943200
55955E5946513Q365930J0060389J2147210J4691740J7676368K1180102K5413080
55948A65481332L0448405L6041988M1684956M6339956M7783315M2826730K9411661
55941D40018343R095725j2926403l0855674m1594280m5450583m4466327m0679465
$$ plain form
55998 3955646 4077137 4204100 4346402 4498194 4650241 4809731 4987509 5177320 5368907
55989 5368907 5569959 5792992 6032620 6278965 6541201 6833484 7150209 7480643 7835062
55980 7835062 8229653 8659065 9112257 9601748 10147460 10746215 11388784 12092026 12880571
55971 12880571 13752773 14701011 15749347 16933160 18259964 19732840 21394798 23306108
55963 23306108 25499571 28009463 30925664 34368477 38437565 43249505 49003313 55946513
55955 55946513 64312443 74372832 86520042 101211782 118888150 140068252 165481332
55948 165481332 195929737 231971725 273656681 319996637 367779952 410606682 440018343
55941 440018343 449114068 436187665 405331991 363737711 318287128 273820801 233141336
55934B33141336l5595943l0290762k5403001k1138902j7501523j4489687j2061605
55927G6659913j0082972q432096p078869o002433n121838m366796l736979l236478
55919B8601452k818476k442351k121431j868886j652952j446319j267058j132042
55911A3851937j017869r03157q04401p36231o77953o11167n51560n13492m79696
55902G556411m34550l92725l67783l45019l11315k80747k65647k51916k27054
55893D679655k04352j95981j89163j71625j54878j50167j46097j31603j17510
55884C218279j14301j11185r7869q5584q6219r0789q7947q4320q7654q8877p9594
55873B203940o9554o8715o9143o1938n5036n7091o0050n4795m8440m9563n1295
$$ plain form
55934 233141336 197545393 167254631 141851630 120712728 103211205 88721518 76659913
55927 76659913 66576941 58144845 51065976 45063543 39941705 35574909 31837930 28601452
55919 28601452 25782976 23340625 21219194 19350308 17697356 16251037 14983979 13851937
55911 13851937 12834068 11930911 11126510 10390279 9712326 9101159 8549599 8036107 7556411
55902 7556411 7121861 6729136 6361353 6016334 5705019 5424272 5158625 4906709 4679655
55893 4679655 4475303 4279322 4090159 3918534 3763656 3613489 3467392 3335789 3218279
55884 3218279 3103978 2992793 2894924 2809340 2723121 2632332 2544385 2460065 2372411 2283534 2203940
55873 2203940 2134386 2065671 1996528 1934590 1879554 1822463 1762413 1707618 1659178 1609615 1558320
55862A558320m5335l8172l7704l7887l2050k7472l1362l5865l2170k6497k7156
55851A186650k8586k3276j7296j8850k2859k1485j9101k2451k6521k4220k0079
55840I41926k0873k2380j8597j4429j6267j9307j6913j3333j4754j6854j3527
55829G54692r038r367j0310o241j959l744p165n753l472o500j0752r690o812q410
55815F55479j1218r222n664o495q612o147j947j549k028J927P003P372N850Q196
55801F32945J2054J2226J1200J3799J6838J4612R387O341L494l250j0441j2763
55789G06442j3085j6708k0759j9529j5392j4087j3887r900m727m438p716r033
55777E57181q830j0860j3010j0474m877j054J889P593J4088J7057J7643J8424
$$ plain form
55862 1558320 1512985 1474813 1437109 1399222 1367172 1339700 1308338 1272473 1240303 1213806 1186650
55851 1186650 1158064 1134788 1117492 1098642 1075783 1054298 1035197 1012746 986225 962005 941926
55840 941926 921053 898673 880076 865647 849380 830073 813160 799827 785073 768219 754692
55829 754692 745654 736287 725977 719736 717777 714033 706868 701115 697643 691143 680391 670701 663889 655479
55815 655479 644261 635039 629375 622880 614268 608121 606174 604625 602597 604524 611527 618899 624749 632945
55801 632945 644999 657225 668425 682224 699062 713674 723061 729402 732896 729646 719205 706442
55789 706442 693357 676649 655890 636361 620969 606882 592995 583095 578368 573930 566214 557181
55777 557181 548351 537491 524481 514007 509130 508076 509965 517558 531646 548703 566346 584770
55765E84770J5869N996o398j3413j5396j7679j9870j8001j3873j2498j2850j0545
55753D66112p060p153r571r439p593q632j1759j2394j0949j1407j2991j1681q311
55740C37172o915o805m310o24J02j340j077Lj765m868m722k082j516l055l113
55725B95085k135l468o077o045l970l457l846j907R20P42j042m6K663K536N08
55710B70461J634N756P798O758O259O554M190l70k663k176k870n516o725n938
55696B83152o232p773p278m624l305l863l241j055k19r75m85J334J630M45P95
55681B48306K786L565L054L915N841N905M383M220M938L312j12j498o79j259l602
55666B83075m199k324j053j123MK400L093J918K045L973M785L898L816M704M082
$$ plain form
55765 584770 600639 606635 600237 586824 571428 553749 533879 515878 502005 489507 476657 466112
55753 466112 459052 451899 442328 432889 425296 416664 404905 392511 381562 370155 357164 345483 337172
55740 337172 330257 323452 319142 318518 318620 317280 316203 316206 314441 309573 304851 302769 301253 298198 295085
55725 295085 292950 289482 283405 277360 273390 269933 266087 264180 265100 265842 264800 264754 267417 269953 270461
55710 270461 272095 277851 285649 292407 298666 305220 309410 309040 306377 304201 301331 295815 289090 283152
55696 283152 276920 269147 261869 257245 253940 250077 246836 245781 245562 244587 244102 245436 247066 247511 248306
55681 248306 251092 254657 257711 261626 267467 273372 277755 281975 286913 290225 290113 288615 287936 286677 283075
55666 283075 278876 276552 275499 274376 274380 276780 279873 281791 283836 287809 292594 296492 300308 305012 309094
55651C09094K398K840N042M994K002k87o17j840m843o839p002p958j0241j0889
55637B75854r164q107q890q862o897n468n738n565l989k932k937k005m8K63j480
55622B04035k163m89J027P31O4j59j197k796k592n49L07j137k455k174j708j749
55606A86996j013L76M04r12j173mL50n54o70J30m57k501l293k239j796k625k488
55589A68531r14k22r43q60L62M02q80p23J262K099R38N85K111K978K170K159L937
55572A82992M931L957L555N285P076P264P046P048N731L083J653K032J550q24
55558B42379k620k586k812m317n070m357m531o343p039n339l800l916l476j274
55544A84899J29q77j791n35R47O13p7N79J281O88J75Q91J331M75n6O51P29p65
$$ plain form
55651 309094 311492 314332 319374 324368 326370 326083 325466 323626 318783 311944 304942 296984 286743 275854
55637 275854 266690 258583 249693 240831 233934 228466 222728 217163 213174 210242 207305 205300 205252 205515 204035
55622 204035 201872 201383 202410 203141 203205 203046 201849 199053 196461 195912 196219 195082 192627 190453 188745 186996
55606 186996 185983 186359 186763 185851 184678 184674 185024 184470 183800 183930 183473 180972 177679 175440 173644 171019 168531
55589 168531 167617 167395 166452 165592 165954 166356 165476 164753 166015 168114 169052 169637 171748 174726 176896 179055 182992
55572 182992 187923 191880 195435 200720 207796 215060 222106 229154 234885 237968 239621 241653 243203 242379
55558 242379 239759 237173 234361 230044 224974 220617 216086 209743 202704 197365 193565 189649 186173 184899
55544 184899 185028 184151 182360 181825 182772 183385 183308 183887 185168 185856 186031 186922 188253 188728 188672 189323 190052 189287
55526A89287j741j075j008k896m312l287j815k137k926k327j545k191l063k620
55512A56344j942k307k516j404l72p62j386j145j234k309k418m58J247N63j000
55497A38901j180n50n47o10L1L11m07n99N34J170K34l29Q98K022J313L59R29J651
55479A44131Q79p3L46P48l73j273K05K689L488K650J776Q57o61j677j268q55j785
55462A49804k714k015o99l62l75J94K24j217k437j835p65r40j277k51R40O32p3
55445A36834N69J593J276M13N50Q39j53j327r53R7N8m36J20R23L77p53p50l0N8
55426A39305qP50J307M12o64r6J331J836J782K308K502J145l69o4J091Q61l99
55409A53030p75l92o92j301q66nk85j168r85n8Q0m15m38m80j521k389j339P10
$$ plain form
55526 189287 187546 186471 185463 182567 178255 174968 173153 171016 168090 165763 164218 162027 158964 156344
55512 156344 154402 152095 149579 148175 147803 147041 145655 144510 143276 140967 138549 138091 139338 139901 138901
55497 138901 137721 137171 136624 136014 136045 136356 135949 135350 135884 137054 137288 136959 137857 139879 141192 141551 142480 144131
55479 144131 145010 144937 145283 146031 145658 144385 144590 147279 150767 153417 155193 156050 155389 153712 152444 151589 149804
55462 149804 147090 145075 144376 144014 143639 143833 144057 142840 140403 138568 137803 136863 135586 135335 136275 136907 136834
55445 136834 137403 138996 140272 140685 141235 142074 141921 140594 139641 139738 139796 139360 139480 140403 140780 140027 139277 139247 139305
55426 139305 139297 140047 141354 141766 141102 141006 142337 144173 145955 148263 150765 151910 151541 151477 152568 153429 153030
55409 153030 152255 151863 151171 149870 149004 148999 148714 147546 146561 146503 146583 146168 145730 145250 143729 141340 140001 140711
55391A40711J460Q58N01L89n25j430n95J280J798O01m55n11l75l16J23L94n27
55374A43381k090k808k487j878r46M07R99j0j180r51l86j278k776k752j390m14
55358A23441J50J367K465J843L10Q3J050J196L55K57J105J286N09J51L80j48j494
55341A34306k077j444q81r08n83M48J285J467J400J127M40k8L73Q05J43r15r15
55324A34043r0L50N17J144J482M23j058j192m20m10q37j73R79N70j094j507n5
55307A32672J140Q00P0M7L52O61J287J814J384O03Q85J842J645J24r42q41p65
55290A42778j242j199j65P98R42P04L19n64j482j343k75M12L22L06O25O70M65
55273A42071O19P32j47j465j595m18M65J96n04r74j202p86P34K417K684J602O78
$$ plain form
55391 140711 142171 143029 143530 143919 143394 141964 141369 142649 144447 145048 144593 144082 143707 143391 143514 143908 143381
55374 143381 141291 138483 135996 134118 133172 133579 134578 134568 133388 132437 132051 130773 127997 125245 123855 123441
55358 123441 123591 124958 127423 129266 129576 129659 130709 131905 132260 132517 133622 134908 135417 135568 135948 135800 134306
55341 134306 132229 130785 129904 128996 128413 128861 130146 131613 133013 134140 134580 134552 134925 135730 135873 134958 134043
55324 134043 133953 134303 134820 135964 137446 137869 136811 135619 135199 134789 133952 133779 134758 135328 134234 132727 132672
55307 132672 133812 134612 134682 134729 135081 135742 137029 138843 140227 140830 141715 143557 145202 145326 144384 143543 142778
55290 142778 141536 140337 140172 140970 141912 142616 142935 142371 140889 139546 139271 139683 140005 140311 140936 141606 142071
55273 142071 142690 143422 143275 141810 140215 139797 140262 140458 139954 138980 137778 136992 137726 140143 142827 144429 145107
55256A45107N20N13N74J173J739J103l52j017n33j14l55o51p00q36q63l36J41
55239A45113l40j304j645j537j746j735o26O53N23n25p77k85l22n39M71K071K131
55222A39581O51k15J67K49m33m17O91J295O44n1r1l12r20p83L54J211J251J361
55204A44233J721J263o1p58k04N38P60R41J050L53p52r03k03k04j099j456j010
55187A44209j094j819j549J7J063P34M29R26R07m50j764j720r30l76Q9O70R11
55170A40253R41J592K594K557J329L02rm47q80p6J575J983Q16J76R19J246J66
55153A55037o59n3N67pn56M6O10n8r41q95q19j643k219j404l67n79j231q48M5
55134A44026J07k78J56J170J531J129Q38R01R51R44Q56K99o34j046o66l87o47
$$ plain form
55256 145107 145627 146140 146714 147887 149626 150729 150377 149360 148827 148713 148358 147707 147007 146171 145308 144972 145113
55239 145113 144773 143469 141824 140287 138541 136806 136180 136833 137356 136831 136054 135769 135447 134908 135379 137450 139581
55222 139581 140232 140017 140184 140433 140000 139583 140274 141569 142213 142162 142071 141759 140839 140056 140410 141621 142872 144233
55204 144233 145954 147217 147156 146398 146194 146732 147492 148433 149483 149836 149084 148181 147978 147774 146675 145219 144209
55187 144209 143115 141296 139747 139764 140827 141561 141990 142916 143823 143373 141609 139889 138959 138583 138672 139342 140253
55170 140253 141194 142786 145380 147937 149266 149568 149559 149112 148232 148156 149731 151714 152530 152706 153625 154871 155037
55153 155037 154378 154325 154892 154885 154329 154375 154985 154927 153986 153091 152272 150629 148410 147006 146639 146060 144829 143981 144026
55134 144026 144133 143855 144011 145181 146712 147841 148679 149580 150531 151475 152331 152630 151996 150950 150284 149897 149250
55117A49250o14J34O79M57J97K19l87j693k022n84Q64O78p1M42J787K273J790
55100A53399J524J746J761J472J336J247P93J66k27m51n15l8P54P55m13j602j836
55083A59871j601j561j283l85L79K91j89m43p39j221j145j81P33Q35O44P03N68
55066A55276N8J1P14J037L27l47j1N59L91qJ73M82K86R0M08N79L2m93l48k95j019
55045A57902j664j283n18l57m44j13J50j64k15Q18K024J997Q91j71q14j162r23
55028A55954j01L39j56p00m57r9m27q82p46n98j049j262l64Q22J050O05M37L87
55010A52753j17n40r3P71J143J100J055P59K31N07J941L022K483J329J145J569
54994A69058J362P95R05J376J125K89k69o57j349j720r97K7R8l96k69J88k26j357
$$ plain form
55117 149250 148636 148770 149449 149906 150103 150322 149935 148242 146220 145636 146500 147178 147107 147549 149336 151609 153399
55100 153399 154923 156669 158430 159902 161238 162485 163278 163444 163217 162766 162251 162213 162967 163722 163309 161707 159871
55083 159871 158270 156709 155426 155041 155420 155711 155522 155079 154340 153119 151974 151793 152526 153361 154005 154708 155276
55066 155276 155334 155345 156059 157096 157423 157076 157065 157624 158015 158007 158180 158662 158948 159038 159446 160025 160057 159564 159216 158921 157902
55045 157902 156238 154955 154437 154080 153636 153523 153673 153509 153294 154112 156136 158133 159024 158853 158039 156877 155954
55028 155954 155853 156192 156036 155336 154879 154780 154353 153471 152725 152127 151078 149816 149452 150274 151324 151929 152366 152753
55010 152753 152636 152096 152003 152774 153917 155017 156072 156831 157062 157569 159510 162532 165015 166344 167489 169058
54994 169058 170420 171215 172120 173496 174621 174910 174641 173984 172635 170915 169918 169945 170043 169647 169378 169566 169340 167983
54976A67983j905j506q96l40M44J209J445J377J357R51q2p21r3R70J308J330J856
54959A74687K169J199k06m06L50M88j98n75l80l40m25QN98N46L64J046J868J249
54941A82042m63j320q92p10j415j728p69N70J286J538J640J292N38K64J078K565
54925A85516M080N378O354O916P287P699Q000Q166Q705R613R545P277L495j0k516
54910B75505m515o240p501q503r440r634q458o705n702n463n062m360l821l214
54896A86887k033q57o16q80m78N16J024R32J139J864K480K840L248L393K911K645
54880B05015L692N487O542O787P346Q252Q377P583O872O272M545J387j859m172
54866B72126n953p657q795q877q166p093n904n019m726m534l875l240l436m053
$$ plain form
54976 167983 166078 164572 163676 163336 163780 164989 166434 167811 169168 170119 170037 169316 169223 170193 171501 172831 174687
54959 174687 176856 178055 177849 177443 177793 178281 178083 177508 177128 176788 176363 176371 176969 177515 177879 178925 180793 182042
54941 182042 181579 180259 179367 178657 177242 175514 174745 175315 176601 178139 179779 181071 181609 181873 182951 185516
54925 185516 189596 194974 201328 208244 215531 223230 231230 239396 248101 257714 267259 274536 278031 278021 275505
54910 275505 270990 264750 257249 248746 239306 229672 221214 214509 208807 203344 198282 193922 190101 186887
54896 186887 184854 183997 183381 182501 182023 182539 183563 184495 185634 187498 189978 192818 196066 199459 202370 205015
54880 205015 208707 214194 220736 227523 234869 243121 251498 259081 265953 272225 276770 278157 276298 272126
54866 272126 266173 258516 249721 240844 232678 225585 219681 214662 209936 205402 201527 198287 194851 190798
54852A90798l937k957j891r57J8L55p48k423k895j958j074r25p81l19k07n98p10
54835A68791l24j14k71k21Rk38p80o05L08Q02M20M2L00P37Q40O48J70n48q28j69
54815A68969N23J01p37l56R69J276Q0q74m53M38Q90J324J955J876Q08K6M15J050
54797A78280Q00M0l48m51p32r68p78m36l09j71K84Q53J185J138O51p2k64N48J517
54778A80767J475Q13J081K600M019M355M057L858L971M666O153P621P912P415
54764B40763P741R197J0202R626Q079O350M228J564j060l405n948q553j0177j0511
54750B58096j0452j0309r164o757m533l741l825l566k755j859j121p80j115j641
54736A96478j286L9J199J561J701J917J578O85N47J929L752M665M798N094N890
$$ plain form
54852 190798 186861 183904 182013 181056 181074 181429 180681 178258 175363 173405 172331 171406 170625 170306 170099 169501 168791
54835 168791 168467 168353 168082 167861 167870 167632 166852 166247 166555 167357 167777 167819 168119 168856 169696 170344 170514 169966 169138 168969
54815 168969 169492 169593 168856 168500 169469 170745 170825 169951 169498 169936 170826 172150 174105 175981 176789 176815 177230 178280
54797 178280 179080 179120 178772 178321 177589 176621 175843 175407 175098 174927 175211 176064 177249 178387 179038 178966 178702 179250 180767
54778 180767 182242 183055 184136 186736 190755 195110 199167 203025 206996 211662 217815 225436 233348 240763
54764 240763 248504 257701 267903 277529 285608 291958 296186 297750 296690 293285 287337 278784 268607 258096
54750 258096 247644 237335 228171 221414 216881 213140 209315 205749 202994 201135 200014 199234 198119 196478
54736 196478 195192 195231 196430 197991 199692 201609 203187 203872 204419 206348 210100 214765 219563 224657 230547
54721B30547P004Q258R101Q636O737M323J979n63l217n052n760o364p620q819
54707B39190q943q025o644n085l708l142l385l553l070k274j525p76k99n57j037
54692A87167o89J31k24k007l260k525p28O24J453K097J929N44r33j242p58n54
54676A81025n94k31L15L44k8j24J27K94K82K57J97Q7P7L6m14j014r90l99l01j084
54656A77862j773j548p75rP72J288P47o18j197j76J167J377P88M59L78J4m06m40
54638A77910l73n33m28K91R03O97J64L5j0n35j068p87J24Q06R38P25K46l58o64
54619A78083n63m99n81k91M88J031R64P68O73K09n69p51j61J78p2J52J243J837
54601A82139J081K67O57J188K14j620k245j121M80J529J965J827J144L75j57q29
$$ plain form
54721 230547 237551 245809 254910 263546 270283 274606 276585 276022 272805 267753 261993 255629 248009 239190
54707 239190 230247 222222 215578 210493 206785 203643 200258 196705 193635 191361 189836 189060 188761 188204 187167
54692 187167 186478 186609 186385 184378 181118 178593 177865 178489 179942 182039 183968 184512 183579 182337 181579 181025
54676 181025 180431 180200 180515 180859 180831 180707 180834 181128 181410 181667 181864 181951 182028 182064 181650 180636 179646 179247 178946 177862
54656 177862 176089 174541 173766 173757 174529 175817 176564 175946 174749 174573 175740 177117 177905 178364 178742 178756 178350 177910
54638 177910 177537 177004 176576 176867 177770 178467 178631 178666 178656 178121 177053 176266 176390 177196 178134 178859 179105 178747 178083
54619 178083 177520 177021 176440 176149 176637 177668 178632 179400 180073 180282 179713 178962 178801 178979 178907 179059 180302 182139
54601 182139 183220 183487 184144 185332 185546 183926 181681 180560 181040 182569 184534 186361 187505 187880 187723 186894
54585A86894j742k007j056K18P54Q89J371J716J061j24o69m85l43m20l12o0J27
54568A85812N83J471J990J416L78r7j24m19q97j062j129j432j359k28J312J960
54552A88175J405L11p41j238n24J245K620K531J694J295J193P71M60R51J672J695
54536B03515J365J496J670R81j61o67n65o51q97q82j095k004k540j454L15P07
54520A99133k75o61K70J010M45n63q38n23k84r7L81J006J314J023L05k04R5P22
54502B02259K99j550l244l144j697m73J36Q74J830K284J996J399P24K5l07j09
54486B01302L3j59O5J062J658Q87j88m8Q73J195J057J442J935J452N51O29J302
54469B15048J049J85M72J902K494J598O90N72L74j07K74J438J413n00k247k048
$$ plain form
54585 186894 185152 183145 182089 182307 183061 183950 185321 187037 188098 187974 187305 186820 186477 186057 185745 185685 185812
54568 185812 186395 187866 189856 191272 191650 191553 191429 191010 190113 189051 187922 186490 185131 184903 186215 188175
54552 188175 189580 189891 189150 187912 187388 188633 191253 193784 195478 196773 197966 198737 199197 200148 201820 203515
54536 203515 204880 206376 208046 209027 208866 208199 207634 206983 206086 205204 204109 202105 199565 198111 198426 199133
54520 199133 198858 198197 198467 199477 199922 199359 198521 197998 197714 197617 197998 199004 200318 201341 201646 201442 201537 202259
54502 202259 202558 201008 197764 194620 192923 192450 192586 193460 195290 197574 199570 200969 201693 201718 201411 201302
54486 201302 201335 201176 201241 202303 203961 204848 204660 204612 205485 206680 207737 209179 211114 212566 213117 213746 215048
54469 215048 216097 216282 216754 218656 221150 222748 223438 224010 224384 224277 224551 225989 227402 226902 224655 222607
54453B22607q94n36q44q58q62j606k539k526j622p65k87J37O02R96J458J972J996
54436B16429J183lr59j673k309k616k324j545m64R01K180K616J902O02n14j051
54420B12355q50P8J231J906J911J523Q24k71j353j779j548j188q92n60m76r15
54404B09996j260o67M77J046R93J365K302K580J544J77l53p7M52J102J764J905
54388B23346J185K7r69j606j810j422n39M23J164J578J412N47m59q57o21k39J72
54371B21332P51J157R58N21N20P70N89M3k63l92q25j229p90K93J009J113J215
54354B26772J380J121P17R92J765J906J127K16m71j263j860j490n20k29p35q48
54338B28580k61n4o27r96p71q80j619j780p25L50K87l49n19k76j01O4J43m11j369
$$ plain form
54453 222607 221713 221177 220333 219475 218613 217007 214468 211942 210320 209555 209268 209405 210007 211003 212461 214433 216429
54436 216429 217612 217609 216650 214977 212668 210052 207728 206183 205719 206620 208800 211416 213318 213920 213406 212355
54420 212355 211505 211583 212814 214720 216631 218154 218978 218707 217354 215575 214027 212839 211947 211387 210911 209996
54404 209996 208736 208069 208546 209592 210585 211950 214252 216832 218376 218553 218200 218123 218575 219677 221441 223346
54388 223346 224531 224558 223589 221983 220173 218751 218212 218635 219799 221377 222789 223336 222877 222020 221399 221160 221332
54371 221332 222083 223240 224198 224719 225239 226009 226598 226641 226378 225986 225161 223932 223142 223435 224444 225557 226772
54354 226772 228152 229273 229990 230982 232747 234653 235780 235996 235525 234262 232402 230912 230392 230163 229428 228580
54338 228580 228319 228265 227638 226642 225871 224991 223372 221592 220867 221217 221504 221155 220636 220360 220259 220323 220466 220055 218686
54319B18686j451l11N70Q1p27m00N78O84j76o74r8Q63J234P72l4m39j31L31J90
54300B19548l55m62j34l05j173j695j218m25j01kL16N98N20L11J57j76o50p72
54282B13982m75k48r0N03J291J325O14K43M88L28n15q65j98K72k84p84j09R49
54264B16427J065M39J02K07M06Q79J635J766P31m66o64k26l7J90J179K386K574
54247B28593J597L31p06j480j759j446j130j265j308o94kp2n43m91N3L12Q2k52
54229B19820n83r91j156q58n58o39n69J86J024R75J91m10n51o35p31n55k07q8
54211B13665j94k81m39q04j069q41k07N15J113J222M53p60j276p23J7L36P66J580
54193B13073J870J053J34K10P56O91J84m9l38j300k169j637j8J005O93q9m66m50
$$ plain form
54319 218686 217235 216924 217494 217575 216848 216448 217026 217710 217534 216860 216762 217625 218859 219631 219597 219158 219027 219358 219548
54300 219548 219193 218731 218597 218292 217119 215424 214206 213781 213680 213678 213994 214592 215112 215423 215580 215404 214754 213982
54282 213982 213507 213259 213169 213672 214963 216288 216902 217145 217633 217961 217446 216581 216383 216655 216371 215587 215478 216427
54264 216427 217492 217931 218033 218240 218646 219525 221160 222926 223657 223191 222527 222301 222264 222454 223633 226019 228593
54247 228593 230190 230521 229815 228335 226576 225130 224000 222735 221427 220733 220731 220659 220116 219625 219678 219990 220072 219820
54229 219820 219237 218246 217090 216232 215674 215035 214466 214652 215676 216651 216842 216432 215881 215246 214515 213960 213753 213665
54211 213665 213471 213190 212751 211947 210878 210037 209830 210345 211458 212680 213133 212373 211097 210374 210391 210727 211493 213073
54193 213073 214943 215996 216130 216340 217096 217787 217971 217922 217584 216284 214115 212478 212460 213465 214158 214069 213603 213153
54175B13153k54J05L75K35o6k2K36P4o37j396j728j471o65K56N84J51l82n30o07
54156B07411q15o19K01P70L73l04k14M84R56J031R49N05l41p05K6Q45L62j031
54138B09884j602o51Q29J652J479N62n00r06m59L3n3r7P03J830K165J664J148
54121B17681Q31L88O9M25J138J319Q29K83l0k04m8N83J115R83O54Q55J222Q66
54103B28959p0o74p11o09l92J64N99L15k09k2P14J056Q68P70P48J92p68j275j087
54084B28568o59p1Q67J614J397N94L30P06Q22M77M55R41J110N91J51N42J606K758
54066B42799L501L458K844K747L977N771O706O757P213Q721J0631J2238J3247
54053C30610J2975J0424N637k4n155r020j1157j1370j0236q647o817m632k686
$$ plain form
54175 213153 212899 213004 213379 213614 213548 213526 213762 213836 213199 211803 210075 208604 207939 208195 208779 208930 208548 208018 207411
54156 207411 206596 205977 206178 206948 207321 207017 206803 207287 208243 209274 210223 210728 210387 209682 209708 210553 210915 209884
54138 209884 208282 207631 208460 210112 211591 212153 211653 210747 210288 210321 210268 210171 210874 212704 214869 216533 217681
54121 217681 218512 218900 218969 219394 220532 221851 222680 222963 222933 222729 222681 223264 224379 225362 226016 226871 228093 228959
54103 228959 228889 228215 227504 226895 226503 226667 227266 227581 227372 227350 228064 229120 229988 230758 231506 231698 230930 229655 228568
54084 228568 227909 227838 228705 230319 231716 232310 232640 233346 234168 234645 235100 236041 237151 237742 237893 238435 240041 242799
54066 242799 246300 249758 252602 255349 259326 265097 271803 278560 285773 294494 305125 317363 330610
54053 330610 343585 354009 359646 359622 354467 345447 334290 322920 312684 304037 297220 292588 289902
54040B89902j848j938j990j637j109k22J258K504K490J783J892K811L017K064
54026B98977J336J714K194J624L78n22q19p82n18j91j76m92p53r46j439k113k401
54009B95071k292k354k686k791k631k706l031l017k544k064j705j272j108j652
53995B63218k251j762l63O12O75N51N84L36p8N4M73N7j170j821j386q82q03l15
53977B55729P53J080P6p70l5J621K811L443M093M600M681M920N814O689O676O000
53961C08181N165L786J418j179k868l704m538n521o052n861n159m009k347m76
53947B76836J053J921K047J586J175J576K654L419L412L301L695M222M346M313
53933C15556M558M852M662L899K804J586N64J18J77L37N59J074J570J457J072
$$ plain form
54040 289902 288054 286116 284126 282489 281380 281158 282416 284920 287410 289193 291085 293896 296913 298977
54026 298977 300313 302027 304221 305845 306223 305701 304882 304100 303582 303391 303215 302723 301970 301024 299585 297472 295071
54009 295071 292779 290425 287739 284948 282317 279611 276580 273563 271019 268955 267250 265978 264870 263218
53995 263218 260967 259205 258842 259454 260129 260680 261264 261600 261522 261576 262049 262106 260936 259115 257729 256847 256044 255729
53977 255729 256482 257562 257638 256868 256833 258454 261265 264708 268801 273401 278082 283002 288816 295505 302181 308181
53961 308181 313346 317132 318550 317371 314503 310799 306261 300740 294688 288827 283668 279659 277312 276836
53947 276836 277889 279810 281857 283443 284618 286194 288848 292267 295679 298980 302675 306897 311243 315556
53933 315556 320114 324966 329628 333527 336331 337917 338481 338599 338776 339113 339672 340746 342316 343773 344845
53918C44845J470K690L500L314L153M044N602O862P452P368O670N997O286P310
53904D16563P689P030O758Q088J0480J3042J5735J7900J7047J1144J470q373j5816
53891E08757k0430k2493k2235k0467j8414j6678j5039j3212j1103q671o261m778
53879C28976m707n277n282m439l356k640k543l047l600l372k325j472j498j816
53865B83602j653j291j370j753j995k305k952l348k776j637r08p42n60k51j99
53850B59862l57k80K1%n34j098j147o14P8L24p6n63m76r9l02r96j017N2J098J121
53830B54997O17M83N75L02j91m50n75p39o25j45P4j47R6J247K188J901J260J647
53812B62515K589K536J406N87O80R02P93R04J607K454L051L519L933M070L803
$$ plain form
53918 344845 346315 349005 352505 355819 358972 363016 368618 375480 382932 390300 396970 402967 409253 416563
53904 416563 424252 431282 438040 446128 456608 469650 485385 503285 520332 531476 532946 524573 508757
53891 508757 488327 465834 443599 423132 404718 388040 373001 359789 348686 340015 333754 328976
53879 328976 324269 318992 313710 309271 305915 303275 300732 297685 294085 290713 288388 286916 285418 283602
53865 283602 281949 280658 279288 277535 275540 273235 270283 266935 264159 262522 261614 260872 260312 260061 259862
53850 259862 259505 259225 259246 259246 258712 257614 256467 255853 255931 256255 256179 255616 255140 255041 254739 253743 252726 252778 253876 254997
53830 254997 255614 256097 256672 256974 256783 256333 255758 255019 254394 254249 254323 254176 254272 255519 257707 259608 260868 262515
53812 262515 265104 267640 269046 269633 270313 271215 272008 272912 274519 276973 280024 283543 287476 291546 295349
53797B95349L154K137J205J271K450L367K891J915K073L202L689L043K396K333
53783C30475K041J014j9m72r14j951l165l936m386m809m932m413l489k572j700
53768B96772r08o14j094j945k503k523k162j654j275j299j624j707j208n39m77
53753B75240j246k183k324j366KP80O57J41k04k89k30k1L14O32R15J243J411J137
53735B74609P41Q97J566J881J488J069J099R99L07k60J75J231J893J941J804J551
53719B92991J041P04J065J766J971J626J382J538J821K026K080J749J053P14J383
53704C14910K659L575L764L444K755J992K014L311M988N674N228M597M261L902
53690C67074L339K740K013R90J28KL13L08Pj07l21j327k628k774j433K3M35K12
$$ plain form
53797 295349 298503 300640 301845 303116 305566 308933 311824 313739 315812 319014 322703 325746 328142 330475
53783 330475 332516 333530 333511 333039 332125 330174 327009 323073 318687 313878 308946 304533 301044 298472 296772
53768 296772 295864 295250 294156 292211 289708 287185 285023 283369 282094 280795 279171 277464 276256 275717 275240
53753 275240 273994 271811 269487 268121 268123 268903 269560 269701 269497 269208 268978 268957 269271 269903 270818 272061 273472 274609
53735 274609 275350 276247 277813 279694 281182 282251 283350 284349 284656 284396 284571 285802 287695 289636 291440 292991
53719 292991 294032 294736 295801 297567 299538 301164 302546 304084 305905 307931 310011 311760 312813 313527 314910
53704 314910 317569 321144 324908 328352 331107 333099 335113 338424 343412 349086 354314 358911 363172 367074
53690 367074 370413 373153 375166 376156 376284 376286 376599 376907 376914 376807 376486 375159 372531 369757 368324 368347 368782 368994
53672C68994K55M95K28o86j634j921j364l99K05P7l98o42o43o90p24n49m00o21
53654C59583r48q93n63m05l48N1P07J111J115R92P91L77m9j87j38n5L58J215J827
53635C64541J536Q03M89N63N36O20J223J734J315N70Q57K062K672K173J713K122
53619C85529K860L352L939M813N360N271N185N502N622M972L965L302L087L193
53605D45952L686M350M579M270M093M443M799M566L861L063K281J627J388J515
53591D94473J535J307J199J353J397J176J067J304J650J981K410K676K208J054
53577E16790o0q50j805l106m173m646m966n468n685n146m198l517l282l246l135
53562D63507k648j665o19j82l50m60j78K61P79J560K267K183J466J210J860K501
$$ plain form
53672 368994 369249 369744 369972 369286 367652 365731 364367 363968 364173 364250 363852 363210 362567 361877 361153 360604 360204 359583
53654 359583 358635 357742 357179 356774 356426 356477 357184 358295 359410 360402 361193 361570 361521 361334 361196 361141 361499 362714 364541
53635 364541 366077 366880 367369 367932 368468 369088 370311 372045 373360 373930 374787 376849 379521 381694 383407 385529
53619 385529 388389 391741 395680 400493 405853 411124 416309 421811 427433 432405 436370 439672 442759 445952
53605 445952 449638 453988 458567 462837 466930 471373 476172 480738 484599 487662 489943 491570 492958 494473
53591 494473 496008 497315 498514 499867 501264 502440 503507 504811 506461 508442 510852 513528 515736 516790
53577 516790 516730 515880 514075 510969 506796 502150 497184 491716 486031 480885 476687 473170 469888 466642 463507
53562 463507 460859 459194 458575 458393 458043 457583 457405 457666 458445 460005 462272 464455 465921 467131 468991 471492
53546D71492K305J732J640J987K216K317K645L149L418L376L392L845M817O053
53532E14384P135P935Q824J0043J1102J1376J1123J1186J1804J2566J3354J4371
53520F45203J5274J5429J5155J5570J6990J8553J9661K0692K1973K3211K4331
53509H52042K5731K7287K8209K8408K8839K9903L0615L0107K8910K7981K7374
53498A165406K6656K5848K5130K4350K3501K3038K3103K3127K2703K2202K1922
53487A426986K1532K0859K0358K0284K0125J9536J8944J8692J8461J8143J8278
53476A642198J8908J8931J7514J5217J2962J0643P714M442J579o84k758n104q152
53463A733410j1987j5649j7638j7734j7393j7726j8224j8286j8658k0224k2414
$$ plain form
53546 471492 473797 475529 477169 479156 481372 483689 486334 489483 492901 496277 499669 503514 508331 514384
53532 514384 521519 529454 538278 548321 559423 570799 581922 593108 604912 617478 630832 645203
53520 645203 660477 675906 691061 706631 723621 742174 761835 782527 804500 827711 852042
53509 852042 877773 905060 933269 961677 990516 1020419 1051034 1081141 1110051 1138032 1165406
53498 1165406 1192062 1217910 1243040 1267390 1290891 1313929 1337032 1360159 1382862 1405064 1426986
53487 1426986 1448518 1469377 1489735 1510019 1530144 1549680 1568624 1587316 1605777 1623920 1642198
53476 1642198 1661106 1680037 1697551 1712768 1725730 1736373 1744087 1748529 1750108 1749424 1746666 1741562 1733410
53463 1733410 1721423 1705774 1688136 1670402 1653009 1635283 1617059 1598773 1580115 1559891 1537477
53452A537477k4138k5371k6518k7034k6213k4729k3901k3806k3522k2811k2235
53441A267199k1817k0887j9149j6876j4143j0926p798n565m311l562l094k770
53429A136301j990l00J880L965O090Q373J0017J0421J0634J2178J4834J7101J8541
53416A248045K0093K2056K3598K4541K5939K8278L0512L1740L2643L4328L6639
53405A558412L8537L9619M0466M1808M3987M7048N0728N4380N7229N8896N9738
53394B090848O0646O2225O4060O5124O5176O5202O5971O6714O6035O3831O1294
53383B797126N9194N7126N4564N1714M8968M6219M3093L9469L5533L1626K8088
53372C292720K4867K1292J6633J0903M656j993r625j8659k8639l8473m7113n3992
$$ plain form
53452 1537477 1513339 1487968 1461450 1434416 1408203 1383474 1359573 1335767 1312245 1289434 1267199
53441 1267199 1245382 1224495 1205346 1188470 1174327 1163401 1155603 1150038 1145727 1142165 1139071 1136301
53429 1136301 1134311 1134011 1135891 1139856 1145946 1154319 1164336 1174757 1185391 1197569 1212403 1229504 1248045
53416 1248045 1268138 1290194 1313792 1338333 1364272 1392550 1423062 1454802 1487445 1521773 1558412
53405 1558412 1596949 1636568 1677034 1718842 1762829 1809877 1860605 1914985 1972214 2031110 2090848
53394 2090848 2151494 2213719 2277779 2342903 2408079 2473281 2539252 2605966 2672001 2735832 2797126
53383 2797126 2856320 2913446 2968010 3019724 3068692 3114911 3158004 3197473 3233006 3264632 3292720
53372 3292720 3317587 3338879 3355512 3366415 3371071 3369078 3359453 3340794 3312155 3273682 3226569 3172577
53360C172577n9079o2648o4920o6089o6688o7481o8601o9167o8192o5663o2329
53349B451720n8909n5910n3847n2936n2772n2821n3102n3792n4397n3899n1732
53338A857603m8250m4393m1067l8593l6407l3671l0357k7245k4584k1666j8214
53327A493156j5319j4061j3977j3880j3646j3931j4601j4712j3918j2733j1436
53316A340942r856q218p146o658o066m947l423j551O37K522L360L469L962N230
53302A312257O713Q302J0688J3934J6829J8372J9110K0321K2495K5200K7902L0265
53290A532388L2037L3181L3893L4172L3665L2210L0183K8060K5940K3757K1662
53279A861148J9919J8527J7119J5093J1984P983L967O27k272n325q464j1209j3794
$$ plain form
53360 3172577 3113498 3050850 2985930 2919841 2853153 2785672 2717071 2647904 2579712 2514049 2451720
53349 2451720 2392811 2336901 2283054 2230118 2177346 2124525 2071423 2017631 1963234 1909335 1857603
53338 1857603 1809353 1764960 1723893 1685300 1648893 1615222 1584865 1557620 1533036 1511370 1493156
53327 1493156 1477837 1463776 1449799 1435919 1422273 1408342 1393741 1379029 1365111 1352378 1340942
53316 1340942 1331086 1322868 1315722 1309064 1302998 1298051 1294628 1293077 1293714 1296236 1299596 1303065 1307027 1312257
53302 1312257 1318970 1327272 1337960 1351894 1368723 1387095 1406205 1426526 1449021 1474221 1502123 1532388
53290 1532388 1564425 1597606 1631499 1665671 1699336 1731546 1761729 1789789 1815729 1839486 1861148
53279 1861148 1881067 1899594 1916713 1931806 1943790 1951773 1955740 1956367 1954095 1948770 1940306 1929097 1915303
53266A915303j7096k1227k5098k7810k9741l1677l3493l4454l4578l4829l5941
53255A589359l7549l8692l8809l8009l6607l4823l2948l1448l0650l0429l0474
53244A208921l0669l0901l0793l0154k9565k9785l0502l0462k9073k7066k5178
53233H84773k3096k0316j7251j4708j2843j1452j0707j0679j0657r959r087r100
53221G24918j0092j1240j2135j3036j3906j4287j4210j4272j4669j4858j4361
53210E77852j3208j1631r977q893q807r151q881p839o915o775p173p583p801p802
53196D55416p627p552p757p868p383o529n971n768n315m414l575l235l286l480
53182C75656l611l327k475j613j417j605j298m20J28j82r11j526j941k019j474
$$ plain form
53266 1915303 1898207 1876980 1851882 1824072 1794331 1762654 1729161 1694707 1660129 1625300 1589359
53255 1589359 1551810 1513118 1474309 1436300 1399693 1364870 1331922 1300474 1269824 1239395 1208921
53244 1208921 1178252 1147351 1116558 1086404 1056839 1027054 996552 966090 937017 909951 884773
53233 884773 861677 841361 824110 809402 796559 785107 774400 763721 753064 743105 734018 724918
53221 724918 714826 703586 691451 678415 664509 650222 636012 621740 607071 592213 577852
53210 577852 564644 553013 543036 534143 525336 516185 507304 499465 492550 485775 478602 471019 463218 455416
53196 455416 447789 440237 432480 424612 417229 410700 404729 398961 393646 389232 385657 382422 379136 375656
53182 375656 372045 368718 366243 364630 363213 361608 360310 359890 360018 359836 358925 357399 355458 353439 351965
53167C51965o21l12p05r31m17J90K3q03j492j644j482j339j373j602j909k095
53151C35453k020j587p95k6J06m22p62m43k92j207k429k330p78O26Q26M71M94
53134C24885Q14R90J044J006O15J04L30J431K202J626L41k27L52J355K094K520
53118C41482K924L528M226M509L931K833K075J912J767J255O93K55m84j683k719
53103C66504l122l306l756m138l959l519l444l681l688l322k881k493k098j745
53089C21352j409p56L27J236J209L45m69n68j04L71N45N54O85R39R37L77m63r64
53071C24144q23k28N61J289J515R23r6p24p12o36j023j717k194k116j486o64j96
53054C15817k39l13p6N8k74m12M41J683J946J150N32N79L80n28j268j197j027
$$ plain form
53167 351965 351344 351032 350327 349396 348979 349169 349192 348389 346897 345253 343771 342432 341059 339457 337548 335453
53151 335453 333433 331846 331051 331025 331131 330709 329947 329504 329212 328005 325576 323246 322468 323094 323920 324391 324885
53134 324885 325699 326689 327733 328739 329354 329458 329788 331219 333421 335047 335388 335161 335513 336868 338962 341482
53118 341482 344406 347934 352160 356669 360600 363433 365508 367420 369187 370442 371135 371390 370906 369223 366504
53103 366504 363382 360076 356320 352182 348223 344704 341260 337579 333891 330569 327688 325195 323097 321352
53089 321352 319943 319187 319514 320750 321959 322304 321835 321267 321163 321534 322079 322633 323318 324257 325194 325571 325108 324144
53071 324144 323321 323093 323654 324943 326458 327381 327285 326561 325849 325213 324190 322473 320279 318163 316677 316013 315817
53054 315817 315578 315265 315189 315247 314973 314561 315002 316685 318631 319781 320313 320892 321272 320744 319476 318279 317252
53037C17252j472k000j861j340r66m94K80N66l08j465j450k45Q09Q35K34k42l30
53020C07803j97j32k78l87n9N92R82J011J199J588J413N10j0O51J619J612Q54
53003C18771N37Q62R77N36O7j59m91r93j116n39L24Q99J000P80N30N36P74Q92
52985C24187P17N19M58K92M3L80J604K802K871K056J560J853K259K188J841J552
52969C47182J232P08J62p1J33N88R14Q31N51O17J145J594J519J144Q18L64m83
52952C58948j428j923j825j335p09m40j132k578l496k949j623r16j204j790k119
52937C33481k135j675o02N27P93M9r69j611j756j421p42l45q61j906k243j279
52921C17305J77R10O17j8k85j89k84q75j405r57N72K076K318J090p69k141k244
$$ plain form
53037 317252 315780 313780 311919 310579 309613 309119 309399 309965 309657 308192 306742 306497 307306 308141 308375 308133 307803
53020 307803 307606 307474 307196 306809 306750 307342 308324 309335 310534 312122 313535 314045 314035 314686 316305 317917 318771
53003 318771 319308 320170 321147 321683 321750 321591 321100 320107 318991 318452 318776 319675 320675 321455 321985 322521 323295 324187
52985 324187 324904 325423 325881 326173 326216 326596 328200 331002 333873 335929 337489 339342 341601 343789 345630 347182
52969 347182 348414 349122 349284 349213 349346 349934 350848 351679 352230 352847 353992 355586 357105 358249 359067 359431 358948
52952 358948 357520 355597 353772 352437 351728 351288 350156 347578 344082 341133 339510 338594 337390 335600 333481
52937 333481 331346 329671 329069 329596 330389 330438 329469 327858 326102 324681 323939 323594 322733 320827 318584 317305
52921 317305 317482 318392 319009 318991 318706 318517 318233 317358 315953 314996 315568 317644 319962 321052 320283 318142 315898
52904C15898j069L57P56L1o05l12K54J55l09j97N04R47P08J12m38o05P0J596K878
52885C20731K680J165l20r29r52r23r04p91n36p3M23L87l62r61m58P93J605J693
52867C22268J853K385K537J903J299J690K832L624L399K479J647J278R56l2j680
52852C48438l088l562l488l614l893l804l416l265l405l428l286l190k872j872
52838C02255n59J45P2j32k48o80j325j366n60L22P84J330K299K912K258O47p95
52821C07359j395j323j013q27r19j079q72k06N52J171J821K524K911K892L019
52806C14615L673M264L799K069j00j747k564k903l232l623l722l295k678k467
52792C02089k714k807k196j046o0J67m22j248j477p29N09J365J503J325J335J572
$$ plain form
52904 315898 314829 315186 315942 315973 315368 315056 315310 315465 315156 314959 315463 316410 317118 317230 316792 316187 316257 317853 320731
52885 320731 323411 324576 324256 323327 322375 321452 320548 319757 319221 319148 319571 319958 319596 318635 318177 318970 320575 322268
52867 322268 324121 326506 329043 330946 332245 333935 336767 340391 343790 346269 347916 349194 350150 350118 348438
52852 348438 345350 341788 338300 334686 330793 326989 323573 320308 316903 313475 310189 306999 304127 302255
52838 302255 301696 301841 301913 301781 301533 300853 299528 298162 297602 297924 298708 300038 302337 305249 307507 308154 307359
52821 307359 305964 304641 303628 302801 301882 300803 299931 299725 300277 301448 303269 305793 308704 311596 314615
52806 314615 318288 322552 326351 328420 328320 326573 324009 321106 317874 314251 310529 307234 304556 302089
52792 302089 299375 296568 294372 293326 293266 293433 293011 291763 290286 289557 290066 291431 292934 294259 295594 297166
52776B97166J691J413Q72N52P87J209J039Q6q87j126q36p34r73j039n59K31P54
52759B99646N59k84j040r02QP08O88N21P29Q49L73j42P3O70P73N01O92J421J950
52740C07793K052K223K590K677K347J988J730J332R21R00J159J225J190J503J916
52725C33546J699Q41L7m79j001j308r11l71r22k465l384k869k001j914k170j856
52709C14472j115o59n51m66l55j81L85J266J663J117K26l01o20j059j174l73R63
52692C13238J818J710R86K51k1L58J031J365J194R87J042J089Q48M00j38o86q13
52675C24659j46O95O22k16m58L41R42M46k67j54K03k58j114j186m98p4j38L1O86
52656C24116J328J806K484L321L794L800L712L451K424N70j317k504k947k896
$$ plain form
52776 297166 298857 300270 301142 301694 302481 303690 304729 304815 303928 302802 301966 301232 300259 299220 298661 298892 299646
52759 299646 300205 299921 298881 297979 297987 298695 299383 299904 300633 301482 301855 301713 301786 302456 303229 303730 304422 305843 307793
52740 307793 309845 312068 314658 317335 319682 321670 323400 324732 325653 326553 327712 328937 330127 331630 333546
52725 333546 335245 336086 336123 335644 334643 333335 332424 332053 331131 328666 325282 322413 320412 318498 316328 314472
52709 314472 313357 312698 312147 311681 311326 311145 311530 312796 314459 315576 315802 315501 314881 313822 312648 312275 313238
52692 313238 315056 316766 317752 318003 317982 318340 319371 320736 321930 322917 323959 325048 325896 326296 326158 325472 324659
52675 324659 324513 325208 325830 325614 325156 325497 326439 326885 326618 326464 326667 326409 325295 324109 323611 323537 323399 323430 324116
52656 324116 325444 327250 329734 333055 336849 340649 344361 347812 350236 350806 349489 346985 344038 341142
52642C41142k554k195k037j830j063K69J463J801J236L85R0P26J771K244J969
52627C43417K005L286N200O053M845K045j157l777n287n633n167m289l176k046
52613C36319j359j306j367r24r7N02P05Q63J073J000N37J10J76P31J341J494R31
52596C40729l6p29q40p97j098j491j322n52J36K42O%M77J230J824J900J512J143
52578C42334J209J532J501P55m32j439j771j327m32L47N29M7o93j083q36l18j96
52561C39727n79q49o05m06r69j962k367j948j497j487j411p13L91J371J983K049
52545C30728J396M33J23P37J286Q07l34j040r56o40o19q41r31n41L63J291J596
52528C32858J325J188J458J525R23J52j20p2k43n07k78N44J486K162K549K806
$$ plain form
52642 341142 338588 336393 334356 332526 331463 331732 333195 334996 336232 336617 336707 337433 339204 341448 343417
52627 343417 345422 348708 353908 359961 364806 366851 365694 361917 356630 350997 345830 341541 338365 336319
52613 336319 334960 333654 332287 331363 331266 331768 332473 333336 334409 335409 335946 336056 336232 336963 338304 339798 340729
52596 340729 340693 339964 339124 338327 337229 335738 334416 333864 334000 334242 334248 334248 334725 335955 337779 339679 341191 342334
52578 342334 343543 345075 346576 347331 346899 345460 343689 342362 341930 342277 342806 342853 342160 341077 340241 339923 339727
52561 339727 339148 338299 337694 337288 336319 334357 331990 330042 328545 327058 325647 324934 325325 326696 328679 330728
52545 330728 332124 332557 332680 333417 334703 335510 335176 334136 333180 332540 331921 331080 330149 329608 329971 331262 332858
52528 332858 334183 335371 336829 338354 339277 339429 339309 339237 338994 338487 338209 338753 340239 342401 344950 347756
52512C47756L192L834M329M046L135K564K801L080K504J183l25j914l568m740
52498C67877m997m732m475m062l236k455k131j718o06O06Q83L88J54M08M55P7
52482C42436j68l7J04J37L46O69P01N05N56Q59R97J067J566K331K548K000J422
52465C58039J441J994K854L876M555M273L216K233J614P76n98k030l083l945m793
52450C70422n317n271m794l928k543j046l87q51j470j242l97L0m51j397k057k004
52434C37297j288l20M53Q91J089J110R89Q81P91M10l63r00n27M20R43P18L72M15
52416C43381O66R35J449K346L410M541N869P202Q025Q369R002J0432J2250J3666
52402D31543J4029J2591Q671K672l637q419j1067j1925j1408r964q345p160o275
$$ plain form
52512 347756 350948 354782 359111 363157 366292 368856 371657 374737 377241 378424 378099 376185 372617 367877
52498 367877 362880 358148 353673 349611 346375 343920 341789 340071 339465 340071 340954 341342 341496 341904 342359 342436
52482 342436 342268 342231 342335 342472 342818 343487 344188 344693 345249 346108 347105 348172 349738 352069 354617 356617 358039
52465 358039 359480 361474 364328 368204 372759 377032 380248 382481 384095 384871 384273 382243 379160 375215 370422
52450 370422 365105 359834 355040 351112 348569 347523 347136 346285 344815 343573 343176 343206 342755 341358 339301 337297
52434 337297 336009 335689 336142 337033 338122 339232 340221 341102 341893 342303 341940 341040 340513 340933 341876 342594 342966 343381
52416 343381 344047 344982 346431 348777 352187 356728 362597 369799 377824 386193 395195 405627 417877 431543
52402 431543 445572 458163 466834 469506 465869 457450 446383 434458 423050 413086 404741 397581 391306
52389C91306n160l712k328j321o14Q5R58J777J876Q21p33j402n25J104K335K943
52373C87410L393L848M099M212M506M902M875M190L225K362J495L56q76j655j721
52358D24621j393j108q72l63M83J334J914K299K599K641K248J617J167J149J598
52343D39934K393L119L243K803K637L376M583N386N768O451P706Q981R853J0522
52329E16755J1232J1884J2522J3565J5210J7089J8834K0448K1848K2499K2043
52318G03929K0932J9950J9332J8808J8360J8384J9063J9905K0191J9699J8892
52307I17445J8329J8097J7895J7564J7244J6979J6467J5401J3876J2229J0658
52296A092184R117P474N530L115L40k481n196p817r969j0917j0488r539r017q940
$$ plain form
52389 391306 386146 382434 380106 378785 378171 378256 379214 380991 382867 383688 382955 381553 381028 382132 384467 387410
52373 387410 390803 394651 398750 402962 407468 412370 417245 421435 424660 427022 428517 428873 427997 426342 424621
52358 424621 423228 422120 421248 420885 421368 422702 424616 426915 429514 432155 434403 436020 437187 438336 439934
52343 439934 442327 445446 448689 451492 454129 457505 462088 467474 473242 479693 487399 496380 506233 516755
52329 516755 527987 539871 552393 565958 581168 598257 617091 637539 659387 681886 703929
52318 703929 724861 744811 764143 782951 801311 819695 838758 858663 878854 898553 917445
52307 917445 935774 953871 971766 989330 1006574 1023553 1040020 1055421 1069297 1081526 1092184
52296 1092184 1101301 1108775 1114305 1117420 1117760 1115279 1110083 1102266 1092297 1081380 1070892 1061353 1052336 1043396
52282A043396q756q321p882p377o329m420j795J049L413M855N771P042Q765J0097
52268A039508J0724J1584J3311J4913J5175J4595J4597J5298J5610J5210J4883
52257A195408J4959J4936J4705J4753J4843J3959J1982J0034Q760P373N007J807
52245A328526j764n524q919j0902j1297j1333j2115j3360j4307j4914j5394j5384
52233A193313j4567j3468j2837j2649j2388j1866j1117r945q196o227m584l541
52221A071928l115l074k717j345P58K487L334L880M625N261N579O041O874P524
52207A108040P647P722P961P648O381N059M555M314L477K604K889M120M949N018
52193A182384N396O727Q125Q371P322N762M429L527K818J887M38j646m374p401
$$ plain form
52282 1043396 1034640 1026319 1018437 1011060 1004731 1000311 998516 999565 1002978 1007833 1013604 1020646 1029411 1039508
52268 1039508 1050232 1061816 1075127 1090040 1105215 1119810 1134407 1149705 1165315 1180525 1195408
52257 1195408 1210367 1225303 1240008 1254761 1269604 1283563 1295545 1305579 1314339 1321712 1326719 1328526
52245 1328526 1326762 1321238 1312319 1301417 1290120 1278787 1266672 1253312 1239005 1224091 1208697 1193313
52233 1193313 1178746 1165278 1152441 1139792 1127404 1115538 1104421 1094476 1086280 1080053 1075469 1071928
52221 1071928 1068813 1065739 1063022 1061677 1062435 1064922 1068256 1072136 1076761 1082022 1087601 1093642 1100516 1108040
52207 1108040 1115687 1123409 1131370 1139018 1145399 1150458 1155013 1159327 1162804 1165408 1168297 1172417 1177366 1182384
52193 1182384 1187780 1194507 1202632 1211003 1218325 1224087 1228516 1232043 1234861 1236748 1237186 1235540 1231166 1223765
52179A223765r683j0133r022q064q409r245r104p922o805o167n346m000k720j999
52165A125146j484o04O19J777K657L312L830M175M166L615K633J640R62N60L39
52150A153343L69N88O57N43Q11J904L327M126M039L645L478L370K797J557J24
52135A184678o35j99J196L048N334Q194J1008J2731J3431J4610J7461K1486K5376
52122A317719K8447L0528L1320L0883L0280L0549L1245L0880K8790K5784K2994
52111A639419K0832J8972J6849J4104J1094Q787P815P724P574O979O111N110M084
52098A775454L315K804J869j02k787n425p960j0911j4344j7679k0439k2467k3492
$$ plain form
52179 1223765 1214082 1203949 1194927 1186863 1178454 1169209 1160105 1152183 1145378 1139211 1133865 1129865 1127145 1125146
52165 1125146 1123662 1123058 1123677 1125454 1128111 1131423 1135253 1139428 1143594 1147209 1149842 1151482 1152444 1153004 1153343
52150 1153343 1153712 1154300 1154957 1155500 1156311 1158215 1161542 1165668 1169707 1173352 1176830 1180200 1182997 1184554 1184678
52135 1184678 1184043 1183844 1185040 1188088 1193422 1201616 1212624 1225355 1238786 1253396 1270857 1292343 1317719
52122 1317719 1346166 1376694 1408014 1438897 1469177 1499726 1530971 1561851 1590641 1616425 1639419
52111 1639419 1660251 1679223 1696072 1710176 1721270 1730057 1737872 1745596 1753170 1760149 1766260 1771370 1775454
52098 1775454 1778769 1781573 1783442 1783340 1780553 1775128 1767168 1756257 1741913 1724234 1703795 1681328 1657836
$$ [...]
108331C9