
##TITLE=AC1372_2418_7221647_llQExT8r8K
##JCAMPDX= 6.0         $$ Bruker NMR JCAMP-DX V2.0
##DATA TYPE= NMR SPECTRUM
##DATA CLASS= NTUPLES
##ORIGIN= BRUKER
##OWNER= Administrator
$$ 1.72 TOPSPIN		Version 2.1
$$ 2012-12-17 15:24:47.057 -0500  Administrator@X
$$ Compression mode = diff/dup
##.OBSERVE FREQUENCY= 400.02188249412
##.OBSERVE NUCLEUS= ^1H
##.ACQUISITION MODE= SIMULTANEOUS (DQD)
##.ACQUISITION SCHEME= undefined
##.AVERAGES= 8
##.DIGITISER RES= 22
##SPECTROMETER/DATA SYSTEM= spect
##.PULSE SEQUENCE= zg30
##.SOLVENT NAME= COFFEE_meoh
##.SHIFT REFERENCE= INTERNAL, COFFEE_meoh, 1, 14.98509
##AUDIT TRAIL= $$ (NUMBER, WHEN, WHO, WHERE, PROCESS, VERSION, WHAT)
$$ ##TITLE= Audit trail, TOPSPIN		Version 2.1
$$ ##JCAMPDX= 5.01
$$ ##ORIGIN= Bruker BioSpin GmbH
$$ ##OWNER= Administrator
$$ $$ E:\/data/COFFEE/nmr/AC1372_2418_7221647_llQExT8r8K/30/pdata/1/auditp.txt
$$ ##AUDIT TRAIL=  $$ (NUMBER, WHEN, WHO, WHERE, PROCESS, VERSION, WHAT)
(   1,<2012-12-17 15:24:38.948 -0500>,<Administrator>,<X>,<go>,<TOPSPIN 2.1>,
      <created by zg
	started at 2012-12-17 15:23:32.448 -0500,
	POWCHK enabled, PULCHK disabled,
       configuration hash MD5:
       86 BA 57 50 F2 9D 5C 9B 26 00 A9 28 5F 66 2E 89
       data hash MD5: 64K
       01 A3 AA 4B 27 08 37 FB C1 7C BB 63 D3 3B E6 C0>)
(   2,<2012-12-17 15:24:41.963 -0500>,<Administrator>,<X>,<proc1d>,<TOPSPIN 2.1>,
      <Start of raw data processing
       efp LB = 0 FT_mod = 6 PKNL = 1 PHC0 = 0 PHC1 = 0 SI = 32K 
       data hash MD5: 32K
       27 42 3D A2 66 F7 38 9A 38 07 0A 56 0C EF 9B BD>)
(   3,<2012-12-17 15:24:42.416 -0500>,<Administrator>,<X>,<proc1d>,<TOPSPIN 2.1>,
      <pk PHC0 = 96.36658 PHC1 = 0 
       data hash MD5: 32K
       F6 1E 3D B7 9C 1E 2E 29 CD 91 E2 39 7C 33 07 4F>)
(   4,<2012-12-17 15:24:42.635 -0500>,<Administrator>,<X>,<proc1d>,<TOPSPIN 2.1>,
      <abs ABSG = 1 
       data hash MD5: 32K
       6B 2E C1 42 01 FA 20 48 FB 4A 9D 5D C8 B4 D0 5B>)
(   5,<2012-12-17 15:24:42.776 -0500>,<Administrator>,<X>,<proc1d>,<TOPSPIN 2.1>,
      <abs ABSG = 2 
       data hash MD5: 32K
       6E F9 4A 3B D4 5D 71 53 84 10 A7 77 F4 63 54 D0>)
(   6,<2012-12-17 15:24:42.932 -0500>,<Administrator>,<X>,<proc1d>,<TOPSPIN 2.1>,
      <abs ABSG = 3 
       data hash MD5: 32K
       6B D8 23 F6 71 29 FF C4 F5 45 53 94 7A BA AB F7>)
(   7,<2012-12-17 15:24:43.073 -0500>,<Administrator>,<X>,<proc1d>,<TOPSPIN 2.1>,
      <abs ABSG = 4 
       data hash MD5: 32K
       2B 1B 31 41 EE A7 6B 90 7A 33 62 86 04 C2 15 66>)
(   8,<2012-12-17 15:24:43.245 -0500>,<Administrator>,<X>,<proc1d>,<TOPSPIN 2.1>,
      <abs ABSG = 5 
       data hash MD5: 32K
       3D E9 C5 DA 6B 47 7D 87 33 41 10 F0 C5 05 5D EF>)
$$ ##END=
$$ 
$$ $$ hash MD5
$$ $$ 47 FE AE D7 CF EE 95 5A 8F A2 7F 18 97 90 B4 8B
##$RELAX= 
##$RELAX= 
##$RELAX= 
##$RELAX= 
##$RELAX= 
##$RELAX= 
##$RELAX= 
$$ Bruker specific parameters
$$ --------------------------
##$DU= <E:\>
##$EXPNO= 30
##$NAME= <AC1372_2418_7221647_llQExT8r8K>
##$PROCNO= 1
$$ [...]
150 150 150 150 150 150 150 150
##$TP07= 0
##$TPNAME0= <>
##$TPNAME1= <>
##$TPNAME2= <>
##$TPNAME3= <>
##$TPNAME4= <>
##$TPNAME5= <>
##$TPNAME6= <>
##$TPNAME7= <>
##$TPOAL= (0..7)
0.5 0.5 0.5 0.5 0.5 0.5 0.5 0.5
##$TPOFFS= (0..7)
0 0 0 0 0 0 0 0
##$TUNHIN= 0
##$TUNHOUT= 0
##$TUNXOUT= 0
##$USERA1= <user>
##$USERA2= <user>
##$USERA3= <user>
##$USERA4= <user>
##$USERA5= <user>
##$V9= 5
##$VALIST= <valist>
##$VCLIST= <CCCCCCCCCCCCCCC>
##$VD= 0
##$VDLIST= <DDDDDDDDDDDDDDD>
##$VPLIST= <PPPPPPPPPPPPPPP>
##$VTLIST= <TTTTTTTTTTTTTTT>
##$WBST= 2048
##$WBSW= 25
##$XGAIN= (0..3)
0 0 0 0
##$XL= 0
##$YL= 0
##$YMAX_a= 619436
##$YMIN_a= -526717
##$ZGOPTNS= <>
##$ZL1= 120
##$ZL2= 120
##$ZL3= 120
##$ZL4= 120
##$ABSF1= 14.98509
##$ABSF2= -5.573092
##$ABSG= 5
##$ABSL= 3
##$ALPHA= 0
##$AQORDER= 0
##$ASSFAC= 0
##$ASSFACI= 0
##$ASSFACX= 0
##$ASSWID= 0
##$AUNMP= <proc_prof1d_extract_pilot.lims>
##$AXLEFT= 0
##$AXNAME= <>
##$AXNUC= <1H>
##$AXRIGHT= 0
##$AXTYPE= 0
##$AXUNIT= <>
##$AZFE= 0.1
##$AZFW= 0.1
##$BCFW= 0
##$BC_mod= 0
##$BYTORDP= 0
##$COROFFS= 0
##$CY= 15
##$DATMOD= 1
##$DC= 0
##$DFILT= <>
##$DTYPP= 0
##$F1P= 0
##$F2P= 0
##$FCOR= 0.5
##$FTSIZE= 32768
##$FT_mod= 6
##$GAMMA= 0
##$GB= 0
##$INTBC= 1
##$INTSCL= 1
##$ISEN= 128
##$LB= 0
##$LEV0= 0
##$LPBIN= 0
##$MAXI= 10000
##$MC2= 0
##$MEAN= 0
##$ME_mod= 0
##$MI= 0
##$NCOEF= 0
##$NC_proc= -8
##$NLEV= 6
##$NOISF1= 0
##$NOISF2= 0
##$NSP= 0
##$NTH_PI= 0
##$NZP= 0
##$OFFSET= 14.98509
##$PC= 1
##$PHC0= 96.36658
##$PHC1= 0
##$PH_mod= 1
##$PKNL= yes
##$PPARMOD= 0
##$PPDIAG= 0
##$PPIPTYP= 0
##$PPMPNUM= 2147483647
##$PPRESOL= 1
##$PSCAL= 4
##$PSIGN= 0
##$PYNMP= <proc.py>
##$REVERSE= no
##$SF= 400.02
##$SI= 32768
##$SIGF1= 0
##$SIGF2= 0
##$SINO= 400
##$SIOLD= 32768
##$SPECTYP= <>
##$SREGLST= <1H.CDCl3>
##$SSB= 0
##$STSI= 32768
##$STSR= 0
##$SW_p= 8223.68421052631
##$SYMM= 0
##$S_DEV= 0
##$TDeff= 65536
##$TDoff= 0
##$TI= <>
##$TILT= no
##$TM1= 0
##$TM2= 0
##$TOPLEV= 0
##$USERP1= <user>
##$USERP2= <user>
##$USERP3= <user>
##$USERP4= <user>
##$USERP5= <user>
##$WDW= 1
##$XDIM= 32768
##$YMAX_p= 471503547
##$YMIN_p= -781379
##$CURPLOT= <Network HP LaserJet P1505>
##$CURPRIN= <$Network HP LaserJet P1505>
##$DFORMAT= <normdp>
##$LAYOUT= <+/1D_H.xwp>
##$LFORMAT= <normlp>
##$PFORMAT= <normpl>
##$SURQMSG= 1
$$ End of Bruker specific parameters
$$ ---------------------------------
##NTUPLES= NMR SPECTRUM
##VAR_NAME=  FREQUENCY,     SPECTRUM/REAL,   SPECTRUM/IMAG
##SYMBOL=    X,             R,               I
##VAR_TYPE=  INDEPENDENT,   DEPENDENT,       DEPENDENT
##VAR_FORM=  AFFN,          ASDF,            ASDF
##VAR_DIM=   32768,         32768,           32768
##UNITS=     HZ,            ARBITRARY UNITS, ARBITRARY UNITS
##FACTOR=    0.250966925370066, 1,           1
##FIRST=     8223.43324360094, -46813,       -48957
##LAST=      0,             34210,           -344527
##MIN=       0,             -781379,         0
##MAX=       8223.43324360094, 471503547,    0
$$ Real data points
##PAGE= N=1
##DATA TABLE= (X++(R..R)), XYDATA
$$ [...]
19553A0902N5661e06449a59629k55844h3470j27280G1277I28a50207n2868g269
19541F2860b91723A42774b75274A41139l8493a65634h2788k46538J15648i38l39752
19530c40690E1200a47069I2804h9820E0627d054I9534n849a91799A90803J23248
19519C14051A17083a03493a2005I8252k8812N4488c50380A78293b29567q8886
19509c18453H9182C3725j2884J1840b00664C25954j41025b08485k05845D0987
19498D09301d5381A65344p5868d99265B16754k2251g4556B3913P4838a88701a1681
19486b99275a33932k6053O1185j30915d5908k14951B26616h8541L808c1954m2969
19475g4923B16818I1127K04826d06618h8479A20516M2326o5607a46762m545o0474
$$ plain form
19553 10902 66563 -506449 -159629 -415473 -83470 -210750 71277 928 -150207 -203075 -7269
19541 62860 -291723 142774 -275274 141139 102646 -165634 -82788 -329326 -213678 -938 -340690
19530 -340690 51200 -147069 92804 -89820 50627 -4054 99534 93685 -191799 190803 314051
19519 314051 117083 -103493 -12005 98252 69440 123928 -350380 178293 -229567 -318453
19509 -318453 89182 33725 20841 32681 -200664 325954 184929 -208485 -414330 40987
19498 409301 -45381 165344 89476 -499265 216754 194503 -74556 23913 98751 -188701 -11681
19486 -299275 -133932 -159985 -98800 -229715 -45908 -260859 226616 -88541 -84733 -31954 -74923
19475 -74923 216818 91127 295953 -406618 -88479 120516 162842 97235 -146762 -151307 -211781
19464b11781b8984B13846Q9834C5943a50436A05274a10537I3373a56785g4163
19453b47097R001N7326h3686J2316I4282a92279g2681a3237j81549I433c09343
19441a9305j09165K5094k7453I1905a10929H7443L6821i3795r1650F431K56903
19430B63334p8247J407J39337d99954g5980c4785r1538D2154b13332h0724d0351
19418a84487P7801M6951k54754J55566K8758e0450j77772J12759K6325F4194K89383
19407C53577a88807C24111b6997m3179k7023E9171b74218E9002b47522R748J7805
19396b19969j20814B73107a06101M339D8695b10447k40512A51500E4069f1503
19385i7642i37j28604k3207D436K6170d74270a18585c6889H6236A2258J16460
$$ plain form
19464 -211781 -28984 213846 303680 35943 -150436 105274 -110537 93373 -156785 -74163
19453 -247097 -238096 -180770 -83686 -71370 94282 -192279 -72681 -13237 -194786 9433 -309343
19441 -19305 -128470 -103376 -130829 91905 -110929 87443 124264 -93795 -185445 6431 263334
19430 263334 185087 186494 325831 -499954 -75980 -34785 -126323 42154 -213332 -80724 -40351
19418 -184487 -106686 -59735 -314489 -158923 -130165 -50450 -228222 -115463 -89138 64194 353577
19407 353577 -188807 324111 -26997 -70176 -97199 59171 -274218 59002 -247522 -237774 -219969
19396 -219969 -340783 273107 -106101 -101762 48695 -210447 -450959 151500 54069 -61503
19385 -97642 -937 -129541 -152748 4436 30606 -474270 -118585 -36889 86236 12258 128718
19374A28718R081a30605A96460G4172a90716O2821C02380A28322a984j60034l6637
19363a98655i0611I0935a33828n0488j0456g8733G4196b19991e454C18070H2389
19351G3066K14121f7031G4841K68085d1815r7957J3276E1814a83544a9926A43939
19339c26383J03939g0123k96563B4401a67947j88482F2293J01322b21617l1107
19329b52724a17597j07211f167k20325A43251b01468j26715c6581l88435G2170
19318A70624E1381h2153K8008l7059q142b7844G0316P4442k2866a3990B824b8730
19305C51468a99384A34961d785j41713p1088A20839N1825A6408F400a00984F953
19293d07520a95039B60575A26087a53787M1268J7927k7150j9234I5158a1957k52028
$$ plain form
19374 128718 137799 -130605 196460 74172 -190716 -127895 302380 128322 -1984 -162018 -198655
19363 -198655 -90611 90935 -133828 -184316 -194772 -78733 74196 -219991 -5454 318070 82389
19351 73066 287187 -67031 74841 342926 -41815 -139772 -126496 51814 -183544 -19926 143939
19339 -326383 -222444 -70123 -366686 24401 -167947 -356429 62293 163615 -221617 -252724
19329 -252724 -117597 -224808 -6167 -226492 143251 -201468 -328183 -36581 -425016 72170
19318 170624 51381 -82153 -54145 -91204 -99346 -27844 70316 144758 121892 -13990 2824 -28730
19305 351468 -199384 134961 -4785 -146498 -217586 120839 172664 16408 6400 -100984 6953
19293 -407520 -195039 260575 126087 -153787 -112519 -94592 -121742 -140976 95158 -11957 -263985
19282b63985C58303h4442p6108b9245k4569o0962B83369d16859E7510a87610N7451
19271a30159n1123k9839C22040a03399j1975B89502e6205b5321B24544b5087l4373
19260e9460j75017A76523a56545A24574a60335O4931l33729R6562B91652I4640
19249c3197k32036C95844A77909a69715C200a63252k5937C7138c21480J47130
19239a74350j0824P7632A91786d5983m12660e7822l11005J62229g9990j46116
19229b26106g9813m3681j854H0299k1925b55091G2010b34120M4449F6769b85775
19217A73103a04526B80600b88642f5291j78403k1788e4227l4983B78734j715A09331
19205f6895A09470a74065n334e2182j06394k28528a44275h727k79848c5446p0193
$$ plain form
19282 -263985 358303 -84442 -160550 -29245 -53814 -114776 283369 -416859 57510 -187610 -130159
19271 -130159 -181282 -211121 322040 -103399 -115374 289502 -56205 -25321 224544 -25087 -59460
19260 -59460 -234477 176523 -156545 124574 -160335 -95404 -429133 -332571 291652 94640
19249 -33197 -265233 395844 177909 -169715 3200 -163252 -189189 37138 -321480 -174350
19239 -174350 -185174 -107542 191786 -45983 -458643 -57822 -368827 -206598 -79990 -226106
19229 -226106 -79813 -123494 -125348 80299 58374 -255091 72010 -234120 -189671 66769 -285775
19217 173103 -104526 280600 -288642 -65291 -243694 -265482 -54227 -89210 278734 277019 109331
19205 -66895 109470 -174065 -179399 -52182 -158576 -387104 -144275 -8727 -288575 -35446 -105639
19194a05639A06194k0139a30542m5841L8933B0178J8194d17536a62350b7392l1134
19183e8526B06463b44235G3606b14205Q8801q6900C7943A2547a73721B653K57205
19172B59858a70353n2326d0093B17071d4311A97935b50819j4817a21909A73065
19161b32429e2057r6453k813A68275b66003k8608B21983A5475a09085P757A5288
19149G6443b83228F8928a83437r4684Q8853A05567I769L0365B666b6338o2836
19138h9174C1274J8346d2282j27089B0792N8023N018J57809a66086j3498Q6403
19127i3181M5395n19498A54125J94032a66126p0570D6108N6200J48751d53610
19116a42769j20966C1883e0027A2510J09970K8516a75058j52218B52408A1547
$$ plain form
19194 -105639 106194 86055 -130542 -176383 -137450 20178 38372 -417536 -162350 -27392 -58526
19183 -58526 206463 -244235 73606 -214205 -125404 -212304 37943 12547 -173721 2653 259858
19172 259858 -170353 -222679 -40093 217071 -44311 197935 -250819 -265636 -121909 173065
19161 -232429 -52057 -148510 -151323 168275 -266003 -294611 221983 15475 -109085 -101328 15288
19149 76443 -283228 68928 -183437 -278121 -189268 105567 9769 40134 2666 -26338 -89174
19138 -89174 31274 49620 -42282 -169371 20792 78815 83833 241642 -166086 -179584 -93181
19127 -93181 -47786 -567284 154125 348157 -166126 -236696 46108 102308 251059 -453610
19116 -142769 -263735 31883 -50027 12510 122480 150996 -175058 -327276 252408 11547
19105g1457E563h2588l4960p4164a8233k0644j61810g6195j10048c1015k2482
19094e3497b1381B66518j28047h4441F0373g306n6939C24915a97424j47915E2061
19082b01185B10169b7170j98466r410C02357a18072j70120J8112A33373c88121
19071E2725b3148A01459a36143E2199a51813c3651j80948a3138j26054D0112a71996
19059H0212a07080M9296g251n2773C31281a1475d937j46587I8627D7560b12403
19047h8026B2836g5856o5704C2701R9386K7426B7430J35238q0097K19459j07850
19036A94180h3875q3411C52838a23878D56311b1211B54275b03411K9333A69210
19025I0212a95414C45625j06266a2413G2843L5504C1571f3126R47B11858D7541
$$ plain form
19105 -71457 5563 -82588 -117548 -191712 -18233 -38877 -200687 -76195 -186243 -31015 -53497
19094 -53497 -21381 266518 138471 -84441 60373 -7306 -64245 324915 -197424 -345339 52061
19082 -201185 210169 -27170 -225636 -235046 302357 -118072 -288192 -270080 133373 -388121
19071 52725 -23148 101459 -136143 52199 -151813 -33651 -214599 -13138 -139192 40112 -171996
19059 80212 -107080 -57784 -7251 -60024 331281 -11475 -4937 -151524 98627 47560 -212403
19047 -88026 22836 -75856 -141560 32701 132087 159513 27430 162668 82571 302030 194180
19036 194180 -83875 -167286 352838 -123878 456311 -21211 254275 -203411 -174078 169210
19025 90212 -195414 345625 239359 -12413 72843 108347 31571 -63126 -62179 211858 47541
19013a2894K901C4248j621b47878f2764a6106A30784B8290a12220d0432m09826
19002d50258a51799B1730K26435h6413e577j76260a7054k4583r1888j80909B01104
18990a14188A10467h0951j08978d9885C3160Q5344E7590B3355b9429B05272c30834
18978f6485F5802K15385B4118c1172A43229n0550b93850a04361m3206A70559I276
18966a60464B752G86O4792f7521r6919O9822b0460k07441d7494j0059C14021C3088
18953a60895P326e6801m2377B3477M003b19778q4312d1183A13684i0377K6582
18942f3795a952r9377r7228J5060O6200l95998c7843H5530j9378K98270j06469
18931B57953E9542J9858a3210K242k74892a07262n7300O2351B35697b17057A01863
$$ plain form
19013 -12894 -9993 34248 32627 -247878 -62764 -16106 130784 28290 -112220 -40432 -450258
19002 -450258 -151799 21730 248165 -86413 -5577 -181837 -17054 -41637 -133525 -314434 201104
18990 -114188 110467 -80951 -189929 -49885 33160 118504 57590 23355 -29429 205272 -330834
18978 -66485 65802 281187 24118 -31172 143229 92679 -293850 -104361 -147567 170559 9276
18966 -160464 2752 786 65578 -67521 -164440 -94618 -20460 -227901 -47494 -57553 314021 33088
18953 -160895 -153569 -56801 -99178 23477 27480 -219778 -304090 -41183 113684 -90377 -63795
18942 -63795 -1952 -101329 -198557 -183497 -117297 -513295 -37843 85530 66152 364422 257953
18931 257953 59542 79400 -13210 -10968 -285860 -107262 -164562 -102211 235697 -217057 101863
18919I4664N8822E3207a74825B67885c82773A81574a62018C7309a69183e878B84055
18907G4292b30157M0406L3346j35823A3276a21044P585A84346a27083c5552n0262
18896h5814k21537D0961P1041d5388o7390E5001J64291f3190H7793c46333B7610
18884c31924a07718c7742B9390Q6071c30833d2270j47737B6236K1813b79870O4295
18873b15575r2521F5366B3712M4391C1118a77973C12541n928c71053Q41B14415
18861g236H8852D206N5682b48438L3803A83902d44415a40976A57448a62193E05439
18849C90488A04259j9161L5631d5653C948b90915N0465k31321b29453a1798r8978
18838a10776l44122a94917N0263A6699a52603r0269l0761A41892a49491j60982
$$ plain form
18919 94664 153486 53207 -174825 267885 -382773 181574 -162018 37309 -169183 -5878 284055
18907 74292 -230157 -189751 -156405 -292228 13276 -121044 -113459 184346 -127083 -35552 -85814
18896 -85814 -307351 40961 112002 -45388 -112778 55001 219292 -63190 87793 -346333 27610
18884 -331924 -107718 -37742 29390 115461 -330833 -42270 -190007 26236 48049 -279870 -215575
18873 -215575 -308096 65366 23712 68103 31118 -177973 312541 306613 -371053 -370212 214415
18861 -7236 88852 4206 59888 -248438 -214635 183902 -444415 -140976 157448 -162193 505439
18849 390488 104259 85098 120729 -45653 3948 -290915 -240450 -471771 -229453 -11798 -110776
18838 -110776 -454898 -194917 -144654 16699 -152603 -242872 -273633 141892 -149491 -310473
18828c10473J34478A54078d6961J3389e176A5014J93487c18008K8562B80957c19319
18816f3560j07976F104i9663A0364h5512p6H3261J68070A07172J51933g3888k62426
18804c36314d9592B5027J59722e8485F6325L8800d32549a52726A31911b19240
18793A77181d0378q7864o7410j23554I3533b38600B66208c78588B95562d2134
18782H9341M8461J75871e7641B31836d3469A01155b87836B76127a98837D3151
18771i6673E3070g4291C9053a68713H4932J17679a20671k5626M6641r3877A58182
18759a9425k26477M0904Q694a8275o3478j8690c1941o3595l70151a61220A76102
18747B97109g2490p6877d0822m8972C0955J27042a12200K9864a9396j35120N2304
$$ plain form
18828 -310473 -175995 154078 -46961 -33572 -5176 15014 208501 -318008 -289446 280957 -319319
18816 -63560 -171536 6104 -99663 10364 -85512 -85588 83261 251331 107172 259105 -73888 -336314
18804 -336314 -49592 25027 184749 -58485 66325 105125 -432549 -152726 131911 -219240
18793 177181 -40378 -128242 -195652 -319206 93533 -238600 266208 -378588 295562 -42134
18782 89341 137802 313673 -57641 231836 -43469 101155 -287836 276127 -198837 43151
18771 -96673 53070 -74291 39053 -168713 84932 202611 -120671 -146297 -99656 -193533 158182
18759 -19425 -245902 -204998 -196304 -18275 -81753 -100443 -31941 -95536 -465687 -161220 176102
18747 297109 -72490 -149367 -40822 -89794 30955 157997 -112200 -82336 -19396 -154516 -102212
18736a02212j19865K2074B1163a34972l1817O3432n7997A66015a68044D7823a59295
18724G3967h9549a5525m0834o4435j56498G3661P0570J65405G3608a25295D4171
18712I2256K99509A57946a40827I2415e3591j87422j67085B18723a20127b0178
18701d9167A90618a19251B06501b19129H7720d9987A16157C4580h8550D26h5695
18689A01848g239n35849b21514M4597H7937d12222A54105C6298J61951b41655
18678A02013e6947B2172i0144C22309b76378A1868b70055J22419B03623J78782
18668C82405d09976A66288a61714B5224M2515N9548E8950L19461A76091A4398
18657A14105a76808C6357P2973K3164a41388q2741d7515j17256B02894N3594c6668
$$ plain form
18736 -102212 -222077 -200003 21163 -134972 -166789 -103357 -161354 166015 -168044 47823 -159295
18724 73967 -89549 -15525 -56359 -120794 -277292 73661 144231 309636 73608 -125295 44171
18712 92256 391765 157946 -140827 92415 -53591 -241013 -408098 218723 -120127 -20178
18701 -49167 190618 -119251 206501 -219129 87720 -49987 116157 34580 -88550 426 -85695
18689 101848 -7239 -543088 -221514 -176917 87937 -412222 154105 36298 198249 -241655
18678 102013 -56947 22172 -90144 322309 -276378 11868 -270055 -147636 203623 382405
18668 382405 -409976 166288 -161714 25224 67739 127287 58950 378411 176091 14398
18657 114105 -176808 36357 109330 132494 -141388 -224129 -47515 -164771 202894 256488 -36668
18645I92J34021c38361J03083j20147a53423M2367n8865q4933B1342a41757c5855
18633a3949l26698p1885B60412a34884d8453l8030j60435Q1939B83412A6082L1457
18622D7539B0017K4697M7423c148A47970C3066a5938G3615K55977b70552C3626
18610I0450a86139B47142a00932B7671E451J74078a69202B61b08257A28008L1439
18599A59447p0513b45791b2014l3155j0832A19356d7416A27282A7151d51440a92373
18587a55013D72508a11081D2116a94505k85861I1257a22325c5161q062J707k1069
18576f2585j48440l8421A53661b93783C132d70086M0682P0839I7036C2717b73599
18564a93871d1238q0318K5340B8725i0290L6106I9418a34271j1066j70483C73684
$$ plain form
18645 992 135013 -338361 -235278 -355425 -153423 -111056 -169921 -254854 21342 -141757 -35855
18633 -13949 -340647 -412532 260412 -134884 -48453 -86483 -246918 -164979 283412 16082 47539
18622 47539 20017 44714 92137 -3148 147970 33066 -15938 73615 329592 -270552 33626
18610 90450 -186139 247142 -100932 27671 5451 179529 -169202 261 -208257 128008 159447
18599 159447 88934 -245791 -22014 -55169 -66001 119356 -47416 127282 17151 -451440 -192373
18587 -155013 472508 -111081 42116 -194505 -480366 91257 -122325 -35161 -43223 -41516 -62585
18576 -62585 -211025 -249446 153661 -293783 3132 -470086 -429404 -358565 97036 32717 -273599
18564 -193871 -41238 -121556 -96216 28725 -90290 -54184 99418 -134271 -145337 -315820 373684
18552b00607b4854H9216c4483e095k42804H0470M7761b43403A29535a67079c2054
18540a52011j22423A70271b1679j17743k75830P0482H9467a17822K3774I2488
18529i6656b6534O870k41314B32623a78469g5791k6656L1141J4649B280b79845
18517c54515d6668k22493f4452m372K5016k2726A4946N1080a97642G2256C4760
18505a68558A90821a52468A98132G152g0266l4781j64985O2237D2586J15563O6575
18494B24724q963a60171l9717l08533A29339C2523R3196a17171A08340J58476
18484B66816a82845C0848a33069j37051l3040P346B04741d5305k03998e8504b8167
18472b04498k1236E295a15029I8448k148b94567J16110j68408c2782r0791L6832
$$ plain form
18552 -200607 -24854 89216 -34483 -5095 -247899 80470 128231 -243403 129535 -167079 -32054
18540 -152011 -274434 170271 -21679 -139422 -415252 -344770 89467 -117822 -94048 92488
18529 -96656 -26534 -19664 -260978 232623 -178469 -75791 -102447 -71306 -56657 2280 -279845
18517 -354515 -46668 -269161 -64452 -68824 -43808 -66534 14946 66026 -197642 72256 34760
18505 -168558 190821 -152468 198132 7152 -70266 -105047 -270032 -207795 42586 158149 224724
18494 224724 215761 -160171 -199888 -508421 129339 32523 125719 -117171 108340 266816
18484 266816 -182845 30848 -133069 -270120 -303160 -295814 204741 -45305 -249303 -58504 -28167
18472 -204498 -225734 5295 -115029 98448 96300 -294567 -178457 -346865 -32782 -123573 -86741
18461h6741j21552Q3493k48666F7698j7433b41845B64103a68012O4058l8338a3681
18449a37181G0646a7412H6484d378E24674c03449a37869j5035d2834l8422O317
18438g4939G0815A7655J06263m6676b65966G6983g7788f941k50927B0882a62780
18426A75446c0185o0494k31255n6858a80399J4685E4106J23823b06203i5611C56446
18414e59176F0434a21995A29685c6050Q306C27716i236A64025R8129a15108B59380
18402a48102C9050L59398c77932A65916a02187A27263A7474h7048A30380i145
18391b01568A72880p9766d08298I026g1997j87248F5516c21771B40235e9277J8675
18380d0602j176E2454A6845J30357b07763B65404a9378D8904g5313k25549I6567
$$ plain form
18461 -86741 -208293 -124800 -373466 67698 50265 -241845 264103 -168012 -103954 -142292 -13681
18449 -137181 70646 -17412 86484 -4378 524674 -303449 -137869 -152904 -42834 -81256 -74939
18438 -74939 70815 17655 123918 77242 -265966 76983 -77788 -6941 -257868 20882 -162780
18426 175446 -30185 -90679 -321934 -378792 -180399 -165714 54106 177929 -206203 -95611 356446
18414 -559176 60434 -121995 129685 -36050 -27744 327716 -9236 164025 262154 -115108 259380
18402 -148102 39050 398448 -377932 165916 -102187 127263 17474 -87048 130380 -9145
18391 -201568 172880 93114 -408298 9026 -71997 -259245 65516 -321771 240235 -59277 -40602
18380 -40602 -41778 52454 16845 147202 -207763 265404 -19378 48904 -75313 -300862 96567
18368C91441c7570p3180c0163I6901i4103B38152j5560g2322q5926j17546B37096
18356B52385b06402l9629D7585e5156k55668e4885B22763j03392c99987H2417
18345A92302b98069D6217J32685A1056J63899a79852L2121J4732C5523a99687
18334A6273J76228e1185k30416K8892I406b087B82799q0057b00005B96130E9906
18322a048E9620a97749i1689k14058A62383F721a95161C787J08839E258N5841
18311F1099K8632a91444B78529a70496D8878h2684j07229A67221E3028b98061
18300A09522b49772A74318C0556F95J14050f1350k39093J41043K2617B4021R9798
18289A23819A3868a56877A1055c04653a32677r2517p0638g7718B29410f4129E7776
$$ plain form
18368 391441 -37570 -110750 -30163 96901 -94103 238152 222592 -72322 -158248 -275794 237096
18356 252385 -206402 -246031 47585 -55156 -310824 -54885 222763 119371 -399987 82417
18345 192302 -298069 46217 178902 11056 174955 -179852 -147731 -132999 35523 -199687
18334 16273 192501 -51185 -281601 -252709 9406 -2087 282799 202742 -200005 296130 59906
18322 -1048 59620 -197749 -91689 -305747 162383 6721 -195161 3787 112626 5258 61099
18311 61099 89731 -191444 278529 -170496 48878 -82684 -189913 167221 53028 -298061
18300 109522 -249772 174318 30556 695 114745 -61350 -300443 -159400 -136783 24021 123819
18289 123819 13868 -156877 11055 -304653 -132677 -225194 -295832 -77718 229410 -64129 57776
18277b13459a02200k21038F3515a10788A68098p1915f5650A41129b69884j3910
18267b83794A44124a32354p3970J544o8752B52890a01327j86141R3838a3220o2541
18256g5761j16214c1209a4975j21425c6472k74030H2314a97131j85892B9797c8860
18244h2902j16341f2880E7761a11902A23210D087c55050h1825B948J8704b19833
18232b29901j4043d8854A0150O1006b75366P8911E0352J04652a0541j68270K2542
18221a56269A13512i2172C1107P5711a27622C31107A7401K95217j07360D2861
18210H7986C0001J25327a11339q9566e1077m7091a9329p2488B43871a40222G0435
18198b64429b519A25423c7957H8461L14649A5521D823J6492J38457d4874q4742
$$ plain form
18277 -213459 -102200 -323238 63515 -110788 168098 96183 -65650 141129 -269884 -283794
18267 -283794 144124 -132354 -206324 -204780 -273532 252890 -101327 -287468 -193630 -13220 -75761
18256 -75761 -191975 -31209 -14975 -136400 -36472 -310502 82314 -197131 -383023 29797 -38860
18244 -82902 -199243 -62880 57761 -111902 123210 4087 -355050 -81825 2948 21652 -219833
18232 -229901 -243944 -48854 10150 71156 -275366 -196455 50352 155004 -10541 -178811 -156269
18221 -156269 113512 -92172 31107 106818 -127622 331107 17401 312618 205258 42861
18210 87986 30001 155328 -111339 -200905 -51077 -98168 -19329 -91817 243871 -140222 70435
18198 -264429 -2519 125423 -37957 88461 403110 15521 4823 21315 159772 -44874 -129616
18187a29616M3527N094r8417A8483N2846k8757I064b73082A78176H061O0962K04727
18175B73750I1262a82720H4810k9491b40272G6543q154J18999h2926j06350a219
18163i1402k47253A62734b79603c1194H7958F621O6424b1708r499a4902m0086
18152e4988o7247A04066a1734I0442b1371A62191c6233a4231j79057J1358A47946
18140B11528B3896a40116n2768N0141A17405e4640k72046i1449K6081l706l1379
18129a00453j27534B59396F8468J34002a80000C53095a61146b0965o62817b55924
18118h0891l26926H6865c19891a24004o5106m5986K5876J4991R5493n9883C06039
18106a25396G6303J88721j0444a53022N8248j16683j44473J52984H8803h8422
$$ plain form
18187 -129616 -86089 -80995 -179412 18483 71329 42572 9064 -273082 178176 8061 69023 273750
18175 273750 91262 -182720 84810 55319 -240272 76543 68389 187388 -82926 -189276 -1219
18163 -91402 -338655 162734 -279603 -31194 87958 6621 73045 -21708 -31207 -14902 -54988
18152 -54988 -122235 104066 -11734 90442 -21371 162191 -36233 -14231 -193288 -181930 147946
18140 211528 23896 -140116 -192884 -142743 117405 -54640 -326686 -91449 -65368 -69074 -100453
18129 -100453 -227987 259396 68468 202470 -180000 353095 -161146 -20965 -683782 -255924
18118 -80891 -407817 86865 -319891 -124004 -189110 -235096 -209220 -194229 -98736 -158619 306039
18106 -125396 76303 265024 254580 -153022 -94774 -211457 -355930 -202946 88803 -88422
18095a82643I490d98352H0274B6775b6462j59280A53769e2536q4797A35419a9177
18083C83569a96409A28882K73481F851J78038A4544c5118k4926k1752A12790K5628
18072A38418c60867J01362I9645b62860I2355b95467a22827A05148O5760a11660
18061c088G9134b87671a40615A5128f2901E8618J93438F0781a57507J1590l4284
18050a80201a1389k42656A19778a80840I2879M925f8856o5393e6978F1957b97874
18038A9170M2992b91636a2090F372g7053A48388E8824f4969G2982b40830C047
18026c37185a15466a6316k575I0470a90095r9903H8540b5946N912k43355B0877
18014f1567n5525M5237A32411g6551A76481a36597d3652p523b4286j03869d6173
$$ plain form
18095 -182643 9490 -498352 80274 26775 -26462 -185742 153769 -52536 -137333 135419 -19177
18083 383569 -196409 128882 402363 6851 184889 14544 -35118 -60044 -81796 112790 138418
18072 138418 -360867 -259505 99645 -262860 92355 -295467 -122827 105148 170908 -111660
18061 -3088 79134 -287671 -140615 15128 -62901 58618 252056 60781 -157507 -145917 -180201
18050 -180201 -11389 -254045 119778 -180840 92879 97804 -68856 -134249 -56978 61957 -297874
18038 19170 62162 -291636 -12090 6372 -77053 148388 58824 -64969 72982 -240830 3047
18026 -337185 -115466 -16316 -18891 90470 -190095 -289998 88540 -25946 -20034 -263389 20877
18014 -61567 -117092 -71855 132411 -76551 176481 -136597 -43652 -51175 -24286 -128155 -46173
18002a91616N2550A56797a63633P7640l76964B73115A03313Q2215c6805k70795
17992c07600B03361J8167O6269F9800P7209a77794B48475b9553k76079B06243
17981a09124j20432k07581B9916b05689c0750m6221j26731A44865b3419O249H6944
17969D99119k16044C310a72679C3214Q1447a64192G1445e6035A92843g2093F4219
17957a10007e118n7047j05680f7543j15413A59539a70692C60618C6568b3235A18644
17945h3966B50069a51479A43611O3425D4040b72800R7116A86576E4085a05394
17934C13286A54154C64a30050k02A22459b3075j0848A35241e0240C2732i8389
17922B15945L1354h9703G7423h072k16436d0791q1342j55508A22388b13120K495
$$ plain form
18002 -191616 -139066 156797 -163633 -85993 -462957 273115 103313 185528 -36805 -307600
17992 -307600 203361 221528 287797 69800 147009 -177794 248475 -29553 -305632 206243
17981 -109124 -229556 -437137 29916 -205689 -30750 -76971 -203702 144865 -23419 -17170 86944
17969 499119 283075 3310 -172679 33214 114661 -164192 71445 -56035 192843 -72093 64219
17957 -110007 -5118 -62165 -167845 -67543 -182956 159539 -170692 360618 36568 -23235 118644
17945 -83966 250069 -151479 143611 207036 44040 -272800 -175684 186576 54085 -105394
17934 313286 154154 364 -130050 -130252 122459 -23075 -33923 135241 -50240 32732 -98389
17922 215945 247299 -89703 77423 -8072 -224508 -40791 -122133 -277641 122388 -213120 -210625
17911b10625j21649a3103A37941B5766o256a7578j62567B5278B216i3062k3774
17900a16836A15082d2115j27442A43853K05222Q7232A32824O6279c48563A00491
17889A63523d02647J88399l3452A81472b55449e0230B01138a67154A65079K16129
17879C81208a42170B53523A21925M5579a59433p1P4075A3757c03679G2948f2015
17867A12920L02293i3887L9729A69323A0547L42511d60995c9036j8510C4448E561
17855G827c84418B30090h2263l272l9721j22184H2206J33433q4871c81621D4302
17843A64787a699F6699J46267n9988e1k82983A98629K5004m9746C1427b55263
17831A32777Q407d4222j75812a09379B8513K56674a58619j2866C8161J09754a75000
$$ plain form
17911 -210625 -332274 -13103 137941 25766 19510 -17578 -180145 25278 2216 -93062 -116836
17900 -116836 115082 -42115 -169557 143853 349075 436307 132824 199103 -348563 100491
17889 163523 -402647 -214248 -247700 181472 -255449 -50230 201138 -167154 165079 381208
17879 381208 -142170 253523 121925 167504 -159433 -159504 -85429 13757 -303679 72948 -62015
17867 112920 415213 -93887 -54158 169323 10547 353058 -460995 -39036 -57546 34448 5561
17855 7827 -384418 230090 -82263 -85535 -125256 -247440 82206 215639 130768 -381621 44302
17843 164787 -1699 66699 212966 152978 -51 -283034 198629 223633 173887 31427 -255263
17831 132777 141184 -44222 -220034 -109379 28513 285187 -158619 -171485 38161 147915 -175000
17819A81164i366H3148K16621b17671d5823B3417J20819n7883m833N3221L6633
17808A71374c6192k72791A26608c23619J41498a0513j0456A08584a29966I9382
17797H4479a16869A71116a54975j84334A33160b51497g2773l12585C16076F7329
17786b31393a07529C21404e3124B72616a10771l49377A05362m4730a58330a5957
17775a43132C00410I54c27947A04057K10399j46934M2097a00575C2773a42189
17764H0666J05527r1438e8973p3603D4652e4536A62412c25638B6176h7490j93972
17753b81462c4330b801D6969L0274Q5587b57565M3801A20380a4880A09306g8710
17741B9704L43866a47009j19306A19366J55603b15666d8112i174p7576m2248e7581
$$ plain form
17819 181164 -9366 83148 299769 -217671 -45823 23417 144236 86353 81520 134741 171374
17808 171374 -36192 -308983 126608 -323619 -182121 -10513 -20969 108584 -129966 99382
17797 84479 -116869 171116 -154975 -339309 133160 -251497 -72773 -385358 316076 67329
17786 -231393 -107529 321404 -53124 272616 -110771 -460148 105362 60632 -158330 -15957
17775 -143132 300410 954 -327947 104057 314456 167522 209619 -100575 32773 -142189
17764 80666 186193 94755 -58973 -132576 44652 -54536 162412 -325638 26176 -87490 -281462
17753 -281462 -34330 -2801 46969 77243 162830 -257565 -213764 120380 -14880 109306 -78710
17741 29704 373570 -147009 -266315 119366 274969 -215666 -48112 -9174 -86750 -128998 -57581
17729C7156J27087a57118A20017a81962K4992I047a41442A21049M468K09481K6730
17718C61728l5685d5577A31411f5647L2159l51434A55754o3214C9846M0384a79237
17706A56303A3753h0014b5102D48599b97402f6382p1414A0268K11374J35638A04756
17694e9666D38319A49208m0089b21974n792F3499a63659m4766Q1892G3034a5303
17682d8257A2694Q0638k2763K19500a24930E0731k2146J01052a85097b0872n06834
17671e27706i2288A51845a8761l5917a4214G3159M03280f6910k08590P3919f1626
17659b8167j11679d1502C7640c21522A20632Q1510K41290f3197b3895r7127j08581
17648b29603B69117b23373F0271d129A36215J923R2832c4592A08611J28071b00764
$$ plain form
17729 37156 164243 -157118 120017 -181962 -156970 9047 -141442 121049 125517 334998 361728
17718 361728 326043 -45577 131411 -65647 -33488 -384922 155754 92540 39846 80230 -179237
17706 156303 13753 -80014 -25102 448599 -297402 -66382 -137796 10268 221642 357280 104756
17694 -59666 438319 149208 109119 -221974 -227766 63499 -163659 -208425 -126533 73034 -15303
17682 -48257 12694 93332 70569 290069 -124930 50731 28585 129637 -185097 -20872 -527706
17671 -527706 -92288 151845 -18761 -54678 -14214 73159 476439 -66910 -275500 -201581 -61626
17659 -28167 -139846 -41502 37640 -321522 120632 202142 443432 -63197 -23895 -121022 -229603
17648 -229603 269117 -223373 60271 -4129 136215 138138 230970 -34592 108611 236682 -200764
17636B72524A03458a27363a4704j92231J03301B87928E70K95014H5591J23427
17626B09018J03822b76952C3602f7265j20331j55092B35392g4917H8373e9154
17615h8698A26318J99233a08316B10895a93583a4172k12816D1259A7532a29908
17604A1445h9292D89578d0493r3456F7217k8256Q7449i2129J1487A8482b3020
17592b36463f1300A56463R3349b3411h208q9330M3684A34832c08193A10902f0459
17580e4129j21425A30190b16144h0097A77160h960D4789a03901A23366a25900
17569B96871M0715j45287A9217f9336G59b14735B22756f0286D771M3118J21500
17558A69389o4748A4673Q5028j9387J1338R9255J37660a14870j2343L6265I1351
$$ plain form
17636 272524 103458 -127363 -14704 -206935 -103634 287928 570 295584 85591 209018
17626 209018 312840 -276952 33602 -67265 -187596 -342688 235392 -74917 88373 -59154
17615 -88698 126318 325551 -108316 210895 -193583 -14172 -226988 41259 17532 -129908
17604 11445 -89292 489578 -40493 -133949 67217 38961 126410 -92129 -80642 18482 -23020
17592 -236463 -61300 156463 249812 -23411 -8208 -97538 -53854 134832 -308193 110902 -60459
17580 -54129 -175554 130190 -216144 -80097 177160 -8960 44789 -103901 123366 -125900
17569 296871 337586 192299 19217 -69336 759 -214735 222756 -60286 4771 47889 169389
17558 169389 104641 14673 99701 80314 91652 190907 328567 -114870 -127213 -90948 91351
17546B43934a6531A34401a37915C2458J19353E4147b42320E0816h8559A45936
17535D42166A59583b31854B02494p9327e5399A35189M6283a55525j32595M4292
17525b43828C29437A22232b08646B06039a81797M4894O0966C03317k2077I5452
17514a82450H3018e9025o6753b3061A22937g3020A32377b07468A53415f7769B04084
17502G6148K3954R1678c5598o1422d303I559a57999e0296B35321h8387p1470n9689
17490b19546A94751h286A32350J47419J87650G8014N1495J84680B8768J76843
17480B05611K63493B32818f116j95208B13772J34928D4433L43515j04212a20187
17469a05467E2660K32562H0216J15106a74090H5838g7781B75004A24740K31011
$$ plain form
17546 243934 -16531 134401 -137915 32458 151811 54147 -242320 50816 -88559 145936
17535 442166 159583 -231854 202494 123167 -55399 135189 181472 -155525 -288120 -243828
17525 -243828 329437 122232 -208646 206039 -181797 -136903 -75937 303317 281240 95452
17514 -182450 83018 -59025 -125778 -23061 122937 -73020 132377 -207468 153415 -67769 204084
17502 76148 100102 191780 -35598 -97020 -4303 9559 -157999 -50296 235321 -88387 -159857 -219546
17490 -219546 194751 -8286 132350 279769 467419 78014 129509 314189 28768 205611
17480 205611 469104 232818 -6116 -201324 213772 348700 44433 387948 283736 -120187
17469 -105467 52660 285222 80216 195322 -174090 85838 -77781 275004 124740 355751
17459C55751A05494N2754J82530F952L07050L9979q2242J33590A69743d1202E60379
17447D43376A46593L23050F2322L29477F5392J47631Q9845k339A03899J63475
17437B67374N6506b9947A49613P15612A74887L66708C5332L37140B525K30184
17427B32709Q445G8109J53775O9550K27040A08634J8174L5621l3894J2238L4530
17416A75303J1953N1553o4340K59717J0872A13587g4402A93259a07569B93906
17405C04925e12322d0011E3300M16682I2016B8256J56286E3665i5207C65380J2367
17394C77747o5300A32144A2137N3915e1432k43251B52261F8275a09464h617C2475
17382C32017p5817L8524A387b29143D10714j96318N5102b13506i6411l2073A61158
$$ plain form
17459 355751 105494 158248 340778 6952 314002 353981 271739 405329 169743 -41202 560379
17447 443376 146593 469643 62322 391799 65392 213023 302868 300529 103899 267374
17437 267374 323880 -29947 149613 865225 174887 541595 35332 372472 2525 232709
17427 232709 241154 78109 231884 301434 528474 108634 126808 162429 128535 140773 175303
17416 175303 187256 238809 174469 434186 445058 113587 -74402 193259 -107569 293906
17405 304925 -512322 -40011 53300 469982 92016 28256 184542 53665 -95207 365380 377747
17394 377747 312447 132144 12137 66052 -51432 -294683 252261 68275 -109464 -8617 32475
17382 332017 256200 294724 1387 -229143 410714 214396 269498 -213506 -96411 -128484 161158
17370A34257i7714a3987B79758q4860a77556B38911m1271J78853a77840h1078
17359A53170d5901j02330B20351o5636L234l026O7867a5453B39375K52788j38137
17348C54026A8297K40415h7180n4268D52142E6521J74049K59921q1260H6296Q7138
17337A73434J26923C0565q162K33887r970J61957K1339F7754B8136K72662j33670
17326A67128k9525b03495L0670B91556o8668G7667J85519a11771B02304K3109
17316B25413K82608m3845o5531a8495l26631B53690o7045J4203I7960k6263C5312
17304b5643D19740j94813a1409C94269a03659A28997J07230e4195B01323K42828
17294D44151b3656H7232L41195D3617H350b03719A48018k5009J95431d7513n7867
$$ plain form
17370 134257 -97714 -13987 279758 194898 -177556 238911 197640 376493 -177840 -81078
17359 153170 -45901 -148231 220351 154715 157949 154923 222790 -15453 239375 492163 354026
17348 354026 18297 258712 -87180 -141448 452142 56521 230570 490491 409231 86296 173434
17337 173434 300357 30565 22403 256290 246320 408277 429616 67754 28136 300798 167128
17326 167128 137603 -203495 -172825 291556 222888 77667 263186 -111771 202304 225413
17316 225413 508021 464176 398645 -18495 -345126 253690 186645 200848 97960 71697 35312
17304 -25643 419740 224927 -11409 394269 -103659 128997 236227 -54195 201323 444151
17294 444151 -23656 87232 428427 43617 8350 -203719 148018 123009 318440 -47513 -105380
17283a05380F6811b49149A72578L6476o4601J90108n7053D70K83038J33441G4521
17271B49248B3090J36672J36644b37471o7925F8036Q5761g7335A32367k0670N0790
17260A62487L3243J02567a05592A81962l7916J07521j08587n8384c0143a1212
17249B09650J40146E9281n821R6699J5286a57312C3302R7369B1680M20206k15360
17238B26526B0998J13688E1362J27512p2792M47774a4391o8160E13965k40227
17228B73738O5217A45964k551P9320b04318A0048J31822c4701j7357C71069A77340
17216A95744C5661N0885K01636a10561E74443k30971J8467b13279C93056j26309
17206B66747g1251H9493J74282j8796O2904I7488C2620J89129F1872J98681J35020
$$ plain form
17283 -105380 66811 -249149 172578 209054 144453 334561 277508 470 283508 416949 74521
17271 249248 23090 159762 296406 -237471 -305396 68036 153797 -77335 132367 111697 162487
17260 162487 195730 298297 -105592 181962 144046 251567 142980 84596 -30143 -11212
17249 209650 349796 59281 53460 150159 165445 -157312 33302 130671 21680 441886 226526
17238 226526 20998 134686 51362 178874 106082 553856 -14391 -82551 513965 273738
17228 273738 338955 145964 143413 222733 -204318 10048 141870 -34701 -52058 371069 177340
17216 195744 35661 86546 288182 -110561 574443 343472 361939 -213279 393056 266747
17206 266747 -71251 89493 263775 244979 307883 97488 32620 221749 61872 260553 395573
17195C95573A89780j1274J99574C8634Q498Q5993K4868J4832J01268N8832A30214
17183A59521N271L3942J90519A09864M49361H3391d610A71578M1472J01486j7299
17172B97237A31772Q9614J3135L3005B7471L64080I280L26444o6032Q8541j61000
17161A97233Q4581K39161P3463A50955F8430L44450j56447c3804H3739J26215
17151B09954H1617J05113J12053M4619B4994M81465h112C03660M97835I2196A5955
17139B98004j46424d8423A51867K70787j62038D6982K15848C9940e9273A62923
17128A56784o9187R7232R6151j32529O4120R5711j22640p8285Q4470L16145A30251
17116H4721L13772J08139F5535N28526k02669o0851L51966e0656A44016D416J10436
$$ plain form
17195 395573 189780 178506 378080 38634 47132 133125 157993 172825 274093 332925 130214
17183 159521 164792 198734 389253 109864 559225 83391 -4610 171578 213050 314536 297237
17172 297237 131772 221386 234521 267526 27471 391551 9280 335724 269692 358233 197233
17161 197233 281814 520975 594438 150955 68430 412880 256433 -33804 83739 209954
17151 209954 81617 186730 298783 343402 24994 506459 -8112 303660 801495 92196 15955
17139 298004 151580 -48423 151867 422654 260616 46982 262830 39940 -59273 162923
17128 156784 87597 184829 280980 148451 212571 308282 185642 107357 191827 507972 130251
17116 84721 398493 506632 65535 594061 391392 330541 682507 -50656 144016 4416 114852
17105A14852M43806A42218L98473k30340m9188K77199J6095j31494B9500J63104
17095A92604K14684K60649m230l24873K26597j84732j33833L01380k43548Q9609
17085C94307l5889P244R0215N9107p4958A95908J2349P3150j3079q1440K49105
17074D35993j09090L01603B62695N3168l7390J88474J14783A51113M99669j43636
17064E07146m6882j59836K85606J02853J76015k04113j22783j26184A54986L28760
17054D83746j56658j0571J22916Q155j15336q5026k3338J62111J234J22338L01460
17043H11031C23940J81877J83177j12393q2506r4291N67459j44614j24656l27969
17033C70024L95097k93669P4803o0628a8140C81557J27327K2705o1936j43018
$$ plain form
17105 114852 558658 142218 540691 310351 261163 538362 554457 422963 29500 192604
17095 192604 407288 667937 663707 338834 565431 380699 246866 548246 304698 394307
17085 394307 358418 365662 455877 514984 440026 195908 208257 281407 268328 186888 435993
17074 435993 326903 628506 262695 315863 278473 466947 581730 151113 650782 507146
17064 507146 460264 300428 586034 688887 864902 660789 538006 411822 154986 483746
17054 483746 327088 316517 439433 447588 332252 247226 223888 385999 387233 509571 811031
17043 811031 323940 505817 688994 576601 494095 399804 967263 822649 697993 370024
17033 370024 765121 471452 546255 485627 -18140 381557 508884 531589 469653 326635
17023C26635q8744L58833k01469j80285M37029R7607j0973k16226J98563j06722
17013F14248Q3157J8140l30576O6033J36167m258m6023R3535J64122r0155B47456
17001C48166K26903N3839j36821j98033K41015p3796J8044k7226K82626q8887
16991F45830J66002k9351M5742j73381N7786J5632J05594K3695P077l46225Q9781
16980F08182r7295J32207A79846N12712K9349K12386j02259j75726J68492B36114
16969H42179M2290o0641k37838L10791J1610j64799K26546k59534J30567J7624
16959H58795Q95q3577K00669k39007l4710L08032j23347J31925K18163E47718
16948H54886J34038J4697K2969K32275l21598J7137K77770j64320o8834K43601
$$ plain form
17023 326635 237891 596724 395255 214970 651999 749606 738633 522407 720970 614248
17013 614248 697405 715545 384969 451002 587169 582911 536888 630423 794545 704390 247456
17001 348166 575069 628908 492087 294054 535069 461273 479317 452091 734717 645830
16991 645830 811832 782481 828223 654842 712628 728260 833854 857549 864626 518401 608182
16980 608182 510887 643094 179846 692558 721907 934293 832034 656308 824800 236114
16969 842179 884469 823828 585990 896781 908391 743592 970138 710604 841171 858795
16959 858795 859690 776113 976782 737775 703065 1011097 887750 1019675 1237838 547718
16948 854886 988924 1003621 1026590 1258865 937267 954404 1232174 1067854 999020 1242621
16938A242621m58722p0877L18593q8322L62164l3714l21465p602K16046K24747
16928A383469l52055m4438O7247J3256K25233k53023R2092q2178O4749RK07224
16917A321585j95833o9497k04785L61439J12559l71584M32762L3866k27459O4212
16907A257265K73219n36042K78419J57358l5529j65445O9148M3141K14710k12976
16897A343268J50469k55010N94514j89980J35750l26647n4804R7864L4182N8654
16887A588260j52730J08827K96843O3987M0601l75001M07028o4289K6285m59156
16877A480655L26187Q3809L46141l572l58253J92534Q2654o619l0920L22840p7210
16866B358246j1207k38685K31070j47212M31653l09504M7042k24592m0382M39412
$$ plain form
16938 1242621 783899 713022 1031615 943293 1305457 1271743 950278 942676 1158722 1383469
16928 1383469 1031414 986976 1054223 1067479 1292712 1039689 1131781 1049603 1114352 1114361 1321585
16917 1321585 1125752 1056255 851470 1212909 1325468 953884 1386646 1420512 1193053 1257265
16907 1257265 1530484 994442 1272861 1430219 1394690 1229245 1298393 1341534 1556244 1343268
16897 1343268 1493737 1238727 1833241 1643261 1779011 1452364 1397560 1495424 1529606 1588260
16887 1588260 1435530 1544357 1841200 1905187 1945788 1570787 1977815 1913526 1939811 1480655
16877 1480655 1806842 1890651 2236792 2233220 1874967 2067501 2150155 2143536 2112616 2435456 2358246
16866 2358246 2347039 2108354 2339424 2192212 2623865 2314361 2361403 2136811 2096429 2535841
16856B535841P1217K4705j27478R308J80067j49984L4466L9038K99524m31483
16846B485221K24355O9292J74879J92240K73893j49846r1775n0392L88914K30806
16836C747587n67768P5119K27951N525M08461k21082l05971J92055P272L16206
16826C885355L52118k39731l7324K51032J43994k93817M09146L36484n9417k83709
16816D464131K81946j69618Q7125L36851K02136j991J78728J72535Q6779M7615
16806E686237J98619j1735L57034r7378J7592L02024M70896l34960k674L37973
16796F923628N36505q0555M96822l48478O24235L29731n4686J60896M3813L21994
16786H953905K92808K95107K83075M30564j08351K62422L81057M61492L60104
$$ plain form
16856 2535841 2607058 2631763 2504285 2513593 2693660 2543676 2578142 2617180 2916704 2485221
16846 2485221 2709576 2778868 2953747 3145987 3419880 3270034 3178259 3127867 3516781 3747587
16836 3747587 3179819 3254938 3482889 3488414 3896875 3675793 3369822 3561877 3569149 3885355
16826 3885355 4237473 3997742 3960418 4211450 4355444 4061627 4470773 4807257 4747840 4464131
16816 4464131 4746077 4576459 4663584 5000435 5202571 5200580 5379308 5551843 5638622 5686237
16806 5686237 5884856 5873121 6230155 6132777 6150369 6452393 6923289 6588329 6585655 6923628
16796 6923628 7460133 7379578 7876400 7527922 8152157 8481888 8427202 8588098 8631911 8953905
16786 8953905 9246713 9541820 9824895 10255459 10147108 10409530 10790587 11252079 11612183
16777A1612183N08854Q5930M48444R6603N60762K28740M24626L22625J065253
16768A5354020R3686Q54681O88146L06523R01161L95818J144667N13196J167931
16759B1419829M18960R81542Q43650J271497J051502J038881J050727J596347
16751B9672935J048885J305349J829397J818118K229781J705530J673038K297456
16743D3580489K427135K306442K961223L180839L290443K914990L946250M444293
16735F9052104L873920M378708N412385N407069O022841N764886O634428O855708
16727A13402049P925504P814435Q312055P852351Q672036Q225121Q117072P906129
16719A78226752O611779O180516M660458L593238J908700N33674j069916k779527
$$ plain form
16777 11612183 12121037 12206967 12655411 12752014 13312776 13541516 13966142 14288767 15354020
16768 15354020 15447706 16302387 16990533 17297056 18198217 18594035 19738702 20251898 21419829
16759 21419829 21838789 22820331 23663981 24935478 25986980 27025861 28076588 29672935
16751 29672935 30721820 32027169 33856566 35674684 37904465 39609995 41283033 43580489
16743 43580489 46007624 48314066 51275289 54456128 57746571 60661561 64607811 69052104
16735 69052104 72926024 77304732 82717117 88124186 94147027 99911913 106546341 113402049
16727 113402049 121327553 129141988 137454043 145306394 153978430 162203551 170320623 178226752
16719 178226752 184838531 191019047 195679505 199272743 201181443 201715117 200645201 197865674
16711A97865674l989921n486887o651258p187173q270371q521380q588296q267193
16703A40903195q335405q485926p364424p485612o899733o437466o299943n750472
16695H3844214n173867m926670m379556m233965l712379l808650l236316l380250
16687E0992561k616732k698396k700443k010507k313184j816857j718890k096337
16679C3021215j451125j458970j102909j084403j744309j031206j590331m97598
16671B3060364j189437p71566q31841q21611r18486n09342r17208o85281k44183
16662A6171409p36507m08209p08361n83855l76051l74994l00305o48078k54718
16653A1780331n74325m51081l39120L98560q89341k43270l31909j99778l28424
$$ plain form
16711 197865674 193875753 188388866 181737608 174550435 166280064 157758684 149170388 140903195
16703 140903195 132567790 124081864 116717440 109231828 102332095 95894629 89594686 83844214
16695 83844214 78670347 73743677 69364121 65130156 61417777 57609127 54372811 50992561
16687 50992561 48375829 45677433 42976990 40966483 38653299 36836442 35117552 33021215
16679 33021215 31570090 30111120 29008211 27923808 26179499 25148293 23557962 23060364
16671 23060364 21870927 21099361 20267520 19445909 18527423 18018081 17100873 16415592 16171409
16662 16171409 15434902 15026693 14318332 13734477 13358426 12983432 12683127 12035049 11780331
16653 11780331 11206006 10754925 10415805 10814365 9925024 9681754 9349845 9150067 8821643
16644H821643n04943K58619l99384L6917m19903k88549j95297k95439l87170K0259
16634F646753l520k4539l76561J80706n80679o253k04026j88819j49836o5260
16624E227966L7259l18438L87511n35916j08110p3467l028l53857K71249k16321
16614D314848J66146j00057k35985O8249l34287K65968j96912k36114l27196K29432
16604C614092l67888M5110K40001k31687l200j07717P2613J41765o71899M7325
16594B778515K16625k17767m03472P11878m42851N2038j27724K08421l74084Q7143
16584B488722m7324K16977l91532m4881L25411m23617M23909o16634K66280L07927
16574B505238k76664n01236L30046q1114j80477J13716o7277j15687K40167l08527
$$ plain form
16644 8821643 8316700 8575319 8175935 8212852 7792949 7504400 7309103 7013664 6626494 6646753
16634 6646753 6643233 6618694 6242133 6422839 5842160 5835907 5631881 5443062 5293226 5227966
16624 5227966 5265225 4946787 5334298 4798382 4690272 4616805 4613777 4259920 4531169 4314848
16614 4314848 4480994 4380937 4144952 4213201 3878914 4144882 3947970 3711856 3384660 3614092
16604 3614092 3246204 3291314 3531315 3299628 3296428 3188711 3261324 3403089 2731190 2778515
16594 2778515 2995140 2777373 2373901 3085779 2642928 2694966 2567242 2775663 2401579 2488722
16584 2488722 2441398 2658375 2266843 2221962 2547373 2123756 2547665 1931031 2197311 2505238
16574 2505238 2228574 1727338 2057384 1976270 1795793 1909509 1842232 1726545 1966712 1658185
16564A658185R0859J4287N09220o93472q9299N2920J23962m9441p7903k85148
16554A254170L00249m5042L22504n63108M12940k54476O551M83072m02536k45832
16544A268492J57877J79268l24875q0891L14107j45830k34684K82286R4665n12847
16534I97568Q772Q2669M1786K218K457J12784j39714J36001J43790m39030j77863
16523G71438L29510l50795Q5937K72029k93494K34222k78645L1867L88029l75613
16513H14485j14443L98508l19064J90989m63363K32626K12038k8968j64013J46848
16503I05643L25325j25122k0789j78605j1699R7050j27639J42307D48764L04276
16493G53040J70185K6282D09646N51788k21539j4497J24824A07063P08095k59200
$$ plain form
16564 1658185 1749044 1763331 2272551 1579079 1489780 1542700 1666662 1617221 1539318 1254170
16554 1254170 1554419 1509377 1831881 1268773 1681713 1427237 1433788 1916860 1514324 1268492
16544 1268492 1426369 1605637 1280762 1199871 1513978 1368148 1133464 1415750 1510415 997568
16534 997568 1006340 1089009 1130795 1133013 1135470 1248254 1108540 1244541 1388331 949301 771438
16523 771438 1100948 750153 836090 1108119 814625 1048847 770202 802069 1190098 814485
16513 814485 700042 1098550 779486 970475 507112 739738 951776 922808 758795 905643
16503 905643 1230968 1105846 1085057 906452 894753 991803 864164 1006471 448764 753040
16493 753040 923225 949507 409646 961434 739895 725398 850222 107063 815158 555958
16483E55958J69835K0019M06110n00552j79032J00392j53961J88981J19580C54587
16472B69363O7990L29006K0096M5413n5327Q7742p6062j41198L09869j78249k94439
16461C84204K79286k15735k18717L54604A87736k2915L05591p154J21859j3935
16451E71182j27081J68195q2271K30832k2557l64763L35322k28275l5210Q6964
16441E32338n6390p0671n1448J25915j49050J81900A94589M32871j84941J40239
16431E82758k46748K47661k32204J55343j01740K66175A29428L80013K0485j56660
16421C73266J77615B71719K71655H0930N8821N4354P1971K97008B65339L36607
16411F01946j2524a34678B24427a48542B11398Q1783R9673J61098B71037P6060
$$ plain form
16483 555958 725793 745812 1151922 651370 472338 572730 418769 607750 727330 354587
16472 269363 337353 666359 686455 731868 676541 764283 688221 547023 856892 678643 384204
16461 384204 663490 447755 229038 583642 187736 164821 470412 463258 585117 571182
16451 571182 444101 612296 530025 760857 738300 373537 708859 480584 445374 532338
16441 532338 475948 405277 353829 479744 330694 512594 194589 627460 442519 582758
16431 582758 336010 583671 351467 506810 405070 671245 129428 509441 529926 373266
16421 373266 550881 271719 543374 80930 139751 194105 266076 563084 265339 601946
16411 601946 589422 -134678 224427 -148542 211398 293181 392854 553952 271037 347097
16401C47097K49183j04861j73789A09049J21343K15276j56516p5191l6206R9822
16391B77577L38955B63189K12067J09552B91624r3913a51063a6142D01181j67129
16381B34052A10454l7113K61004o4917A08452K26060j36745M8513a0738B00813
16370C50413a99885d4611B37840o4467b1706C1750K33015P309F3510c1213E12014
16358B50022j7817m5579J29130j24953a8957C39023I2976K11732j21995K9059
16348B11772E7187J47329n3437L25546A12526K89205j89092I4369J79553J69650
16338D43572j71898Q6846j07880o9852k7722J5850J06467J87560A08623R9729
16328B08352H6154O5878l7395J91769J48238H2316K99287b89270B55429Q4092
$$ plain form
16401 347097 596280 491419 317630 109049 230392 445668 289152 213961 177755 277577
16391 277577 616532 263189 475256 584808 291624 197711 -151063 -16142 401181 234052
16381 234052 110454 73341 334345 269428 108452 334512 197767 246280 -10738 200813
16370 350413 -199885 -44611 237840 173373 -21706 31750 264765 272074 63510 -31213 512014
16358 250022 232205 186626 315756 190803 -18957 339023 92976 304708 182713 211772
16348 211772 57187 204516 151079 476625 112526 401731 212639 94369 273922 443572
16338 443572 271674 358520 250640 180788 153066 168916 275383 462943 108623 208352
16328 208352 86154 152032 114637 306406 454644 82316 381603 -289270 255429 339521
16318C39521J3410j43512n6606a01197A83898L2916A8183J21143l3356b0621A41200
16306d39086B78543a93592G4488N603e6420A03937K5086J28463n485D0550J69281
16295B09831f4096A97141B2763J95418g0879C68653n5877A20799O1306d2152n8103
16284a00255B21012m2048R8734c9351A10460L2912p0206b38768A09467i0746B02575
16272e1334I3924D2291J50143h4618B2616K73106F6704m412d3346A63900N4046
16261B17946Q446N9338j18393d1072A31918K12975j70931K03864n7306g4704B09663
16249B63450a84593A56514a16103F1448J66273J7049a82749A25961e7906a8643
16238b3646n1757b3304p1850j00037g4869D01886D7161R1500b0138l9810B02397
$$ plain form
16318 339521 352931 209419 152813 -101197 183898 216814 18183 139326 105970 -20621 141200
16306 -439086 278543 -193592 74488 80091 -56420 103937 129023 257486 252001 40550 209831
16295 209831 -64096 197141 22763 218181 -70879 368653 312776 120799 182105 -42152 -100255
16284 -100255 221012 178964 277698 -39351 110460 143372 73166 -238768 109467 -90746 202575
16272 -51334 93924 42291 192434 -84618 22616 295722 66704 62292 -43346 163900 217946
16261 217946 226392 285730 167337 -41072 131918 344893 173962 377826 320520 -74704 209663
16249 263450 -184593 156514 -116103 61448 227721 244770 -182749 125961 -57906 -18643
16238 -23646 -75403 -23304 -95154 -195191 -74869 401886 47161 138661 -20138 -59948 202397
16226A86388E9386Q6659j1843c9354j05438B1029K33536A10684R4059g6120A76413
16214F1204J59742L1792M4643A6914a41888b0880o3861A35778g1064c0947j04425
16203a35372A96928O5817E8102a6803A73622g5176F574a37376O1795j87371I8261
16191C29181L7844L8746H3097K83827D2969P7542m483a37647A4834a49718C11351
16179E0290R505f3523A13105b25093Q7044G592a6083A61578N6813A6722J02865
16168A19587g9442H5610A9976J22140d81437G6411b46385R4392B77175h7403G8835
16156b04207E5951d1152p3480H4454N5965m1731N4134K3511c8528j42803E0295
16144B81815C0873a74230j09049J25437r1477Q9580B87217g8484A88081d438j11265
$$ plain form
16226 186388 59386 146045 134202 -39354 -144792 21029 254565 110684 204743 -76120 176413
16214 61204 220946 252738 297381 16914 -141888 -20880 -84741 135778 -71064 -30947 -135372
16203 -135372 196928 262745 58102 -16803 173622 -75176 6574 -137376 -75581 -262952 98261
16191 329181 367025 405771 83097 366924 42969 120511 116028 -137647 14834 -149718 311351
16179 50290 59795 -63523 113105 -225093 -138049 7592 -16083 161578 218391 16722 119587
16168 119587 -79442 85610 19976 142116 -481437 76411 -246385 -151993 277175 -87403 78835
16156 -204207 55951 -41152 -114632 84454 140419 98688 152822 176333 -38528 -181331 50295
16144 281815 30873 -174230 -283279 -157842 -249319 -159739 287217 -78484 188081 -4438 -115703
16133a15703a6445I8075a11631p7679A353L03885c81710a03989o4416a9291o5297
16122h4588j0366B63112k7516a21485b171A39248o8663b21358A48816a6436E5199
16110e1009l3297A54369a07423F3304H456b3073C30069j47598P5675c7496D58333
16098a53483P898O6333A89190i9434j71110h2890q5858A43671J64857A32447J7582
16087A50029a55991B01912b13089A39384l790e7644j58046M4763B2611a75204
16076A642a11177A38781l4490L9249b34940r975F2764b07434o3190C3541N9721
16065I3262e0552B5674J71344e74328D5158c6461j67486G52762c22977A55908
16054d3494e998C0692N8849m0837j3772J8242B5256K10970E3085c05182e5528
$$ plain form
16133 -115703 -16445 98075 -111631 -189310 1353 305238 -381710 -103989 -168405 -19291 -84588
16122 -84588 -94954 263112 235596 -121485 -2171 139248 70585 -221358 148816 -16436 55199
16110 -51009 -84306 154369 -107423 63304 8456 -23073 330069 182471 258146 -37496 458333
16098 -153483 -145585 -79252 189190 -99434 -270544 -82890 -168748 143671 308528 132447 150029
16087 150029 -155991 201912 -213089 139384 135594 -57644 -215690 -170927 22611 -175204
16076 1642 -111177 138781 104291 143540 -234940 -244915 62764 -207434 -270624 33541 93262
16065 93262 -50552 25674 197018 -574328 45158 -36461 -203947 752762 -322977 155908
16054 -43494 -5998 30692 89541 48704 34932 53174 25256 236226 53085 -305182 -55528
16042I2126d4217r1773j84733J30724A08916a24185j17788f8387A12773a49014
16031c21022B6438K6960c48072B81677G9159J708Q064M1772O5958b20243C27846
16019D02039A90333l0977D1371b50832f6612E7099a69490E6898b49322a10091
16008b87718A93526b14508f0454B821J68247H3064J43446K57693A28722h7588
15997f2281k64310K3335O1546f339A03358a47034A90687J07951d5294j51268b542
15985A52593c771j69442B45309N5343A26757k9380K72467c7364I3835C8762J13672
15974A52434a76255L8850P842k38830B11016e4536A57405c33589J02614O4391
15964a66584P8152A29754b1146k14291J13396A6946i7894E9732e2591j29328C5589
$$ plain form
16042 92126 -44217 -135990 -320723 -189999 108916 -124185 -241973 -68387 112773 -149014
16031 -321022 26438 53398 -348072 281677 79159 80867 88931 130703 196661 -220243 327846
16019 402039 190333 159356 41371 -250832 -66612 57099 -169490 56898 -249322 -110091
16008 -287718 193526 -214508 -60454 2821 171068 83064 226510 484203 128722 -87588
15997 -62281 -326591 -303256 -241710 -6339 103358 -147034 190687 298638 -45294 -196562 -2542
15985 152593 -3771 -173213 245309 300652 126757 97377 369844 -37364 93835 38762 152434
15974 152434 -176255 -137405 -129563 -368393 211016 -54536 157405 -333589 -230975 -166584
15964 -166584 -88432 129754 -21146 -235437 -122041 16946 -97894 59732 -52591 -181919 35589
15952A26914b3432B30072a01276d2256l18360K1838i2972A23628d35868e6490
15941a35127A62111b67629g4744E5167a13415N0975I4508b74166A47607n0536
15931I7071c95669d9865j53217m2068j52596a78806A36050I343b15420A90714
15920a9199j38534F7272J52323g4958H8895f6000k46573J36757A42476b18339
15909a34246j56143d4758k31830k370A79891M7140p0434a29827B5332q500J9379
15898C6211b7235A40209l3372b58559B54939b31002J5320G7063d29052a45594
15887C35354c5499k34379B49034n8050b12423A92518e8381o3370N491A55659B1185
15875c87814b1859q4075C0930a38247a4577q689r0295A44102a71693l175I7492
$$ plain form
15952 126914 -23432 230072 -101276 -42256 -360616 -338778 -92972 123628 -435868 -56490
15941 -135127 162111 -267629 -74744 55167 -113415 -62440 94508 -274166 147607 97071
15931 97071 -395669 -49865 -203082 -245150 -397746 -178806 136050 9343 -215420 190714
15920 -19199 -157733 67272 219595 -74958 88895 -66000 -312573 -175816 142476 -218339
15909 -134246 -290389 -44758 -276588 -278958 179891 227031 156597 -129827 25332 16832 36211
15898 36211 -27235 140209 106837 -258559 254939 -231002 -215682 77063 -429052 -145594
15887 335354 -35499 -269878 249034 190984 -212423 192518 -58381 -121751 -116260 155659 21185
15875 -387814 -21859 -105934 30930 -138247 -14577 -23266 -113561 144102 -171693 -174868 97492
15863a77103A24035B8577h8715e868F6893a15541j77300k42967A71043d3736D3066
15851a85793c2460B3450P0881a30161d7778A02458O7143g2111A36794a72951g3923
15839a0533D3019d6752m2757B43351A4998b4457B8793K8485B6890L00818D6084
15827c42399d2743B7747L2815J88843f3593j47489I7858i7275M5885C9396e520
15815b18578K7829k22894g593k46135e9424j70791B07712A3312i2494k76445a1086
15803h347m6366C0501f7063J9982J6781A66148J83805a3331j43383C57625j27206
15792B30419b4985k2651l5341F3554a95480D8674a58535B32210m4021E6574c6654
15780B27020q7705H174P0309f700A81524a03167o2254o6901A49594b61055k17687
$$ plain form
15863 -177103 124035 28577 -88715 -5868 66893 -115541 -292841 -535808 171043 -43736 43066
15851 -185793 -32460 23450 94331 -130161 -47778 102458 169601 -72111 136794 -172951 -73923
15839 -10533 43019 -46752 -89509 243351 14998 -24457 28793 57278 26890 327708 46084
15827 -342399 -42743 27747 60562 249405 -63593 -211082 97858 -97275 -51390 39396 -5520
15815 -218578 -190749 -413643 -7593 -253728 -59424 -230215 207712 13312 -92494 -368939 -11086
15803 -8347 -54713 30501 -67063 -47081 -30300 166148 349953 -13331 -156714 357625 230419
15792 230419 -24985 -47636 -82977 63554 -195480 48674 -158535 232210 188189 56574 -36654
15780 227020 139315 8174 78483 -6700 181524 -103167 -165421 -232322 149594 -261055 -478742
15769d78742J52135M1669i4863b8118l875l7258r4088C8339a09959B78835e0080
15757H0279A1875L6318A3306d45123E5340A7122a72705k08804A47037b67880C14153
15745h7060A68461i6624k2773B34767h6065A23259b33479a7880B55411j05169
15735A50242l0481L20770e4689A20639b68003m0421A15766h6160I3328e4275G5218
15723a32140C66914b80201e7646p3354l5895l34737B24953J04776D0676i097o1799
15712g0896k00803a17952j22281q2309a29514m1169Q2604k8029l5713C44244a66585
15700g933E537b05755A42701D2528c87168a2458o8522d0074j5767C649M50681
15689D54330b7864A68880o4197b90696l4548C9395f1597A60799a66512A2027a39705
$$ plain form
15769 -478742 -326607 -284938 -94863 -28118 -31993 -69251 -163339 38339 -109959 278835 -50080
15757 80279 11875 48193 13306 -445123 55340 17122 -172705 -381509 147037 -267880 314153
15745 -87060 168461 -96624 -119397 234767 -86065 123259 -233479 -17880 255411 150242
15735 150242 119761 440531 -54689 120639 -268003 -308424 115766 -86160 93328 -54275 75218
15723 -132140 366914 -280201 -57646 -131000 -166895 -501632 224953 329729 40676 -9097 -70896
15712 -70896 -271699 -117952 -240233 -322542 -129514 -170683 -88079 -116108 -151821 344244 -166585
15700 -7933 5537 -205755 142701 42528 -387168 -12458 -80980 -40074 -55841 3649 454330
15689 454330 -27864 168880 104683 -290696 -325244 39395 -61597 160799 -166512 12027 -139705
15677A69580h6365I1513h9337b913B64999A25025K43144G5569c867k18063E6872
15665E82J10715b45614H9310j9178b60960J12794B956N4568K2255a0394j56849
15654a67243A75569C5816e1514k72563g4168A85898c12253B06224a3394l8739
15644e2133A67882o7258R367d591j6145A96482b8225B6917a27954K348E4404b0822
15631a57193P0993p6084A17276J23742J9230m6020q8078b37106k26049A65404
15620b00069D0296J30726b66274A29138e3549R937A07324B2c6521B04760G7455
15608b98230p7732J48330D6430a58533b5110F8638a55224P3277a9192o9913E6765
15596F2368a50924e145o500k21613B9051b54297h1280C98512A4427J60647C8615
$$ plain form
15677 169580 -86365 91513 -89337 -2913 264999 125025 368169 75569 -3867 -221930 56872
15665 582 111297 -245614 89310 70132 -260960 -148166 2956 57524 79779 -10394 -167243
15654 -167243 175569 35816 -51514 -324077 -74168 185898 -312253 206224 -13394 -52133
15644 -52133 167882 100624 109991 -4591 -20736 196482 -28225 26917 -127954 -125606 54404 -20822
15631 -157193 -86200 -162284 117276 241018 260248 214228 126150 -237106 -463155 165404
15620 -200069 40296 171022 -266274 129138 -53549 -43612 107324 22 -36521 204760 77455
15608 -298230 -375962 -227632 46430 -158533 -25110 68638 -155224 -81947 -19192 -89105 56765
15596 62368 -150924 -5145 -11645 -233258 29051 -254297 -81280 398512 14427 175074 38615
15584a82910C9612a63190A15836c82596A8491Q5003a37759L0042D9396a27997
15573B1862M0289J60353l8151d0929p4819p8764F9734K54433c4056j43658b4839
15561G0328b4037A5174M26043G5612b91011a25399k43461D8989b59125M8018E5293
15549B27839m4733J60931e4832k47121R8363G1917b06195N8905A02717K6772P4917
15538B04406F7429M6819m36e5977l40562c2237B95340e5229C2571N43a2334A28192
15525a1441o7366p9961B06711a13397B42236A06686B7918a63947A23669A7950
15514b49065D75565i141C9319c02151A51128a50542A3167K49522C812c204l04900
15503c08104a20450k63840j18518I8695J06572c38689A4439i4121j56411D4755
$$ plain form
15584 -182910 39612 -163190 115836 -382596 18491 103494 -137759 -107717 49396 -127997
15573 21862 62151 222504 184353 -40929 -115748 -194512 69734 324167 -34056 -177714 -24839
15561 70328 -24037 15174 441217 75612 -291011 -125399 -368860 48989 -259125 -211107 55293
15549 227839 183106 344037 -54832 -301953 -203590 71917 -206195 -147290 102717 129489 204406
15538 204406 67429 114248 113812 -55977 -396539 -32237 295340 -55229 32571 33114 -12334 128192
15525 -11441 -78807 -158768 206711 -113397 242236 106686 27918 -163947 123669 17950
15514 -249065 475565 -9141 39319 -302151 151128 -150542 13167 262689 3812 -3204 -308104
15503 -308104 -120450 -384290 -502808 98695 205267 -338689 14439 -94121 -250532 44755
15492a87228c8328l33033A21730k5625I374e9969j87493g0835j42093A04558Q6891
15481A91449b9047E4313O0536O906f6830k42574G5531b84305B13564a16151L2083
15470h4068j22577j9058i4067d1821B20937i5690M0086B31739b24032A79758m5634
15459A34124N2766e3487C48603h2387A86925a66750d3047g023E0098b65815d9841
15447f6918A56828J96567c4449D7701L3142J07269o8276f6150a4535j6373k3037
15436e3945C28052j28374o1049a67900E6183b9195j6178j74209A16016J8890N1173
15425A86079c11162C0338c97278g2986o8979k34523d9239K0650J0709o7394I5716
15413f4678E0519L5750a16528k1274A76928D0663J28103i3499d0018r4428L1908
$$ plain form
15492 -187228 -38328 -371361 121730 96105 9374 -59969 -247462 -70835 -212928 104558 191449
15481 191449 -29047 54313 114849 121755 -66830 -309404 75531 -284305 213564 -116151 -84068
15470 -84068 -206645 -225703 -94067 -41821 220937 -95690 -55604 231739 -224032 179758 134124
15459 134124 186890 -53487 348603 -82387 186925 -166750 -43047 -7023 50098 -265815 -49841
15447 -66918 156828 353395 -34449 47701 80843 188112 119836 -66150 -14535 -30908 -53945
15436 -53945 328052 199678 138629 -167900 56183 -29195 -45373 -219582 116016 134906 186079
15425 186079 -311162 30338 -397278 -72986 -141965 -376488 -49239 -28589 -17880 -85274 95716
15413 -64678 50519 86269 -116528 -137802 176928 40663 168766 -93499 -40018 -134446 -102538
15402a02538B54947K9231b9063l60686C37173H7765a86002A61367B2019L00912
15392C22931E7728R5936F6685J26871a71859j75874A27778b29444K1162Q9516
15382a18766B27372M98A2879J07523k1244a13878p3755C8400g0917G0017c13708
15370B04962D8341a25883p4857j87608A29339b41410c4513q4171A28520b5003
15359b2730r3855o1306C24330b34680A50332l8919B9377L7343a03068k6519j58544
15348b88131J29504A05550a08878k12667A32857L1338b08693c7319A67911c3819
15337c45470I0059C8109J96839q8067o8242b95472a05472A18829a41774B29093
15326C5741g0542o6364F8026c64847A50767B3595a27538j20223A8151a51065A33753
$$ plain form
15402 -102538 254947 284178 -29063 -389749 337173 87765 -186002 161367 22019 322931
15392 322931 57728 153664 66685 193556 -171859 -347733 127778 -229444 -208282 -118766
15382 -118766 227372 227870 12879 120402 99158 -113878 -187633 38400 -70917 70017 -313708
15370 204962 48341 -125883 -200740 -388348 129339 -241410 -34513 -118684 128520 -25003
15359 -22730 -116585 -177891 324330 -234680 150332 111413 29377 66720 -103068 -129587 -288131
15348 -288131 -158627 105550 -108878 -321545 132857 164195 -208693 -37319 167911 -33819
15337 -345470 90059 38109 234948 146881 78639 -295472 -105472 118829 -141774 229093
15326 35741 -70542 -136906 68026 -364847 150767 23595 -127538 -247761 18151 -151065 133753
15314a24078B25159A11648J64662c07952A06736a19962m9066I8511B636P9245
15304H1881K23577b54589C47916I9704B8986K49596E8427c6600B55492j27358
15294A28134c39991C03871A13460L0141b83603Q2633C55380G0031A4814J59496
15284A74310D2441R9488m3875a5546A65087D5772A7232J30696j8141O7915L12414
15273E10116A44393c14664A14804L20301d8738A69795b7262i522B6919K6276K1622
15262G4817K38513b71298A51713a22963A86294N0775G1562J87311h808K835C92238
15250A53957R1149Q94236m83310J30320l6457l65887a59201B55357d7033E26908
15239A26770c31539a0320B10635l0959a15236G1119J0405r976P0027a47235k369
$$ plain form
15314 -124078 225159 111648 276310 -307952 106736 -119962 -169028 98511 2636 81881
15304 81881 305458 -254589 347916 99704 28986 278582 58427 -36600 255492 128134
15294 128134 -339991 303871 113460 143601 -283603 -200970 355380 70031 14814 174310
15284 174310 42441 141929 98054 -15546 165087 45772 17232 147928 129787 197702 510116
15273 510116 144393 -314664 114804 435105 -48738 169795 -27262 -9522 26919 53195 74817
15262 74817 313330 -271298 151713 -122963 186294 237069 71562 258873 -8808 -5973 392238
15250 153957 245106 1139342 656032 786352 749895 384008 -159201 255357 -47033 526908
15239 126770 -331539 -10320 210635 179676 -115236 71119 81524 71548 141575 -147235 -149604
15228a49604D5168g7592k4691A51117n1370J70467G5810J13367f3465B17456E7158
15216b4983A65012J33112G7851l6191j8246J86544c1225D2996a87846f8377A58514
15204C15911A31424c2209j31177B2524K543L422R0540A8084g5817E2017J60344
15193B12361C6268R346b89273A87932i7378A61708K40906D0406b15381d5523A63750
15181B33222c21825A94885L73772c48985D4085J3416a09770B61982a98487B10042
15170C84445n6580C5917i8705B96551j36818M7959a28594b6589k57129A4071e9563
15158b47295O2566p032B42533A11198A2619b0125D65481A39528g3901L079c1436
15146A05643a9253I1603L6817o1751K4754a44606g753l9735n8151D1357a03959
$$ plain form
15228 -149604 45168 -77592 -102283 151117 99747 270214 75810 189177 -63465 217456 57158
15216 -24983 165012 298124 77851 41660 23414 209958 -31225 42996 -187846 -68377 158514
15204 315911 131424 -32209 -163386 22524 25067 28489 119029 18084 -75817 52017 212361
15193 212361 36268 45614 -289273 187932 -97378 161708 402614 40406 -215381 -45523 163750
15181 233222 -321825 194885 568657 -348985 44085 57501 -109770 261982 -198487 210042
15170 384445 327865 35917 -98705 296551 159733 207692 -128594 -26589 -283718 14071 -59563
15158 -247295 -184729 -191761 242533 111198 12619 -20125 465481 139528 -73901 -70822 -31436
15146 105643 -19253 91603 128420 66669 91423 -144606 -7753 -47488 -105639 41357 -103959
15134B27350F8010j0557Q2162E5153M31073e0794D66996L2387k38374d7513A72181
15122c7347B43831a74599e8595C8123a05672B05156d2479A3478P7772A9795d76
15110I424M0385B3750J30981j0190j6734e385A48612D2053K10576H7386C2574
15098A00573J04298b35641B57890J20614B8382K038b90588A6628M02721h0962
15087A68178l2077m2450K3182p750h6955m8353A92110K01731A39622K03418G6518
15075f920H8184a52837B54473d7845g703A95266J6221k235r4591a09674C8235
15063B67557n9299J07713C5660h265H2086n982L52828k00537j04528J2349j8870
15052A17346k3145K45776j3051c0145D93026b01946D9251J99924O7482m6698l3591
$$ plain form
15134 227350 68010 57453 139615 55153 486226 -50794 466996 499383 261009 -47513 172181
15122 -37347 243831 -174599 -58595 38123 -105672 205156 -42479 13478 91250 19795 -476
15110 9424 49809 23750 154731 144541 127807 -5385 148612 42053 252629 87386 32574
15098 100573 204871 -235641 257890 378504 28382 30420 -290588 16628 419349 -80962
15087 168178 136101 93651 116833 109083 -86955 -135308 192110 393841 139622 343040 76518
15075 -6920 88184 -152837 254473 -47845 -7703 195266 211487 209252 114661 -109674 38235
15063 267557 208258 315971 35660 -8265 82086 76104 428932 228395 123867 136216 117346
15052 117346 94201 339977 326926 -30145 493026 -201946 49251 249175 316657 269959 236368
15041B36368B7937L07149A34083L48206Q0081A32975m8572J14008O2903l4518
15031B26796h6743K803B14423f2741I6161K54375C9317r738R543L6747O3869Q2963
15019B22701J4396a52366B77792a41125o7598D51593j96049J66004A45561n8976
15009H6585J72772j13656M7241i8319E10634B44115f4955A57211N8693G7836a70116
14997A24421F24L91646k3061E6104K62024q8002n929D1444K52402B741N87648
14986E90389D7087O5149J0817M28721q4160A74528G3426O3741N2364P1639J80428
14975D41598B06638C1537B068P6970P7087K26130K7649J13044j88518c0883p6864
14964a07747k3356C70662j71803K34746j06311A35908F0649P7411J01835r0231
$$ plain form
15041 236368 27937 335086 134083 482289 562370 132975 84403 198411 261314 226796
15031 226796 -86743 -83940 214423 -62741 96161 350536 39317 29579 39122 75869 139738 222701
15019 222701 237097 -152366 277792 -141125 -208723 451593 255544 421548 145561 86585
15009 86585 259357 145701 192942 -98319 510634 244115 -64955 157211 215904 77836 -170116
14997 124421 624 392270 369209 56104 318128 230126 224197 41444 293846 2741 590389
14986 590389 47087 112236 123053 551774 467614 174528 73426 137167 189531 261170 441598
14975 441598 206638 31537 2068 79038 156125 382255 409904 522948 334430 -30883 -107747
14964 -107747 -131103 370662 198859 433605 327294 135908 60649 138060 239895 149664
14954A49664k525Q3530F9656K67405D7810K63406J28594o6511A73852e0418D20945
14942A61517b0202A47671o8022e8235A05137J30485J30338J46851a76987C20196
14931C78488K79818l13930J27227j20368j73928o5923k3679L60784l8430k2794
14921C87265q4872I9699O8791l2876K99677A41070J67044j26920R2926A05769
14910C58510j10392j22589N6047K94711m4848k9602I2551J62228R1369A13307
14899B38593e5170E8577J70454r2229L788L72632j45367J2742E8981M50496j28083
14888C81394q3240r7603p1721L16085G2547a63212C55335M7234P120j59317K68124
14877E18496d519A86243J95349p8941j15648I1798K18670K133A13987L34014k14106
$$ plain form
14954 149664 147139 230669 69656 337061 47810 311216 439810 373299 173852 -50418 420945
14942 161517 -20202 147671 79649 -58235 105137 235622 365960 512811 -176987 320196
14931 378488 658306 344376 471603 351235 177307 111384 87705 448489 410059 387265
14921 387265 302393 99699 168490 135614 435291 141070 308114 181194 274120 105769
14910 358510 248118 125529 181576 476287 431439 401837 92551 254779 346148 113307
14899 238593 -55170 58577 229031 136802 140590 513222 367855 380597 58981 509477 381394
14888 381394 298154 200551 128830 444915 72547 -163212 355335 402569 409689 250372 518496
14877 518496 -4519 186243 381592 302651 187003 91798 310468 312601 113987 448001 233895
14866B33895m5640k3096L42765k21452E1284L91179A81677L68216q3912N5482
14856E21463j52342K25648A99881L69264O12j20075q7289K07267k16320j65604
14846A87736M42176A28775J22649A07052J60876q5094K0862J52381H3616K16792
14836C00408A30578L9390O04227C5314M59446q9086O7126r8741K49267B46936
14825B96712Q7911J08054j09057A58312K9243n4736M30117n6963K74913j78385
14815F02501o1827k57108K42146Q509J35828l24872J21082j03520A16128K27927
14805C44055L47902l41597K58852k82535Q0149o1462P5135K71546B20190R2432
14795C12622O8580J87391j21534A63668L61918K71733l68402J061J40013j9887
$$ plain form
14866 233895 188255 165159 507924 286472 51284 442463 181677 549893 465981 521463
14856 521463 369121 594769 199881 569145 569757 449682 362393 569660 353340 187736
14846 187736 629912 128775 251424 107052 267928 182834 203696 356077 83616 300408
14836 300408 130578 169968 774195 35314 494760 405674 472800 374059 623326 246936
14825 296712 384623 492677 383620 158312 187555 132819 562936 505973 780886 602501
14815 602501 540674 283566 525712 534221 670049 345177 466259 362739 116128 344055
14805 344055 691957 350360 609212 326677 406826 345364 420499 692045 220190 312622
14795 312622 381202 568593 447059 163668 525586 797319 428917 429978 569991 550104
14785E50104B15870N45467k80418O4567j29746N0362L6339J66629j03632L9244
14775F04682R022j07163M00439k40635j25577J94733r533j38596k43591J91459
14765E35240n154R171J3155m0771J83088k36728J75548M67516n34881H863N78087
14754E86950J00577j10508N6811J37152j30411J51260k12528Q7917j99053L09784
14744G77951j57419p512j51220M32097j81916N9832l26912M01991C62205L81828
14734G44033L22188E05869j30408N24636q1251j13470N5511p0374M7308J99097
14724I36918k66433O198Q7583r0920O7142q4636K21269J2926k57632J2010J92720
14713H37145j15043K770Q0245R1810r0278j54745J42390j30393M27790D99708
$$ plain form
14785 550104 215870 761337 480919 545486 415740 466102 502441 669070 565438 604682
14775 604682 613704 506541 906980 666345 540768 735501 725968 587372 343781 535240
14765 535240 530086 539257 552412 511641 694729 458001 633549 1101065 566184 8863 586950
14754 586950 687527 577019 633830 770982 640571 791831 579303 667220 468167 777951
14744 777951 620532 613020 461800 893897 711981 771813 444901 846892 362205 744033
14734 744033 1066221 505869 375461 900097 818846 705376 760887 690513 737821 936918
14724 936918 670485 676683 764266 673346 740488 655852 877121 890047 632415 644425 837145
14713 837145 722102 724872 805117 896927 806649 651904 794294 663901 1091691 499708
14702A052524D56117M64619m822o5614j01538j36947M48475k02075K00958l11225
14692G47948K5094J4884L44958m38325J40544K28221N3673l31219j7062M5299
14682H14015L03053m54019j1137L74727o2312K14942J6466j36415r1150n9391
14672I08779J38252J18812n82427J94018M4853j56908L06913J99371J0470k14206
14662I67927K8621k14352K38627j71126P3877J60049l0140j8751j42719K5680
14652I17693j21572M64017m77064K47258O033j11772R2743K70905k47476j66297
14642H74468P3885K20308l07315L79361l62866M67593n76626M62060l32165K84977
14632A183680l17062K9447N39199j47823j36349j01839K58673J7055j65011j03658
$$ plain form
14702 1052524 456117 920736 915914 850300 748762 611815 1060290 858215 1059173 747948
14692 747948 773042 787926 1132884 694559 835103 1063324 1116997 785778 768716 814015
14682 814015 1117068 663049 651912 1026639 964327 1179269 1195735 1059320 968170 908779
14672 908779 1047031 1165843 583416 777434 822287 665379 972292 1171663 1182133 967927
14662 967927 996548 782196 1020823 849697 923574 1083623 1053483 1034732 892013 917693
14652 917693 796121 1260138 783074 1030332 1036365 924593 1017336 1288241 1040765 874468
14642 874468 948353 1168661 861346 1240707 877841 1345434 768808 1230868 898703 1183680
14632 1183680 866618 896065 1435264 1287441 1151092 1049253 1307926 1324981 1159970 1056312
14622A056312J86256P5443j43686j75340N56788r7120m3426l3348N6601k47397
14612A191083L1717L18995m11330N6723m0288M83560j96778K1540K98519j38627
14602A615114k31210r1689J82080r0572p1322J4877N0311K87408k06596k4781
14592A433620N8336L0150m4994J45618j70348r5848L63439j18816p9624J3979
14582A535512J96434L7627J9378O780N7511j49733Q0254L6868J7011K80867j72031
14571A946478J74669o5703j04352j81349P43148n32050J68940L1035K22348o1378
14561B341786l230K04503k17946K44718j66623M55820O3879j76833O90881K24935
14551C661890P95135K19197J934363L311305P164952J5749393J4795473k3086712
$$ plain form
14622 1056312 1242568 1318011 1174325 998985 1555773 1458653 1415227 1381879 1438480 1191083
14612 1191083 1222800 1541795 1130465 1187188 1146900 1630460 1433682 1455222 1753741 1615114
14602 1615114 1383904 1292215 1474295 1383723 1312401 1327278 1377589 1664997 1458401 1433620
14592 1433620 1491956 1522106 1477112 1622730 1452382 1356534 1719973 1601157 1521533 1535512
14582 1535512 1731946 1769573 1788951 1795731 1853242 1703509 1783763 1820631 1837642 2118509 1946478
14571 1946478 2121147 2055444 1951092 1769743 2512891 1980841 2149781 2180816 2403164 2341786
14561 2341786 2338556 2543059 2325113 2569831 2403208 2859028 2922907 2746074 3436955 3661890
14551 3661890 4457025 4676222 6610585 9921890 17086842 32836235 47631708 24544996
14543B4544996A0063326m842279j975810r45489j93520n24254M32834m87268N05470
14534B033010k85851L09909R0653m75368J17934M22516L2450m1276l34811M02678
14524B271844l07619Q7596L76353O4029j94162j41488K59475j88534K8944k85455
14514A970983N95937k2134n11L0714L2770R9900K06159q1145l38695q9036J05639
14503B510581R1526J47386L32443l25805L5647K36457Q7793k11961J63977J36093
14493C204137j17628L12154m42475P99032n33100j30245J80166J30054k30537
14484C171558j37757L40858K2102j49j84855J80918J86801K97886j91287n6443
14474C629632K67307k86860r6847l2182L11627L40519m12695M75861l59818L52560
$$ plain form
14543 24544996 10063326 5221047 3245237 2299748 2106228 1581974 2014808 1527540 2033010
14534 2033010 1747159 2057068 2147721 1672353 1790287 2212803 2245253 2203977 1869166 2271844
14524 2271844 1964225 2051821 2428174 2492203 2298041 2156553 2416028 2227494 2256438 1970983
14514 1970983 2566920 2544786 2544275 2574989 2607759 2707659 2913818 2832673 2493978 2404942 2510581
14503 2510581 2602107 2749493 3081936 2756131 2791778 3028235 3116028 2904067 3068044 3204137
14493 3204137 3086509 3398663 2956188 3755220 3222120 3091875 3272041 3402095 3171558
14484 3171558 3033801 3374659 3396761 3396612 3211757 3392675 3579476 3877362 3686075 3629632
14474 3629632 3896939 3610079 3513232 3481050 3792677 4133196 3720501 4196362 3836544 4189104
14464D189104j41429J09711K17726r854J05539J14531K7535q8513K6255M07072
14454D957677j09271j88590N1952J29856J81805o3786M28384k93465L21912k47366
14444E169108J96647j31158L18983m38196M09281j0449J92767j46661N00315n55630
14434E505007M57682J38846K44046l46583K69659L40266m8781l6142k1492m8802
14424F453706J57515K30493J05114L8289M27951l79834N01436K00510k72395K10853
14414G673638L30391k20889L46143j27304P6883J56639K45349J10968J48425j33258
14404H606985J41575J53949K70260L61999n24013M52888L63355k19451O74271
14395A0281818O7864j2138J09720L06062k52165R79203m274K09460j64101L63684
$$ plain form
14464 4189104 4047675 4157386 4375112 4365258 4470797 4585328 4612863 4524350 4550605 4957677
14454 4957677 4848406 4659816 4711768 4841624 5023429 4959643 5388027 5094562 5416474 5169108
14444 5169108 5365755 5234597 5553580 5115384 5524665 5514216 5706983 5560322 6060637 5505007
14434 5505007 5962689 6101535 6345581 5998998 6268657 6608923 6560142 6524000 6502508 6453706
14424 6453706 6611221 6841714 6946828 6985117 7413068 7033234 7534670 7735180 7462785 7673638
14414 7673638 8004029 7783140 8129283 8001979 8078862 8235501 8480850 8591818 8740243 8606985
14404 8606985 8748560 8902509 9172769 9534768 9010755 9463643 9826998 9607547 10281818
14395 10281818 10349682 10337544 10447264 10753326 10501161 11480364 11476090 11685550 11521449 11885133
14385A1885133J43341L2154N84851J52942O7430O68694J24513L1041K40136K05523
14375A4135758M32364J45341L57543M82808K20028K26900K89658L37810P8206
14366A6706416M34864P45277O0244O45570M50288L06976K69523N42225L73025
14357B0534408O56372L61406K63283R49455L17979N92897N26049N85830P68339
14348B5556018O26970O40879J048758N44004Q61755L32257J031320O84242Q09110
14339C2135313J350020O02957P66831J048193J310876O76271J183716J518580
14331D0592757J053088J162127J628485J079128J385082J749336J469744K032304
14323E2152051J466532K116902J903678J917446K248585K279628K468007K566499
$$ plain form
14385 11885133 12028474 12060628 12645479 12798421 12865851 13534545 13659058 13690099 13930235 14135758
14375 14135758 14568122 14713463 15071006 15553814 15773842 16000742 16290400 16628210 16706416
14366 16706416 17141280 17886557 17946801 18592371 19042659 19349635 19619158 20161383 20534408
14357 20534408 21190780 21552186 21815469 22764924 23082903 23675800 24201849 24787679 25556018
14348 25556018 26182988 26823867 27872625 28416629 29278384 29610641 30641961 31326203 32135313
14339 32135313 33485333 34088290 34855121 35903314 37214190 37890461 39074177 40592757
14331 40592757 41645845 42807972 44436457 45515585 46900667 48650003 50119747 52152051
14323 52152051 53618583 55735485 57639163 59556609 61805194 64084822 66552829 69119328
14315F9119328K750405K946274K910082L334458L226114L338051L924956L821408
14307I5371076M295841M186739N056939N005793N197876N847675O292563O123171
14299A37377673P064988P257345P875808Q302279R068290R378833J0136711J0491671
14291B06953598J1193143J2031218J2951287J3224041J3768100J4695081J5389432
14284C00205900J5943783J6381995J6295575J6918818J6637850J6134934J5982840
14277D14501695J4270417J3636398J1725117R394670N627895K068366K78989j404947
14269D70098600j654391m246136n368880o923614r860428j1168781j3315704j5164053
14261D02396613j6685446j7005142j6626799j7491225j6068138j5976007j5460857
$$ plain form
14315 69119328 71869733 74816007 77726089 81060547 84286661 87624712 91549668 95371076
14307 95371076 99666917 103853656 108910595 113916388 119114264 124961939 131254502 137377673
14299 137377673 144442661 151700006 159575814 167878093 176946383 186325216 196461927 206953598
14291 206953598 218146741 230177959 243129246 256353287 270121387 284816468 300205900
14284 300205900 316149683 332531678 348827253 365746071 382383921 398518855 414501695
14277 414501695 428772112 442408510 454133627 463528297 469156192 471224558 471503547 470098600
14269 470098600 468444209 464198073 458829193 451905579 442045151 430876370 417560666 402396613
14261 402396613 385711167 368706025 352079226 334588001 318519863 302543856 287082999
14254B87082999j4948113j4241135j3721354j2730859j2285941j1373565j0925591
14247A96856441j0053460r543653r065024q082523p775663p281862p513883o250645
14239A31289728o399664n624818m748330n613665m635100m531735m454010l548380
14231I1734026l926376l331054l950438l160520k612888l108094k650854k474805
14223F6518997k261924k522198k215841j859423k091895j549365j989788k074398
14215D9954165j458519j387933j275537j113473j644600j403494j341772j030833
14207C9298004n93707p38889j467839j255629j219062o89698r50372n88633r75868
14198C0818307j082644l77606j124570p34358k45348m43174j241995q52710m54493
$$ plain form
14254 287082999 272134886 257893751 244172397 231441538 219155597 207782032 196856441
14247 196856441 186802981 177259328 168194304 160111781 152336118 145054256 137540373 131289728
14239 131289728 124890064 119265246 114516916 108903251 104268151 99736416 95282406 91734026
14231 91734026 87807650 84476596 80526158 77365638 74752750 71644656 68993802 66518997
14223 66518997 64257073 61734875 59519034 57659611 55567716 54018351 52028563 49954165
14215 49954165 48495646 47107713 45832176 44718703 43074103 41670609 40328837 39298004
14207 39298004 38704297 37965408 36497569 35241940 34022878 33333180 32382808 31794175 30818307
14198 30818307 29735663 29358057 28233487 27499129 27253781 26810607 25568612 24715902 24261409
14189B4261409q35106m75690m13156r908j211777m1396p27888n12891l21643k81544
14179A9430410o74406J06155n70080l93166p2526n19819n05414n28726p5065n98643
14169A5598720J33077n53712q0104o6281m91245k39704k35842m31596m12391l63695
14159A2857227Q3329k4114o24537N6925l02262n6976m23146l22585K0076J67542
14149A1431479m36170j64178k41438m41073J8393m6972k46696j69994l29850L17131
14139I690632l53897k10585j69495N9504l77196k803j615J43097n69917j90676
14129H017049K39219j08887l93329L6634k85449j76286K46283k52288k0805l83736
14119F918405J0055J3710k28995Q010o4353m14165M6995L36852n57239K92707
$$ plain form
14189 24261409 23426303 22950613 22537457 22527549 21315772 21274376 20546488 20033597 19711954 19430410
14179 19430410 18756004 18862159 18292079 17898913 17826387 17306568 16801154 16272428 16197363 15598720
14169 15598720 15731797 15178085 15097981 15031700 14540455 14300751 14064909 13633313 13220922 12857227
14159 12857227 12940556 12916442 12291905 12348830 12046568 11989592 11566446 11243861 11263937 11431479
14149 11431479 10995309 10831131 10589693 10148620 10167013 10120041 9873345 9703351 9373501 9690632
14139 9690632 9336735 9126150 8956655 9016159 8638963 8636160 8634545 8777642 8207725 8017049
14129 8017049 8256268 8147381 7754052 7790686 7505237 7328951 7575234 7322946 7302141 6918405
14119 6918405 6928460 6942170 6713175 6721185 6656832 6242667 6289662 6626514 6069275 6361982
14109F361982o0165l37140l2375J51791j84313k96882K72553k98907j58823L6190
14099E453911j76942J78904Q798j78798P972N7541l45836n6640r9904O7082J17691
14088E033779l43615k09854K10492j59677L3261k92667K92853o544l77236q1044
14078D099748L21790k07830n2843J24788r3915M440k77986K33282m15638J66110
14068C901946J50840m592j23178p33k05160k01335P1618r9378K56629m36692L19185
14057C629150l27010J25270J56342K50222l74284j80107R3058K6825j08586M2730
14047C333610k36070m2283k37063R7407J11582Q956o6272j47455J13692l26912
14037B609192K91922K07023k40110J01814q6432P1314l92288L87972m69718K09312
$$ plain form
14109 6361982 6301817 5964677 5932302 6084093 5899780 5602898 5875451 5576544 5417721 5453911
14099 5453911 5276969 5455873 5464671 5285873 5293845 5351386 5005550 4948910 4849006 4916088 5033779
14088 5033779 4690164 4480310 4690802 4531125 4564386 4271719 4564572 4558028 4180792 4099748
14078 4099748 4421538 4213708 4160865 4285653 4191738 4196178 3918192 4151474 3735836 3901946
14068 3901946 4052786 4048194 3925016 3924283 3719123 3517788 3589406 3490028 3746657 3309965 3629150
14057 3629150 3302140 3427410 3583752 3833974 3459690 3279583 3372641 3399466 3290880 3333610
14047 3333610 3097540 3055257 2818194 2915601 3027183 3036139 2969867 2822412 2936104 2609192
14037 2609192 2901114 3108137 2868027 2969841 2883409 2954723 2562435 2950407 2480689 2690001
14027B690001k77490N38219p24516J83120J5172K64197k89022L5475K005o3048
14017B374113P9409j68745K02548l34423k8177r9366M4760O69339p86787j96699
14007A755972M27569p5544Q66k74960J99682L10196r2883j80045J72896m83351
13997A760398J23613R0314N7029M9959n9879J45922M5878J61526Q21868K182240
13987E378868N191176J4156612K1206113j6008477j4735647o269212k942058j267178
13979D710197j051563n17946j30400j28671j72226j81469j09148J75029m61408
13970B132395O7687l2529J1379j51650K05595k5159k45982r5269Q3741J48578
13960B098786k32721J50670O0124k44436j29882R106l43712L56542M6426Q3104
$$ plain form
14027 2690001 2412511 2950730 2226214 2409334 2424506 2688703 2399681 2435156 2437161 2374113
14017 2374113 2453522 2284777 2487325 2152902 2124725 2025359 2070119 2739458 1952671 1755972
14007 1755972 2183541 2107997 2108863 1833903 2033585 2343781 2250898 2070853 2243749 1760398
13997 1760398 1884011 1974325 2031354 2081313 2021434 2167356 2213234 2374760 3196628 5378868
13987 5378868 10570044 24726656 45932769 29924292 15188645 8919433 5977375 4710197
13979 4710197 3658634 3140688 3010288 2881617 2709391 2527922 2418774 2593803 2132395
13970 2132395 2200082 2167553 2178932 2027282 2232877 2207718 1961736 1866467 1950208 2098786
13960 2098786 1866065 2016735 2076859 1832423 1702541 1711647 1367935 1724477 1770903 1854007
13950A854007j34006K4694j92702M3205l3485M35766k73595L6029l71814j02689
13940A285410R0618M08758l41902j3067L01349j70450Q2013j63292L10441k27464
13930A562414K93019m48066J3578J46646p7505k68234M18129j85190p3373O2857
13920A444275N60541G19645P28194m31830p1264p2840N20791l11675K53336O2376
13910A396733K65562j22969n70746L87301j32544L81726l20790k01704K79707
13901A362276r7149n9665o9667K39986l38106L6033l4737J77930j46768L75281
13891A445414m42433j08389L16042k30093K98248O594N3169k55479J58492k42397
13881I99168k1238K08964j05351O8500n45412N54117K69778j00908m20777r92
$$ plain form
13950 1854007 1720001 1744695 1551993 1595198 1561713 1997479 1723884 1759913 1388099 1285410
13940 1285410 1376028 1784786 1442884 1429817 1731166 1560716 1642729 1479437 1789878 1562414
13930 1562414 1855433 1407367 1420945 1567591 1490086 1221852 1639981 1454791 1381418 1444275
13920 1444275 2004816 719645 1447839 1016009 944745 871905 1392696 1081021 1334357 1396733
13910 1396733 1662295 1539326 968580 1355881 1223337 1605063 1284273 1082569 1362276
13901 1362276 1265127 1205462 1135795 1375781 1037675 1073708 1038971 1216901 1070133 1445414
13891 1445414 1002981 894592 1210634 980541 1278789 1285383 1338552 1083073 1241565 999168
13881 999168 977930 1186894 1081543 1150043 604631 1158748 1428526 1327618 906841 905849
13871I05849J91384j80356O2240L8182J71738k32757k08327K93275J60334k57682
13861I43880k06323K43407P4807J6668l20249J75219o3520J52126J36092m73230
13851F78877L75530J46349n25485J81620k48608K29444p4989M94557n47916J47522
13841H56901j94205Q2324j24551L84342j75162k6587R806P2890j22113k9626M07668
13830A141687n24836L36637k98180M88344n26993n258J90576j0788r9000J78874
13820H71063k28698N8878o1271n8761k78792L55265L62229k48707J73565j93388
13810G51383J04496k17239q3900L46980l76430P8545J61781j20896L20813j45273
13800H20260K0709J02553J01886k97806k8845C44271J93646K179J56553o0382
$$ plain form
13871 905849 1097233 916877 979117 1017299 1189037 956280 747953 1041228 1201562 943880
13861 943880 737557 980964 1055771 1072439 752190 927409 863889 1016015 1152107 678877
13851 678877 1054407 1200756 675271 856891 608283 837727 762738 1257295 709379 856901
13841 856901 662696 745020 620469 1004811 829649 803062 812868 885758 763645 734019 1141687
13830 1141687 616851 953488 655308 1143652 616659 611401 801977 791189 692189 871063
13820 871063 642365 701243 639972 581211 302419 657684 1019913 771206 944771 751383
13810 751383 855879 638640 554740 901720 525290 603835 765616 644720 965533 820260
13800 820260 840969 943522 1045408 747602 718757 344271 537917 540096 696649 636267
13790F36267k41783K59350J48885l91169J84238J60269C21584M15001k53304j396
13780D81885L26251l37932o3019J91553K32072k05109Q1949J40797j57814C44005
13769C30157J05795J21087J70808j54874J51512B56616K92852j91252N9475L01359
13759G19050K38955m41462J10031j53781k33943K34029N7184P390r5901K23812
13749F65364j16981J64062j78743n7932Q1972k22881K25241J264K38678o4538
13739G35506Q6625c5031D55314k531K79988j97885N54Q6226O5535l08361J93029
13728E71869K1314M7620M6573j96772j36321l6468J64538K67985l37287M0502
13718D53553O3370J44427j06586J80500l54307L13695j49940q41k24502k0880
$$ plain form
13790 636267 394484 653834 802719 411550 595788 756057 321584 736585 483281 481885
13780 481885 808136 470204 407185 598738 830810 625701 707650 848447 690633 344005
13769 330157 435952 557039 727847 572973 724485 256616 549468 358216 417691 719050
13759 719050 958005 516543 626574 472793 238850 472879 530063 537453 441552 665364
13749 665364 548383 712445 533702 475770 557742 334861 560102 561366 800044 735506
13739 735506 822131 -35031 455314 452783 732771 534886 535440 621666 687201 378840 571869
13728 571869 593183 640803 687376 490604 354283 317815 482353 750338 413051 453553
13718 453553 516923 661350 554764 735264 380957 694652 544712 543871 319369 298489
13708B98489M14192B19726M48569k15639l6346J22203H8056N02279j87239K3336
13698D26432J52526j21013j64350j14236P8668m1909M09402k59833K27457B33731
13687C33105J13299p7532J90112q9854o2313L78576B08768Q7328J11039J51518
13677E58653j58103M9158j46486J96659A61157L90933K3639k19808K38411q7838
13667E06494B14270K3462J18158J78720M455F873L56633K26663B52963I3278K12638
13656C05916o6822L59262B45395J28807J87191B49322J92561J13474k1113j06528
13646D27716k1028O164J55079k61684J23127a23427F63168G6227L07580p9526
13636C04281L19577k33849J00692j07699J57393k46242a33447C10834A44629J41002
$$ plain form
13708 298489 712681 219726 668295 452656 416310 538513 88056 590335 403096 426432
13698 426432 578958 457945 293595 179359 258027 216118 625520 365687 593144 233731
13687 333105 446404 368872 558984 469130 406817 785393 208768 296096 407135 558653
13677 558653 400550 449708 303222 499881 161157 552090 575729 355921 594332 506494
13667 506494 214270 237732 355890 534610 539065 6873 363506 590169 252963 93278 305916
13656 305916 239094 598356 245395 374202 561393 249322 441883 555357 534244 427716
13646 427716 406688 412852 567931 306247 429374 -123427 663168 76227 383807 304281
13636 304281 623858 390009 490701 383002 540395 294153 -133447 310834 144629 285631
13626B85631I1340L42236j32530o077J90073B17873r5034J5241J47824A18243
13615H4013J38141P3968M1847o2754K44896C8172P0798L46403A79936K63630G3813
13603B99521m857m316lJ66946B09707K11497c872D87562A8435L96728j81032L56687
13591E90818B48234k0472M33012B73781J76544m301k6083j54124K14096j36023
13581C43890r6697E4879L53627c1413A50162o2659L97155J24527B99992J1955
13571C11947b8285A86390L00703B09288D6606L77106J45533r2125L01202k57558
13561E20764A80815Q1018m9887q3536B3665K81505J07306j65560k8809j3534j02093
13550A02480J78820j33022R6941J46346j07864l3012D8428J21927m9945M82733
$$ plain form
13626 285631 91340 433576 301046 294969 485042 217873 122839 138080 285904 118243
13615 84013 222154 296122 337969 275215 520111 38172 108970 455373 179936 443566 73813
13603 299521 294664 290348 290345 457291 209707 421204 -3872 487562 18435 415163 234131 590818
13591 590818 248234 227762 660774 273781 450325 446024 419941 265817 479913 343890
13581 343890 247193 54879 408506 -31413 150162 87503 484658 609185 299992 311947
13571 311947 -28285 186390 487093 209288 46606 423712 569245 477120 778322 520764
13561 520764 180815 261833 211946 128410 23665 305170 412476 246916 218107 204573 102480
13550 102480 281300 148278 245219 391565 283701 250689 48428 170355 120410 603143
13540F03143P4451B94616b08176A67183J53996j08440O2087j23637h4656B38392
13529D6452L08321J37334k4129A54489p2738J75754q1438K9756J45686l133r387
13518C38989D2825K29765P4952p8703A04106J89910n5208o0347J24373j4553j02362
13507A85919H6437J97250a15696C93327i8006B53462H5186l988l3630M9379B5371
13495A50284J20479J36222J03224a23603a579k09136B75209J76554p2069o2537
13485C17157J35877a64112B61226J76740j96251m177e2731A62938K02290A63548
13474A04483b11437A27054O3331E3790c0411E2567K11686K2581E5015K60384n2423
13463B62976b9007B61279J70374j56691a79410D37516p100n7960J05598e9711
$$ plain form
13540 603143 677594 294616 -208176 167183 321179 212739 274826 151189 -84656 238392
13529 46452 354773 492107 467978 154489 81751 257505 176067 205823 351509 348376 338989
13518 338989 42825 272590 347542 268839 104106 294016 238808 178461 302834 288281 185919
13507 185919 86437 283687 -115696 393327 -98006 253462 85186 81198 47568 96947 25371
13495 150284 270763 406985 510209 -123603 -1579 -210715 275209 451763 379694 317157
13485 317157 453034 -164112 261226 437966 241715 237538 -52731 162938 365228 163548
13474 104483 -211437 127054 190385 53790 -30411 52567 264253 286834 55015 315399 262976
13463 262976 -29007 261279 431653 274962 -179410 437516 430416 372456 478054 -59711
13452A14029O5649c1993J5248B43263B8408J78983J22240I0011M6944K1352n821
13441A52486c5800C32374n7517A2411J69660G2573N9573A0639M56964O451j60903
13430C13151o7587q3917E4362J26961J44374F375J29734L00430D1495J99003c773
13418F22407k57833a49161F12127B32574c7764A81216f8976D32699j55640k9156
13408B47903I2092J3299g7444C73744A33746k610m1519Q5178J96553j57880j03690
13397A09778K15117r7754K33295A0425K66575c85707E4912J93928b55777A01259
13386c26107a17507C01984N6628j03052g071n9629B30043j14134j9664J22082
13376B18327L22283k58134j14443J48868q1653p0226a34712B22897F1223K04538
$$ plain form
13452 114029 179678 -31993 -16745 243263 28408 207391 329631 90011 136955 158307 152486
13441 152486 -35800 332374 274857 12411 182071 72573 132146 10639 467603 474054 313151
13430 313151 245564 161647 54362 181323 325697 6375 136109 436539 41495 240498 -3773
13418 622407 364574 -149161 612127 232574 -37764 181216 -68976 432699 277059 247903
13408 247903 92092 105391 -77444 373744 133746 131136 89617 174795 371348 213468 109778
13397 109778 324895 227141 460436 10425 277000 -385707 54912 248840 -255777 101259
13386 -326107 -117507 301984 358612 255560 -7071 -66700 230043 115909 96245 218327
13376 218327 540610 282476 168033 316901 235248 165022 -134712 222897 61223 265761
13366B65761o5089K0644J0562R9248r7417A06909K12555A03305j0353k7991J97832
13355B62793m5426L3374j05986n8367K2378L5487J22619L8755M5084q9831M06841
13344F67721A91254J99572J61076k19842j49860K59187I2239J64642M9297J35491
13334D41669k10421k2124b58223D5092J73935j5005p9371O2672r0694J05413N4207
13323B56249a00745B28385J17428n4737F3736K90652A67540k9489P435J13389
13313B58875p8180h1748C26597A61303m3310d8438B16555b57333A59664n2920
13303A06744m4282J83300c1217D11148A11669B4064J92268D0645O0790L3002J45933
13292B80370B4404O4944R4964b9938A40772O7713b27739C15203H6854b93424A28105
$$ plain form
13366 265761 200672 221316 231878 331126 233709 106909 319464 103305 92952 64961 262793
13355 262793 217367 250741 144755 86388 108766 144253 266872 305627 350711 260880 667721
13344 667721 191254 390826 551902 332060 182200 441387 92239 256881 306178 441669
13334 441669 231248 209124 -258223 45092 219027 204022 124651 187323 96629 202042 256249
13323 256249 -100745 228385 345813 291076 63736 354388 167540 138051 145486 258875
13313 258875 180695 -81748 326597 161303 117993 -48438 216555 -257333 159664 106744
13303 106744 62462 245762 -31217 411148 111669 24064 216332 40645 101435 134437 280370
13292 280370 24404 89348 184312 -29938 140772 208485 -227739 315203 86854 -293424 128105
13280b7627A5936J8505L8354K12987A21890m4903b56292D29722j48131g8474j48461
13269b26935A80561K2810E7222l744j3215O1623b83528B31913A10537J37597c49239
13257C76530a062G2259a38561H5487J68652A11805K84646J59776C2242b7822m5428
13246g3250G0780k9522a9360l45495B69020n4474Q1117b14554B41384J2555N2291
13235C06230h3738E6533K35285A07231J31963q8171M9562R7467G6982b43152A82606
13223E4284b5013m0506j94066b9495A77461o4766K0628J46829j26678j8371R2908
13212B28011c3043A73499o9608j7753a00012C02175B5254J77042b28587d6716
13201b06671C8498L40636F7541f2708l40092F9282J1647K18543p9555a72358j2936
$$ plain form
13280 -27627 15936 34441 72795 285782 121890 76987 -256292 429722 281591 -78474 -226935
13269 -226935 180561 203371 57222 53478 40263 101886 -283528 231913 110537 248134 -349239
13257 376530 -1062 72259 -138561 85487 254139 111805 396451 556227 32242 -27822 -73250
13246 -73250 70780 41258 -19360 -364855 269020 214546 295663 -214554 241384 253939 306230
13235 306230 -83738 56533 291818 107231 239194 151023 200585 298052 76982 -243152 182606
13223 54284 -25013 -65519 -259585 -29495 177461 112695 133323 280152 153474 135103 228011
13212 228011 -33043 173499 103891 86138 -100012 302175 25254 202296 -228587 -46716
13201 -206671 38498 379134 67541 -62708 -402800 69282 80929 299472 219917 -172358 -185294
13190a85294A79929a58083P7385B18023F5973c5079B11428F2495A3630b5426A0807
13178d9395C58301a9068A718a42102A00788a78145e7528r5306C2879J51655p8633
13167A05901K13913n1425k830P1116j39989j6230n6088J07956o6687N958b65651
13155A34177J6043b13379C10540b03191A96250K0452b1709l22886b8327c942q231
13144a2173q1093G9524M7296m8482J03807c68972a77395a9140C9653a53233a8152
13132G3322M9280a71693j86440J59660G7163a01258D06521a00880j92054p3949
13122c66883C15396A50137L6774k1970J58636f7928B05628I5409a86286B57468
13111A13954K94506A19268F892a36138H9784J56998k5096r5494m3511R2156b19722
$$ plain form
13190 -185294 179929 -158083 -80698 218023 65973 -35079 211428 62495 13630 -25426 10807
13178 -49395 358301 -19068 1718 -142102 100788 -178145 -57528 -152834 32879 184534 105901
13167 105901 319814 268389 265559 336675 196686 180456 124368 232324 165637 171595 -265651
13155 134177 150220 -213379 310540 -203191 196250 216702 -21709 -344595 -28327 -3942 -12173
13144 -12173 -93266 79524 126820 78338 182145 -368972 -177395 -19140 39653 -153233 -18152
13132 73322 122602 -171693 -358133 -198473 77163 -101258 406521 -100880 -292934 -366883
13122 -366883 315396 150137 186911 164941 323577 -67928 205628 95409 -186286 257468
13111 113954 408460 119268 6892 -136138 89784 246782 221686 126192 82681 174837 -219722
13099E9552i7824E3275J25958B8410e315A78621p0432J05518A02417e4744j63002
13088b17746B6266K00349A08147M446m9682L6055J51636J83849k14122F8172J83092
13077B51264d5494B6199M0901J92208A10478E3987J07008c3934j71202C08119
13066E40630i8169E543L5568Q980K2589L63962G6239a45384A51589K4355k063
13055A73881c28688B35760b5417D22568A1217L16221A47934c04159A50870J01222
13045B52092q4197L52154a10719A83682k5161a57329B65511p3929P2441C8252
13034A61617m0747l8956a07923A38309b5940A42970m0449a0911B34811O0841l4133
13023B61519C2602a897A06637c0915p9089e1094l25235a58876C01515A48239L22593
$$ plain form
13099 59552 -97824 53275 179233 28410 -5315 178621 108189 213707 102417 -54744 -217746
13088 -217746 26266 226615 108147 112593 62911 98966 250602 434451 220329 68172 251264
13077 251264 -45494 26199 67100 259308 110478 53987 160995 -33934 -205136 308119
13066 540630 -98169 5543 41111 50091 72680 436642 76239 -145384 151589 175944 173881
13055 173881 -328688 235760 -25417 422568 11217 327438 147934 -304159 150870 252092
13045 252092 167895 520049 -110719 183682 158521 -157329 265511 191582 264023 38252
13034 161617 120870 81914 -107923 138309 -25940 142970 102521 -10911 234811 295652 261519
13023 261519 32602 -1897 106637 -30915 -110004 -51094 -376329 -158876 301515 148239 470832
13012D70832F0556J11379J89643a2443A07067n899b6486k3316D0430b9557k08256
13001b37813g314l39845F8156d3208p5298k7129L5007A54788a88609C16361A31699
12989A9151b68367h385j3730G7815J00207K0199b31468Q3984O7963E9899a80225
12977D44527j96270n4969C0487c2397p9690A05352e674A84288b6239k6473G3482
12965B73148e7417j95554I4450n621B3335J7453L59842m9052b50528E0433j7413
12954C3020b44728J6745D48890a01342A04619a71622C5626O9964B3604b84295
12943a83817A42510F8420L6841R6328k716m0211a8950A8816n45R4718J68348b10320
12930e5064H79i0557m9479M5320A29233a6337k90562a6862j00421b7097A40765
$$ plain form
13012 470832 60556 171935 361578 -12443 107067 101168 -26486 -49802 40430 -29557 -237813
13001 -237813 -7314 -347159 68156 -43208 -118506 -145635 -110628 154788 -188609 316361 131699
12989 19151 -268367 -8385 -22115 77815 178022 198221 -231468 -147484 -79521 59899 -180225
12977 444527 248257 193288 30487 -32397 -112087 105352 -5674 184288 -26239 -52712 73482
12965 273148 -57417 -252971 94450 88829 23335 40788 400630 351578 -250528 50433 33020
12954 33020 -244728 -227983 448890 -101342 104619 -171622 35626 105590 23604 -284295
12943 -183817 142510 68420 105261 201589 198873 158662 -18950 18816 18271 112989 281337 -210320
12930 -55064 879 -90557 -140036 -94716 129233 -16337 -306899 -16862 -117283 -27097 140765
12918B74599a0221k5004F5226a8598O48k58374Q6248A4401a39462G9781B1689
12906b89021D7768J51593f3068A50209e201A2082b86173M822f9097B22716M21920
12895F44636A0894N05015F2831R8233h3524B49070E7377b41712a18589A6014J00682
12884A16696b9623R602A83600q9215C4145d06329h6554j99412a29628j72636C08791
12872B50044j22974o1452L20037A66747C0869b59218B319R3098J70139j19584
12862A45972D9008h0348A37573E7923a65974O5184B25343g6784j6554j22000F6270
12850a86881K044I233b13333p7578Q3120R3071a7361F1824O81749A39051e494
12838a8738A33781C9617b4740E7827B0319J20743a95272n8339J16795N1808k21010
$$ plain form
12918 274599 -10221 -35225 65226 -18598 -17950 -276324 -190076 14401 -139462 79781 21689
12906 -289021 47768 199361 -63068 150209 -5201 12082 -286173 -281351 -69097 222716 644636
12895 644636 10894 515909 62831 161064 -83524 249070 57377 -241712 -118589 16014 116696
12884 116696 -29623 -20021 183600 94385 34145 -406329 -86554 -285966 -129628 -302264 308791
12872 250044 127070 65618 385655 166747 30869 -259218 2319 95417 265556 145972
12862 145972 49008 -80348 137573 57923 -165974 -100790 225343 -76784 -93338 -215338 66270
12850 -186881 -184837 9233 -213333 -290911 -207791 -114720 -17361 61824 743573 139051 -5494
12838 -18738 133781 39617 -24740 57827 20319 141062 -195272 -253611 -136816 -85008 -306018
12827c06018B17513c29174J25286N2175K7054C47366f2451B40745b51647f8494
12816G4846b19710j04404e8547I0041i6582B6518a56342B51344F9903i0877B03733
12804a10590m52519b06795E4017J13552a16671G2667b60094G9579c87338B7411
12793c0852j95742A03856N1482K70396j41064h8844E5259a6311q5006n647j20380
12782b27344F5090P6768J70268a39558A94326R8812a54082M5378j18094A34188
12771c90137A61976E4435j3551j7851g0818F8667a53424B90061A13482K5755a60085
12759e1376B08442b30135I8226a0800A39649a01161A65965M2115i6196B31500
12748A53252p6255c8254m6209n9433E8188b9397k0443o5999d501r5874N610D32365
$$ plain form
12827 -306018 217513 -329174 -203888 -151713 -124659 347366 -62451 240745 -251647 -68494
12816 74846 -219710 -324114 -58547 90041 -96582 26518 -156342 251344 69903 -90877 203733
12804 -110590 -563109 -206795 54017 167569 -116671 72667 -260094 79579 -387338 27411
12793 -30852 -226594 103856 155338 425734 284670 -88844 55259 -16311 -101317 -106964 -227344
12782 -227344 65090 141858 312126 -139558 194326 293138 -154082 -108704 -226798 134188
12771 -390137 161976 54435 40884 23033 -70818 68667 -153424 290061 113482 139237 -160085
12759 -51376 208442 -230135 98226 -10800 139649 -101161 165965 208080 -96196 231500
12748 153252 76997 -38254 -84463 -143896 58188 -29397 -49840 -115839 -4501 -100375 -94765 432365
12735D69003j75833A32386L40139A12045a2297j57664B14026e7150b8310A4893
12724B38739a37474L0536l043b0084B2536c5981A35344c48729B9022b65426F7178
12712B16609c07726f8923B91173j34365G1210a41108C47840m3877o115b1483n5884
12701g7367C19348h250B59854K7341a24099A36959B5254N8004G283a66689L2860
12690a33829B34172o249r7684R4125a48q3227j83818B84086K44780h0655C96837
12678H0047L10889D2498J70519a49608n1395a7566B29705K0895D5159K87827q3346
12667B49640B8997c8087C04638e8304K4737o2268A40974B956P8232R7374A107
12655C35735A5603a38423I2964C3880K87477G8617J22368q6616a31416j4576g0123
$$ plain form
12735 469003 293170 132386 472525 112045 -12297 -169961 214026 -57150 -28310 14893
12724 238739 -137474 -106938 -109981 -20084 22536 -35981 135344 -348729 29022 -265426 67178
12712 216609 -307726 -68923 291173 156808 71210 -141108 347840 303963 297848 -21483 -77367
12701 -77367 319348 -8250 259854 287195 -124099 136959 25254 83258 7283 -166689 -133829
12690 -133829 234172 227923 130239 224364 -148 -83375 -267193 284086 528866 -80655 396837
12678 80047 390936 42498 213017 -149608 -201003 -17566 229705 250600 45159 332986 249640
12667 249640 28997 -38087 304638 -58304 -33567 -95835 140974 2956 81188 178562 1107
12655 335735 15603 -138423 92964 33880 321357 78617 200985 114369 -131416 -145992 -70123
12643f1107O042o538D70578A89154f8470A14072D9478M99663A02853f0231m6949
12632a07180A76481j9416Q4261R4656J45342A66104n6164C9307J57172n4248b60959
12620B21504n4687A1336L61614f8832B10093a19095B28642E5610g5818C44195
12609C26879a48516C57009A41094a7412N568H8308a74788B56869n7294J29852
12599C29427a08500A19343a80943A60278J31362j14607B1168P5325J85200m1969
12589B39724G7179i0080A12531b06763B8181J33286n3143a9406B33043b5895A34968
12577G5123f5708k55040C59932f7866A81051a51063F4136g0923n1868B45595a53263
12565D5772b48544A00326a40406E0602a73349E9407b24155D2851a35836A10694
$$ plain form
12643 -61107 -55065 -61603 470578 189154 -68470 114072 49478 549141 102853 -60231 -107180
12632 -107180 176481 157065 241326 335982 481324 166104 109940 39307 196479 142231 -260959
12620 221504 166817 11336 372950 -68832 210093 -119095 228642 55610 -75818 344195
12609 326879 -148516 357009 141094 -17412 -11844 88308 -174788 256869 199575 329427
12599 329427 -108500 119343 -180943 160278 291640 177033 21168 96493 281693 239724
12589 239724 77179 -90080 112531 -206763 28181 161467 108324 -19406 233043 -25895 134968
12577 75123 -65708 -320748 359932 -67866 181051 -151063 64136 -70923 -122791 245595 -153263
12565 45772 -248544 100326 -140406 50602 -173349 59407 -224155 42851 -135836 110694
12554A72514J49337O3261E2486d01210B30762d12012J84015A38709J06013j08429
12544A36293a78257C54105a23101D4976b54773A33244D9791F617h5862k54648
12534c40510h7053C0785b0478p0240A14809a60528j23401D44052j27686j28648
12524A87718K1652C5634i0313B4300d21040C05864a53342j16348B22799a98961
12513b43327A60924a48066m0933A11663K45177b2922l5469A40657d1219A74739
12502A11678b00657r9579a6060m6974A82325g6879A81268K60271a57257D10024
12491e7813C8783M3445B9593b63049m1276h9132I9534B4343K3566a34226B18825
12479D2741c4809A80666a28042C963J08241b04106A83737a2437E7461F127O2548
$$ plain form
12554 172514 321851 385112 52486 -401210 230762 -412012 -227997 138709 244722 136293
12544 136293 -178257 354105 -123101 44976 -254773 133244 49791 6617 -85862 -340510
12534 -340510 -87053 30785 -20478 -90718 114809 -160528 -283929 444052 316366 187718
12524 187718 209370 35634 -90313 24300 -421040 305864 -153342 -269690 222799 -198961
12513 -243327 160924 -148066 -188999 111663 356840 -22922 -58391 140657 -41219 174739
12502 111678 -200657 -300236 -16060 -63034 182325 -76879 181268 441539 -157257 410024
12491 -57813 38783 82228 29593 -263049 -304325 -89132 99534 24343 47909 -134226 218825
12479 42741 -34809 180666 -128042 3963 112204 -204106 183737 -12437 57461 6127 68675
12468F8675b24913R6579A13711a10001c0858A65815F5763a8708l04499A59178
12457A7737c49749l2327C7212b42794A82866b61504A4567f2476G7400a89395C30981
12445g9143A07053b47159i6591j91937H2332G828d15745a70579A54285a5198I1104
12433a22519b1150F5667a15340j38273H1584i395I1282a44704p1409A11283N7122
12422A68405J29789a61276F6181L6879j829e3862l21668i1337i861k64556C57055
12410A82848e266q3464J2605b8447Q710G6705d8547p6772B52069c12836c5764
12398b44232j27675A85790b10213I7769a68244d3830B7388h1091j15058D05952
12387B27738b60325d7423B41903a12303C3326j0038J61850C6858a50654D64111
$$ plain form
12468 68675 -224913 -128334 113711 -110001 -30858 165815 65763 -18708 -323207 159178
12457 17737 -349749 -382076 37212 -242794 182866 -261504 14567 -62476 77400 -189395 330981
12445 -79143 107053 -247159 -96591 -288528 82332 7828 -415745 -170579 154285 -15198 91104
12433 -122519 -21150 65667 -115340 -253613 81584 -9395 91282 -144704 -216113 111283 168405
12422 168405 298194 -161276 66181 103060 101231 -53862 -375530 -91337 -9861 -274417 357055
12410 182848 -5266 -88730 -76125 -28447 -19737 76705 -48547 -125319 252069 -312836 -35764
12398 -244232 -371907 185790 -210213 97769 -168244 -43830 27388 -81091 -196149 405952
12387 227738 -260325 -47423 241903 -112303 33326 23288 185138 36858 -150654 464111
12376B69306J48707b58693C4419K32391j26900b46703A87311F0816d6307j1378
12366e7685k79297a42790d9065A88728b8258k58641B60112j07373D7624i0382
12355C6312a57561B7360a40610B94537c12142M3369O4707B68411k0849a35677
12344H8726a50361j44245A82872E8966M084J1660Q961K00440a35507j54162f835
12332B07884a4641B53716h1169D6832c92425e8358j3160I3644a4380m3088D995
12320A08123a61086A89163P3507Q1683C0454J3396K4528K22382I6287l9985E710
12308A8218g3003A44477P7174L2192b51190D5338i7133j88598d523A50392b63223
12296B20760n0308c28662M9925c6716A29300p200a7836j93586F5336l0396b96899
$$ plain form
12376 269306 418013 -258693 34419 266810 139910 -246703 187311 60816 -46307 -57685
12366 -57685 -336982 -142790 -49065 188728 -28258 -286899 260112 152739 47624 -90382
12355 36312 -157561 27360 -140610 294537 -312142 -268773 -204066 268411 247562 -135677
12344 88726 -150361 -294606 182872 58966 63050 74710 83671 284111 -135507 -289669 -6835
12332 207884 -14641 253716 -81169 46832 -392425 -58358 -71518 93644 -14380 -57468 4995
12320 108123 -161086 189163 262670 344353 30454 43850 68378 290760 96287 56302 5710
12308 18218 -73003 144477 221651 253843 -251190 45338 -97133 -285731 -4523 150392 -263223
12296 220760 170452 -328662 -278737 -36716 129300 122100 -17836 -211422 65336 34940 -296899
12284A28873a17188j6700F7721K31193F5012i1285j03630c0288B0154C728K73190
12273B76918j1784j22636n3246Q4274P8459b664I6734J24006o6955a16425C3150
12261f6773A87132h8484L7958A26210A2564a403G2894K34824A12594a81873B60003
12249B81124a35526B18251m0474H7661e7610a3213B47896b6697H8001M2676a67521
12237A48361e5563C14465b6181j29777C8937a80123B02957k8646c25835D40431
12226C71732A46071M89565e3989B50726p3781b0735B26661P9771q1431R1891J92030
12215E08922A64590o9003a2488B70106D7609A9929l860M26012A0224d1973F3741
12203b42280A24402K02910J70785a32782A80924J27785A03787J94914D5564b1333
$$ plain form
12284 128873 -117188 -133888 67721 298914 65012 -91285 -194915 -30288 20154 3728 276918
12273 276918 265134 142498 89252 173526 251985 -2664 96734 220740 153785 -116425 33150
12261 -66773 187132 -88484 -50526 126210 12564 -1403 72894 307718 112594 -181873 260003
12249 281124 -135526 218251 177777 87661 -57610 -13213 247896 -26697 88001 130677 -167521
12237 148361 -55563 314465 -26181 -155958 38937 -180123 202957 174311 -325835 440431
12226 371732 146071 635636 -53989 250726 176945 -20735 226661 306432 225001 316892 508922
12215 508922 164590 95587 -12488 270106 47609 19929 16069 442081 10224 -41973 63741
12203 -242280 124402 327312 498097 -132782 180924 308709 103787 298701 45564 -21333
12192A34416j893l593M0839L32418B1208K07458A6967b14655r3273H8766j7144
12181G1622d6474C26803I7040M138c40603a46887j45262B1804a82898C37213A07159
12169g0994n1522B00843J17966k1996r2198m2410a8416l0847j21841K8074k4434
12158a67464A46314C0042N8095a2644A03985K46098K2986E0892a13945A51306
12147i8907J3754c6534j74726Q9586e6238B54968g4630l4437a3031j0964A8303
12135A4620J07275L3557b91757Q3422B0580c3154E8986L3367l4737K89835g8584
12123c36077c2585j74252F8620a49087d2661j58987A25689a9614j3266A84908
12112g6098e49p3866d495r9073B79764a89726g3287A62077L100b907j96998B48136
$$ plain form
12192 134416 132523 128930 169769 502187 21208 228666 16967 -214655 -307928 88766 71622
12181 71622 -46474 326803 97040 101178 -340603 -146887 -292149 21804 -182898 337213 107159
12169 -70994 -122516 200843 318809 296813 204615 162205 -18416 -49263 -171104 -143030 -167464
12158 -167464 146314 30042 88137 -12644 103985 350083 373069 50892 -113945 151306
12147 -98907 -85153 -36534 -211260 -121674 -56238 254968 -74630 -109067 -13031 -23995 18303
12135 14620 121895 155452 -291757 -208335 20580 -33154 58986 92353 57616 347451 -78584
12123 -336077 -32585 -206837 68620 -149087 -42661 -201648 125689 -19614 -32880 184908
12112 -76098 -549 -74415 -4495 -103568 279764 -189726 -73287 162077 165177 -2907 -199905 248136
12099A70184J48765n268a0489q0744A70033J04334b82088J36295J0306j7647b1234
12087b27729i9576A63852a19048H5790K5799k7272J9577a84187D5531M7273L36796
12076D29600A0320L9032b8753C40576e2803k5128B31316L76347J096272p82534
12066I21401k54377E9717a47754D7686J76580K29471A61648b39288D5663b13639
12055b7987q1932e0950A43432L2320i0989j60043G6170g0601l22452A27537n644
12044A21893l6222a5809L509o1798q593C6486N0416b77496B07839p3066g2355
12032B52547H8301g3334q7580j64335q9959b4085k92158a49671C07626J06950
12022D14576D8510M3782O3096e6453A02356K05542c0444j67141j06822j90094
$$ plain form
12099 170184 318949 313681 -10489 -91233 170033 274367 -282088 -145793 -135487 -153134 -21234
12087 -227729 -99576 163852 -119048 85790 111589 84317 103894 -184187 45531 92804 429600
12076 429600 10320 49352 -28753 340576 -52803 -77931 231316 607663 1703935 921401
12066 921401 667024 59717 -147754 47686 224266 453737 161648 -239288 45663 -213639
12055 -27987 -109919 -50950 143432 175752 -90989 -251032 76170 -70601 -393053 127537 121893
12044 121893 85671 -15809 -12300 -74098 -82691 36486 86902 -277496 207839 134773 -72355
12032 252547 88301 -73334 -160914 -325249 -415208 -24085 -316243 -149671 307626 414576
12022 414576 48510 92292 155388 -56453 102356 307898 -30444 -197585 -304407 -494501
12012d94501h9009p6800j55449I3024O404a98819F1497f9771j58799a151j35655
12001a36806g192j66917E0241a62897P5331A31905e8239j26018l3493A35635a65272
11989a55239H3712L1684h9132j60008C24354A55111m0884l1270c9480j76574A09671
11977a72476A44516L11680A8113f2501j10474j16634h1698e902j32492A49966
11966A63225J70559C522J86307o959a23758A59591b17477a06659l8294H186J12436
11955A20622a37642h887j67523M0786B4623c6074B3597J30201b60579A30209b63510
11943A4130c900B48306b534A35294b27345A75205b88157A61561n9832J2932b60441
11931b97435A33304h2787k73246N3492D872d15246P8176A15958a61779f0917K3492
$$ plain form
12012 -494501 -89009 -165809 -321258 93024 99428 -198819 61497 -69771 -228570 -1151 -136806
12001 -136806 -7192 -174109 50241 -162897 -87566 131905 -58239 -184257 -217750 135635 -165272
11989 -155239 83712 115396 -89132 -249140 324354 155111 114227 82957 -39480 -216054 109671
11977 -172476 144516 456196 18113 -62501 -172975 -289609 -81698 -5902 -138394 149966
11966 163225 333784 3522 189829 182870 -123758 159591 -217477 -106659 -144953 8186 120622
11955 120622 -137642 -8887 -176410 -135624 24623 -36074 23597 153798 -260579 130209 -263510
11943 14130 -3900 248306 -2534 135294 -227345 175205 -288157 161561 101729 114661 -260441
11931 -297435 133304 -82787 -356033 -302541 4872 -415246 -337070 115958 -161779 -60917 -37425
11920c7425D76199a93412A09039c7967E6750J99305D7191a00766A51128b5367
11909B34226a6325C41250r3008a58741q3762B94276f305q7199A21986B9303a79784
11897b8147C27066f1161A07608e9440j83379A09268n0794c05553i9050G0856J89162
11886B60018o8843d7268j9099K049H764a31255B76924A10945d2794k019r5400
11875a40213B47292b47875A21202d7822j52698R0262E9252d08057a88555E4492
11864a44330i875A64761d04277a1302j18347N0805B4713L08790a5352j75791A92597
11852B11346j6677B2977J062b00056D25817b68759d8464j41660A42833a01141
11841E4072a5242q3315m22163D1064O8652a63407B12560b94422D6072c48022J44522
$$ plain form
11920 -37425 476199 -193412 109039 -37967 56750 256055 47191 -100766 151128 -25367
11909 234226 -16325 341250 248242 -158741 -242503 294276 -6305 -93504 121986 29303 -179784
11897 -28147 327066 -61161 107608 -59440 -242819 109268 58474 -305553 -99050 70856 260018
11886 260018 191175 -47268 -66367 -64318 8764 -131255 276924 110945 -42794 -44813 -140213
11875 -140213 247292 -247875 121202 -47822 -200520 -110258 59252 -408057 -188555 54492
11864 -144330 -9875 164761 -404277 -11302 -129649 -78844 24713 333503 -15352 -191143 192597
11852 211346 194669 22977 24039 -200056 425817 -268759 -48464 -190124 142833 -101141
11841 54072 -15242 -98557 -520720 41064 109716 -163407 212560 -294422 46072 -348022 -203500
11830b03500j8545n1571B22334h8494m6557F8280e5233r9099M1643I0520a69441
11818A90341d07927a11633a4019j65779N740k4845B59159h6859A66376a13486
11807C34910q501i9932A06600b02423M4334A60729J93171d0565p2319G5024C6929
11795c9228C5394J28691J01159a63625L874A65129a52867n2608B00737f0783J8348
11784d2435m6275a4296l3948l10808b736A80868e4952j65827M2142B0195J7566
11773C7761K2101b17225a4727n1799r619J490B67850p8179e7093M699p9133n7664
11761a89191B8864i3165c6140A05732B675h396B10723c7823k07704P4623E5229
11749E1168J38952B786K6283c23383A85241H2099a88484A19562a35739A67415
$$ plain form
11830 -203500 -222045 -273616 222334 -88494 -135051 68280 -55233 -154332 -112689 90520 -169441
11818 190341 -407927 -111633 -14019 -179798 -174058 -198903 259159 -86859 166376 -113486
11807 334910 326409 -99932 106600 -202423 -158089 160729 353900 -40565 -112884 75024 36929
11795 -39228 35394 164085 265244 -163625 -159751 165129 -152867 -205475 200737 -60783 -42435
11784 -42435 -88710 -14296 -48244 -359052 -2736 180868 -54952 -220779 -178637 20195 37761
11773 37761 59862 -217225 -14727 -66526 -76145 -74655 267850 189671 -57093 -52394 -131527 -189191
11761 -189191 28864 -93165 -36140 105732 2675 -8396 210723 -37823 -245527 -170904 55229
11749 51168 190120 2786 29069 -323383 185241 82099 -188484 119562 -135739 167415
11738b16649F5331a81692N4365F3076L54180j18753a65895e0345C3659L038a34976
11726a18617F2564b00863A29801a91930B07615b8608B81465b4331l29362B8354
11715f3659B18022M3372b75992N5055R6798I6273N8539i6120d0235L9C71427j07834
11703B63593a63483B47093a94329A94324a32703p1270A24883a83240n7834A85713
11692b37047R9798Q172I8482a93503F2930i829C0447h4044A55361l6152g0313
11680a6137I6727a73135P4216H2037F588J40695C8721A9253K67557A6313J79705
11669A96018J00211I5685b0820p2596A19871c03776h2663A96611q7277a1035m3396
11658e4431k70945a07389F7310K44256a16382K0180m5850M0699A24680j3329j8916
$$ plain form
11738 -216649 65331 -181692 -127327 63076 417256 298503 -165895 -50345 33659 36697 -134976
11726 -118617 62564 -200863 129801 -191930 207615 -28608 281465 -24331 -353693 28354
11715 -63659 218022 261394 -275992 -220937 -124139 96273 154812 -96120 -40235 -40196 371427 263593
11703 263593 -163483 247093 -194329 194324 -132703 -203973 124883 -183240 -241074 185713
11692 -237047 -137249 -129077 98482 -193503 62930 -9829 30447 -84044 155361 119209 -70313
11680 -16137 96727 -173135 -98919 82037 6588 147283 38721 19253 286810 16313 196018
11669 196018 296229 95685 -20820 -93416 119871 -303776 -82663 196611 109334 -11035 -54431
11658 -54431 -325376 -107389 67310 311566 -116382 -96202 -142052 -101353 124680 111351 92435
11647I2435g765B9568a54746j41507B92708k5513C439f6684F0885b1663C23011
11635C0891e9296j86193I2721C9689h4611B84563o4019M9137E77a24388D96371
11623C9014Q0961K00066G8618B2903K05920b57787e6985p7630o5413c7452H6710
11611E0599P309a79321e6029B91544b74052H5667a03850A70182m9638D7669p255
11600D0414f784m7254m579A11629a5197A50421J71172A33031b6393k53859A71626
11588I0591P3666g8940B53779J3585e2554n9350C1009K08918b8353A00705a64102
11576G6809b77426B62798A5205N8532B846K16922c08537A3617N62N6242J67690
11565B38111E9483d7678G0897K14962C8609K8406g7440l03554a06586C63231A28575
$$ plain form
11647 92435 -7765 29568 -154746 -296253 292708 267195 3439 -66684 60885 -21663 323011
11635 30891 -59296 -245489 92721 39689 -84611 284563 220544 269681 577 -124388 496371
11623 39014 119975 320041 78618 22903 228823 -257787 -56985 -134615 -200028 -37452 86710
11611 50599 57908 -179321 -56029 291544 -274052 85667 -103850 170182 120544 47669 40414
11600 40414 -6784 -54038 -58617 111629 -15197 150421 321593 133031 -26393 -280252 171626
11588 90591 164257 -78940 253779 267364 -52554 -111904 31009 239927 -28353 100705 -164102
11576 76809 -277426 262798 15205 73737 2846 219768 -308537 13617 14179 70421 238111
11565 238111 59483 -47678 70897 285859 38609 67015 -77440 -380994 -106586 363231 128575
11553A79435j956h671B4253b545D1195a00627B59335N890D573a04875A80801O0308
11541B41109a85365P2182A95795I5437k9609d6129A08313B4377K7789J19855a49384
11529A07494C5035J87233m8142Q6061C6502J58496B6111P8666N0203d0357A69624
11517A01756K39657j5245C0829K66579j16268D8600d426j14801C40260J75156
11507E15416A17852Q4118K56137A36109i0182K8573m4626C1133J82930a88563
11496C1556A2969b7374C45136j36908a82988l0163A94428P1607J44158k8712a03704
11484B80973E1062L26968k5662d00D1794L02198A10509m054K32434n9672A17587
11472D84838H3216A5407L69479F7890j7455P8983M21769k38371C2318P172a6164
$$ plain form
11553 179435 177479 -8671 24253 -2545 41195 -100627 259335 265225 4573 -104875 180801 241109
11541 241109 -185365 -113183 195795 95437 65828 -46129 108313 24377 52166 172021 -149384
11529 107494 35035 222268 174126 260187 36502 194998 26111 104777 154980 -40357 169624
11517 101756 341413 326168 30829 297408 181140 48600 -4426 -119227 340260 515416
11507 515416 117852 201970 458107 136109 -90182 -61609 -106235 31133 214063 -188563
11496 31556 12969 -27374 345136 208228 -182988 -213151 194428 266035 410193 381481 -103704
11484 280973 51062 378030 352368 -400 41794 343992 110509 106455 338889 279217 117587
11472 484838 83216 15407 384886 67890 50435 129418 551187 312816 32318 39490 -16164
11460B24424n9556F917K57812d4469A51301g6978A00297K023k8837d0711D124
11448h7468A730L69540A16746k6842K9869K72899a79896A5674N0685b6282A0518
11436b41641J18875d2362j6043l5045A73437b08833h6612r7330g1745r51I7917
11424a5005A18166Q9629F9304b44976e0152F2898J0848a7776k06172h293B51729
11412e3055B86257M9576d3562A17916a12772n9526B24231b41884F6500J80379
11402B46879r592j0855a84320A77255d5883B63128a43549F6962a68011F4028r500
11391E4528M3058C3786K3444e4651B62363D4984a33530e9063A53808a37371F735
11379A68632p7593M2019a92220b3156j7711k9756L336F16e3315e962j90508j35295
$$ plain form
11460 224424 164868 6917 264729 -44469 151301 -76978 100297 102320 73483 -40711 4124
11448 -87468 1730 371270 116746 89904 119773 392672 -179896 15674 66359 -26282 10518
11436 -241641 -122766 -42362 -58405 -93450 173437 -208833 -86612 -183942 -71745 -72696 97917
11424 -15005 118166 207795 69304 -244976 -50152 62898 73746 -17776 -223948 -8293 251729
11412 -53055 286257 335833 -43562 117916 -112772 -172298 224231 -241884 66500 246879
11402 246879 237287 226432 -184320 177255 -45883 263128 -143549 66962 -168011 64028 54528
11391 54528 97586 33786 57230 -54651 262363 44984 -133530 -59063 153808 -137371 6735
11379 168632 91039 133058 -192220 -23156 -40867 -70623 -67287 616 -53315 -5962 -196470 -331765
11367c31765i8633k51914A3021K1472o72a00635j75656B88219b04036h2953C25602
11355b2380I2977R7079a38811B44386C6158L9590a86266C3707L02775J77965c641
11343A29953F068c4142A31000a81042f906C54113A62026b77421B78452I7454a91030
11331a89181A69291a52013C84667i656B424a25390K6517C10474c66283D1256a35987
11319C7987Q0969c36547A64103E2360B584J09616B8722a44304j3660j56497M0278
11308b74183B37307c74765e1196J114j91158D1564R1661f060H4366d7803J9842
11297b7961k8541j75434n7376i8314B25984h9964L4504k99096G5795a19806B7170
11285d42348d1476J6366n617k22033H0343J88801b50178J7988d9040j76187h8929
$$ plain form
11367 -331765 -98633 -350547 13021 34493 33821 -100635 -276291 288219 -204036 -82953 325602
11355 -22380 92977 190056 -138811 244386 36158 75748 -186266 33707 336482 514447 -3641
11343 129953 6068 -34142 131000 -181042 -6906 354113 162026 -277421 278452 97454 -191030
11331 -189181 169291 -152013 384667 -9656 2424 -125390 -98873 310474 -366283 41256 -135987
11319 37987 118956 -336547 164103 52360 2584 112200 28722 -144304 -157964 -314461 -274183
11308 -274183 237307 -374765 -51196 -50082 -241240 41564 133225 -6060 84366 -47803 -27961
11297 -27961 -56502 -231936 -289312 -98314 225984 -89964 -55460 -354556 75795 -119806 27170
11285 -442348 -41476 -25110 -30727 -252760 80343 269144 -250178 -232190 -49040 -225227 -88929
11273A32109c8227r3231k2671A37139B1268K97859c26453Q2501J04503G7584c97598
11261f6045m4371B32145b15699R9499q5566C7137N8589a51912K7522j69801A6279
11249A40585a88572E4573a41007B70865I0532a75211c1546G0067d957k34953A56511
11237b00969d2915K0555A21984J0125c09662J14348j33435C01206A1456a43129
11226h8392j82556h8862j85777a3291p7364a1818l6445G8315h3203c7522B7207
11214A57714a46975q5185B29530e1178a8490l9699K4413B7002O2664c3168C9282
11202A85191b08387f8877A44914b12877k08658J16010a17391D7265a42438N0027
11192i2411r1647A73718D8693M6847D507b75789j8936h116C57060b08722i9475
$$ plain form
11273 132109 -38227 -131458 -154129 137139 21268 319127 -326453 -243952 -139449 77584 -397598
11261 -66045 -110416 232145 -215699 -116200 -201766 37137 95726 -151912 -124390 -294191 16279
11249 140585 -188572 54573 -141007 270865 90532 -175211 -31546 70067 -4957 -239910 156511
11237 -200969 -42915 -22360 121984 132109 -309662 -195314 -328749 301206 11456 -143129
11226 -88392 -270948 -88862 -274639 -13291 -90655 -11818 -48263 78315 -83203 -37522 27207
11214 157714 -146975 -232160 229530 -51178 -18490 -58189 -33776 27002 89666 -33168 39282
11202 185191 -208387 -68877 144914 -212877 -421535 -305525 -117391 47265 -142438 -92411
11192 -92411 -184058 173718 48693 95540 4507 -275789 -294725 -8116 357060 -208722 -99475
11180A88475b30437A25765c96970a26298e0241B1028c05044e1917k35444A83840
11169d0401G6974a14366k88155A8794L6954d96100J45133J6665b8849l6872m2510
11158a08231A31971C9539d2696k3384o138j43469l03867c8067A23634N1117o7236
11147A07515M4196k6425N0207O6379B9552a38528j54172G7536j6572R1936k6775
11136A26125B506K19487p0489e3964l76894B62987n5662R283J04571j03216g1121
11124B90561j27446A6199J19285B1461b4027B04396O5739q3754H0682C8028K35070
11113B73098d7163A51893a16817A98976I8010J2371J25448G2514J295R8509C3063
11101g534n2664B48363j04420E9428J14688p8541J30423L6751A27298B9556J43366
$$ plain form
11180 188475 -230437 125765 -396970 -126298 -50241 21028 -305044 -51917 -287361 183840
11169 -40401 76974 -114366 -402521 18794 55748 -496100 -350967 -334302 -28849 -65721 -108231
11158 -108231 131971 39539 -42696 -66080 -72218 -215687 -519554 -38067 123634 174751 107515
11147 107515 151711 125286 175493 241872 29552 -138528 -292700 77536 60964 152900 126125
11136 126125 2506 221993 151504 -53964 -430858 262987 207325 216608 321179 217963 -71121
11124 290561 163115 16199 135484 21461 -24027 204396 270135 186381 80682 38028 273098
11113 273098 -47163 151893 -116817 198976 98010 110381 235829 72514 73809 172318 33063
11101 -7534 -60198 248363 143943 59428 174116 95575 225998 262749 127298 29556 172922
11090A72922G5206P1162K05064I5433J0538L75720j89557A36770P8420K34150
11080D49340C7446J85520A04946a11892C53195J06271I3648K31986J2970J83918
11070E22522K00618A92057L82846o0346K75793l08718m0048L07528B61554J31739
11060C93293L63013l77016M78463Q9047n8639j93612o2698K4174K15126m5559
11050H25592J08929r5432J81116j90936l3174Q7896p8203J07011K28516n59885
11040E81430K05624m2341J90755q7744k58967K23215r0937j79139J16131J4418
11030F72445R1725K1473m137k59366O21717j09622m18258j9464K39260Q8788D03444
11018I04159j50382P6118l18685L39044k36774O4301J06443m3894J26216r814
$$ plain form
11090 172922 75206 146368 351432 95433 105971 481691 292134 136770 215190 449340
11080 449340 37446 222966 104946 -111892 353195 459466 93648 325634 338604 522522
11070 522522 723140 192057 574903 514557 790350 481632 441584 749112 261554 393293
11060 393293 756306 379290 857753 946800 888161 694549 631851 656025 871151 825592
11050 825592 934521 839089 1020205 829269 796095 883991 805788 912799 1141315 581430
11040 581430 787054 744713 935468 847724 588757 811972 721035 541896 658027 672445
11030 672445 764170 785643 781506 522140 1143857 1034235 615977 596513 835773 924561 403444
11018 904159 753777 829895 511210 850254 613480 677781 784224 740330 866546 856732
11008H56732j72932n5470L7356M0020J38700l73579K13231J23323K21227m70708
10998E57900J97148k3958o6165J45433K20561l97267L2591M20910l89507N6679
10988G54325K34455K61528L51794p04517L59088m5329l30372L57630K89281Q0414
10978A608297Q6907L27847L61982L9552O73797J80877K76314k18895o2520q2549
10968C191609n41979j26903k83386m59393J52828l16713J90474q4067o4984k08472
10958A449014M26933m76146K42884l23604K7988m19928J34393l79656M5817J95593
10948I23288l55900k54976a62049G0718c1958B46235P7503a22734D08335A5633
10937E32455p7271B6082K06724R6238A382L19369c440A1311f2653m55o1446B4522
$$ plain form
11008 856732 683800 628330 665686 705706 844406 470827 684058 807381 1028608 557900
10998 557900 755048 731090 664925 810358 1030919 633652 666243 1087153 697646 754325
10988 754325 988780 1250308 1602102 897585 1256673 1211344 880972 1238602 1527883 1608297
10978 1608297 1695204 2023051 2385033 2424585 3098382 3279259 3555573 3336678 3274158 3191609
10968 3191609 2649630 2522727 2239341 1779948 1932776 1616063 1806537 1722470 1657486 1449014
10958 1449014 1875947 1399801 1642685 1319081 1347069 927141 1061534 681878 727695 923288
10948 923288 567388 312412 -162049 70718 -31958 246235 323738 -122734 408335 15633
10937 532455 455184 26082 232806 329044 1382 320751 -3440 11311 -62653 -63108 -124554 24522
10924H4563J57042j1245D1125K29551a60478B12622B0721b53144e5609C20035
10913a70695B81477a02970C79109A04003O9885Q9464f3404l4278j31482D00190
10902a66198l45534G4038b07425O0021L3422D670i7537k36893f4902J5967a3102
10890a4520k19070A56796b07097E6945c19599C23692b8658A99082D5901A861J95007
10879A96868C2174Q6761J13554h6087C20283h3727A2927a38782A81181h1857j58984
10868b40841a00305A13180b19250M6988O9430A61631g2620B6322e1160j25j90558
10857b41843I2263j5491n48K2819J9993j5915A6186a97624I50c21666D65i7874
10844A10526b28809O6746E9168h6647j07472R1143C57180a35315N3439j77091
$$ plain form
10924 84563 241605 230360 41125 270676 -160478 212622 20721 -253144 -55609 320035
10913 -170695 281477 -102970 379109 104003 173888 263352 -63404 -97682 -229164 400190
10902 -166198 -511732 74038 -207425 -147404 -113982 4670 -97537 -334430 -64902 -48935 -13102
10890 -14520 -233590 156796 -207097 56945 -319599 323692 -28658 199082 45901 1861 196868
10879 196868 32174 118935 232489 -86087 320283 -83727 12927 -138782 181181 -81857 -240841
10868 -240841 -100305 113180 -219250 -172262 -102832 161631 -72620 26322 -51160 -51285 -241843
10857 -241843 92263 76772 76224 99043 119036 103121 16186 -197624 950 -321666 465 -97874
10844 110526 -228809 -162063 59168 -86647 -194119 -102976 357180 -135315 -81876 -258967
10834b58967J8030F5303b61326A01198H374a20459C5702a23327B82479a87199
10823G4628b6147A39526e7091j6457j3521C828J64101F5536K6002c4643B56685
10811d0618C95733F0786c59353A14559h5828j50561P2831L0583E4378K89807g6632
10799b788A9061b22155q6099P5533A02997h6088j22491A70953R9662l9512j07317
10788A23786J81551q3640h044j28660D7151a81787A04565l3656C4828a3243A49000
10776a16411L3426L4041B40325p4070b12323j752F9576h369l03426o4889a20249
10764b50709I70c7631k8889l46417K02999i474k7060j81508A36755i0054c8980
10752d60210A91148a92653O7663k7444M4030j27099C41418b05451c5635B34129
$$ plain form
10834 -258967 -240937 65303 -261326 101198 8374 -120459 35702 -123327 282479 -187199
10823 74628 -26147 139526 -57091 -73548 -87069 3828 167929 65536 91538 -34643 256685
10811 -40618 395733 60786 -359353 114559 -85828 -236389 -163558 -132975 54378 344185 -76632
10799 -2788 19061 -222155 -308254 -232721 102997 -86088 -208579 170953 270615 231103 123786
10788 123786 305337 221697 -8044 -136704 47151 -181787 104565 70909 34828 -13243 149000
10776 -116411 -82985 -48944 240325 166255 -212323 -214075 69576 -8369 -311795 -376684 -120249
10764 -250709 970 -37631 -66520 -412937 -209938 -9474 -36534 -218042 136755 -90054 -38980
10752 -460210 191148 -192653 -124990 -152434 -108404 -235503 341418 -205451 -35635 234129
10741C8678O3364c4105j01254O2566J9196k08300A24203d8098B9210K74541A5999
10729a63395C0952L34638G828a20645A02882b24279B8430g8974C161N9290a58141
10717h4102J6015B5501c1915D6030c87477O9392c4176B55143E8919B984O2911
10706F5895d2197j9591A10464G911b12700e0377n1550j2926A31274M1986D3189
10694A21951a42847k548F4575d98977B99342H6359J7456b77977N5398G1004c38174
10682A10858e7807K4107A7672L03169b9327k25146A00348h4041J4430n4C1347
10670e7137A13784a17509r9612i4249o6321A81322b52278A7792M0049j1646M958
10659E1153b2987B73168a95175c0342o6240J1324j80566K8479E1917c23209F3330
$$ plain form
10741 38678 102042 -34105 -135359 -72793 -53597 -261897 124203 -48098 29210 303751 15999
10729 -163395 30952 365590 7828 -120645 102882 -224279 28430 -78974 3161 62451 -158141
10717 -84102 -68087 25501 -31915 46030 -387477 -318085 -34176 255143 58919 2984 65895
10706 65895 -42197 -61788 110464 7911 -212700 -50377 -101927 -114853 131274 173260 43189
10694 121951 -142847 -145395 64575 -498977 299342 86359 103815 -277977 -222579 71004 -338174
10682 110858 -57807 -33700 17672 320841 -29327 -254473 100348 -84041 -69611 -69665 31347
10670 -57137 113784 -117509 -217121 -94249 -160570 181322 -252278 17792 57841 46195 51153
10659 51153 -22987 273168 -195175 -30342 -96582 -85258 -265824 -237345 51917 -323209 63330
10647G7743a14230j38808A30004a61556c5221n2465j60943O9418B22971h8204
10636d26654D6236a97521A50382a06458F927a18609l21234A95338G751K1489b3908
10624A12381R032I716c24026d6182h090n1545j6644D1431a8145J872j73834K1834
10612a68273d3215B47410i0502G0453g901B64138e2356B84414d70632b28195B8255
10600b41189A88420b08982O392A94304f045k4114F2330d8570m2667Q923l760G5890
10587e1943j77126R4542j07460a17214B33110a1089E0431J79965i5892B67756
10576A28030E7910a34323j1852J603M2652E4739a2608D29181A56034f1903m3457
10565a05360L8909c2873l8168I2590a87682B442a10581l7473O2059p4108k1749
$$ plain form
10647 77743 -114230 -253038 130004 -161556 -35221 -87686 -248629 -179211 222971 -88204
10636 -426654 46236 -197521 150382 -106458 6927 -118609 -439843 195338 7751 29240 -23908
10624 112381 121413 9716 -324026 -46182 -8090 -59635 -76279 41431 -18145 -16273 -190107 -168273
10612 -168273 -43215 247410 -90502 70453 -7901 264138 -52356 284414 -470632 -228195 28255
10600 -241189 188420 -208982 -202590 194304 -6045 -30159 62330 -48570 -91237 -82314 -86074 75890
10587 -51943 -229069 -134527 -241987 -117214 233110 -11089 50431 230396 -95892 267756
10576 128030 57910 -134323 -146175 -144572 -101920 54739 -12608 429181 156034 -61903 -105360
10565 -105360 -66451 -32873 -71041 92590 -187682 2442 -110581 -148054 -85995 -160103 -181852
10554a81852G0358d70867J6585A65607b15854C7723a47062m3705h6730k01202
10544b87932J34323A4673J11958b31382C80593g9459A55126k4994c34742B16166
10533b38687i0761C458b40129Q597B38127l8401p6771f4059k43315A05972b54325
10521c47261A20133b4348A90840a50864N1484b3309m5858a625E8117f698B45923
10509c27786B3554a23987c2527r9351e5945m1387L3903k32863B42963A07617d7256
10497b7537o0321j07316d7495k59734M0712J0224B72124a47989B0070J02660E2545
10485A08389J06587m4707L26246K27680Q3837G9063N31417A59843E5873J73181
10475B29054J28041b54130A69343f0041j6037A49553a84580o5241A8297L88461
$$ plain form
10554 -181852 70358 -470867 -454282 165607 -215854 37723 -147062 -190767 -86730 -287932
10544 -287932 -153609 14673 126631 -231382 380593 -79459 155126 130132 -334742 216166
10533 -238687 -90761 3458 -240129 -231532 238127 199726 122955 -64059 -307374 105972 -254325
10521 -347261 120133 -24348 190840 -150864 -99380 -23309 -69167 -1625 58117 -6698 245923
10509 -327786 23554 -123987 -32527 -131878 -55945 -97332 -63429 -296292 242963 107617 -47256
10497 -27537 -87858 -195174 -47495 -307229 -266517 -256293 272124 -147989 20070 122730 52545
10485 108389 214976 170269 496515 724195 808032 79063 610480 159843 55873 229054
10475 229054 357095 -254130 169343 -60041 -76078 149553 -184580 -249821 18297 406758
10465D06758H4841f2293H2053b5680A19766d2848j32966O9375B35755g5396n3585
10454a28981B097J53562c26747P8799e5447k90163Q6440G6140c50B05901m5008
10443A60893J91119C9923A1404a54027c803A26339g1564j28198j55387J75139
10433a80010h2416k05346C9462b56114D1783i5516I0136a77548e472D971J48906
10422A53877K57891b33106k2457J09020A93443A3053a28707C76592D8426a18312
10411a37566d443j8073A72387i4465A30366a49507B42231a50927I7977A05h6528
10399g2775A48545n9792i1082A25210K14343b1879A38002o8090K65038J2259A47091
10387a02546A35013O2287h9394j11196A73513M7877K5402e1660D91949J4103A32140
$$ plain form
10465 406758 84841 -62293 82053 -25680 119766 -42848 -175814 -106439 235755 -75396 -128981
10454 -128981 2097 155659 -326747 -247948 -55447 -345610 -259170 76140 -350 205901 160893
10443 160893 352012 39923 11404 -154027 -3803 126339 -71564 -199762 -355149 -180010
10433 -180010 -82416 -287762 39462 -256114 41783 -95516 90136 -177548 -5472 4971 153877
10422 153877 411768 -233106 -255563 -146543 193443 13053 -128707 376592 48426 -118312
10411 -137566 -4443 -22516 172387 -94465 130366 -149507 242231 -150927 97977 105 -86528
10399 -72775 148545 88753 -91082 125210 339553 -21879 138002 69912 334950 347209 147091
10387 -102546 135013 197300 -89394 -200590 173513 221390 246792 -51660 491949 506052 132140
10375B24214M31336A99825L63211j67741j31561R3422J87383j35597Q5557j99797
10365B94702j6737M4024j50675Q1116O4661K2892B0710c5632A16575J66298K5465
10354C08338J88331A99990M29699L11734m46170j59592J8445H9141J56890Q8661
10344C34692j50302L0327o6685a65340I8103N0528J06888P1604J2261A42785b37326
10332G8176A807M42381a95632C52014E3662K7283J77755q8585P5195h1402A93262
10320A22122d7449J2700A47591a21027A38250L8666L6590D2527Q9689c8790k86908
10309c25698C05762c30763E5102a03723a1258m0046j75673B00103e0488a476B06297
10297a96385A7441a39636G8327a64053d1725l90852A1890J82967G5379J26092
$$ plain form
10375 224214 655550 199825 563036 395295 263734 357156 544539 408942 494499 294702
10365 294702 277965 321989 171314 252430 317091 339983 20710 -35632 116575 282873 308338
10354 308338 496669 199990 629689 941423 495253 335661 354106 89141 246031 334692
10344 334692 184390 214717 148032 -165340 98103 148631 255519 327123 339384 142785 -237326
10332 78176 1807 444188 -195632 352014 53662 80945 258700 170115 245310 -81402 193262
10320 122122 -47449 -34749 147591 -121027 138250 176916 213506 42527 132216 -38790 -325698
10309 -325698 305762 -330763 55102 -103723 -11258 -51304 -226977 200103 -50488 -1476 206297
10297 -196385 17441 -139636 78327 -164053 -41725 -432577 11890 194857 75379 201471
10287B01471b1541l47j36105A32380b74557A18273J43801q8124b50295A85083
10276H8748a0738B4890M1781a95681e7271A15096O1820D0183a23023B8140o71
10265B7469b9689A97893R518B7430M43321J79915A35480K16158A47006J8201c20306
10253B4821P3180h0226A35822A5964c22463B04167a81869A00287c0076o9991l37814
10242d37881c400o4715k15378a3326j10896j46098a22174r3729A63917d7685C692
10230a87658l5222H5702a05940G5703J9597b70626D8349b16925Q5945E0768O7912
10219A18680a86061C121Q5053i8946K4070A65259a025B2187R5491d0490m87128
10208e27618A66938k616b8906j28970k430a5871k71109h8302k64345Q146C715
$$ plain form
10287 201471 -21541 -21888 -157993 132380 -274557 118273 262074 173950 -250295 185083
10276 88748 -10738 24890 66671 -195681 -57271 115096 176916 40183 -123023 28140 27469
10265 27469 -29689 197893 207411 27430 470751 650666 135480 351638 147006 165207 -320306
10253 24821 98001 -80226 135822 15964 -322463 204167 -181869 100287 -30076 -100067 -437881
10242 -437881 -3400 -68115 -283493 -13326 -124222 -270320 -122174 -215903 163917 -47685 3692
10230 -187658 -222880 85702 -105940 75703 95300 -270626 48349 -216925 -130980 50768 118680
10219 118680 -186061 3121 88174 -98946 -74876 165259 -1025 22187 117678 -40490 -527618
10208 -527618 166938 164322 -28906 -157876 -160306 -15871 -286980 -88302 -352647 -344501 3715
10196A07441K27525C2528c1164D7333B0091J10587a50278A99123G8470a14181
10185a88258j61825D2210K21367B887L005b07169B08889a64202l2034c9814A04359
10173c01319C52187j74402D9950h1998k45846e4743p0414j00470I013c38806j95103
10162e33909a66383j46437h5887B01244a281m1105B21369A01459a20067L8000
10152h2067j02451A77306L6027q9733D9562j9815b04806A94131A8871a26069c3350
10140c46505N5101J20619k35873a01140k604B75785I8468c81573E2506Q5298J06927
10129B44731a04486l7717q2964J1724A26368L11477H6090a57659A7673k451Q4986
10118A00208e6019H0497l719b67261B8706K17007j16379J07817B0785g8825B37873
$$ plain form
10196 107441 334966 32528 -31164 47333 20091 130678 -150278 199123 78470 -114181
10185 -188258 -350083 42210 263577 2887 5892 -207169 208889 -164202 -196236 -39814 104359
10173 -301319 352187 177785 49950 -81998 -327844 -54743 -125157 -225627 9013 -338806 -533909
10162 -533909 -166383 -312820 -85887 201244 -1281 -42386 221369 101459 -120067 -82067
10152 -82067 -184518 177306 213333 123600 49562 29747 -204806 194131 18871 -126069 -33350
10140 -346505 -291404 -170785 -406658 -101140 -103744 275785 98468 -381573 52506 137804 244731
10129 244731 -104486 -142203 -225167 -213443 126368 437845 86090 -157659 17673 15222 100208
10118 100208 -56019 80497 76778 -267261 28706 245713 129334 237151 20785 -78825 237873
10106b31348R1330j28818J22015e7368b4726k3527A17741a17567L2142k24375
10096c09800k4041A77580b1316j02863N5499B11070d4770j43225D3265b66978
10085b073A74543F6942f4047j0454o8461A3909a99537I64a5925o1386k25576Q9517
10073b13370k36866K20402A23095h2970h469k74324G5772a8280j4232j50161b6109
10061f4204j9352c8491A73709d0340j34521j9714A46674f3715l4633n1749j15925
10050b66022A58599R0095p4535c33561F0422b22704M0166h2658q8436G8106j9533
10039E8573D155K21845b93156A14339B3043J03150a08734j01749i6858D12646
10028a64210D6878g1456j24596Q0545j78400f6783j39647N0476C22271a10211
$$ plain form
10106 -231348 -140018 -268836 -146821 -57368 -24726 -48253 117741 -117567 -85425 -309800
10096 -309800 -333841 177580 -21316 -124179 -68680 211070 -44770 -187995 43265 -266978
10085 -2073 174543 66942 -64047 -74501 -142962 13909 -199537 964 -15925 -77311 -302887 -213370
10073 -213370 -450236 -229834 123095 -82970 -8469 -282793 75772 -18280 -32512 -182673 -26109
10061 -64204 -83556 -38491 173709 -40340 -174861 -194575 146674 -63715 -98348 -150097 -266022
10050 -266022 158599 248694 174159 -333561 60422 -222704 -182538 -82658 -171094 78106 58573
10039 58573 4155 226000 -293156 114339 23043 126193 -108734 -210483 -96858 412646
10028 -164210 46878 -71456 -196052 -115507 -293907 -66783 -206430 -155954 322271 -110211
10017b25018A19931J6770a10316j011d8325J9529n9513C8061P8031A750c8428
10005i1484k95014a24884B0835g1864I4109a79668j49565a04959c5548k33301
9995b68849B31761a45641L5735A95918m8053K05189b63120d8899C97112a71050
9984b7220k44397L7810A24874e7238o09j28986b8606k06963j13345h246A2511
9972c0423p1890L858I9424b13657d9966A28477a47380A76308K1564J34846a08466
9960G3825b06023M4792j1761O5225m41413H9760b84639e4907f61D4765a00944
9948a99088A31096o5394d81179a65139F2790e39882a5832C09465e02934a10641
9937b9333M73M444F1941e3927k0711k85663l3096B6285c10955C9308b39478E396
$$ plain form
10017 -225018 119931 136701 -110316 -111327 -48325 -28796 -88309 38061 116092 1750 -38428
10005 -91484 -386498 -124884 20835 -71864 94109 -179668 -329233 -104959 -35548 -268849
9995 -268849 231761 -145641 -109906 195918 147865 353054 -263120 -48899 397112 -171050
9984 -27220 -271617 -233807 124874 -57238 -57847 -186833 -28606 -235569 -348914 -8246 12511
9972 -30423 -102313 -98455 99424 -213657 -49966 128477 -147380 176308 197872 332718 -108466
9960 73825 -206023 -161231 -172992 -107767 -549180 89760 -284639 -54907 -661 44765 -100944
9948 -199088 131096 65702 -481179 -165139 62790 -539882 -15832 309465 -502934 -110641
9937 -29333 -28860 -24416 61941 -53927 -74638 -360301 -393397 26285 -310955 39308 -239478 5396
9924b21005O4313j07605J8434F7805J03531a79291c5357r4795J6302q6839A23498
9912a84928Q8826D2398a89265j24298l1613b2307H6163Q0477a57033j84383n3616
9901c95032i6934j16022c1033A58608n7356b7162k11845A1515a01312M0975K9317
9890c1020A02888J79758c4388j9547l0882B16305b7509A47450a93512P1772J8447
9879a03293j7249e0273j1232k29058g1125F4325b62237I9479A7127c64778g4135
9867A7775a67078P3485k04818a19493r0729E0293J85846e0691C782d7778E935
9855c60189A269c18244A74985b19451r6146A24312f9404B0638g1158C967K23122
9844B27089M0346a09004C42915a74801k40219O5415C5772a15092m21605a78512
$$ plain form
9924 -221005 -156692 -264297 -245863 67805 171336 -179291 -35357 -130152 -113850 -200689 123498
9912 -184928 -96102 42398 -189265 -313563 -345176 -22307 86163 166640 -157033 -341416 -395032
9901 -395032 -96934 -212956 -31033 158608 101252 -27162 -239007 11515 -101312 -60337 -31020
9890 -31020 102888 282646 -34388 -53935 -84817 216305 -27509 147450 -193512 -121740 -103293
9879 -103293 -120542 -50273 -61505 -290563 -71125 64325 -262237 99479 17127 -364778 -74135
9867 17775 -167078 -93593 -298411 -119493 -210222 50293 236139 -50691 3782 -47778 5935
9855 -360189 1269 -318244 174985 -219451 -315597 124312 -69404 20638 -71158 3967 227089
9844 227089 267435 -109004 342915 -174801 -415020 -349605 35772 -115092 -536697 -178512
9833A24066a62089H1062b53980a3235j16447E9595K1242C426J46702K8628J8779
9822A97535b00203k23094A5962a20429o5508m8147a9091D1990f7936k4017k2567
9811a14520A49534Q1189A03825k2781A5389b05568J0556e0943k76719K6026A38676
9799a23960l8405o447a9806D40986A49715c79881a20492B18403a45163f9520B28307
9787A94796i2273r9426B9222c25708A31530a15399k02713A21306B001b32655A12696
9775c08538j9249F2173h1191J9226l16117c9411k46731J27690e3501j8539j73146
9764b45186B71370a31001c4481m6724B41972L5765a47p3128l78028a95447G6151
9752B08383b41691L2042I954a60046N446j99340i1560B41956b28066h7693j3903
$$ plain form
9833 124066 -162089 81062 -253980 -13235 -129682 59595 80837 3426 150128 178756 197535
9822 197535 -200203 -423297 15962 -120429 -185937 -234084 -19091 41990 -67936 -91953 -114520
9811 -114520 149534 230723 103825 81044 15389 -205568 -195012 -50943 -327662 -301636 138676
9799 -123960 -162365 -168812 -19806 440986 149715 -379881 -120492 218403 -145163 -69520 228307
9787 194796 -92273 -191699 29222 -325708 131530 -115399 -318112 121306 2001 -232655 112696
9775 -308538 -327787 62173 -81191 -61965 -378082 -39411 -286142 -158452 -53501 -72040 -245186
9764 -245186 271370 -131001 -34481 -81205 241972 277737 -147 -73275 -451303 -195447 76151
9752 208383 -241691 -209649 9954 -160046 -154600 -353940 -91560 241956 -228066 -87693 -101596
9741a01596E0097P3257j9272a76415o7842l7003N3910j03579f7779o6116H9191
9729a31805j97953a08337A00410a48749A88920a23786e869l21535C85520c0465
9718c50548a46630H7712D3478g5597D8913a07665b2366m3408E9922Q6832D8316
9706E6201B0750a31811N506A602e8480E9981A789a33295B68999H5838l8852b23271
9693C5650c12426A63315B3582b38899j62426g7068C70173a62557b8746G3937a15130
9681A15505e9060r0498I771b2253k70123j17453B26683q6552R1729h1068B35879
9669A13362J03541a86649q3112F5578a04826C55738b3053r3177k26810A594a31249
9657I7442b03795R8166H6779a46605I4391k3392b41446A11277K3957a44669L2650
$$ plain form
9741 -101596 50097 123354 104082 -176415 -244257 -281260 -227350 -330929 -67779 -133895 89191
9729 -131805 -329758 -108337 100410 -148749 188920 -123786 -5869 -327404 385520 -30465
9718 -350548 -146630 87712 43478 -75597 48913 -107665 -22366 -65774 59922 146754 48316
9706 56201 20750 -131811 -126305 1602 -58480 59981 1789 -133295 268999 85838 46986 -223271
9693 35650 -312426 163315 23582 -238899 -401325 -77068 370173 -162557 -28746 73937 -115130
9681 115505 -59060 -149558 9771 -22253 -292376 -409829 226683 140131 231860 -81068 235879
9669 113362 216903 -186649 -269761 65578 -104826 355738 -23053 -116230 -343040 1594 -131249
9657 97442 -203795 -105629 86779 -146605 94391 70999 -241446 111277 135234 -144669 -112019
9646a12019b9619m426D3456K6160c27176F0625a66350B01939i3286B2694a44149
9634c49209B49431g7368L6326A33842m7730R3525E434h4639l04282g0150A91496
9622A00156b01926r2411J7699e6983k67873A58971F6928a8523C50307h7059j43288
9611b30347A00994c62566F2482c74300I8868D9382c37341A56665b94737g7362
9600a4960p4345j92391A15485E5189B6489a7052j38962o4668M4419Q8040b7864
9588A53850G4092K2253b442j39935j50731j52648A8580c4145j6669A876J05019
9577A06895e50798a30746b965j38407D225a55024e0636C4391K54435F5044d50000
9565a6225q9280K7847r0573h3999F8863J54154A5962a17820N7418l1433k65252
$$ plain form
9646 -112019 -29619 -34045 43456 69616 -327176 60625 -166350 201939 -93286 22694 -144149
9634 -349209 249431 -77368 -41042 133842 86112 179637 5434 -84639 -388921 -70150 191496
9622 100156 -201926 -294337 -276638 -56983 -324856 158971 66928 -18523 350307 -87059 -230347
9611 -230347 100994 -362566 62482 -374300 98868 49382 -337341 156665 -294737 -77362
9600 -14960 -89305 -281696 115485 55189 26489 -17052 -156014 -220682 -176263 -88223 -27864
9588 153850 74092 96345 -2442 -142377 -293108 -445756 18580 -34145 -50814 1876 106895
9577 106895 -550798 -130746 -2965 -141372 4225 -155024 -50636 34391 288826 65044 -450000
9565 -16225 -105505 -77658 -168231 -83999 68863 223017 15962 -117820 -60402 -91835 -357087
9554c57087J43695g2992j00089j65432C4392J31306c47975K0087P3797k07576
9544d61667K1783a95920R3672D8299b27724F8866a1938j64870A29230a22032e7110
9532a15059k93953J78301I7996a57899j11148G7679b28152i7974b7543B15731
9521h0209A31983O8541A9989q469e7754j9064p0027k49122a67613A2090a45612
9509c3798D0651J80362d1118A2469a85780m4591E0240K7069d6198A27486i4055
9497a21678r2312B54489c1631k01996q3373R7401H734K60211b7116k72895J10378
9486a89633j68866D80c1515D27485d52025J82615B55646B5869a5335r9462B8538
9474b76024a0059k97567C12651A28782b86151a0231k0996j54451p9062f5988A16281
$$ plain form
9554 -357087 -213392 -72992 -173081 -338513 34392 165698 -347975 -327888 -254091 -461667
9544 -461667 -439884 -195920 -102248 48299 -227724 68866 -11938 -176808 129230 -122032 -57110
9532 -115059 -409012 -230711 97996 -157899 -269047 77679 -228152 -97974 -27543 215731
9521 -80209 131983 200524 19989 11520 -57754 -76818 -146845 -395967 -167613 12090 -145612
9509 -33798 40651 221013 -41118 12469 -185780 -230371 50240 77309 -46198 127486 -94055
9497 -121678 -213990 254489 -31631 -233627 -317000 -219599 8734 268945 -27116 -300011 -189633
9486 -189633 -358499 480 -31515 427485 -452025 -269410 255646 25869 -15335 -114797 28538
9474 -276024 -10059 -307626 312651 128782 -286151 -10231 -31227 -185678 -264740 -65988 116281
9462d19877B08711l3168b03587Q0191E9227b75709O1469a442A48283J62775c72475
9450F3327b89063C07560j32543a61613R913j19038c927j87345A35685L8158a18450
9438a40580J6582D32004b0885l26929j82901e0057j44458O9962M8859l86156a51291
9426i3008r2559B83308C5082b86310A7279J99959e3087D9583J47705b03469A8822
9414e3964A05302J9335f7965m312l06114A13362e2798j69282D2173B978e7250
9402b64503A4997L8398d30498o0042g243A4960f2718C83884H5017a01476B7557
9390c1556B66458a3992l40836a50207j08542A69443A3710c82815e6597o7225G6296
9378A00916J83581P0660a19472A81745a1126j82166A51186f9198B50591b85816
$$ plain form
9462 -419877 208711 175543 -203587 -123396 59227 -275709 -214240 -1442 148283 311058 -372475
9450 63327 -289063 307560 175017 -161613 -151700 -270738 -3927 -191272 135685 173843 -118450
9438 -140580 -123998 432004 -20885 -347814 -530715 -50057 -194515 -124553 -75694 -461850 -151291
9426 -93008 -185567 283308 35082 -286310 17279 217238 -53087 49583 197288 -203469 18822
9414 -53964 105302 124637 -67965 -72277 -378391 113362 -52798 -222080 42173 2978 -57250
9402 -264503 14997 53395 -430498 -490540 -7243 14960 -62718 383884 85017 -101476 27557
9390 -31556 266458 -13992 -354828 -150207 -258749 169443 13710 -382815 -56597 -123822 76296
9378 100916 284497 355157 -119472 181745 -11126 -193292 151186 -69198 250591 -285816
9367B07157d7564j27591G3822K07262a78348H4230B2994D779K1167a1533D0440
9355A09086c37625f1541A01608f8225k71926g732l67371A6569h3225a8675k96090
9344c14765C6151b5800A82161a85354K5188P2377F6985g656B2284a16118j93797
9333c09915f6381c1641B79786b18057A89169d17295a97367m6008e2843j66483
9323b19326A8349b82796F1146g758A04810g6377j11311B33225a8993k23635m2690
9312b85318b3004m0238j49182o509o329A32582J07801f7840A12133a84326A38756
9300e2433M838A25698h8642G4439f0861l15970I5584c24094j45105B23055j2979
9289B10076q6058d8271A9186K07581G3267R6732B8943a83876K3398b5817G2487
$$ plain form
9367 207157 -47564 -175155 73822 281084 -178348 84230 22994 4779 25946 -11533 40440
9355 109086 -337625 -61541 101608 -68225 -340151 -7732 -375103 16569 -83225 -18675 -314765
9344 -314765 36151 -25800 182161 -185354 -160166 -87789 66985 -7656 22284 -116118 -309915
9333 -309915 -66381 -31641 279786 -218057 189169 -417295 -197367 -243375 -52843 -219326
9323 -219326 18349 -282796 61146 -7758 104810 -76377 -187688 233225 -18993 -242628 -285318
9312 -285318 -23004 -63242 -212424 -218933 -225262 132582 240383 -67840 112133 -184326 138756
9300 -52433 -47595 125698 -88642 74439 -60861 -376831 95584 -324094 -469199 223055 210076
9289 210076 124018 -48271 19186 226767 73267 169999 28943 -183876 -160478 -25817 72487
9277e04791E6395b08847A07799d5793q7389J3599k4044C0639c0838k02118n9287
9266b92243Q5211d179l37967i586I2693P6140a33980A80939m1614N6265b2854
9254D0310g9527o1965A04051O4402O0026a22462G1960e70696B00113b34898a03334
9242A51898b24988J05448L3275A77244g4791n7033A67456A3997L4854e9578j95736
9231b55314A2569c4702A38296D9027c4444k74578A64845l0387a90278Q5987A11590
9219e7950J0895j05395K1828f379r4386J4976G9123N5373c01214B57822A11180
9207a60799m8773A02707o249b73232a10666C2937c42446C4381a70515A39082n8969
9196H0113Q4396b95425A61180J9582e8277j19211d6942H4705c8901G3612c33232
$$ plain form
9277 -504791 56395 -208847 107799 -45793 -133182 -119583 -143627 30639 -30838 -232956 -292243
9266 -292243 -207032 -4179 -342146 -9586 92693 168833 -133980 180939 139325 195590 -22854
9254 40310 -79527 -141492 104051 168453 228479 -122462 71960 -570696 200113 -234898 -103334
9242 151898 -224988 -119540 -86265 177244 -74791 -131824 167456 13997 48851 -59578 -255314
9231 -255314 12569 -34702 138296 49027 -34444 -309022 164845 134458 -190278 -104291 111590
9219 -57950 -47055 -152450 -130622 -6379 -100765 -85789 79123 134496 -301214 257822 111180
9207 -160799 -209572 102707 96458 -273232 -110666 32937 -342446 34381 -170515 139082 80113
9196 80113 164509 -295425 161180 180762 -58277 -177488 -46942 84705 -38901 73612 -333232
9184b05308A27288c42724A59358A5427b15578B19691b44041J02118l2369I2966
9173b89795A8060c82278a46264A65956D8587f34615i7994B32911C7270b72796
9162A8222e7972B09754a77568j65847E1850J88317a09482k98001A71553o7438
9152A04115J26501b51240M3870h1043o8103A42663b34725A45726F9811b17355
9141c3771D9328A4484N6707J08830F0065J7458a9308I0898K8561g4631G1909a92146
9128b42754E1066O6855d2662B30539a82258B0826b64730J26522O2843K6860k67766
9117c16271c0111D2065J63659c03010I9949b8392D0152Q2628b23669a10427j13044
9106b23471J03064e3062j05745N8358C59151a93996H6330d7100r0621B5154K09642
$$ plain form
9184 -205308 127288 -342724 159358 15427 -215578 219691 -244041 -141923 -174292 92966
9173 -289795 18060 -382278 -146264 165956 48587 -634615 -97994 232911 37270 -272796
9162 18222 -57972 209754 -177568 -343415 51850 240167 -109482 -407483 171553 104115
9152 104115 230616 -251240 -207370 -81043 -149146 142663 -234725 145726 69811 -217355
9141 -33771 49328 14484 71191 180021 60065 77523 -19308 90898 119459 -74631 71909 -192146
9128 -242754 51066 117921 -42662 230539 -182258 20826 -264730 -138208 -75365 -48505 -316271
9117 -316271 -30111 42065 205724 -303010 99949 -28392 40152 122780 -223669 -110427 -223471
9106 -223471 -120407 -53062 -158807 -100449 359151 -193996 86330 -47100 -137721 25154 234796
9095B34796a53544k9208B7038J5958a85772B8331b49003B06032i2248o4616a5852
9083a57315e4083G2114c4133M324F7392a3003a901j07498N1892l93531J11520
9072c39518J24312B10267B2161J22568g0141H6149a3783l43125A02985h9296r5927
9061a85223j36935A70929h6672C5811M3307b83707j49651H4688A0331d1722l58358
9050d00080A43502b19748B5693g9567I9705J2688a98089O2690a5333I5405f4829
9038G5362k834b6055j77619a01223j46355J0425Q3261D07485a54115A94518b55531
9026b6421A53882l7377n7622K3770P927k5747F466J67291c71667a62299j91110
9015c53409Q3093b7909q7697k45779A27074a75218f3050j13578j99763d7666G2111
$$ plain form
9095 234796 -153544 -182752 27038 42996 -185772 28331 -249003 206032 -92248 -156864 -15852
9083 -157315 -54083 72114 -34133 -29809 67392 -13003 -1901 -109399 -57507 -451038 -339518
9072 -339518 -215206 210267 22161 144729 -70141 86149 -13783 -356908 102985 -89296 -185223
9061 -185223 -322158 170929 -86672 35811 79118 -283707 -433358 84688 10331 -41722 -400080
9050 -400080 143502 -219748 25693 -79567 99705 112393 -198089 -135399 -15333 95405 -64829
9038 75362 72528 -26055 -203674 -101223 -247578 -237153 -153892 407485 -154115 194518 -255531
9026 -26421 153882 116505 58883 82653 90580 64833 6466 173757 -371667 -162299 -353409
9015 -353409 -270316 -27909 -115606 -361385 127074 -175218 -63050 -176628 -376391 -47666 72111
9003G2036a50517D1172d1890k80174a13822M4210A10669a23451N3918b4997e558
8991a15343M0216A80406d26332A0221M52i5172b9950j98023J09630I5778b38288
8979C9915K03866L7466b71202A52655a17164j97699A00657k16g166k98582B41290
8967B1336c83914F4185h2363a7973N399k08793A25477a71434j01874D02823a12287
8955c15546C93454j08551D3604A0643d45684J37675r6785a71485B02001q0808
8945A21193D3927J53020o4226b957A48070i1823m9251E3317b5037l4717B32930
8933A10999j4274D7105i143D4695J99488b4228q9154L5462E2800K85251J553480
8922A891531M206884A919678H17547l59553B02361b06194D4549i2859j55874b1891
$$ plain form
9003 72036 -150517 41172 -41890 -322064 -113822 -69612 110669 -123451 -69533 -24997 -5558
8991 -115343 -75127 180406 -426332 10221 10673 -95172 -29950 -227973 -118343 95778 -238288
8979 39915 243781 281247 -271202 152655 -117164 -314863 100657 100441 -7166 -305748 241290
8967 21336 -383914 64185 -82363 -17973 -12574 -221367 125477 -171434 -273308 402823 -112287
8955 -315546 393454 284903 43604 10643 -445684 -308009 -404794 -171485 202001 121193
8945 121193 43927 196947 132721 -2957 148070 -91823 -141074 53317 -25037 -59754 232930
8933 110999 96725 47105 -9143 44695 244183 -24228 -113382 -77920 52800 338051 1891531
8922 1891531 6098415 1919678 817547 457994 202361 -206194 44549 -92859 -248733 -21891
8911g6539n220K0395k36581h3861B31455A14747c1056j2912H141P7805j8263R3253
8899A60936a81548e4412B63465a10980j94724h5905d0854A74500d8463D6899a81047
8887e2073B31086b20394I7263b8142A98449e02521E8023J17492a40518j70229
8877c10747A23199F195a93129A13895a03674A35380c03630G9065c71501I2148
8866a79034A91863b4096k46972H7438C6461m157a43219r3257N8593l03211H658
$$ plain form
8911 -76539 -81759 -61364 -297945 -83861 231455 114747 -31056 -43968 8141 85946 67683 160936
8899 160936 -181548 -54412 263465 -110980 -305704 -85905 -40854 174500 -48463 46899 -181047
8887 -52073 231086 -220394 97263 -28142 198449 -502521 58023 175515 -140518 -310747
8877 -310747 123199 6195 -193129 113895 -103674 135380 -303630 79065 -371501 92148
8866 -179034 191863 -24096 -271068 87438 36461 32304 -143219 -236476 -177883 -481094 8658
$$ [...]
##END NTUPLES=NMR SPECTRUM
##END=
