
##TITLE=AC1372_2418_7221647_llQExT8r8K
##JCAMPDX= 6.0         $$ Bruker NMR JCAMP-DX V2.0
##DATA TYPE= NMR SPECTRUM
##DATA CLASS= NTUPLES
##ORIGIN= BRUKER
##OWNER= Administrator
$$ 1.72 TOPSPIN		Version 2.1
$$ 2012-12-17 15:37:49.154 -0500  Administrator@X
$$ Compression mode = diff/dup
##.OBSERVE FREQUENCY= 400.02188249412
##.OBSERVE NUCLEUS= ^1H
##.ACQUISITION MODE= SIMULTANEOUS (DQD)
##.ACQUISITION SCHEME= undefined
##.AVERAGES= 64
##.DIGITISER RES= 22
##SPECTROMETER/DATA SYSTEM= spect
##.PULSE SEQUENCE= noesygpps1d.comp
##.SOLVENT NAME= COFFEE_meoh
##.SHIFT REFERENCE= INTERNAL, COFFEE_meoh, 1, 14.96057
##AUDIT TRAIL= $$ (NUMBER, WHEN, WHO, WHERE, PROCESS, VERSION, WHAT)
$$ ##TITLE= Audit trail, TOPSPIN		Version 2.1
$$ ##JCAMPDX= 5.01
$$ ##ORIGIN= Bruker BioSpin GmbH
$$ ##OWNER= Administrator
$$ $$ E:\/data/COFFEE/nmr/AC1372_2418_7221647_llQExT8r8K/32/pdata/1/auditp.txt
$$ ##AUDIT TRAIL=  $$ (NUMBER, WHEN, WHO, WHERE, PROCESS, VERSION, WHAT)
(   1,<2012-12-17 15:37:43.342 -0500>,<Administrator>,<X>,<go>,<TOPSPIN 2.1>,
      <created by zg
	started at 2012-12-17 15:26:13.307 -0500,
	POWCHK enabled, PULCHK disabled,
       configuration hash MD5:
       86 BA 57 50 F2 9D 5C 9B 26 00 A9 28 5F 66 2E 89
       data hash MD5: 64K
       43 AF A0 7E 51 A9 40 00 55 43 80 96 24 46 13 DF>)
(   2,<2012-12-17 15:37:46.482 -0500>,<Administrator>,<X>,<proc1d>,<TOPSPIN 2.1>,
      <Start of raw data processing
       efp LB = 0.3 FT_mod = 6 PKNL = 1 PHC0 = 0 PHC1 = 0 SI = 128K 
       data hash MD5: 128K
       7F 21 61 0B DF 20 38 C5 56 AB A4 D0 3D 14 E0 AE>)
(   3,<2012-12-17 15:37:47.498 -0500>,<Administrator>,<X>,<proc1d>,<TOPSPIN 2.1>,
      <pk PHC0 = -81.28784 PHC1 = 0 
       data hash MD5: 128K
       28 37 71 77 37 0E 02 79 78 05 60 A3 76 2C 2D 74>)
(   4,<2012-12-17 15:37:48.123 -0500>,<Administrator>,<X>,<proc1d>,<TOPSPIN 2.1>,
      <abs ABSG = 1 
       data hash MD5: 128K
       B7 AC 83 1C AE 19 CC 02 C7 AD FE F2 60 E8 56 92>)
(   5,<2012-12-17 15:37:48.311 -0500>,<Administrator>,<X>,<proc1d>,<TOPSPIN 2.1>,
      <abs ABSG = 2 
       data hash MD5: 128K
       51 27 61 C6 19 74 65 AF 84 B4 D1 F3 F6 3D 05 F5>)
(   6,<2012-12-17 15:37:48.436 -0500>,<Administrator>,<X>,<proc1d>,<TOPSPIN 2.1>,
      <abs ABSG = 3 
       data hash MD5: 128K
       90 3F D7 4F 0E 0C 73 30 DB 1B 94 2E F9 70 F6 46>)
(   7,<2012-12-17 15:37:48.607 -0500>,<Administrator>,<X>,<proc1d>,<TOPSPIN 2.1>,
      <abs ABSG = 4 
       data hash MD5: 128K
       AF DE A5 B6 70 29 66 B0 5C A5 50 23 4F 13 04 66>)
(   8,<2012-12-17 15:37:48.779 -0500>,<Administrator>,<X>,<proc1d>,<TOPSPIN 2.1>,
      <abs ABSG = 5 
       data hash MD5: 128K
       8F 46 EB D1 A6 03 6E 56 72 30 6A A2 09 56 7E 35>)
$$ ##END=
$$ 
$$ $$ hash MD5
$$ $$ 94 C2 07 DF F7 D2 54 FD CC AD 7C 56 78 8E 3D 71
##$RELAX= 
##$RELAX= 
##$RELAX= 
##$RELAX= 
##$RELAX= 
##$RELAX= 
##$RELAX= 
##$RELAX= 
$$ Bruker specific parameters
$$ --------------------------
##$DU= <E:\>
##$EXPNO= 32
$$ [...]
##$TP07= 0
##$TPNAME0= <>
##$TPNAME1= <>
##$TPNAME2= <>
##$TPNAME3= <>
##$TPNAME4= <>
##$TPNAME5= <>
##$TPNAME6= <>
##$TPNAME7= <>
##$TPOAL= (0..7)
0.5 0.5 0.5 0.5 0.5 0.5 0.5 0.5
##$TPOFFS= (0..7)
0 0 0 0 0 0 0 0
##$TUNHIN= 0
##$TUNHOUT= 0
##$TUNXOUT= 0
##$USERA1= <user>
##$USERA2= <user>
##$USERA3= <user>
##$USERA4= <user>
##$USERA5= <user>
##$V9= 5
##$VALIST= <valist>
##$VCLIST= <CCCCCCCCCCCCCCC>
##$VD= 0
##$VDLIST= <DDDDDDDDDDDDDDD>
##$VPLIST= <PPPPPPPPPPPPPPP>
##$VTLIST= <TTTTTTTTTTTTTTT>
##$WBST= 2048
##$WBSW= 25
##$XGAIN= (0..3)
0 0 0 0
##$XL= 0
##$YL= 0
##$YMAX_a= 6118607
##$YMIN_a= -12344115
##$ZGOPTNS= <>
##$ZL1= 120
##$ZL2= 120
##$ZL3= 120
##$ZL4= 120
##$ABSF1= 14.96057
##$ABSF2= -5.597611
##$ABSG= 5
##$ABSL= 3
##$ALPHA= 0
##$AQORDER= 0
##$ASSFAC= 0
##$ASSFACI= 0
##$ASSFACX= 0
##$ASSWID= 0
##$AUNMP= <proc_prof1d_extract.lims>
##$AXLEFT= 0
##$AXNAME= <>
##$AXNUC= <1H>
##$AXRIGHT= 0
##$AXTYPE= 0
##$AXUNIT= <>
##$AZFE= 0.1
##$AZFW= 0.1
##$BCFW= 0
##$BC_mod= 0
##$BYTORDP= 0
##$COROFFS= 0
##$CY= 15
##$DATMOD= 1
##$DC= 0
##$DFILT= <>
##$DTYPP= 0
##$F1P= 0
##$F2P= 0
##$FCOR= 0.5
##$FTSIZE= 131072
##$FT_mod= 6
##$GAMMA= 0
##$GB= 0
##$INTBC= 1
##$INTSCL= 1
##$ISEN= 128
##$LB= 0.3
##$LEV0= 0
##$LPBIN= 0
##$MAXI= 10000
##$MC2= 0
##$MEAN= 0
##$ME_mod= 0
##$MI= 0
##$NCOEF= 0
##$NC_proc= -2
##$NLEV= 6
##$NOISF1= 0
##$NOISF2= 0
##$NSP= 0
##$NTH_PI= 0
##$NZP= 0
##$OFFSET= 14.96057
##$PC= 1
##$PHC0= -81.28784
##$PHC1= 0
##$PH_mod= 1
##$PKNL= yes
##$PPARMOD= 0
##$PPDIAG= 0
##$PPIPTYP= 0
##$PPMPNUM= 2147483647
##$PPRESOL= 1
##$PSCAL= 4
##$PSIGN= 0
##$PYNMP= <proc.py>
##$REVERSE= no
##$SF= 400.020009808784
##$SI= 131072
##$SIGF1= 0
##$SIGF2= 0
##$SINO= 400
##$SIOLD= 131072
##$SPECTYP= <>
##$SREGLST= <1H.CDCl3>
##$SSB= 0
##$STSI= 131072
##$STSR= 0
##$SW_p= 8223.68421052631
##$SYMM= 0
##$S_DEV= 0
##$TDeff= 65536
##$TDoff= 0
##$TI= <>
##$TILT= no
##$TM1= 0
##$TM2= 0
##$TOPLEV= 0
##$USERP1= <user>
##$USERP2= <user>
##$USERP3= <user>
##$USERP4= <user>
##$USERP5= <user>
##$WDW= 1
##$XDIM= 131072
##$YMAX_p= 409161597
##$YMIN_p= -11648
##$CURPLOT= <Network HP LaserJet P1505>
##$CURPRIN= <$Network HP LaserJet P1505>
##$DFORMAT= <normdp>
##$LAYOUT= <+/1D_H.xwp>
##$LFORMAT= <normlp>
##$PFORMAT= <normpl>
##$SURQMSG= 1
$$ End of Bruker specific parameters
$$ ---------------------------------
##NTUPLES= NMR SPECTRUM
##VAR_NAME=  FREQUENCY,     SPECTRUM/REAL,   SPECTRUM/IMAG
##SYMBOL=    X,             R,               I
##VAR_TYPE=  INDEPENDENT,   DEPENDENT,       DEPENDENT
##VAR_FORM=  AFFN,          ASDF,            ASDF
##VAR_DIM=   131072,        131072,          131072
##UNITS=     HZ,            ARBITRARY UNITS, ARBITRARY UNITS
##FACTOR=    0.0627417313425164, 1,          1
##FIRST=     8223.62146879497, 2813,         -62371
##LAST=      0,             4754,            -61747
##MIN=       0,             -11648,          0
##MAX=       8223.62146879497, 409161597,    0
$$ Real data points
##PAGE= N=1
##DATA TABLE= (X++(R..R)), XYDATA
$$ [...]
61748D91434K333J229j99j477j936j899k554m246n744n773m648l637l242k958
$$ 491434 493767 494996 494797 493320 491384 489485 486931 482685 476941 471168 466520 462883 459641 456683
61734D56683k438j924j532r88k97P1q1k15K63J297K382L171L578L600L366L168
$$ 456683 454245 452321 450789 449801 449504 449575 449494 449279 449542 450839 453221 456392 459970 463570 466936 470104
61718D70104L212L437L720M028M234M062L479K837K317J561J89j460k619l069
$$ 470104 473316 476753 480473 484501 488735 492797 496276 499113 501430 502991 503180 501720 499101 496032
61704D96032l338l911m685n351n836o096n810m713l160j967j665k093k746l274
$$ 496032 492694 488783 484098 478747 472911 466815 461005 456292 453132 451165 449500 447407 444661 441387
61690D41387l599l721l657l508l406l300k894k013r97m98p83j425j837j848j563
$$ 441387 437788 434067 430410 426902 423496 420196 417302 415289 414292 413794 413011 411586 409749 407901 406338
61675D06338q97K41J383J699J002P1k86j63j52l40l23q5k40j105k032k068j070
$$ 406338 405441 405682 407065 408764 409766 409837 409551 409388 409236 408896 408573 408488 408248 407143 405111 403043 401973
61658D01973K50J238J837K121J895J131M37M97J119J452J282J392K289L220L184
$$ 401973 402223 403461 405298 407419 409314 410445 410882 411379 412498 413950 415232 416624 418913 422133 425317
61643D25317K457K220K860L588L791L788L893L658K654J266K9j258k963m567n084
$$ 425317 427774 429994 432854 436442 440233 444021 447914 451572 454226 455492 455521 454263 451300 446733 441649
61628D41649m405l422k859k705k814l321m150m675m304l107j686o55l06n17q10
$$ 441649 437244 433822 430963 428258 425444 422123 417973 413298 408994 405887 404201 403546 403240 402723 401913
61613D01913p14k17K56L04j98j196k503l791m820n681o563p303p528p223o751
$$ 401913 401199 400982 401238 401542 401344 400148 397645 393854 389034 383353 376790 369487 361959 354736 347985
61598C47985o341n892n334m817m428m050l616l229k963k828k884l120l244l001
$$ 347985 341644 335752 330418 325601 321173 317123 313507 310278 307315 304487 301603 298483 295239 292238
61584B92238k625k582k853l014k960k988l086k836k212j754j648j347n68O5ol10
$$ 292238 289613 287031 284178 281164 278204 275216 272130 269294 267082 265328 263680 262333 261765 261830 261824 261514
61568B61514j42K42Q9n15p63m71l42p87j309j332q99k74M82J182J411J199J258
$$ 261514 261372 261614 261703 261188 260425 259954 259612 258825 257516 256184 255285 255011 255493 256675 258086 259285 260543
61551B60543J926K412J789M45k96K4M49J05n00k93P98J772J913J542J331J478
$$ 260543 262469 264881 266670 267115 266819 266843 267292 267397 266897 266604 267402 269174 271087 272629 273960 275438
61535B75438J766K000K118K101K126K448K859K656J546K99r8K12J44q07j955k509
$$ 275438 277204 279204 281322 283423 285549 287997 290856 293512 295058 295357 295259 295471 295615 294808 292853 290344
61519B90344k532k454k276j862j550j776k229k114j254l50m2j82k92k98m62p29
$$ 290344 287812 285358 283082 281220 279670 277894 275665 273551 272297 271947 271905 271723 271431 271133 270671 269942
61503B69942n98K07J202J458O13o62j335j103m61J50P94J472J662R99P5j53L57
$$ 269942 269344 269551 270753 272211 272824 272162 270827 269724 269263 269413 270207 271679 273341 274340 274415 274262 274619
61486B74619O83L15j35N4O38Q64O75P11J259J859K100K235K661L183L239K631
$$ 274619 275302 275617 275482 275536 276174 277038 277713 278424 279683 281542 283642 285877 288538 291721 294960 297591
61470B97591J663O21m28j277j455p29M36J133Q22j63r27q65k92j07o90j328j079
$$ 297591 299254 299875 299447 298170 296715 295986 296422 297555 298377 298214 297287 296422 296130 296023 295333 294005 292926
61453B92926r8M71j0q19q68l5R37J515J710J636J342J106J284J815K294K586K866
$$ 292926 292828 293299 293289 292470 291602 291567 292504 294019 295729 297365 298707 299813 301097 302912 305206 307792 310658
61436C10658L051K814K305K316L275M530M970M200K779J524Q29N30K32j84l39
$$ 310658 313709 316523 318828 321144 324419 328949 333919 338119 340898 342422 343251 343781 344013 343829 343490
61421C43490K18J321K309K834L156L494L586L222K766K711K962K944K276J042
$$ 343490 343708 345029 347338 350172 353328 356822 360408 363630 366396 369107 372069 375013 377289 378331
61407C78331l93j549k111k359l012m258n227m986l803k805k544k542k303k013
$$ 378331 377938 376389 374278 371919 368907 364649 359422 354436 350633 347828 345284 342742 340439 338426
61393C38426j956j958j782j659j843j969j446m29K47K11J43Q10J923K403J809
$$ 338426 336470 334512 332730 331071 329228 327259 325813 325384 325631 325842 325985 326795 328718 331121 332930
61378C32930R01O79J266K048K535K621K258J468O78M61P78R80P76O93J217J940
$$ 332930 333831 334510 335776 337824 340359 342980 345238 346706 347384 347845 348623 349603 350379 351072 352289 354229
61362C54229K065J446O79K66K41N35J192K142L100L856M457M980N352N523N658
$$ 354229 356294 357740 358419 358685 358926 359461 360653 362795 365895 369751 374208 379188 384540 390063 395721
61347C95721O043O799P801Q774R539J0092J0425J0321R545Q294P216O788O772
$$ 395721 401764 408563 416364 425138 434677 444769 455194 465515 475060 483354 490570 497358 504130
61334E04130O439N356L900L020L334M315M450K673m12l083m396m936n598o259
$$ 504130 510569 515925 519825 522845 526179 530494 534944 537617 537205 534122 529726 524790 519192 512933
61320E12933o332o010o089o621o637n425l481j899j145q59n13O4P96J618K459
$$ 512933 506601 500591 494502 487881 481244 475819 472338 470439 469294 468435 467922 467986 468782 470400 472859
61305D72859L125L453L686M417N877P412Q072P674O802N666L723P78k173l893
$$ 472859 475984 479437 483123 487540 493417 500829 508901 516575 523377 529043 532766 533544 531371 527478
61291E27478m377m699n548o559p045o814o145n369m621l727k444j030l21p61j562
$$ 527478 523101 518402 512854 506295 499250 492436 486291 480922 476301 472574 470130 469100 468779 468018 466456
61276D66456j433o3J688K973L653L847L662L565M340O082P750Q141P084N364L842
$$ 466456 465023 464960 466648 469621 473274 477121 480783 484348 488688 494770 502520 510661 517745 523109 526951
61261E26951K979K925L638M966O787Q997J1305J3238J4467J4864J4257J2584J0342
$$ 526951 529930 532855 536493 541459 548246 557243 568548 581786 596253 611117 625374 637958 648300
61248F48300Q471P474O960O316N332L958J909r29l985o465q212r595j0670j0982
$$ 648300 656771 664245 671205 677521 682853 686811 688720 687791 683806 677341 669129 659534 648864 637882
61234F37882j0363r419q980r229r630r575q896p739o232m424k545j011n4M78Q61
$$ 637882 627519 618100 609120 599891 590261 580686 571790 564051 557819 553395 550850 549839 549785 550263 551124
61219E51124J132J254J331J369J017N9r62j098j20J236K218K719K825K380J329
$$ 551124 552256 553510 554841 556210 557227 557286 556324 555226 555106 556342 558560 561279 564104 566484 567813
61204E67813P9r48j711k226k261j753j056k91J031L163N410P013Q347J0352J2952
$$ 567813 567892 566944 565233 563007 560746 558993 557937 557646 558677 561840 567250 574263 582610 592962 605914
61189F05914J5101J6333J7116J7481J6472J3698J0461Q421P684P085O071N265
$$ 605914 621015 637348 654464 671945 688417 702115 712576 720997 728681 735766 741837 747102
61177G47102N178N370N217M769M371L868K767J019q39k317l408m323n094n662
$$ 747102 752280 757650 762867 767636 772007 775875 778642 779661 778822 776505 773097 768774 763680 758018
61163G58018o222p116q344r433j0021j0440j1373j2852j4063j4278j3756j3303
$$ 758018 751796 744680 736336 726903 716882 706442 695069 682217 668154 653876 640120 626817
61151F26817j3141j2645j1165q705n760k953q82J33M45P23R10J5k557n877q406
$$ 626817 613676 601031 589866 581161 575401 572448 571566 571699 572144 572867 573777 573792 571235 565358 556952
61136E56952r739j0596j1249j0951r292p137n603m670l541j898q9J646L308M659
$$ 556952 547213 536617 525368 514417 505125 497988 492385 487715 484174 482276 482187 483833 487141 491800
61122D91800N360N645O215P356Q792J0410J2471J4859J6831J7963J8760J9870
$$ 491800 497160 502805 509020 516376 525168 535578 548049 562908 579739 597702 616462 636332
61110F36332K1156K2087K2650K3227K3734K3610K2676K1470K0558J9948J9303
$$ 636332 657488 679575 702225 725452 749186 772796 795472 816942 837500 857448 876751
61099H76751J8317J6639J3828R794N141P56k974o346r741j3027j5669j7311j8118
$$ 876751 895068 911707 925535 935329 940470 941226 938252 931906 922165 909138 893469 876158 858040
61086H58040j8559j8976j9447j9929k0369k0640k0588k0183j9541j8723j7663
$$ 858040 839481 820505 801058 781129 760760 740120 719532 699349 679808 661085 643422
61075F43422j6425j5345j4677j4189j3381j2059j0466q851p229n623m277l440
$$ 643422 626997 611652 596975 582786 569405 557346 546880 538029 530800 525177 520900 517460
61063E17460l029k659j896n68R96K026K004J460J650L133N013O091O360O731P523
$$ 517460 514431 511772 509876 509308 510304 512330 514334 515794 517444 520577 525590 531681 538041 544772 552295
61048E52295Q116Q224Q610J0040J2247J4442J6375J8209J9765K0744K1489K2799
$$ 552295 560411 568635 577245 587285 599532 613974 630349 648558 668323 689067 710556 733355
61036G33355K4882K7117K8980L0689L2686L4898L6704L7459L6993L5921L5389
$$ 733355 758237 785354 814334 845023 877709 912607 949311 986770 1023763 1059684 1095073
61025A095073L6323L8837M2519M6960N1760N6485O1233O6873P4034Q2413R2099
$$ 1095073 1131396 1170233 1212752 1259712 1311472 1367957 1429190 1496063 1570097 1652510 1744609
61014A744609J05031J23693J48572J78669K14523K58752L13450L79748M60907
$$ 1744609 1849640 1973333 2121905 2300574 2515097 2773849 3087299 3467047 3927954
61005C927954N62881O90165Q43671J022061J213940J376469J427403J284219R35191
$$ 3927954 4490835 5181000 6024671 7046732 8260672 9637141 11064544 12348763 13283954
60996A3283954M74484N4250k08059k81526j99608j5760K03594L61784L49862J13071
$$ 13283954 13758438 13812688 13604629 13323103 13123495 13107735 13311329 13673113 14022975 14136046
60986A4136046k96454p43134j092029j278583j314484j247944j126375r83642
$$ 14136046 13839592 13096458 12004429 10725846 9411362 8163418 7037043 6053401
60978F053401q41536p11743n97559m98203m12860l41119k81719k32772j92929
$$ 6053401 5211865 4500122 3902563 3404360 2991500 2650381 2368662 2135890 1942961
60969A942961j61376j37010j18287j03700r1925q1813p2712o4657n7783n1689
$$ 1942961 1781585 1644575 1526288 1422588 1330663 1248850 1176138 1111481 1053698 1002009
60959A002009m5682l9497l3465k8129k3856k0777j8807j7675j7053j6632j6115
$$ 1002009 956327 916830 883365 855236 831380 810603 791796 774121 757068 740436 724321
60948G24321j5173j3523j1074q120n336l333k096j094j23L12k97j676l114m323
$$ 724321 709148 695625 684551 676431 671095 667762 665666 664572 664449 664761 664464 662788 659674 655351
60934F55351n401o157o220n792n695o395p450q108q091p587o869o179n812n975
$$ 655351 649950 643793 637573 631781 626086 619691 612241 604133 596042 588455 581586 575407 569595 563620
60920E63620o601p289p417o530m855l252k414k233k219k214k271k136j461m08
$$ 563620 557019 549730 542313 535783 530928 527676 525262 523029 520810 518596 516325 514189 512728 512320
60906E12320N77J440K389L186L345L054L130L949N106O253P519Q834R578R367
$$ 512320 512897 514337 516726 519912 523257 526311 529441 533390 538496 544749 552268 561102 570680 580047
60892E80047Q614P957P627P688Q234Q940Q969P916O522N990O750Q252R617J0281
$$ 580047 588661 596618 604245 611933 620167 629107 638076 645992 652514 658504 665254 673506 683123 693404
60878F93404J0331J0508J1608J3620J5653J6940J7568J8115J8934J9957K0795
$$ 693404 703735 714243 725851 739471 755124 772064 789632 807747 826681 846638 867433
60867H67433K0949K0301J9463J9101J8855J7632J5129J2264R815P389M339R71
$$ 867433 888382 908683 928146 947247 966102 983734 998863 1011127 1020942 1028331 1032670 1033641
60855A033641j867l921n657p587r922j2609j5185j7056j8277j9628k1511k3220
$$ 1033641 1031774 1027853 1022196 1014609 1004687 992078 976893 959837 941560 921932 900421 877201
60843H77201k3794k3157k1953k0719j9797j9525j9878k0227k0065j9627j9307
$$ 877201 853407 830250 808297 787578 767781 748256 728378 708151 688086 668459 649152
60832F49152j8879j7910j6587j5470j4678j3937j3122j2226j1121r841q761p982
$$ 649152 630273 612363 595776 580306 565628 551691 538569 526343 515222 505381 496620 488638
60820D88638o984n506m261m063m659n186n328n216m668l525k411k099k219j710
$$ 488638 481654 476148 471887 467824 463165 457979 452651 447435 442767 439242 436831 434732 432513 430803
60806D30803m89L84L15r2j19J66M54P84J173J308J054P73Q01R92J046R63R04Q69
$$ 430803 430314 430698 431013 430921 430802 430968 431422 432206 433379 434687 435741 436514 437315 438307 439353 440316 441220 442089
60788D42089O81J36q30j944k696k835k577k118j375n28k73r43j876k362k676l346
$$ 442089 442770 442906 442076 440132 437436 434601 432024 429906 428531 428003 427730 426787 424911 422549 419873 416527
60772D16527l936l657k842k514k716k608k229k599l786m388l591k408k111k506
$$ 416527 412591 408934 406092 403578 400862 398254 396025 393426 389640 385252 381661 379253 377142 374636
60758C74636k752k857l255l637l326k469j799j514j209p69n14m93l16L07J383
$$ 374636 371884 369027 365772 362135 358809 356340 354541 353027 351818 351049 350535 350042 349726 350033 351416
60743C51416K834M383N394N357M504L415K188N92j035j754j192j86J31l83q96
$$ 351416 354250 358633 364027 369384 373888 377303 379491 380083 379048 377294 376102 375916 376047 375664 374768
60728C74768p27j11K12j71j085k127k984l475l600l605l691l655l112k256j870
$$ 374768 374041 373930 374142 373971 372886 370759 367775 364300 360700 357095 353404 349749 346637 344381 342511
60713C42511k336l043l191k805k519k650l023l413l625l383k702k112j915j595
$$ 342511 340175 337132 333941 331136 328617 325967 322944 319531 315906 312523 309821 307709 305794 304199
60699C04199o78K18J42o53j016o36k96m35o41p57j167j647j224J79J299J368J245
$$ 304199 303521 303739 303881 303228 302212 301576 301280 300845 300204 299447 298280 296633 295409 295588 296887 298255 299500
60682B99500J841K542K387J816J848K276K077J269Q48J042R85L49N5R01K380L349
$$ 299500 301341 303883 306270 308086 309934 312210 314287 315556 316404 317446 318431 318780 318835 319736 322116 325465
60666C25465L257K384J295M36pl2M54J668L388M701M743L700K572K122K423L165
$$ 325465 328722 331106 332401 332837 332830 332798 333252 334920 338308 343009 347752 351452 354024 356146 358569 361734
60650C61734L823L750K847J970J916K161J495q3j219j198j019j783l040l622l501
$$ 361734 365557 369307 372154 374124 376040 378201 379696 379613 378394 377196 376177 374394 371354 367732 364231
60635C64231l723m709n653n723n053m270l702l351l167k930k225r87J02J89p60
$$ 364231 360508 355799 350146 344423 339370 335100 331398 328047 324880 321950 319725 318738 318840 319029 318269
60620C18269j831k077j317p5R28J134L95p99j534j243k69N20O47K96j72n76p72
$$ 318269 316438 314361 313044 312969 313897 315031 315426 314627 313093 311850 311581 312101 312748 313044 312872 312296 311524
60603C11524n70m8K90O6m12m32K01Q39P56J15j63M11J139R25k58j186q94P8M00
$$ 311524 310954 310906 311196 311262 310850 310418 310619 311458 312214 312329 312166 312577 313716 314641 314383 313197 312303 312381 312781
60584C12781l37j213j220l42P44J540J998K239K380K540K812L285M097N229O283
$$ 312781 312444 311231 310011 309669 310413 311953 313951 316190 318570 321110 323922 327207 331304 336533 342816
60569C42816O773O788P039P951Q988R191Q289O903N664M488K809L50k536n112
$$ 342816 349589 356377 363416 371367 380355 389546 397835 404738 410402 414890 417699 418049 415513 410401
60555D10401o641o689n439l780k725k365j647L41L062N095N986O738Q249J0077
$$ 410401 403760 397071 391632 387852 385127 382762 381115 381456 384518 389613 395599 402337 410586 420663
60541D20663J1340J2017J2587J2902J2437J1280R901Q041N002J094k280m289n525
$$ 420663 432003 444020 456607 469509 481946 493226 503127 511168 516170 517264 514984 510695 505170
60528E05170o710p474p054n702m582m401m682m425l295k083j851k578k959j996
$$ 505170 498460 490986 483932 478230 473648 469247 464565 460140 456845 454762 452911 450333 447374 445378
60514D45378l30O54O90P06J243J957K717L998N743P104P895R241J1994J5424J8414
$$ 445378 445048 445702 446392 447098 448341 450298 453015 457013 462756 469860 477755 486996 498990 514414 532828
60499E32828K1125K4430K8270L1681L4081L5566L6102L5355L3160K9421K3616
$$ 532828 553953 578383 606653 638334 672415 707981 744083 779438 812598 842019 865635
60488H65635J5256M811o331j6850k5931l2958l7517l9730m0080l8923l6491l3231
$$ 865635 880891 885702 879371 862521 836590 803632 766115 726385 686305 647382 610891 577660
60476E77660k9664k5988k2308j9052j6651j4943j3368j1688j0047q536p211o342
$$ 577660 547996 522008 499700 480648 463997 449054 435686 423998 413951 405415 398204 391862
60464C91862o045n777m884l622k965l280l775l513k524j643j553k157k718k522
$$ 391862 385817 380040 375156 371534 368569 365289 361514 358001 355477 353834 352281 350124 347406 344884
60450C44884j601q04r21j806k562k511j795j004n44l66j80J56M39L99J15j08k16
$$ 344884 343283 342479 341558 339752 337190 334679 332884 331880 331336 330970 330790 330946 331385 331784 331899 331791 331575
60433C31575m27p20p82n98n73q43r37n15P5L33K33o4n67j065r49o2P90Q65N94
$$ 331575 331148 330428 329646 329048 328475 327632 326695 326180 326255 326588 326821 326757 326190 325125 324176 324114 324904 325769 326363
60414C26363R45J951K693K547J779R43L96K52K97O2n13p27k6J037J428J034O87
$$ 326363 327308 329259 331952 334499 336278 337221 337617 337869 338166 338228 337715 336988 336962 337999 339427 340461 341148
60397C41148Q91J313J596J912K531L308L869L936L505K922K699K976L369L499
$$ 341148 342039 343352 344948 346860 349391 352699 356568 360504 364009 366931 369630 372606 375975 379474
60383C79474L317K766J733P14P06J819K811K818K685L492M626M762M081L817L961
$$ 379474 382791 385557 387290 388004 388710 390529 393340 396158 398843 402335 406961 411723 415804 419621 423582
60368D23582L347K019J505K246K645J480k50r77p25n12n18j65O27J402K070K926
$$ 423582 426929 428948 430453 432699 435344 436824 436574 435597 434872 434360 433842 433677 434304 435706 437776 440702
60352D40702M061N326O660P929Q821R247R469R387Q303N903K986O03j078k504
$$ 440702 444763 450089 456749 464678 473499 482746 492215 501602 509905 515808 518794 519397 518319 515815
60338E15815l775m593m889m927m899m771m385l562k446j779k296l656m612m576
$$ 515815 512040 507447 502558 497631 492732 487961 483576 480014 477568 475789 473493 469837 465225 460649
60324D60649m294m545n000m931m365l751l080k128j138m01M16J765L333M495N397
$$ 460649 456355 451810 446810 441879 437514 433763 430683 428555 427417 427016 427432 429197 432530 437025 442422
60309D42422O758Q792J1111J3615J6713K0575K4742K8339L0200K9048K4459J7536
$$ 442422 449180 457972 469083 482698 499411 519986 544728 573067 603267 632315 656774 674310
60297F74310R862J812p143j6433k3823k7426k7536k5870k3556k0633j7088j3554
$$ 674310 684172 685984 678841 662408 638585 611159 583623 557753 534197 513564 496476 482922
60285D82922j0801q972p527n851l853k062j071q83r79j072j440k341l349l670
$$ 482922 472121 463149 455622 449771 445918 443856 442785 441902 440923 439851 438411 436070 432721 429051
60271D29051l051k020j212p73n40m91o66r31j118j406k077k882l079k333j263
$$ 429051 426000 423980 422768 421995 421455 420964 420298 419367 418249 416843 414766 411884 408805 406472 405209
60256D05209p54r78j425j624j494j102o05l08l77n07l32q2l13r65j315j032o38
$$ 405209 404455 403477 402052 400428 398934 397832 397227 396919 396542 396035 395703 395621 395308 394343 393028 391996 391358
60239C91358o07n72N5J088J805J990K124K515K802K529J910J640K022K498K253
$$ 391358 390751 390179 390234 391322 393127 395117 397241 399756 402558 405087 406997 408637 410659 413157 415410
60224D15410J167Nl80J70J176K063K461K257J766J627K133K806L022K869K907
$$ 415410 416577 416582 416202 416372 417548 419611 422072 424329 426095 427722 429855 432661 435683 438552 441459
60209D41459L233L467L612M134N049N674N623N443N743O315O584O462O178N601
$$ 441459 444692 448159 451771 455905 460954 466628 472251 477694 483437 489752 496336 502798 508976 514577
60195E14577M469L154K571L126M152M585M010K937K122J740J268K22j171k275
$$ 514577 519046 522200 524771 527897 532049 536634 540644 543581 545703 547443 548711 548933 547762 545487
60181E45487k870l271l685l880l690l361l214l216l161k985k690k227j699j378
$$ 545487 542617 539346 535661 531781 528091 524730 521516 518300 515139 512154 509464 507237 505538 504160
60167E04160j353j430j512j773k210k478k402k325k499k455j524J63J628K064
$$ 504160 502807 501377 499865 498092 495882 493404 491002 488677 486178 483723 482199 482362 483990 486054
60153D86054J568Q72O14R34J517J888J790J429J340J903K893L599L557L155L254
$$ 486054 487622 488494 489108 490042 491559 493447 495237 496666 498006 499909 502802 506401 509958 513113 516367
60138E16367M122N146N776O225O812P090O382M943L750L162K585J554M17l68r11
$$ 516367 520489 525635 531411 537636 544448 551538 557920 562863 566613 569775 572360 573914 574331 573963 573052
60123E73052j518k136k495k394j656k95J111J760J531J088R28Q90Q32R96J403
$$ 573052 571534 569398 566903 564509 562853 562558 563669 565429 566960 568048 568976 569866 570698 571694 573097
60108E73097J493R03J04k31k1M07Q23R95N81l59j120j068l37M77R23Q18K63j50
$$ 573097 574590 575493 575597 575366 575345 575752 576575 577570 578151 577792 576672 575604 575267 575744 576667 577485 577748 577598
60090E77598K32J135J477Q80L25O91J433J535J072Q75J108J288J369J682J892
$$ 577598 577830 578965 580442 581322 581647 582338 583771 585306 586378 587253 588361 589649 591018 592700 594592
60075E94592J141n82k164k774k838l237m129n006n548n953o534p251p702p530
$$ 594592 595733 595151 592987 590213 587375 584138 580009 575003 569455 563502 556968 549717 542015 534485
60061E34485o900o435o566p089p456p351o850o214n729n436m967l917k577j840
$$ 534485 527585 521150 514584 507495 500039 492688 485838 479624 473895 468459 463492 459575 456998 455158
60047D55158k056k408j861l70J211K196K540K548K604L091M087N175N837N952
$$ 455158 453102 450694 448833 448463 449674 451870 454410 456958 459562 462653 466740 471915 477752 483704
60033D83704N775N504N160M671L889K706J269j13j401k768m053m758m808m803
$$ 483704 489479 494983 500143 504814 508703 511409 512678 512565 511164 508396 504343 499585 494777 489974
60019D89974n218n839o260o443o444o095n377m680m259l884l352k868k623k485
$$ 489974 484756 478917 472657 466214 459770 453675 448298 443618 439359 435475 432123 429255 426632 424147
60005D24147k446k728l138k990k166j479j414j318n43L76N69K23J77N83R57J191
$$ 424147 421701 418973 415835 412845 410679 409200 407786 406468 405925 406301 406870 407093 407270 407853 408810 410001
59989D10001J614K259K789L008K847K296J790K108L254M076L763K971K626K432
$$ 410001 411615 413874 416663 419671 422518 424814 426604 428712 431966 436042 439805 442776 445402 447834
59975D47834J639N16k32q78k053l176l046j808q22o46n71j80O5K2K53R40J549
$$ 447834 449473 449989 449757 448879 446826 443650 440604 438796 437974 437328 436757 436577 436642 436664 436917 437857 439406
59958D39406J887K373K988L042K348J606J281J047O55M99Q72J404J546J065J9
$$ 439406 441293 443666 446654 449696 452044 453650 454931 455978 456633 457132 458004 459408 460954 462019 462038
59943D62038j089j269n9J476J801Q22k24o80r36j096p09m5r9q71j120m23L8n22
$$ 462038 460949 459680 459621 461097 462898 463720 463496 462816 461880 460784 460075 460030 459931 459060 457940 457517 457555 457033
59925D57033j150q51k46l37o73j53J059J742J425Q62R49J961L647N343O268O317
$$ 457033 455883 455032 454786 454449 453776 453623 454682 456424 457849 458711 459660 461621 465268 470611 476879 483196
59909D83196O269O772P478P668P182O197M686K800J281O85N22j06j263k257k708
$$ 483196 489465 496237 503715 511383 518565 524762 529448 532248 533529 534214 534736 534630 533367 531110 528402
59894E28402k877k974k815k206j257k84M12P48R50J300J757K082K334K812L470
$$ 528402 525525 522551 519736 517530 516273 515989 516401 517149 518099 519399 521156 523238 525572 528384 531854
59879E31854L933M123M316M469M184L540L214L431L424K421N89j345k873l833
$$ 531854 535787 539910 544226 548695 552879 556419 559633 563064 566488 568909 569498 568153 565280 561447
59865E61447m284m585n063n374m813l435k132j355o47K76R21J065J427K607M119
$$ 561447 557163 552578 547515 542141 537328 533893 531761 530406 529759 530035 530956 532021 533448 536055 540174
59850E40174N165N584N436M457K776J360Q71P14J11n78o19l28o86j866l193m306
$$ 540174 545339 550923 556359 560816 563592 564952 565823 566537 566648 566070 565451 565123 564437 562571 559378 555072
59834E55072n328o122o312n943n345m515l297j946q02K26J131J224Jj723k591
$$ 555072 549744 543622 537310 531367 526022 521507 518210 516264 515462 515688 516819 518043 518044 516321 513730
59819E13730k423k196k435k656k451k105j939j832j570j081k37R34J872J974J384
$$ 513730 511307 509111 506676 504020 501569 499464 497525 495693 494123 493042 492805 493739 495611 497585 498969
59804D98969O96j9j017j883j788q54k81p40j596k072k311k702k993k793k407k403
$$ 498969 499665 499646 498629 496746 494958 494104 493823 493083 491487 489415 487104 484402 481409 478616 476209 473806
59788D73806k642k499j882j366j304j375j154p33n06o05q13r78j244j742k239
$$ 473806 471164 468665 466783 465417 464113 462738 461584 460851 460345 459740 458927 457949 456705 454963 452724
59773D52724k276j604l80R72J910J938J062Q3n0O55J234J075O86Q03J268J440
$$ 452724 450448 448844 448464 449436 451346 453284 454346 454429 454379 455034 456268 457343 458029 458832 460100 461540
59757D61540J338J621K508L422L848L963M185M490M524M194L808L669L779M006
$$ 461540 462878 464499 467007 470429 474277 478240 482425 486915 491439 495633 499441 503110 506889 510895
59743E10895M408N091N752N745M858L748L134K836K168J094L18J56J44o0j86m2
$$ 510895 515303 520394 526146 531891 536749 540497 543631 546467 548635 549729 550047 550203 550347 550287 550101 550059
59727E50059O9M9L35R93J205L45r90j751j807j809k051k238k143j861j498j142
$$ 550059 550128 550177 550512 551505 552710 553055 552065 550314 548507 546698 544647 542409 540266 538405 536907 535765
59711E35765r06o40Q1J235K077K138J971K199K432J998J306J352K069K368J839
$$ 535765 534859 534219 534300 535535 537612 539750 541721 543920 546352 548350 549656 551008 553077 555445 557284
59696E57284J365J744K630L208L211K858K327J734J216P75K41l73q00q22m20L40
$$ 557284 558649 560393 563023 566231 569442 572300 574627 576361 577577 578352 578593 578220 577420 576598 576178 576518
59680E76518J225J663J140j03j157j372j029j016k001l838n607o326n812m752
$$ 576518 577743 579406 580546 580443 579286 577914 576885 575869 573868 570030 564423 558097 552285 547533
59666E47533l845l267l087l501m194m102k609o19M04K25j82j31K06P14J690L062
$$ 547533 543688 540421 537334 533833 529639 525537 522928 522309 522713 522938 522756 522625 522831 523545 525235 528297
59650E28297M083M283M024L820L629L169K447J593N91n04j463k281l330m772o098
$$ 528297 532380 536663 540687 544507 548136 551305 553752 555345 555936 555432 553969 551688 548358 543586 537488
59635E37488o588o089n092m177l523k920k125j255q01j115j960k715k978k860
$$ 537488 530900 524811 519719 515542 512019 509099 506974 505719 504918 503803 501843 499128 496150 493290
59621D93290k761l024l688m438m930n232n680o131n844m459k717j668j395j087
$$ 493290 490529 487505 483817 479379 474449 469217 463537 457406 451562 447103 444386 442718 441323 440236
59607D40236j92J046K158K989L578L930L951L468K406J130L34K40K60j66p05o59
$$ 440236 440044 441090 443248 446237 449815 453745 457696 461164 463570 464700 465034 465274 465534 465368 464663 464004
59591D64004K8Q72J659K445K910K571J569N89l3n24j037j486k016k844l624l703
$$ 464004 464032 464904 466563 469008 471918 474489 476058 476647 476614 476090 475053 473567 471551 468707 465083 461380
59575D61380l178k947l446m038m014l555l268l276l235k937k429j760r90m08l02
$$ 461380 458202 455255 451809 447771 443757 440202 436934 433658 430423 427486 425057 423297 422307 421899 421597
59560D21597n79p43l57M81J219J443J397J620K115K307J979J762K273L249M058
$$ 421597 421018 420275 419918 420399 421618 423061 424458 426078 428193 430500 432479 434241 436514 439763 443821
59545D43821M622N216N710N873O144P251R094J0923J2730J5469J9384K2669K2473
$$ 443821 448443 453659 459369 465242 471386 478637 487731 498654 511384 526853 546237 568906 591379
59532E91379J7254Q123j747r054j2203j1780r418o326k990J28K316L136K904K508
$$ 591379 608633 616756 615009 605955 593752 581972 572554 566228 563238 563366 565682 568818 571722 574230
59518E74230K795L904N031N079L846K205Q13q45l539o877r549j0825j1085j0965
$$ 574230 577025 580929 585960 591039 594885 597090 597903 597058 593519 586642 577093 566268 555183 544218
59504E44218j0689j0219r486q444p298o573o496o563o138n290m417l475k257j118
$$ 544218 533529 523310 513824 505380 498082 491509 485013 478450 472312 467022 462605 459130 456873 455755
59490D55755o15n88m23q7l3k20n8O26J395J931K251K278J967J771K172K850L136
$$ 455755 455140 454552 454129 454042 454009 453789 453731 454357 455752 457683 459934 462212 464179 465950 468122 470972 474108
59473D74108L138L491M109M189L469K477J521N39r4K21J073J326Q81R05J861K647
$$ 474108 477246 480737 484846 489035 492504 494981 496502 497041 496947 497168 498241 499567 500448 501353 503214 505861
59457E05861K358J737J952K899L749M451N611P242Q609R195R129Q798Q412P872
$$ 505861 508219 509956 511908 514807 518556 523007 528618 535860 544469 553664 562793 571591 580003 587875
59443E87875O705M421J186k073m525o142p397q503r243r335q839q186p794p526
$$ 587875 594580 599001 600187 598114 593589 587447 580050 571547 562304 552969 544130 535944 528150 520624
59429E20624o820n604m598m266l930k601k98K212M623P084R326J0814J1731J2861
$$ 520624 513804 508200 503602 499336 495406 492805 492507 494719 499342 506426 515752 526566 538297 551158
59415E51158J4524J6432J8543K1236K4681K8592L1975L2397K6618J3880j766j4190
$$ 551158 565682 582114 600657 621893 646574 675166 707141 739538 766156 780036 778270 764080
59403G64080k0345k1418j9567j5729j0533m761J614Q477J2987J0593K61j3228
$$ 764080 743735 722317 702750 687021 676488 671727 673341 681818 694805 705398 705659 692431
59391F92431k3673k8634k9186k6847k2873j9025j6436j4235j1063p393m856l841
$$ 692431 668758 640124 610938 584091 561218 542193 525757 511522 500459 493066 488210 484369
59379D84369l367k807k241j528m04P47J403J815K396K743K347J746J748K086K039
$$ 484369 481002 478195 475954 474426 474022 474769 476172 477987 480383 483126 485473 487219 488967 491053 493092
59364D93092J876K403L422M021M037M070M319M558M980N864O721O942P036P979
$$ 493092 494968 497371 500793 504814 508851 512921 517240 521798 526778 532642 539363 546305 553341 561320
59350E61320R588J0825J1550J2662J4387J5798J6257J6285J6635J7344J7968J8141
$$ 561320 570908 581733 593283 605945 620332 636130 652387 668672 685307 702651 720619 738760
59338G38760J7664J6526J4918J2857J0087O732L649J395o78l561p124j0347j2631
$$ 738760 756424 772950 787868 800725 810812 817544 821193 822588 821910 818349 811225 800878 788247
59325G88247j4124j4985j5252j5197j5096j4811j4169j3397j2610j1415r707q159
$$ 788247 774123 759138 743886 728689 713593 698782 684613 671216 658606 647191 637484 629325
59313F29325p139n892l771j530j92O61K071L918N325O273P065O695L688j377o015
$$ 629325 622186 616294 612523 610993 610801 611462 613533 617451 622776 629049 636114 642809 646497 645120 639105
59298F39105q673r886j0426j0053q597o786n339m349l883l961l765k276j24O77
$$ 639105 630432 620546 610120 600067 591470 584684 579345 574996 571113 567152 563387 561111 560987 561664
59284E61664n31j999j986q67PL20N56Q30J007J324J910K358K608L525N650Q068
$$ 561664 561133 559134 557148 556281 556288 556608 557164 557994 559001 560325 562235 564593 567201 570726 576376 584444
59268E84444R537J0217J1135J2342J2770J1867J0285Q777P268N290K698l63l693
$$ 584444 593981 604198 615333 627675 640445 652312 662597 671374 678642 683932 686630 686267 682574
59255F82574o860r101r919r764r748j0502j1474j1577j0477q930p806p177o501
$$ 682574 675714 666613 656694 646930 637182 626680 615206 603629 593152 584222 576416 569239 562738
59242E62738n404l896k210p97j23j18J6R48K474L897M817N047M301K707J250Q11
$$ 562738 557334 553438 551228 550431 550308 550190 550206 551154 553628 557525 562342 567389 571690 574397 575647 576458
59226E76458R99P38k01j240k335m077o303p820p949p397p034o633n561m040k985
$$ 576458 577457 578195 577994 576754 574419 570342 564039 556219 548270 540873 533839 527206 521645 517605 514620
59211E14620k857l272l548l167j954k53J151J618J250P10M79M21P0p26j494j565
$$ 514620 511763 508491 504943 501776 499822 499569 500720 502338 503588 504298 504777 505198 505268 504542 503048 501483
59195E01483p91L96J521K401K856K693K254K458L798N568O605O507N734M844M105
$$ 501483 500692 501088 502609 505010 507866 510559 512813 515271 519069 524637 531242 537749 543483 548327 552432
59180E52432L587L126K392J419P33O46Q16R30J190J671J816J325R40J487K684
$$ 552432 556019 559145 561537 562956 563689 564335 565151 566081 567271 568942 570758 572083 573023 574510 577194
59165E77194L761M697N866O971P502P773Q300Q542P586N812M439L557K087k24
$$ 577194 580955 585652 591518 598489 605991 613764 622064 630606 638192 644004 648443 652000 654087 653863
59151F53863k310l565m646o048p151p327o952o655o428o058n654n277m774m290
$$ 653863 651553 647988 643342 637294 630143 622816 615864 609209 602781 596723 591069 585792 581018 576728
59137E76728m290m732m955m603l939l112k024j068r81j591j807j193n93o68q55
$$ 576728 572438 567706 562751 558148 554209 551097 549073 548005 547024 545433 543626 542433 541840 541172 540317
59122E40317l77O04J539K442L591M949O408Q003R387R857R429R204R987J1115
$$ 540317 539940 540544 542083 544525 548116 553065 559473 567476 576863 586720 596149 605353 615340 626455
59108F26455J1329J0330Q886P852P522P600P399O483N394N116N653N810M766L065
$$ 626455 637784 648114 657000 664852 672374 679974 687373 693856 699250 704366 710019 715829 720595 723660
59094G23660J563K46j189k328k534k008j619j853k498l053k980j978n74o3j296
$$ 723660 725223 725469 724280 721952 719418 717410 715791 713938 711440 708387 705407 703429 702855 702792 701496
59079G01496l684n897p276q105q788r317r496r267q738q078p395o632n749m929
$$ 701496 697812 691915 684639 676534 667746 658429 648933 639666 630928 622850 615455 608823 603074 598145
59065E98145m412m212m292m795n602n980n300m082l464l704m037m074m273m768
$$ 598145 593733 589521 585229 580434 574832 568852 563552 559470 556006 552302 548265 544191 539918 535150
59051E35150m843m088l149k655k225j344n39p08j692k363k040j106k68K04M44
$$ 535150 530307 526219 523070 520415 518190 516846 516307 515599 513907 511544 509504 508398 508130 508334 508778
59036E08778O15P34P60P68R64J411J923K419L127M059M625M421M157N018P098
$$ 508778 509393 510127 510887 511655 512619 514030 515953 518372 521499 525558 530183 534604 538761 543779 550877
59021E50877R270J0658J1502J2482J3928J5806J7651J8468J7476J5142J2614J0100
$$ 550877 560147 570805 582307 594789 608717 624523 642174 660642 678118 693260 705874 715974
59009G15974O780K573j218l513m646n356n558m912l811k867j928m23J606L528
$$ 715974 722754 725327 724109 720596 715950 710594 705036 700124 696313 693446 691518 691095 692701 696229
58995F96229M865N544N628N220M508L571K390J156K07m51j167k093l143m467o349
$$ 696229 701094 706638 712266 717486 721994 725565 727955 729111 729318 728867 727700 725607 722464 717997 711648
58980G11648q436r768r828r052q094p076n762l986j783M75K167L125M027N445
$$ 711648 703212 693444 683616 674564 666470 659394 653632 649646 647863 648338 650505 653630 657657 663102
58966F63102O828P338P311P782Q726R135Q781Q477Q493Q162P378O962O940N995
$$ 663102 669930 677268 684579 692361 701087 710222 719003 727480 735973 744135 751513 758475 765415 771410
58952G71410L336j78l466o567r758j2488j4149j4900j5002j4194j2584j1137j0449
$$ 771410 774746 774568 771102 764535 754777 742289 728140 713240 698238 684044 671460 660323 649874
58939F49874r929q885p603o559n552m399l615l586l794l667l434l484l616l577
$$ 649874 639945 631060 623457 616898 611346 606947 603332 599746 595952 592285 588851 585367 581751 578174
58925E78174l537l491l007k159j764k130k532k429k177j990j433n63k41o00n43
$$ 578174 574637 571146 568139 565980 564216 562086 559554 557125 554948 552958 551525 550962 550721 550121 549578
58910E49578L93J096Q04M83J135K192K940M112O447Q875R899R874J0129J0671
$$ 549578 549971 551067 551871 552354 553489 555681 558621 562733 569180 578055 587954 597828 607957 618628
58896F18628J0525R764R387R526R422Q949Q814R340J0381J2090J4691J7649K0174
$$ 618628 629153 638917 648304 657830 667252 676201 685015 694355 704736 716826 731517 749166 769340
58883G69340K2227K4086K5300K5170K3795K1637J8582J4534J0372P089M390J223
$$ 769340 791567 815653 840953 866123 889918 911555 930137 944671 955043 962132 966522 967745
58871I67745k704o922j1215j5403j8558j9703j9101j7880j6720j5678j4780j3882
$$ 967745 965041 958119 946904 931501 912943 893240 874139 856259 839539 823861 809081 795199
58859G95199j2465j0551r209r195r823j0133j0430j1512j3117j4250j4512j3978
$$ 795199 782734 772183 762974 753779 743956 733823 723393 711881 698764 684514 670002 656024
58847F56024j2520j0336q332o936n420l547k613l458m658m594m129n147p260q327
$$ 656024 643504 633168 624836 617900 612480 608933 606320 602862 598204 593610 589481 584334 577074 568747
58833E68747p727o784o156n120l591k658k714k897k755k857l346l378k496j261
$$ 568747 561020 554236 548080 542960 539369 536711 533997 531100 528345 525488 522142 518764 516268 515007
58819E15007k93K41J34o94j474j205n5R53J424J649J600J187J155K165L250K811
$$ 515007 514714 514955 515089 514395 512921 511716 511661 512614 514038 515687 517287 518474 519629 521794 525044 527855
58803E27855J055j91p8N06P31P60P07K89k53k69L8j61p99r64n28k92m60m24r5
$$ 527855 528910 528719 528641 529147 529878 530638 531345 531634 531381 531112 531150 530989 530190 529226 528698 528406 527946 527522 527427
58784E27427K3J68J175K898M256M970N665O276O045N346N552O697P018N458L029
$$ 527427 527450 527618 528793 531691 535947 540917 546582 552858 558903 564249 569801 576498 583516 588974 592003
58769E92003R96p24k561m097m853n146n401n457n204n069n308n595n577n147m065
$$ 592003 592999 592275 589714 585617 580764 575618 570217 564760 559556 554487 549179 543584 538007 532860 528795
58754E28795k247m10N98J085K041L433M270M314M286M315L735K677K330L153M184
$$ 528795 526548 526138 526736 527821 529862 533295 537565 541879 546165 550480 554215 556892 559222 562375 566559
58739E66559M626M802N091N206N071N304O182P119P583P750P940Q239Q798R649
$$ 566559 571185 575987 581078 586284 591355 596659 602841 609960 617543 625293 633233 641472 650270 659919
58725F59919J0257J0109R566R117Q199O010L226J441J126J571K528M088N340N178
$$ 659919 670176 680285 689851 698968 707167 713177 716403 717844 718970 720541 723069 727157 732497 737675
58711G37675M470N281P718R616R691Q851P914O201L274R6k516m975p642j0048
$$ 737675 742145 747426 755144 764760 774451 783302 791216 797417 800691 800787 798271 793296 785654 775606
58697G75606j2190j4959j8468k1400k2805k3066k2510k0773j8239j6353j5538
$$ 775606 763416 748457 729989 708589 685784 662718 640208 619435 601196 584843 569305
58686E69305j4437j2208r949q841q431p820p110o540n650m359l534l351k593p41
$$ 569305 554868 542660 532711 523870 515439 507619 500509 493969 488319 483960 480426 477075 474482 473741
58672D73741O93L76n83k15J410K597K668K642L508N090O708Q000Q945R516R452
$$ 473741 474434 474810 474227 474012 475422 478019 480687 483329 486837 491927 498635 506635 515580 525096 534548
58657E34548Q423O619M833L506K066N0j708k149j787k035k980l514l387l425l709
$$ 534548 542971 549590 554423 557929 559995 560045 558337 556188 554401 552366 549386 545872 542485 539060 535351
58642E35351l420k619k335k631k518j927j852k179j512L61J954K563L169M214
$$ 535351 531931 529312 526977 524346 521828 519901 518049 515870 514358 514719 516673 519236 522405 526619
58628E26619M680M201L864L944L034N73j732k324j808j383j075o61n90p82j59
$$ 526619 531299 535500 539364 543308 546342 546915 545183 542859 541051 539668 538593 537932 537342 536560 536401
58613E36401J463K723K984L414M719N704N319M366L773L005J511J27m18p54j419
$$ 536401 537864 540587 543571 546985 551704 557408 562727 567093 570866 573871 575382 575509 575091 574337 572918
58598E72918j795j583j611k031j609j44N16o44j934j589l02N67J366K741L811
$$ 572918 571123 569540 567929 565898 564289 564145 564661 564017 562083 560494 560192 560759 562125 564866 568677
58583E68677L814L989N661P837Q797Q779R032R457R164Q354P778P327O710O530
$$ 568677 572491 576480 582141 589978 598775 607554 616586 626043 635207 643561 651339 658666 665376 671906
58569F71906P081P346O703O372P556R558J1248J3028J5615J8358K0466K2519K5000
$$ 671906 678987 686333 693036 699408 706964 716522 727770 740798 756413 774771 795237 817756 842756
58556H42756K6763K6784K5951K5211K3487J9523J4336R723N617J157k872n101
$$ 842756 869519 896303 922254 947465 970952 990475 1004811 1014534 1020151 1021308 1018436 1013335
58544A013335o088p481r403j0734j1311j1914j2756j3794j5665j8623k1335k2483
$$ 1013335 1007247 999766 990363 979629 968318 956404 943648 929854 914189 895566 874231 851748
58532H51748k2603k2739k2367k0476j7714j5484j3766j1597q930o397m061j918
$$ 851748 829145 806406 784039 763563 745849 730365 716599 705002 696072 689675 685614 683696
58520F83696o24k82L76K116L689L699K666J733Q06m41j198r64q53j764k726k743
$$ 683696 683072 682790 683166 685282 688971 692670 695336 697069 697875 697434 696236 695272 694419 692655 689929 687186
58504F87186k620l232l770l512l445m177m307l001j951k438k776j360M8q07k586
$$ 687186 684566 681334 677564 674052 670607 666430 662123 659122 657171 654733 651957 650597 650645 649838 647252
58489F47252k573j167o19q25j2J516J985J668K369M058N253O097P937J0423J2132
$$ 647252 644679 643512 642893 642068 642056 643572 645557 647225 649594 653652 658905 665002 672939 683362 695494
58474F95494J3342J5224J6969J6763J4937J3118J1001P098K072j902m584p387
$$ 695494 708836 724060 741029 757792 772729 785847 796848 803946 806018 804116 799532 792145
58462G92145j0149j1333j1035j0749j0419q736o020l877k307j5K765M598N618
$$ 792145 781996 770663 759628 748879 738460 729724 723704 719827 717520 717505 720270 724868 730486
58449G30486P170R088R978R715Q990P076K921k153n703p430q563r011q083o865
$$ 730486 737656 746744 756722 766437 775427 782503 785424 783271 777568 770138 761575 752564 744481 737616
58435G37616o591n767k419J849L853L955N180P887R480R127Q567Q247O821M752
$$ 737616 731025 725258 722839 724688 728541 732496 737676 745563 755043 764170 772737 780984 787805 792557
58421G92557M452O292P998Q437Q630Q713P354M583J979j80k987o057p797q422
$$ 792557 797009 803301 811299 819736 828366 837079 844433 849016 850995 850815 847828 841771 833974 825552
58407H25552r519j0779j0521r161q761r311q964p669p010o760n278l017j872j417
$$ 825552 816033 805254 794733 785572 776811 767500 758536 750867 743857 737097 731819 728802 726930 725513
58393G25513K91K597L106K299K828M460M343K348J355J950J641j16r13j04J43
$$ 725513 725804 728401 731507 733806 736634 741094 745437 747785 749140 751090 752731 752615 751702 751598 751741
58378G51741o26j36K111L819M345N668P917Q509O980O200P419Q448Q104Q141R237
$$ 751741 751115 750979 753090 756909 761254 766922 774839 783348 790328 796528 803947 812395 820499 828640 837877
58363H37877R373P851O954P964R253R785J0727J2316J2818J1899J1494J2121J1921
$$ 837877 847250 855101 862055 870019 879272 889057 899784 912100 924918 936817 948311 960432 972353
58350I72353J0191Q339O647L921Q88j15P40J027O86J959M593N882N849P279J0149
$$ 972353 982544 990883 997530 1001451 1002339 1002224 1002964 1003991 1004677 1006636 1011229 1017111 1022960 1030239 1040388
58335A040388J1305J0369J0502J2494J3677J3623J5034J7798J8109J5113J2514
$$ 1040388 1051693 1062062 1072564 1085058 1098735 1112358 1127392 1145190 1163299 1178412 1190926
58324A190926J1937J0616P504N597O030N780L580K319L245L560K151J983M211
$$ 1190926 1202863 1213479 1220983 1226580 1232610 1238390 1241970 1244289 1247534 1251094 1253245 1255228 1259439
58311A259439N695M972N053P740J0613J2120J4025J6526J6826J4943J4973J8104
$$ 1259439 1265134 1270106 1275159 1282899 1293512 1305632 1319657 1336183 1353009 1367952 1382925 1401029
58299A401029K0467K0266K0577K2526K2531J9304J6866J7279J7099J4391J2627
$$ 1401029 1421496 1441762 1462339 1484865 1507396 1526700 1543566 1560845 1577944 1592335 1604962
58288A604962J4050J5781J6023J7571K1615K4683K5308K6933L0709L2441L0341
$$ 1604962 1619012 1634793 1650816 1668387 1690002 1714685 1739993 1766926 1797635 1830076 1860417
58277A860417K8628K9715L0244K8630K8786L2264L4486L3249L3035L6435L9380
$$ 1860417 1889045 1918760 1949004 1977634 2006420 2038684 2073170 2106419 2139454 2175889 2215269
58266B215269L9506M0930M5731M9222M8917M9689N4555N8922N9645O1042O6044
$$ 2215269 2254775 2295705 2341436 2390658 2439575 2489264 2543819 2602741 2662386 2723428 2789472
58255B789472P0177P0347P0737P3862P4928P1291O8237O9080O9273O6651O7127
$$ 2789472 2859649 2929996 3000733 3074595 3149523 3220814 3289051 3358131 3427404 3494055 3561182
58244C561182P3489P9380Q1554Q6834R9027J10732J16612J22865J34434J45033
$$ 3561182 3634671 3714051 3795605 3882439 3981466 4092198 4208810 4331675 4466109 4611142
58234D611142J49720J55035J66400J77724J84262J93086K09662K26932K39383
$$ 4611142 4760862 4915897 5082297 5260021 5444283 5637369 5847031 6073963 6313346
58225F313346K54517K78251L02792L21892L43793L75570M09504M39186M73670
$$ 6313346 6567863 6846114 7148906 7470798 7814591 8190161 8599665 9038851 9512521
58216I512521N20818N72726O23344O83253P60412Q44424R27622J022396J139084
$$ 9512521 10033339 10606065 11229409 11912662 12673074 13517498 14445120 15467516 16606600
58207A6606600J268365J406625J576227J797920K067684K385435K779524L275025
$$ 16606600 17874965 19281590 20857817 22655737 24723421 27108856 29888380 33163405
58199C3163405L867367M558404N386528O388407P572028Q971298J0685159J2814055
$$ 33163405 37030772 41589176 46975704 53364111 60936139 69907437 80592596 93406651
58191I3406651J5407565J8529142K2292296K6714476L1545153L6256974M0011614
$$ 93406651 108814216 127343358 149635654 176350130 207895283 244152257 284163871
58184B84163871M1410975L8502241K9716784J5367726j783411j7779772k9568893
$$ 284163871 325574846 364077087 393793871 409161597 407378186 389598414 360029521
58177C60029521l6165629l8267726l7215595l4295413l0517028k6554278k2755702
$$ 360029521 323863892 285596166 248380571 214085158 183568130 157013852 134258150
58170A34258150j9273321j6198839j3578818j1383137r544691q019781o776495
$$ 134258150 114984829 98785990 85207172 73824035 64279344 56259563 49483068
58163D9483068n758701m907101m195531l612390l127510k708438k349091k052579
$$ 49483068 43724367 38817266 34621735 31009345 27881835 25173397 22824306 20771727
58155B0771727j803188j581341j388655j232658j102192r81379q73141p86512
$$ 20771727 18968539 17387198 15998543 14765885 13663693 12682314 11809173 11022661
58147A1022661p14339o44761n81842n34312m95629m54623m14960l85510l61665
$$ 11022661 10308322 9663561 9081719 8547407 8051778 7597155 7182195 6796685 6435020
58138F435020l33986l05774k85018k67914k46778k25720k12511k02866j88149
$$ 6435020 6101034 5795260 5510242 5242328 4995550 4769830 4557319 4354453 4166304
58129D166304j71359j60616j53680j43267j31335j24297j19926j12238j03782
$$ 4166304 3994945 3834329 3680649 3537382 3406047 3281750 3161824 3049586 2945804
58120B945804j00443r9396r4349q7424q4132q1735p4409o5019o0335n9013n5411
$$ 2945804 2845361 2745965 2651616 2564192 2480060 2398325 2323916 2258897 2198562 2139549 2084138
58109B084138n0934n0658n2710n1741m9199m9921n2036n0338m6328m5137m5653
$$ 2084138 2033204 1982546 1929836 1878095 1828896 1778975 1726939 1676601 1630273 1585136 1539483
58098A539483m3215l9034l7615l7727l5022l0919k9978l0997k9307k5636k4276
$$ 1539483 1496268 1457234 1419619 1381892 1346870 1315951 1285973 1254976 1225669 1200033 1175757
58087A175757k4733k3230k0343j9378j9331j7005j3963j3953j5615j4976j2942
$$ 1175757 1151024 1127794 1107451 1088073 1068742 1051737 1037774 1023821 1008206 993230 980288
58076I80288j3207j5022j5107j4427j5962j7970j6730j3840j3697j5660j5660
$$ 980288 967081 952059 936952 922525 906563 888593 871863 858023 844326 828666 813006
58065H13006j3726j3042j3314j1849r539r191r640p964n693o360q738r091q190
$$ 813006 799280 786238 772924 761075 751536 742345 732705 724741 719048 712688 703950 694859 686669
58052F86669r408j1727j1452r334r048j0050q848o119n598o911o385m252m206
$$ 686669 677261 665534 654082 644748 635700 625650 616802 610683 605085 598174 591789 587537 583331
58039E83331o349p162o139o019o790n844l891m362o895p618n981n362o681p323
$$ 583331 576982 569820 563681 557662 550872 545028 541137 536775 529880 522262 516281 510919 504238 496915
58025D96915o731p291r121r478p936p039p358o921n721n787o665n845l783l371
$$ 496915 490184 482893 473772 464294 456358 449319 441961 435040 429319 423532 416867 411022 407239 403868
58011D03868m408l854j702j148k547k685p36L37o38j286n19k28r64o50J101J837
$$ 403868 399460 395606 393904 392756 390209 387524 386788 387125 386487 385201 384682 384454 383490 382840 383941 385778
57995C85778P57J21J018J786J789K658M677N832N591N837P018P117N477L917L051
$$ 385778 386535 386656 387674 389460 391249 393907 398584 404416 410007 415844 422862 429979 435456 439373 442424
57980D42424J257j735l816m196m560n575n736m666m170m894n204m388l775l800
$$ 442424 443681 441946 438130 433934 429374 423799 418063 413397 409227 404333 399129 394741 390966 387166
57966C87166l229k106k193l516l755k048l24Q1J57O48O93jn18r47k434m430m869
$$ 387166 383937 381831 379638 376122 372367 370319 369995 370076 370233 370881 371574 371573 371055 370108 367674 363244 358375
57949C58375l642k857l123k668q93M88O20Q03J732K414K656L685N540O689O974
$$ 358375 354733 351876 348753 346085 345192 345680 346300 347103 348835 351249 353905 357590 363130 369819 376793
57934C76793Q003J0040J1433J1731J2311J3279J2907J0901R012P661N233J596
$$ 376793 384796 394836 406269 418000 430311 443590 456497 467398 476410 484071 489304 490900
57922D90900j030j855k902n385p757q747r304j0190j0495r882r590r888r268p372
$$ 490900 489870 488015 485113 479728 471971 463224 453920 443730 433235 423353 413763 403875 394607 387235
57908C87235o025o084o040m922l853l463k591r85n58k255m222m615l966l350k560
$$ 387235 381210 375126 369086 364164 360311 356848 354257 353272 352714 350459 346237 341622 337656 334306 331746
57893C31746j524j155j433q54R26K212K126J992K626K857K092J798K810L668L204
$$ 331746 330222 329067 327634 326780 327706 329918 332044 334036 336662 339519 341611 343409 346219 349887 353091
57878C53091K494K617K706J920J169J136O91j016k779l331l385m053n040n807
$$ 353091 355585 358202 360908 362828 363997 365133 365824 364808 362029 358698 355313 351260 346220 340413
57864C40413o768p871p827o188m461l736k954j044J048J990K142K484K947L181
$$ 340413 333645 325774 317947 311759 307298 303562 300608 299564 300612 302602 304744 307228 310175 313356
57850C13356L617M409M668L823K533J342q8j681k571k795l572n074n755m806l429
$$ 313356 316973 321382 326050 329873 332406 333748 333660 331979 329408 326613 323041 317967 312212 307406 303977
57835C03977k771k508k332k790l759m038l406l040l090k114J57J921K294K731
$$ 303977 301206 298698 296366 293576 289817 285779 282373 279333 276243 274129 274286 276207 278501 281232
57821B81232M207N448N427N144N387N091L542J897Q95n67k896m343m004l758n108
$$ 281232 285439 290887 296314 301458 306845 311936 315478 317375 318270 317703 314807 310464 306460 302702 297594
57806B97594o456n956m722m593m772l572j793j391k054j978j017m08j69O45J675
$$ 297594 291138 285182 280460 275867 271095 267523 265730 264339 262285 260307 259290 258882 258713 259358 261033
57791B61033J543J68j203j876k101k079j993k365l075k912j371K01N52M45J194
$$ 261033 262576 262744 261541 259665 257564 255485 253492 251127 248052 245140 243769 243970 244522 244967 246161
57776B46161K534L517M260N112N353M489L670M052M733M143K477J040J03q16j573
$$ 246161 248695 252212 256472 261584 266937 271426 275096 279148 283881 288024 290501 291541 291644 290828 289255
57761B89255j971k808m599o130o045m961m380m381m147l767l683l151j273J024
$$ 289255 287284 284476 279877 273747 267702 262741 258361 253980 249833 246066 242383 239232 237959 238983
57747B38983J954J421Q95J108J398J062N2j359k570k861k544l024m641n638m528
$$ 238983 240937 242358 243253 244361 245759 246821 246873 245514 242944 240083 237539 234515 229874 224236 219708
57732B19708k369j190j236j407j419j719k065j850j382j308j420j295j347j928
$$ 219708 217339 216149 214913 213506 212087 210368 208303 206453 205071 203763 202343 201048 199701 197773
57718A97773k250j585o47l58k23N50J381J359J012J292J682J057k77j110j229
$$ 197773 195523 193938 193291 192933 192710 193260 194641 196000 197012 198304 199986 201043 200766 199656 198427
57703A98427j180r17k43J40l75r38m63N77J144J522K448L254K716J158p7o40j048
$$ 198427 197247 196330 196087 196227 195852 194914 194451 195028 196172 197694 200142 203396 206112 207270 207193 206553 205505
57686B05505j274j082j039j489j368K06K134L000L580N519Q396J0472J1780J4052
$$ 205505 204231 203149 202110 200621 199253 199459 201593 204593 208173 213692 222088 232560 244340 258392
57672B58392J7928K2577K7856L4556M2536N0739N8723O5813O8534O1615M2702
$$ 258392 276320 298897 326753 361309 403845 454584 513307 579120 647654 709269 751971
57661G51971J5013j4797m0120n6473o2803o1799n7577n2447m6589m0177l4057
$$ 751971 766984 752187 712067 655594 592791 530992 473415 420968 374379 334202 300145
57650C00145k8469k3033j8130j4696j2569j0587q459o951o109m979l337k174k059
$$ 300145 271676 248643 230513 215817 203248 192661 184202 177251 171142 166163 162826 160652 158593
57637A58593k380k408k022j150K32J432J592R12L26L1m91j176j416j214j129j138
$$ 158593 156213 153805 151783 150633 150865 152297 153889 154801 155127 155158 154667 153491 152075 150861 149732 148594
57621A48594q62o26j058j842k139k057k306k698k375j389o04k39R1J94m11j175
$$ 148594 147732 147106 146048 144206 142067 140010 137704 135006 132631 131242 130638 130399 130490 130684 130273 129098
57605A29098j006L5Q69J034R13O39J40p7L80P07kj035j055k85k7m92r08j257j950
$$ 129098 128092 128127 128996 130030 130943 131582 131722 131645 132025 132732 132730 131695 130640 130355 130328 129836 128928 127671 125721
57586A25721k237j109N40Q28j58n76J18O88O83J017J736J573K53r84j633k534
$$ 125721 123484 122375 122915 123743 123585 123009 123127 123815 124498 125515 127251 128824 129077 128093 126460 123926
57570A23926l686l792k658j886k259k500j530j38O51J011J142M92q06j326l29
$$ 123926 120240 116448 113790 111904 109645 107145 105615 105477 106128 107139 108281 108773 107967 106641 106312
57555A06312J063J604J569J700J929K006K159K277J655K27j110j950k776l434
$$ 106312 107375 108979 110548 112248 114177 116183 118342 120619 122274 122501 121391 119441 116665 113231
57541A13231k819q07J052J662J678J890J909J427J258J901K351J672N26M1J49
$$ 113231 110412 109605 110657 112319 113997 115887 117796 119223 120481 122382 124733 126405 126931 126972 127121
57526A27121J90J88L26M6j163k665l333k928k079j452j439k069k755k759k246
$$ 127121 127311 127499 127825 127871 126708 124043 120710 117782 115703 114251 112812 110743 107988 105229 102983
57511A02983k174k926l876m398m364l609k097p41o72j482j562n20K28l15j494
$$ 102983 100809 97883 94007 89609 85245 81636 79539 78798 78126 76644 75082 74562 74790 74475 72981
57496G2981k422l101l487l052k071j833k734l554l397k896k691k261j194k25J56
$$ 72981 70559 67458 63971 60919 58848 57015 54281 50727 47330 44434 41743 39482 38288 38063 38219
57481C8219P70K318M124N324O125O838O819N523L597J893M19q49j320r36p54j362
$$ 38219 38989 41307 45431 50755 56880 63718 70537 76060 79657 81550 81969 81120 79800 78864 78110 76748
57465G6748j820j309o33q77j646j895j584j263r06l46j3j63j67L79P25K55k98
$$ 76748 74928 73619 72986 72109 70463 68568 66984 65721 64815 64469 64456 64293 64126 64505 65230 65485 65187
57448F5187p5L71O4o92q89m63p6J62O00J110J343J405J425J022R8n09j93L08k1
$$ 65187 65112 65483 65547 64855 63966 63503 63427 63589 64189 65299 66642 68047 69472 70494 70592 70083 69890 70198 70177
57429G0177r14j340j085p16m90k27R1M43J100K048K566K068R78J24j87n4L85P19
$$ 70177 69263 67923 66838 66122 65632 65405 65496 65939 67039 69087 71653 73721 74699 74823 74636 74582 74967 75686
57411G5686L86m15p32k75J69J08N5K84K07l04l16N21J039L79n63o40k21j38n1
$$ 75686 76072 75657 74925 74650 74819 74927 74982 75266 75473 75169 74853 75374 76413 76792 76229 75589 75368 75230 75179
57392G5179P11J671J983J827J725J369M44k70j8O63J031J513K541L078K047L38
$$ 75179 75890 77561 79544 81371 83096 84465 84909 84639 84621 85284 86315 87828 90369 93447 95494 95832
57376I5832m08k59m80j228j672j915k784l958m177l300k420j991j404n57k49p27
$$ 95832 95424 95165 94685 93457 91785 89870 87086 83128 78951 75651 73231 71240 69836 69279 69030 68303
57360F8303j211j109o97l81k86n37j084j365r91n01n29o52r4Q61J310J183J097
$$ 68303 67092 65983 65286 64905 64619 64082 62998 61633 60642 60141 59612 58960 58866 59727 61037 62220 63317
57343F3317J156J012P58N47j56j662k888k542j143k81k52j8O94R91N27K8j47m47
$$ 63317 64473 65485 66243 66790 66634 64972 62084 59542 58399 58118 57866 57848 58542 59533 60060 60088 59941 59494
57325E9494r04q68k21L37M69N35N63J64m60n99k70j82l45o0N59M79n00j258j120
$$ 59494 58590 57722 57501 57838 58307 58842 59405 59569 59109 58510 58240 58058 57713 57653 58212 58691 58191 56933 55813
57306E5813q23j136j668j782j662j672j469n78O31J224P18n37j719k079j503o63
$$ 55813 54990 53854 52186 50404 48742 47070 45601 45023 45654 46878 47596 47059 45340 43261 41758 41095
57290D1095k94l49k71M3K19J99L99J044J917K773L476L863M045M614N894P226
$$ 41095 40801 40452 40181 40224 40443 40642 41041 42085 44002 46775 50251 54114 58159 62773 68667 75893
57274G5893P769P750Q106Q983R533R194Q328P494O848O318N775M934L594K027
$$ 75893 83662 91412 99518 108501 118034 127228 135556 143050 149898 156216 161991 166925 170519 172546
57260A72546O62m30j407k233k822l241l398l008k278j937k097j937j156p06j206
$$ 172546 173208 172778 171371 169138 166316 163075 159677 156669 154391 152454 150357 148420 147264 146558 145352
57245A45352j709j292p53j213j963j538k96J00n68q86k91J80j00m36k91j23k21
$$ 145352 143643 142351 141598 140385 138422 136884 136588 136688 136120 135234 134943 135123 135023 134587 134296 134173 133952
57228A33952j57J53R4m87r42r57r06q04j31R35J353P13j96p55j302k124k648k208
$$ 133952 133795 133948 134042 133555 132613 131656 130750 129946 129815 130750 132103 132816 132620 131865 130563 128439 125791 123583
57210A23583r05O63J854K089J364O63J009K053K565K250K019K497L422M465N486
$$ 123583 122678 123341 125195 127284 128648 129311 130320 132373 134938 137188 139207 141704 145126 149591 155077
57195A55077N923N232M021L484L751M003M231N237O826P689P471P310P832Q280
$$ 155077 161000 166232 170253 173737 177488 181491 185722 190959 197785 205474 212945 220255 228087 236367
57181B36367Q260Q747J0375J2156J2949J2951J2875J2685J2154J1636J1360J0823
$$ 236367 244627 253374 263749 275905 288854 301805 314680 327365 339519 351155 362515 373338
57169C73338R798R087R362R999R897Q852P460O258N573N603O039O245O168O383
$$ 373338 383136 392223 401585 411584 421481 430333 437793 444051 449624 455227 461266 467511 473679 480062
57155D80062O964P220O910O764P259P860Q093Q382R188J0240J1274J2703J4735
$$ 480062 487026 494246 501156 507920 515179 523039 531132 539514 548702 558942 570216 582919 597654
57142E97654J6661J7789J8408J9220K0413K1892K3751K5874K7757K9250L0917
$$ 597654 614315 632104 650512 669732 690145 712037 735788 761662 789419 818669 849586
57131H49586L3170L5654L7925M0040M2079M3859M5553M7783N0607N3203N5102
$$ 849586 882756 918410 956335 996375 1038454 1082313 1127866 1175649 1226256 1279459 1334561
57120A334561N7003N9832O3720O8387P3841Q0235Q7664R6323J05888J14532J19879
$$ 1334561 1391564 1451396 1515116 1583503 1657344 1737579 1825243 1921566 2027454 2141986 2261865
57109B261865J21898J24122J31160J45571J67377J95413K28161K64216L03413
$$ 2261865 2383763 2507885 2639045 2784616 2951993 3147406 3375567 3639783 3943196
57100C943196L47739M00892M67144N50620O54676P81492R32948J112085J322706
$$ 3943196 4290935 4691827 5158971 5709591 6364267 7145759 8078707 9190792 10513498
57091A0513498J566748J842374K144391K464785K791559L107759L392909L625899
$$ 10513498 12080246 13922620 16067011 18531796 21323355 24431114 27824023 31449922
57083C1449922L787245L860624L833938L698742L447428L070694K559407J912929
$$ 31449922 35237167 39097791 42931729 46630471 50077899 53148593 55708000 57620929
57075E7620929J150850L19463n16235j293772j972679k537234k984619l314141
$$ 57620929 58771779 59091242 58575007 57281235 55308556 52771322 49786703 46472562
57067D6472562l526491l627134l626181l536320l372994l154889k901431k629620
$$ 46472562 42946071 39318937 35692756 32156436 28783442 25628553 22727122 20097502
57059B0097502k353762k086290j836432j608572j403461j220758j059635r18268
$$ 20097502 17743740 15657450 13821018 12212446 10808985 9588227 8528592 7610324
57051G610324p94603o87377n95418n16667m49017l91314l42499l00707k64257
$$ 7610324 6815721 6128344 5532926 5016259 4567242 4175928 3833429 3532722 3268465
57042C268465k32721k05790j82071j60130j39802j21226j03550q5811o8032n0364
$$ 3268465 3035744 2829954 2647883 2487753 2347951 2226725 2123175 2037364 1969332 1918968
57032A918968l2836j7809j1121j7730l6058n8424p6971q7904r1034q8013q1557
$$ 1918968 1886132 1868323 1857202 1839472 1803414 1744990 1668019 1580115 1489081 1401068 1319511
57021A319511p4369o7695o1450n5579n0322m5502m0811l6640l3464l0790k7903
$$ 1319511 1245142 1177447 1115997 1060418 1010096 964594 923783 887143 853679 822889 794986
57010G94986k5241k3627k2526k0697j8337j6917j6923j7286j7167j6747j6130
$$ 794986 769745 746118 723592 702895 684558 667641 650718 633432 616265 599518 583388
56999E83388j4970j3556j2851j3060j3246j2722j1726j0538r005p226n704m416
$$ 583388 568418 554862 542011 528951 515705 502983 491257 480719 471714 464488 458784 454368
56987D54368k742m84J914M310P069J0078J2391J3039J1509P482J154o027j1972
$$ 454368 451626 451142 453056 457366 464435 474513 486904 499943 511452 518934 520088 514061 502089
56974E02089j5644j7443j7929j7164j5386j3230j0941q216n191k675j000O15L091
$$ 502089 486445 469002 451073 433909 418523 405293 394352 386136 380945 378270 377270 377885 380976
56961C80976O404R820J2744J5081J7177J9488K1857K3013K1286J5962P704k048
$$ 380976 387380 397200 409944 425025 442202 461690 483547 506560 527846 543808 551512 549464
56949E49464j1574j9084k3394k4660k3966k2220j9813j7034j4144j1047p572m022
$$ 549464 537890 518806 495412 470752 446786 424566 404753 387719 373575 362528 354956 350934
56937C50934q96J854M789Q216J1995J5926J9968K4081K8080L1086L0949K5177
$$ 350934 350038 351892 356681 364897 376892 392818 412786 436867 464947 496033 526982 552159
56925E52159J3484j013j4025k3243k8800l1444l1586k9841k7201k4347k1516j8909
$$ 552159 565643 564630 550605 527362 498562 467118 435532 405691 378490 354143 332627 313718
56913C13718j6638j4439j2166j0290r278q810q254p447o327m420j701O43J442
$$ 313718 297080 282641 270475 260185 250907 242097 233843 226396 220069 215649 213948 214591 216033
56900B16033J169J284K310L706N258P324R804J2054J3813J5372J6953J8810K1514
$$ 216033 217202 218486 220796 224502 229760 237084 246888 258942 272755 288127 305080 323890 345404
56887C45404K5198K8919L1687L3628L4892L4067K9276K0669J0399M02q415j5143
$$ 345404 370602 399521 431208 464836 499728 533795 563071 583740 594139 594541 586126 570983
56875E70983j8936k0250k0524k0251j8720j5689j1941p898l193K085P111J1775
$$ 570983 552047 531797 511273 491022 472302 456613 444672 436774 433581 435666 442777 454552
56863D54552J7167K4039L1861L9888M8089N6300O2899O4780N8559M2580J8928
$$ 454552 471719 495758 527619 567507 615596 671896 734795 799575 858134 900714 919642
56852I19642o670k8092m2364m9739n1333m8195m2077l5013k7798k0105j2065m279
$$ 919642 912972 884880 842516 792777 741444 693249 651172 616159 588361 568256 556191 551912
56840E51912L595J2604K2800L3378M4544N7395P1756Q5944R8716J09009J13037
$$ 551912 555507 568111 590911 624289 668833 726228 797984 883928 982644 1091653 1204690
56829A204690J04346P8943L9728m971m6103p6945r4164r8527r4208q5790p5697
$$ 1204690 1309036 1387979 1427707 1422736 1376633 1299688 1205524 1106997 1012789 926999 851302
56818H51302o4572n3015m1905l1674k2209j3111l647O847J8098K9124L9707N0822
$$ 851302 786730 733715 691810 660136 637927 624816 621169 628016 646114 675238 714945 765767
56806G65767O2931P4236Q0770P7720O1472L2477l171l6360o0433p3999p8946p7535
$$ 765767 828698 902934 983704 1061424 1122896 1155373 1152202 1115842 1055409 981410 902464 824929
56794H24929p1892o4258n6116m7667l8939l0638k3274j6466r792l416K681R120
$$ 824929 753037 688779 632663 584996 546057 515419 492145 475679 465887 462471 465152 474272
56782D74272J6164K3272L0039L6292M0581L9948L2290J8280N75j7647l2959m2435
$$ 474272 490436 513708 543747 580039 620620 660568 692858 711138 711713 694066 661107 618672
56770F18672m5660m5121m3429m1028l7378l3043k9169k5782k2141j8255j4884
$$ 618672 573012 527891 484462 443434 406056 373013 343844 318062 295921 277666 262782
56759B62782j2460j0961j0338j0155r360p411n175l876l608l595l358k947k459
$$ 262782 250322 239361 229023 218868 209508 202097 196922 193046 189438 185843 182485 179538 177079
56746A77079k057j976j968j442n15j44o80j222j069p74j023j409j282r97j215
$$ 177079 175022 173046 171078 169636 169121 168977 168297 167075 166006 165232 164209 162800 161518 160521 159306
56731A59306j705j732j128j45J081K257K755K442K042K077K194K033J900J908
$$ 159306 157601 155869 154741 154596 155677 157934 160689 163131 165173 167250 169444 171477 173377 175285
56717A75285J536O76J07J18j56j203k066j809q92n6R14K152K695J966J153J503
$$ 175285 176821 177497 177604 177722 177566 176363 174297 172488 171596 171540 172454 174606 177301 179267 180420 181923
56701A81923K236J841O19J11N45P65L41j1n3l39q00n66N01J375J311P89O83J289
$$ 181923 184159 186000 186619 186730 187275 188040 188381 188370 188317 187978 187178 186612 187113 188488 189799 190588 191271 192560
56683A92560K305L169L303K643J816J351J004K86p47j818l020m386n351n427m959
$$ 192560 194865 198034 201337 203980 205796 207147 208151 208437 207690 205872 202852 198466 193115 187688 182729
56668A82729m585m399m302m579n345o023o159o202o574o646n610l844k370j385
$$ 182729 178144 173745 169443 164864 159519 153496 147337 141135 134561 127915 122305 118461 116091 114706
56654A14706l02J080K343L186L665L939M298N037N863O081N699N555N852N701
$$ 114706 114404 115484 117827 121013 124678 128617 132915 137952 143815 149896 155595 161150 167002 172703
56640A72703M721L841L680L422K461J775K244K864K260R16J12l91j641l253l921
$$ 172703 177424 181265 184945 188367 190828 192603 194847 197711 199971 200887 200999 200608 198967 195714 191793
56625A91793l776m092m844m624l153j955k127k874k851j761k51Q63R87J87o94
$$ 191793 188017 183925 179081 174457 171304 169349 167222 164348 161497 159736 159485 160348 161335 161522 160828
56610A60828r14o67m47j07N67J004O92K77O10J142P44l40p65j59M62L55j38m26
$$ 160828 159914 159247 158800 158693 159260 160264 160956 161233 161843 162985 163729 163389 162624 162465 162927 163282 163144 162718
56592A62718k63L63J061J091M29K02J047J805J189o4l08M40Q04M69L37N75M64
$$ 162718 162455 162818 163879 164970 165399 165601 166648 168453 169642 169578 169270 169710 170514 170983 171320 171895 172359
56575A72359J23M74J396J706J271J315K302L173L151K799K845L286M112N605P519
$$ 172359 172482 172956 174352 176058 177329 178644 180946 184119 187270 190069 192914 196200 200312 205917 213436
56560B13436R135J0443J2083J3900J4713J3721J1080P069K097k431m747m699l837
$$ 213436 222571 233014 245097 258997 273710 287431 298511 305580 307677 305246 300499 295800 291963
56547B91963l313k933k478k441k991l459l431l320l503l804m125m567m739m013
$$ 291963 288650 285717 283239 280798 277807 274348 270917 267597 264094 260290 256165 251598 246859 242846
56533B42846k737k089k500l224l573l629l527l151k610k148j592q51o94j761l140
$$ 242846 240109 238020 235520 232296 228723 225094 221567 218416 215806 213658 212066 211215 210521 208760 205620
56518B05620l320k450k080k721l264k951k258j633r38l87n31r92o88L95J072Q51
$$ 205620 202300 199850 197770 195049 191785 188834 186576 184943 184005 183618 183087 182095 181407 181802 182874 183725
56502A83725M29K02j19k55M93J528J307j45r35j02J070J266Q34M99J56j35L19
$$ 183725 184154 184356 184237 183982 184475 186003 187310 187165 186230 186128 187198 188464 189298 189797 189953 189818 190137
56485A90137J336J576P50M23J499K580K195J052N98O82L70j34o9K45J7m23j49
$$ 190137 191473 193049 193799 194222 195721 198301 200496 201548 202146 202828 203198 203064 202995 203240 203257 202834 202685
56468B02685O47Q93L53j39m1L96Q69J371J782J791J305N72q8m54n15n30o53n72
$$ 202685 203332 204225 204578 204439 204398 204794 205663 207034 208816 210607 211912 212484 212396 211942 211427 210897 210244 209672
56450B09672L0P75R45M91q3o37j302j620q88N39J412J175M33k51q93j338j138
$$ 209672 209702 210477 211422 211913 211830 211193 209891 208271 207383 207922 209334 210509 210942 210691 209798 208460 207322
56433B07322m13J80M89Q21R52M17l13l13J40q9r80j296p21l09m64l36L59O63K30
$$ 207322 206909 207089 207578 208399 209351 209768 209455 209142 209282 209193 208213 206917 206196 205887 205423 205087 205446 206109 206339
56414B06339J52J163K463L039K831K010O01p14r32l50k37n84k0J520K235J354
$$ 206339 206491 207654 210117 213156 215987 217997 218598 217884 216952 216602 216365 215781 215761 217281 219516 220870
56398B20870M69Q68J582J427J096J673K744L427L843M110L343J203r14j635j416
$$ 220870 221339 222207 223789 225216 226312 227985 230729 234156 237999 242109 245452 246655 245741 244106 242690
56383B42690j294j133m81J00K6q6M24R64Q02M01M07L60k91j002j196j377j940
$$ 242690 241396 240263 239782 239882 239908 239822 240246 241210 242012 242413 242820 243180 242889 241887 240691 239314 237374
56366B37374k035r60M23R72Q89Q29N08l80r46l04R35J626J707J670J430R45R45
$$ 237374 235339 234379 234802 235774 236663 237492 238000 237620 236674 236370 237305 238931 240638 242308 243738 244683 245628
56349B45628J792K568K436J897J572R02n71j858j865j092o83o57m40j22P2O85
$$ 245628 247420 249988 252424 254321 255893 256795 256224 254366 252501 251409 250726 250069 249629 249507 249579 250264
56333B50264K060L411L955M043M118L747K796K299K890L603L394K667K019R76
$$ 250264 252324 255735 259690 263733 267851 271598 274394 276693 279583 283186 286580 289247 291266 292242
56319B92242o86j794j493p90q76j306j314j398j986k053q78K97J90l39lN12J4
$$ 292242 291556 289762 288269 287479 286603 285297 283983 282585 280599 278546 277668 277965 278155 277816 277813 278325 278339
56302B78339p18j60J368K524L254M101M328L127J686J694K545K416J296O84R19
$$ 278339 277621 277461 278829 281353 284607 288708 293036 296163 297849 299543 302088 304504 305800 306484 307403
56287C07403J224J719L016M297M164K963K142J799J037K94Q53K428L466L667L999
$$ 307403 308627 310346 313362 317659 321823 324786 326928 328727 329764 330058 330911 333339 336805 340472 344471
56272C44471M470M101L086K776L477M235M789N833P351Q418Q711Q673Q426Q042
$$ 344471 348941 353042 356128 358904 362381 366616 371405 377238 384589 393007 401718 410391 418817 426859
56258D26859Q442J0303J2543J3644J4019J5294J7726K0262K2617K5341K8193L0491
$$ 426859 435301 445604 458147 471791 485810 501104 518830 539092 561709 587050 615243 645734
56246F45734L2765L6087L9992M3040M5095M7139M9060M9689M8789M7097M4509
$$ 645734 678499 714586 754578 797618 842713 889852 938912 988601 1037390 1084487 1128996
56235A128996M0226L4542K8648K2690J5807Q026M28o438j2797j8595k3676k8506
$$ 1128996 1169222 1203764 1232412 1255102 1270909 1278935 1279363 1272925 1260128 1241533 1217857 1189351
56223A189351l3269l6811l8106l8006l7906l7591l6293l4856l4568l4584l2970
$$ 1189351 1156082 1119271 1081165 1043159 1005253 967662 931369 896513 861945 827361 794391
56212G94391k9802k6965k5236k3823k2389k1313k0192j8212j5760j3829j2264
$$ 794391 764589 737624 712388 688565 666176 644863 624671 606459 590699 576870 564606
56201E64606j0464r052q831q879p830o171n098m159k454j063j484k605k236q36
$$ 564606 554142 545090 536259 527380 519550 513379 508281 504122 501668 500605 499121 496516 494280 493444
56187D93444o33j586j579k53N76K65M4K78M0n20j69R03J264R51J352K474L039
$$ 493444 492811 491225 489646 489393 489969 490234 490278 490556 490596 490076 489907 490810 492074 493025 494377 496851 499890
56170D99890L091L848N049N212M414M083M309M094L919N147P140Q033Q000Q695
$$ 499890 502981 506829 511878 517090 521504 525587 529896 533990 537909 543056 550196 558229 566229 574924
56156E74924R895R958R331J0086J2143J3467J3961J5547J8348K0411K1539K3795
$$ 574924 584819 594777 604108 614194 626337 639804 653765 669312 687660 708071 729610 753405
56144G53405K7986L2994L8758M6332N4979O2901P1136Q2810R8010J12939J24322
$$ 753405 781391 814385 853143 899475 954454 1017355 1088491 1171301 1269311 1382250 1506572
56133A506572J30897J30644J21334J04911Q7466P3586O4033N8832N8121N8998
$$ 1506572 1637469 1768113 1889447 1994358 2081824 2155410 2219443 2278275 2336396 2395394
56123B395394N6063M6755L2862J6386j819j8730k9576l3496l5022l8592m5375
$$ 2395394 2451457 2498212 2531074 2547460 2545641 2526911 2497335 2463839 2428817 2390225 2344850
56112B344850n6070p1804r0337j05854j14754j18107j17080j10478r8694q5658
$$ 2344850 2288780 2216976 2126639 2020785 1906031 1787924 1670844 1560366 1461672 1376014
56102A376014p4320o3836n3224m3918l6793l0376k4094j9604j7111j4214j0221
$$ 1376014 1301694 1237858 1184634 1140716 1103923 1073547 1049453 1029849 1012738 998524 988303
56091I88303p567p135o272l587j446j418j367M14K176K376K589M155N555N588
$$ 988303 980736 973601 967329 963742 962296 960878 959511 959925 962101 964477 967066 971221 976776 982364
56077I82364N651O595O823N728N460P078Q588Q727R045J0328J0889J0367J1140
$$ 982364 988015 994610 1001433 1007161 1012621 1019699 1028287 1037014 1046059 1056387 1067276 1077643 1088783
56064A088783J3916J6011J5966J5827J6885J7506J7138J7924K0292K1568K0969
$$ 1088783 1102699 1118710 1134676 1150503 1167388 1184894 1202032 1219956 1240248 1261816 1282785
56053A282785K1164K2876K3006K0379J8163J8187J8158J6916J6958J9104K0304
$$ 1282785 1303949 1326825 1349831 1370210 1388373 1406560 1424718 1441634 1458592 1477696 1498000
56042A498000J9424J9517K1631K2388K0720K0676K4212K7429K7525K7202K8510
$$ 1498000 1517424 1536941 1558572 1580960 1601680 1622356 1646568 1673997 1701522 1728724 1757234
56031A757234K8913K7355K7662L1645L5267L5874L6549L9126L9960L7391L6186
$$ 1757234 1786147 1813502 1841164 1872809 1908076 1943950 1980499 2019625 2059585 2096976 2133162
56020B133162L9455M3191M4070M5477N0256N4823N6326N8494O4275O9817P1814
$$ 2133162 2172617 2215808 2259878 2305355 2355611 2410434 2466760 2525254 2589529 2659346 2731160
56009B731160P3609P7890Q0864P9963P9702Q3412Q7161Q8411R2256J01880J11639
$$ 2731160 2804769 2882659 2963523 3043486 3123188 3206600 3293761 3382172 3474428 3576308 3687947
55998C687947J17081J22925J33169J42643J46930J51203J60265J69456J74861
$$ 3687947 3805028 3927953 4061122 4203765 4350695 4501898 4662163 4831619 5006480
55989E006480J82619J97903K14672K26940K40153K60369K82584L01289L21924
$$ 5006480 5189099 5387002 5601674 5828614 6068767 6329136 6611720 6913009 7234933
55980G234933L49922L79437M05531M35934M77582N23716N68090O19131O85284
$$ 7234933 7584855 7964292 8369823 8805757 9283339 9807055 10375145 10994276 11679560
55971A1679560P60052Q37384R27304J039353J166291J302831J464319J667506
$$ 11679560 12439612 13276996 14204300 15243653 16409944 17712775 19177094 20844600
55963B0844600J910932K195779K546351K986035L514364M133540M873672N764452
$$ 20844600 22755532 24951311 27497662 30483697 33998061 38131601 43005273 48769725
55955D8769725O813191Q047884R551250J1412914J3685289J6430983J9758225
$$ 48769725 55582916 63630800 73182050 84594964 98280253 114711236 134469461
55948A34469461K3731704K8267629L3105175L7642643M0528760L9577308L2743664
$$ 134469461 158201165 186468794 219573969 257216612 297745372 337322680 370066344
55941C70066344J9800676L161624j3197847k5891441l3524914l6529069l6160120
$$ 370066344 389867020 393028644 379830797 353939356 320414442 283885373 247725253
55934B47725253l3716642l0244351k6461559k2764522j9337536j6285405j3665649
$$ 247725253 214008611 183764260 157302701 134538179 115200643 98915238 85249589
55927H5249589j1463666r620488q089109o835021n806281m946274m226013l632831
$$ 85249589 73785923 64165435 56076326 49241305 43435024 38488750 34262737 30629906
55919C0629906l139866k715431k350063k046637j793485j571401j377155j216620
$$ 30629906 27490040 24774609 22424546 20377909 18584424 17013023 15635868 14419248
55911A4419248j083004r63035q56611p70273o98471o30086n66737n16683m76775
$$ 14419248 13336244 12373209 11516598 10746325 10047854 9417768 8851031 8334348 7857573
55902G857573m37225l98699l68536l44945l20086k94471k74170k57822k39569
$$ 7857573 7420348 7021649 6653113 6308168 5988082 5693611 5419441 5161619 4922050
55893D922050k20794k06462j93902j77319j59586j47966j41726j35025j28211
$$ 4922050 4701256 4494794 4300892 4123573 3963987 3816021 3674295 3539270 3411059
55884C411059j25337j24098j19071j11877j07818j05486r9542r0943q4649p9974
$$ 3411059 3285722 3161624 3042553 2930676 2822858 2717372 2617830 2526887 2442238 2362264
55874B362264p2730o4440o0169n9478n8266n7168n9433o2738o1859n7667n5228
$$ 2362264 2289534 2225094 2164925 2105447 2047181 1990013 1930580 1867842 1805983 1748316 1693088
55863A693088n4708n2186m7783m5076m3877m1152l7709l6705l6881l4471l0457
$$ 1693088 1638380 1586194 1538411 1493335 1449458 1408306 1370597 1333892 1297011 1262540 1232083
55852A232083k8911k9368k7799k4150k2178k2616k2888k2729k3984k5579k4631
$$ 1232083 1203172 1173804 1146005 1121855 1099677 1077061 1054173 1031444 1007460 981881 957250
55841I57250k1846k0309j9935j8381j6278j6076j6982j6366j4870j4925j5622
$$ 957250 935404 915095 895160 876779 860501 844425 827443 811077 796207 781282 765660
55830G65660j4384j2121j1411j1197q810n631n055o286o000m726n671q347r377
$$ 765660 751276 739155 727744 716547 707737 702106 697051 690765 684765 680039 674368 666021 656644
55817F56644q742r321j0981j0937r412r207j0049r092o665n896o802o388m492
$$ 656644 647902 638581 627600 616663 607251 598044 587995 578903 572238 566342 559540 553152 548660
55804E48660l997n073m686k224l49J94J586M213N772N670N729O070M916K831K548
$$ 548660 544663 539590 534904 532680 532331 532525 534111 538324 544096 549766 555495 561565 566481 569312 571860
55789E71860M115M636L426K829L453L079J022r61k889p164j3843j9467k1857k2320
$$ 571860 575975 580611 584037 586866 590319 593398 594420 593459 590570 583406 569563 550096 528239 505919
55775E05919k2104k0478j7452j4741j2751r903n939k907k009k441l728o108q290
$$ 505919 483815 463337 445885 431144 418393 408490 402551 399644 397635 395194 391466 385358 377068
55762C77068q182o289n128n056m151k324j736k625k681j310p29j931l162l439
$$ 377068 368886 362597 357469 352413 348262 345938 344202 341577 338896 337586 336857 334926 331764 328325
55748C28325l924m784m190j773K49O56P65J280Q24j073k547k400j755j601j370
$$ 328325 324401 319617 315427 313654 313903 314559 315324 316604 317428 316355 313808 311408 309653 308052 306682
55733C06682r71j426k433k134m33L37r33k595l385m163n347n605m506l733m181
$$ 306682 305711 304285 301852 299718 299285 299622 298689 296094 292709 288546 283199 277594 273088 269355 265174
55718B65174m456l640k938l133k969j582j78J96L70J125J737J786K237L370L762
$$ 265174 260718 257078 254140 251007 248038 246456 246278 246474 246844 247969 249706 251492 253729 257099 260861
55703B60861K683J420R83N93l71j119j434k634n094o959o869o012n889n958n122
$$ 260861 263544 264964 265947 266540 266169 265050 263616 260982 255888 248929 242060 236048 230159 224201 219079
55688B19079l823l030k607k125j884j832r43J078K860L340L268L736M536N032
$$ 219079 215256 212226 209619 207494 205610 203778 202835 203913 206773 210113 213381 217117 221653 226685
55674B26685N219M941L565J320m44j185j874k951l365k560j652j557j573r68m04
$$ 226685 231904 236845 240410 241730 241286 240101 238227 235276 231911 229351 227699 226142 224569 223601 223197
55659B23197n60p99m34K5j2j4O43J587K269K810L279L283K898K722K603J707L06
$$ 223197 222637 221838 221404 221429 221417 221403 222046 223633 225902 228712 231991 235274 238172 240894 243497 245204 245510
55642B45510k21L12L61q03j915j995j978k984m564n820o740p358p020n611m271
$$ 245510 245289 245601 245962 245159 243244 241249 239271 236287 231723 225903 219163 211805 204785 199174 194903
55627A94903l834l775l508l309l234k526j015K77P52J030J455J338M77j83k35
$$ 194903 191069 187294 183786 180477 177243 174717 173702 173979 174731 175761 177216 178554 179031 178848 178613
55612A78613n60j551k243k061j786j918j797j348j749l200l964k960j556j283
$$ 178613 178053 176502 174259 172198 170412 168494 166697 165349 163600 160400 156436 153476 151920 150637
55598A50637j508r71n6K25J99O94J331J257P01L55O4m95q28m56M4L5m3M30J104
$$ 150637 149129 148158 148102 148327 148526 149220 150551 151808 152509 152864 152928 152433 151605 151149 151193 151228 151185 151615 152719
55579A52719J471J791K294K421J940J740K569L922N035N938O699O790O065N158
$$ 152719 154190 155981 158275 160696 162636 164376 166945 170867 175902 181840 188539 195329 201394 206552
55565B06552M142K189o41k818l599m203n616o862o882o465o788p332p001o063
$$ 206552 210694 212883 212242 209424 205825 201622 196006 189144 182262 175797 169009 161677 154676 148613
55551A48613n371m695l481k324k137k691l314m056m862m667k820m71Q33J127J311
$$ 148613 143242 138547 135066 132742 130605 127914 124600 120544 115682 111015 108195 107724 108557 109684 110995
55536A10995J452J250J192J768K341K152J641J564J670J516J526K006K162J535
$$ 110995 112447 113697 114889 116657 118998 121150 122791 124355 126025 127541 129067 131073 133235 134770
55522A34770J170J833K241Q72j410k515k124j650j795j970j859j831j952j943
$$ 134770 135940 137773 140014 140886 139476 136961 134837 133187 131392 129422 127563 125732 123780 121837
55508A21837j905k020j998j793k183l463m424l929k685k080k129k001j772k026
$$ 121837 119932 117912 115914 114121 111938 108475 104051 100122 97437 95357 93228 91227 89455 87429
55494H7429k333j755m38O81J317J721J760J331J027J183J118N20M75J660K689
$$ 87429 85096 83341 82903 83584 84901 86622 88382 89713 90740 91923 93041 93561 94036 95696 98385
55479I8385K038N02j62%j93n12J67J395J586O68N1J36N6k26K35J279J522N76m54
$$ 98385 100423 100925 100763 100763 100570 100058 100225 101620 103206 103874 103925 104061 104117 103891 104126 105405 106927 107503 107049
55460A07049r02j170j303p40K02M48L3J63J053J437O85k63n26l77k48p1j7n49
$$ 107049 106147 104977 103674 102934 103136 103584 103617 103780 104833 106270 106955 106692 106166 105789 105541 105470 105453 104904
55442A04904j274j093L6Q26N06k40o74r97j483j754j523j113q06m96k43k71l11
$$ 104904 103630 102537 102573 103399 103905 103665 102991 101994 100511 98757 97234 96121 95315 94819 94576 94305 93994
55425I3994J12P41R02O95P07P18R3n89M4J867L053K600J556J137J070N94j97q71
$$ 93994 94106 94847 95749 96444 97151 97869 97962 97373 97417 99284 102337 104937 106493 107630 108700 109294 109097 108226
55407A08226j466j959j878j127m65m73q10r59r18o77M3J059J519J025K24k23m75
$$ 108226 106760 104801 102923 101796 101331 100858 100048 99089 98171 97494 97537 98596 100115 101140 101364 101141 100666
55390A00666q15r28m82K17P20J031J247J193Q77P71J107J393J103M46K8Q0L58
$$ 100666 99851 98923 98441 98658 99378 100409 101656 102849 103726 104497 105604 106997 108100 108546 108574 108654 109012
55373A09012M97K44m24j188j606j550j216q45o82r46j465j597j051m15l31n39
$$ 109012 109509 109753 109329 108141 106535 104985 103769 102924 102242 101296 99831 98234 97183 96768 96437 95898
55357I5898m95m77j068j926k120j532q50k90M84J260J330P55M11M84J89p05j259
$$ 95898 95403 94926 93858 91932 89812 88280 87430 87140 87624 88884 90214 90969 91380 91864 92053 91348 90089
55340I0089q14k1K64K39O13J382J813J388L52n10n16J56M87j73j138j278o18j60
$$ 90089 89275 89254 89518 89757 90370 91752 93565 94953 95305 94795 94279 94435 94922 94749 93611 92333 91715 91555
55322I1555k56k23K88O69L71k74o45n71j62M39R15R68Q06Q82J096R21K71l77p78
$$ 91555 91299 91076 91364 92033 92404 92130 91485 90914 90752 91191 92106 93074 93880 94762 95858 96779 97050 96673 95895
55303I5895j066j145p10L7M54L34O1p8q9J22N94Q87N78N3k1K35K27k2j13k86r05
$$ 95895 94829 93684 92974 93011 93465 93799 93860 93782 93693 93815 94409 95296 95874 95927 95906 96141 96368 96346 96233 95947 95042
55282I5042j306n31Q24J093j3r63o71K21P80J006J064N94m23j211j247q87m82
$$ 95042 93736 93205 94029 95122 95109 94146 93475 93696 94476 95482 96546 97140 96717 95506 94259 93372 92890
55265I2890J77J040J419R51P0p78j523j794j024L83J144P91K14J28J99J48L81
$$ 92890 93067 94107 95526 96477 96547 95769 94246 92452 91428 91811 92955 93746 93960 94088 94287 94435 94816
55248I4816R25R90L50l6M14Q96N73j32m78n98q63r63n32O2L39L85L14j3j92N87
$$ 94816 95741 96731 97081 97045 97459 98355 98928 98796 98318 97720 96857 95894 95362 95424 95763 96148 96462 96449 96257 96844
55228I6844J932K032J27k010k307j065j16k04o05p20o07k71L15P12N16J14R5L41
$$ 96844 98776 100808 100935 98925 96618 95553 95437 95233 94628 93908 93301 93030 93345 94057 94573 94687 94782 95123
55210I5123M35N21Q43J035P32M13O12Q18K30q28j292q78k45J59M22N41M00K04
$$ 95123 95558 96079 96922 97957 98689 99102 99714 100532 100762 99934 98642 97764 97519 97678 98100 98641 99041 99245
55192I9245K09J96j01l92l69m52j057j545r38N29J591J598R92K34o64j380j138
$$ 99245 99454 99650 99549 99157 98788 98336 97279 95734 94796 95325 96916 98514 99506 99740 99076 97696 96558
55175I6558J96J498J474Q6j391j664o27O24R81M97J12L54Q02R55R94J312J822
$$ 96558 96754 98252 99726 99812 98421 96757 96130 96754 97735 98232 98344 98698 99500 100455 101449 102761 104583
55158A04583K182K239J900R96k74j248j529j387j153p95m12m03p42q12m47l54
$$ 104583 106765 109004 110904 111900 111626 110378 108849 107462 106309 105514 105102 104699 103957 103145 102698 102344
55142A02344q96j313r59m03m65q45p53k55Q9L59R61J562J515J024Q38R78Q43M19
$$ 102344 101448 100135 99176 98773 98308 97463 96710 96455 96544 96903 97864 99426 100941 101965 102803 103781 104624 105043
55124A05043L09N85O19J66l15n10o49q97j035q81m88R6P83J188R12Q7p94j433
$$ 105043 105352 105937 106556 106722 106407 105897 105248 104351 103316 102435 101947 102043 102826 104014 104926 105013 104219 102786
55106A02786j772j670j081k69N53J488K434K724J910N47m44q00p22j90P68J540
$$ 102786 101014 99344 98263 97994 98547 100035 102469 105193 107103 107650 107206 106406 105684 105494 106262 107802
55090A07802J501R13M87L65K71K95O13P49J12r07j312r00m16l31l76k72r4Q3K63
$$ 107802 109303 110216 110703 111068 111339 111634 112247 112996 113108 112201 110889 109989 109573 109242 108866 108594 108500 108583 108846
55071A08846K17j45k77L88J441J851J312M36k80q86j379j523j343j110q24l01
$$ 108846 109063 108918 108641 109029 110470 112321 113633 114069 113789 112903 111524 110001 108658 107548 106724 106423
55055A06423K56M59M08M48M33K8m33k24O08J222J140O68J80j59p9N61J121P92
$$ 106423 106679 107138 107546 107994 108427 108455 108022 107798 108406 109628 110768 111436 111616 111457 111378 111939 113060 113852
55037A13852j90p46n80n36j156j805j665q30L5N49P10O38M98L60J8o57j261j247
$$ 113852 113662 112916 112336 111800 110644 108839 107174 106344 106379 106928 107638 108276 108774 109134 109152 108495 107234 105987
55019A05987o34Q9O58R94Q22K05N2J064K332K225O95o15o89k36p5J08P56J338
$$ 105987 105353 105442 106100 107094 107916 108121 108173 109237 111569 113794 114489 113874 113185 112949 112874 112982 113738 115076
55001A15076J188O18L49M76P06J022J421J538J090L15m73j230j732j480m99M43
$$ 115076 116264 116882 117231 117707 118413 119435 120856 122394 123484 123799 123326 122096 120364 118884 118385 118828
54985A18828R19J360J927J731J37j842k501j477J2Q09Q47O90P55J007R80K41q45
$$ 118828 119747 121107 123034 124765 124902 123060 120559 119082 119094 119903 120750 121440 122195 123202 124182 124423 123578
54968A23578j209l94O45P41P2k89j7K30J55K98R38J456J232N92K52K80J94j71
$$ 123578 122369 121975 122620 123361 123433 123144 123127 123357 123512 123810 124748 126204 127436 128028 128280 128560 128754 128583
54950A28583m27k67P8J69j40o38j039j099o66J62Q73Q55Nj105j842k091k084j917
$$ 128583 128156 127889 127967 128136 127996 127358 126319 125220 124554 124716 125589 126444 126449 125344 123502 121411 119327 117410
54932A17410j518r64m60m3M08R39J489K033K470K547K242K051K442L138L517L603
$$ 117410 115892 114928 114468 114425 114833 115772 117261 119294 121764 124311 126553 128604 131046 134184 137701 141304
54916A41304M022M945N768O037O041O109N998N304M066K444L12k333m886o565
$$ 141304 145326 150271 156039 162076 168117 174226 180224 185528 189594 192038 192350 190017 185131 178566
54902A78566p147o853n855m411l195k805k907k577j555o66p24j527k251k468k361
$$ 178566 171419 164566 158711 154300 151105 148300 145393 142816 141261 140595 139871 138344 136093 133625 131264
54887A31264k089j492n31L73P39N98M62P29J322J898K251K478K839L496M323N044
$$ 131264 129175 127683 127152 127525 128264 128862 129324 130053 131375 133273 135524 138002 140841 144337 148660 153704
54871A53704N560N994O304O162N453M636M123L488J910o26l207n089o258o785
$$ 153704 159264 165258 171562 177724 183177 187813 191936 195424 197334 196708 193501 188412 182154 175369
54857A75369o439n353m318l882l760l569l524l761l723k920j881j412j445j397
$$ 175369 168930 163577 159259 155377 151617 148048 144524 140763 137040 134120 132239 130827 129382 127985
54843A27985j293j526j854j630r40m82m34l01L1J47lN2L98N87N69Q72J551J818
$$ 127985 126692 125166 123312 121682 120742 120260 119826 119525 119556 119703 119700 119752 120150 120737 121306 122178 123729 125547
54825A25547J172J31n33o86o21m99l62l04k71j07J6k88r17j184o40M57J561K261
$$ 125547 126719 126850 126317 125631 125010 124511 124149 123845 123574 123467 123483 123195 122278 121094 120454 120911 122472 124733
54807A24733K179J137l77j410j455q22r7K93P6o00r51l65N77P29Q5j84M29J055
$$ 124733 126912 128049 127672 126262 124807 123985 123888 124181 124257 123657 122706 122341 122918 123647 123732 123548 123977 125032
54789A25032R63O46P10P57K72k57j50J81j03p58p17K57J215J417J237J447K158
$$ 125032 125995 126641 127351 128108 128380 128123 127973 128154 128051 127293 126576 126833 128048 129465 130702 132149 134307
54772A34307K809K949K700K562K845L407L957M470N000N323N235N083N397O024
$$ 134307 137116 140065 142765 145327 148172 151579 155536 160006 165006 170329 175564 180647 186044 192068
54758A92068O270O048N969O094N426L194ol012n361p184q369q638q195p559o896
$$ 192068 198338 204386 210355 216449 221875 225069 225063 222051 216690 209506 201137 192499 184304 176745 169849
54743A69849o043n035m164l640l507l661l675k996j653n27l98r97j353q86J53
$$ 169849 163806 158771 154607 150967 147460 143799 140124 137128 135475 134948 134550 133553 132200 131314 131467
54728A31467J096J397J055P92J382K606L312K903K211K469L792N262O124O289
$$ 131467 132563 133960 135015 135807 137189 139795 143107 146010 148221 150690 154482 159744 165868 172157
54714A72157N950N322M626L903K881J422j81j640l114m784o279o956o627n616
$$ 172157 178107 183429 188055 191958 194839 196261 196080 194440 191326 186542 180263 173307 166680 161064
54700A61064m427l521l121k871k131j017n66j324k353k386j545r71j055j104p12
$$ 161064 156637 153116 149995 147124 144993 143976 143410 142086 139733 137347 135802 134831 133776 132672 131960
54685A31960m21o54r25o61j95l38j150j769j476n87ro7j03N86J663K038J204j62
$$ 131960 131539 130885 129960 129299 129104 128766 127616 125847 124371 123784 123775 123708 123605 124191 125854 127892 129096 128934
54667A28934j082j297j151q74m83j55k17p13j187r94N6J324J789J111J37j68P
$$ 128934 127852 126555 125404 124530 124047 123892 123675 122962 121775 120781 120837 122161 123950 125061 125198 125030 125037
54650A25037k43r53j132l87K83r8j068j406o34P56K078K785K511J475N23K13J88
$$ 125037 124794 123841 122709 122322 122605 122507 121439 120033 119399 120155 122233 125018 127529 129004 129527 129740 129928
54633A29928p9m24m66m24o93r66o12K37P86O21J20j94j25K35N85N50J71K6M97
$$ 129928 129849 129425 128959 128535 127842 126876 126264 126501 127287 127908 128028 127834 127709 127944 128529 129079 129250 129276 129773
54614A29773J137J236P13On40p95o66l13j45j52K37J074J348L79q67q61M04J435
$$ 129773 130910 132146 132859 132865 132325 131530 130864 130551 130406 130254 130491 131565 132913 133292 132425 131564 131968 133403
54596A33403J227K05p26j109r04l79j15m16p27l56L88O00J28l46m78n00k81N92
$$ 133403 134630 134835 134109 133000 132096 131717 131602 131186 130459 130103 130491 131091 131219 130873 130395 129895 129614 130206
54578A30206J673J760O11n32o57k29r8j02L39R45R48M25K50Q15J529J747J519
$$ 130206 131879 133639 134250 133718 133061 132832 132734 132632 132971 133916 134864 135289 135539 136354 137883 139630 141149
54561A41149J196P70nr87j560j263l06O47J115J006L85n50j221r63J29J146J472
$$ 141149 142345 143115 143110 142123 140563 139300 138994 139641 140756 141762 142147 141597 140376 139413 139542 140688 142160
54544A42160J554K007K477K103Q88j96m38o3L52N28L91m8n24n98j56M72R10R70
$$ 142160 143714 145721 148198 150301 151189 150993 150555 150492 150844 151372 151763 151715 151191 150593 150437 150909 151819 152789
54526A52789N21m57j580k197j969j119o7Q86J542J723J386P02j6m43m89m29n23
$$ 152789 153310 152853 151273 149076 147107 145988 145921 146807 148349 150072 151458 152160 152144 151701 151212 150783 150260
54509A50260n64j49M84N14l33j243j345p51j16K68L96J34m25p30n10k62l41j81
$$ 150260 149696 149547 150031 150545 150212 148969 147624 146873 146757 147025 147421 147555 147130 146400 145890 145628 145287 145106
54491A45106P62J873K126J547R12M11k34p41n61m8l2l58j03P83J363J300J228
$$ 145106 145868 147741 149867 151414 152326 152737 152503 151762 151201 151153 151121 150763 150660 151443 152806 154106 155334
54474A55334J340J082N66Q52K090K758J728L6m64M34J327J228N60K21M92R84J266
$$ 155334 156674 157756 158322 159174 161264 164022 165750 165786 165322 165756 167083 168311 168871 169092 169584 170568 171834
54457A71834J284J239J136O58k41j013j196j130j393j780j671j173r61j075q79
$$ 171834 173118 174357 175493 176151 175910 174897 173701 172571 171178 169398 167727 166554 165593 164518 163639
54442A63639l13q8m37o97m07J22O15J181J560J047k59j167r39k91j80m84n61l86
$$ 163639 163326 163238 162801 162104 161697 161819 162434 163615 165175 166222 165963 164796 163857 163566 163386 162902 162341 161955
54424A61955l58m83m92l01J27Q55J510J336K62p57r54o98o59p33m74j8K04K52
$$ 161955 161597 161114 160622 160321 160448 161303 162813 164149 164411 163654 162700 162002 161343 160610 160136 160118 160322 160574
54406A60574M75Q18R60Q61O61L39n4j78K19R14J533J851J668R50K54L58J049J105
$$ 160574 161049 161867 162827 163688 164349 164688 164634 164456 164675 165589 167122 168973 170641 171591 171845 172203 173252 174357
54388A74357m3j389j692j027l19M1L02N90P81Q82R04O74K44NJ6k26q76j234q06
$$ 174357 174314 172925 171233 170206 169887 169928 170230 170820 171601 172483 173387 174061 174305 174310 174326 174100 173224 171990 171184
54369A71184k04k25n94m91J55P78J231J806K372K343J533M08n14j017j023n48
$$ 171184 170980 170755 170161 169670 169825 170603 171834 173640 176012 178355 179888 180296 179782 178765 177742 177194
54353A77194J47O87P48J20j035j895j552j56J072J266P62K61o9l14m15n39j007
$$ 177194 177341 178028 178776 178896 177861 175966 174414 174258 175330 176596 177358 177619 177550 177236 176821 176282 175275
54336A75275j459j011K01P40j18j251j472j305j713k141j500k40K00l22o21k43
$$ 175275 173816 172805 173006 173746 173628 172377 170905 169600 167887 165746 164246 164006 164206 163884 163263 163020
54320A63020nm38j010j112o72K25J343J949J435L08l48l24k56l66l26j63k27l31
$$ 163020 163015 162577 161567 160455 159783 160008 161351 163300 164735 165043 164695 164371 164115 163749 163423 163260 163033 162702
54302A62702o8J81k72j049j155o43m52o01j03J034J389K86j075j417j068r97j249
$$ 162702 162634 162815 162543 161494 160339 159696 159244 158643 158540 159574 160963 161249 160174 158757 157689 156692 155443
54285A55443j239q33k75L36Q24P57J44l49l38k59m64n03P9Q93J343J484J597J465
$$ 155443 154204 153371 153096 153432 154256 155013 155157 154808 154470 154211 153747 153244 153323 154216 155559 157043 158640 160105
54267A60105Q32J67J64O84R18M37l72r07r18n63j98n3J5L22Q60J294J490J639
$$ 160105 160937 161104 161268 161952 162870 163307 162935 162028 161110 160547 160349 160296 160311 160633 161493 162787 164277 165916
54249A65916J776J577Q89M1n01n46j29M99P48R5j181k094k028j356p96o28o98
$$ 165916 167692 169269 170158 170199 169698 169152 169023 169522 170270 170365 169184 167090 165062 163706 162910 162282 161584
54232A61584q25r19r83j137j414j558j339r27n49JQ86J553J330O02L73P03N89
$$ 161584 160759 159840 158857 157720 156306 154748 153409 152482 151933 151934 152820 154373 155703 156305 156678 157381 157970
54215A57970k96r40n42K32K83l95r47r05n00j07O7Ok5K61O66O53K20O3N45J114
$$ 157970 157674 156734 156192 156424 156707 156312 155365 154460 153960 153853 153920 153926 153901 154162 154828 155481 155701 155764 156309 157423
54195A57423J058L51n46j185j231o80j77m21j051j016k25K15j78m16K61J015Q14
$$ 157423 158481 158832 158286 157101 155870 155190 155013 154592 153541 152525 152300 152515 152337 151921 152182 153197 154011
54178A54011J86K63Q06O25m03j166j001l71J92P30J224J271O50l16j165j602j493
$$ 154011 154197 154460 155266 155891 155488 154322 153321 152950 153142 153872 155096 156367 157017 156701 155536 153934 152441
54161A52441j023p51r81j275j045m18O2K63L56K46j20k01N06J440J570R29N79
$$ 152441 151418 150667 149686 148411 147366 146948 147010 147273 147629 147875 147755 147554 148060 149500 151070 151999 152578
54144A52578R62J297Q59On02m91k43K5K10K59L60P56J241J235O04p6l19l20m83
$$ 152578 153540 154837 155696 155702 155200 154709 154466 154491 154701 154960 155320 156076 157317 158552 159156 159080 158761 158441 157958
54125A57958p54q07n86l21j10K51R61J815K169J580N59K26R08J563J116l0n83
$$ 157958 157204 156397 155811 155490 155380 155631 156592 158407 160576 162156 162715 162941 163849 165412 166528 166498 165915
54108A65915j48N00P55Q00P70L93k97p22o50m74l32J48P68N18q33j811r99Q66
$$ 165915 165767 166267 167022 167822 168592 168985 168688 167966 167316 166842 166510 166658 167426 167944 167111 165300 164301 165167
54090A65167J767J020j40n05k57j37k46j66K78Q42J163R21Q3q09r17P3J551K592
$$ 165167 166934 167954 167814 167309 167052 166915 166669 166503 166781 167623 168786 169707 169790 168981 168064 168137 169688 172280
54072A72280K745K171J299M85j33o59j125j248p58K1L77J72J31Q06J734K085J898
$$ 172280 175025 177196 178495 178980 178847 178188 177063 175815 175057 175078 175455 175627 175758 176564 178298 180383 182281
54055A82281J959K628L455M093M873O197P857R445J0952J2342J2804J1189P311
$$ 182281 184240 186868 190323 194416 199289 205486 213343 222788 233740 246082 258886 270075 277386
54042B77386K415j819m492n692n999n940n625m705k968j012L0k73j091j324q53
$$ 277386 279801 277982 273490 267798 261799 255859 250234 245529 242561 241549 241579 241306 240215 238891 238038
54027B38038l46j74r7L9%k73l62m0J73m01j584k445k436k024k018k551l047l087
$$ 238038 237692 237518 237421 237460 237460 237187 236825 236785 236958 236557 234973 232528 230092 228068 226050 223499 220452 217365
54009B17365k857k663k393j804j150j017j496j947j775j150o03k71R2M65M55r8
$$ 217365 214508 211845 209452 207648 206498 205481 203985 202038 200263 199113 198510 198239 198331 198796 199251 199153
53993A99153p49r28n29M4K61j77j118k000k252j809j085m37P0L64K00m51j119
$$ 199153 198404 197476 196947 196991 197252 197075 195957 193957 191705 189896 188811 188374 188444 188808 189008 188557 187438
53976A87438j347j263j254j209o69K63P58L16m98q08n41k53q0M57J444K111J761
$$ 187438 186091 184828 183574 182365 181696 181959 182717 183033 182535 181727 181186 180933 180853 181310 182754 184865 186626
53959A86626P87K73O88J473J837J664J463J715K421L160L514L448L359L664M343
$$ 186626 187413 187686 188374 189847 191684 193348 194811 196526 198947 202107 205621 209069 212428 216092 220435
53944B20435M981N280N442N968P090Q419R215Q990P924O578N310M050K627J074
$$ 220435 225416 230696 236138 242106 249196 257615 266830 275820 283744 290322 295632 299682 302309 303383
53930C03383m85j999l285l859l320j888l25P29J166J219J049O42k7p22q44J91
$$ 303383 302898 300899 297614 293755 290435 288547 288222 288951 290117 291336 292385 293027 293000 292278 291434 291625
53914B91625K220M123M740M024K990K510K492K264J445K34q10j029K8K143M369
$$ 291625 293845 297968 302708 306732 309722 312232 314724 316988 318433 318667 317857 316828 316856 318999 323368
53899C23368N793O459P319R124J1422J2742J1668P762J701n075j0879j4466j5689
$$ 323368 329161 335620 342939 352063 363485 376227 387895 395657 397358 392283 381404 366938 351249
53886C51249j5470j4835j4081j3008j1693j0424r098p347n447m306m245m496m285
$$ 351249 335779 320944 306863 293855 282162 271738 262640 255293 249846 245540 241295 236799 232514
53873B32514l753l292k726j902j381j591j853j326n55p73j900k559k099j286p26
$$ 232514 228761 225469 222743 220841 219460 217869 216016 214690 214135 213362 211462 208903 206804 205518 204792
53858B04792m2Q81J136J40j301k128k375k478k159j004L96J025Q51O39O12K63
$$ 204792 204750 205631 206767 206907 205606 203478 201103 198625 196466 195462 195858 196883 197734 198373 198985 199248
53842A99248n48j226j277q71m51k27j44j4K68M93L68J40M89J474K201J987J271
$$ 199248 198700 197474 196197 195326 194875 194648 194504 194490 194758 195251 195619 195759 196248 197722 199923 201910 203181
53825B03181P42K97k85l77N76J665J449J10o82r9R45J475J651J803J590R25O58
$$ 203181 203923 204220 203935 203558 204134 205799 207248 207358 206676 206577 207522 208997 210648 212451 214041 214966 215624
53808B15624J375K283K281J527J038J191J616K248L374M635M951L805J919M05
$$ 215624 216999 219282 221563 223090 224128 225319 226935 229183 232557 237192 242143 245948 247867 248272
53794B48272k89l07K24J235K359K987K822K218J808J791J634O98q51j994j990
$$ 248272 247983 247676 247900 249135 251494 254481 257303 259521 261329 263120 264754 265452 264601 262607 260617
53779B60617j335j249k144l118l099k197j528j841k775l486l605l310k892k549
$$ 260617 259282 258033 255889 252771 249672 247475 245947 244106 241331 237845 234240 230930 228038 225489
53765B25489k433k449k114j099J00O06K82r3l2p0r08k267l153l015k093q81K16
$$ 225489 223056 220607 218493 217394 217494 218100 218382 218289 218257 218187 217279 215012 211859 208844 206751 205870 206086
53748B06086P95O58J77N0N45J277J733J691J219N96K64M12O64N36K01L27J077
$$ 206086 206881 207539 207716 207766 208311 209588 211321 213012 214231 214827 215091 215503 216167 216703 216904 217231 218308
53731B18308J793J873J531J405J722K153K347K290K188K162K087J771J273R49
$$ 218308 220101 221974 223505 224910 226632 228785 231132 233422 235610 237772 239859 241630 242903 243852
53717B43852J022J281J443J588J921K215K086J716J817K659L648M070L910L646
$$ 243852 244874 246155 247598 249186 251107 253322 255408 257124 258941 261600 265248 269318 273228 276874
53703B76874L608L780L958L732K737J217J61L88J640K955L820M383M623L980K316
$$ 276874 280482 284262 288220 291952 294689 295906 296067 296455 298095 301050 304870 309253 313876 317856 320172
53688C20172O83M19J463K214J416l09j294q60P0L12l46j388k364k949k772j807
$$ 320172 320855 321274 322737 324951 326367 326058 324764 323904 323974 324286 323940 322552 320188 317239 314467 312660
53672C12660p38l60o79j018r68p67p84j027j233j181q30m00k63n51r09r03n53
$$ 312660 311922 311562 310883 309865 308897 308130 307346 306319 305086 303905 303075 302675 302412 301861 300952 300049 299496
53655B99496k30r8PK09M22N19M24J62KL10R90J319Q48J52J68R85J858K270K283
$$ 299496 299266 299168 299175 299384 299806 300325 300749 300911 300913 301223 302213 303532 304380 304532 304700 305685 307543 309813 312096
53636C12096J997J453J080J439K322K885K862K905L442L965L883L439L219L291
$$ 312096 314093 315546 316626 318065 320387 323272 326134 329039 332481 336446 340329 343768 346987 350278
53622C50278L363L368L365L173K728K497L023M114M977N104M671M186L984M056
$$ 350278 353641 357009 360374 363547 366275 368772 371795 375909 380886 385990 390661 394847 398831 402887
53608D02887M153M067L937M067M430M596M296L734L187K690K230J927J743J380
$$ 402887 407040 411107 415044 419111 423541 428137 432433 436167 439354 442044 444274 446201 447944 449324
53594D49324P50K46K28N38Q71J279J868K272J889O35q57j841k093k031k323l294
$$ 449324 450074 450320 450548 451086 451957 453236 455104 457376 459265 459900 459043 457202 455109 453078 450755 447461
53578D47461m632n736o313o351n714m291k626j727j932k495k645k483k430k336
$$ 447461 442829 437093 430780 424429 418715 414424 411798 410071 408139 405644 402999 400516 398086 395750
53564C95750j800r90l97l4M72J146J627J800J908K010J899J610J515J777K112
$$ 395750 393950 392960 392563 392529 393001 394147 395774 397574 399482 401492 403391 405001 406516 408293 410405
53549D10405K191K064K046K477L484M767N696N874N553N228N063N014N345O413
$$ 410405 412596 414660 416706 419183 422667 427434 433130 439004 444557 449785 454848 459862 465207 471620
53535D71620Q001R416J0342J1114J2051J2931J3423J3675J4149J5058J6201J7213
$$ 471620 479621 489037 499379 510493 522544 535475 548898 562573 576722 591780 607981 625194
53523F25194J7832J8060J8199J8668J9643K0950K2324K3743K5333K7108K8820
$$ 625194 643026 661086 679285 697953 717596 738546 760870 784613 809946 837054 865874
53512H65874L0121L0805L0935L0776L0648L0764L1088L1329L1127L0422K9516
$$ 865874 895995 926800 957735 988511 1019159 1049923 1081011 1112340 1143467 1173889 1203405
53501A203405K8744K8113K7437K6616K5650K4553K3583K3339K4135K5332K5748
$$ 1203405 1232149 1260262 1287699 1314315 1339965 1364518 1388101 1411440 1435575 1460907 1486655
53490A486655K4898K3333K1771K0444J9464J9125J9404J9626J9181J8273J7523
$$ 1486655 1511553 1534886 1556657 1577101 1596565 1615690 1635094 1654720 1673901 1692174 1709697
53479A709697J7049J6260J4487J1547P917M512J949j33k712o169r907j3306j6366
$$ 1709697 1726746 1743006 1757493 1769040 1776957 1781469 1783418 1783285 1780573 1774404 1764497 1751191 1734825
53466A734825j9077k0848k1309k1071k0979k1065k1025k1281k2599k4865k7158
$$ 1734825 1715748 1694900 1673591 1652520 1631541 1610476 1589451 1568170 1545571 1520706 1493548
53455A493548k8939l0295l1037l0579k8928k7027k5764k5159k4746k4165k3172
$$ 1493548 1464609 1434314 1403277 1372698 1343770 1316743 1290979 1265820 1241074 1216909 1193737
53444A193737k1540j9276j6675j4031j1520r267p246n259l358j985j159L2K382
$$ 1193737 1172197 1152921 1136246 1122215 1110695 1101428 1094182 1088923 1085565 1083580 1082421 1082453 1084835
53431A084835N251P297Q367R582J1479J3315J4511J5615J7221J8991K0477K2040
$$ 1084835 1090086 1097383 1105750 1115332 1126811 1140126 1154637 1170252 1187473 1206464 1226941 1248981
53419A248981K4103K6220K7831K9339L1443L3847L5694L7033L8807M1348M3932
$$ 1248981 1273084 1299304 1327135 1356474 1387917 1421764 1457458 1494491 1533298 1574646 1618578
53408A618578M6022M8030N0474N3092N5421N7696O0566O3958O6872O8474O9066
$$ 1618578 1664600 1712630 1763104 1816196 1871617 1929313 1989879 2053837 2120709 2189183 2258249
53397B258249O9658P0754P1940P2698P3159P3666P3883P2966P0627O7486O4280
$$ 2258249 2327907 2398661 2470601 2543299 2616458 2690124 2764007 2836973 2907600 2975086 3039366
53386C039366O1183N8041N4741N1084M6781M1966L7273L3056K8871K4180J9081
$$ 3039366 3100549 3158590 3213331 3264415 3311196 3353162 3390435 3423491 3452362 3476542 3495623
53375C495623J3950Q739L131k931r577j7522k7436l8752m9847n9409o7098p2830
$$ 3495623 3509573 3518312 3521443 3518512 3508935 3491413 3463977 3425225 3375378 3315969 3248871 3176041
53363C176041p6235p7306p6964p6428p6220p6082p5612p4570p2734o9947o6408
$$ 3176041 3099806 3022500 2945536 2869108 2792888 2716806 2641194 2566624 2493890 2423943 2357535
53352B357535o2731n9641n7631n6778n6757n7024n7059n6498n5060n2578m9172
$$ 2357535 2294804 2235163 2177532 2120754 2063997 2006973 1949914 1893416 1838356 1785778 1736606
53341A736606m5347m1723l8675l6156l3784l1081k7781k4069k0513j7642j5606
$$ 1736606 1691259 1649536 1610861 1574705 1540921 1509840 1482059 1457990 1437477 1419835 1404229
53330A404229j4290j3635j3702j4312j4890j4812j3989j2827j1595j0075q053
$$ 1404229 1389939 1376304 1362602 1348290 1333400 1318588 1304599 1291772 1280177 1270102 1262049
53319A262049n990m728m374l965k521k37J846L183M297N920Q014R935J1271J2214
$$ 1262049 1256059 1251331 1246957 1242992 1240471 1240234 1242080 1245263 1249560 1255480 1263494 1273429 1284700 1296914
53305A296914J3243J4818J7249K0438K3622K5785K6690K7269K8714L1162L3665
$$ 1296914 1310157 1324975 1342224 1362662 1386284 1412069 1438759 1466028 1494742 1525904 1559569
53294A559569L5376L6444L7439L8267L8060L6280L3510L0934K9056K7294K4860
$$ 1559569 1594945 1631389 1668828 1707095 1745155 1781435 1814945 1845879 1874935 1902229 1927089
53283A927089K1775J8699J5850J2606Q304L165j935o315r797j2446j4522j6679
$$ 1927089 1948864 1967563 1983413 1996019 2004323 2007488 2005553 1999238 1989441 1976995 1962473 1945794
53271A945794j9542k2936k6033k8426l0599l3049l5482l7297l8431l9266m0004
$$ 1945794 1926252 1903316 1877283 1848857 1818258 1785209 1749727 1712430 1673999 1634733 1594729
53260A594729m0646m1322m2121m2734m2707m1910m0394l8102l5263l2760l1457
$$ 1594729 1554083 1512761 1470640 1427906 1385199 1343289 1302895 1264793 1229530 1196770 1165313
53249A165313l1271l1553l2059l2772l3060l2082l0114k8421k7529k6692k5380
$$ 1165313 1134042 1102489 1070430 1037658 1004598 972516 942402 913981 886452 859760 834380
53238H34380k4146k3347k2070j9361j5823j2874j0977r615q699q690r407r838
$$ 834380 810234 786887 764817 745456 729633 716759 705782 696167 687468 678778 669371 659533
53226F59533r450q892r041j0009j1386j2853j4212j5236j5758j5665j4732j2927
$$ 659533 650083 641191 632150 622141 610755 597902 583690 568454 552696 537031 522299 509372
53214E09372j0910r699r524r628r359q935q759q631q183p664p548p721p753p779
$$ 509372 498462 488763 479239 469611 460252 451317 442558 433927 425744 418080 410532 402811 395058 387279
53200C87279q293r063r051p747n971m930m924n361n658n591n060m080k995k267
$$ 387279 378986 369923 360872 353125 347154 342224 337300 331939 326281 320690 315630 311550 308555 306288
53186C06288j989j917j888j830j504q05k42n38j502k029j552q81j048j886k418
$$ 306288 304299 302382 300494 298664 297160 296355 296113 295575 294073 292044 290492 289611 288563 286677 284259
53171B84259k256j770j182m11K74M38L17N85J087Q50l36j395j578j532j930k063
$$ 284259 282003 280233 279051 278640 278914 279352 279669 280254 281341 282191 281855 280460 278882 277350 275420 273357
53155B73357j027M06O01n43j534j577j516k069k531k020r76m33n02n26k65PK79
$$ 273357 272330 272736 273337 272794 271260 269683 268167 266098 263567 261547 260571 260138 259636 259110 258845 258852 259131
53138B59131Q00J399J541J127O11L22J72M6m2j61l63l34K51J009J119M68j15N9
$$ 259131 259931 261330 262871 263998 264609 264931 265103 265149 265107 264946 264583 264249 264500 265509 266628 267096 266981 267040
53120B67040P51J436K049K639K843K439J968K088K499K191P81j063k479l137l038
$$ 267040 267791 269227 271276 273915 276758 279197 281165 283253 285752 287943 288724 287661 285182 282045 279007
53105B79007k296j390j003j273j586j435j050q58q26p73r97j842k887l149k275
$$ 279007 276711 275321 274318 273045 271459 270024 268974 268116 267290 266517 265520 263678 260791 257642 255367
53090B55367r40K2M89Q18J087R86M27j11m3N98J112Q95J31n07p27q59j151j337
$$ 255367 254427 254449 254938 255756 256843 257829 258256 258145 258102 258700 259812 260707 260838 260331 259604 258745 257594 256257
53072B56257j134p76o42o14l13J53K06l83j120j401j173q31o64o26n17k76j04
$$ 256257 255123 254347 253705 253091 252778 252931 253137 252754 251634 250233 249060 248229 247565 246939 246422 246146 246042
53055B46042k68p42j111r66l46L52P52O73J39n68j041j147j098r70m98L18P98
$$ 246042 245774 245032 243921 242955 242609 242961 243713 244386 244525 243957 242916 241769 240671 239701 239203 239521 240319
53038B40319L72m87q06m77k59m67n42j39K02p2o48q90p14l96P9Q53J644J979J812
$$ 240319 240691 240204 239398 238921 238662 238195 237653 237514 237716 237644 236996 236106 235392 234996 235075 235928 237572 239551 241363
53019B41363J511J331J276J301J283R38J67o13q47m75O6M08M71K47k82r64j532
$$ 241363 242874 244205 245481 246782 248065 249003 249170 248557 247710 247235 247301 247709 248180 248427 248145 247181 245649
53002B45649j787j664j214o51k69j40m9J08J70J10K40O33P62K36m30l93L08Q58
$$ 245649 243862 242198 240984 240333 240064 239924 239875 239983 240153 240263 240503 241136 241898 242134 241704 241311 241619 242477
52984B42477R49J163J822K244J635L36m58j42O90J064P47L37M57J079J696J999
$$ 242477 243426 244589 246411 248655 250290 250626 250168 250026 250716 251780 252527 252864 253321 254400 256096 258095
52968B58095K185K599L202L566L324K479J369M02j93m85p46j154j634j967j987
$$ 258095 260280 262879 266081 269647 272971 275450 276819 277221 277028 276543 275797 274643 273009 271042 269055
52953B69055j646j038m38j25n9N4K47Q7p54j857k377k016j350j120j404j660j488
$$ 269055 267409 266371 265933 265808 265749 265803 266050 266137 265383 263526 261149 259133 257783 256663 255259 253599 252111
52936B52111j106r93j168j126n37K45N74K71l73j123j866k209j691n47K90K83
$$ 252111 251005 250012 248844 247718 247181 247426 248000 248271 247898 246775 244909 242700 241009 240462 240752 241035
52920B41035r0j03K97O99R08Q94N26j15m72j79K79K27j68j65L71Q18P45K85m67
$$ 241035 240945 240842 241139 241838 242746 243640 244166 244051 243579 243400 243679 243906 243738 243573 243944 244762 245507 245792 245325
52901B45325j614k830l320k750j698q70l15K44P87J093J125R51N31r2o40q86r00
$$ 245325 243711 240881 237561 234811 233113 232243 231928 232172 232959 234052 235177 236128 236659 236567 235927 235041 234141
52884B34141p57l13M68J181J314Q23J38l16l74j01K50L83K38J44M64J215K102
$$ 234141 233384 233071 233539 234720 236034 236857 236995 236679 236305 236204 236454 236837 237075 237219 237683 238898 241000
52867B41000K868L366L423K862J839R35P29J180J534J005l59j646k033j645j235
$$ 241000 243868 247234 250657 253519 255358 256293 257022 258202 259736 260741 260382 258736 256703 255058 253823
52852B53823j212j299j095o63m04o40j437k603l710m245l967l064j997j191p94
$$ 253823 252611 251312 250217 249554 249150 248510 247073 244470 240760 236515 232548 229484 227487 226296 225502
52837B25502o58n26l66m26q29j238j145m69L71R06J029R43Q61P78M18m09j331
$$ 225502 224844 224318 223952 223526 222697 221459 220314 219845 220216 221122 222151 223094 223955 224733 225151 224742 223411
52820B23411j595r54j07J13l21q99j350j591j212J21J815K752K667K364K494K817
$$ 223411 221816 220862 220755 220868 220547 219648 218298 216707 215495 215616 217431 220183 222850 225214 227708 230525
52804B30525K959K926K574J431l72j744j999j926k684m050m662l833k289j085
$$ 230525 233484 236410 238984 240415 240043 238299 236300 234374 231690 227640 222978 219145 216856 215771
52790B15771n24k47J40O86J048P98qp34q75n92k52K27J012J771K024J934J943
$$ 215771 215247 215000 215140 215826 216874 217672 217664 216930 216055 215463 215211 215438 216450 218221 220245 222179 224122
52773B24122J881J184K4o98o23l55m11n55n58p86j441j894j484n73p6k42n44n37
$$ 224122 226003 227187 227211 226513 225890 225535 225124 224569 224011 223225 221784 219890 218406 217833 217757 217515 216971 216434
52755B16434k08L65J041J403J178Q25J040J671J839J268P70J006J515J501J027
$$ 216434 216226 216591 217632 219035 220213 221038 222078 223749 225588 226856 227626 228632 230147 231648 232675
52740B32675Q03J046J346J480J735K244K683K743K489K059J438Q06O65J273K057
$$ 232675 233478 234524 235870 237350 239085 241329 244012 246755 249244 251303 252741 253547 254212 255485 257542
52725B57542K041Q33r40k214k380j759j220j292j677j742j429j301j635j939j649
$$ 257542 259583 260416 259476 257262 254882 253123 251903 250611 248934 247192 245763 244462 242827 240888 239239
52710B39239r62n82q95j665k387k545j803l65R32J324R09M33L54N04N57M29J95
$$ 239239 238277 237695 236800 235135 232748 230203 228400 228035 228967 230291 231200 231633 231987 232491 233048 233477 233672
52693B33672L3K16Q18J400J454J124J025J296J419J066N75L58L65M17O30J009
$$ 233672 233705 233921 234739 236139 237593 238717 239742 241038 242457 243523 244098 244456 244821 245238 245868 246877
52677B46877J113N85k48p72q08o17l90j78j29l25m93k75K12M91L79J69J36K37
$$ 246877 247990 248575 248327 247555 246747 246130 245740 245562 245433 245108 244615 244340 244552 245043 245422 245591 245727 245964
52659B45964L17L06J73o0j78J61J097K380L448L689K876J473K89m15j131k115
$$ 245964 246281 246587 246760 246700 246522 246683 247780 250160 253608 257297 260173 261646 261935 261520 260389 258274
52643B58274k657k027q52n97j593k437j810j13J250J613J393J120R55R89J339
$$ 258274 255617 253590 252738 252141 250548 248111 246301 246188 247438 249051 250444 251564 252519 253508 254847
52628B54847J843K239K653L378M167M332L603K334O95j498l899n327n010l659
$$ 254847 256690 258929 261582 264960 269127 273459 277062 279396 280091 278593 274694 269367 264357 260698
52614B60698k584k173j880j401j086j133j223j020n09K36J014J287P14n8R3J207
$$ 260698 258114 255941 254061 252660 251574 250441 249218 248198 247689 247925 248939 250226 250940 250882 250975 252182
52598B52182K013J616O16Pj71m14o32m24m3n7l02j23M17N30M6j77M75J398J583
$$ 252182 254195 255811 256427 256434 256263 255849 255217 254793 254750 254693 254391 254268 254685 255215 255261 255084 255559 256957 258540
52579B58540Q97J11q1L02P26Q16P22R03J368J403L75j266k328k171j319o40m16
$$ 258540 259437 259548 259467 259769 260495 261311 262033 262936 264304 265707 266082 264816 262488 260317 258998 258358 257942
52562B57942l76k74j84l26q02j407j746j659j339r20k12Q17J611J589R98O62R11
$$ 257942 257566 257292 257108 256782 255980 254573 252827 251168 249829 248909 248697 249514 251125 252714 253712 254374 255285
52545B55285J239R80l5j354k136j749n95O9l04p00p8R31R47J25r0N90Q87K25k86
$$ 255285 256524 257504 257469 256115 253979 252230 251635 251704 251400 250700 250622 251553 252500 252625 252535 253125 254012 254237 253951
52526B53951R5L65l71j131o07N67P45j40o24p5N61N44M04Q29J569K058K380K937
$$ 253951 254046 254411 254040 252909 252302 252869 253614 253474 252850 252775 253336 253880 254284 255113 256682 258740 261120 264057
52508B64057L568L672L105K529K604K999K572P79j410k506k300j924k159k602
$$ 264057 267625 271297 274402 276931 279535 282534 285106 285885 284475 281969 279669 277745 275586 272984
52494B72984k729k790l003k770j591j22N94M74K08R2j5J6M38R46J029Q41R92J495
$$ 272984 270255 267465 264462 261692 260101 259979 260573 261047 261255 261347 261332 261348 261786 262732 263761 264602 265594 267089
52476B67089J721J304N02k55n73j11R32J575J076N0j54Q31K062K569K303J816
$$ 267089 268810 270114 270616 270361 269788 269677 270609 272184 273260 273310 273156 273987 276049 278618 280921 282737
52460B82737J659K064K720K827J920M74o84j322j713k034k459l336m531n060m272
$$ 282737 284396 286460 289180 292007 293927 294401 293717 292395 290682 288648 286189 282853 278322 273262 268990
52445B68990k879j918j235k08O75M05o55j113p29n62q41m13J040J998J162o93
$$ 268990 266111 264193 262958 262750 263425 263830 263175 262062 261333 260771 259930 259517 260557 262555 263717 263024
52429B63024j847j644n73O97J561J534Q62M14N12N46K40K78J079J926K102J986
$$ 263024 261177 259533 258960 259657 261218 262752 263614 264028 264540 265086 265326 265604 266683 268609 270711 272697
52413B72697K235K711L174M200O330Q914J0853J2029J2991J3521J2596R605M967
$$ 272697 274932 277643 280817 285017 291347 300261 311114 323143 336134 349655 362251 371856 376823
52400C76823k77m854p691q763r175r796j0101r175p260n417m029k743j658j418
$$ 376823 376546 371692 364001 355238 346063 336267 326166 316991 309731 304314 300285 297542 295884 294466
52386B94466j911k023j028M95J560J947K079K197K142J867J756K283L421M481
$$ 294466 292555 290532 289504 289999 291559 293506 295585 297782 299924 301791 303547 305830 309251 313732
52372C13732M794M522M406M721M951M697M304M189M031L204J722K20p69j107q58
$$ 313732 318526 323048 327454 332175 337126 341823 346127 350316 354347 357551 359273 359493 358724 357617 356759
52357C56759k54L05N26M70L06K05N22J521K727L217K960L080M193N352N455N020
$$ 356759 356505 356810 357336 357806 358112 358317 358839 360360 363087 366304 369264 372344 376537 381889 387344 392364
52341C92364N402O780Q110Q848R529J0563J1594J2338J3128J4300J5611J6665
$$ 392364 397766 404546 412656 421504 431033 441596 453190 465528 478656 492956 508567 525232
52329E25232J7433J8146J8976J9917K0739K1175K1421K2177K3695K5128K5411
$$ 525232 542665 560811 579787 599704 620443 641618 663039 685216 708911 734039 759450
52318G59450K4485K3045K1417J9526J7592J5933J4232J1967R560Q060P554O948
$$ 759450 783935 806980 828397 847923 865515 881448 895680 907647 917207 925267 932821 939769
52306I39769N517L707K129P39n34j252j229j129j672k663l408l738m111m935o101
$$ 939769 945286 948993 951122 951861 951327 950075 948846 947717 946045 943382 939974 936236 932125 927190 921089
52291I21089p085p324o764o062n863n949n525m316k688q09J545M163O362Q089
$$ 921089 914004 906680 899916 893854 887991 882042 876517 872201 869513 868704 870249 874412 880774 888863
52277H88863J0181J2960J5423J6389J5957J5134J4672J4795J5536J6483J6688
$$ 888863 899044 912004 927427 943816 959773 974907 989579 1004374 1019910 1036393 1053081
52266A053081J5498J3349J1134R160P281N594M314L261K228J510J318Q92q04l528
$$ 1053081 1068579 1081928 1093062 1102222 1109503 1115097 1119411 1122672 1124900 1126410 1127728 1128620 1127816 1124288
52252A124288n799o595o316n887n766o152p375r494j1916j3911j5236j5898j5658
$$ 1124288 1118489 1111894 1105578 1099691 1093925 1087773 1080398 1070904 1058988 1045077 1029841 1013943 998285
52239I98285j4297j2227j0374r366r126r169r015q308o899m994l110j698q20k21
$$ 998285 983988 971761 961387 952021 942895 933726 924711 916403 909504 904510 901400 899702 898882 898661
52225H98661L25Q43J256J533J733K029K712L921N276N960N508M486M033M635N691
$$ 898661 898986 899829 901085 902618 904351 906380 909092 913013 918289 924249 929757 934243 938276 942911 948602
52210I48602O461P023P896Q904R076P799N649L789K794K369K020J612J288J276
$$ 948602 955063 962086 969982 978886 987962 995761 1001410 1005199 1007993 1010362 1012382 1013994 1015282 1016558
52196A016558J800K762L434K914J330J06L91J538J862R11pJ97Q56O61m81j626
$$ 1016558 1018358 1021120 1024554 1027468 1028798 1028904 1029295 1030833 1032695 1033606 1033599 1033796 1034652 1035313 1034832 1033206
52180A033206k392l297m496n273n172m817n100n997o710o670n954m888l602k113
$$ 1033206 1030814 1027517 1023021 1017748 1012576 1007759 1002659 996662 989952 983282 977328 972440 968838 966725
52166I66725n80N90J031Q92Q51J383K151K546K690L343M684N779N621M222K435
$$ 966725 966145 966735 967766 968658 969509 970892 973043 975589 978279 981622 986306 992085 997706 1001928 1004363
52151A004363J004K70L23R41J498J566J535K190L654N126N837N853N724N747N892
$$ 1004363 1005367 1005637 1005960 1006901 1008399 1009965 1011500 1013690 1017344 1022470 1028307 1034160 1039884 1045631 1051523
52136A051523O251P056Q197R232J0109J1501J3945J6813J8843J9761K0712K2651
$$ 1051523 1057774 1064830 1073027 1082259 1092368 1103869 1117814 1134627 1153470 1173231 1193943 1216594
52124A216594K4903K6036K5864K5666K6449K7729K8277K7515K5735K3458K1010
$$ 1216594 1241497 1267533 1293397 1319063 1345512 1373241 1401518 1429033 1454768 1478226 1499236
52113A499236J8555J6083J3391J0280O783L108n29l975p145r968j2235j3631j4052
$$ 1499236 1517791 1533874 1547265 1557545 1564328 1567436 1566907 1562932 1555787 1545819 1533584 1519953 1505901
52100A505901j3856j3477j2976j2218j1306j0412r325p788o157n089m539l802
$$ 1505901 1492045 1478568 1465592 1453374 1442068 1431656 1422331 1414543 1408386 1403297 1398758 1394956
52088A394956k742k183k648l417l403k439j049N49K601N149P893J0586J3090J5126
$$ 1394956 1392214 1390031 1387383 1383966 1380563 1378124 1377075 1377624 1380225 1385374 1393267 1403853 1416943 1432069
52074A432069J6469J7243J7676J7641J6909J5767J4859J4450J4171J3534J2320
$$ 1432069 1448538 1465781 1483457 1501098 1518007 1533774 1548633 1563083 1577254 1590788 1603108
52063A603108J0546Q393O190M119J867j068m658q170j0794j2301j3083j3778j4875
$$ 1603108 1613654 1622047 1628237 1632356 1634223 1633155 1628497 1620327 1609533 1597232 1584149 1570371 1555496
52050A555496j6426j8015j9155j9718j9985k0251k0606k1053k1672k2514k3347
$$ 1555496 1539070 1521055 1501900 1482182 1462197 1441946 1421340 1400287 1378615 1356101 1332754
52039A332754k3606k2798k1093j9240j7684j5910j3082r285n654l191j940j478
$$ 1332754 1309148 1286350 1265257 1246017 1228333 1212423 1199341 1190056 1184402 1181211 1179271 1177793
52027A177793j574k008k267j970j398j124j327j820k494l393m504n771p055p880
$$ 1177793 1176219 1174211 1171944 1169974 1168576 1167452 1166125 1164305 1161811 1158418 1153914 1148143 1141088 1133208
52013A133208p648o569n960o922r063j1108j2630j4367j6832j9347k0734k0537
$$ 1133208 1125560 1118991 1113031 1106109 1097046 1085938 1073308 1058941 1042109 1022762 1002028 981491
52001I81491j9352j8178j7625j7616j7820j8298j9363k0679k1089j9818j7448
$$ 981491 962139 943961 926336 908720 890900 872602 853239 832560 811471 791653 774205
51990G74205j5124j3207j1363r580q203p182o178n404n405n936o031n470n269
$$ 774205 759081 745874 734511 724931 716728 709546 703368 697964 692559 686623 680592 675122 669853
51977F69853o344q323j0116j1065j1173j0836j0625j0778j0647r317p028n198
$$ 669853 663509 655186 645070 634005 622832 611996 601371 590593 579946 570629 563601 558403
51965E58403m544m006k256M29K642L785M549N642O833P413P017N895M561L233
$$ 558403 553859 549853 547597 548026 550668 554453 559002 564644 571477 578890 585907 591802 596363 599596
51951E99596J512j069m102o440p530p940q042p079m437j250N89R08J508L705O749
$$ 599596 601108 600039 595937 589497 581967 574027 565985 558906 554469 553219 553808 554716 556224 559929 566678
51936E66678R137J0472J1315J1873J1749J0735R140P259N021K208j211n026q830
$$ 566678 575815 586287 597602 609475 621224 631959 641099 648358 653379 655587 654376 649350 640520
51923F40520j2108j4385j5369j5129j4243j3626j3810j4306j4032j2473j0199
$$ 640520 628412 614027 598658 583529 569286 555660 541850 527544 513512 501039 490840
51912D90840q160o845o219n992n577m214j644J419M043O139Q331J0902J3494J5994
$$ 490840 482680 475835 469616 463624 458047 453833 452189 453608 457651 463790 472121 483023 496517 512511
51898E12511J8997K2889K6771K8879K7966K3845J6805P277l553j3489k0532k4290
$$ 512511 531508 554397 581168 610047 638013 661858 678663 685940 682387 668898 648366 624076
51886F24076k5770k5791k4215k0881j6614j2685r625p160n062l409j964l7K653
$$ 624076 598306 572515 548300 527419 510805 498120 488495 481335 476273 472864 470900 470863 473516
51873D73516N456P447Q337Q469Q226P844P468O948N691L240n4l250n720p475q700
$$ 473516 478972 486419 494756 503225 511451 519295 526763 533711 539402 542642 542588 539338 533618 526143 517443
51858E17443r475r920j0171r945q584n850k419O80K875M123M548M329L708K664
$$ 517443 507968 498048 487877 477932 469348 463498 461079 461759 464634 468757 473305 477634 481342 484006
51844D84006Q33j857m593o274o603o162n475m640l913l937m817n498m677k273
$$ 484006 484839 482982 478389 472115 465512 459350 453875 449235 445322 441385 436568 431070 426393 424120
51830D24120M59K229K767K637K442K381K325K042J374L17r75k267l287l816l832
$$ 424120 424579 426808 429575 432212 434654 437035 439360 441402 442776 443093 442118 439851 436564 432748 428916
51815D28916l519l092k611k050j438p87J20J620L678N579O345N621L989K287O99
$$ 428916 425397 422305 419694 417644 416206 415419 415539 417159 420837 426416 432761 438382 442371 444658 445357
51800D45357j156l206m512m271k953j910j931k686l511m151m515m423m013l822
$$ 445357 444201 440995 436483 432212 429259 427349 425418 422732 419221 415070 410555 406132 402119 398297
51786C98297m009l899k950j731j218j321j004J44J295J631J381J211J130P07j8
$$ 398297 394288 390389 387439 385708 384490 383169 382165 382309 383604 385235 386616 387827 388957 389664 389646
51771C89646m28j29P37J951L523N337O936P944Q502R063R816J0548J0958J0783
$$ 389646 389218 389089 389826 391777 395300 400637 407573 415517 424019 433082 442898 453446 464404 475187
51757D75187R647P175L511m75l819o222p981r283r985j0000r547q829p785o349
$$ 475187 484834 492009 495520 495045 491226 485004 477023 467740 457755 447755 438208 429379 421594 415245
51743D15245m680k984j373K9J159K290L916O118Q445J0534J2350J3578J3345J1204
$$ 415245 410565 407581 406208 406237 407396 409686 413602 419720 428165 438699 451049 464627 477972 489176
51729D89176P964N016L137K506L275N208O999P007M744R83l448p989j1577j2842
$$ 489176 497140 502156 505293 507799 511074 516282 523281 530288 535032 536015 532567 524578 513001 500159
51715E00159j1577r137o913n228m117m086n278o629o838n799m303k693o31K017
$$ 500159 488582 479445 472532 467304 463187 459101 453823 447194 440356 434557 430254 427561 426930 428947
51701D28947M821P192Q517Q084N648K155p14j860j376j5J509K726L399L457K773
$$ 428947 433768 440960 449477 457561 463209 465364 464650 462790 461414 461399 462908 465634 469033 472490 475263
51686D75263J164j213l683n627o951p737p809p122o109n110l785j812K41J581
$$ 475263 476427 475214 471531 465904 458953 451216 443407 436285 430176 425066 421281 419469 419710 421291
51672D21291K463L817N772P545Q851J0268J1990J3305J3715J3608J3097J1111
$$ 421291 423754 427571 433343 440888 449739 460007 471997 485302 499017 512625 525722 536833
51660E36833O579O7o468j1278j3684j3821j2246r642o392k606J163L728M260L107
$$ 536833 543412 543479 537011 525733 512049 498228 485982 476340 469948 467342 468505 472233 476493 479600
51646D79600J140j192l550n093n213m643m821o040p238p638p608p566p073n674
$$ 479600 480740 479548 475998 470905 465692 461049 456228 450188 442950 435312 427704 420138 413065 407391
51632D07391l900k667k109j651j026m74k04k41p08j639k513k676k222j905k020
$$ 407391 403491 400824 398715 397064 396038 395564 395360 395119 394411 392772 390259 387583 385361 383456 381436
51617C81436j960j238l78k30p78j262j319j319j490j412p41J07M61L44L18O39
$$ 381436 379476 378238 377860 377630 376852 375590 374271 372952 371462 370050 369309 369416 369877 370221 370539 371178
51601C71178J154K024L832O641R490J1318J2090J2544J2918J2450J0226O201J287
$$ 371178 372332 374356 378188 384829 394319 405637 417727 430271 443189 455639 465865 472066 473353
51588D73353l292o589q223q361p494o075m378k624j019L94J863L687N895Q204
$$ 473353 470061 463472 455249 446888 439394 433319 428941 426317 425298 425692 427555 431242 437137 445341
51574D45341J0309J2208J4178J6379J8447J9719J9986J9893K0272K1036K1053
$$ 445341 455650 467858 482036 498415 516862 536581 556567 576460 596732 617768 638821
51563F38821J9309J6056J2769J1151J2238J6083K1889K8448L4712M0052M3774
$$ 638821 658130 674186 686955 698106 710344 726427 748316 776764 811476 851528 895302
51552H95302M4576M0927L2376K0411P752l392j2473k0171k7091l2975l7179l9621
$$ 895302 939878 980805 1013181 1033592 1041344 1037952 1025479 1005308 978217 945242 908063 868442
51540H68442m0958m1777m1798m0242l6849l2346k7818k3867k0561j7886j5848
$$ 868442 827484 785707 743909 703667 666818 634472 606654 582787 562226 544340 528492
51529E28492j4140j2174r772p611o601o783p166o794n766m940m858n248n553n572
$$ 528492 514352 502178 492406 484795 478194 471411 464245 457451 451685 446745 441887 436639 431086 425514
51515D25514n393n028m420l658k937k270j538q02l23k02k31k04j93l04l13J76
$$ 425514 420121 415093 410673 407015 404078 401808 400270 399468 399145 398943 398712 398508 398315 398011 397698 397874
51499C97874J228K444L403M019M428M664M722M730M780M517L297J043j281k487
$$ 397874 399102 401546 404949 408968 413396 418060 422782 427512 432292 436809 440106 441149 439868 437381
51485D37381k450k239k847m182n505o421p013p240o874o021n179m598m020l330
$$ 437381 434931 432692 429845 425663 420158 413737 406724 399484 392610 386589 381410 376812 372792 369462
51471C69462k985l404m241m691m398l675k927k288j813j617j679j767j675j362
$$ 369462 366477 363073 358832 354141 349743 346068 343141 340853 339040 337423 335744 333977 332302 330940
51457C30940q02K7R60J714K273K934L802M515M780M943N676P078Q458R124R208
$$ 330940 330138 330165 331125 332839 335112 338046 341848 346363 351143 356086 361762 368840 377298 386422 395630
51442C95630R514J0704J2715J4843J6081J5443J2439P621K583r78k410k194j132
$$ 395630 405144 415848 428563 443406 459487 474930 487369 494990 497573 496595 494185 491991 490859
51429D90859J09O41o55m089q379j1621j2988j2969j2137j0522q343o430n348m730
$$ 490859 490968 491609 490954 486865 478486 466865 453877 440908 428771 418249 409906 403476 398128 393398
51415C93398l988l135k303j035J031L076L785L178K708L218L731K891R35n19m04
$$ 393398 389410 386275 383972 382937 383968 387044 390829 394007 396715 399933 403664 406555 407490 406971 406567
51400D06567P39J585J399O32M13J456L310M873N722O510P770Q890Q977Q389Q500
$$ 406567 407306 408891 410290 410922 411335 412791 416101 420974 426696 433206 440976 449866 458843 467232 475732
51385D75732R948J1936J3634J5518J8764K3711K9432L4683L8982M2870M7299N2476
$$ 475732 485680 497616 511250 526768 545532 569243 598675 633358 672340 715210 762509 814985
51373H14985N7031N8615N5734M8871L9693K9540J9014Q515j621j1488k1336l0816
$$ 814985 872016 930631 986365 1035236 1074929 1104469 1123483 1131998 1130377 1118889 1097553 1066737
51361A066737l8964m5142m9511n2403n3687n3101n0794m7240m2840l7949l3123
$$ 1066737 1027773 982631 933120 880717 827030 773929 723135 675895 633055 595106 561983
51350E61983k8885k5255k1755j7995j4127j0722q284o884o251o103o184o104n463
$$ 561983 533098 507843 486088 468093 453966 443244 434960 428076 421825 415722 409538 403434 397971
51337C97971m434l831m131m651m310l072j917j378r89m17k12q28j702k060k071
$$ 397971 393537 389706 385575 380924 376614 373542 371625 370247 369258 368841 368629 367801 366099 364039 361968
51322C61968k302k527k097j257j045j761k525k587k262k196k338k169j444l41
$$ 361968 359666 357139 355042 353785 352740 350979 348454 345867 343605 341409 339071 336902 335458 335117
51308C35117Q18J648J777J186L42j56K1Q34J884K560K573K341K465K851K892K452
$$ 335117 335935 337583 339360 340546 340888 340732 340753 341587 343471 346031 348604 350945 353410 356261 359153 361605
51292C61605K034J834J448P84M96R48J469J303P61O75J164J743K322L164L918
$$ 361605 363639 365473 366921 367705 368201 369149 370618 371921 372682 373357 374521 376264 378586 381750 385668
51277C85668L647K075J21j155j628j856k180k455k423k005j273l47O61J639K468
$$ 385668 389315 391390 391511 390356 388728 386872 384692 382237 379814 377809 376536 376189 376850 378489 380957
51262C80957K991L030K421J105o04j908k102j438j003j436k134k170j655j496
$$ 380957 383948 386978 389399 390504 389900 387992 385890 384452 383449 382013 379879 377709 376054 374558
51248C74558j966k277j731o81j0q3n26q29p90n19k58j94l52o48j013j328j320
$$ 374558 372592 370315 368584 367903 367893 367810 367284 366455 365665 365146 364888 364694 364342 363694 362681 361353 360033
51231C60033p19M07J627K442K529J788M37q92j477j106k96J49k12j103j729j446
$$ 360033 359314 359721 361348 363790 366319 368107 368544 367652 366175 365069 364773 364922 364710 363607 361878 360432
51215C60432l89N93P85K21n64j100j072k42J148K237K372K004K080K647K821K239
$$ 360432 360043 360636 361421 361642 361078 359978 358906 358664 359812 362049 364421 366425 368505 371152 373973 376212
51199C76212J661J745K052J857J361J273J554J416N42m41q07m99R5O39Q83N92
$$ 376212 377873 379618 381670 383527 384888 386161 387715 389131 389673 389232 388425 387926 388021 388660 389543 390135
51183C90135j93j022j414j293r20n21j42J73L25K37j23p74j670k541k943k597
$$ 390135 389942 388920 387506 386213 385293 384772 384630 384803 385128 385365 385242 384468 382798 380257 377314 374717
51167C74717j678o60J33P47J367K005K574L107L747M434M787M385L194J634K56
$$ 374717 373039 372379 372512 373259 374626 376631 379205 382312 386059 390493 395280 399665 402859 404493 404749
51152D04749o88j362k063k827l336l226k532j757j494j849k211j795n18P16R81
$$ 404749 404061 402699 400636 397809 394473 391247 388715 386958 385464 383615 381404 379609 379091 379807 380788
51137C80788L90l2M02J386K217K560K375J621M75n42j060j275j463j437r60l81
$$ 380788 381178 381146 381548 382934 385151 387711 390086 391707 392182 391640 390580 389305 387842 386405 385445 385064
51121C85064k34m03l50l4J62K96Q82J927K689K636K038J360Q11P02J434K711L433
$$ 385064 384830 384427 384077 384043 384205 384501 385383 387310 389999 392635 394673 396033 396844 397546 398980 401691 405124
51104D05124L042K312K244K692K829K525K332K389K276J907J745J901J800J048
$$ 405124 408166 410478 412722 415414 418243 420768 423100 425489 427765 429672 431417 433318 435118 436166
51090D36166R9l22r1L38N57N06K89J3k87o62j178j701j929j703j243r88j151j497
$$ 436166 436265 435943 435852 436190 436747 437253 437542 437555 437268 436606 435428 433727 431798 430095 428852 427864 426713 425216
51072D25216j545j041j73O72J350J976K616L215L886M876O214P717R558J2262
$$ 425216 423671 422630 422457 423129 424479 426455 429071 432286 436172 441048 447262 454979 464537 476799
51058D76799J5573J7696J6529J1911O199K375J867M173Q019J2276J5957J8007
$$ 476799 492372 510068 526597 538508 544707 547082 548949 553122 561141 573417 589374 607381
51046F07381J7690J5335J2376J0203Q794O689K683k633p282r710r869q710p299
$$ 607381 625071 640406 652782 662985 671779 678468 681151 678518 671236 661526 651657 642947 635648
51033F35648o710q003j1486j5956j9263j9996j8539j6359j4463j2656j0258p140
$$ 635648 628938 620935 609449 593493 574230 554234 535695 519336 504873 492217 481959 474819
51021D74819l973j583k53L97R74J795K702L369L821M526N807P263Q066P914P435
$$ 474819 470846 469263 469010 469407 470381 472176 474878 478247 482068 486594 492401 499664 507730 515644 523079
51006E23079P546Q575J0071J1339J2027J2371J2960J4096J5311J5800J5429J4965
$$ 523079 530625 539200 549271 560610 572637 585008 597968 612064 627375 643175 658604 673569
50994F73569J5067J5343J4828J3136J0814Q652P073O142N686N377M975M647M771
$$ 673569 688636 703979 718807 731943 742757 751409 758482 764624 770310 775687 780662 785309 790080
50981G90080N372O003O156N623M490L157K410L079N396Q859J2866J7285K2208
$$ 790080 795452 801455 807611 813234 817724 820881 823291 826370 831766 840625 853491 870776 892984
50968H92984K7457L2601L7385M1830M6009M9996N4071N8549O3247O7281O9838
$$ 892984 920441 953042 990427 1032257 1078266 1128262 1182333 1240882 1304129 1371410 1441248
50957A441248P1030P1562P1523O9969O6043O0158N3499M6649L9378L1782K4741
$$ 1441248 1512278 1583840 1655363 1725332 1791375 1851533 1905032 1951681 1991059 2022841 2047582
50946B047582J8863J3661Q415L414l47k561m109o191r395j3525j7797k1149k2848
$$ 2047582 2066445 2080106 2088521 2091935 2091588 2089027 2084918 2078727 2069332 2055807 2038010 2016861 1994013
50933A994013k3001k2356k1698k1594k2510k4563k7252k9977l2872l6572m1112
$$ 1994013 1971012 1948656 1926958 1905364 1882854 1858291 1831039 1801062 1768190 1731618 1690506
50922A690506m5599m9174n1742n3536n4456n4284n3157n1338m8779m5293m1077
$$ 1690506 1644907 1595733 1543991 1490455 1435999 1381715 1328558 1277220 1228441 1183148 1142071
50911A142071l6772l3053l0310k8456k6789k4298k0558j6322j2919j1075j0442
$$ 1142071 1105299 1072246 1041936 1013480 986691 962393 941835 925513 912594 901519 891077
50900H91077j0204r786r088q269p482o723n867m958m246l816l302k209o04Q06
$$ 891077 880873 871087 861999 853730 846248 839525 833658 828700 824454 820638 817336 815127 814523 815329
50886H15329J379J265J245J932L165M210M489M015L245K701K786L719N331O985
$$ 815329 816708 817973 819218 821150 824315 828525 833014 837029 840274 842975 845761 849480 854811 861796
50872H61796Q001Q293Q393Q890J0024J1845J4286J6918J8938J9907K0402K1621
$$ 861796 869797 878090 886483 895373 905397 917242 931528 948446 967384 987291 1007693 1029314
50860A029314K4309K8212L2528L6677M0584M4594M9236N5013O2183P0661Q0133
$$ 1029314 1053623 1081835 1114363 1151040 1191624 1236218 1285454 1340467 1402650 1473311 1553444
50849A553444R0197J00366J10058J18780J26496J33681J40805J47654J53340J57050
$$ 1553444 1643641 1744007 1854065 1972845 2099341 2233022 2373827 2521481 2674821 2831871
50839B831871J58595J58021J54815J47885J36353J20191J00135P7344N3273K9520
$$ 2831871 2990466 3148487 3303302 3451187 3587540 3707731 3807866 3885210 3938483 3968003
50829C968003P495j1869k7971m0402m9070n4354n6730n6142n1992m3929l2867
$$ 3968003 3975498 3963629 3935658 3895256 3846186 3791832 3735102 3678960 3626968 3583039 3550172
50818C550172k1051j1113m854k828m814j0412j9165l0419m3371n7221p1175q4538
$$ 3550172 3529121 3518008 3513154 3510326 3505512 3495100 3475935 3445516 3402145 3344924 3273749 3189211
50806C189211r6943j08280j18090j25313j29034j29370j27036j22236j14658j04677
$$ 3189211 3092268 2983988 2865898 2740585 2611551 2482181 2355145 2232909 2118251 2013574
50796B013574r3664q2700p1632o0018m8454l8080k9044k0427j1723l614L021Q072
$$ 2013574 1919910 1837210 1765578 1705560 1657106 1619026 1589982 1569555 1557832 1554218 1557239 1565311
50784A565311J1722J3618J3308J1274Q754O424L862O12k776n306o868q373j0507
$$ 1565311 1577033 1590651 1603959 1615233 1623987 1630411 1634273 1634885 1632109 1626803 1619935 1611562 1601055
50771A601055j2908j4911j6663j9017k2377k6192k9594l2237l4256l5718l6357
$$ 1601055 1588147 1573236 1556573 1537556 1515179 1488987 1459393 1427156 1392900 1357182 1320825
50760A320825l5890l4440l2536l0684k8871k6632k3666k0271j7027j4135j1274
$$ 1320825 1284935 1250495 1217959 1187275 1158404 1131772 1108106 1087835 1070808 1056673 1045399
50749A045399q063m523j054J844L961N629P538J0069J2950J5829J9031K3283K8712
$$ 1045399 1037336 1032813 1031759 1033603 1037564 1043193 1050731 1060800 1073750 1089579 1108610 1131893 1160605
50736A160605L4608M0281M5724N1213N6720O2062O7294P2617P7924Q2668Q6082
$$ 1160605 1195213 1235494 1281218 1332431 1389151 1451213 1518507 1591124 1669048 1751716 1837798
50725A837798Q7560Q7129Q5622Q4032Q2450P9896P5315O8371N9149M7555L3526
$$ 1837798 1925358 2012487 2098109 2182141 2264591 2344487 2419802 2488173 2547322 2594877 2628403
50714B628403J7532N18j6378l1662m3505n0590n3024n1953m8294m2285l4189k4916
$$ 2628403 2645935 2646453 2630075 2598413 2554908 2504318 2451294 2399341 2351047 2308762 2274573 2249657
50702B249657j5761p794j566K809N404O102M459N5p022j6218k6841l8009m8481
$$ 2249657 2233896 2226102 2224536 2227345 2232749 2238851 2243310 2243365 2236343 2220125 2193284 2155275 2106794
50689B106794n6999o2963o6442o7536o6136o2385n6938n0459m3155l5078k6543
$$ 2106794 2049795 1986832 1920390 1852854 1786718 1724333 1667395 1616936 1573781 1538703 1512160
50678A512160j7894r026M62J0623K0957L0898M0175M8604N5756O1149O4608O6101
$$ 1512160 1494266 1485240 1485702 1496325 1517282 1548180 1588355 1636959 1692715 1753864 1818472 1884573
50666A884573O5334O1940N6279M9641M3313L7653L2402K7678K4104K1971K0798
$$ 1884573 1949907 2011847 2068126 2117767 2161080 2198733 2231135 2258813 2282917 2304888 2325686
50655B325686J9831J8525J6476J3520J0175P605O643P071Q158R618J1762J4958
$$ 2325686 2345517 2364042 2380518 2394038 2404213 2411818 2418461 2425532 2433690 2443308 2455070 2470028
50643B470028J9307K4650L0626L6853M3171M9370N4642N7838N8620N7770N5945
$$ 2470028 2489335 2513985 2544611 2581464 2624635 2674005 2728647 2786485 2845105 2902875 2958820
50632B958820N2733M7620M1257L4908K9096K3654J8539J3009M220j1414l4267
$$ 2958820 3011553 3059173 3100430 3135338 3164434 3188088 3206627 3219636 3223856 3212442 3178175
50621C178175n9657q0828r3487r7227r3736q4955p2664n8571m4081l0079j6978
$$ 3178175 3118518 3037690 2944203 2846976 2753240 2668285 2595621 2537050 2492969 2462890 2445912
50610B445912m829O352J6033K3064K6441K5965K1877J4102K487j2256k8304m3656
$$ 2445912 2441083 2447435 2463468 2486532 2512973 2538938 2560815 2574917 2577404 2565148 2536844 2493188
50598B493188n7124o8372p7376q4041q8192q9743q8839q5888q1415p5844o9517
$$ 2493188 2436064 2367692 2290316 2206275 2118083 2028340 1939501 1853613 1772198 1696354 1626837
50587A626837o2847n6316n0192m4354l8589l3071k8279k4336k0755j7194j4202
$$ 1626837 1563990 1507674 1457482 1413128 1374539 1341468 1313189 1288853 1268098 1250904 1236702
50576A236702j2598j2113j1446r927q344p538o887n196k596l55J109K853N722
$$ 1236702 1224104 1211991 1200545 1190618 1182274 1174736 1167849 1162653 1160057 1159702 1160811 1163664 1169386
50563A169386R174J2345J5359J8827K2717K6568L0450L4871L9845M4810M9394
$$ 1169386 1178560 1190905 1206264 1225091 1247808 1274376 1304826 1339697 1379542 1424352 1473746
50552A473746N3653N7466O0166O1055O0047N7780N5081N2339M9363M6057M3177
$$ 1473746 1527399 1584865 1645031 1706086 1766133 1823913 1878994 1931333 1980696 2026753 2069930
50541B069930M2004M3175M6260N0615N6071O2402O8909P5199Q1939Q9949R8840
$$ 2069930 2111934 2155109 2201369 2251984 2308055 2370457 2439366 2514565 2596504 2686453 2785293
50530B785293J07404J15285J23434J32768J43069J53402J62920J70925J76743
$$ 2785293 2892697 3007982 3131416 3264184 3407253 3560655 3723575 3894500 4071243
50521D071243J79944J80403J77872J71738J61434J46799J27898J04786P7809M7962
$$ 4071243 4251187 4431590 4609462 4781200 4942634 5089433 5217331 5322117 5399926 5447888
50511E447888J6648j4988m6498p7797j08292j36146j58795j74489j83211j85696
$$ 5447888 5464536 5449548 5403050 5325253 5216961 5080815 4922020 4747531 4564320 4378624
50501D378624j81969j71546j54854j33526j08997q1745n2280k2126O785L3111
$$ 4378624 4196655 4025109 3870255 3736729 3627732 3545987 3493707 3471581 3478366 3511477
50491C511477N5803P3246Q3469Q5025P7151N9515L2776n49l6572p1693j03441
$$ 3511477 3567280 3640526 3723995 3809020 3886171 3945686 3978462 3977913 3941341 3869648 3766207
50480C766207j30009j49900j62612j69048j70704j68647j63501j56002j47025
$$ 3766207 3636198 3486298 3323686 3154638 2983934 2815287 2651786 2495784 2348759
50471B348759j37221j26997j16715j06631r6680q6777p7266o8822o1787n5814
$$ 2348759 2211538 2084541 1967826 1861195 1764515 1677738 1600472 1531650 1469863 1414049
50461A414049n0186m4384l8412l2758k7973k4134k0745j7356j4106j1386r113
$$ 1414049 1363863 1319479 1281067 1248309 1220336 1196202 1175457 1158101 1143995 1132609 1123496
50450A123496o784m199j645Q02L545O682R386J0646J0407R424Q076N968K875m33
$$ 1123496 1116712 1112513 1110868 1111670 1115215 1121897 1131283 1141929 1152336 1161760 1169836 1175804 1178679 1178246
50436A178246k631k963j640O54L378O392R761J3415J7001K0157K2857K5336K7640
$$ 1178246 1175615 1172652 1171012 1171666 1175044 1181436 1191197 1204612 1221613 1241770 1264627 1289963 1317603
50423A317603K9601L1285L3204L5835L9153M2847M6867N1443N6675O2362O8246
$$ 1317603 1347204 1378489 1411693 1447528 1486681 1529528 1576395 1627838 1684513 1746875 1815121
50412A815121P4218Q0264Q6299R2003R6779R9973J01391J01381J00271R7762R3230
$$ 1815121 1889339 1969603 2055902 2147905 2244684 2344657 2446048 2547429 2647700 2745462 2838692
50401B838692Q6570P8436O9506N9735M8407L4756J8408n08k1375m3096o4163q2918
$$ 2838692 2925262 3003698 3073204 3132939 3181346 3216102 3234510 3234002 3212627 3169531 3105368 3022450
50389C022450r7965j08518j14427j15812j12833j05910r5923q3852p0200n5161
$$ 3022450 2924485 2815967 2701540 2585728 2472895 2366985 2271062 2187210 2117010 2061849
50379B061849l9316k3778r419L634J5428K5470L2930L7261L7992L4212K5068J1134
$$ 2061849 2022533 1998755 1989336 1992970 2008398 2033868 2066798 2104059 2142051 2176263 2201331 2212465
50367B212465n363k2093l7933n2422o4482p2665p6678p7853p7733p6746p4559
$$ 2212465 2207102 2185009 2147076 2094654 2030172 1957507 1880829 1802976 1725243 1648497 1573938
50356A573938p1272o7607o4132o0808n7369n3738n0019m6266m2470l8623l4774
$$ 1573938 1502666 1435059 1370927 1310119 1252750 1199012 1148993 1102727 1060257 1021634 986860
50345I86860l1042k7464k3794j9718j5414j1690r174p511n793l695j757m90L42
$$ 986860 955818 928354 904560 884842 869428 857738 848564 841053 835260 831565 829808 829318 829660
50332H29660J354K850M647O406P946R426J1251J3583J5895J7202J6691J3944Q827
$$ 829660 831014 833864 838511 844917 852863 862289 873540 887123 903018 920220 936911 950855 959682
50319I59682J900n131j0243j2759j3557j3353j1696q268m347j750o10O82L282
$$ 959682 961582 956451 946208 933449 919892 906539 894843 886575 882228 880478 879868 880550 883832
50306H83832O548Q992R830R271Q009O830O334O578P117P562P903Q306Q948J0028
$$ 883832 890380 899372 909202 918473 926482 933312 939646 946224 953341 960903 968806 977112 986060 996088
50292I96088J1585J3175J4144J4256J3785J3141J2827J3619J5998J9470K3309
$$ 996088 1007673 1020848 1034992 1049248 1063033 1076174 1089001 1102620 1118618 1138088 1161397
50281A161397K8146L5481M4476N0017M5500K8334K644k3294m2157n1016n1359
$$ 1161397 1189543 1225024 1269500 1319517 1365017 1393351 1395995 1372701 1330544 1279528 1228169
50270A228169m6707m0118l3241k6889k1670j7792j4803j2070r434p095n061l139
$$ 1228169 1181462 1141344 1108103 1081214 1059544 1041752 1026949 1014879 1005445 998350 993289 990150
50258I90150j263N61K498M644O578P660P774P498P457P862Q636R666J0900J2416
$$ 990150 988887 989448 991946 996590 1003168 1010828 1018602 1026100 1033557 1041419 1050055 1059721 1070621 1083037
50244A083037J4373J6728J9098K1260K3665K6971L1163L5594L9928M4372M8807
$$ 1083037 1097410 1114138 1133236 1154496 1178161 1205132 1236295 1271889 1311817 1356189 1404996
50233A404996N2272N3649N2595M9438M4574L8459L2008K6537K3113K1989K2524
$$ 1404996 1457268 1510917 1563512 1612950 1657524 1695983 1727991 1754528 1777641 1799630 1822154
50222A822154K3503K3588K1645J6727Q047m508j9742l5466m9765o1748p1007p6850
$$ 1822154 1845657 1869245 1890890 1907617 1915664 1911156 1891414 1855948 1806183 1744435 1673428 1596578
50210A596578p8602p6362p1011o3535n4759m5563l6820k9036k2546j8118j6874
$$ 1596578 1517976 1441614 1370603 1307068 1252309 1206746 1169926 1140890 1118344 1100226 1083352
50199A083352j9199k3918k8808l1956l2671l1415k9165k6699k4225k1652j9025
$$ 1083352 1064153 1040235 1011427 979471 946800 915385 886220 859521 835296 813644 794619
50188G94619j6630j4621j2837j1177r928r447r574r617q996p724o250m992m154
$$ 794619 777989 763368 750531 739354 729426 719979 710405 700788 691792 684068 677818 672826 668672
50175F68672l793l805l884l749l459l267l036k174m06J607K962L704M727O400
$$ 668672 664879 661074 657190 653441 649982 646715 643679 641505 641099 642706 645668 649372 654099 660499
50161F60499P927Q528Q570Q960R764J0236J0146J0228J1200J2946J4866J6445
$$ 660499 668426 676954 685524 694484 704248 714484 724630 734858 746058 759004 773870 790315
50149G90315J7233J6862J5536J4009J2626J0827Q150N237L175K097J253M07K83
$$ 790315 807548 824410 839946 853955 866581 877408 885558 890795 893970 896067 897320 897727 898010
50136H98010J408L349N468P894J1170J5254J9423K3093K6292K9370L2610L6156
$$ 898010 899418 902767 908235 916129 927299 942553 961976 985069 1011361 1040731 1073341 1109497
50124A109497M0183M5031N1229N9195O8733P8870Q8430R6736J03596J08618J10840
$$ 1109497 1149680 1194711 1245940 1305135 1373868 1452738 1541168 1637904 1741500 1850118 1960958
50113A960958J09263J03830R5909Q7850Q1806P8794P8538P9981Q1681Q1708P7650
$$ 1960958 2070221 2174051 2269960 2357810 2439616 2518410 2596948 2676929 2758610 2840318 2917968
50102B917968O7344M9944K6460o61k8464n4415p6946r5466j09881j20077j25850
$$ 2917968 2985312 3035256 3061716 3061055 3032591 2978176 2901230 2805764 2695883 2575806 2449956
50091B449956j27224j24704j19214j11837j03398r4183q4082p3230o2444n2925
$$ 2449956 2322732 2198028 2078814 1966977 1863579 1769396 1685314 1612084 1549640 1496715
50081A496715m5533m0419l7198l5209l3777l2523l1538l0937l0298k8932k6779
$$ 1496715 1451182 1410763 1373565 1338356 1304579 1272056 1240518 1209581 1179283 1150351 1123572
50070A123572k4553k2760k1023j8823j6493j4828j3936j3162j2175j1397j1114
$$ 1123572 1099019 1076259 1055236 1036413 1019920 1005092 991156 977994 965819 954422 943308
50059I43308j0834j0002q874p992p211n842l706j421M32J851L063M114N015N872
$$ 943308 932474 922472 913598 905606 898395 892553 888847 887426 887858 889709 892772 896886 901901 907773
50045I07773O644P122P302P475P679P509O687N457M077K451O54o31q48m11j27
$$ 907773 914417 921539 928841 936316 943995 951504 958191 963648 967725 970176 970830 970199 969351 968940 968813
50030I68813p0K85R40J300J225J227J463J395Q24M10N80O78Lr07q27N03K154L243
$$ 968813 968743 969028 969968 971268 972493 973720 975183 976578 977402 977812 978392 979070 979073 978166 977339 977842 979996 983239
50012I83239L668L690L461L237L538M803P190J0592J4613J8670K2598K7154L3411
$$ 983239 986907 990597 994058 997295 1000833 1005636 1012826 1023418 1038031 1056701 1079299 1106453 1139864
49999A139864M1549N0575N9283O6966P3182P7312P8648P6690P1306O3170N4074
$$ 1139864 1181413 1231988 1291271 1358237 1431419 1508731 1587379 1664069 1735375 1798545 1852619
49988A852619M6318M1336L9019L8341L8005L6277L0895J9969L148j8164m1467
$$ 1852619 1898937 1940273 1979292 2017633 2055638 2091915 2122810 2142779 2145927 2127763 2086296
49977B086296o3926q3091r7493j06628j10246j08213j01397r2054q2453p3296
$$ 2086296 2022370 1939279 1841786 1735158 1624912 1516699 1415302 1323248 1240795 1167499
49967A167499o4176n5355m8086m2925l8720l3973k8648k3930k0518j7834j5038
$$ 1167499 1103323 1047968 999882 956957 918237 884264 855616 831686 811168 793334 778296
49956G78296j2046r284o816m157r56K393N010O365O870P567R157J1309J2867J2788
$$ 778296 766250 756966 750150 745993 745037 747430 752440 758805 765675 773242 782399 793708 806575 819363
49942H19363J0917P981M920K255M5j690k773l247l823n612r201j4040j8852k2494
$$ 819363 830280 838261 843181 845436 845481 843791 841018 837771 833948 828336 819135 805095 786243 763749
49928G63749k4359k4227k2233j9043j5688j2933j0860r148p565n976m197k201
$$ 763749 739390 715163 692930 673887 658199 645266 634406 625258 617693 611717 607520 605319
49916F05319l77P79J242J404J435J163P04O87J556K917M119N156O470P952Q846
$$ 605319 604942 605721 606963 608367 609802 610965 611669 612356 613912 616829 620948 626104 632574 640526 649372
$$ [...]
##END NTUPLES=NMR SPECTRUM
##END=
