
##TITLE=AC1372_2418_7221647_llQExT8r8K
##JCAMPDX= 6.0         $$ Bruker NMR JCAMP-DX V2.0
##DATA TYPE= NMR SPECTRUM
##DATA CLASS= NTUPLES
##ORIGIN= BRUKER
##OWNER= Administrator
$$ 1.72 TOPSPIN		Version 2.1
$$ 2012-12-17 16:38:40.049 -0500  Administrator@X
$$ Compression mode = diff/dup
##.OBSERVE FREQUENCY= 400.02188249412
##.OBSERVE NUCLEUS= ^1H
##.ACQUISITION MODE= SIMULTANEOUS (DQD)
##.ACQUISITION SCHEME= undefined
##.AVERAGES= 8
##.DIGITISER RES= 22
##SPECTROMETER/DATA SYSTEM= spect
##.PULSE SEQUENCE= zg30
##.SOLVENT NAME= COFFEE_meoh
##.SHIFT REFERENCE= INTERNAL, COFFEE_meoh, 1, 14.98509
##AUDIT TRAIL= $$ (NUMBER, WHEN, WHO, WHERE, PROCESS, VERSION, WHAT)
$$ ##TITLE= Audit trail, TOPSPIN		Version 2.1
$$ ##JCAMPDX= 5.01
$$ ##ORIGIN= Bruker BioSpin GmbH
$$ ##OWNER= Administrator
$$ $$ E:\/data/COFFEE/nmr/AC1372_2418_7221647_llQExT8r8K/40/pdata/1/auditp.txt
$$ ##AUDIT TRAIL=  $$ (NUMBER, WHEN, WHO, WHERE, PROCESS, VERSION, WHAT)
(   1,<2012-12-17 16:38:31.752 -0500>,<Administrator>,<X>,<go>,<TOPSPIN 2.1>,
      <created by zg
	started at 2012-12-17 16:37:25.095 -0500,
	POWCHK enabled, PULCHK disabled,
       configuration hash MD5:
       86 BA 57 50 F2 9D 5C 9B 26 00 A9 28 5F 66 2E 89
       data hash MD5: 64K
       75 C9 37 F0 23 D6 3D 4B EC DD 2B DB DB 7B 86 FE>)
(   2,<2012-12-17 16:38:34.955 -0500>,<Administrator>,<X>,<proc1d>,<TOPSPIN 2.1>,
      <Start of raw data processing
       efp LB = 0 FT_mod = 6 PKNL = 1 PHC0 = 0 PHC1 = 0 SI = 32K 
       data hash MD5: 32K
       49 8C 69 46 85 0F 7D 65 96 1E 84 BF 60 2A 2D 0E>)
(   3,<2012-12-17 16:38:35.408 -0500>,<Administrator>,<X>,<proc1d>,<TOPSPIN 2.1>,
      <pk PHC0 = 92.59277 PHC1 = 0 
       data hash MD5: 32K
       BE 70 AF 94 1A 2A 2F 79 EB 45 2A 9B 99 89 88 DB>)
(   4,<2012-12-17 16:38:35.627 -0500>,<Administrator>,<X>,<proc1d>,<TOPSPIN 2.1>,
      <abs ABSG = 1 
       data hash MD5: 32K
       B8 7E 5D 34 6A 7C C8 A8 AA 1A EF 1B 64 A7 AA 30>)
(   5,<2012-12-17 16:38:35.767 -0500>,<Administrator>,<X>,<proc1d>,<TOPSPIN 2.1>,
      <abs ABSG = 2 
       data hash MD5: 32K
       24 0B 32 00 A7 AD AA 1E 83 BB 73 23 AF 91 7E 9E>)
(   6,<2012-12-17 16:38:35.908 -0500>,<Administrator>,<X>,<proc1d>,<TOPSPIN 2.1>,
      <abs ABSG = 3 
       data hash MD5: 32K
       5C 91 F3 98 11 F7 EE 51 A0 15 96 D6 B3 16 B8 FE>)
(   7,<2012-12-17 16:38:36.049 -0500>,<Administrator>,<X>,<proc1d>,<TOPSPIN 2.1>,
      <abs ABSG = 4 
       data hash MD5: 32K
       06 B3 AC 24 0B AC DB 00 D4 35 56 1F FF 3B 7A B1>)
(   8,<2012-12-17 16:38:36.205 -0500>,<Administrator>,<X>,<proc1d>,<TOPSPIN 2.1>,
      <abs ABSG = 5 
       data hash MD5: 32K
       C6 63 34 3F AC 85 F8 47 DE 0E CA 21 37 EF 61 4A>)
$$ ##END=
$$ 
$$ $$ hash MD5
$$ $$ B6 C4 57 A0 DD A2 12 DF D3 0A F5 5A E0 73 3A 8A
##$RELAX= 
##$RELAX= 
##$RELAX= 
##$RELAX= 
##$RELAX= 
##$RELAX= 
##$RELAX= 
$$ Bruker specific parameters
$$ --------------------------
##$DU= <E:\>
##$EXPNO= 40
##$NAME= <AC1372_2418_7221647_llQExT8r8K>
##$PROCNO= 1
$$ [...]
150 150 150 150 150 150 150 150
##$TP07= 0
##$TPNAME0= <>
##$TPNAME1= <>
##$TPNAME2= <>
##$TPNAME3= <>
##$TPNAME4= <>
##$TPNAME5= <>
##$TPNAME6= <>
##$TPNAME7= <>
##$TPOAL= (0..7)
0.5 0.5 0.5 0.5 0.5 0.5 0.5 0.5
##$TPOFFS= (0..7)
0 0 0 0 0 0 0 0
##$TUNHIN= 0
##$TUNHOUT= 0
##$TUNXOUT= 0
##$USERA1= <user>
##$USERA2= <user>
##$USERA3= <user>
##$USERA4= <user>
##$USERA5= <user>
##$V9= 5
##$VALIST= <valist>
##$VCLIST= <CCCCCCCCCCCCCCC>
##$VD= 0
##$VDLIST= <DDDDDDDDDDDDDDD>
##$VPLIST= <PPPPPPPPPPPPPPP>
##$VTLIST= <TTTTTTTTTTTTTTT>
##$WBST= 2048
##$WBSW= 25
##$XGAIN= (0..3)
0 0 0 0
##$XL= 0
##$YL= 0
##$YMAX_a= 572330
##$YMIN_a= -490260
##$ZGOPTNS= <>
##$ZL1= 120
##$ZL2= 120
##$ZL3= 120
##$ZL4= 120
##$ABSF1= 14.98509
##$ABSF2= -5.573092
##$ABSG= 5
##$ABSL= 3
##$ALPHA= 0
##$AQORDER= 0
##$ASSFAC= 0
##$ASSFACI= 0
##$ASSFACX= 0
##$ASSWID= 0
##$AUNMP= <proc_prof1d_extract_pilot.lims>
##$AXLEFT= 0
##$AXNAME= <>
##$AXNUC= <1H>
##$AXRIGHT= 0
##$AXTYPE= 0
##$AXUNIT= <>
##$AZFE= 0.1
##$AZFW= 0.1
##$BCFW= 0
##$BC_mod= 0
##$BYTORDP= 0
##$COROFFS= 0
##$CY= 15
##$DATMOD= 1
##$DC= 0
##$DFILT= <>
##$DTYPP= 0
##$F1P= 0
##$F2P= 0
##$FCOR= 0.5
##$FTSIZE= 32768
##$FT_mod= 6
##$GAMMA= 0
##$GB= 0
##$INTBC= 1
##$INTSCL= 1
##$ISEN= 128
##$LB= 0
##$LEV0= 0
##$LPBIN= 0
##$MAXI= 10000
##$MC2= 0
##$MEAN= 0
##$ME_mod= 0
##$MI= 0
##$NCOEF= 0
##$NC_proc= -8
##$NLEV= 6
##$NOISF1= 0
##$NOISF2= 0
##$NSP= 0
##$NTH_PI= 0
##$NZP= 0
##$OFFSET= 14.98509
##$PC= 1
##$PHC0= 92.59277
##$PHC1= 0
##$PH_mod= 1
##$PKNL= yes
##$PPARMOD= 0
##$PPDIAG= 0
##$PPIPTYP= 0
##$PPMPNUM= 2147483647
##$PPRESOL= 1
##$PSCAL= 4
##$PSIGN= 0
##$PYNMP= <proc.py>
##$REVERSE= no
##$SF= 400.02
##$SI= 32768
##$SIGF1= 0
##$SIGF2= 0
##$SINO= 400
##$SIOLD= 32768
##$SPECTYP= <>
##$SREGLST= <1H.CDCl3>
##$SSB= 0
##$STSI= 32768
##$STSR= 0
##$SW_p= 8223.68421052631
##$SYMM= 0
##$S_DEV= 0
##$TDeff= 65536
##$TDoff= 0
##$TI= <>
##$TILT= no
##$TM1= 0
##$TM2= 0
##$TOPLEV= 0
##$USERP1= <user>
##$USERP2= <user>
##$USERP3= <user>
##$USERP4= <user>
##$USERP5= <user>
##$WDW= 1
##$XDIM= 32768
##$YMAX_p= 448767284
##$YMIN_p= -1392605
##$CURPLOT= <Network HP LaserJet P1505>
##$CURPRIN= <$Network HP LaserJet P1505>
##$DFORMAT= <normdp>
##$LAYOUT= <+/1D_H.xwp>
##$LFORMAT= <normlp>
##$PFORMAT= <normpl>
##$SURQMSG= 1
$$ End of Bruker specific parameters
$$ ---------------------------------
##NTUPLES= NMR SPECTRUM
##VAR_NAME=  FREQUENCY,     SPECTRUM/REAL,   SPECTRUM/IMAG
##SYMBOL=    X,             R,               I
##VAR_TYPE=  INDEPENDENT,   DEPENDENT,       DEPENDENT
##VAR_FORM=  AFFN,          ASDF,            ASDF
##VAR_DIM=   32768,         32768,           32768
##UNITS=     HZ,            ARBITRARY UNITS, ARBITRARY UNITS
##FACTOR=    0.250966925370066, 1,           1
##FIRST=     8223.43324360094, -138332,      -131198
##LAST=      0,             -62246,          -172339
##MIN=       0,             -1392605,        0
##MAX=       8223.43324360094, 448767284,    0
$$ Real data points
##PAGE= N=1
##DATA TABLE= (X++(R..R)), XYDATA
$$ [...]
$$ plain form
19567 -113828 -272674 -189288 -316533 -13367 -172552 35418 -374098 -247718 -435118 30452
19556 -325497 65445 -112799 169298 -186608 111794 716 -85110 -74776 3937 7408 -241271
19544 296927 -138237 -405539 38776 34423 -106119 20162 21807 -105866 -149580 -32562 116350
19532 -445167 -39333 -38053 185512 -207780 100487 -130549 -241916 177468 -200623 -93624
19521 -113029 136137 -4093 59074 -148710 93745 94447 51910 -40330 -104236 -29247 136867
19509 -8845 73157 -126086 59677 115436 -469642 -85211 -215905 -75513 40899 -465999 -41763
19497 9829 -73468 -432374 4219 75034 -242800 -241331 -83441 -369818 -59954 -198022 -15478
19485 -162959 -44280 -238284 103319 -128690 -194853 -239089 248970 -101202 -108777 168768
$$ packed form
19567a13828j58846Q3386j27245a3367j59185C5418c74098J26380j87400C0452
19556c25497F5445a12799A69298a86608A11794G16h5110J0334C937L471b41271
19544B96927a38237k67302C8776m353a06119B0162J645a05866m3714c2562A16350
19532d45167c9333J280A85512b07780A00487a30549j11367A77468b00623i3624
19521a13029A36137d093E9074a48710I3745P02m2537d0330o3906b9247A36867
19509h845G3157a26086E9677N5759d69642h5211j30694g5513D0899d65999d1763
19497I829g3468l58906D219P0815b42800J469h3441k86377e9954j38068a5478
19485a62959d4280j94004A03319a28690o6163m4236B48970a01202p575A68768
$$ plain form
19474 -161468 -87530 -225137 131347 206074 52138 295452 97620 -318289 -17081 180834
19463 -98853 -160116 99290 -8489 29197 -108712 200167 -160715 99099 -74135 -237202 -52448
19451 -251553 -223704 124912 27956 -177887 261511 -3238 85472 -224280 -145549 198043 -242431
19439 272261 -337855 -88726 -120626 281220 -16174 226698 81864 -174146 129028 -16117
19428 219981 -444556 68971 104012 57481 -281095 7961 -17 -91961 11714 150823 -33475 200517
19415 -37415 11476 28992 83248 69957 -263591 182271 175069 -292203 -133973 -355612 28291
19403 89460 207309 -210841 250009 -28693 200829 -107839 -399463 -436077 -20933 -80200
19393 -80200 81868 -161062 -182828 57484 215579 -110704 19961 300203 -34574 -48197 -302485
$$ packed form
19474a61468P3938j37607A31347P4727E2138K43314I7620c18289a7081A80834
19463i8853o1263I9290h489B9197a08712B00167a60715I9099g4135j63067e2448
19451b51553K7849A24912B7956a77887B61511c238H5472b24280P8731A98043b42431
19439B72261c37855h8726l1900B81220a6174B26698H1864a74146A29028a6117
19428B19981d44556F8971L5041m6531b81095G961a7r1944A1714J39109c3475B00517
19415c7415A1476J7516N4256j3291b63591A82271p202b92203a33973k21639B8291
19403H9460J17849b10841B50009b8693B00829a07839k91624l6614b0933n9267
19393h0200H1868a61062k1766E7484J58095a10704A9961K80242c4574j3623k54288
$$ plain form
19382 -302485 -363111 15787 -185745 226411 -54574 -186042 -169859 -90036 112920 -69035 117198
19370 -13083 -54663 -213791 2806 2820 171528 95918 -88675 233054 101271 19094 -236979
19358 -197141 56263 -200674 -338503 8655 222262 -172262 -298121 -33616 288127 27243
19347 272282 -3706 73927 -211116 -7653 -60296 -6765 133562 -91806 -256996 37382 -361909
19335 38377 134134 -59149 -144055 -13369 -63272 -159858 -205277 -196376 262702 -332936 -197544
19324 -197544 -163864 -135442 -4816 -106567 297188 11225 -52716 -124220 -214142 -466811 50093
19312 -110557 195846 173426 185937 -32265 71235 -338744 2477 110529 -126779 -116941 38117
19300 140075 -37251 124639 -427826 81658 -161413 156126 -24722 4276 -31149 200619 -72061
$$ packed form
19382c02485o0626A5787a85745B26411e4574j31468J6183P9823A12920f9035A17198
19370a3083m1580j59128B806J4J68708p5610h8675B33054A01271A9094b36979
19358a97141E6263b00674j37829H655K13607a72262j25859c3616B88127B7243
19347B72282c706G3927b11116g653n2643f765A33562i1806j65190C7382c61909
19335C8377R5757e9149q4906a3369m9903r6586m5419Q901B62702c32936J35392
19324a97544L3680K8422d816j01751B97188A1225e2716p1504q9922k52669E0093
19312a10557A95846k2420J2511c2265G1235c38744B477J08052a26779R838C8117
19300A40075c7251A24639d27826H1658a61413A56126b4722D276c1149B00619g2061
$$ plain form
19288 -265029 244782 -43379 -319789 114681 286706 257244 68147 112718 -293965 -82235
19277 -290769 -119138 19975 -247562 -16983 106559 30996 -336780 -260226 -296053 103905
19266 311216 40110 -261755 -98748 -22168 29781 -86017 -359830 -64237 -124465 -77121 91692
19254 62204 -147013 99985 -32727 216481 -153190 -90695 122008 -68221 129282 109441 69735
19243 69735 -365538 -132059 85473 -159096 -116656 -74235 99482 -92447 -379499 -255024 330822
19231 -36339 -144848 6291 -178947 33659 -113361 17338 -188969 -278033 -30711 15708 -99918
19219 14812 -179234 74536 80258 -103782 124569 166914 212496 -32656 -56978 -316119 -26487
19207 -60578 244173 -186673 -191916 277434 -243760 93295 213534 58056 -325189 196184
$$ packed form
19288b65029B44782d3379k76410A14681J72025k9462F8147M4571b93965h2235
19277b90769a19138A9975b47562a6983A06559C0996c36780P6554l5827A03905
19266C11216D0110b61755i8748b2168B9781h6017k73813f4237o0228M7344I1692
19254F2204a47013I9985c2727B16481a53190O2495A22008f8221A29282j9841l9706
19243F9735c65538a32059H5473a59096M2440M2421I9482i2447k87052J24475C30822
19231c6339j08509F291a78947C3659a13361A7338a88969q9064c0711A5708i9918
19219A4812a79234G4536N722a03782A24569M2345M5582c2656k4322k59141b6487
19207f0578B44173a86673n243B77434b43760I3295J20239E8056c25189A96184
$$ plain form
19196 -474331 -284913 62762 83460 183306 176124 103847 -12746 170361 -271013 7816 -197156
19184 -68557 -187111 -199264 51533 -28760 10417 53655 256115 84543 -257267 146431 -389100
19172 3931 -102571 35588 -427739 -101301 211399 -83314 560962 -200759 -216593 -29708 20202
19160 137035 -72160 -218995 96289 -171885 -206045 20619 427131 249 -59346 156353 79167
19149 79167 -71701 -43150 -19389 101847 -137657 -73124 -87143 491021 -314890 -163662 3860
19137 -82310 55963 -218190 205907 -51264 -191905 -48215 -87582 7673 -132303 14182 155892
19126 155892 168650 57868 -323394 39586 -168107 -211523 -65746 -109288 -52684 -229820 -41767
19114 194981 249547 204186 -127669 149094 -38840 -260292 -204195 1075 -314074 33559 217624
$$ packed form
19196d74331J89418F2762K0698R9846p182p2277a2746A70361b71013G816a97156
19184f8557j18554j2153E1533b8760A0417M3238K02460H4543b57267A46431c89100
19172C931a02571C5588d27739a01301B11399h3314E60962b00759j5834b9708B0202
19160A37035g2160j46835I6289a71885l4160B0619M06512B49e9346A56353p7186
19149G9167g1701K8551a9389A01847a37657O4533j4019D91021c14890J51228C860
19137h2310E5963b18190B05907e1264j40641d8215l9367G673a32303A4182J41710
19126A55892J2758E7868c23394C9586a68107m3416f5746m3542e2684j77136d1767
19114A94981N4566m5361a27669A49094c8840k21452N6097A075c14074C3559J84065
$$ plain form
19103 217624 -36278 148999 13210 -135815 -18856 -88262 13511 -182652 -81252 388729 14762
19091 -50681 -71760 239584 -328075 79390 -38094 -289661 -90502 -258849 29247 -17018 18054
19079 -427077 -187666 60002 18302 -159467 -92808 92902 439543 -9617 475962 38105 -149117
19067 253858 35964 274767 77821 28790 -180185 -185496 -346625 -341194 98532 -166577 -30785
19055 -64215 104435 38205 82560 -339559 9664 -94501 139091 -122163 154244 -147439 -115799
19044 -115799 -234041 -239858 112637 -366736 268998 -10075 331918 -75753 367304 -55475
19033 -11756 -9537 240414 -150815 -108457 -61759 147192 188710 83156 357959 266717 20118
19021 155994 -169530 13437 -14820 240424 -7836 -43268 -136404 45321 -17330 -79879 173103
$$ packed form
19103B17624c6278A48999A3210a35815a8856o9406A3511a82652h1252C88729A4762
19091e0681k1079B39584c28075G9390c8094k51567i0502j68347B9247a7018A8054
19079d27077a87666F0002A8302a59467O6659I2902L46641i617D75962C8105a49117
19067B53858C5964K38803G7821B8790a80185n311j61129N431I8532a66577c0785
19055f4215A04435C8205M4355c39559I664i4501A39091a22163A54244a47439L1640
19044a15799j18242n817A12637c66736B68998a0075C31918g5753C67304e5475
19033a1756K219B40414a50815M2358M6698A47192M1518H3156K74803r1242B0118
19021A55994a69530A3437a4820B40424g836l5432r3136D5321a7330o2549A73103
$$ plain form
19009 -505101 -237194 162988 -292399 -288146 -62613 96660 298641 -226180 -95884 -590150
18999 -590150 -215830 -57264 -42037 254492 -340431 419027 98030 167155 -117522 234623
18988 183798 69564 -541735 -179680 -2980 112709 -12337 -82399 -225485 -117379 -24060 23465
18976 225026 -239280 183550 120775 27203 -142244 175895 -136934 -41972 21556 -8316 -82232
18965 -82232 67536 65252 -94510 163987 145591 -28924 166428 35982 307761 -97050 -82198
18954 -82198 433806 -180652 -124570 -97812 208804 -11523 -71605 -268562 76841 -30694 102597
18942 -119402 137043 65339 -50602 112581 -310221 -178171 -353204 -188290 121706 -312839
18931 228091 -87321 16942 -331664 -33799 55732 -171718 -395279 -108575 90739 293293
$$ packed form
19009e05101b37194A62988b92399M253f2613I6660K01981b26180i5884m94266
18999e90150b15830e7264J5227B54492c40431D19027I8030O9125a17522B34623
18988A83798F9564e41735a79680b980A12709a2337p0062j43086J08106b4060B3465
18976B25026b39280A83550o2775B7203a42244A75895a36934d1972B1556h316p3916
18965h2232F7536k284i4510A63987j8396b8924A66428C5982K71779i7050J4852
18954h2198D33806a80652N6082K6758B08804a1523o0082j96957G6841c0694A02597
18942a19402A37043F5339e0602A12581c10221J32050j75033J64914A21706c12839
18931B28091h7321A6942c31664c3799E5732a71718k23561a08575I0739K02554
$$ plain form
18921 293293 70682 -137423 67529 -282774 -194502 -52883 159973 120621 184968 -111442 -392263
18910 -392263 -203161 29229 -23061 -123140 -60812 -239634 63897 -106314 -182295 171812
18899 272459 216157 -110454 264690 -121647 26346 163229 18366 178195 -29842 -163209
18889 -163209 22581 -197212 100535 177576 -62141 -67261 28679 -24664 -227783 204329 -144083
18877 -131988 -278308 368323 -16370 -151144 -165139 -52334 86462 -374147 -415734 217803
18866 57820 945 -266734 144898 -78012 248793 -62154 -259167 -437708 -207451 -177055 -86494
18854 15446 246069 -136351 55751 -203088 -78916 -84628 9341 -111866 -525218 -360925 336986
18842 4678 -132466 42860 47267 -184171 -248493 76421 -122565 271205 -118588 67347 112359
$$ packed form
18921B93293G0682a37423F7529b82774Q8272e2883A59973l9352O4347a11442k80821
18910c92263J89102B9229b3061j00079f0812j78822F3897a06314p5981A71812
18899B72459n6302a10454B64690a21647B6346J36883A8366J59829b9842j33367
18889a63209B2581a97212A00535P7041f2141n120B8679b4664k03119B04329a44083
18877a31988j46320C68323a6370j34774j3995e2334H6462c74147m1587B17803
18866E7820I45b66734A44898g8012B48793f2154j97013j78541b07451L0396h6494
18854A5446K30623a36351E5751b03088g8916n712I341a11866m13352J64293C36986
18842D678a32466D2860M407a84171o4322G6421a22565B71205a18588F7347M5012
$$ plain form
18831 112359 -126530 -216708 283278 -240184 -259033 -156050 -200645 -27247 213712 -97039
18820 -9279 82785 -159762 16869 -76823 -84394 -101264 73805 58190 -30476 99345 26438 126721
18808 126721 140808 -394374 179795 -35305 288604 42629 -2778 -193230 149851 -68986 306516
18796 11552 -289560 34574 -64235 -103566 16213 -28572 92917 -168540 266769 -150051 -252087
18785 -252087 140292 -376363 110334 252658 342152 117589 -71710 -238627 -61800 97763
18774 120599 72641 -30440 286111 147671 -188950 178879 -346716 -353407 -157544 -9384 -183479
18763 -183479 -43813 -158317 -40033 -29922 -261709 -109285 -133512 -22695 -25444 55146 -229350
18751 1829 -81185 -44528 103050 -221257 -64962 -87988 -299096 -93011 135872 -115559 10327
$$ packed form
18831A12359a26530r0178B83278b40184j8849J02983m4595b7247B13712i7039
18820i279H2785a59762A6869g6823p571j6870G3805j5615c0476I9345B6438J00283
18808A26721J4087c94374A79795c5305B88604D2629b778j90452A49851f8986C06516
18796A1552b89560C4574f4235l9331A6213b8572I2917a68540B66769a50051j02036
18785b52087A40292c76363A10334J42324Q9494A17589g1710j66917f1800I7763
18774A20599m7958c0440B86111j38440a88950A78879c46716o691a57544i384j74095
18763a83479d3813j14504d0033J0111k31787a09285k4227b2695k749E5146b29350
18751A829h1185L6657A03050b21257f4962k3026k11108i3011A35872a15559A0327
$$ plain form
18739 -327817 189299 203681 -128854 -125272 -132264 77147 211739 131363 4013 -27303 -316690
18728 -316690 -269099 8324 -109839 -124138 -5835 -44998 151782 238284 -336066 -19960 -364857
18717 -364857 60463 -3307 266844 238842 161182 -25319 -10767 -216046 62503 61042 396629
18706 396629 390453 -132067 228107 -210157 -499804 -215288 -2217 -74744 -75386 -164414 -36383
18694 306415 97357 -65991 -215389 159109 190992 15431 91647 -136041 -26392 4239 5329
18683 5329 -151341 -281797 -162827 -221032 -5974 -213935 1493 -91311 -166197 -56788 -301463
18672 -301463 -91624 -164103 -373098 105782 -9515 -364822 -68544 -170046 222097 40844 -171175
18660 9017 -357958 -14783 59526 -303671 144490 -20944 -73913 -9984 -430187 -19053 14341
$$ packed form
18739c27817A89299J4382a28854L582o992G7147J34592q0376D013b7303k89387
18728c16690M7591H324a09839j4299e835l9163A51782Q6502c36066a9960l44897
18717c64857F0463c307B66844k8002p7660b5319a0767k05279F2503j461L35587
18706C96629o176a32067B28107b10157k89647b15288b217p2527o42q9028c6383
18694C06415I7357f5991j49398A59109L1883A5431P6216a36041b6392D239J090
18683E329a51341j30456J18970n8205e974k07961A493i1311p4886e6788k44675
18672c01463i1624p2479k08995A05782i515l55307f8544j01502B22097D0844a71175
18660I017c57958a4783E9526c03671A44490b0944n2969i984m20203a9053A4341
$$ plain form
18648 -72811 207014 87448 -44256 -251215 73534 -343642 8769 -7991 1615 -198920 -153092
18637 -153092 -38716 139567 -507715 157086 -179579 169826 -149824 188462 497004 -135969
18626 -172399 59080 -2593 -242121 -142093 -170297 57342 -79960 -239241 -239549 -159699 54735
18614 39485 -140121 -322291 98097 -21195 4341 3714 30888 -183124 -35799 -61732 -276825
18603 -276825 -208541 -167840 -67155 18529 -182709 -557507 -125841 -165860 -176534 125859 -240616
18591 -65094 -161114 50484 -93405 15221 -127080 168580 171054 -206779 204303 85118 -15733
18579 100169 -243901 -59979 58327 -187287 -125578 -220624 -225304 -146027 -23201 -344708 46318
18567 -271040 -342451 -354185 -112499 18217 -3500 -16902 80934 50139 71565 124228 81607
$$ packed form
18648g2811B07014H7448d4256k06959G3534c43642H769g991A615a98920M5828
18637a53092c8716A39567e07715A57086a79579A69826a49824A88462L08542a35969
18626a72399E9080b593k39528J00028k8204E7342g9960j59281l08P9850E4735
18614C9485a40121j82170I8097b1195D341o27K7174a83124c5799k5933k15093
18603b76825O8284M0701f7155A8529a82709l74798a25841m0019j0674A25859b40616
18591f5094r6020E0484i3405A5221a27080A68580K474b06779B04303H5118a5733
18579A00169b43901e9979E8327a87287O1709r5046m680P9277b3201l21507D6318
18567b71040p1411j1734a12499A8217c500j3402H0934l0795K1426N2663m2621
$$ plain form
18556 81607 -610417 -70750 -75716 -113 -208983 2217 -143453 84868 64159 -306348 -5482 229946
18543 -83810 -180457 155501 -191739 -131511 -246536 106278 132593 -210847 -132989 -209784 81777
18531 607 -138465 -103330 -237118 -203098 -129092 57916 122461 -317029 -124789 -379851 -287008
18520 -287008 -231459 183918 -36606 -60577 -235637 -246110 61836 80678 28760 -144640 242084
18508 435400 -236377 -156705 -169725 -224710 -260150 300885 -97311 -50976 48876 -125919 138608
18496 -77937 44956 -17914 17344 -55972 -28531 -160629 -212606 -47942 -252358 152963 -192265
18484 -138311 -148790 196561 -96737 -82915 -31781 185859 -366149 20902 -137629 81500 -31554
18472 -89474 -146036 -117525 -73992 -153237 -113053 150697 -111931 -438402 475312 -62735 225246
$$ packed form
18556H1607f10417g0750m966a13k08870B217a43453H4868k0709c06348e482B29946
18543h3810r6647A55501a91739O0228j15025A06278K6315b10847P7858p6795H1777
18531F07a38465L5135j33788L4020P4006E7916O4545c17029a24789k55062R2843
18520b87008N5549A83918c6606k3971j75060j0473F1836J8842B8760a44640B42084
18508D35400b36377P9672j3020n4985l5440C00885i7311M6335D8876a25919A38608
18496g7937D4956a7914A7344e5972K7441j32098n1977d7942k04416A52963a92265
18484a38311j0479A96561i6737J3822c1781A85859c66149B0902a37629H1500c1554
18472h9474n6562K8511M3533p9245M0184A50697a11931l26471D75312f2735B25246
$$ plain form
18460 -60899 56539 -264411 -232494 -262369 173350 82339 -52453 -77466 133242 -87371 17868
18448 -53237 -76890 153969 -28519 216837 31263 78735 -80220 -312693 45491 -268981 -56108
18436 -124519 223599 -111504 -163764 -144904 144468 24582 -3760 -26053 26681 127320 214773
18425 214773 -7424 -1658 64432 -177558 -7482 60393 39944 -138718 -312977 -253205 -235258
18414 -235258 130523 -255829 56726 -245492 11855 -147231 -67320 -14551 -190031 -89562
18403 116635 73649 164053 -30398 -76194 74219 -53974 -3568 -232567 -374599 -244445 152950
18391 115933 -151506 308041 -74404 -280369 42471 -364174 -278858 70369 246719 -187719
18380 -177617 -351954 -133704 58963 47374 -34751 -91382 -127641 31054 25348 -91323 -384311
$$ packed form
18460f0899E6539b64411L1917k9875A73350H2339e2453k5013A33242h7371A7868
18448e3237k3653A53969b8519B16837C1263M7472h0220k32473D5491b68981e6108
18436a24519B23599a11504n2260J8860A44468B4582c760k2293B6681J00639Q7453
18425B14773g424a658F4432a77558g482F0393k0449a38718j74259N9772J7947
18414b35258A30523b55829E6726b45492A1855a47231f7320a4551j75480h9562
18403A16635m2986R0404c0398m5796G4219e3974c568k28999j42032J30154A52950
18391A15933a51506C08041g4404k05965D2471c64174Q5316G0369J76350a87719
18380a77617j74337a33704E8963j1589c4751n6631l6259C1054n706i1323k92988
$$ plain form
18369 -384311 143668 -94462 -38198 -315966 103007 -26507 -125903 172713 28153 236940
18359 236940 80373 -298429 -93850 -10783 -158588 48809 -33778 -40756 -580656 -337982 -105232
18347 68024 168544 -21158 237988 70988 -286134 160336 90340 -305621 -7448 -42669 34362
18335 -220552 39482 128957 97688 68658 -149341 82346 9766 -188253 -415243 -101886 342247
18323 -310592 -384329 -9668 78066 -50073 -74764 -37131 -184771 -266746 9663 -11788 51905 -130411
18310 106996 -30358 -52303 -133909 -392988 -175562 -270654 21130 -67118 88649 110765 131314
18299 131314 -98667 46498 151281 -176302 -132240 25586 -58573 -175521 103583 -357615
18288 7458 -169956 -156628 -171485 -130507 -47356 -210842 -298394 -159473 -215626 -169090 -114622
$$ packed form
18369c84311A43668i4462c8198k77768A03007b6507r9396A72713B8153K08787
18359B36940H0373b98429i3850a0783j47805D8809c3778o978n39900K42674a05232
18347F8024J00520b1158B37988G0988b86134A60336o9996c05621g448l5221C4362
18335b20552C9482Q9475l1269k9030a49341H2346I766a88253k26990a01886C42247
18323c10592p3737i668G8066e0073k4691c7131j47640q1975I663a1788E1905a30411
18310A06996c0358k1945q1606k59079a75562r5092B1130f7118H8649K2116K0549
18299A31314i8667D6498J04783a76302M4062B5586e8573j16948A03583c57615
18288G458a69956J3328j4857M0978d7356j63486q7552J38921n6153M6536N4468
$$ plain form
18277 -114622 -32352 -450809 34099 193236 113493 -91985 -53838 -2142 197267 126996 102436
18266 102436 307567 -146424 3413 -222662 54087 103067 -137114 -38166 -77329 230649 -19663
18254 284092 10707 425361 8016 23079 -54185 142085 -173164 -137634 60467 358669 151391
18242 -44084 -109482 261206 -203558 -149830 -87943 -123770 124876 -9579 143251 72617 -119518
18230 -13040 -127022 148941 -154283 -28300 -151959 -336247 -336586 30741 75457 -260860 79748
18218 91610 -58818 67503 11725 -333465 342079 -242380 110874 -205995 -3095 -336429 -105271
18206 -245853 -282663 92838 -353976 143310 -129237 128311 -333922 -47933 295044 71614
18195 -103488 -273689 146685 -45113 -26780 343361 33267 186212 42602 -75623 73854 414124
$$ packed form
18277a14622c2352m18457C4099J59137p9743i1985L8147b142A97267p0271k4560
18266A02436K05131a46424C413b22662E4087M8980a37114c8166l9163B30649a9663
18254B84092A0707M14654H016J5063e4185A42085a73164L5530F0467K98202A51391
18242d4084o5398B61206b03558N3728O1887l5827A24876i579A43251p0634a19518
18230a3040j13982A48941a54283b8300j23659j84288l39C0741M4716b60860G9748
18218I1610e8818F7503A1725c33465C42079b42380A10874b05995c095l33334a05271
18206b45853l6810I2838c53976A43310a29237A28311c33922d7933B95044G1614
18195a03488j70201A46685d5113J8333C43361C3267J52945D2602g5623G3854L40270
$$ plain form
18184 414124 104560 352007 -37519 156119 -226536 -35642 -30447 -171610 50100 -493196
18173 -266433 -103629 18070 386244 -30972 -274795 102544 -24360 59866 -146961 -246358
18163 -246358 -308263 -186417 312679 -179097 -197584 -73748 -13952 -302034 35439 -136340
18152 89239 -246968 135874 -148364 -35326 23893 -10744 -240118 68861 -186633 -114139 71612
18140 24965 -73448 -354584 -11427 -68774 -110236 -108512 32741 -75308 -62269 39666 -252086
18128 -161416 -223353 -76295 -139019 -19526 93004 -113683 -226596 7255 160976 -274097 -166438
18117 -166438 11704 177177 -105587 350061 160145 -78491 -129167 54612 -311954 -41991
18106 -323310 -158563 -197579 -4433 199453 91609 275102 63542 -353012 -142975 -260029
$$ packed form
18184D14124A04560K47447c7519A56119b26536c5642N195j41163E0100d93196
18173b66433a03629A8070L68174c0972k43823A02544b4360E9866a46961r9397
18163b46358o1905J21846C12679a79097j8487g3748a3952k88082C5439a36340
18152H9239b46968A35874a48364c5326B3893a0744k29374F8861a86633P2494G1612
18140B4965g3448k81136a1427n7347m1462J724C2741g5308J3039C9666b52086
18128a61416o1937g6295o2724a9526I3004a13683j12913G255J53721b74097J07659
18117a66438A1704J65473a05587C50061A60145g8491n0676E4612c11954d1991
18106c23310a58563l9016d433A99453I1609J83493F3542c53012a42975j17054
$$ plain form
18096 -260029 -135897 -337841 -144700 244208 254186 -90473 -49292 -322312 120403 -8563 -243476
18085 -243476 -280295 324862 -191962 120159 -152051 279330 -193310 -214075 187217 -136556
18074 170831 -135650 -117495 -51265 40735 119168 47119 -157590 313571 -369100 317762
18063 -53692 350127 -240528 -234554 185261 -231250 -269394 103963 -115807 98014 80828 45244
18052 45244 167230 112498 83320 -362240 27998 -9671 48403 -340914 345715 -15061 -116961
18041 -116961 -200386 -16520 -79003 59452 -191961 -76129 -55441 -105422 -57642 -225309 -82714
18029 102150 49948 357311 204211 -303245 149744 20906 -44870 -471983 375218 152477
18018 89559 -98900 -185748 -341366 237016 77784 91788 -264481 65246 -244367 155580 -20719
$$ packed form
18096b60029J24132k01944a44700B44208R978i0473M1181k73020A20403h563k34913
18085b43476l6819C24862a91962A20159a52051B79330a93310k0765A87217a36556
18074A70831a35650J8155e1265D0735P8433D7119a57590C13571c69100C17762
18063e3692C50127b40528N974A85261b31250l8144A03963a15807I8014j7186l5584
18052D5244J21986n4732k9178c62240B7998i671D8403c40914C45715a5061j01900
18041a16961q3425a6520o2483E9452a91961g6129K0688m9981M7780j67667h2714
18029A02150D9948L07363j53100c03245A49744B0906d4870m27113C75218A52477
18018H9559i8900q6848j55618B37016G7784J4004b64481F5246b44367A55580b0719
$$ plain form
18006 297712 83062 -187126 -13619 -73237 317321 254948 179040 -193866 -169750 -130979 134162
17994 -247691 105881 -44765 187764 329508 -71250 57174 -201161 -319570 217598 -86915
17983 68758 7187 -225237 196363 470997 44896 157372 89928 129461 -331342 -263471 -169673
17972 -169673 -111439 318027 -206958 119294 -104555 264387 -127892 -171409 -162339 -271046
17962 -271046 -71564 32036 49840 -158790 -95566 387193 378053 22422 21751 -141308 -125835
17951 -125835 -27332 105321 -108976 -52646 -35674 23683 -104055 223266 309887 -246235
17940 -67423 -312906 -204545 397343 97966 -62983 86415 -588496 -142990 -30280 93477 -289350
17928 39580 -61165 -219746 -70178 165618 -77295 11441 79616 -166029 41712 -84251 389887
$$ packed form
18006B97712H3062a87126a3619n9618C17321o2373p5908a93866K4116L8771A34162
17994b47691A05881d4765A87764J41744g1250E7174b01161j18409B17598h6915
17983F8758G187b25237A96363K74634D4896J12476o7444L9533c31342O7871R3798
17972a69673N8234C18027b06958A19294a04555B64387a27892m3517R070j08707
17962b71046g1564C2036J7804a58790O3224C87193r140B2422o71a41308J5473
17951a25835b7332A05321a08976e2646J6972B3683a04055B23266Q6621b46235
17940f7423k45483J08361C97343I7966f2983H6415e88496a42990c0280I3477b89350
17928C9580f1165j58581g0178A65618g7295A1441O8175a66029D1712h4251C89887
$$ plain form
17916 89619 169400 77927 75472 -77710 21939 94862 -39519 -290967 -50341 -29933 433410
17904 42627 212385 150599 89131 5646 -332346 46875 110304 165769 -51193 -156355 50348
17892 111428 -8530 -332410 -106716 -107272 -256678 111781 -65939 -137327 64234 48094 -364219
17880 -25481 -61751 -292610 -63064 -359380 -96179 -256482 -102054 -13377 49882 -116167 220452
17868 135256 231338 -178518 243642 -198990 -134334 245003 -140628 141674 -135129 -253534
17858 -253534 -9424 32297 -108624 -2966 98053 28969 59202 -165879 6504 -16217 49567 -292970
17845 -242170 -90599 -27368 119849 -102303 -152306 -3502 -49480 -141523 41488 -76485 -107182
17834 -107182 -187573 -78670 -167404 392553 -140165 221053 36827 -309336 -3104 -34827 249601
$$ packed form
17916H9619P9781G7927k455g7710B1939P2923c9519k51448e0341K0408D33410
17904D2627J69758o1786o1468E646c32346D6875O3429N5465e1193j05162E0348
17892A11428h530l23880a06716n56j49406A11781f5939p1388F4234j6140c64219
17880b5481l6270k30859f3064k96316i6179j60303a02054a3377D9882a16167B20452
17868A35256R6082a78518B43642a98990O4656B45003a40628A41674a35129j18405
17858b53534i424C2297a08624b966I8053B8969L0233a65879F504a6217D9567b92970
17845b42170i0599b7368A19849a02303n0003c502m5978r2043D1488g6485l0697
17834a07182q0391g8670q8734C92553a40165B21053C6827c09336c104l1723B49601
$$ plain form
17822 -273056 48769 9380 408446 311793 -16671 -121657 375429 -256616 37947 -177065 -143820
17811 -143820 -154715 -42778 246573 133406 -887178 697 39458 -365875 -157858 -132712 -202130
17800 -202130 16309 -363120 -138897 250827 335868 320926 204221 152684 -106698 -62207
17790 -62207 -24639 300465 191801 -18827 44514 -96491 -227733 27377 56104 138794 57976
17778 88529 -68948 482967 66173 21758 171879 97402 -275177 -190858 -451437 -68564 -50491
17767 -50491 7138 360125 249574 -220637 -251857 49990 -14951 -6380 3343 -292933 137804
17755 321908 280005 130607 -42692 355044 -119767 -348329 -88868 -163505 -137251 35353 -109085
17743 18588 -319680 -132808 124427 -170443 165034 -67366 -37237 385417 -366235 -49222
$$ packed form
17822b73056D8769I380L99066r6653a6671j04986C75429b56616C7947a77065L3245
17811a43820j0895d2778B46573j13167h87178F97L8761c65875a57858K5146o9418
17800b02130A6309c63120a38897B50827Q5041j4942j16705n1537a06698M4491
17790f2207b4639C00465j08664a8827D4514i6491j31242B7377K8727Q2690E7976
17778H8529f8948D82967F6173B1758J50121p4477b75177Q4319k60579f8564J8073
17767e0491G138L52987j10551b20637l1220D9990a4951f380C343b92933A37804
17755C21908m1903A30607d2692C55044a19767k28562h8868p4637K6254C5353a09085
17743A8588c19680a32808A24427a70443A65034f7366L0129C85417c66235d9222
$$ plain form
17732 165841 175443 -93149 132447 88093 -142711 -223694 -126166 -104732 31190 106803 -365588
17720 60667 -21529 37669 6204 284303 151861 22454 -196988 -28631 125458 50725 275833
17709 275833 -332658 208098 74403 -5886 -228749 247896 93856 -590673 59558 114652 9106
17697 371066 -253324 -313334 -135773 -97704 162408 190149 -36537 -184425 -1452 -116069 -67118
17686 -67118 75931 44499 -152993 37854 -79810 -205739 -193696 -130783 -27054 253466 -194406
17674 -202171 -252885 6686 -40897 29357 59185 -44831 22433 438539 -32462 134006 206156
17663 206156 14394 -86795 97582 291545 11006 -115418 -67392 318834 -40037 53278 -178551
17651 -80356 39027 149046 -101150 158688 77599 116545 -66269 -132672 -20342 90141 230474
$$ packed form
17732A65841R602i3149A32447m4354a42711q0983R7528K1434C1190P5613c65588
17720F0667b1529C7669F204K78099j32442B2454a96988b8631A25458E0725K25108
17709B75833c32658B08098G4403e886k22863B47896I3856e90673E9558N5094I106
17697C71066b53324o0010a35773L8069A62408K7741c6537j47888a452j14617M8951
17686f7118G5931l1432a52993C7854g9810j25929J2043O2913b7054B53466a94406
17674b02171n0714F686d0897B9357K9828d4831B2433M16106c2462A34006P2150
17663B06156A4394h6795I7582J93963A1006a15418M8026C18834d0037E3278a78551
17651h0356C9027J10019a01150A58688G7599L8946f6269o6403b0342I0141J40333
$$ plain form
17640 230474 -91158 -46185 98338 2475 96261 12902 -318906 413133 -223479 -187283 175255
17628 172985 40726 -177929 -201491 149358 198542 -56302 -61762 -22931 126925 78486 -46775
17616 -19752 84899 -215542 122185 -190031 217349 104831 140118 -62395 -74483 -397086
17606 -397086 43822 275855 -103822 -60399 -145577 32914 -108702 130591 211096 -60283 85674
17594 180121 -8856 -237501 -179368 -297259 -33550 95030 87916 -154489 -310147 33790 158679
17583 158679 158346 245179 -537372 -137032 -71414 257168 -278782 15050 -90393 210879 -185715
17571 -69540 -133438 6544 -77606 293185 13038 -219160 -39334 -70951 -55603 -93110 -8848 41360
17558 450584 59252 32645 73724 217593 249318 -94753 230334 -76885 28345 48949 278801
$$ packed form
17640B30474i1158M4973I8338B475R3786A2902c18906D13133b23479L6196A75255
17628A72985D0726a77929k3562A49358M9184e6302n460b2931A26925m8439d6775
17616a9752H4899b15542A22185a90031B17349A04831L5287f2395j2088l22603
17606c97086D3822K32033a03822M3423q5178C2914a08702A30591Q0505f0283H5674
17594A80121h856k28645N8133j17891c3550I5030p114a54489j55658C3790J24889
17583A58679l33Q6833e37372a37032O5618B57168b78782A5050i0393B10879a85715
17571f9540o3898F544g7606B93185A3038b19160c9334l1617J5348l7507h848D1360
17558D50584E9252k6607M1079J43869L1725i4753B30334g6885B8345K0604K29852
$$ plain form
17547 278801 6419 -21087 -17787 -266405 -125095 -284794 31521 -141963 19232 -210544 -74263
17535 -25917 295219 105598 -227880 -313622 20206 251787 30567 111707 96249 21988 218468
17524 218468 -77414 220027 -81930 -363945 -193497 81471 -332657 160542 370008 207617
17514 207617 127412 -4738 118994 231490 113089 339677 -43820 27649 -31585 25689 172682
17503 172682 27485 94358 194137 249068 54195 147205 -214575 143351 10206 131548 -142978
17491 215994 156928 -100845 -13894 48197 5129 -34621 -135447 -121380 -187746 132911 246473
17480 246473 67641 -225451 334733 167371 121257 59306 -14093 -114383 137173 241278
17470 241278 105238 -47322 -327851 275567 30350 -51237 -200068 -90891 245657 167362
$$ packed form
17547B78801F419b1087L300k48618a25095j59699C1521a41963A9232b10544g4263
17535b5917B95219A05598b27880q5742B0206K31581C0567Q1140j5458B1988J96480
17524B18468g7414B20027h1930k82015J70448H1471c32657A60542K09466j62391
17514B07617q0205d738A18994J12496A13089K26588d3820B7649c1585B5689J46993
17503A72682B7485O6873R9779N4931E4195R3010b14575A43351A0206J21342a42978
17491B15994n9066a00845a3894D8197E129c4621j00826J4067o6366A32911J13562
17480B46473F7641b25451C34733j67362m6114E9306a4093j00290A37173J04105
17470B41278A05238d7322k80529B75567C0350e1237j48831i0891B45657p8295
$$ plain form
17460 167362 436507 72631 204374 249228 243738 214838 575447 326297 247770 184367 20920
17448 -34810 182051 -15590 188314 60458 78690 380816 420056 176803 112518 16510 137091
17437 137091 109990 110672 356303 311333 135531 133815 379386 327260 232733 182932 42771
17425 191882 166263 -18413 285366 325490 321940 139555 299622 453023 552744 67535 419867
17414 419867 136356 -15749 46533 261982 105981 122574 194931 154391 146265 -183839 -30836
17402 5798 -3734 102395 189928 194374 -36938 173598 -244012 85373 14152 -100616 99107
17390 107553 -397650 28696 -108670 46823 22642 -14194 157435 363395 243482 84103
17379 -110541 551766 186803 -3612 128194 155870 300062 397165 303188 30238 -131997 263358
$$ packed form
17460A67362K69145G2631J31743M4854n490k8900L60609k49150p8527o3403B0920
17448c4810A82051a5590A88314F0458J8232L02126L9240A76803o4285A6510J20581
17437A37091k7101O82K45631m4970A35531j716K45571n2126r4527m9801D2771
17425A91882k5619a8413B85366M0124l550A39555J60067J53401R9721F7535L52332
17414D19867A36356a5749D6533K15449A05981J6593P2357m0540q126a83839c0836
17402E798c734A02395Q7533M446c6938A73598b44012H5373A4152a00616I9107
17390A07553c97650B8696a08670D6823B2642a4194A57435K05960j19913H4103
17379a10541E51766A86803c612A28194K7676J44192R7103r3977C0238a31997B63358
$$ plain form
17367 184049 58114 65234 323422 61498 58608 -24018 -3970 -114517 -125785 -158303 71863 -204491
17354 -173590 37833 150987 -107440 -129516 102742 -61672 250230 332887 54587 71957 186903
17343 186903 261420 -407755 354658 -367265 -52444 187558 -108129 -51721 -47683 370898
17332 -118068 127246 138002 -111988 -176620 320408 -330038 303213 407035 164130 -27659
17321 175338 113262 158364 325398 -43278 275411 293047 133819 107459 195193 -286425 380315
17309 189738 72272 213042 188781 76601 119694 326281 47483 151958 260649 86422 247791
17298 247791 23952 188708 16075 -143865 147624 -136227 93216 119943 60470 37613 185851
17287 185851 381327 212060 -104523 37359 4883 -151421 -216130 426864 -32546 146203
$$ packed form
17367A84049E8114P120K58188F1498k890b4018c970j10547j1268l2518G1863b04491
17354a73590C7833J13154a07440k2076A02742f1672B50230Q2657E4587J7370J14946
17343A86903P4517d07755C54658c67265e2444A87558a08129e1721M038C70898
17332a18068A27246J0756a11988o4632C20408c30038C03213J03822A64130b7659
17321A75338o2076M5102J67034d3278B75411J7636A33819k6360Q7734b86425C80315
17309A89738G2272J40770k4261G6601M3093K06587D7483J04475J08691H6422J61369
17298B47791B3952J64756A6075a43865A47624a36227I3216K6727n9473k2857J48238
17287A85851J95476j69267a04523C7359D883a51421o4709D26864c2546A46203
$$ plain form
17276 279358 341289 263243 51843 -153295 -13887 48023 270675 -134918 -131483 192370 114570
17265 114570 236730 27171 46026 71930 302306 74098 61721 135168 448021 84441 82442
17254 82442 291041 437731 -102629 56480 -100751 -50115 360888 243230 206446 122928
17244 122928 124963 -8746 -89906 -1806 -30700 356850 98466 37246 216772 165871 -43864 254693
17231 78349 -336019 288350 149258 101729 470489 369286 57515 122111 204680 -71530 -70952
17220 -70952 166683 24876 -92024 43614 58470 274394 243898 199891 247248 470935 58880
17208 201713 -86217 373686 -102271 -122253 132131 156148 471085 25142 245019 264021
17198 264021 216100 235672 227354 15587 41844 161411 440892 -81495 -30818 162213 -119431
$$ packed form
17276B79358O1931p8046E1843a53295a3887D8023K22652a34918L435A92370p7800
17265A14570J22160B7171J8855K5904K30376G4098j2377P3447L12853H4441j999
17254H2442K08599J46690a02629E6480a00751e0115C60888j17658l6784q3518
17244A22928K035h746q1160a806k8894C56850I8466C7246J79526n0901d3864B54693
17231G8349c36019B88350j39092m7529L68760j01203E7515O4596Q2569g1530N78
17220g0952A66683B4876i2024D3614J4856K15924l0496m4007M7357K23687E8880
17208B01713h6217C73686a02271j9982A32131K4017L14937B5142K19877J9002
17198B64021m7921J9572q318A5587K6257J19567K79481h1495c0818A62213a19431
$$ plain form
17186 138623 421697 266537 -105507 61235 -246 83278 46504 214062 -113674 68929 249754
17175 249754 33029 58030 33712 163964 -9148 226138 320463 -20653 -91846 129137 236744
17164 236744 217364 175755 181260 237313 315418 238757 195062 315025 227153 449830 595112
17153 595112 204206 494592 313486 236610 313175 130298 -105636 -23921 283519 442474
17143 442474 101937 15786 228939 370577 407625 65735 182906 304959 267183 341451
17133 341451 316345 116330 470948 212271 362709 113748 407061 106415 477070 130893
17122 56525 409491 238740 -14374 433227 211805 488265 448472 414610 172065 356189
17112 356189 713905 172066 413140 271888 215364 226996 351647 523225 153884 30180
$$ packed form
17186A38623K83074j55160a05507F1235b46H3278l6774J67558a13674F8929J80825
17175B49754C3029K5001k4318J30252i148B26138R4325b0653p1193A29137J07607
17164B36744j9380m1609N505N6053P8105p6661m3695J19963q7872K22677J45282
17153E95112B04206K90386j81106p6876P6565A30298a05636b3921B83519J58955
17143D42474A01937A5786K13153J41638L7048F5735J17171J22053l7776P4268
17133C41451k5106A16330L54618B12271J50438A13748K93313A06415L70655A30893
17122E6525L52966j70751a4374D33227B11805K76460l9793l3862A72065J84124
17112C56189L57716A72066K41074j41252n6524J1632J24651J71578A53884C0180
$$ plain form
17101 258276 254201 203402 355901 -55821 274639 27146 182354 256104 113393 679955 471045
17090 471045 -49359 224664 347065 156246 328113 471131 443699 363506 787665 81037
17079 386708 302344 302615 279406 259002 249530 623489 374633 283417 343400 481100 272072
17068 272072 441704 422861 726860 305043 655371 309896 716782 672343 118635 220581
17058 220581 536330 608536 351858 233092 264715 295740 419082 527425 191552 174221
17048 174221 654389 494299 231876 608197 333892 373189 257265 912425 584297 329762
17038 329762 43297 286474 679416 73632 324020 288538 366688 866833 392069 387611 505034
17027 505034 448316 333440 525468 421574 269995 428614 275639 391797 63791 181573
$$ packed form
17101B58276m075n0799J52499e5821B74639B7146J55208P3750A13393N66562k08910
17090D71045d9359B24664J22401A56246J71867J43018k7432q0193M24159H1037
17079C86708q4364K71k3209k0404r472L73959k48856r1216N9983J37700k09028
17068B72072J69632j8843L03999C05043L50328C09896M06886m4439A18635J01946
17058B20581L15749P2206k56678j18766L1623L1025J23342J08343A91552j7331
17048A74221M80168j60090B31876L76321k74305L9297j15924O55160l28128k54535
17038C29762D3297K43177L92942G3632K50388l5482P8150N00145C92069m458J17423
17027E05034n6718j14876J92028j03894j51579J58619j52975J16158F3791J17782
$$ plain form
17017 181573 592481 384921 416537 446403 670795 768109 177759 557147 757796 339295
17006 555545 427688 696809 377011 216596 632141 476201 500068 535589 848313 583534
16996 583534 447296 893501 453258 717217 620700 889047 318856 304997 546303 479101
16986 479101 580073 871168 686027 789899 490316 404016 579375 799080 664844 687475
16976 687475 687714 548105 901903 572952 787415 642741 813924 834914 439963 880226
16966 880226 608146 795404 749674 663489 920079 687530 525406 758672 681163 817949
16956 817949 773749 773450 990097 618047 722906 921325 812803 745472 636366 978054
16946 978054 747166 1105599 714616 1032030 955458 1046725 686090 904664 542925 645919
$$ packed form
17017A81573M10908k07560L1616K9866K24392R7314A77759L79388K00649C39295
17006E55545j27857K69121l19798j60415M15545j55940K3867L5521L12724k64779
16996E83534j36238M46205m40243K63959r6517K68347C18856j3859K41306o7202
16986D79101J00972K91095j85141J03872k99583q6300J75359K19705j34236K2631
16976F87475K39j39609L53798l28951K14463j44674J71183K0990l94951M40263
16966H80226k72080J87258m5730q6185K56590k32549j62124K33266p7509J36786
16956H17949m4200k99K16647l72050J04859J98419j08522o7331j09106L41688
16946I78054k30888L58433l90983L17414p6572R1267l60635K18574l61739J02994
$$ plain form
16936 645919 891727 914135 852100 878915 1110281 1488676 968383 1101808 879606 732035
16926 732035 1047860 1096129 1075587 800549 957777 952389 1477559 1094805 798792 1041922
16916 1041922 1176061 1020014 899403 1197561 1277725 1226623 997773 1394494 1179172 980495
16906 980495 1429400 1313338 1462117 1355471 1454283 962622 1536283 1341018 1415765 1258335
16896 1258335 1203231 1126930 1323390 1411283 1490076 1581242 1277795 1464549 1715364 1472003
16886 1472003 1728991 1750747 1368232 1617222 1767214 1915906 2092291 1836315 1528613 2180802
16876 2180802 1738404 1856766 1618142 2147218 2045976 1977489 2268012 2451808 2062514 1932033
16866 1932033 2036979 2061653 2171358 2165935 2107413 2198634 2217753 2079668 2228696 2456092
$$ packed form
16936F45919K45808K2408o2035K6815K31366L78395n20293J33425k22202j47571
16926G32035L15825M8269k0542k75038J57228n388N25170l82754k96013K43130
16916A041922J34139j56047j20611K98158Q0164n1102k28850L96721k15322j98677
16906I80495M48905j16062J48779j06646R8812m91661N73661j95265P4747j57430
16896A258335n5104p6301J96460Q7893P8793R1166l03447J86754K50815k43361
16886A472003K56988K1756l82515K48990J49992J48692J76385k55976l07702O52189
16876B180802m42398J18362k38624N29076j01242o8487K90523J83796l89294j30481
16866A932033J04946K4674J09705n423n8522R1221J9119j38085J49028K27396
$$ plain form
16856 2456092 2432097 2026484 2411719 2401607 2252042 2308059 2408318 2688602 2742219 3036861
16846 3036861 2768711 2857269 2474078 2539116 2921095 3544262 2989615 3000784 2976416 3331981
16836 3331981 3092489 2912246 3114440 3257158 3322765 3175829 3514088 3533580 3646201 3715962
16826 3715962 3906015 3776664 3604103 3767161 3827432 3957275 4175743 4247406 4265597 4347735
16816 4347735 4083940 4600789 4406018 4679247 4563914 5210047 4939083 4926802 5001154 5436241
16806 5436241 5270002 5427616 5837404 5631872 5950358 5982906 5954957 6326466 6593191 6555975
16796 6555975 6582446 6566209 6896994 7269383 7750276 7511783 7768436 8109296 8475108 8409448
16786 8409448 8582094 8923384 9224501 9398626 9583095 10108443 10157381 10551557 10706705 11255937
$$ packed form
16856B456092k3995m05613L85235j0112j49565N6017J00259K80284N3617K94642
16846C036861k68150Q8558l83191O5038L81979O23167n54647J1169k4368L55565
16836C331981k39492j80243K02194J42718O5607j46936L38259J9492J12621O9761
16826C715962J90053j29351j72561J63058O0271J29843K18468P1663J8191Q2138
16816D347735k63795N16849j94771K73229j15333O46133k70964j2281P4352M35087
16806E436241j66239J57614M09788k05532L18486L2548k7949L71509K66725l7216
16796F555975K6471j6237L30785L72389M80893k38493K56653L40860L65812o5660
16786H409448J72646L41290L01117J74125J84469N25348M8938L94176J55148N49232
$$ plain form
16776 11255937 11615424 11440555 12286145 12506054 13041906 13460384 13716774 14244079 14913631
16767 14913631 15323481 16068238 16410684 16681887 17485224 18459002 18878839 19748354 20758196
16758 20758196 21353030 22329782 23009126 23979338 25222355 26558023 27161278 28563018 30003842
16749 30003842 31529072 32944483 34570079 36263408 38263891 40049797 42120602 44571692
16741 44571692 47037928 50001265 52311004 55395757 58919255 62563668 66098323 70555784
16733 70555784 74840655 79133511 84466044 89780260 95860156 101564297 108561742 115158282
16725 115158282 122207350 129773840 137118043 145096837 152574640 159571512 166597116 172482316
16717 172482316 177726519 181533130 184574823 185936379 185882114 184466537 181648208 177468720
$$ packed form
16776A1255937L59487j74869Q45590K19909N35852M18478K56390N27305O69552
16767A4913631M09850P44757L42446K71203Q03337R73778M19837Q69515J009842
16758B0758196N94834R76752O79344R70212J243017J335668O03255J401740J440824
16749C0003842J525230J415411J625596J693329K000483J785906K070805K451090
16741D4571692K466236K963337K309739L084753L523498L644413L534655M457461
16733G0555784M284871M292856N332533N314216O079896N704141O997445O596540
16725A15158282P049068P566490P344203P978794P477803O996872P025604N885200
16717A72482316N244203L806611L041693J361556n4265j415577k818329m179488
$$ plain form
16709 177468720 172367193 166116967 159142123 152003143 144003474 136492976 128951358 121195805
16701 121195805 114038021 106827120 100158844 93670242 88186670 82211976 77267191 72258347
16693 72258347 68112360 63573320 59893142 56188424 53301725 50131217 47545259 44899044
16685 44899044 42112586 40081387 37911789 35808324 34308026 32204830 30936160 29404684
16677 29404684 28051593 26679992 25718418 24224048 23589827 22143753 21261325 20681770 19543994
16668 19543994 18808651 17858337 17460758 16806951 16338646 15359245 14900231 14298433 13991079
16659 13991079 13391499 12877243 12601650 12084644 11675257 11417928 11004106 10656149 10405695
16650 10405695 10065334 9811141 9710770 8995128 8893198 8466046 8199894 8175612 8302336
$$ packed form
16709A77468720n101527o250226o974844p138980p999669p510498p541618p755553
16701A21195805p157784p210901o668276o488602n483572n974694m944785n008844
16693G2258347m145987m539040l680178l704718k886699l170508k585958k646215
16685D4899044k786458k031199k169598k103465j500298k103196j268670j531476
16677B9404684j353091j371601r61574j494370o34221j446074q82428n79555j137776
16668A9543994p35343r50314l97579o53807m68305r79401m59014o01798l07354
16659A3991079n99580n14256k75593n17006m09387k57329m13822l47957k50454
16650A0405695l40361k54193j00371p15642j01930m27152k66152k4282J26724
$$ plain form
16641 8302336 8015883 7690862 7454767 7207290 6890863 6715532 6722911 6653099 6465550 6375754
16631 6375754 6059972 6110847 5830110 5368506 5589321 5192216 5132391 5157889 5228873 4840147
16621 4840147 4957585 4603964 4612267 4589318 4268649 4243105 4177280 4141252 3750861 3962645
16611 3962645 3529132 3726790 3835593 3718674 3531030 3531523 3650763 3533406 3551817 3118712
16601 3118712 3389062 3436539 3105156 2937344 3040075 2768881 2933865 2674629 2686214 2547570
16591 2547570 2285139 2541932 2419515 2385952 2364413 2665726 2350073 2448683 2173218 2385373
16581 2385373 2220406 2271664 2011662 1942447 2188475 2055024 1795562 1891175 1824606 1993835
16571 1993835 2182943 1805735 2148078 1711852 1809883 1783912 1656218 1902005 1624478 1556956
$$ packed form
16641H302336k86453l25021k36095k47477l16427j75331P379o9812j87549q9796
16631F375754l15782N0875k80737m61604K20815l97105n9825K5498P0984l88726
16621D840147J17438l53621Q303k2949l20669k5544o5825l6028l90391K11784
16611C962645m33513J97658J08803j16919j87644M93J19240j17357J8411m33105
16601C118712K70350M7477l31383j67812J02731k71194J64984k59236J1585j38644
16591B547570k62431K56793j22417l3563k1539L01313l15653R8610k75465K12155
16581B385373j64967N1258k60002o9215K46028j33451k59462R5613o6569J69229
16571A993835J89108l77208L42343m36226R8031k5971j27694K45787k77527o7522
$$ plain form
16561 1556956 1538003 1685817 1495012 1444759 1292664 1521597 1739497 1530367 1664084 1450922
16551 1450922 1596343 1315060 1130808 1640334 1242409 1474586 1376173 1508709 1154630 1283449
16541 1283449 1113627 1304964 1196980 1315415 1664413 1252514 1266654 1099874 1004855 973638
16531 973638 1090768 778822 1103579 941861 1060093 1134020 990478 1194058 1044547 925665
16521 925665 898113 1075416 786031 967249 1059941 1093427 1017761 934600 554097 995561
16511 995561 991596 843035 860652 872771 849828 921924 663579 862605 792982 1088370 969163
16500 969163 682275 794906 930459 452802 745972 907572 594127 836658 362985 663406
16490 663406 691527 720635 725488 886679 696525 928382 421504 570516 320349 531461
$$ packed form
16561A556956j8953J47814j90805n0253j52095K28933K17900k09130J33717k13162
16551A450922J45421k81283j84252N09526l97925K32177r8413J32536l54079J28819
16541A283449j69822J91337j07984J18435L48998m11899J4140j66780r5019l1217
16531I73638J17130l11946L24757j61718J18232P3927j43542K03580j49511j18882
16521I25665k7552J77303k89385J81218R2692L3486p5666q3161l80503M41464
16511I95561l965j48561J7617J2119k2943P2096k58345J99026o9623K95388j19207
16500I69163k86888J12631J35553D52802K93170J61600l13445K42531C62985L00421
16490F63406K8121K9108M853J61191j90154K31857D21504J49012k50167K11112
$$ plain form
16480 531461 590388 833466 799322 942541 479647 605248 405937 411138 626159 567440
16470 567440 570162 750731 523035 494805 921815 684630 564195 567422 338503 672899
16460 672899 866311 828721 543946 339101 521157 810529 438572 343542 421919 697812
16450 697812 33408 434500 488294 337458 411338 326818 666195 914040 453063 520258
16440 520258 675340 376432 465998 384317 370597 495180 487058 345781 228154 594056
16430 594056 237736 431767 646459 399906 556330 33621 367785 295677 238580 353345
16420 353345 -27957 396404 483558 509885 480879 749617 519482 291709 187829 344185
16410 344185 446875 431717 435762 418005 560027 245353 81632 246337 389305 252492
$$ packed form
16480E31461N8927K43078l4144J43219m62894J25601j99311N201K15021n8719
16470E67440K722J80569k27696k8230M27010k37185j20435L227k28919L34396
16460F72899J93412l7590k84775k04845J82056K89372l71957r5030P8377K75893
16450F97812C3408M01092N3794j50836P3880q4520L39377K47845D53063O7195
16440E20258J55082k98908Q9566q1681j3720J24583q122j41277j17627L65902
16430E94056B37736J94031K14692k46553J56424C3621L34164p2108n7097J14765
16420C53345b7957C96404Q7154K6327k9006K68738k30135k27773j03880J56356
16410C44185J02690j5158M045j7757J42022B45353H1632J64705J42968j36813
$$ plain form
16400 252492 339915 695445 -26816 294417 555018 471360 413984 353868 509924 -126852
16389 185090 142777 406234 250049 518612 397712 9347 285617 76280 8024 397257 281637
16378 281637 361959 68076 364964 185960 371688 294356 344452 230301 382267 483979
16368 483979 206700 377860 105341 343845 304678 288803 44044 595974 -192434 198005
16357 192927 201858 343206 -76575 213366 -110065 -116467 211126 259909 316123 -86411 209537
16345 339704 330727 154672 362245 342881 201125 275346 239007 142112 339567 465494 419015
16334 419015 24179 149397 569620 494783 156468 258080 -35439 176465 167724 236827 -147054
16322 363240 -47823 -75083 -13731 -31924 250210 465490 -172914 323972 308382 -71166 125792
$$ packed form
16400B52492Q7423L55530b6816B94417K60601q3658n7376o0116J56056a26852
16389A85090m2313K63457j56185K68563j20900I347K76270G6280H024L89233j15620
16378B81637Q0322F8076K96888j79004J85728p7332N0096j14151J51966J01712
16368D83979B06700J71160A05341K38504l9167j5875D4044N51930a92434A98005
16357A92927Q931J41348g6575B13366a10065o402B11126M8783N6214h6411B09537
16345C39704q977A54672K07573j9364j41756P4221l6339r6895J97455J25927m6479
16334D19015B4179J25218M20223p4837A56468J01612c5439A76465q741O9103a47054
16322C63240d7823k7260a3731j8193B50210K15280a72914C23972j5590g1166A25792
$$ plain form
16310 336659 375068 -403 93295 304751 -46760 280511 -48922 63257 257904 71362 224149
16299 224149 79547 -144578 379638 206550 380285 20282 200501 50739 342128 233468
16289 233468 315074 99600 46223 221813 -236000 274086 58996 375038 -373362 235169
16278 138771 -102594 279014 167981 -66717 122556 140992 136020 36861 211272 509060
16268 509060 -225500 239221 96015 412812 106750 -28098 212264 -33319 19271 -108883
16257 332313 520295 -275338 -215973 286294 -19042 219474 322974 -16722 -120728 153648
16246 224045 251264 215543 344305 509302 47773 349120 -44216 299201 -11489 164768
16235 243017 64646 100149 222648 -118964 116797 340072 278104 -36669 -232034 165916
$$ packed form
16310C36659L8409d03I3295K11456d6760B80511d8922F3257J94647G1362J52787
16299B24149G9547a44578C79638j73088J73735B0282J80219E0739K91389j08660
16289B33468Q1606I9600D6223J75590b36000B74086E8996L16042c73362B35169
16278A38771a02594B79014j11033f6717A22556J8436m972C6861J74411K97788
16268E09060b25500B39221I6015L16797A06750b8098B12264c3319A9271a08883
16257C32313J87982b75338N9365B86294a9042B19474J03500a6722j04006A53648
16246B24045K7219l5721J28762J64997D7773L01347d4216B99201a1489A64768
16235B43017F4646L5503J22499a18964A16797K23275o1968c6669j95365A65916
$$ plain form
16224 -271787 183949 16306 -6427 -64659 267000 -40686 201451 12440 54489 49050 293298
16213 293298 30097 28153 -73280 -35625 220191 165729 387746 -27110 -214943 144178 290203
16202 290203 -27345 98690 105560 14339 -185945 31903 22305 67724 226707 -45760 178505
16190 135563 -67490 150826 86478 422136 188028 -237277 -252113 9755 170712 36181 39299
16179 39299 177644 -91353 131372 -221677 -252731 83635 238895 -49918 -20810 122788 113174
16168 113174 127101 73887 -25342 -6059 31381 -273725 115131 46739 -91498 158996 147742
16157 147742 -163176 -282289 -110598 20636 96193 -220344 52863 -152604 15002 362285
16147 362285 32471 -63417 9074 -65340 -237643 -117830 -20015 172974 -117849 -116558 -123964
$$ packed form
16224b71787A83949A6306f427n8232B67000d0686B01451A2440M2049n439K44248
16213B93298C0097j944g3280c5625B20191n4462K22017b7110j87833A44178J46025
16202B90203b7345I8690O870A4339a85945C1903r598M5419J58983d5760A78505
16190A35563f7490A50826o4348L35658A88028b37277j4836I755J60957C6181L118
16179C9299J38345i1353A31372b21677l1054H3635J55260d9918b0810A22788r614
16168A13174J3927n3214b5342f059C1381b73725A15131D6739i1498A58996j1254
16157A47742a63176j19113a10598B0636P5557b20344E2863a52604A5002L47283
16147C62285C2471f3417I074f5340j72303a17830b0015A72974a17849J291p406
$$ plain form
16136 -123964 -274311 -94498 148595 -140249 265972 93721 131106 160723 145598 -154209
16125 11095 -169139 -218376 -50981 70039 190087 -59699 -262899 -105938 -333657 278390
16114 333123 211052 284740 106581 -217903 265610 185734 103893 119049 328 94151 25314
16102 69327 -43689 89476 168164 171123 243871 82682 -77523 -230579 -109332 273065 -219356
16090 -106796 14645 -300129 -10764 301507 125600 -71192 -171398 -1880 -181734 -149389 220856
16078 -48465 211156 140694 -245304 231887 -1985 -223877 -101063 270719 90411 -2572 -294159
16067 -294159 -81231 -271179 151996 -39479 -87199 68803 -267736 80141 -135621 -254947
16057 -254947 -276932 169055 25054 84183 -122577 272512 -184577 -23623 -100411 120553
$$ packed form
16136a23964j50347i4498A48595a40249B65972I3721L7385K9617j5125a54209
16125A1095a69139m9237e0981G0039J20048e9699k03200a05938k27719B78390
16114C33123j22071P3688A06581b17903B65610p9876q1841J5156C28R3823B5314
16102F9327d3689H9476P8688K959P2748H2682g7523j53056a09332B73065b19356
16090a06796A4645c00129a0764C01507A25600g1192j00206a880j79854L2345B20856
16078d8465B11156p0462b45304B31887a985k21892a01063B70719I0411b572k91587
16067b94159h1231j89948A51996c9479m7720F8803b67736H0141a35621j19326
16057b54947k1985A69055B5054N9129a22577B72512a84577b3623p6788A20553
$$ plain form
16046 17141 -141576 3005 254600 -66398 84188 -84860 -223210 -12163 -366930 272799 -39909
16034 -7283 103412 34553 -163720 3967 14795 -80189 166272 -150919 -190732 -36983 -200331
16023 -200331 -114230 213717 40782 -46827 81642 -105951 -122881 119210 -287953 138196
16012 -505502 -412045 95490 116034 -182923 13548 -97281 68146 -37436 -203703 -228528 -91868
16000 -449007 -164523 86185 -70180 -116812 158480 19901 -189100 250648 43933 -101055
15989 -173738 174513 123342 73445 37760 307434 -18319 12397 159839 305387 217284 -127110
15977 -93738 175168 100459 14235 5574 69897 -40373 -59919 -213552 -154234 85697 328727
15966 328727 96354 -106285 429178 -82856 175446 192297 203957 -157252 -1580 -205047 -61856
$$ packed form
16046A7141a41576C005K51595f6398H4188h4860j38350a2163l54767B72799c9909
16034g283A03412C4553a63720C967J0828h0189A66272a50919l9813c6983j63348
16023b00331Q6101B13717D0782d6827H1642a05951j6930A19210b87953A38196
16012e05502R3457I5490K0544a82923A3548i7281F8146c7436j66267k4825i1868
16000d49007a64523H6185g0180m6632A58480A9901a89100B50648D3933a01055
15989a73738A74513n1171m9897l5685K69674a8319A2397J47442J45548q8103a27110
15977i3738A75168p4709A4235E574O4323d0373j9546j53633N9318H5697K43030
15966C28727I6354a06285D29178h2856A75446J6851J1660a57252a580k03467f1856
$$ plain form
15954 -251028 -82842 -220594 -100158 68768 -131780 -55164 -208616 13027 148108 -165234
15943 6434 -277433 90324 -136696 -273274 -102458 -139595 -342731 -157119 179092 23516
15932 136664 -23532 -509657 -297531 -16628 185151 -534832 -34197 -134563 196743 8182
15921 176557 -106105 92936 131059 -246435 104238 64029 -87842 -91820 -9148 22 -190890 272397
15908 175471 135091 231401 -88683 65904 113235 298557 -66733 196679 95845 102570 -51525
15896 -30362 -200985 -165883 -203287 43124 28323 -404883 119393 157074 -14163 297838 172441
15885 172441 10943 -284095 75203 -522594 -253927 103543 -277255 30041 206775 276506
15875 276506 -84118 92659 143455 -252074 -65530 -328186 -37796 -13276 -121231 -230149 -88659
$$ packed form
15954b51028h2842j37752a00158F8768a31780e5164j53452A3027J35081a65234
15943F434b77433I0324a36696j36578a02458l7137k03136a57119A79092B3516
15932A36664b3532m86125K12126a6628A85151e34832c4197j00366A96743H182
15921A76557a06105I2936L8123b46435A04238m0209h7842l978i148B2a90890B72397
15908A75471m0380R6310h8683F5904M7331J85322f6733A96679I5845O725e1525
15896c0362j70623L5102l7404D3124j4801d04883A19393L7681a4163B97838j25397
15885A72441A0943b84095G5203e22594b53927A03543b77255C0041J76734O9731
15875B76506h4118I2659N0796b52074f5530k62656c7796a3276j07955j08918h8659
$$ plain form
15863 -322256 61206 -159690 40655 -281535 -189872 104855 111197 -52612 199752 69255 210504
15852 210504 -224924 126757 -173887 185871 -35852 -183986 -17541 -140071 171434 -247470
15841 -3598 -220922 -209276 -397722 -77576 253779 -103641 -315628 253638 192761 434901
15831 434901 51014 -7020 -141524 34522 -250185 -85153 -47408 -12886 -539565 -281804 60975
15819 124868 -147450 -140526 -227734 -190876 -184087 240985 -57174 -121425 -40110 -274604 -310060
15808 -310060 95168 -249853 -12990 272466 126127 -161288 -144296 -164663 99270 211636
15798 211636 122515 127150 -289552 101782 -87864 114776 294918 311838 -363134 39407 -15750
15786 -278278 -20280 10576 -375668 208675 34322 94799 -98085 -122918 -149614 71562 -92140
$$ packed form
15863c22256F1206a59690D0655b81535R1663A04855O342e2612A99752F9255J41249
15852B10504b24924A26757a73887A85871c5852j48134a7541j22530A71434b47470
15841c598k17324J1646j88446g7576B53779a03641k11987B53638o0877K42140
15831D34901E1014g020j34504C4522b50185h5153L7745a2886n26679K57761F0975
15819A24868a47450O924q7208L6858O789B40985e7174o4251d0110k34494l5456
15808c10060I5168b49853a2990B72466A26127a61288J6992k0367I9270J12366
15798B11636q9121M635b89552A01782h7864A14776J80142J6920c63134C9407a5750
15786b78278b0280A0576c75668B08675C4322O0477i8085k4833k6696G1562i2140
$$ plain form
15774 -41470 321999 289105 -149167 -226520 69549 -183919 -135180 -120006 3600 78217 -111785
15762 58000 228195 396498 182391 23663 -88896 -51627 141284 238894 23735 28558 -161929
15750 46653 289820 83190 161082 235753 4626 117561 80950 -403572 -3496 12333 -91937
15738 -257944 319133 -188675 -84412 -59799 -71461 247478 -98477 -14791 22491 -138995 145373
15726 -205095 -139669 -259617 287582 106457 -39246 -350602 -65075 -116583 -49623 111022
15715 -210348 -34565 138244 -276494 -225736 -341106 -88756 92973 13027 -165036 -303968
15705 -303968 -46516 -273251 458360 101196 54720 141998 -63328 285275 166867 -278930
15694 53400 -225347 101460 212206 60179 -52676 124491 -39363 -121958 239727 -92382 -28131
$$ packed form
15774d1470C21999l2894a49167p7353F9549a83919M8739J5174C600P4617a11785
15762E8000J70195J68303A82391B3663h8896L7269A41284R7610B3735M823a61929
15750D6653K43167H3190P7892P4671D626J12935l6611d03572c496A2333i1937
15738b57944C19133a88675h4412K4613j1662B47478i8477a4791B2491a38995A45373
15726b05095O5426j19948B87582A06457c9246l11356f5075n1508d9623A11022
15715b10348c4565A38244b76494N0758j15370h8756I2973A3027a65036j38932
15705c03968d6516k26735D58360A01196m6476Q7278f3328B85275j18408b78930
15694E3400b25347A01460J10746F0179e2676A24491c9363q2595B39727i2382b8131
$$ plain form
15682 50051 -51430 -88414 -122307 125327 -383362 -49720 -77284 59468 -138189 -77779 56979
15670 68190 177152 -117416 64605 -113750 99630 -396368 15141 -169071 151614 94197
15660 94197 134429 207249 -408695 129902 -45673 -350581 -313866 -259808 8007 -983 -218994
15649 -218994 -238519 -146806 47964 -44217 -23019 -18829 218978 -449921 -56506 59861 175657
15638 175657 -48439 316991 -125980 316170 16710 -168755 48223 -148244 17021 -24447
15627 -247416 -298299 292231 22115 -10486 -125416 -264765 -111717 -56255 100036 74681
15617 74681 -3379 -68963 -273248 253159 35697 -218407 28523 -119651 -174216 33488 -65108
15605 -148432 8116 132471 19508 -136571 -372428 -51474 -131176 59405 -274436 -68464 -78994
$$ packed form
15682E0051e1430l6984l3893A25327c83362d9720k7564E9468a38189O0410E6979
15670F8190J08962a17416F4605a13750I9630c96368A5141a69071A51614n7417
15660I4197M0232P2820d08695A29902d5673l04908L6715N4058H007i83k18011
15649b18994j9525R1713D7964d4217K1198M190B18978d49921e6506E9861J15796
15638A75657d8439C16991a25980C16170A6710a68755D8223a48244A7021b4447
15627b47416n0883B92231B2115a0486j14930j39349a11717N5462A00036k5355
15617G4681c379o5584k04285B53159C5697b18407B8523a19651n4565C3488f5108
15605a48432H116J24355A9508a36571k35857e1474p9702E9405b74436f8464j0530
$$ plain form
15594 -78994 19064 -29847 -184315 -156716 -34092 -78902 123927 -15792 -41870 227764 -60784
15582 213254 192072 91330 -112609 -23509 -168435 -116930 -61896 -60112 -250563 -177347 -108354
15571 -108354 57308 89181 -108394 76564 -47467 -302150 189963 -37289 59278 155394 110029
15560 110029 131459 10514 35163 -36489 -60384 -243367 -89895 11134 74742 52187 -55525
15548 -2145 81616 174210 -117869 1679 239141 71000 -45373 133828 232479 -155419 -27004
15536 -145850 147456 -165068 239428 -87961 -101132 175614 212740 -204240 -49949 34320
15525 18683 -42159 -20887 -207064 -100632 68917 -111800 30391 154737 87132 63980 601496
15514 601496 92732 -260944 48733 -138540 -71551 55909 -50790 -316940 -205054 -237200 52148
$$ packed form
15594g8994A9064b9847j54468K7599c4092m4810A23927a5792k6078B27764f0784
15582B13254k1182I1330a12609b3509j44926N1505N5034J784j90451P3216O8993
15571a08354E7308L1873a08394G6564d7467k54683A89963c7289E9278R6116m5365
15560A10029K1430A0514K4649c6489k3895j82983h9895A1134O3608k2555e5525
15548b145H1616R2594a17869A679K37462G1000d5373A33828R8651a55419b7004
15536a45850A47456a65068B39428h7961j3171A75614L7126b04240d9949C4320
15525A8683d2159b0887j86177a00632F8917a11800C0391J24346o7605k3152N37516
15514F01496I2732b60944D8733a38540O6989E5909e0790k66150J11886l2146E2148
$$ plain form
15502 18368 -384458 -158484 -74690 -114948 -192814 35009 -139910 -276141 114664 -259594
15491 282373 -30775 -180686 -53217 72474 33371 -161635 263871 98136 -226259 233273
15480 -197249 -65638 -115399 -98432 -346639 58171 80873 238612 16528 93411 121572 226749
15469 226749 -187592 -170580 21907 -287658 84450 36151 -516319 -87917 -79840 -321347 58981
15457 -108636 -60118 -177212 -70344 80605 81202 254588 -68037 -10627 299386 -167953 -16988
15445 -42242 12955 98954 221286 -158877 4178 -52916 -269125 -196680 265760 -55544 395876
15433 -96219 -72919 -6572 -394877 174960 88805 33614 121901 -55706 -69874 -95962 -35157
15421 51641 -75030 116658 -135390 197160 46138 -26540 97390 -89479 -368067 78830 293440
$$ packed form
15502A8368c84458a58484g4690m0258p7866C5009a39910j36231A14664b59594
15491B82373c0775j49911e3217G2474C3371a61635B63871I8136b26259B33273
15480a97249f5638m9761J6967k48207E8171K2702J57739A6528P6883K8161J05177
15469B26749a87592J7012B1907b87658H4450C6151e16319h7917Q077k41507E8981
15457a08636M8518j17094g0344H0605N97J73386f8037a0627B99386a67953a6988
15445d2242A2955Q5999J22332a58877D178e2916k16209P2445B65760e5544C95876
15433i6219K3300f572l88305A74960q6155C3614Q8287e5706j4168k6088c5157
15421E1641g5030A16658a35390A97160D6138b6540I7390h9479k78588G8830K14610
$$ plain form
15410 293440 -155134 412050 -46245 316792 58802 -130802 132305 -22353 -184949 30581
15399 99897 -206804 -32243 113331 261266 278811 48311 -283605 123039 -56400 97236 139552
15388 139552 84860 -193124 -96408 -215657 -274770 103407 57503 -197849 -77460 121961
15377 -75804 398821 306013 28843 -14650 79853 188768 -286931 151056 -244147 -18317 237980
15365 109435 -13479 159863 201935 -135492 123649 366283 -15777 -201454 87955 147071
15355 147071 248216 -247693 -47190 -117183 95483 -114908 -201883 -333653 149257 -65605
15344 33336 -2737 -52541 192359 -103359 -7640 -478861 -276383 262037 22368 111634 -111498
15332 99472 -202454 -168415 30274 38536 12929 -269776 -116007 -213865 -336779 -16041 -100867
$$ packed form
15410B93440a55134D12050d6245C16792E8802a30802A32305b2353j62596C0581
15399I9897b06804c2243A13331J47935J7545D8311b83605A23039e6400I7236M2316
15388A39552n4692a93124i6408j19249n9113A03407m5904a97849g7460A21961
15377g5804C98821r2808B8843a4650G9853J08915b86931A51056b44147a8317B37980
15365A09435a3479A59863M2072a35492A23649K42634a5777j85677H7955N9116
15355A47071J01145b47693d7190o9993I5483a14908q6975j31770A49257f5605
15344C3336b737m9804A92359a03359g640m71221K02478B62037B2368Q9266a11498
15332I9472b02454L4039C0274Q262A2929b69776a16007r7858j22914a6041q4826
$$ plain form
15321 -100867 -293165 83339 -112025 -22867 -98216 310996 -192531 140205 19815 9239 -25862
15309 -1425 -13406 183202 -67859 85093 -1739 992 -185873 138299 80898 -183479 -194730 72382
15296 81139 161763 150258 155901 98058 -139451 316061 168102 73256 -323765 3890 -50275
15284 156665 -178798 182594 -10158 -10803 97983 290991 -11176 -169895 412660 13937 288052
15273 288052 2195 -17785 -15518 214493 -186811 -16437 -366442 150073 -205642 148563 297583
15262 297583 176873 457766 -54433 101134 129459 76799 -352883 -62623 363913 156649
15251 201563 408893 580603 692849 723863 896984 191799 -99293 -116584 30220 -4184 -20970
15240 -20970 48828 193679 127920 -57997 54940 148751 -17084 -109549 -73128 -358194 51541
$$ packed form
15321a00867j92298H3339a12025b2867p5349C10996a92531A40205A9815I239b5862
15309a425j1981A83202f7859H5093a739I92a85873A38299n7401a83479j1251G2382
15296H1139Q0624j1505N643n7843a39451C16061j47959G3256c23765C890e0275
15284A56665a78798A82594a0158o45I7983J93008a1176j58719D12660A3937K74115
15273B88052B195a7785K267B14493a86811a6437l50005A50073b05642A48563J49020
15262B97583j20710K80893e4433A01134K8325n2660c52883f2623C63913A56649
15251B01563K07330J71710J12246L1014J73121A91799i9293j7291C0220d184j6786
15240b0970D8828J44851o5759e7997E4940R3811a7084r2465L6421k85066E1541
$$ plain form
15228 182648 -332719 -36468 154954 104992 -37406 -34705 204174 -41334 252529 13702 -238647
15216 -103266 177220 -259331 368662 117443 -33737 74102 118480 161135 36459 -256557
15205 170547 239270 30096 116559 267784 32799 279125 325629 77692 141641 160512 -36751
15193 186375 102868 267635 101570 -253131 22652 23897 -86435 228024 64467 61199 235502
15182 235502 283657 -150479 128962 -25545 68270 255592 -22544 254404 203838 96421 -4091
15170 93875 208444 130561 95285 -32251 88616 -152531 67102 -26928 -25054 96496 -130934
15158 23584 226870 -36643 -65583 -173036 94175 -113465 405864 21738 -253745 73102 349894
15147 349894 256078 -289989 226919 253479 91341 -134226 120432 101621 -10735 -81865 151418
$$ packed form
15228A82648c32719c6468A54954m9962c7406K701B04174d1334B52529A3702b38647
15216a03266A77220b59331C68662A17443c3737G4102M4378M2655C6459b56557
15205A70547O8723C0096Q6463J51225C2799K46326M6504G7692O3949J8871c6751
15193A86375q3507J64767A01570b53131B2652J245h6435B28024F4467l268J74303
15182B35502M8155a50479A28962b5545F8270J87322b2544B54404n0566I6421d091
15170I3875J14569p7883l5276c2251H8616a52531F7102b6928J874I6496a30934
15158B3584K03286c6643k8940j07453I4175a13465D05864B1738b53745G3102K76792
15147C49894r3816b89989B26919K6560I1341a34226A20432j8811a0735p1130A51418
$$ plain form
15135 -189717 -3546 -125910 344987 138588 -218474 159997 176952 -73889 100841 -9857 104178
15123 -4051 249799 138068 111818 28718 -323588 122742 -94618 154220 -24240 105586 -169611
15111 65403 195594 239068 52738 289616 286369 -19637 -62169 -114148 -20456 323116 326401
15100 326401 228283 254230 165276 363124 -2789 140952 238952 4263 -80289 94514 79425
15089 79425 -318075 -6225 3722 -210975 -39751 167790 263900 -79407 126640 440671 136149
15077 5166 -32248 118514 574691 -16310 158486 -8968 -125441 169324 -40523 179037 31164
15065 40449 -255419 238335 235111 290031 156952 294706 259178 231920 161175 166461 -5272
15053 332541 90376 126995 -117359 178527 -49554 -62085 371840 218739 158622 125082 173688
$$ packed form
15135a89717c546j22364C44987A38588b18474A59997J6955g3889A00841i857A04178
15123d051B49799j11731k6250B8718c23588A22742i4618A54220b4240A05586a69611
15111F5403J30191M3474E2738K36878l247a9637m2532n1979b0456C23116L285
15100C26401r8118K5947q8954J97848b789A40952R8000D263h0289I4514j5089
15089G9425c18075f225C722b10975c9751A67790R6110g9407A26640L14031A36149
15077E166c2248A18514M56177a6310A58486h968j16473A69324d0523A79037C1164
15065D0449b55419B38335l224N4920j33079J37754l5528k7258p0745N286e272
15053C32541I0376L6619a17359A78527d9554j2531C71840j53101o0117l3540M8606
$$ plain form
15042 173688 136393 32639 -148032 49580 -159004 -73331 -331205 93113 177638 392128 128955
15030 95652 151657 366836 311872 107589 -110180 -126799 400571 241777 139476 410457
15020 410457 244903 123160 -232980 177538 -54443 39566 -191461 218353 41541 349864
15010 349864 179770 -78000 61635 -94058 102310 233270 31937 180229 318642 162381
15000 162381 120708 408029 435707 132209 74071 -247460 136320 299362 101565 -129419
14989 269613 276385 71625 -82737 56490 79301 320475 400802 37401 158848 91691 333189
14978 333189 205150 39833 114411 99593 234795 66036 14685 254724 63067 84114 332428
14967 332428 -68100 423258 40829 297791 -39710 130631 384288 398186 58041 834422
$$ packed form
15042A73688l7295C2639a48032D9580a59004g3331k57874I3113Q4525K14490A28955
15030I5652N6005K15179n4964A07589a10180j6619D00571j58794j02301K70981
15020D10457j65554j21743b32980A77538e4443C9566a91461B18353D1541L08323
15010C49864j70094g8000F1635i4058A02310J30960C1937J48292J38413j56261
15000A62381m1673K87321K7678A32209n8138b47460A36320J63042A01565a29419
14989B69613O772G1625h2737E6490K2811K41174Q0327C7401J21447o7157K41498
14978C33189j28039C9833P4578j4818J35202F6036A4685K40039F3067K1047K48314
14967C32428f8100D23258D0829K56962c9710A30631K53657J3898E8041P76381
$$ plain form
14957 834422 82569 225319 372753 46657 182278 382235 -265632 37926 197422 149613
14947 149613 387068 236274 546220 -263455 8472 -29252 283002 405258 299752 201311
14937 201311 340989 257908 -210999 290725 406879 551780 107728 222611 370274 383282
14927 383282 178277 430032 582657 200988 527819 162639 339863 125685 458021 142798
14916 312780 299444 79835 36784 143406 248917 503289 227979 305975 121371 118432 65896
14905 65896 127672 294786 245423 352894 96796 244122 542212 187686 323555 189251
14895 189251 541035 480606 290138 238769 35080 287758 381544 200078 379294 5865 496308
14884 496308 177728 316238 571061 -107431 44567 -89191 323722 228564 601288 324731
$$ packed form
14957H34422H2569J42750J47434D6657J35621J99957b65632C7926J59496m7809
14947A49613K37455j50794L09946b63455H472b9252B83002J22256j05506r8441
14937B01311J39678q3081b10999B90725J16154J44901A07728J14883J47663J3008
14927C83282A78277K51755J52625B00988L26831A62639J77224A25685L32336A42798
14916C12780j3336G9835C6784J06622J05511K54372B27979P7996A21371k939n2536
14905F5896O1776J67114m9363J07471I6796J47326K98090A87686J35869j34304
14895A89251L51784o0429j90468n1369C5080K52678R3786j81466J79216E865M90443
14884D96308A77728J38510K54823a07431D4567h9191C23722r5158L72724k76557
$$ plain form
14874 324731 -69387 131611 134806 400353 389524 320549 326356 274091 172465 372391 301958
14863 301958 271060 48606 117042 371906 109427 605523 388809 -4968 549494 266675
14852 384743 323196 551959 554289 288213 216703 316125 584368 487666 712653 507486 38053
14840 329241 436664 126757 311583 -130289 372248 570890 142698 300258 173833 318132
14830 318132 235630 328431 316541 467778 281556 567153 337810 400343 248671 472826
14820 472826 618145 252082 446290 386593 403416 322770 501791 288489 169079 584946
14810 584946 379551 597421 173683 277554 564507 394956 610804 339536 746333 451303
14800 451303 162295 435186 376469 263881 425650 310527 780359 471356 308981 358910
$$ packed form
14874C24731f9387A31611L195K65547j0829o8975N807n2265j01626J99926p0433
14863C01958l0898D8606O8436K54864A09427M96096k16714d968E49494B66675
14852C84743o1547K28763K330k66076p1510R9422K68243r6702K24987k05167C8053
14840C29241J07423A26757J84826a30289C72248J98642A42698J57560j26425J44299
14830C18132q2502R2801j1890J51237j86222K85597k29343O2533j51672K24155
14820D72826J45319B52082J94208n9697J6823q0646J79021k13302j19410M15867
14810E84946k05395K17870A73683J03871K86953j69551K15848k71268M06797k95030
14800D51303A62295K72891n8717j12588J61769j15123M69832l09003j62375M9929
$$ plain form
14790 358910 418670 384044 487188 602699 593303 393555 686340 530271 484251 364219
14780 364219 736685 589782 187257 318780 432457 372684 592944 787272 299594 450169
14770 450169 591184 454001 474276 534461 355565 547976 309169 730233 800109 337923
14759 512409 624979 481918 779245 354500 952885 761807 309576 561994 581760 284867
14748 561214 494385 510123 831594 930052 217123 715078 434126 398607 794260 944204
14738 944204 404904 393136 391847 485196 1027096 -123284 571958 392932 461580 543667 481790
14727 481790 556754 582077 432044 792532 780330 448686 827646 599964 782303 391226
14717 391226 647778 916180 211149 231887 262266 745131 466388 934857 974474 855470
$$ packed form
14790C58910N9760l4626J03144J15511r396j99748K92785j56069m6020j20032
14780C64219L72466j46903A87257J31523J13677n9773K20260J94328B99594J50575
14770D50169J41015j37183K0275O0185j78896J92411k38807M21064O9876C37923
14759E12409J12570j43061K97327C54500N98385j91078C09576K52418J9766B84867
14748E61214o6829J5738L21471R8458B17123M97955k80952l5519L95653J49944
14738I44204D04904j1768j289R3349N41900a23284E71958j79026O8648Q2087o1877
14727D81790P4964K5323j50033L60488j2202l31644L78960k27682J82339l91077
14717C91226K56552K68402B11149K0738L0379M82865k78743M68469L9617j19004
$$ plain form
14707 855470 1021489 355182 898551 660790 484662 906180 574436 698714 639629 551114
14697 551114 474168 767913 834481 626491 1096726 902418 804568 802419 612045 997194
14687 997194 793313 801191 886482 810193 719050 365085 713521 642685 978463 1090228 577648
14676 577648 998049 1021035 576703 918864 494488 999205 694742 901251 822635 631423
14666 631423 1050913 548282 580575 1051795 960440 979369 734810 453411 966766 909791
14656 909791 847218 1020594 739339 921310 855781 892945 1068712 784741 1058287 773678
14646 773678 1243191 1054983 1024460 680213 957245 1221027 871903 1140615 1347570 1130944
14636 1130944 725419 727427 1261634 1088498 918903 991382 863667 789047 1303396 1324669
$$ packed form
14707H55470J66019C55182N43369k37761j76128M21518l31744J24278n9085q8515
14697E51114p6946K93745O6568k07990M70235j94308r7850k149j90374L85149
14687I97194k03881P878Q5291p6289r1143l53965L48436p0836L35778J11765n12580
14676E77648M20401K2986m44332L42161m24376N04717l04463K06509p8616j91212
14666F31423M19490n02631L2293M71220r1355J8929k44559k81399N13355n6975
14656I09791o2573J73376k81255J81971o5529L7164J75767k83971K73546k84609
14646G73678M69513j88208l0523l44247K77032K63782l49124K68712K06955k16626
14636A130944m05525K008N34207j73136j69595P2479j27715p4620N14349K1273
$$ plain form
14626 1324669 893737 938544 1099990 1196393 1042014 1485567 963432 1325818 884264 1461886
14616 1461886 1296448 1316296 1356558 1311954 1151086 1184958 1755275 1259357 1022069 1423611
14606 1423611 1503112 1192793 1566341 1265477 1134514 1422920 1217976 1548785 1570111 1149789
14596 1149789 1243065 1562138 1495361 1438730 1488246 1670854 1173403 1153252 1444765 1428027
14586 1428027 1484796 1618750 1496217 1736073 1732781 1742276 1593676 1636468 1666023 1919120 1468112
14575 1468112 1957578 1829764 1807653 1716656 1928875 1947896 1718223 1675250 1948259 2343974
14565 2343974 2274416 2038547 2353512 2099618 1698999 2324795 2311002 2707391 2601874 2472137
14555 2472137 3143465 3086210 3289542 3842438 4304413 4870335 6348045 9913093 17821120
$$ packed form
14626A324669m30932M4807J61446R6403j54379M43553n22135L62386m41554N77622
14616A461886j65438J9848M0262m4604j60868L3872N70317m95918k37288M01542
14606A423611P9501l10319L73548l00864j30963K88406k04944L30809K1326m20322
14596A149789R3276L19073o6777n6631M9516J82608m97451k0151K91513j6738
14586A428027N6769J33954j22533K39856l292R495j48600M2792K9555K53097m51008
14575A468112M89466j27814k2111r0997K12219J9021k29673m2973K73009L95715
14565B343974o9558k35869L14965k53894m00619O25796j3793L96389j05517j29737
14555B472137O71328n7255K03332N52896M61975N65922J477710L565048P908027
$$ plain form
14546 17821120 32256459 41025868 18940074 8021193 4265263 2989153 2625878 1987541
14538 1987541 1631802 1430568 1895422 1886669 1764261 1824477 1814923 2022807 1661483 1977117
14528 1977117 1847111 1982043 1898742 1784565 2072301 1945896 2287962 2019220 2098096 2122802
14518 2122802 2233122 2557710 1934571 2223359 2143017 2063985 2344251 2356174 2377606 2545200
14508 2545200 2520483 2444614 2180344 2367622 2815051 2484476 2801794 2445683 2808953 2418358
14498 2418358 2573536 2508955 2473732 2343071 2995878 2913037 3136966 3235303 2923371 2815474
14488 2815474 2808513 2915561 3233723 2766627 3164354 3151003 3120358 3364344 3313661 3669086
14478 3669086 3693371 3233482 3585652 3550108 3232215 3579052 3520490 3766273 3665959 3855888
$$ packed form
14546A7821120J4435339Q769409A8940074H021193l755930j276110l63275o38337
14538A987541l55739k01234M64854q753j22408O0216r554K07884l61324L15634
14528A977117j30006J34932q3301j14177K87736j26405L42066k68742P8876K4706
14518B122802J10320L24588o23139K88788q0342p9032K80266J1923K1432J67594
14508B545200k4717p5869k64270J87278M47429l30575L17318l56111L63270l90595
14498B418358J55178o4581l5223j30661O52807q2841K23929R8337l11932j07897
14488B815474o961J07048L18162m67096L97727j3351l0645K43986n0683L55425
14478C669086K4285m59889L52170l5544l17893L46837n8562K45783j00314J89929
$$ plain form
14468 3855888 3760136 3685676 3899251 3879357 3712114 3779686 4006282 4404279 4030376 4239194
14458 4239194 4214524 4095248 4497951 4118739 4430252 4332382 4355620 4608191 4437745 4695595
14448 4695595 4568494 5078753 4741903 5109664 5095491 4982693 4970531 4989487 5354371 5201344
14438 5201344 5435983 5681480 5534743 5490785 5574144 5683173 5651980 6002267 5935105 5575298
14428 5575298 6159757 6092571 6637172 6556590 6224017 6561028 6609232 6649407 6630749 6831614
14418 6831614 7098908 6960044 6937987 7228398 7153565 7467393 7565590 7468708 7879041 7757590
14408 7757590 8220796 8133622 8271091 8572794 8543643 8593429 9058671 8820597 9270590 9185375
14398 9185375 9380824 9404245 9491265 9827113 10037171 10171728 10287445 10566252 10670209 10951012
$$ packed form
14468C855888r5752p4460K13575j9894j67243O7572K26596L97997l73903K08818
14458D239194k4670j19276M02703l79212L11513r7870K3238K52571j70446K57850
14448D695595j27101N10259l36850L67761j4173j12798j2162J8956L64884j53027
14438E201344K34639K45497j46737m3958Q3359J09029l1193L50287o7162l59807
14428E575298N84459o7186N44601q0582l32573L37011M8204M0175j8658K00865
14418F831614K67294j38864k2057K90411p4833L13828R8197r6882M10333j21451
14408G757590M63206q7174J37469L01703k9151M9786M65242k38074M49993q5215
14398I185375J95449K3421Q7020L35848K10058J34557J15717K78807J03957K80803
$$ plain form
14388 10951012 11116281 11422171 11441798 11501197 11791956 12001804 12199712 12357792 12659415 12824781
14378 12824781 13094537 13328254 13927621 13753607 14312855 14512394 14694121 14485997 15119507
14369 15119507 15568772 15992594 16377399 16525436 16743056 17502617 17725027 17854171 18337183
14360 18337183 18743543 19342787 19468675 19788485 20921327 21081713 21760237 22389114 22773869
14351 22773869 23271933 23894250 24482372 25141144 25595454 26175497 26990675 27915071 28719108
14342 28719108 29338362 30296407 30945119 32199378 32634971 33554712 34653109 35410451 37211806
14333 37211806 37952963 39003413 40472276 41585476 42920626 44525651 45772862 46999880
14325 46999880 49198109 50536400 52577986 54099272 56408955 58307018 60497067 63028922
$$ packed form
14388A0951012J65269L05890J9627N9399K90759K09848J97908J58080L01623J65366
14378A2824781K69756K33717N99367j74014N59248J99539J81727k08124O33510
14369A5119507M49265M23822L84805J48037K17620P59561K22410J29144M83012
14360A8337183M06360N99244J25888L19810J132842J60386O78524O28877L84755
14351B2773869M98064O22317N88122O58772M54310N80043Q15178R24396Q04037
14342B8719108O19254R58045O48712J254259M35593R19741J098397P57342J801355
14333C7211806P41157J050450J468863J113200J335150J605025J247211J227018
14325D6999880K198229J338291K041586J521286K309683J898063K190049K531855
$$ plain form
14317 63028922 65286503 67292905 70306890 72979584 76157602 79189949 82234590 86129502
14309 86129502 89538942 93230497 97597629 102464442 106827061 111768035 117298128 122700341
14301 122700341 128805796 135342654 141830955 149407129 156831915 165085335 173782952 183138730
14293 183138730 192600657 202818509 213932583 225512645 237761549 250596399 264001448
14286 264001448 278048310 292510419 307299538 322753345 337959693 353387411 368976060
14279 368976060 383695854 397767635 411004894 423088102 433398221 441666528 446810996
14272 446810996 448767284 447329260 445534273 442442948 437685801 429296660 419243857 407957360
14264 407957360 395289072 380544216 365260679 349463863 333307476 316920306 300964099
$$ packed form
14317F3028922K257581K006402L013985K672694L178018L032347L044641L894912
14309H6129502L409440L691555M367132M866813M362619M940974N530093N402213
14301A22700341O105455O536858O488301P576174P424786Q253420Q697617R355778
14293A83138730R461927J0217852J1114074J1580062J2248904J2834850J3405049
14286B64001448J4046862J4462109J4789119J5453807J5206348J5427718J5588649
14279C68976060J4719794J4071781J3237259J2083208J0310119Q268307N144468
14272D46810996J956288j438024j794987l091325m757147q389141j0052803j1286497
14264D07957360j2668288j4744856j5283537j5796816j6156387j6387170j5956207
$$ plain form
14257 300964099 285888815 270860070 256586899 242923758 229486465 217178332 205816774
14250 205816774 194787499 184643266 175036539 165875454 157409221 149662206 142245687 135638471
14242 135638471 128885664 122694676 116603074 111260648 106290933 101540475 97104014 92787867
14234 92787867 88424763 85145563 81430488 78635993 75374802 72131245 69514880 66542925
14226 66542925 64066825 61678860 59258873 57145239 55586243 53261490 51438398 49825065
14218 49825065 48046402 46506855 44803035 43462623 42453355 41420782 39889626 38546106
14210 38546106 37519432 36246796 35158901 34821703 34340290 32960233 31779903 30555760
14202 30555760 29971828 29118440 28849876 27927111 27276439 26157525 25565883 24816913 24411443
$$ packed form
14257C00964099j5075284j5028745j4273171j3663141j3437293j2308133j1361558
14250B05816774j1029275j0144233r606727r161085q466233p747015p416519o607216
14242A35638471o752807o190988o091602n342426m969715m750458m436461m316147
14234I2787867m363104l279200l715075k794495l261191l243557k616365k971955
14226F6542925k476100k387965k419987k113634j558996k324753j823092j613333
14218D9825065j778663j539547j703820j340412j009268j032573j531156j343520
14210C8546106j026674j272636j087895l37198m81413j380057j180330j224143
14202C0555760n83932q53388k68564r22765o50672j118914n91642p48970m05470
$$ plain form
14193 24411443 24044723 23494414 22878553 22417631 21495608 21121045 20495671 20135654 19637886
14184 19637886 19221225 18937571 18378937 18278656 17736342 17006783 16876107 16531463 16354485
14175 16354485 15703908 15458505 15533325 15026624 14753509 14511208 13965968 13766100 13787660 13026721
14165 13026721 13221748 12726045 12799380 12596218 12545667 11963010 11898296 11452596 11280244 10925667
14155 10925667 11076947 11039440 10839533 10385090 10024594 10020298 9551966 9942009 9720890 9353279
14145 9353279 9463445 9035875 9055979 8718124 8356603 8564988 8446248 8281108 7968091 7971636
14135 7971636 7912805 7664231 7670096 7410495 7792005 7214129 7112489 7021616 7141444 7051095
14125 7051095 6922604 6276136 6445994 6795774 6840801 6591124 6320004 6195441 5969893 6027748
$$ packed form
14193B4411443l66720n50309o15861m60922r22023l74563o25374l60017m97768
14184A9637886m16661k83654n58634j00281n42314p29559j30676l44644j76978
14175A6354485o50577k45403P4820n06701k73115k42301n45240j99868K1560p60939
14165A3026721J95027m95703P3335k03162n0551n82657o4714m45700j72352l54577
14155A0925667J51280l7507j99907m54443l60496m296m68332L90043k21119l67611
14145I353279J10166m27570K0104l37855l61521K08385j18740j65140l13017L545
14135G971636n8831k48574N865k59601L81510n77876j01640r0873J19828r0349
14125G051095j28491o46468J69858L49780M5027k49677k71120j24563k25548N7855
$$ plain form
14115 6027748 6094276 6019652 5749873 6126423 5950555 5304878 5779882 5335955 5480991 5075872
14105 5075872 5505049 5385979 5044598 5213096 4786136 5312629 5096247 4760868 4947787
14096 4947787 4938348 5185268 4800250 4218261 4599595 4712466 4479557 4242314 4130958 4460307
14086 4460307 4039089 4084402 4324463 4023927 3987837 3924524 3710601 3889638 4039850 3808851
14076 3808851 3676198 3919877 4082943 3946539 3690206 3488313 3570046 3672483 3631152 3285950
14066 3285950 3461686 3352592 3398178 3433775 3221471 3256423 2961293 3242650 3189968 3487094
14056 3487094 3167325 3766544 2871650 3345815 3183722 3044420 2884772 2966476 2774477 3049696
14046 3049696 2893318 2861533 2877201 2841346 2750929 2931097 2466661 2522141 2396283 2404846 2697745
$$ packed form
14115F027748O6528p4624k69779L76550j75868o45677M75004m43927J45036m05119
14105E075872M29177j19070l41381J68498m26960N26493k16382l35379J86919
14096D947787r439K46920l85018n81989L81334J12871k32909k37243j11356L29349
14086D460307m21218M5313K40061l00536l6090o3313k13923J79037J50212k30999
14076C808851j32653K43679J63066j36404k56333k01893Q1733J02437m1331l45202
14066C285950J75736j09094M5586L5597k12304L4952k95130K81357n2682K97126
14056C487094l19769N99219q94894M74165j62093j39302j59648Q1704j91999K75219
14046C049696j56378l1785J5668l5855r0417J80168m64436N5480j25858Q563K92899
$$ plain form
14035 2697745 2722052 2885025 2836408 2883420 2731915 2648632 2365740 2539411 2698860 2217485
14025 2217485 2552000 2595874 2481628 2574543 2469888 2490413 2484910 2286790 2157689 2301663
14015 2301663 2181711 2079937 2193293 2036106 1823876 2099672 1975901 2159857 2270560
14006 2270560 1919938 2278466 1805608 2031488 2162968 1596498 1702638 1798095 1796580 1576994
13996 1576994 2022048 1975617 1796824 2204103 2380709 2010766 2713328 3583559 5292596
13987 5292596 11704490 26052202 41331144 23788849 12185833 7537088 5602721 4321109
13979 4321109 3684739 3037729 2679654 3078095 2577434 2118882 2498087 2419948 2272776 2219247
13969 2219247 1915641 1943701 1430049 1770080 1657888 1730335 2055839 1787653 1653305 1668073
$$ packed form
14035B697745K4307J62973m8617M7012j51505q3283k82892J73671J59449m81375
14025B217485L34515M3874j14246R2915j04655K0525n503j98120j29101J43974
14015B301663j19952j01774J13356j57187k12230K75796j23771J83956J10703
14006B270560l50622L58528m72858K25880J31480n66470J06140R5457j515k19586
13996A576994M45054m6431j78793M07279J76606l69943P02562Q70231J709037
13987E292596O411894J4347712J5278942j7542295j1603016m648745j934367j281612
13979D321109o36370o47010l58075L98441n00661m58552L79205p8139j47172n3529
13969B219247l03606K8060n13652L40031j12192P2447L25504k68186j34348J4768
$$ plain form
13959 1668073 1512513 1728356 2236212 1902476 1568827 1623596 1602912 1760271 1634952 1479570
13949 1479570 1100657 1577617 1457187 1451763 1586381 1389310 1412867 1400803 1759575 1580237
13939 1580237 1815231 1114273 1607536 1504246 1423849 1112276 1222006 1331702 1775790 1309031
13929 1309031 1391353 1435463 1627771 1459751 1237987 1356429 1135346 1367468 1514694 1130687
13919 1130687 1347039 1219153 1116823 1210339 1147642 1351552 1233592 1474042 1106298 1233797
13909 1233797 945280 947261 1113932 1056865 706872 1114428 1103157 1248179 1274391 1252179
13899 1252179 1043062 945113 1241806 1120104 1094691 1171431 908819 989836 920864 1138123
13889 1138123 675404 913711 920934 1330641 944225 1111163 1029210 793662 984050 817360
$$ packed form
13959A668073j55560K15843N07856l33736l33649N4769k0684J57359j25319j55382
13949A479570l78913M76960j20430n424J34618j97071K3557j2064L58772j79338
13939A580237K34994p00958M93263j03290q0397l11573J09730J09696M44088m66759
13929A309031Q2322M4110J92308j68020k21764J18442k21083K32122J47226l84007
13919A130687K16352j27886j02330R3516o2697K03910j17960K40450l67744J27499
13909A233797k88517J981J66671n7067l49993M07556j1271J45022K6212k2212
13899A252179k09117r7949K96693j21702k5413P6740k62612Q1017o8972K17259
13889A138123m62719K38307P223M09707l86416J66938q1953k35548J90388j66690
$$ plain form
13879 817360 931505 556843 653520 996973 1008093 916578 1141063 908444 910933 1050789
13869 1050789 1155550 1055577 1114745 1152121 866021 1178816 711909 1226796 450641 691444
13859 691444 1023786 1043238 1026098 445913 834733 988116 1017706 821568 956369 618638
13849 618638 797209 712807 1116258 854414 804051 583674 997611 685132 872843 733884
13839 733884 799073 782155 1008093 994437 602762 760479 1067180 832183 518678 697980
13829 697980 788403 516373 698948 593427 542731 901130 796594 617253 796736 636389
13819 636389 644101 594540 1051336 637355 540246 765813 838183 685413 924406 572175
13809 572175 1082521 283797 677713 908514 707908 903126 870551 885032 489298 748221
$$ packed form
13879H17360J14145l74662R6677L43453J1120r1515K24485k32619K489J39856
13869A050789J04761r9973N9168L7376k86100L12795m66907N14887D50641K40803
13859F91444L32342J9452j7140D45913L88820J53383K9590j96138J34801l37731
13849F18638J78571q4402M03451k61844n0363k20377M13937l12479J87711j38959
13839G33884O5189j6918K25938j3656l91675J57717L06701k34997l13505J79302
13829F97980R0423k72030J82575j05521n0696L58399j04536j79341J79483j60347
13819F36389P712m9561M56796m13981r7109K25567P2370j52770K38993l52231
13809E72175N10346B83797L93916K30801k00606J95218l2575J4481l95734K58923
$$ plain form
13799 748221 568122 544231 674781 813881 513887 678428 716280 352107 513460 693353
13789 693353 816464 794456 763106 494908 577628 472629 718690 715495 686731 781169 761404
13778 761404 457631 533635 571751 855057 571516 572699 511654 658837 859066 904389 578411
13767 578411 659724 893913 430323 452403 700313 576560 733071 805547 823104 713306
13757 713306 529816 814883 568642 612929 725061 745896 439561 659522 480573 500742
13747 500742 406758 523867 516553 243722 752286 637962 588168 370170 427942 533979
13737 533979 355781 508178 414365 232837 335693 362372 426074 563893 454730 690252
13727 690252 595650 293006 630125 643340 301420 476226 564486 647654 311707 722903
$$ packed form
13799G48221j80099k3891J30550J39100k99994J64541L7852C52107J61353J79893
13789F93353J23111k2008l1350k68198Q2720j04999K46061l195k8764R4438j9765
13778G61404l03773P6004L8116K83306k83541J183o1045J47183K00229M5323l25978
13767E78411Q1313K34189D30323K2080K47910j23753J56511P2476J7557j09798
13757G13306j83490K85067k46241M4287J12132K0835l06335K19961j78949K0169
13747E00742r3984J17109p314B43722N08564j14324m9794k17998N7772J06037
13737E33979j78198J52397r3813j81528J02856K6679O3702J37819j09163K35522
13727F90252r4602B93006L37119J3215C01420J74806Q8260Q3168C11707M11196
$$ plain form
13717 722903 746105 711162 187146 649670 543974 392221 473027 254120 139160 467932
13707 467932 191281 402714 264671 184124 404211 580811 640891 420052 408439 483112
13697 483112 566343 459709 355403 608016 361482 323341 467513 586210 538429 337057
13687 337057 593865 682015 347083 275704 443350 89821 671466 204562 416785 477093
13677 477093 216464 527888 289076 343733 435923 584393 414973 315652 593644 420625
13667 420625 72958 693967 233488 524983 42085 333517 538176 132279 423519 438206
13657 438206 201398 304624 401751 -135230 373658 141434 479689 334751 414711 519978
13647 519978 510209 314683 210647 571006 423149 -106709 459881 389648 394691 225870
$$ packed form
13717G22903K3202l4943A87146M62524j05696j51753Q0806k18907j14960L28772
13707D67932A91281K11433j38043q0547K20087J76600O0080k20839j1613P4673
13697D83112Q3231j06634j04306K52613k46534l8141J44172J18697m7781k01372
13687C37057K56808Q8150l34932p1379J67646H9821N81645B04562K12223O0308
13677D77093B16464L11424k38812N4657R2190J48470j69420r9321K77992j73019
13667D20625G2958O21009B33488K91495D2085K91432K04659A32279K91240J4687
13657D38206B01398J03226R7127a35230C73658A41434L38255j44938P9960J05267
13647E19978r769j95526j04036L60359j47857a06709D59881p0233N043j68821
$$ plain form
13637 225870 504921 -81872 481411 148612 5642 253526 145807 422016 15396 490202
13627 490202 184988 147521 186423 411124 577473 303668 321367 321346 315515 239678 487346
13616 487346 478571 166443 239224 41191 -27466 36302 441086 453201 278283 537473 132579
13604 378940 415755 106591 92780 453701 315192 29401 426218 833149 577966 330221
13594 330221 283618 421699 125674 514755 229020 -200322 224668 196553 211420 282526
13584 282526 372534 406815 263807 352742 537911 126326 324752 565845 310888 344204
13574 344204 261335 75175 157444 220520 204553 333499 298485 232121 239546 131485 115279
13563 115279 435375 407215 205956 335592 167451 295628 400011 303312 259560 351709
$$ packed form
13637B25870K79051h1872D81411A48612E642K47884j07719K76209A5396M74806
13627D90202A84988l7467L8902K24701J66349k73805J7699k1n831p5837K47668
13616D87346q775A66443P2781D1191b7466C6302M04784J2115j74918K59190A32579
13604C78940L6815A06591j3811L60921j38509B9401L96817M06931k55183k47745
13594C30221m6603J38081A25674L89081B29020b00322B24668k8115J4867P1106
13584B82526R0008L4281j43008Q8935J85169A26326J98426K41093k54957L3316
13574C44204q2869G5175Q2269O3076j5967J28946l5014o6364P425j08061j6206
13563A15279L20096k8160k01259J29636A67451J28177J04383r6699m3752R2149
$$ plain form
13553 351709 6061 233702 74056 5239 301826 134891 6308 289248 370209 216826 535260
13542 535260 503378 32702 398732 551976 28614 354613 315413 144547 561731 246361
13531 19071 198219 216409 219354 387210 152180 255195 164671 53426 251017 356574 -1229
13519 -18926 352056 275781 -14118 246224 565424 249515 532492 143244 419000 -47605
13508 372864 182056 302453 131788 -149622 -21070 408246 90898 256285 -9964 183871
13497 -586 351984 360651 242779 -150968 144991 371063 412099 -90984 415408 -440413 -21639
13485 358258 68352 397815 345457 54029 13965 457503 121624 179554 48946 62635 26989
13473 401213 4559 61985 252022 -143760 375322 217212 294969 20832 748547 111809
$$ packed form
13553C51709F061K27641G4056E239K96587A34891F308K82940Q0961j53383L18434
13542E35260l1882C2702L66030J53244B8614L25999l9200A44547M17184B46361
13531A9071J79148J8190K945J67856A52180J03015r0524E3426J97591J05557a229
13519a8926C52056p6275a4118B46224L19200B49515K82977A43244K75756d7605
13508C72864A82056J20397A31788a49622b1070D08246I0898J65387i964A83871
13497e86C51984Q667j17872a50968A44991K26072M1036i0984D15408d40413b1639
13485C58258F8352L29463n2358E4029A3965M43538A21624N7930D8946J3689B6989
13473D01213D559N7426J90037a43760C75322j58110P7757B0832P27715A11809
$$ plain form
13462 176190 246549 64122 41508 190485 204636 339031 153049 139457 116051 162559 -43304
13450 257160 601842 176557 167965 9461 146372 54149 190357 334428 -128805 -132839 13102
13438 12973 215146 48174 191802 51182 52030 264039 298852 -144226 209837 281676 523199
13427 523199 223656 450954 130070 114472 83656 313204 153072 222355 -114471 37164
13416 -146950 206702 332550 92342 277395 325741 78573 127553 327376 263873 252769 234207
13405 234207 296581 138622 553934 6208 198100 165292 377110 217147 78880 123710 208552
13394 208552 690882 60375 97878 -61214 536413 -48622 157450 132465 401714 258080
13384 258080 55555 188884 167969 125736 32735 -17863 57778 483654 -66594 386763 253467
$$ packed form
13462A76190P0359F4122k2614J48977J4151J34395A53049j3592k3406M6508d3304
13450B57160L44682A76557q592I461J36911E4149J36208J44071a28805m034A3102
13438A2973K02173D8174J43628E1182Q48K12009L4813a44226B09837P1839K41523
13427E23199B23656K27298A30070j5598l0816K29548A53072O9283a14471C7164
13416a46950B06702J25848I2342J85053M8346G8573M8980J99823o3503j1104j8562
13405B34207O2374A38622M15312F208J91892l2808K11818j59963G8880M4830Q4842
13394B08552M82330F0375L7503f1214E36413d8622A57450k4985K69249j43634
13384B58080E5555J33329k0915m2233C2735a7863E7778M25876f6594C86763j33296
$$ plain form
13373 253467 -18870 489883 229670 120793 240850 381995 362102 94156 273788 184194
13363 184194 -211738 387877 190195 80173 -78266 418102 235120 -76702 -3142 95206 74566
13352 74566 135595 166229 276485 191090 610835 459979 227188 558707 239934 122529
13342 122529 504559 561273 434364 404241 265114 222016 372520 294258 154467 190999
13332 190999 110551 76134 232457 250156 -187245 542514 84630 270233 97981 219169
13322 219169 -14669 140724 -299124 -191600 96839 185434 -63672 296892 32824 62586 257797
13311 257797 -65343 284246 66026 333717 151071 -132601 -185206 214331 59897 55897 42463
13300 42463 361499 36736 -4002 104302 127049 4517 222876 181804 43853 293085 117581
$$ packed form
13373B53467a8870D89883B29670j08877J20057J41145j9893I4156J79632q9594
13363A84194b11738C87877A90195H0173g8266D18102j82982g6702c142I5206k0640
13352G4566O1029L0634J10256q5395M19745j50856B27188L31519B39934j17405
13342A22529L82030N6714j26909l0123j39127m3098J50504p8262j39791L6532
13332A90999q0448l4417J56323J7699a87245E42514H4630J85603I7981J21188
13322B19169a4669A40724b99124J07524I6839Q8595f3672B96892C2824K9762J95211
13311B57797f5343B84246F6026K67691A51071a32601n2605B14331E9897m000j3434
13300D2463L19036C6736d002A04302K2747D517K18359m1072D3853K49232A17581
$$ plain form
13288 124398 291186 83757 -67969 164343 381279 -32272 -98968 -180880 51555 236369 45259
13276 56019 126098 -168112 190923 -166875 -9992 211366 -111398 134063 497003 191515
13265 49176 231725 225367 113259 89662 169283 -221682 81006 286770 400352 -524 143478
13253 -98021 254838 102900 -140730 318161 176593 1012 201898 132270 -55727 391205
13242 -71840 29074 169419 -53731 328173 -225184 210173 -83853 267516 -87024 -311053
13232 -311053 197646 79272 237196 48152 92841 66072 77559 256092 80799 83394 -75639
13220 162939 -214872 100206 -20867 238950 -35205 -10450 169264 445062 -161385 -22404
13209 465945 283938 -4085 21162 -85335 256283 -90112 431114 400498 40196 76698 232100
$$ packed form
13288A24398J66788H3757f7969A64343K16936c2272o6696q1912E1555J84814D5259
13276E6019P0079a68112A90923a66875i992B11366a11398A34063L62940A91515
13265D9176J82549o358j12108k3597P9621b21682H1006K05764J13582e24A43478
13253i8021B54838A02900a40730C18161j41568A012K00886o9628e5727C91205
13242g1840B9074J40345e3731C28173b25184B10173h3853B67516h7024k24029
13232c11053A97646G9272J57924D8152M4689k6769J1487J78533H0799K595g5639
13220A62939b14872A00206b0867B38950c5205a0450A69264K75798a61385b2404
13209D65945j82007d085B1162h5335B56283i0112D31114l0616D0196L6502J55402
$$ plain form
13198 232100 237421 233791 -105520 341849 -101577 406964 127407 142214 40524 433904 422759
13187 422759 -120645 -114748 53185 9536 -80600 -45234 432649 209231 -104723 70083 -147834
13175 -310381 -188051 -395282 -125252 -40618 339741 594504 91350 92225 42263 -24107 365507
13163 -248770 77336 265173 109281 -361369 248127 286547 150228 313148 -8149 -243252
13153 -243252 34773 160141 -231187 -74167 93583 217858 37606 295037 311357 137022
13142 68336 35790 -155332 56100 346467 62674 -313729 90967 -27355 -269487 313358 7740
13130 10840 122545 -159477 33850 74076 183826 200868 48222 135112 20686 272515 -171623
13118 73177 251927 -191993 37905 157858 91868 303843 196603 375269 35862 193059
$$ packed form
13198B32100N321l630a05520C41849a01577D06964A27407J4807D0524L93380j1145
13187D22759a20645N897E3185I536h0600L5366D32649B09231a04723G0083a47834
13175c10381J22330k07231a25252d0618C39741K54763I1350Q75D2263b4107C65507
13163b48770G7336J87837A09281c61369B48127L8420j36319J62920h149k35103
13153b43252C4773J25368b31187g4167I3583J24275C7606K57431J6320A37022
13142F8336l2546a55332E6100K90367F2674c13729I0967b7355k42132C13358G740
13130A0840J11705a59477C3850M0226J09750J7042D8222Q6890B0686K51829a71623
13118G3177J78750a91993C7905J19953o5990K11975j07240J78666C5862J57197
$$ plain form
13108 193059 25526 149704 123730 206245 14528 -50772 288892 124158 -66231 -129544 -101249
13097 -101249 -107970 310121 262301 148147 228285 182930 -19030 225707 -68422 -324837 205178
13085 61967 -102805 -50444 -115406 63643 342068 235996 405569 -112185 286961 217074
13075 217074 430793 55229 -111614 60540 -141676 -32664 369406 -279672 514104 34025
13064 160049 106528 -23215 11229 172647 298639 246098 -9363 60704 44411 138692 294016
13053 294016 -78125 101784 91151 183898 35175 -125301 -223410 -8988 9672 94140 402594
13042 402594 165739 48015 -249549 -62105 189378 -295888 365372 34690 92086 42380
13031 -259220 -273673 202321 128700 113810 205072 103628 -78278 80114 -117707 178752 2973
$$ packed form
13108A93059B5526J24178k5974Q2515A4528e0772B88892A24158f6231o3313K8295
13097a01249o721C10121m7820j14154Q0138m5355a9030B25707f8422k56415B05178
13085F1967a02805e0444o4962F3643K78425j06072J69573a12185B86961o9887
13075B17074K13719E5229a11614F0540a41676c2664C69406b79672E14104C4025
13064A60049n3521b3215A1229J61418J25992n2541i363F0704j6293R4281J55324
13053B94016g8125A01784j0633R2747C5175a25301r8109h988I672Q4468L08454
13042D02594A65739D8015b49549f2105A89378b95888C65372C4690N7396D2380
13031b59220j4453B02321p3621j4890R1262j01444g8278H0114a17707A78752B973
$$ plain form
13019 369512 41409 77784 -282381 168383 137688 -275131 365406 109290 172784 -95445
13008 -182111 132472 67976 18907 -59496 -12083 156672 120332 -205693 -169887 -89756 39550
12996 28780 88441 31565 69639 -260193 207791 -135433 93226 -66632 -260426 -65925 -61293
12985 -61293 -65060 -156985 184950 -26679 292693 333418 193989 132283 32125 190275 153923
12974 153923 158665 -20473 -96682 -175800 84665 361279 97453 249489 -303689 -16389 310159
12962 -163550 58397 -62811 -141401 92379 46001 -442559 -320263 61316 67487 48296 149157
12951 149157 199588 69366 58780 -122606 -137118 109716 -235988 -97145 423914 -133912
12940 -132780 -12960 101360 -73705 276986 -126444 -25766 71881 -206954 -235739 -115191
$$ packed form
13019C69512D1409L6375b82381A68383l0695b75131C65406A09290O3494i5445
13008a82111A32472o4496A8907e9496a2083A56672l6340b05693L5806Q0131C9550
12996B8780N9661C1565L8074b60193B07791a35433I3226f6632j93794f5925M632
12985f1293l767r1925A84950b6679B92693M0725j39429o1706C2125J58150l6352
12974A53923M742b0473p6209p9118H4665K76614I7453J52036c03689a6389C10159
12962a63550E8397f2811p8590I2379D6001d42559J22296F1316O171j9191J00861
12951A49157N0431F9366j0586a22606j4512A09716b35988i7145D23914a33912
12940a32780a2960A01360g3705B76986a26444b5766G1881b06954k8785a15191
$$ plain form
12929 261661 100357 134660 286644 -132998 -36533 -138924 177215 -97420 -102832 92160 246591
12918 246591 -99630 -56583 332536 -14871 -125961 -70966 24109 -118666 -53754 62225 -5787
12906 200143 227873 -41644 9154 -70369 205401 110501 -32179 50222 78809 4601 113546
12895 113546 -139378 -202426 -196657 101942 -131598 220407 -128309 -389018 306818 -110106
12884 242522 -86701 168740 67543 -15266 -40762 278343 -350657 219187 -148351 -123227
12874 -123227 96690 -26789 -31478 93950 -201626 177819 363356 -110426 177607 -3688 12550
12862 -27710 151803 -22724 -34064 -105829 95180 -106826 161813 -242433 248811 77252 51652
12851 51652 174208 -75075 -162991 7928 -109517 138708 -237145 378521 -27001 -183043 -107000
$$ packed form
12929B61661A00357L4303J51984a32998c6533j02391A77215i7420n412I2160J54431
12918B46591i9630M3047C32536a4871j11090N4995B4109a18666e3754F2225e787
12906B00143K7730d1644I154g0369B05401r4900c2179E0222K8587D601J08945
12895A13546a39378o3048N769A01942a31598B20407a28309k60709C06818a10106
12884B42522h6701A68740F7543a5266k5496B78343c50657B19187a48351K5124
12874a23227I6690b6789m689I3950b01626A77819J85537a10426A77607c688A2550
12862b7710A51803b2724j1340p1765I5180a06826A61813b42433B48811G7252k5600
12851E1652J22556g5075q7916G928a09517A38708b37145C78521b7001j56042P6043
$$ plain form
12840 -107000 -316619 134748 -150671 -73815 89397 14262 -8910 44879 63544 137628 -396604
12828 373768 141048 76966 -86069 274505 -8026 -111025 95127 -243032 -11763 -239047 -59491
12816 193382 96171 -179949 172128 -109993 108078 229035 -165983 -225476 87439 140182
12806 140182 30937 13759 303183 -96088 -141007 -94721 171033 95783 228050 -23919 -230912
12795 -230912 -128708 21174 -76093 167144 -143049 -54268 206642 -75238 57562 244098
12785 244098 178 -65287 247365 -83542 373807 -128872 -18184 -68846 -9596 81832 -40101
12773 -87842 -17940 -221999 47172 -295791 -161336 46717 16919 214658 -154934 -74275 -105782
12762 -105782 -123471 12239 151128 95566 -11399 -166215 402167 95962 -219619 -327403
$$ packed form
12840a07000k09619A34748a50671g3815H9397A4262h910D4879J8665P4084c96604
12828C73768A41048o4082h6069B74505h026j02999I5127b43032a1763k27284e9491
12816A93382I6171a79949A72128a09993A08078J20957a65983n9493H7439N2743
12806A40182C0937A3759K89424i6088m4919M6286A71033p5250J32267b3919k06993
12795b30912J02204B1174g6093A67144a43049e4268B06642g5238E7562J86536
12785B44098A78f5287B47365h3542C73807a28872a8184n0662i596H1832d0101
12773h7842a7940k04059D7172b95791J34455D6717A6919J97739a54934g4275l1507
12762a05782j7689A2239J38889n5562a1399j54816D02167I5962b19619j07784
$$ plain form
12752 -327403 -81437 -344660 -10541 101767 105320 -21024 159163 141129 108223 497691 105887
12740 155578 -35182 217448 161445 431354 -36705 103417 138432 32991 -56969 -15384 -260196
12729 -260196 -155219 -167089 103291 -68617 -293433 -82019 -202303 -105423 100319 59898
12719 59898 99617 -37494 -55604 194393 355200 -139348 -32437 223942 123550 109058 304576
12708 304576 -10203 -128184 79336 -11278 -76700 227870 353232 116564 131344 124799 118293
12697 118293 -184683 340348 -98367 58572 -123999 158981 -85369 -14918 72057 -49247 15225
12685 -136494 -72456 2140 72441 89701 253629 -89394 96294 328193 76306 309280 94478
12673 63461 110104 100460 20796 83024 17316 2505 128184 65135 28422 -144594 285899
$$ packed form
12752c27403h1437k63223a0541A01767L553b1024A59163j8034l2906L89468A05887
12740A55578c5182B17448n6003K69909c6705A03417L5015C2991e6969a5384k44812
12729b60196J04977j1870A03291f8617k24816h2019j20284R6880A00319m0421
12719E9898L9719c7494j8110A94393J60807a39348c2437B23942j00392j4492J95518
12708C04576a0203j17981G9336a1278o5422B27870J25362A16564J4780o545o506
12697A18293a84683C40348i8367E8572a23999A58981h5369a4918G2057d9247A5225
12685a36494O4038B140P0301J7260J63928h9394I6294K31899G6306K32974I4478
12673F3461M6643r644B0796O2228A7316B505J25679o3049B8422a44594B85899
$$ plain form
12661 133427 310590 238798 114587 100152 9508 -104066 -253127 -19789 51962 -135824 296844
12649 324803 421649 170452 203836 -154542 244227 132669 18192 -78440 -142986 -117410 -249086
12638 -249086 -136560 -60391 -154467 -48320 256319 384866 69016 452079 404399 410868 179954
12626 120332 403027 -48984 309069 -40268 2149 350768 247646 185671 32797 294140 122967
12614 -20772 -76436 -61698 90529 137546 -196370 359490 311132 -13479 -82898 9136 -104793
12602 -37586 430018 -68831 402498 75839 76288 41153 110533 -60473 213170 106938 209276
12591 209276 110624 -205816 243695 230444 189358 294008 105991 161868 293475 -9980 50043
12579 198063 -123637 -16651 -121567 -280693 -91320 -318116 480132 91332 190494 -226314
$$ packed form
12661A33427J77163p1792A14587j4435I508a04066j49061a9789E1962a35824B96844
12649C24803R6846A70452L3384a54542B44227j11558A8192g8440o4546K5576j31676
12638b49086J12526f0391r4076d8320B56319J28547F9016L83063m7680O469A79954
12626A20332K82695d8984C09069d0268B149L48619j03122o1975C2797K61343A22967
12614b0772n5664J4738I0529M7017a96370C59490m8358a3479o9419I136a04793
12602c7586D30018f8831D02498G5839M49l5135O9380f0473B13170j06232J02338
12591B09276r8652b05816B43695j3251m1086J04650A05991N5877J31607i980E0043
12579A98063a23637a6651j04916j59126i1320k26796D80132I1332R9162b26314
$$ plain form
12568 -218201 -411178 82318 44939 3559 52651 161252 229023 158948 226785 -226361 -55510
12556 252690 132468 130544 87374 -59504 97460 216316 -128358 -17583 41031 -166504 129133
12544 -245096 -94522 -83335 -20379 221495 144654 165673 -372145 302839 121912 -248835
12533 -239394 -272899 155891 341925 -418606 -23076 467361 290284 -49510 -13820 82796
12522 123356 -99262 -76367 -66523 104918 -2557 64557 -257556 -98786 308641 -65550 -159542
12511 -159542 203876 -122142 -47893 189294 112396 316634 75934 -132283 -509012 -2161
12500 -21689 127389 -163466 229495 222649 -130175 294890 50597 171905 -25874 -152045
12490 -152045 -20415 5672 -117479 -135817 25941 -70300 72171 103074 -133081 49641 688 -136793
$$ packed form
12568b18201j92977H2318l7379C559M9092J08601O7771p0075O7837b26361e5510
12556B52690j20222j924m3170e9504I7460J18856a28358a7583D1031a66504A29133
12544b45096i4522J1187b0379B21495p6841K1019c72145C02839A21912b48835
12533b39394l3505A55891J86034d18606b3076D67361j77077d9510a3820H2796
12522A23356i9262K2895R844A04918b557F4557b57556i8786C08641f5550r3992
12511a59542B03876a22142d7893A89294p6898K04238G5934a32283l76729b161
12500b1689A27389a63466B29495o846a30175B94890E0597J21308b5874j26171
12490a52045b0415E672a17479j8338B5941g0300G2171L0903a33081D9641F88a36793
$$ plain form
12477 26049 -159370 -47958 159655 139212 -82652 199558 -274980 94556 286024 -82001 364252
12465 59569 -115720 -56391 143171 -169702 223344 -38835 33610 75282 165400 -92085 -104403
12454 -104403 -20314 75540 -73527 218220 -242267 120039 58127 223317 -63575 239642
12443 -231732 -173649 -3337 -4271 134749 -175214 183221 77892 -114517 178364 -106855 6880
12431 -101304 333540 84856 2113 33955 190283 -38286 -196619 -351776 -225599 -99475 287537
12419 -254010 -106932 84406 19594 55258 21286 -128708 -153258 -390473 -153278 283706
12408 -358584 297078 -219841 -340749 -52144 -67588 -115880 148775 -318210 5521 -261896
12397 -70618 56501 -224277 -320821 -206555 133086 -4041 -7022 70497 56755 299270 -159687
$$ packed form
12477B6049a59370d7958A59655k0443h2652A99558b74980I4556J91468h2001C64252
12465E9569a15720e6391A43171a69702B23344c8835C3610M1672R0118i2085j2318
12454a04403b0314G5540g3527B18220b42267A20039E8127J65190f3575B39642
12443b31732N8083c337r34A34749a75214A83221G7892a14517A78364a06855F880
12431a01304C33540H4856B113L1842J56328c8286j58333j55157J26177i9475B87537
12419b54010a06932H4406A9594L5664B1286a28708k4550k37215a53278B83706
12408c58584B97078b19841j20908e2144j5444m8292A48775c18210E521b61896
12397g0618E6501b24277r6544J14266A33086d041k981G0497j3742K42515a59687
$$ plain form
12385 36972 -61260 -159051 -154567 -35347 73183 56021 -47091 32769 38273 -210574 -7440 -30033
12373 -30033 388666 115585 186946 86072 149313 -29609 167551 242842 188075 -159783 -30105
12361 -272852 -146723 49723 391787 -324498 -119175 -83566 182566 123725 -43523 134406
12350 47863 274629 -31312 -231139 -86862 -68621 150345 -99446 -44215 -377606 -332542 -141927
12338 68034 -21404 -133905 -30351 134728 -161853 50564 206482 6927 223885 113639 39219
12326 148362 151819 -14740 -18938 109622 -116787 91489 170187 -190907 28811 -87278 -176145
12315 -176145 -176413 -184181 3287 172394 257895 372139 82762 287701 -22141 -140983 -43035
12303 111605 -373450 -17846 -62656 -284351 179687 147522 134500 -49112 23340 132576 216161
$$ packed form
12385C6972f1260r7791M484c5347G3183j7162d7091C2769N504b10574g440k2593
12373c0033C88666A15585P1361H6072O3241b9609A67551P5291n4767a59783c0105
12361b72852J26129D9723L42064c24498a19175L5609A82566n8841d3523A34406
12350D7863K26766c1312j99827h6862J8241A50345i9446d4215l33391M5064a41927
12338F8034b1404j12501c0351A34728a61853E0564J55918F927K16958j10246C9219
12326A48362L457a4740m198A09622a16787I1489P8698a90907B8811h7278q8867
12315a76145k68p768C287J69107Q5501J14244H2762K04939b2141j18842d3035
12303A11605c73450a7846m4810k21695A79687l2165j3022d9112B3340J09236Q3585
$$ plain form
12292 216161 385657 215928 349107 260176 -72844 350324 -380785 246995 213847 144737
12282 144737 -160233 89354 143326 -170186 23984 162999 268390 482273 125740 436513
12272 436513 -20290 552954 31680 96880 -74136 270342 -49623 290649 33794 82918 54639
12261 54639 -357994 42625 15192 68447 -376051 136919 137196 19974 34050 -98480 273355
12249 -10024 125688 -128356 87070 -12747 163901 38376 -88364 22175 22555 67447 260725
12238 260725 60239 -361674 24953 102389 132603 331655 262266 -113402 284446 12470 115371
12227 115371 -78307 34035 312288 -90166 354960 60008 7492 142042 42883 -53023 77829
12215 195296 138466 168074 232865 44406 322844 93432 65799 169155 163112 23561 -8249
$$ packed form
12292B16161J69496j69729J33179q8931g2844C50324c80785B46995l3148o9110
12282A44737a60233H9354N3972a70186B3984J39015J05391K13883A25740L10773
12272D36513b0290E52954C1680O5200g4136B70342d9623B90649C3794M9124k8279
12261E4639c57994D2625A5192N3255c76051A36919K77A9974J4076i8480B73355
12249a0024A25688a28356H7070a2747A63901C8376h8364B2175L80M4892J93278
12238B60725F0239c61674B4953P7436L0214J99052o9389a13402B84446A2470J02901
12227A15371g8307C4035K78253i0166C54960F0008G492J34550D2883e3023G7829
12215A95296n6830K9608O4791D4406K78438I3432k7633J03356o043B3561h249
$$ plain form
12203 275072 180604 209641 -211161 14510 60599 310924 479989 461274 153160 -1212 -103203
12192 -103203 94900 15899 131492 -43353 56803 405923 140766 39237 -75074 43353 103288
12181 103288 -101822 76596 302656 99413 -212608 224074 -77839 269152 -122275 199692
12170 -40880 423193 24764 45633 233964 296138 284216 371751 -73241 52463 -26195 -19253
12159 -19253 -236488 315173 238191 11251 -175942 -104301 -61731 88146 188637 154439 85460
12148 85460 15350 -155020 54503 11218 360143 -24423 -50145 -147262 444404 -32830 -27138
12137 -27138 227650 262842 -119862 -192869 -321965 -9471 -244822 46293 157253 301002 -118044
12125 -17090 -21766 -72050 82055 -327845 -13059 -151846 134253 2457 110135 -45693 -132303
$$ packed form
12203B75072r4468K9037b11161A4510M6089K50325J69065j8715A53160a212j01991
12192a03203I4900A5899J15593d3353E6803L49120A40766C9237g5074D3353N9935
12181A03288a01822G6596K26060I9413b12608B24074g7839B69152a22275A99692
12170d0880D23193B4764K0869J88331O2174j1922Q7535g3241E2463b6195O942
12159a9253k17235C15173p6982A1251a75942P1641M2570H8146J00491l4198o8979
12148H5460A5350a55020E4503A1218L48925b4423k5722r7117D44404c2830N692
12137b7138B27650L5192a19862p3007j29096i471k35351D6293J10960J43749a18044
12125a7090m676n0284H2055c27845a3059j38787A34253B457J07678d5693q6610
$$ plain form
12114 -132303 4154 -138486 270674 -14361 63362 341040 327734 -125426 183583 -164965
12103 -118961 43239 168229 -468552 -32523 -131550 -96734 114053 -62010 6876 -43953 -175186
12092 -175186 188854 17864 69888 -7321 -243371 147482 -47854 -24186 -114192 213906 -30596
12080 81520 226540 64201 -35910 -221259 -150172 -107799 286436 280250 -19131 -181139 299135
12068 1049304 1802966 594140 383318 194424 -105295 -197809 -37763 19239 202029 151908
12058 151908 231735 38048 -109467 -16831 298803 -467544 -61201 144433 62093 -3129 -88310
12047 -88310 -353820 53235 -315546 45772 223847 -134158 52333 -141491 153156 125093
12037 125093 117372 186912 -91915 59776 -24800 8034 86575 -217147 10236 32241 -3194 1783
$$ packed form
12114a32303D154a38486B70674a4361F3362K77678j3306a25426A83583a64965
12103a18961D3239J24990d68552c2523r9027L4816A14053f2010F876d3953j31233
12092a75186A88854A7864N2024g321k36050A47482d7854K3668r0006B13906c0596
12080H1520J45020F4201c5910j85349P1087M2373B86436o186a9131j62008B99135
12068A049304P53662E94140k10822j88894a05295r2514c7763A9239J82790n0121
12058A51908P9827C8048a09467a6831B98803d67544f1201A44433F2093c129q5181
12047h8310k65510E3235c15546D5772J78075a34158E2333a41491A53156k8063
12037A25093p721O9540i1915E9776b4800H034P8541b17147A0236K2005c194A783
$$ plain form
12024 51263 -171407 -97388 -399837 -333582 57791 333016 17261 198382 23063 457 121546
12013 121546 17801 -12245 165733 -150148 -107950 173147 -222730 -72626 -81753 90574 -314202
12001 91800 109008 -381649 -57489 -28909 44301 -35707 47768 -138890 -198030 181962 -119274
11989 -146959 -282998 -257508 371389 153695 -136448 -3038 -120891 -200126 -53829 54779 -58575
11977 43500 111691 115537 -81015 60866 47690 -18129 100370 -41869 -216495 -16811 -244528
11966 -244528 -36306 1373 -186258 -453908 -139099 72435 -127122 -87846 -94041 -83772 -41541
11954 224738 272558 -351873 367464 -66635 -203082 53067 21410 -202407 -148112 237509
11943 -161035 -59493 -298361 -135164 187105 -162242 -228925 -155883 -61931 -139473 135459
$$ packed form
12024E1263a71407P4019l02449O6255E7791K75225A7261J81121B3063D57J21089
12013A21546A7801a2245A65733a50148M2198A73147b22730g2626r127I0574c14202
12001I1800J7208c81649e7489K8580D4301c5707D7768a38890n9140A81962a19274
11989a46959j36039K5490C71389A53695a36448c038j17853p9235e3829E4779e8575
11977D3500O8191L846h1015F0866j3176a8129A00370d1869j74626a6811k27717
11966b44528c6306A373a86258k67650a39099G2435a27122L9276o195J0269d1541
11954B24738M7820c51873C67464f6635j36447E3067B1410b02407N4295B37509
11943a61035e9493k38868a35164A87105a62242o6683P3042f1931p7542A35459
$$ plain form
11932 -55136 48281 -89211 -119294 -75551 -384702 -36541 182096 235432 -159280 -161495 -79791
11920 -84287 -51857 -60210 118833 48543 224716 25676 -130010 1741 52569 32893 125680
11909 125680 290401 4220 136783 54731 -151200 85272 74590 83919 153131 -284729 -138684
11897 -76783 -279402 234618 155817 39050 134337 31413 -207480 -31901 284654 -127453 -89380
11886 -89380 72829 -150155 29226 57394 125051 227838 -22719 250151 221728 176840 -18650
11874 -96392 4106 -102547 123706 -263112 -300467 195815 -33399 -452959 -77965 52634 -62014
11862 7084 273900 -89637 -229043 75647 -108043 -179905 218611 -76992 103369 126762 -2994
11850 24682 -203474 -146743 -157055 80341 147860 82865 119448 20027 57111 30380 -100567
$$ packed form
11932e5136D8281h9211l0083M3743l09151c6541A82096N3336a59280k215g9791
11920h4287L2430q353A18833D8543J76173B5676a30010A741N0828j9676R2787
11909A25680J64721D220J32563E4731a51200H5272j0682R329O9212b84729a38684
11897g6783k02619B34618p8801C9050R5287C1413b07480c1901B84654a27453L8073
11886h9380G2829a50155B9226K8168O7657J02787b2719B50151k8423m4888a8650
11874i6392D106a02547A23706b63112l7355A95815c3399m19560g7965E2634f2014
11862G084K66816h9637j39406G5647a08043p1862B18611g6992A03369K3393b994
11850B4682b03474N6731j0312H0341O7519o4995L6583B0027L7084k6731a00567
$$ plain form
11838 94320 -9095 -51966 233667 193100 192133 -171047 -5930 68645 100346 42387 -147171 -133268
11826 -133268 -45364 -312155 -95775 144204 201520 131630 -251242 -178193 -144677 -192317 -111502
11815 -111502 67877 -168171 -86297 76294 13209 -16948 152110 -412587 -289510 69174 -324004
11803 -53347 188255 -229687 57842 17031 -337239 -191394 -182645 109730 215715 183396 -19789
11791 -153443 153388 -115131 -271686 304755 -125703 182553 -54586 128650 -89692 152878
11780 56474 -2515 -2952 -39986 234590 125524 267343 195369 8558 244264 -290787 173301
11768 305014 -438562 -59533 -492948 -137159 -135338 -160819 -129648 217025 -181242 -169573 292147
11756 -58501 80136 -97198 -57698 -36797 106600 -67766 98253 39604 98847 -29703 224849
$$ packed form
11838I4320i095m2871B33667m0567r67a71047e930F8645L1701D2387a47171J3903
11826a33268d5364k66791i5775A44204N7316o9890b51242P3049L3516m7640Q0815
11815a11502F7877a68171Q1874G6294A3209a6948A52110d12587J23077F9174c24004
11803e3347A88255b29687E7842A7031c37239J45845Q749A09730J05985l2319a9789
11791a53443A53388a15131j56555C04755a25703A82553e4586A28650h9692A52878
11780E6474b515m37l7034B34590j09066J41819p1974H558K35706b90787A73301
11768C05014d38562e9533m33415a37159J821k5481L1171B17025a81242J1669B92147
11756e8501H0136i7198L9500K0901A06600f7766I8253C9604N9243b9703B24849
$$ plain form
11744 91606 -66126 -106539 -28642 398678 -221515 -213238 46651 158650 -135065 3368 -149643
11732 181163 -44012 -71306 -78136 -24277 245310 -11522 47447 146922 289340 -3148 -130702
11721 -130702 119202 107966 322871 67649 27926 -66397 119588 23712 65178 -86939 -14062
11709 -176579 308734 -140999 -214344 126856 -190277 168857 473973 -378420 117222 -56234
11698 -320158 87682 37266 59274 195987 268390 -6867 230284 -80276 217113 264845 21996
11686 160339 27777 -22981 24196 -340435 -157144 212432 -34413 -62815 60166 113036 364279
11675 364279 -273400 131056 41888 153256 68562 21823 -75730 55713 82999 -533018 -22420
11663 70506 -293777 41687 -15903 28519 -17260 -54599 120125 -155837 304861 295646 443800
$$ packed form
11744I1606f6126m0413b8642C98678b21515Q277D6651J11999a35065C368a49643
11732A81163d4012k7294o830b4277B45310a1522D7447R9475J42418c148j27554
11721a30702A19202j1236K14905F7649B7926f6397A19588B3712M1466h6939a4062
11709a76579C08734a40999p3345A26856a90277A68857L05116c78420A17222e6234
11698c20158H7682C7266K2008J36713P2403f867B30284h0276B17113M7732B1996
11686A60339B7777b2981B4196c40435a57144B12432c4413k8402F0166N2870K51243
11675C64279b73400A31056D1888J11368F8562B1823g5730E5713K7286e33018b2420
11663G0506b93777D1687a5903B8519a7260l7339A20125a55837C04861r215J48154
$$ plain form
11652 443800 166799 59033 141197 -33378 -128322 -9733 284600 75991 -182077 52885 -199583
11640 -193034 34086 -401699 -145874 -144838 366468 72548 -145840 350529 256299 316320 -84102
11628 33316 196802 355885 68764 99190 -13931 257326 143577 -398302 88728 -127122
11617 -21378 53224 -29576 -111714 231095 -69758 69311 212798 -54448 227562 222956 87425
11605 53725 -165395 32414 -196891 -91353 -30161 167827 127104 253573 -19586 -121469 -14181
11593 76784 -81720 206219 111760 100130 -12845 -55390 -272129 415785 29486 269699 -137858
11581 103717 -92105 -29386 -59002 -110045 244921 -5579 171989 -223191 -116139 84554 125533
11570 125533 25739 -408864 -194933 -5653 447323 114106 3665 201328 -2427 149753 -89423
$$ packed form
11652D43800A66799E9033Q2164c3378r4944i733B84600G5991a82077E2885a99583
11640a93034C4086d01699a45874J036C66468G2548a45840C50529r4230O0021h4102
11628C3316J63486J59083F8764L0426a3931B57326j13749c98302H8728a27122
11617b1378E3224b9576q2138B31095f9758F9311J43487e4448B27562m606H7425
11605E3725a65395C2414a96891i1353c0161A67827m0723J26469a9586j01883a4181
11593G6784h1720B06219r4459j1630a2845m2545k16739D15785B9486K40213a37858
11581A03717i2105b9386k9616n1043B44921e579A71989b23191J07052H4554M0979
11570A25533B5739d08864a94933e653D47323A14106C665J97663b427A49753h9423
$$ plain form
11558 -25348 -51562 -120426 3536 -77304 -62219 -120364 113287 -50749 65992 -190153 -173050
11547 -173050 -192723 65937 193473 197584 -189653 178918 -239658 -248343 192497 -109017 -5590
11535 -263723 210004 68004 -55322 165446 -20581 -45285 -73202 142459 373156 212102
11525 212102 170427 -147867 140002 -241693 219993 -355624 -111878 719047 418584 351682
11515 351682 108927 176506 80302 112313 56095 238591 -137580 377429 76801 -63637 360568
11503 -65235 366831 196366 -136451 338872 -113605 -249320 156738 31664 -44783 6078
11492 481481 308827 59896 14094 -173601 36462 606589 25674 312729 391434 318615 263954
11481 263954 -302129 -20223 64662 335693 235893 206068 127611 34601 242081 172266 248348
$$ packed form
11558b5348k6214o8864C536g7304J5085n8145A13287e0749F5992a90153J7103
11547a73050j9673F5937J27536M111a89653A78918b39658q685A92497a09017e590
11535b63723B10004F8004e5322A65446b0581k4704k7917A42459K30697j61054
11525B12102m1675a47867A40002b41693B19993c55624a11878G19047l00463o6902
11515C51682A08927O7579H0302L2011E6095J82496a37580C77429G6801f3637C60568
11503f5235C66831j70465a36451C38872a13605j35715A56738C1664d4783F078
11492D81481j72654E9896A4094a73601C6462N70127B5674K87055P8705p2819n4661
11481B63954c02129b0223F4662K71031r9800k9825p8457C4601K07480o9815P6082
$$ plain form
11470 248348 620686 -156098 362500 66207 280946 76842 -258078 213074 -249077 396440
11459 -44429 -3518 101573 -114142 29161 290943 497046 -128907 39448 197510 148632 -413316
11447 210233 240509 150485 -37078 107976 101620 142153 83077 33782 283772 6335 171729
11436 171729 240 10288 -63804 -66192 -32916 -92380 38811 52807 59455 -11070 -147720 92727
11423 -381078 93087 -241077 -255591 102859 177523 205243 -176196 112014 97952 -33936 106896
11411 -167644 186767 171332 -221666 -336253 -282140 21212 -240350 115362 -173892 -139682
11401 -139682 -181046 95904 80110 310770 -43606 -37050 24926 475411 -81768 -176016 -9336
11389 -123731 -227792 -320705 -57724 -163245 -37331 -1300 -71981 44284 56322 176352 255913
$$ packed form
11470B48348L72338a56098C62500F6207K14739G6842b58078B13074b49077C96440
11459d4429c518A01573a14142B9161K61782K06103a28907C9448J58062m8878d13316
11447B10233L0276r0024c7078A07976o356M0533n9076C3782K49990F335J65394
11436A71729B40J0048f3804k388c2916n9464C8811J3996O648a1070j36650I2727
11423c81078I3087b41077j4514A02859P4664K7720a76196A12014j4062c3936A06896
11411a67644A86767j5435b21666j14587N4113B1212b40350A15362a73892L4210
11401a39682m1364I5904j5794K30660d3606O556B4926M50485h1768r4248i336
11389a23731j04061r2913e7724j05521c7331a300p0681D4284J2038J20030P9561
$$ plain form
11378 255913 107442 -255049 32272 85535 -160163 -251993 -121756 332727 123457 -54021
11367 145782 47148 267028 190479 36316 108926 438864 -437366 243412 94069 -198704
11356 -18268 -236514 150600 53112 27563 -135537 -177113 114081 4846 283872 247911 -6829
11344 142198 228250 69626 -189960 182896 -42929 -324263 143749 -17353 295417 -934 -79005
11333 -79005 131117 -4163 -5464 -87211 38013 -59366 125264 -53081 264701 -85865 48183
11321 -52614 -180087 137352 -76477 -144056 15290 20662 -265369 36806 139497 192977 366330
11310 366330 -118906 221335 -24116 -132756 -200991 104139 33500 -203754 -79013 -8862 114463
11298 16502 -11557 -92299 -38763 -325514 -58591 -45443 -184758 -226722 19038 -15767 82712
$$ packed form
11378B55913A07442b55049C2272N3263a60163r1830a21756C32727A23457e4021
11367A45782D7148K19880p6549C6316P2610L29938d37366B43412I4069a98704
11356a8268k18246A50600E3112k5549a35537m1576A14081D846K79026l5961f829
11344A42198Q6052F9626a89960A82896d2929k81334A43749a7353B95417i34p8071
11333g9005A31117d163j301q1747C8013e9366A25264e3081B64701h5865D8183
11321e2614j27473A37352g6477o7579A5290N372b65369C6806J02691N3480J73353
11310C66330a18906B21335b4116j08640o8235A04139C3500b03754g9013h862A14463
11298A6502a1557q0742c8763k86751e8591J3148j39315m1964A9038a5767H2712
$$ plain form
11286 38086 -31251 -140732 126704 -389128 2054 -97452 -182082 17865 -112127 51149 364531
11275 364531 215109 -152065 -103777 -229110 -310767 40058 34630 -115591 261156 -26546 -48440
11264 -48440 -151061 -234955 -419491 -158597 344189 38705 -129603 40179 101057 -216266
11253 -115511 15105 -124444 -58107 -136207 187673 17369 -42972 -328647 -102854 120785
11242 -236495 -93213 -30356 -298626 -9076 -43136 -405156 -202167 -317946 -112110 -11313 265680
11230 455103 -246980 -31770 -283975 -188843 23359 164117 -258959 -176996 -25823 -87290 273065
11218 88115 13519 320426 -5371 104591 27078 9869 -221074 -165738 -426018 -5399 51207
11206 121329 -185235 159964 7861 -124949 -563866 37422 -330141 -493769 -13972 -60572
$$ packed form
11286C8086c1251j09481A26704c89128B054i7452q4630A7865a12127E1149L13382
11275C64531j49422a52065M8288j25333q1657D0058n428a15591B61156b6546k1894
11264d8440j02621q3894j84536a58597C44189C8705a29603D0179O0878b16266
11253a15511A5105a24444e8107p8100A87673A7369d2972k85675a02854A20785
11242b36495i3213c0356k68270i076l4060l62020b02167j15779a12110a1313B65680
11230D55103b46980c1770k52205R5132B3359J40758b58959Q1963b5823o1467B73065
11218H8115A3519L06907e371A04591B7078I869b21074N5336k60280e399E1207
11206A21329a85235A59964G861a24949m38917C7422c30141j63628a3972m6600
$$ plain form
11196 -60572 -247869 -148618 33032 -92061 38341 -160347 -125298 170314 -56341 283429 -25847
11184 66884 150266 -145037 162726 -149304 4041 -80505 -74398 -84259 -172596 79393 -102912
11172 -139204 -166497 -204492 -407847 323087 -17263 51877 -270336 -149079 -81775 106226
11161 -233473 190055 -258787 -115336 6760 -307679 -172248 -51626 -84906 173930 -272977
11150 41340 171237 154544 -201388 -229672 -133013 -162147 199361 -56001 285911 -117541 -76981
11139 -76981 73818 38070 -47999 -131744 -35437 515458 -10566 304323 -180886 182644 256287
11128 256287 -6340 205838 143038 98238 261685 -34739 51651 89930 138803 85833 -80844
11116 190531 -38384 1021 503453 -20439 326302 -113026 332712 39747 -513036 130449
$$ packed form
11196f0572j87297R9251C3032i2061C8341a60347L5049A70314e6341B83429b5847
11184F6884Q3382a45037A62726a49304D041h0505O107r861q8337G9393a02912
11172a39204k7293l7995k03355C23087a7263E1877b70336J21257O7304A06226
11161b33473A90055b58787a15336F760c07679J35431e1626l3280A73930b72977
11150D1340J29897j6693b01388k8284R6659k9134A99361e6001B85911a17541M0560
11139g6981G3818l5748d7999q3745c5437E15458a0566C04323a80886A82644P3643
11128B56287f340B05838o2800m4800J63447c4739E1651L8279M8873n2970h0844
11116A90531c8384A021N02432b0439C26302a13026C32712C9747e13036A30449
$$ plain form
11105 236027 -14941 251196 286617 432489 446557 211212 341237 130698 131914 358990
11095 358990 95195 358154 112083 128197 636244 952 148303 194339 135119 206530 42293
11083 379868 332354 146425 281276 282692 503403 150804 268168 150519 293539 461628
11073 461628 272579 124985 258698 517545 460932 299125 503216 341272 471029 684986
11063 684986 578377 517361 640735 338629 617113 737952 644946 1023051 353875 977323
11053 977323 336006 828445 658500 639290 982463 665951 538653 736247 1095250 865249
11043 865249 658893 780496 743307 791144 680044 653701 967156 401022 954731 655032
11033 655032 606230 852766 1040848 384339 848595 764890 778778 711866 827903 734834
$$ packed form
11105B36027a4941B51196L5421J45872J4068B11212J30025A30698J216K27076
11095C58990I5195K62959A12083J6114N08047I52J47351M6036n9220P1411D2293
11083C79868m7514A46425J34851J416K20711A50804J17364j17649J43020J68089
11073D61628j89049A24985J33713K58847n6613j61807K04091j61944J29757K13957
11063F84986j06609o1016J23374l02106K78484J20839r3006L78105C53875O23448
11053I77323C36006M92439j69945j9210L43173l16512j27298J97594L59003k30001
11043H65249k06356J21603l7189M7837j11100k6343L13455D01022N53709k99699
11033F55032m8802K46536J88082C84339M64256q3705J3888o6912J16037r3069
$$ plain form
11023 734834 484524 729272 929716 437479 534399 752237 508720 517454 643611 679303
11013 679303 680694 484620 937638 1074454 731425 542049 367911 621182 627762 749694
11003 749694 856216 689643 765920 665969 1060648 870358 750767 594920 852317 694609
10993 694609 787796 783568 816450 695453 581331 1105202 962962 953327 1384031 1062048 1295677
10982 1295677 920974 1355187 1608671 1624125 1875852 2280620 2393071 2803928 3055175 3098057
10972 3098057 3297795 3219773 3069445 2607518 2349023 2091025 1745175 1816565 1539218 1411495
10962 1411495 1585899 1847110 1302433 1638620 1525277 960991 982132 1314246 1188614 948310
10952 948310 542344 510878 796676 766587 365160 804757 688473 679152 66936 71092 543318
$$ packed form
11023G34834k50310K44748K00444D37479R6920K17838k43517Q734J26157L5692
11013F79303J391j96074M53018J36816l43029j89376j74138K53271O580J21932
11003G49694J06522j66573P6277r9951L94679j90290j19591j55847K57397j57708
10993F94609R3187m228L2882j20997j14122N23871j42240r635M30704l21983K33629
10982A295677l74703M34213K53484J5454K51727M04768J12451M10857K51247M2882
10972C098057J99738p8022j50328m61927k58495k57998l45850P1390k77347j27723
10962A411495J74404K61211n44677L36187j13343n64286K1141L32114j25632k40304
10952I48310m05966l1466K85798l0089C65160M39597j16284r321F6936M156M72226
$$ plain form
10941 543318 42367 21033 246825 68933 359372 197532 547694 -3594 -42433 -65773 -127436
10930 -127436 332928 211699 66539 469462 301716 -157701 -10321 31543 -34181 48107
10919 40711 334283 203489 -142071 13011 -30508 -410476 -224154 116435 -92421 -214207
10909 -214207 -68327 -97528 145379 -81639 -506770 134120 27501 -222220 -238913 257383
10898 70272 -77227 -74069 2488 33491 243194 4216 -204191 -40193 -90246 -131856 -178451 -102030
10886 -102030 -143786 -65045 -68359 78876 57869 69361 198110 -118382 -128559 -228856 -301090
10875 -301090 -88883 51097 -471260 -15774 87979 143452 -240511 -136206 -117118 371591 191953
10864 191953 128131 -217801 -123607 42856 -4073 96834 146037 86342 -18591 156234 82458
$$ packed form
10941E43318D2367B1033K25792F8933K90439j61840L50162c594l8839k3340o1663
10930a27436C32928j21229F6539M02923j67746a57701a0321C1543c4181D8107
10919D0711K93572j30794a42071A3011c0508l79968J86322A16435i2421j21786
10909b14207f8327k9201A45379h1639m25131A34120B7501b22220j6693B57383
10898G0272g7227L158B488L1003K09703D216b04191d0193n0053m1610m6595P6421
10886a02030m1756f5045l314G8876k1007J1492J28749a18382j0177j00297p2234
10875c01090h8883E1097d71260a5774H7979N5473b40511J04305J9088C71591j79638
10864A91953o3822b17801R4194D2856d073I6834M9203n9695a8591A56234p3776
$$ plain form
10853 82458 -28693 528413 -47066 -18534 175351 -27385 117663 16449 63200 -358725 -325860
10842 -325860 -279384 195397 -25811 -48497 -37280 141273 -118341 100138 -159770 -205830
10832 -205830 -140500 -2796 -294424 38418 -36272 -290948 -118636 -132469 -16879 -8131 20849
10820 -314166 105683 -236590 -37434 -104006 -225846 282442 218134 -214641 363379 -112701
10809 89175 -734 -64067 -208706 -150674 -154640 -85975 -420116 139524 171584 26326 123429 -54392
10796 -24492 -331413 85176 27746 367913 -159484 -210870 20779 -3387 95678 -156711 121213
10784 -18888 111950 -239837 -157423 -130505 206453 -84682 -310821 -166844 -32496 93320 -81194
10772 276936 145763 -137495 -70043 -80530 -79198 120668 128672 83004 173022 232092 -38395
$$ packed form
10853H2458b8693E28413d7066a8534A75351b7385A17663A6449M6751c58725L2865
10842c25860M6476A95397b5811k2686J1217A41273a18341A00138a59770m6060
10832b05830O5330b796k91628C8418c6272k54676a18636j3833a6879h131B0849
10820c14166A05683b36590c7434o6572j21840B82442o4308b14641C63379a12701
10809H9175g34o3333j44639N8032l966O8665l34141A39524L2060B6326R7103e4392
10796b4492l06921H5176B7746L40167a59484n1386B0779c387I5678a56711A21213
10784a8888A11950b39837Q2414K6918B06453h4682k26139J43977c2496I3320h1194
10772B76936j31173a37495O7452j0487J332A20668Q004m5668R0018N9070c8395
$$ plain form
10760 -160165 -58874 -165756 266764 -196021 88837 -290108 -5685 151305 113005 321897
10750 321897 -131039 69077 -37001 46019 131481 -207111 -218955 -148781 12222 -33445 42191
10738 45721 -2824 -154228 32656 172644 -393741 -80776 198340 57994 -263717 82570 -270892
10726 69580 -66470 -225991 30670 -155620 -177415 -219487 -186304 168816 -93519 -136893 -94158
10715 -94158 214377 -118692 -319270 125320 -325139 107722 50087 -228928 -89603 7640
10704 -11656 7880 -128561 232620 52995 -4300 242887 73392 -96813 -231244 -70692 2747
10692 -40177 -121246 48594 -144259 -146228 -72607 96511 117302 56604 53570 282243 -308154
10680 41734 -58487 -18103 -33946 -117576 182118 -115888 90140 -14972 -136088 -161043 -267977
$$ packed form
10760a60165e8874j06882B66764a96021H8837b90108e685A51305l8300K08892
10750C21897a31039F9077c7001D6019Q5462b07111j1844P0174A2222c3445D2191
10738D5721b824j51404C2656J39988c93741h0776A98340E7994b63717H2570b70892
10726F9580f6470j59521C0670a55620k1795m2072L3183A68816i3519m3374M2735
10715i4158B14377a18692k00578A25320c25139A07722E0087b28928h9603G640
10704a1656G880a28561B32620E2995d300B42887G3392i6813j34431g0692B747
10692d0177q1069D8594a44259j969g2607I6511K0791E6604l034K28673c08154
10680D1734e8487a8103j5843q3630A82118a15888I0140a4972j21116k4955j06934
$$ plain form
10669 -267977 111730 70731 175610 -153232 -83168 -46788 195680 -220476 -167751 -233520
10659 -233520 -195626 309167 152337 223752 21937 -262895 -158186 -77149 -164528 -78301 -108530
10648 -108530 155715 -18965 78314 287018 -359388 -94126 -189427 -303795 8304 54896 -95453
10636 -204790 217178 84093 8647 -245952 -243409 180259 171847 36750 -10190 -420598 -63929
10624 -297644 -23578 -6245 -85715 -152707 -183651 -165428 153463 206732 -125188 -79796 93750
10612 -73710 128263 19851 92397 -140706 -305854 -219885 56407 17993 -234935 319281 150194
10600 54202 -150873 321702 289590 70341 38964 -101476 -312912 -78025 -27546 -219121 -62562
10588 620870 550 276307 -91692 -21593 72692 14079 -242559 -51971 -420794 81499 147739
$$ packed form
10669b67977A11730m0999J04879a53232P0064L6380A95680b20476N2725o5769
10659b33520L7894C09167A52337P1415B1937b62895J04709g7149q7379g8301l0229
10648a08530A55715a8965G8314K08704c59388i4126r5301j14368H304M6592i5453
10636b04790B17178H4093H647b45952K543A80259q412C6750a0190m10408f3929
10624b97644b3578f245p9470o6992l0944J8223A53463N3269a25188M5392I3750
10612g3710A28263A9851P2546a40706j65148Q5969E6407A7993b34935C19281A50194
10600E4202a50873C21702l2112G0341l1377a01476k11436g8025b7546j91575f2562
10588F20870E50K75757i1692b1593G2692A4079b42559e1971l68823H1499O6240
$$ plain form
10577 147739 -146136 -81423 -280103 -251119 -25716 -119037 154625 93427 -115431 -231628
10567 -231628 22022 -3276 96563 -60183 178733 -206737 133245 -34824 13987 -84081 34956
10555 102655 91383 -63643 -160117 -48420 313018 -172195 -962 -276393 157102 219019 51831
10543 -618357 33652 44693 1529 -259180 -140745 -63413 -116696 -272782 165777 -130612 -204699
10532 -204699 260690 7484 67773 -101727 293955 -61982 -275009 -158941 -187884 111008
10521 -281850 -263270 -75811 341336 -192909 -210097 33476 -272436 -212876 -29622 37164 254320
10510 254320 162480 -78226 78499 -173434 284481 87852 13024 199928 189429 24084 -41981
10498 2112 -62993 -444978 78671 26791 -157901 -124800 -215851 16060 99030 -207997 22846
$$ packed form
10577A47739a46136O4713j98680K8984b5716r3321A54625o1198a15431j16197
10567b31628B2022c276I6563f0183A78733b06737A33245c4824A3987h4081C4956
10555A02655j1272f3643r6474d8420C13018a72195i62k75431A57102O1917E1831
10543f18357C3652J1041A529b59180J18435f3413n3283j56086A65777a30612p4087
10532b04699B60690G484O0289a01727B93955f1982k13027J16068k8943A11008
10521b81850J8580g5811C41336a92909j7188C3476b72436N9560b9622C7164K17156
10510B54320r1840g8226G8499a73434B84481H7852A3024J86904j0499B4084d1981
10498B112f2993l81985G8671B6791a57901L3101r1051A6060Q2970b07997B2846
$$ plain form
10486 79815 497962 208231 6399 715003 327821 333511 169539 351216 477872 240541
10476 240541 -26915 -148756 -328852 44600 30494 -280095 32971 -19489 -121344 176901
10465 75142 -267877 205774 -9656 -7892 52184 93785 -70270 117236 -135588 435769 -41674
10453 -31491 -179887 -63220 419038 25115 -34810 11509 201739 157757 6661 11025 15666 2274
10440 266142 124102 65415 -164970 5169 33203 -38771 204290 32725 -368432 22599 71632
10429 71632 -199356 12814 -198848 -44087 -128506 433370 -179670 -43957 65095 48478 106176
10418 106176 94293 -220394 259492 193617 191450 364410 -33606 -501643 -90454 98163 -45247
10406 -57707 -178503 267536 -260095 22751 347251 55605 407485 -32908 203010 260641
$$ packed form
10486G9815M18147B08231F399P08604C27821N690j63972J81677J26656k37331
10476B40541b6915j21841j80096D4600j4106b80095C2971a9489j01855A76901
10465G5142b67877B05774i656J764E2184M1601g0270A17236a35588D35769d1674
10453c1491j48396f3220D19038B5115c4810A1509J90230m3982F661M364M641B274
10440B66142A24102n8687a64970E169K8034c8771B04290C2725c68432B2599M9033
10429G1632a99356A2814a98848d4087q4419D33370a79670d3957F5095j6617N7698
10418A06176j1883b20394B59492o5875k167J72960c3606m68037i0454I8163d5247
10406e7707j20796B67536b60095B2751L24500E5605L51880c2908B03010N7631
$$ plain form
10396 260641 101161 231629 178367 -87940 -568231 22722 94914 423246 -16069 185395
10385 -20327 -66119 304750 184135 -86488 127380 137345 443046 78594 233399 369090 197080
10374 197080 263836 -22309 339223 398539 494357 507061 354053 349492 524920 675763 461442
10363 461442 398574 59353 37042 302582 535060 46605 164542 -75854 94469 660267 230853
10351 461160 255487 528761 261644 71897 219599 301427 293248 142898 320931 13696
10340 -47538 233535 127603 60820 336014 232893 108115 265506 50141 -9886 132601
10329 -75123 -48011 -172646 107698 464259 134618 -184660 94002 493872 -109185 269806
10318 161057 -21354 279488 49526 199398 206265 104917 -158693 -140561 -197460 -151400 -253742
$$ packed form
10396B60641A01161J30468n3262h7940m80291B2722P2192L28332a6069A85395
10385b0327m5792C04750j20615h6488A27380R965L05701G8594J54805J35691j72010
10374A97080O6756b2309C39223N9316R5818J2704j53008m561J75428J50843k14321
10363D61442o2868E9353k2311K65540K32478D6605J17937g5854I4469N65798B30853
10351D61160k05673K73274B61644G1897J47702Q1828q179A42898J78033A3696
10340d7538B33535j05932F0820K75194j03121A08115J57391E0141i886A32601
10329g5123K7112j24635A07698L56561A34618a84660I4002L99870a09185B69806
10318A61057b1354B79488D9526J49872O867j01348a58693J8132n6899M6060j02342
$$ plain form
10307 -253742 -16992 -11580 42187 36188 -126758 -130268 491600 -439512 -106864 -179477 152897
10295 -123577 -182991 -22815 -314355 -327430 -139855 129477 -276708 -140920 36533 -17507
10284 362429 -2169 -132513 -404767 -31489 -420473 -243982 166179 -106083 -301605 -62793
10273 39498 -66042 220347 72003 120734 -203221 563671 35803 -444773 41532 -133984 -139465
10262 -139465 371938 439231 265490 261890 88473 151674 9271 7743 148707 -90113 -328355
10251 -328355 -193856 213771 -143818 160441 -28618 211415 65597 -136051 -368362 -47955
10240 101050 259430 -75704 -38688 -67884 42473 195025 -133699 160175 -2047 165961 -59572
10228 124528 -233276 -11369 16183 33991 -19015 -193917 154219 124810 -211487 -16247 -27978
$$ packed form
10307b53742a6992N412D2187n999a26758l510D91600d39512a06864p2613A52897
10295a23577n9414b2815k91540j3075a39855A29477b76708J35788C6533a7507
10284C62429b169j30344k72254c1489l88984J76491A66179a06083j95522f2793
10273C9498f6042B20347G2003M8731b03221E63671C5803d44773D1532a33984n481
10262a39465C71938O7293j73741l600H8473O3201I271j528J40964i0113k38242
10251c28355J34499B13771a43818A60441b8618B11415F5597a36051k32311d7955
10240A01050J58380g5704L7016k9196D2473J52552a33699A60175b047A65961e9572
10228A24528b33276a1369A6183J7808a9015j74902A54219k9409b11487a6247j1731
$$ plain form
10217 -27978 27812 -416684 48948 -354494 -161356 -80097 60470 -495754 -255328 -72609 26308
10205 -71590 71654 -69937 -283595 133593 242524 66722 81267 76051 7692 -493923 47295
10193 -56682 -171343 37799 -34736 -235054 179671 194192 -3076 123243 272473 151697 -78996
10181 235369 -14262 -7741 -61188 -33619 -119870 -100856 -83684 214796 -57739 -172951 -309655
10170 -309655 -54475 -101559 54259 104222 209832 51248 166325 153644 -31205 -87343 -214594
10159 -214594 -113477 74069 -39642 -193350 -18628 -182711 -392911 105930 78089 -113787
10148 125865 60845 34852 80294 -53968 77179 159243 -220128 37041 -217164 181750 83059
10136 -183030 -111324 -272840 -10026 32804 -304706 -141475 278155 15378 -52258 -81444 134
$$ packed form
10217b7978B7812d16684D8948c54494a61356h0097F0470d95754K40426g2609B6308
10205g1590G1654f9937k13658A33593J08931F6722J4545n216G692d93923D7295
10193e6682j14661C7799c4736k00318A79671J4521c076A23243J49230j20776g8996
10181B35369a4262O521n3447K7569q6251J9014J7172B14796e7739j15212j36704
10170c09655e4475m7084E4259M9963J05610E1248J15077j2681c1205n6138j27251
10159b14594J01117G4069c9642j53708a8628j64083k10200A05930k7841a13787
10148A25865F0845k5993M5442e3968G7179Q2064b20128C7041b17164A81750H3059
10136a83030P1706j61516a0026C2804c04706a41475B78155A5378e2258k9186A34
$$ plain form
10124 -276832 164851 -284709 -96459 -59166 -225417 -159165 -116766 4978 59502 220333 162485
10113 162485 102427 23701 -87392 -8157 -210044 98873 -37529 -17668 -164994 -210726 -90688
10101 99771 58546 56144 -3509 -345351 120598 49852 247945 55676 7211 77385 44931 -219410
10088 -115728 -377990 12772 268081 -255225 -158884 72717 -384891 179880 -147687 -145951
10078 -145951 -221041 124276 25327 101320 -103082 -235443 -206368 -145313 -129153 -111961 27816
10066 274151 -125693 -25897 -215327 -232695 -97743 -27866 -13945 100828 -218495 -302479 -270877
10055 -270877 -458155 144288 -64130 -263146 -192841 153749 -253174 159188 157265 -28125
10044 -9919 90069 5014 -58525 -83284 -237324 -292532 -93694 -191379 19732 -221841 82528 21296
$$ packed form
10124b76832A64851b84709i6459L7293j66251O6252M2399D978N4524J60831n7848
10113A62485o0058B3701h7392h157k01887I8873c7529a7668j47326m5732i0688
10101I9771m1225k402c509l41842A20598D9852J98093E5676G211P0174l2454b19410
10088a15728k62262A2772K55309b55225R6341G2717c84891A79880a47687J736
10078a45951p5090A24276B5327P5993a03082j32361K9075O1055J6160J7192B7816
10066B74151a25693b5897j89430j7368i7743b7866J3921A00828b18495q3984L1602
10055b70877j87278A44288f4130j99016P0305A53749b53174A59188j923b8125
10044i919I0069E014e8525k4759j54040n5208i3694r7685A9732b21841H2528B1296
$$ plain form
10031 71787 192983 254868 -15398 -170272 -43619 -38465 -296271 70643 -107241 61282 -282815
10019 -299820 129074 175256 -354655 80718 -352100 -24120 -66749 -310260 -115236 -41372
10008 132787 170594 -96901 -156822 -273425 -24144 349890 -3531 -64812 -459116 -337222 84958
9996 -194191 -349476 -98604 -28880 -13861 -103359 -72998 29117 -54229 88852 -409401 3840
9984 -37451 81528 -35583 -293306 -172664 150101 -186939 135403 -71673 105280 -220088
9973 -168078 -172735 272832 72418 132967 -64764 -82595 -305167 -99783 -75750 -34699 43316
9961 74390 24101 -240153 -181434 -151220 153410 -153133 109129 -39028 -207612 -187078 -346791
9950 -346791 -80212 -4508 -108587 92231 -542321 -124313 131293 -162595 -42701 -277945 -36775
$$ packed form
10031G1787J21196O1885a5398j54874d3619N154k57806G0643a07241F1282b82815
10019b99820A29074M6182c54655H0718c52100b4120m2629k43511a15236d1372
10008A32787L7807i6901n9921j16603b4144C49890c531o1281l94304J21894H4958
9996a94191j55285i8604b8880a3861q9498L0361B9117e4229H8852d09401C840
9984c7451H1528c5583k57723J20642A50101a86939A35403g1673A05280b20088
9973a68078m657B72832G2418O0549f4764j7831k22572i9783K4033c4699D3316
9961G4390B4101b40153N8719L0214A53410a53133A09129c9028j68584K0534j59713
9950c46791h0212d508j04079I2231e42321a24313A31293a62595d2701k35244c6775
$$ plain form
9938 19710 -88889 -309786 -60668 119143 -256185 -110354 126863 57436 -23912 68335 -176206
9926 -11587 126035 -67092 -262815 102651 -58169 -223096 -488137 -109387 -203729 -164812 -90120
9915 -90120 -279081 49061 66775 234809 -169086 106165 -151157 -155168 53210 75941 -11919
9903 -38953 -79395 -174118 -86691 -477569 -89554 30921 -77102 230353 -101339 -323730 -11932
9891 -66861 -61939 -204543 -90160 -307434 -27550 -167035 -253662 119967 85822 -186602 270859
9879 -107419 -113696 -113660 -5488 -74700 554282 -160773 49524 -131703 -135045 -64754 -72328 16580
9866 -163434 -69852 28147 119828 -263662 -113043 -212052 56147 115761 158260 -277813 -217008
9855 -217008 60045 -383581 29353 5958 -314854 -322780 12764 23701 -120013 -356189 -290064
$$ packed form
9938A9710h8889k20897f0668A19143b56185a10354A26863E7436b3912F8335a76206
9926a1587A26035f7092j95723A02651e8169j64927k65041a09387r4342L8917P4692
9915i0120j88961D9061J7714J68034a69086A06165a51157m011E3210K2731a1919
9903c8953m0442r4723h6691l90878h9554C0921g7102B30353a01339k22391a1932
9891f6861M922j42604i0160k17274b7550j39485q6627A19967l4145a86602B70859
9879a07419o277L6e488o9212E54282a60773D9524a31703l342f4754p574A6580
9866a63434f9852B8147R1681b63662a13043r9009E6147N9614M2499b77813O0805
9855b17008F0045c83581B9353E958c14854p926A2764J0937a20013k36176O6125
$$ plain form
9844 -290064 -98510 73458 -295499 -319399 86892 167763 47817 60480 234019 -328549 -299501
9833 -299501 -129008 -54922 -64197 -304761 -285274 -53860 -183719 12296 2902 216774 -120541
9821 30834 -118186 99157 56041 4648 118699 -14404 -45224 -385363 186122 26918 -201856
9809 264796 59754 -117840 174806 -86593 -89538 483555 478326 195201 119351 1309 -38666
9797 -325900 -181536 -162455 130300 119421 -163136 105072 -164087 -26994 12372 20586 -231041
9785 22827 311717 -98409 -490226 -266416 136474 -10295 240159 -150070 2543 -13905 -136186
9774 -136186 -132686 -81299 -242046 -39311 -79247 5445 -77748 64555 -107031 255537 -124321
9762 -41899 -240698 343874 -74165 -62508 73128 205819 -224426 -246868 158124 -402128 80014
$$ packed form
9844b90064i8510G3458b95499k3900H6892Q0871D7817J2663J73539c28549K9048
9833b99501a29008e4922r275k40564J9487e3860j29859A2296B902K13872a20541
9821C0834a18186I9157m3116D648J14051a4404l0820l40139A86122B6918b01856
9809B64796E9754a17840A74806h6593k945D83555n229A95201p5850A309c8666
9797c25900J44364J9081A30300j0879a63136A05072a64087b6994A2372Q214b31041
9785B2827K88890i8409l91817K23810A36474a0295B40159a50070B543a3905j22281
9774a36186L500N1387j60747c9311l9936E445g7748F4555a07031B55537a24321
9762d1899j98799C43874g4165J1657G3128J32691b24426k2442A58124d02128H0014
$$ plain form
9750 -191073 -102878 42998 152462 -322660 -324598 380 -14902 -124618 -251954 -182640 -224203
9739 -224203 -198925 188881 -406921 -187414 -97741 -163584 -186801 -61677 -139178 -54477 -102894
9728 -102894 37505 -439253 -295197 -218557 49835 -220822 11999 -129876 -153548 66649 -234131
9716 274890 -487487 153433 68687 -57804 -80140 -378203 131027 209690 -177081 19882 41891
9705 41891 -99975 -298188 44499 -59320 -54829 -227868 63349 62935 -23965 -185789 -196385 -38572
9692 -199640 385292 255480 -151409 72858 -36378 -197840 -247210 -166777 -5775 -121178 -166377
9681 -166377 -133145 47969 -278133 -6052 145003 13302 -188630 37602 -186244 -260878 -46051
9669 -27572 -108305 349577 85131 98021 -82449 -651 10993 -173952 186173 -80147 -252506
$$ packed form
9750a91073Q8195D2998J09464c22660j938C80a4902j09716j27336O9314m1563
9739b24203K5278A88881d06921a87414Q9673o5843k3217f1677p7501e4477m8417
9728a02894C7505d39253J44056P6640D9835b20822A1999a29876k3672F6649b34131
9716B74890d87487A53433F8687e7804k2336k98063A31027P8663a77081A9882K2009
9705D1891i9975j98213D4499e9320M491j73039F3349m14b3965j61824j0596c8572
9692a99640C85292j29812a51409G2858c6378j61462m9370Q0433e775j15403m5199
9681a66377L3232D7969b78133f052A45003A3302a88630C7602a86244p4634d6051
9669b7572q0733C49577H5131J2890h2449f51A0993a73952A86173h0147j72359
$$ plain form
9658 -252506 118604 84720 1068 -167859 -237187 46756 -23639 88004 201455 119321 -27959
9646 -147826 32094 -210824 -147398 -87413 371929 399386 -234130 78938 106711 77370 -141693
9634 67005 -11525 -209993 146471 44728 -28969 -128337 213562 -231766 484844 65633 -95202
9622 -351183 -320269 -87116 -19797 251548 -38650 -338 -82897 50266 -204280 -276879 -83695 50685
9609 138404 72029 -122135 -175500 -83568 -22295 -456226 -116818 -120367 -47890 7185 24715
9598 24715 -86418 -28978 -184649 -30111 -261286 -50601 -4373 -85507 117449 102536 194948
9587 194948 -133568 210696 -327506 -394438 -136702 -216085 236069 -59411 -300130 70818
9576 -131547 -286863 -21268 -377657 -229805 133255 -311352 224863 40725 -161110 10704
$$ packed form
9658b52506A18604l3884A068a67859o9328D6756b3639H8004J13451q2134b7959
9646a47826C2094b10824O3426N9985C71929K7457b34130G8938K7773k9341a41693
9634F7005a1525j98468A46471D4728b8969r9368B13562b31766D84844F5633i5202
9622c51183L0914h7116a9797B51548c8650c38q2559E0266b04280p2599h3695E0685
9609A38404o6375a22135n3365h3568b2295m33931a16818l549d7890G185J7530
9598B4715h6418b8978j55671c0111k31175e0601d373q1134A17449j4913R2412
9587A94948a33568B10696c27506o6932a36702p9383B36069e9411k40719G0818
9576a31547j55316b1268l56389J47852A33255c11352B24863D0725a61110A0704
$$ plain form
9565 -283064 -326290 116757 -167250 157514 -158087 8781 204110 -434603 230843 -87789
9554 -221634 -306831 -73001 91907 -168157 132668 46825 -151582 -33199 -154678 33745 120051
9543 120051 -46450 -74113 359108 -153669 -263315 149830 332340 -166284 78754 -140471
9532 108986 -256519 -144643 -6054 -474145 -47584 308465 59421 213779 -42775 -116509 -117796
9521 -117796 154421 -136999 -94219 -92496 106306 121643 -208686 -54190 171192 -12590 -283673
9510 -283673 35896 133542 57636 293261 -70201 2511 -38271 -216128 -141558 164569 -187682
9498 -91268 -411743 -15715 -161086 146564 -506920 -313156 -149651 -117675 27476 -63484 -133342
9487 -133342 84056 48514 -88089 -5572 -84399 -68653 -164170 -255989 -116675 -102292 -157503 42805
$$ packed form
9565b83064m3226A16757a67250A57514a58087H781J95329d34603B30843h7789
9554b21634q5197g3001I1907a68157A32668D6825a51582c3199j21479C3745Q6306
9543A20051d6450k7663C59108a53669j09646A49830J82510a66284G8754a40471
9532A08986b56519J11876f054m68091d7584C08465E9421J54358d2775p3734j287
9521a17796A54421a36999M2780J723A06306J5337b08686e4190A71192a2590k71083
9510b83673C5896R7646E7636K35625g0201B511c8271j77857P4570A64569a87682
9498i1268l20475a5715j45371A46564e06920J93764a49651L1976B7476f3484o9858
9487a33342H4056l5542h8089e572p8827J5746r5517r1819a16675J4383n5211D2805
$$ plain form
9474 89658 -159187 -187051 218913 324063 -79421 57610 -173992 -59760 -100556 -112611 -156598
9463 -156598 357699 176956 30431 -102703 204530 11984 -180022 -213232 285454 -126095
9452 -25059 167045 -52877 26224 -150570 -123092 83838 119155 -164702 -22213 -153926 -358602
9441 -358602 -21684 71195 157813 -137409 -249853 -213746 46061 -216281 188675 177806 -241957
9429 -120811 -413032 -351985 65758 -19189 164077 -4930 -20128 311425 45394 -68531 -174541
9418 -174541 -25057 -159346 186321 170001 -170669 104032 -57223 90262 -117574 -48317 -130127
9407 -130127 -203252 130358 -13455 -57147 -76664 16218 -148216 -210365 44886 160113 -296120
9395 -821 -42860 92907 232840 17833 -18315 -18295 -132138 -44058 -161683 -127086 -104926 -223779
$$ packed form
9474H9658a59187k7864B18913J05150g9421E7610a73992e9760m0796j2055m3987
9463a56598C57699A76956C0431a02703B04530A1984a80022l3210B85454a26095
9452b5059A67045e2877B6224a50570K7478H3838L5317a64702b2213j31713k04676
9441c58602b1684G1195Q6618a37409j12444L6107D6061b16281A88675j0869b41957
9429a20811k92221O1047F5758a9189A64077d930j5198C11425D5394f8531j06010
9418a74541b5057j34289A86321j6320a70669A04032e7223I0262a17574d8317q1810
9407a30127p3125A30358a3455m3692j9517A6218a48216o2149D4886J15227b96120
9395h21m2039I2907J39933A7833a8315K0j13843d4058j17625L4597K2160j18853
$$ plain form
9383 -223779 -160207 -206068 -276537 59493 -154458 -123265 -180259 60985 85250 -329632 -189944
9372 -189944 341787 -164072 326698 -225497 -329766 -34632 22337 -120295 -68573 199297
9361 30600 -205418 133661 -42510 125268 90846 -238499 13765 -127708 -9562 -297935 -99568
9349 -8237 -135160 -10339 10275 -131172 79939 58865 -36160 -129062 201564 -81213 -18010
9337 22287 -66185 181967 30757 78180 159845 51670 -25085 -136419 -53256 -162865 205010
9325 -183527 -68163 -128510 -236451 -22559 58105 -9637 -75116 -289094 -142941 -340125 -119096
9313 -99002 163815 -244739 -10773 -291354 -74561 -140147 -31628 218822 189768 -160104 -72688
9301 221699 -82280 62714 -86358 -69005 -141981 662 465667 -205630 202 263073 -46609 -129044
$$ packed form
9383b23779O3572m5861p0469E9493a54458L1193n6994F0985K4265c29632J39688
9372a89944C41787a64072C26698b25497j04269c4632B2337a20295N1722A99297
9361C0600b05418A33661d2510A25268l4422b38499A3765a27708i562k88373i9568
9349h237j26923a0339A0275a31172G9939k1074c6160r2902B01564h1213a8010
9337B2287f6185A81967C0757M7423Q1665E1670b5085j11334e3256j09609B05010
9325a83527f8163o0347j07941b2559E8105i637o5479k13978a42941j97184a19096
9313i9002A63815b44739a0773k80581g4561o5586c1628B18822k9054a60104g2688
9301B21699h2280F2714h6358J7353p2976F62M65005b05630B02K62871d6609q2435
$$ plain form
9289 -129044 79895 43845 148657 -124355 -351662 -241456 -67595 -1074 -200783 25690 -165755
9277 -164656 -168443 -266716 -255132 30981 21059 -380639 -161854 61797 -216838 208447 -252217
9265 206910 73756 255751 -184211 -148903 -97121 -186757 -224851 -6127 -71544 -255698 -146132
9254 -146132 -118335 -317915 -151477 31661 -295602 210096 -106280 295462 123114 219665
9244 219665 -324452 250372 -388137 -187801 72125 346736 -156001 170048 111046 -75219
9233 -200356 -250427 6076 -393137 -317634 5731 -33240 -381234 -223167 -293554 -275613 -208497
9222 -208497 -181872 -298192 -98919 -65682 65657 49480 56740 -177899 -190255 -141014 213318
9210 100810 133151 20478 -10075 26668 84119 -114303 -223793 -53420 67280 -51026 123672
$$ packed form
9289a29044G9895l6050J04812a24355k27307J10206f7595a074j99709B5690a65755
9277a64656l787r8273J1584C0981r922c80639a61854F1797b16838B08447b52217
9265B06910G3756J81995a84211L5308N1782q9636l8094f127o5417j84154J09566
9254a46132K7797j99580a51477C1661b95602B10096a06280B95462A23114R6551
9244B19665c24452B50372c88137a87801G2125K74611a56001A70048n9002g5219
9233b00356n0071F076c93137P5503E731c3240l47994J58067p0387J7941O7116
9222b08497K6625j16320i8919L3237F5657j6177P260a77899j2356M9241B13318
9210A00810L2341B0478a0075B6668N7451a14303j09490e3420F7280e1026A23672
$$ plain form
9198 -49370 83970 -16880 76182 -173363 44421 -73173 -65195 -135410 147684 -91425 95194 112599
9186 112599 222832 -276013 -10430 103972 -228404 168186 10773 -231412 -107766 3026
9175 -208156 314194 223276 -118348 -328937 -174396 11646 134823 -45 45003 -157339 -259882
9164 -259882 359567 -2860 -242120 140804 -370713 -184301 62881 71826 -79692 -143261 -22223
9152 80746 42946 153401 -289852 268225 -85690 -110204 275200 -95124 15328 3385 -172846
9140 -472646 -293732 -102251 -335389 -41561 -147 -137025 -15179 -217341 102623 5317 -207830
9128 7342 -52258 40631 -46722 -48790 -130138 -445614 -124735 -53038 165373 -388677 -267714
9117 -267714 -247081 193859 -430973 -154782 -159368 176242 -156742 -351170 24445 -9081 122772
$$ packed form
9198d9370H3970a6880G6182a73363D4421g3173P978p0215A47684i1425I5194J7405
9186A12599J10233b76013a0430A03972b28404A68186A0773b31412a07766C026
9175b08156C14194r0918a18348k10589J54541A1646J23177d5D5003a57339j02543
9164b59882C59567b860k39260A40804c70713a84301F2881Q945g9692o3569b2223
9152H0746l7800J10455b89852B68225h5690k4514B75200i5124A5328C385a72846
9140d72646J78914a02251k33138d1561a47j36878a5179k02162A02623E317b07830
9128G342e2258D0631d6722k068q1348l15476a24735e3038A65373c88677J20963
9117b67714K0633A93859d30973a54782m586A76242a56742j94428B4445i081A22772
$$ plain form
9105 -42130 -91579 68798 -77094 -89460 -362647 114332 6114 203188 -362676 -82208 96998
9093 -63802 -114026 68420 27475 -31638 2678 -132184 -224578 -465955 -330801 -8195 123418
9081 -168855 -154169 -92502 -136427 -178456 73190 -54464 -41534 -151233 159417 46918 -12048
9069 -32296 9519 -105675 188344 173869 101762 -113021 -179863 -360451 -256296 -18356 -204819
9058 -204819 241301 -228557 270538 -249095 -192914 191716 266439 201268 -142531 -33221
9047 66503 -170072 -126033 123813 -144630 -311206 -54776 -288645 -7949 152218 -65852 -306329
9036 -306329 4236 -47806 -44203 14472 -304544 80822 -263352 120965 47051 -99789 -167221
9025 -167221 -187143 -127364 -358122 147109 -44977 172415 160919 116114 -186187 139870 -98770
$$ packed form
9105d2130m9449F8798g7094j2366k73187A14332F114J97074c62676h2208I6998
9093f3802n0224F8420B7475c1638B678a32184r2394k41377J35154h195A23418
9081a68855J4686O1667m3925m2029G3190e4464J2930j09699A59417D6918a2048
9069c2296I519a05675A88344j4475p2107a13021o6842j80588J04155a8356j86463
9058b04819B41301b28557B70538b49095N6181A91716P4723o5171a42531c3221
9047F6503a70072M4039A23813a44630j66576e4776k33869g949A52218f5852k40477
9036c06329D236d7806L603A4472c04544H0822b63352A20965D7051i9789o7432
9025a67221j9922N9779k30758A47109d4977A72415j1496m4805a86187A39870i8770
$$ plain form
9013 -60321 82941 66012 -332921 108547 67502 -28871 -108824 -284438 -392164 53664 140270
9002 140270 -281789 20855 65773 -337716 131669 -118793 -59477 55662 -262114 388436
8991 -18247 -466 -136710 -145679 -246021 22287 111901 -82090 -220213 95104 -203310 151391
8979 -134610 112913 -75068 103132 12652 114222 180348 131865 -31089 260378 -167251 102588
8967 108464 -155201 -222316 74207 -154831 352891 -322267 366765 -199931 69605 128904
8957 128904 148252 125817 171289 -10420 -70221 206736 -422700 80916 228190 163571 197910
8946 197910 13104 -63459 -152527 173666 -6272 -236508 52302 125973 -98916 -251810 265595
8934 76719 -29422 86440 39356 -187502 6544 119332 255592 -124013 -53909 90942 758828
$$ packed form
9013f0321H2941j6929c32921A08547m1045b8871p9953j75614j07726E3664Q6606
9002A40270b81789B0855M4918c37716A31669a18793N9316E5662b62114C88436
8991a8247d66j36244q969j00342B2287Q9614h2090j38123I5104b03310A51391
8979a34610A12913g5068A03132A2652J01570O6126m8483c1089B60378a67251A02588
8967A08464a55201o7115G4207a54831C52891c22267C66765a99931F9605N9299
8957A28904J9348k2435M5472a0420n9801B06736d22700H0916J47274o4619L4339
8946A97910A3104f3459q9068A73666f272k30236E2302P3671i8916j52894B65595
8934G6719b9422H6440C9356a87502F544J12788J36260a24013e3909I0942O67886
$$ plain form
8923 758828 3103335 4526267 959929 105169 275491 -30406 121438 -47628 -40845 -116966
8913 -116966 106405 -308152 -480943 -98980 138627 151395 -60815 68847 63887 -56363 -41252
8902 -41252 -103902 -276179 -203706 -24081 16139 -125923 45199 -5799 144100 -24645 8244 100382
8890 100382 -161391 -145996 -361338 -300393 -288067 45063 -47460 439209 -103274 107601 -351038
8878 -57591 -268599 -24805 17858 122705 -217198 -169078 -239306 315320 -249352 -81591 9813
8866 262608 123358 -385812 -59544 -234944 128902 51384 -125249 -166351 24970 -191209
$$ packed form
8923G58828K344507J422932I59929A05169J70322c0406A21438d7628O783p6121
8913a16966A06405c08152j72791i8980A38627J2768f0815F8847m960e6363J5111
8902d1252o2650j72277P2473b4081A6139a25923D5199e799A44100b4645H244R2138
8890A00382a61391J5395k15342O0945J2326D5063d7460D39209a03274A07601c51038
8878e7591k11008b4805A7858J04847b17198M8120p0228C15320b49352h1591I813
8866B62608A23358c85812e9544j75400A28902E1384a25249m1102B4970a91209
$$ [...]
##END NTUPLES=NMR SPECTRUM
##END=
