
##TITLE=AC1372_2418_7221647_llQExT8r8K
##JCAMPDX= 6.0         $$ Bruker NMR JCAMP-DX V2.0
##DATA TYPE= NMR SPECTRUM
##DATA CLASS= NTUPLES
##ORIGIN= BRUKER
##OWNER= Administrator
$$ 1.72 TOPSPIN		Version 2.1
$$ 2012-12-17 16:51:42.521 -0500  Administrator@X
$$ Compression mode = diff/dup
##.OBSERVE FREQUENCY= 400.02188249412
##.OBSERVE NUCLEUS= ^1H
##.ACQUISITION MODE= SIMULTANEOUS (DQD)
##.ACQUISITION SCHEME= undefined
##.AVERAGES= 64
##.DIGITISER RES= 22
##SPECTROMETER/DATA SYSTEM= spect
##.PULSE SEQUENCE= noesygpps1d.comp
##.SOLVENT NAME= COFFEE_meoh
##.SHIFT REFERENCE= INTERNAL, COFFEE_meoh, 1, 14.96033
##AUDIT TRAIL= $$ (NUMBER, WHEN, WHO, WHERE, PROCESS, VERSION, WHAT)
$$ ##TITLE= Audit trail, TOPSPIN		Version 2.1
$$ ##JCAMPDX= 5.01
$$ ##ORIGIN= Bruker BioSpin GmbH
$$ ##OWNER= Administrator
$$ $$ E:\/data/COFFEE/nmr/AC1372_2418_7221647_llQExT8r8K/42/pdata/1/auditp.txt
$$ ##AUDIT TRAIL=  $$ (NUMBER, WHEN, WHO, WHERE, PROCESS, VERSION, WHAT)
(   1,<2012-12-17 16:51:36.615 -0500>,<Administrator>,<X>,<go>,<TOPSPIN 2.1>,
      <created by zg
	started at 2012-12-17 16:40:06.595 -0500,
	POWCHK enabled, PULCHK disabled,
       configuration hash MD5:
       86 BA 57 50 F2 9D 5C 9B 26 00 A9 28 5F 66 2E 89
       data hash MD5: 64K
       E5 5E EC 52 94 2A BF AE FD EE E0 74 97 E5 3D E0>)
(   2,<2012-12-17 16:51:39.771 -0500>,<Administrator>,<X>,<proc1d>,<TOPSPIN 2.1>,
      <Start of raw data processing
       efp LB = 0.3 FT_mod = 6 PKNL = 1 PHC0 = 0 PHC1 = 0 SI = 128K 
       data hash MD5: 128K
       47 27 C6 F8 18 95 E5 98 0A 8A 37 04 A3 3B 79 8E>)
(   3,<2012-12-17 16:51:40.786 -0500>,<Administrator>,<X>,<proc1d>,<TOPSPIN 2.1>,
      <pk PHC0 = -84.14978 PHC1 = 0 
       data hash MD5: 128K
       23 26 BE 48 60 65 CA CA FD 89 04 EF CE BC 43 C0>)
(   4,<2012-12-17 16:51:41.427 -0500>,<Administrator>,<X>,<proc1d>,<TOPSPIN 2.1>,
      <abs ABSG = 1 
       data hash MD5: 128K
       6F 01 C6 8A 22 FB 52 AB 26 6E CA F1 86 A3 2F 08>)
(   5,<2012-12-17 16:51:41.615 -0500>,<Administrator>,<X>,<proc1d>,<TOPSPIN 2.1>,
      <abs ABSG = 2 
       data hash MD5: 128K
       47 9F 88 CF 89 90 B2 FF 71 63 D0 97 87 CB AA 0B>)
(   6,<2012-12-17 16:51:41.802 -0500>,<Administrator>,<X>,<proc1d>,<TOPSPIN 2.1>,
      <abs ABSG = 3 
       data hash MD5: 128K
       33 4F 89 81 36 AA F1 E4 DC B8 AB E3 A2 7C BC 03>)
(   7,<2012-12-17 16:51:41.974 -0500>,<Administrator>,<X>,<proc1d>,<TOPSPIN 2.1>,
      <abs ABSG = 4 
       data hash MD5: 128K
       C2 01 05 A1 66 63 5A AB 17 0F 69 B8 45 44 B9 1E>)
(   8,<2012-12-17 16:51:42.161 -0500>,<Administrator>,<X>,<proc1d>,<TOPSPIN 2.1>,
      <abs ABSG = 5 
       data hash MD5: 128K
       64 17 D3 12 B1 15 C9 E0 A8 07 A9 85 BC E6 51 DB>)
$$ ##END=
$$ 
$$ $$ hash MD5
$$ $$ A7 3D 40 AD 26 15 98 48 26 4D 42 D3 EC 00 1E 43
##$RELAX= 
##$RELAX= 
##$RELAX= 
##$RELAX= 
##$RELAX= 
##$RELAX= 
##$RELAX= 
##$RELAX= 
$$ Bruker specific parameters
$$ --------------------------
##$DU= <E:\>
##$EXPNO= 42
$$ [...]
##$TP07= 0
##$TPNAME0= <>
##$TPNAME1= <>
##$TPNAME2= <>
##$TPNAME3= <>
##$TPNAME4= <>
##$TPNAME5= <>
##$TPNAME6= <>
##$TPNAME7= <>
##$TPOAL= (0..7)
0.5 0.5 0.5 0.5 0.5 0.5 0.5 0.5
##$TPOFFS= (0..7)
0 0 0 0 0 0 0 0
##$TUNHIN= 0
##$TUNHOUT= 0
##$TUNXOUT= 0
##$USERA1= <user>
##$USERA2= <user>
##$USERA3= <user>
##$USERA4= <user>
##$USERA5= <user>
##$V9= 5
##$VALIST= <valist>
##$VCLIST= <CCCCCCCCCCCCCCC>
##$VD= 0
##$VDLIST= <DDDDDDDDDDDDDDD>
##$VPLIST= <PPPPPPPPPPPPPPP>
##$VTLIST= <TTTTTTTTTTTTTTT>
##$WBST= 2048
##$WBSW= 25
##$XGAIN= (0..3)
0 0 0 0
##$XL= 0
##$YL= 0
##$YMAX_a= 6128146
##$YMIN_a= -11877013
##$ZGOPTNS= <>
##$ZL1= 120
##$ZL2= 120
##$ZL3= 120
##$ZL4= 120
##$ABSF1= 14.96033
##$ABSF2= -5.597852
##$ABSG= 5
##$ABSL= 3
##$ALPHA= 0
##$AQORDER= 0
##$ASSFAC= 0
##$ASSFACI= 0
##$ASSFACX= 0
##$ASSWID= 0
##$AUNMP= <proc_prof1d_extract.lims>
##$AXLEFT= 0
##$AXNAME= <>
##$AXNUC= <1H>
##$AXRIGHT= 0
##$AXTYPE= 0
##$AXUNIT= <>
##$AZFE= 0.1
##$AZFW= 0.1
##$BCFW= 0
##$BC_mod= 0
##$BYTORDP= 0
##$COROFFS= 0
##$CY= 15
##$DATMOD= 1
##$DC= 0
##$DFILT= <>
##$DTYPP= 0
##$F1P= 0
##$F2P= 0
##$FCOR= 0.5
##$FTSIZE= 131072
##$FT_mod= 6
##$GAMMA= 0
##$GB= 0
##$INTBC= 1
##$INTSCL= 1
##$ISEN= 128
##$LB= 0.3
##$LEV0= 0
##$LPBIN= 0
##$MAXI= 10000
##$MC2= 0
##$MEAN= 0
##$ME_mod= 0
##$MI= 0
##$NCOEF= 0
##$NC_proc= -2
##$NLEV= 6
##$NOISF1= 0
##$NOISF2= 0
##$NSP= 0
##$NTH_PI= 0
##$NZP= 0
##$OFFSET= 14.96033
##$PC= 1
##$PHC0= -84.14978
##$PHC1= 0
##$PH_mod= 1
##$PKNL= yes
##$PPARMOD= 0
##$PPDIAG= 0
##$PPIPTYP= 0
##$PPMPNUM= 2147483647
##$PPRESOL= 1
##$PSCAL= 4
##$PSIGN= 0
##$PYNMP= <proc.py>
##$REVERSE= no
##$SF= 400.020009906818
##$SI= 131072
##$SIGF1= 0
##$SIGF2= 0
##$SINO= 400
##$SIOLD= 131072
##$SPECTYP= <>
##$SREGLST= <1H.CDCl3>
##$SSB= 0
##$STSI= 131072
##$STSR= 0
##$SW_p= 8223.68421052631
##$SYMM= 0
##$S_DEV= 0
##$TDeff= 65536
##$TDoff= 0
##$TI= <>
##$TILT= no
##$TM1= 0
##$TM2= 0
##$TOPLEV= 0
##$USERP1= <user>
##$USERP2= <user>
##$USERP3= <user>
##$USERP4= <user>
##$USERP5= <user>
##$WDW= 1
##$XDIM= 131072
##$YMAX_p= 392934789
##$YMIN_p= -11786
##$CURPLOT= <Network HP LaserJet P1505>
##$CURPRIN= <$Network HP LaserJet P1505>
##$DFORMAT= <normdp>
##$LAYOUT= <+/1D_H.xwp>
##$LFORMAT= <normlp>
##$PFORMAT= <normpl>
##$SURQMSG= 1
$$ End of Bruker specific parameters
$$ ---------------------------------
##NTUPLES= NMR SPECTRUM
##VAR_NAME=  FREQUENCY,     SPECTRUM/REAL,   SPECTRUM/IMAG
##SYMBOL=    X,             R,               I
##VAR_TYPE=  INDEPENDENT,   DEPENDENT,       DEPENDENT
##VAR_FORM=  AFFN,          ASDF,            ASDF
##VAR_DIM=   131072,        131072,          131072
##UNITS=     HZ,            ARBITRARY UNITS, ARBITRARY UNITS
##FACTOR=    0.0627417313425164, 1,          1
##FIRST=     8223.62146879497, 3304,         -57988
##LAST=      0,             5435,            -57928
##MIN=       0,             -11786,          0
##MAX=       8223.62146879497, 392934789,    0
$$ Real data points
##PAGE= N=1
##DATA TABLE= (X++(R..R)), XYDATA
$$ [...]
$$ plain form
63948 909753 979739 1059639 1149626 1250624 1363878 1489862 1627920 1776944 1935944 2103745
63938 2103745 2278355 2456946 2636354 2813304 2984201 3145126 3292263 3422196 3531779
63929 3531779 3618091 3678906 3713094 3720268 3700143 3652580 3578216 3478764 3356800 3215797 3060385
63918 3060385 2895787 2726307 2554576 2382696 2213709 2051168 1897392 1752996 1618258
63909 1618258 1494096 1381266 1279346 1187283 1104571 1031206 966692 909802 859391 814959 776310
63898 776310 743051 714435 689400 666831 646122 627483 611348 597537 585338 574279 564409 555882
63886 555882 548763 543200 539362 537207 536774 538606 543236 550301 558802 568254 578818 590190 601365 611981
63872 611981 623131 636192 651474 668542 687240 707611 729270 751609 774341 797143 819139
$$ packed form
63948I09753O9986P9900Q9987J00998J13254J25984J38058J49024J59000J67801
63938B103745J74610J78591J79408J76950J70897J60925J47137J29933J09583
63929C531779Q6312O0815L4188P174k0125m7563p4364r9452j21964j41003j55412
63918C060385j64598j69480j71731j71880j68987j62541j53776j44396j34738
63909A618258j24162j12830j01920r2063q2712p3365o4514n6890n0411m4432l8649
63898G76310l3259k8616k5035k2569k0709j8639j6135j3811j2199j1059r870q527
63886E55882p119n563l838k155m33J832M630P065Q501R452J0564J1372J1175J0616
63872F11981J1150J3061J5282J7068J8698K0371K1659K2339K2732K2802K1996
$$ plain form
63861 819139 839452 858012 875038 889890 901323 908866 913226 915215 914914 911950 905942 896545 883594
63848 883594 867388 848489 827243 803912 779099 753390 726676 698610 669839 641945 615824
63837 615824 590827 565916 541070 517119 494707 474009 455137 438181 422940 408955 395777
63826 395777 383079 370667 358620 347208 336521 326352 316603 307506 299268 291685 284350 277093 270142
63813 270142 263971 258972 255022 251436 247721 244279 241892 240567 239543 238511 237984 238160 238262 237617 236696
63798 236696 236322 236321 235732 234085 231693 228953 226121 223700 222187 221303 220117 218161 215931 214143 212894 211736
63782 211736 210211 208195 206018 204336 203603 203569 203535 203128 202584 202240 202114 201977 201611 200914 200004 199192 198658 198232
63764 198232 197736 197355 197279 197174 196546 195586 195067 195300 195803 196164 196668 197726 199181 200520 201409 201672 201105 199834
$$ packed form
63861H19139K0313J8560J7026J4852J1433P543M360J989l01k964o008r397j2951
63848H83594j6206j8899k1246k3331k4813k5709k6714k8066k8771k7894k6121
63837F15824k4997k4911k4846k3951k2412k0698j8872j6956j5241j3985j3178
63826C95777j2698j2412j2047j1412j0687j0169r749r097q238p583p335p257o951
63813B70142o171m999l950l586l715l442k387j325j024j032n27J76J02o45r21
63798B36696l74jn89j647k392k740k832k421j513q84j186j956k230j788j249j158
63782B11736j525k016k177j682p33l4l4m07n44l44j26j37l66o97r10q12n34m26
63764A98232m96l81p6j05o28r60n19K33N03L61N04J058J455J339Q89K63n67j271
$$ plain form
63746 199834 198619 198358 199273 200859 202494 203908 205176 206602 208544 211155 214285 217696 221203 224473 227044
63731 227044 228860 230664 233493 237805 243247 249137 254897 260159 264836 269179 273595 278377 283646 289346
63717 289346 295029 299792 302816 304012 303922 303016 301349 298876 295770 292335 288785 285195 281545 277796 274078
63702 274078 270767 268219 266478 265391 264876 264813 264861 264754 264680 264973 265511 265974 266679 268435 271335 274361 276693
63685 276693 278848 281880 285769 289391 291940 293703 295327 296906 298017 298336 297995 297536 297616 298588 300395 302949
63669 302949 306343 310394 314276 317236 319510 321860 324129 325096 324037 321730 319405 317285 314729 311328
63655 311328 307155 302246 296643 290948 286091 282351 279034 275363 271409 268056 266259 266364 267847 269675
63641 269675 271104 272196 273492 275373 277975 281469 285991 291333 297068 302898 308631 314026 319171 324845
$$ packed form
63746A99834j215k61R15J586J635J414J268J426J942K611L130L411L507L270K571
63731B27044J816J804K829M312N442N890N760N262M677M343M416M782N269N700
63717B89346N683M763L024J196r0r06j667k473l106l435l550l590l650l749l718
63702B74078l311k548j741j087n15o3M8j07p4K93N38M63P05J756K900L026K332
63685B76693K155L032L889L622K549J763J624J579J111L19l41m59Q0R72J807K554
63669C02949L394M051L882K960K274K350K269R67j059k307k325k120k556l401
63655C11328m173m909n603n695m857l740l317l671l954l353j797J05J483J828
63641B69675J429J092J296J881K602L494M522N342N735N830N733N395N145N674
$$ plain form
63627 324845 331896 340281 349339 358950 369688 381717 394427 407550 421844 438175 456571 476815
63615 476815 499268 524305 551419 579869 610016 643151 679950 719832 761780 804983 848513
63604 848513 891008 930877 966240 994591 1013395 1021692 1020886 1013764 1003023 990736 978376 966622
63592 966622 955337 944143 932736 920289 905039 885216 860442 831821 800699 767873 733954
63581 733954 699919 666966 636160 608429 584585 564924 548867 535377 523913 514811 508601 505060
63569 505060 503240 502461 502969 505321 509433 514776 521492 530543 542370 555919 569633 583216 597809
63556 597809 614525 633448 654163 676589 700951 727428 756353 788609 825392 867565 915398
63545 915398 968688 1026505 1086269 1142982 1189803 1220387 1231821 1225980 1208121 1183993 1157962 1132974
$$ packed form
63627C24845P051Q385R058R611J0738J2029J2710J3123J4294J6331J8396K0244
63615D76815K2453K5037K7114K8450L0147L3135L6799L9882M1948M3203M3530
63604H48513M2495L9869L5363K8351J8804Q297q06p122j0741j2287j2360j1754
63592I66622j1285j1194j1407j2447j5250j9823k4774k8621l1122l2826l3919
63581G33954l4035l2953l0806k7731k3844j9661j6057j3490j1464r102o210l541
63569E05060j820p79N08K352M112N343O716R051J1827J3549J3714J3583J4593
63556E97809J6716J8923K0715K2426K4362K6477K8925L2256L6783M2173M7833
63545I15398N3290N7817N9764N6713M6821L0584J1434n841j7859k4128k6031k4988
$$ plain form
63533 1132974 1111008 1093035 1078966 1068053 1059029 1049666 1037000 1018784 994556 964853 929942 890160
63521 890160 847114 803302 760331 718416 677835 639848 605664 575249 547820 522958 500639
63510 500639 480713 462966 447353 433618 421098 409479 399338 391253 384775 378927 373364 368254
63498 368254 363436 358662 354438 351546 349812 348385 347238 347146 347973 348314 347441 346408 346407 347089 347573 348261 350313
63481 350313 353721 357194 359921 362374 365272 368750 372750 377382 382442 387121 390540 392191 391784 389142
63467 389142 384507 378556 371901 364915 358088 352041 346991 342680 339048 336482 335101 334336 333630 333171 333381
63452 333381 334094 334920 336251 339070 343643 349110 354725 360989 369002 379011 390190 401838 414285 428514
63438 428514 445362 465399 489236 517612 551221 590519 635105 682564 728120 766458 794668
$$ packed form
63533A132974k1966j7973j4069j0913r024r363j2666j8216k4228k9703l4911l9782
63521H90160m3046m3812m2971m1915m0581l7987l4184l0415k7429k4862k2319
63510E00639j9926j7747j5613j3735j2520j1619j0141q085o478n848n563n110
63498C68254m818m774m224k892j734j427j147r2Q27L41q73j033jO82M84O88K052
63481C50313L408L473K727K453K898L478M000M632N060M679L419J651m07k642
63467C89142m635n951o655o986o827o047n050m311l632k566j381p65p06m59K10
63452C33381P13Q26J331K819M573N467N615O264Q013J0009J1179J1648J2447J4229
63438D28514J6848K0037K3837K8376L3609L9298M4586M7459M5556L8338K8210
$$ plain form
63427 794668 813415 825349 832963 838210 843375 851200 863910 882525 907254 938290 976081 1020873
63415 1020873 1071884 1126790 1182117 1234251 1279887 1315685 1338500 1346970 1342849 1330110 1312561 1292605
63403 1292605 1271895 1252156 1234852 1220297 1207149 1192442 1172419 1144357 1108215 1066293 1021175
63392 1021175 974375 926886 880079 835480 794151 756717 723490 694095 667531 643262 621889
63381 621889 604168 589793 577908 568524 562479 560006 560226 562279 566245 572641 581563 592654 605531
63368 605531 619919 635711 653136 672654 694478 718520 744922 774270 806979 842852 881543
63357 881543 923146 967968 1015867 1066087 1117415 1167971 1214920 1254976 1285517 1305186 1313678 1311515
63345 1311515 1300248 1282598 1261895 1241120 1222112 1205233 1189471 1172992 1153899 1130773 1102778
$$ packed form
63427G94668J8747J1934P614N247N165P825J2710J8615K4729L1036L7791M4792
63415A020873N1011N4906N5327N2134M5636L5798K2815Q470m121j2739j7549j9956
63403A292605k0710j9739j7304j4555j3148j4707k0023k8062l6142m1922m5118
63392A021175m6800m7489m6807m4599m1329l7434l3227k9395k6564k4269k1373
63381F21889j7721j4375j1885r384o045k473K20K053L966O396Q922J1091J2877
63368F05531J4388J5792J7425J9518K1824K4042K6402K9348L2709L5873L8691
63357H81543M1603M4822M7899N0220N1328N0556M6949M0056L0541J9669Q492k163
63345A311515j1267j7650k0703k0775j9008j6879j5762j6479j9093k3126k7995
$$ plain form
63334 1102778 1069579 1031338 988819 943402 896968 851547 808765 769391 733527 701304 673280
63323 673280 650052 631774 618480 610734 609157 612665 617314 617619 609576 592697 569506 543546 517800
63310 517800 494162 473387 455226 438952 424136 410986 399976 391273 384474 378789 373479 368316
63298 368316 363640 359768 356336 352516 347988 343354 339317 335790 332204 328451 324944 321726 318144 313694
63284 313694 308763 304231 300649 298116 296630 296092 296158 296511 297167 298080 298602 297964 296360 294958 294601 295012 295524
63267 295524 296050 296865 297863 298653 299228 300019 301329 303138 305374 307958 310654 313346 316470 320629 325699 330801
63251 330801 335396 339967 345355 351761 358705 365697 372690 380090 388579 398689 410316 422929 436482
63238 436482 451831 469870 490468 512635 535520 558782 582140 605143 627476 649133 670201
$$ packed form
63334A102778l3199l8241m2519m5417m6434m5421m2782l9374l5864l2223k8024
63323F73280k3228j8278j3294p746j577L508M649L05q043j6879k3191k5960k5746
63310E17800k3638k0775j8161j6274j4816j3150j1010q703o799n685n310n163
63298C68316m676l872l432l820m528m634m037l527l586l753l507l218l582m450
63284C13694m931m532l582k533j486n38O6L53O56R13N22o38j604j402l57M11N12
63267B95524N26Q15R98P90N75P91J310J809K236K584K696K692L124M159N070N102
63251C30801M595M571N388O406O944O992O993P400Q489J0110J1627J2613J3553
63238D36482J5349J8039K0598K2167K2885K3262K3358K3003K2333K1657K1068
$$ plain form
63227 670201 690788 711111 731264 750954 769950 788838 808752 830130 852219 874094 895589
63216 895589 916734 936677 953817 966834 975056 977988 975139 966386 951977 932094 906983 877674
63204 877674 846065 813978 782490 752432 724949 700952 680268 661989 645702 631914 621273
63193 621273 613820 609158 606958 607025 609146 613132 618957 626686 636342 647864 661059 675527 690793 706566
63179 706566 722715 738938 754740 769892 784706 799599 814568 829335 843762 857741 870651
63168 870651 881307 888558 891758 890656 885078 874895 860090 840822 817557 791176 762701 732767
63156 732767 701569 669504 637700 607644 580315 555726 533264 512342 492949 475763 461654
63145 461654 450785 442212 434512 426848 419260 412135 405778 400555 396928 394962 393947 392915 391432 389685
$$ packed form
63227F70201K0587K0323K0153J9690J8996J8888J9914K1378K2089K1875K1495
63216H95589K1145J9943J7140J3017Q222K932k849q753j4409j9883k5111k9309
63204H77674l1609l2087l1488l0058k7483k3997k0684j8279j6287j3788j0641
63193F21273p453m662k200O7K121L986N825P729R656J1522J3195J4468J5266J5773
63179G06566J6149J6223J5802J5152J4814J4893J4969J4767J4427J3979J2910
63168H70651J0656P251L200j102n578j0183j4805j9268k3265k6381k8475k9934
63156G32767l1198l2065l1804l0056k7329k4589k2462k0922j9393j7186j4109
63145D61654j0869q573p700p664p588p125o357n223l627j966j015j032j483j747
$$ plain form
63131 389685 387955 386439 385564 385899 387462 389469 391163 392687 394771 397642 400686 403263 405471 407915 410939
63116 410939 414267 417244 419326 420497 421388 422858 425244 428078 430668 432855 434999 437320 439551 441302
63102 441302 442553 443636 444861 446304 447871 449462 451050 452677 454325 455766 456644 456870 456925 457521 458856
63087 458856 460381 461500 462415 463945 466538 469799 473121 476402 479836 483346 486719 490260 494755 500652
63073 500652 507643 515225 523353 532362 542446 553471 565168 577416 590509 605152 621946 640805
63061 640805 661235 683330 708047 736177 767413 800907 836480 874832 916700 962245 1011096
63050 1011096 1062423 1114922 1167288 1218947 1270098 1320944 1371220 1420491 1468663 1516096 1563531
63039 1563531 1611967 1662207 1714287 1767450 1820698 1872995 1922833 1968028 2006356 2036296 2056897
$$ packed form
63131C89685j730j516q75L35J563K007J694J524K084K871L044K577K208K444L024
63116D10939L328K977K082J171Q91J470K386K834K590K187K144K321K231J751
63102D41302J251J083J225J443J567J591J588J627J648J441Q78K26N5N96J335
63087D58856J525J119R15J530K593L261L322L281L434L510L373L541M495N897
63073E00652O991P582Q128R009J0084J1025J1697J2248J3093J4643J6794J8859
63061F40805K0430K2095K4717K8130L1236L3494L5573L8352M1868M5545M8851
63050A011096N1327N2499N2366N1659N1151N0846N0276M9271M8172M7433M7435
63039A563531M8436N0240N2080N3163N3248N2297M9838M5195L8328K9940K0601
$$ plain form
63028 2056897 2067058 2065273 2050208 2021517 1980191 1928241 1868007 1801621 1730987 1658100 1585125
63017 1585125 1514123 1446821 1384675 1328942 1280468 1239439 1205426 1177822 1156333 1141162 1132685
63006 1132685 1130896 1135178 1144630 1158465 1176109 1197040 1220684 1246362 1273276 1300765 1328617 1356898
62994 1356898 1385391 1413614 1441570 1469948 1499070 1528015 1555312 1580052 1601557 1618265 1628048
62983 1628048 1629809 1623894 1610674 1589485 1559452 1520769 1474716 1422897 1366906 1308296 1248395 1188322
62971 1188322 1129378 1073004 1020066 970579 924416 881850 843108 807978 776270 748174 723610
62960 723610 701719 681627 663320 647102 632512 618475 604399 590447 576893 563840 551499
62949 551499 540072 529347 518954 509008 499910 491518 483187 474749 466832 459950 453796 447724 441531
$$ packed form
63028B056897J0161j785j5065k8691m1326n1950o0234o6386p0634p2887p2975
63017A585125p1002o7302o2146n5733m8474m1029l4013k7604k1489j5171q477
63006A132685j789M282R452J3835J7644K0931K3644K5678K6914K7489K7852K8281
62994A356898K8493K8223K7956K8378K9122K8945K7297K4740K1505J6708R783
62983A628048J761n915j3220k1189l0033l8683m6053n1819n5991n8610n9901o0073
62971A188322n8944n6374n2938m9487m6163m2566l8742l5130l1708k8096k4564
62960G23610k1891k0092j8307j6218j4590j4037j4076j3952j3554j3053j2341
62949E51499j1427j0725j0393r946r098q392q331q438p917o882o154o072o193
$$ plain form
62936 441531 435457 429679 424077 418391 412440 406325 400403 394935 389888 385327 381787 379788 379040 378643 378086
62921 378086 377505 376924 375824 373751 370904 367855 365085 362979 361826 361486 361385 361134 360830 360501 359747 358282
62905 358282 356473 354885 353631 352635 352188 352529 353088 352920 352017 351554 352570 354899 357635 360150 362283 363945
62889 363945 365127 366157 367449 368999 370483 371762 372837 373304 372477 370410 368359 367736 368727 370347 371673
62874 371673 372578 373311 373890 374114 373772 372699 370944 369029 367707 367231 367138 366923 366617 366455 366390 366337 366620 367687
62856 367687 369482 371487 373320 374936 376311 377340 378080 378756 379466 380115 380612 380962 381195 381426 381913 382800 383871
62839 383871 384832 385737 386864 388244 389591 390594 391037 390805 390153 389826 390460 391921 393617 395281 396962 398424
62823 398424 399326 400073 401740 404814 408598 412137 415214 418128 421073 424189 427738 431691 435515 438916 442482
$$ packed form
62936D41531o074n778n602n686n951o115n922n468n047m561l540j999p48l97n57
62921C78086n81n81j100k073k847l049k770k106j153l40j01k51l04l29p54j465
62905C58282j809j588j254r96m47L41N59j68r03m63J016K329K736K515K133J662
62889C63945J182J030J292J550J484J279J075M67q27k067k051o23R91J620J326
62874C71673R05P33N79K24l42j073j755j915j322m76r3k15l06j62o5n3K83J067
62856C67687J795K005J833J616J375J029P40O76P10O49M97L50K33K31M87Q87J071
62839C83871R61R05J127J380J347J003M43k32o52l27O34J461J696J664J681J462
62823C98424R02P47J667L074L784L539L077K914K945L116L549L953L824L401L566
$$ plain form
62808 442482 447073 452770 459045 465734 473145 481189 489152 496685 504557 514052 525828 539584 554582
62795 554582 570192 586204 603004 621502 642521 666150 691921 719810 750810 786273 826853
62784 826853 872530 923571 980863 1045001 1115554 1191678 1273098 1359820 1451010 1544804 1639175
62773 1639175 1732231 1821428 1903229 1974129 2031796 2074876 2102098 2112113 2104213 2078889 2037834
62762 2037834 1983647 1919325 1847510 1770009 1688162 1603634 1518608 1435105 1354219 1276161 1201071
62751 1201071 1129787 1063600 1003155 947792 896271 848079 803679 763564 727594 695363 666588
62740 666588 640850 617512 596374 577998 562779 550008 538485 527919 518977 511920 505950 500188
62728 500188 494760 490443 487623 486099 485687 486449 488205 490353 492510 495137 499114 504724 511407 518640 526710
$$ packed form
62808D42482M591N697O275O689P411Q044P963P533P872R495J1776J3756J4998
62795E54582J5610J6012J6800J8498K1019K3629K5771K7889L1000L5463M0580
62784H26853M5677N1041N7292O4138P0553P6124Q1420Q6722R1190R3794R4371
62773A639175R3056Q9197Q1801P0900N7667M3080K7222J0015p900k5324m1055
62762B037834n4187o4322p1815p7501q1847q4528q5026q3503q0886p8058p5090
62751A201071p1284o6187o0445n5363n1521m8192m4400m0115l5970l2231k8775
62740F66588k5738k3338k1138j8376j5219j2771j1523j0566q942p057n970n762
62728E00188n428m317k820j524m12P62J756K148K157K627L977N610O683P233Q070
$$ plain form
62713 526710 536339 547781 560760 575271 592003 611811 635059 661635 691420 724644 761920 803986
62701 803986 851170 903020 958675 1017611 1079734 1144704 1211594 1279340 1347018 1413319 1476076
62690 1476076 1532757 1581298 1620273 1648609 1665542 1670607 1663281 1642903 1609412 1564087 1509184 1447050
62678 1447050 1379966 1310464 1240941 1172780 1106430 1042448 981948 925781 873913 825968 782000
62667 782000 742244 706389 673613 643332 615511 590248 567402 546826 528707 513354 500624
62656 500624 489737 479815 470563 462327 455462 449741 444414 438710 432273 425311 418484 412539 407886 404483
62642 404483 402106 400501 399249 397855 396311 395339 395647 397017 398459 399269 399561 399774 400072 400401 400735 400992
62626 400992 401000 400849 401119 402361 404363 406248 407415 408232 409627 412142 415504 419080 422504 425841 429494 434176
$$ packed form
62713E26710R629J1442J2979J4511J6732J9808K3248K6576K9785L3224L7276M2066
62701H03986M7184N1850N5655N8936O2123O4970O6890O7746O7678O6301O2757
62690A476076N6681M8541L8975K8336J6933N065p326k0378l3491m5325n4903o2134
62678A447050o7084o9502o9523o8161o6350o3982o0500n6167n1868m7945m3968
62667G82000l9756l5855l2776l0281k7821k5263k2846k0576j8119j5353j2730
62656E00624j0887r922r252q236o865n721n327n704o437o962o827n945m653l403
62642D04483k377j605j252j394j544r72L08J370J442Q10K92K13K98L29L34K57
62626D00992Qj51K70J242K002J885J167Q17J395K515L362L576L424L337L653M682
$$ plain form
62610 434176 440729 449445 459534 469718 479587 490066 502332 516660 532652 550208 569717 591476
62598 591476 615640 642771 673802 709098 747946 789229 832288 876752 921781 965877 1007338
62587 1007338 1044562 1075955 1099960 1115452 1122067 1120113 1110209 1092998 1069088 1039207 1004451 966331
62575 966331 926406 885790 845039 804596 765260 728103 693957 663013 634914 609089 585012
62564 585012 562342 541031 521329 503625 488236 475253 464446 455298 447322 440414 434677 429779
62552 429779 424870 419464 414121 409802 406707 404285 402252 400896 400300 399985 399646 399596 400094 400864 401789 403441
62536 403441 406118 408811 410053 409738 409215 409614 410917 412922 416216 421669 429457 439091 450079 462145
62522 462145 475131 489191 504973 523215 544198 567853 594267 623753 656434 692039 730063
$$ packed form
62610D34176O553Q716J0089J0184R869J0479J2266J4328J5992J7556J9509K1759
62598E91476K4164K7131L1031L5296L8848M1283M3059M4464M5029M4096M1461
62587A007338L7224L1393K4005J5492O615j954r904j7211k3910k9881l4756l8120
62575I66331l9925m0616m0751m0443l9336l7157l4146l0944k8099k5825k4077
62564E85012k2670k1311j9702j7704j5389j2983j0807r148p976o908n737m898
62552D29779m909n406n343m319l095k422k033j356n96l15l39n0M98P70R25J652
62536D03441K677K693J242l15n23L99J303K005L294N453P788R634J0988J2066
62522D62145J2986J4060J5782J8242K0983K3655K6414K9486L2681L5605L8024
$$ plain form
62511 730063 769878 810674 851463 891152 928486 961994 990250 1012261 1027495 1035641 1036637 1030954
62499 1030954 1019517 1003150 982386 958062 931805 905461 880069 855881 833453 814242 799782
62488 799782 790555 786028 785575 788910 795809 806097 820212 839426 865071 897388 935114 976189 1019014
62475 1019014 1063189 1108921 1155460 1200218 1239758 1271558 1294686 1309114 1315123 1313218 1303711 1285971
62463 1285971 1258741 1221672 1176247 1124998 1070298 1014115 958104 903225 849689 797856 748840
62452 748840 703737 662813 626150 594490 568364 546619 526990 508309 491321 477155 465930
62441 465930 457148 450566 445990 442730 439936 437278 434935 433086 431700 430600 429424 427664 425017 421678
62427 421678 418190 415052 412432 410013 407148 403422 399166 395196 392019 389463 386963 383937 380047 375600
$$ packed form
62511G30063L9815M0796M0789L9689L7334L3508K8256K2011J5234Q146R96n683
62499A030954j1437j6367k0764k4324k6257k6344k5392k4188k2428j9211j4460
62488G99782r227m527m53L335O899J0288J4115J9214K5645L2317L7726M1075M2825
62475A019014M4175M5732M6539M4758L9540L1800K3128J4428O009j905r507j7740
62463A285971k7230l7069m5425n1249n4700n6183n6011n4879n3536n1833m9016
62452G48840m5103m0924l6663l1660k6126k1745j9629j8681j6988j4166j1225
62441D65930q782o582m576l260k794k658k343j849j386j100j176j760k647l339
62427D21678l488l138k620k419k865l726m256l970l177k556k500l026l890m447
$$ plain form
62413 375600 371648 369127 367766 366327 364116 361791 360414 360214 360564 360726 360232 358826 356585 354098 352217
62398 352217 351591 352359 354142 356307 358547 361260 365034 369643 373966 377102 379203 380980 382801 384704 387014
62383 387014 390361 395072 400872 407289 414184 421849 430655 440551 450924 461085 470984 481327 492978
62370 492978 506420 521760 538945 557858 578418 600749 625188 652231 682646 717474 757475
62359 757475 802582 852356 907018 967595 1034858 1108527 1187420 1269593 1351914 1430158 1500262
62348 1500262 1559442 1605971 1638563 1656661 1661082 1653705 1636417 1610556 1577018 1536364 1488870 1434908
62336 1434908 1375321 1311356 1244586 1177247 1112200 1051804 996770 946554 900770 859717 823651
62325 823651 792245 764935 741230 720336 700967 681980 663089 644668 626961 609725 592586
$$ packed form
62413C75600l952k521j361j439k211k325j377k00L50J62m94j406k241k487j881
62398C52217o26P68J783K165K240K713L774M609M323L136K101J777J821J903K310
62383C87014L347M711N800O417O895P665Q806R896J0373J0161R899J0343J1651
62370D92978J3442J5340J7185J8913K0560K2331K4439K7043L0415L4828M0001
62359G57475M5107M9774N4662O0577O7263P3669P8893Q2173Q2321P8244P0104
62348A500262N9180M6529L2592J8098M421p377j7288k5861l3538m0654m7494n3962
62336A434908n9587o3965o6770o7339o5047o0396n5034n0216m5784m1053l6066
62325H23651l1406k7310k3705k0894j9369j8987j8891j8421j7707j7236j7139
$$ plain form
62314 592586 575461 558609 542431 527321 513565 501169 489763 478876 468427 458894 450841 444384
62302 444384 439279 435390 432740 431174 430309 429869 429715 429533 428948 428092 427655 428081 429080 430188 431498 433509
62286 433509 436501 440358 444817 449621 454653 460124 466354 473173 479963 486562 493666 501876 510761 519502
62272 519502 528142 537513 548078 559558 571723 584905 599646 616425 635895 658878 685892 717070
62260 717070 752694 793393 839668 891693 949858 1015010 1087631 1166801 1250147 1334587 1416843
62249 1416843 1493440 1560746 1615396 1654933 1678389 1686529 1681492 1665838 1641452 1608949 1567889 1517725
62237 1517725 1458891 1393228 1323348 1251536 1179240 1107426 1037153 969695 906258 847757 794853
62226 794853 748004 707324 672366 642255 616172 593651 574300 557378 541993 527741 514883
$$ packed form
62314E92586j7125j6852j6178j5110j3756j2396j1406j0887j0449r533q053o457
62302D44384n105l889k650j566q65m40j54j82n85q56m37M26R99J108J310K011
62286D33509K992L857M459M804N032N471O230O819O790O599P104Q210Q885Q741
62272E19502Q640R371J0565J1480J2165J3182J4741J6779J9470K2983K7014L1178
62260G17070L5624M0699M6275N2025N8165O5152P2621P9170Q3346Q4440Q2256
62249A416843P6597O7306N4650L9537K3456Q140n037j5654k4386l2503m1060n0164
62237A517725n8834o5663o9880p1812p2296p1814p0273o7458o3437n8501n2904
62226G94853m6849m0680l4958l0111k6083k2521j9351j6922j5385j4252j2858
$$ plain form
62215 514883 503778 494309 485909 477944 470091 462618 456285 451635 448363 445744 443681 442766 443227 444466
62201 444466 446003 448212 451632 456103 461251 467387 475188 484702 495379 506890 519274 532472 546467
62188 546467 561805 579110 597908 616622 633975 649957 665276 680410 695340 709638 722517
62177 722517 733163 741302 747231 751444 754739 758692 765245 775567 789893 808751 833562 865482 904271
62164 904271 948958 999138 1054692 1114381 1175501 1234950 1289922 1337476 1374431 1398637 1410333
62153 1410333 1411776 1405357 1392192 1372325 1345788 1313053 1274647 1230809 1181840 1128715 1073173 1017275
62141 1017275 962979 912004 865688 824686 788825 757431 729963 706358 686814 671281 659344
62130 659344 650622 645092 642775 643231 645700 649703 655208 662121 669973 678186 686332 694056 701136 707764
$$ packed form
62215E14883j1105r469q400p965p853p473o333m650l272k619k063r15M61J239
62201D44466J537K209L420M471N148O136P801R514J0677J1511J2384J3198J3995
62188E46467J5338J7305J8798J8714J7353J5982J5319J5134J4930J4298J2879
62177G22517J0646Q139N929M213L295L953O553J0322J4326J8858K4811L1920L8789
62164I04271M4687N0180N5554N9689O1120N9449N4972M7554L6955K4206J1696
62153A410333J443o419j3165j9867k6537l2735l8406m3838m8969n3125n5542n5898
62141A017275n4296n0975m6316m1002l5861l1394k7468k3605j9544j5533j1937
62130F59344q722n530k317M56K469M003N505O913P852Q213Q146P724P080O628
$$ plain form
62116 707764 714330 720714 726303 730871 734753 737682 738169 734840 727992 719096 709165 698456 687460 677088
62102 677088 667845 659784 653410 649729 649183 651233 655219 660883 667840 675459 683703 693295 704456 716152
62088 716152 727275 737988 749143 760730 771827 782107 792679 805142 820088 836722 853849
62077 853849 871116 889298 909445 931991 956833 983887 1012967 1043291 1073878 1104600 1136245
62066 1136245 1169402 1204037 1240425 1279632 1322396 1368011 1414758 1460839 1504169 1541861 1571028
62055 1571028 1590219 1599603 1600019 1592528 1578690 1560324 1538519 1513069 1482846 1446518 1403344 1354091
62043 1354091 1301270 1247809 1195207 1143291 1091720 1041125 992646 946985 904349 864915 828874
62032 828874 796239 767001 741348 719367 700546 683914 668717 654729 641865 629790 618107
$$ packed form
62116G07764O566O384N589M568L882K929M87l329o848q896r931j0709j0996j0372
62102F77088r243q061o374l681n46K050L986N664O957P619Q244R592J1161J1696
62088G16152J1123J0713J1155J1587J1097J0280J0572J2463J4946J6634J7127
62077H53849J7267J8182K0147K2546K4842K7054K9080L0324L0587L0722L1645
62066A136245L3157L4635L6388L9207M2764M5615M6747M6081M3330L7692K9167
62055A571028J9191R384M16p491j3838j8366k1805k5450l0223l6328m3174m9253
62043A354091n2821n3461n2602n1916n1571n0595m8479m5661m2636l9434l6041
62032H28874l2635k9238k5653k1981j8821j6632j5197j3988j2864j2075j1683
$$ plain form
62021 618107 606725 595715 584805 573408 561339 549267 538121 528179 519021 510258 501913 494135
62009 494135 487048 481042 476821 474879 475151 477270 480798 485076 489352 493469 498043 503506 509300 514443
61995 514443 518567 521770 523689 523524 521051 516934 511764 505386 497515 488602 479576 470910 462312 453271
61981 453271 443651 433835 424503 416277 409378 403580 398552 394214 390655 387819 385413 383148 380945 378936
61967 378936 377398 376637 376818 377807 379283 381016 382935 384973 387108 389671 393295 398244 403940 409544 414891
61952 414891 420408 426178 431822 437549 444623 454116 465579 477658 489857 503011 518119 535440 554949
61939 554949 576989 601972 629621 658777 687901 715840 742399 768156 793499 817964 840850
61928 840850 862151 882215 900524 915679 926741 933868 937299 936461 930647 920112 906064 890014
$$ packed form
62021F18107j1382j1010j0910j1397j2069j2072j1146r942r158q763q345p778
62009D94135p087o006m221j942K72K119L528M278M276M117M574N463N794N143
61995E14443M124L203J919j65k473m117n170o378p871q913r026q666q598r041
61981D53271r620r816r332q226o899n798n028m338l559k836k406k265k203k009
61967C78936j538p61J81R89J476J733J919K038K135K563L624M949N696N604N347
61952D14891N517N770N644N727P074R493J1463J2079J2199J3154J5108J7321J9509
61939E54949K2040K4983K7649K9156K9124K7939K6559K5757K5343K4465K2886
61928H40850K1301K0064J8309J5155J1062P127L431q38n814j0535j4048j6050
$$ plain form
61916 890014 873551 858258 845280 835233 828893 827481 831737 841169 854776 872176 893327 917467
61904 917467 943080 968731 993231 1015066 1032444 1044047 1049292 1047907 1039959 1026304 1008351 987065
61892 987065 962731 935880 907873 880164 853288 826988 801181 776464 753711 733385 715216
61881 715216 698468 682484 667036 652158 637811 623817 610064 596645 583838 572066 561737
61870 561737 552959 545471 538996 533657 529908 528120 528254 529869 532458 535983 541139 548846 559500 572989
61856 572989 589413 609242 632654 659310 689113 722631 760294 801618 845634 891599 938739
61845 938739 985795 1031608 1075813 1118104 1156887 1189415 1213297 1227436 1231827 1227277 1215404 1198149
61833 1198149 1177132 1153927 1130781 1110301 1094289 1083488 1078432 1079783 1087769 1102014 1122036 1147040
$$ packed form
61916H90014j6463j5293j2978j0047o340j412M256R432J3607J7400K1151K4140
61904I17467K5613K5651K4500K1835J7378J1603N245j385p948j3655j7953k1286
61892I87065k4334k6851k8007k7709k6876k6300k5807k4717k2753k0326j8169
61881G15216j6748j5984j5448j4878j4347j3994j3753j3419j2807j1772j0329
61870E61737q778p488o475n339l749j788J34J615K589L525N156P707J0654J3489
61856E72989J6424J9829K3412K6656K9803L3518L7663M1324M4016M5965M7140
61845I38739M7056M5813M4205M2291L8783L2528K3882J4139M391m550j1873j7255
61833A198149k1017k3205k3146k0480j6012j0801n056J351P986J4245K0022K5004
$$ plain form
61821 1147040 1174924 1202300 1226014 1244165 1255484 1258603 1252571 1237490 1214022 1182700 1144338 1100723
61809 1100723 1054244 1006953 960381 915902 874642 836980 802523 770610 740724 712656 686567
61798 686567 662742 641090 621111 602537 585772 571416 559562 549663 540774 531801 522072 512083
61786 512083 503212 496234 490468 484867 479532 475400 472636 470186 467048 463337 459805 456798 454029 451089
61772 451089 447855 444474 441201 438263 435829 434045 433037 432808 433219 434116 435403 436989 438874 441286 444449
61757 444449 448059 451375 454092 456810 460224 464148 467794 470827 473551 476108 478056 478837 478230 476227 472989
61742 472989 469140 465615 462854 460375 457454 453948 450223 446595 443371 441212 440799 441917 443312 443804 443382
61727 443382 443047 443745 445695 448549 451813 455049 458028 460933 464292 468515 473517 478850 484073 488844 492838
$$ packed form
61821A147040K7884K7376K3714J8151J1319L119o032j5081k3468l1322l8362m3615
61809A100723m6479m7291m6572m4479m1260l7662l4457l1913k9886k8068k6089
61798F86567k3825k1652j9979j8574j6765j4356j1854r899q889q973r729r989
61786E12083q871o978n766n601n335m132k764k450l138l711l532l007k769k940
61772D51089l234l381l273k938k434j784j008k29M11Q97J287J586J885K412L163
61757D44449L610L316K717K718L414L924L646L033K724K557J948P81o07k003l238
61742D72989l849l525k761k479k921l506l725l628l224k159m13J118J395M92m22
61727D43382l35O98J950K854L264L236K979K905L359M223N002N333N223M771L994
$$ plain form
61712 492838 495851 497957 499280 499527 498065 494599 489615 483969 478234 472614 467261 462286 457539 452782
61698 452782 448191 444302 441255 438427 435169 431647 428506 425818 422996 419865 417205 415743 415030 413880
61684 413880 411807 409442 407551 406155 404802 403275 401816 400866 400712 401158 401483 401087 400207 399618 399512 399199
61668 399199 398145 396782 395936 395856 396238 396817 397435 397874 398128 398579 399364 399933 399874 399900 401170 403706 406280 407959
61650 407959 408975 409877 410635 411080 411643 413056 415536 418636 421811 424935 428361 432521 437258 441563 444300
61635 444300 445218 444890 443698 441396 437805 433366 428716 424129 419672 415487 411576 407681 403752 400275 397755
61620 397755 396097 394833 393798 393251 393424 394222 395345 396471 397340 397709 397191 395233 391550 386578 381138 375552
61604 375552 369463 362668 355730 349521 344489 340535 337193 333678 329219 323827 318500 314278 311211 308519
$$ packed form
61712D92838L013K106J323K47j462l466m984n646n735n620n353m975m747m757
61698D52782m591l889l047k828l258l522l141k688k822l131k660j462p13j150
61684D13880k073k365j891j396j353j527j459r50j54M46L25l96q80n89j06l13
61668C99199j054j363q46q0L82N79O18M39K54M51P85N69n9K6J270K536K574J679
61650D07959J016R02P58M45N63J413K480L100L175L124L426M160M737M305K737
61635D44300R18l28j192k302l591m439m650m587m457m185l911l895l929l477k520
61620C97755j658j264j035n47J73P98J123J126Q69L69n18j958l683m972n440n586
61604C75552o089o795o938o209n032l954l342l515m459n392n327m222l067k692
$$ plain form
61590 308519 305473 301813 297653 293454 289961 287672 286374 285429 284414 283180 281492 279110 276242 273543
61576 273543 271471 269817 267986 265695 263351 261668 260894 260501 259831 258873 258015 257198 255959 254497 253922 254974
61560 254974 257025 258892 260212 261392 262577 263472 264059 264674 265280 265361 264823 264424 264976 266408 267923 268845 269073
61543 269073 268928 268865 269290 270394 272002 273652 274915 275721 276334 277015 277837 278943 280743 283517 286885 290065
61527 290065 292632 294608 295771 295519 293694 291045 288453 286075 283601 280964 278313 275641 272991 270797
61513 270797 269508 268979 268674 268292 267794 267010 265770 264368 263407 263210 263649 264410 265073 265194 264793 264538 264898 265360
61495 265360 265126 264432 264362 265378 266828 268078 269325 270928 272582 273682 274080 274108 274129 274411 275092 275911 276274
61478 276274 275984 275694 276316 278079 280475 282975 285440 287815 289760 290797 290789 290234 290008 290683 292021 293124
$$ packed form
61590C08519l046l660m160m199l493k289j298r45j015j234j688k382k868k699
61576B73543k072j654j831k291k344j683p74l93o70r58q58q17j239j462n75J052
61560B54974K051J867J320J180J185Q95N87O15O06Q1n38l99N52J432J515R22K28
61543B69073j45o3M25J104J608J650J263Q06O13O81Q22J106J800K774L368L180
61527B90065K567J976J163k52j825k649k592k378k474k637k651k672k650k194
61513B70797j289n29l05l82m98p84j240j402r61j97M39P61O63J21m01k55L60M62
61495B65360k34o94p0J016J450J250J247J603J654J100L98K8K1K82O81Q19L63
61478B76274k90k90O22J763K396K500K465K375J945J037qn55k26O75J338J103
$$ plain form
61462 293124 293131 291861 289957 288456 288036 288467 288856 288535 287628 286678 286006 285614 285469 285540 285761 286257 287429 289375
61444 289375 291404 292628 293034 293646 295570 299200 304211 309864 315297 319946 323825 327201 330076 332361 334372
61429 334372 336597 338921 340598 341140 340835 340347 340182 340615 341690 343195 344998 347423 350858 355025 359159
61414 359159 362904 366420 369565 371747 372741 372924 372389 370601 367383 363463 359421 354793 349074 343154 338801
61399 338801 336769 336100 335260 333401 330628 327683 325461 324369 323998 323669 323182 322766 322521 322382 322485 323040 323902
61382 323902 324828 326083 328180 330881 333060 333917 333928 334313 335822 338235 340740 342579 343636 344625 346463 349139
61366 349139 351466 352330 352043 352068 353422 355723 357878 359337 360404 361576 362971 364428 365930 367799 370560
61351 370560 374638 380038 386256 392715 399466 407321 416971 427951 438762 448090 455766 462470 468745 474520
$$ packed form
61462B93124Pj270j904j501m20M31L89l21r07r50o72l92j45P1K21M96J172J946
61444B89375K029J224M06O12J924L630N011N653N433M649L879L376K875K285K011
61429C34372K225K324J677N42l05m88j65M33J075J505J803K425L435M167M134
61414C59159L745L516L145K182R94J83n35j788l218l920m042m628n719n920m353
61399C38801k032o69q40j859k773k945k222j092l71l29m87m16k45j39J03N55Q62
61382C23902R26J255K097K701K179Q57J1L85J509K413K505J839J057R89J838K676
61366C49139K327Q64k87K5J354K301K155J459J067J172J395J457J502J869K761
61351C70560M078N400O218O459O751P855R650J0980J0811R328P676O704O275N775
$$ plain form
61337 474520 479491 483738 487892 492658 498087 503345 507456 510365 513032 516183 519094 519953 517524 512286
61323 512286 505862 499579 493735 488089 482713 478096 474543 471801 469437 467392 465908 465003 464382 463975 464213
61308 464213 465493 467593 469938 472381 475402 479528 484871 491270 498515 506134 513166 518494 521528 522422
61294 522422 521681 519676 516547 512347 507232 501591 495965 490670 485482 479999 474373 469352 465376 462007
61280 462007 458681 455736 454112 454125 455127 456470 458183 460521 463442 466901 471196 476544 482593 488753 494697
61265 494697 500176 504710 508071 510896 514298 518924 524846 532222 541446 552561 564954 577787 590405
61252 590405 602327 613211 622926 631431 638576 644289 648815 652435 655059 656422 656485 655096 651478 644849
61238 644849 635718 625933 617032 608922 600457 590971 581040 571970 564750 559301 554705 550325 546527 543942
$$ packed form
61337D74520M971M247M154M766N429N258M111K909K667L151K911Q59k429n238
61323E12286o424o283n844n646n376m617l553k742k364k045j484r05o21m07K38
61308D64213J280K100K345K443L021M126N343O399P245P619P032N328L034Q94
61294E22422p41k005l129m200n115n641n626n295n188n483n626n021l976l369
61280D62007l326k945j624J3J002J343J713K338K921L459M295N348O049O160N944
61265D94697N479M534L361K825L402M626N922P376R224J1115J2393J2833J2618
61252E90405J1922J0884R715Q505P145N713M526L620K624J363O3j389l618o629
61238F44849r131r785q901q110q465r486r931r070p220n449m596m380l798k585
$$ plain form
61224 543942 542292 540678 539004 538220 538838 539990 540478 540188 539882 540038 540519 541111 541784 542549 543463 544755 546561
61207 546561 548544 549959 550055 548511 545784 543093 541552 541119 540869 540538 541202 543992 548742 554576 561439 570264
61191 570264 581758 595675 611229 627612 643952 659269 672722 683832 692549 699314 704930 710071
61179 710071 714983 719798 724824 730149 735210 739254 742140 744281 745833 746378 745440 742972 739316 734968 730417
61164 730417 725860 720972 715055 707518 698221 687553 676272 665007 653702 641811 629273 616992
61152 616992 605999 596428 587786 580051 573907 569848 567530 566149 565142 564346 563646 562537 560037 555212
61138 555212 547975 539270 530283 521678 513685 506524 500334 494938 490153 486233 483628 482445 482517 483823 486428
61123 486428 490144 494768 500549 507962 517070 527596 539590 553417 569020 585735 603119 621531
$$ packed form
61224E43942j650j614j674p84O18J152M88k90l06J56M81N92O73P65R14J292J806
61207E46561J983J415R6j544k727k691j541m33k50l31O64K790M750N834O863Q825
61191E70264J1494J3917J5554J6383J6340J5317J3453J1110Q717O765N616N141
61179G10071M912M815N026N325N061M044K886K141J552N45r38k468l656m348m551
61164G30417m557m888n917p537r297j0668j1281j1265j1305j1891j2538j2281
61152F16992j0993r571q642p735o144m059k318j381j007p96p00j109k500m825
61138E55212p237q705q987q605p993p161o190n396m785l920k605j183P2J306K605
61123D86428L716M624N781P413R108J0526J1994J3827J5603J6715J7384J8412
$$ plain form
61111 621531 641554 663019 684873 705960 725819 744749 763160 781029 798148 814770 831469
61100 831469 848125 863546 876455 886444 893524 897199 896686 891871 883482 872478 859792 846344 832572
61087 832572 818116 802596 786546 770797 755133 738528 720755 702794 685440 668491 651692
61076 651692 635631 621093 608121 596238 585132 574712 564953 556145 548916 543594 539797 536879 534419
61063 534419 532177 530110 528670 528578 529942 532131 534811 538501 543688 549955 556532 563267 570496 578402 587071
61048 587071 596866 608145 620800 634583 649689 666577 685473 706457 729703 755126 782031 809753
61036 809753 838619 869836 904318 941746 980620 1019132 1056408 1093204 1131127 1171140 1213424
61025 1213424 1258775 1309084 1365618 1427621 1493545 1563224 1638063 1719922 1811234 1916042 2039798
$$ packed form
61111F21531K0023K1465K1854K1087J9859J8930J8411J7869J7119J6622J6699
61100H31469J6656J5421J2909R989P080L675n13m815q389j1004j2686j3448j3772
61087H32572j4456j5520j6050j5749j5664j6605j7773j7961j7354j6949j6799
61076F51692j6061j4538j2972j1883j1106j0420r759q808p229n322l797k918k460
61063E34419k242k067j440r2J364K189K680L690N187O267O577O735P229P906Q669
61048E87071R795J1279J2655J3783J5106J6888J8896K0984K3246K5423K6905K7722
61036H09753K8866L1217L4482L7428L8874L8512L7276L6796L7923M0013M2284
61025A213424M5351N0309N6534O2003O5924O9679P4839Q1859R1312J04808J23756
$$ plain form
61014 2039798 2188322 2367968 2586379 2851871 3172948 3560690 4031675 4606818 5308603
61005 5308603 6162535 7195499 8411913 9748304 11047668 12101339 12749622 12966973 12863406
60996 12863406 12612341 12376124 12275156 12377741 12671853 13034819 13257800 13140541 12593837
60987 12593837 11670896 10514969 9279847 8080900 6986517 6027604 5208638 4518638 3941436
60978 3941436 3461047 3062054 2729771 2452036 2219815 2025516 1861737 1721940 1601138
60969 1601138 1495346 1401210 1316641 1241008 1173949 1114291 1060448 1011431 967135 927907 894038
60958 894038 865241 840367 817856 796616 776239 756536 737447 719517 703778 690786 680179
60947 680179 671392 664248 658515 653527 648883 645128 643105 642747 643079 643233 642909 641896 639789 636374 631870
$$ packed form
61014B039798J48524J79646K18411K65492L21077L87742M70985N75143P01785
61005E308603Q53932J032964J216414J336391J299364J053671O48283K17351j03567
60996A2863406k51065k36217j00968J02585K94112L62966K22981j17259n46704
60987A2593837r22941j155927j235122j198947j094383r58913q18966o90000n77202
60978C941436m80389l98993l32283k77735k32221j94299j63779j39797j20802
60969A601138j05792r4136q4569p5633o7059n9658n3843m9017m4296l9228l3869
60958H94038k8797k4874k2511k1240k0377j9703j9089j7930j5739j2992j0607
60947F80179q787p144n733m988m644l755k023l58L32J54l24j013k107l415m504
$$ plain form
60932 631870 626566 620480 613578 606116 598620 591559 585075 578885 572452 565423 558003 550851 544613 539590
60918 539590 535704 532605 529834 527035 524088 520988 517772 514633 511924 509817 508139 506812 506294 507150 509241
60903 509241 511764 514186 516849 520507 525586 531981 539301 547065 554885 562691 570716 579063 587326 594725
60889 594725 600626 605075 608926 613303 618705 624642 630411 636108 642573 650431 659618 669809 680778 692222
60875 692222 703859 716032 729680 745361 762640 780825 799831 819847 840602 861578 882628
60864 882628 903653 923834 941949 957474 970687 981635 989762 994794 997263 997758 996154 992081 985624
60851 985624 977020 965985 952077 935675 917975 899901 881406 862029 841784 821250 801060 781516
60839 781516 762574 743927 725153 705977 686394 666497 646413 626609 608034 591419 576387
$$ packed form
60932F31870n304o086o902p462p496p061o484o190o433p029p420p152o238n023
60918E39590l886l099k771k799k947l100l216l139k709k107j678j327n18Q56K091
60903E09241K523K422K663L658N079O395P320P764P820P806Q025Q347Q263P399
60889E94725N901M449L851M377N402N937N769N697O465P858R187J0191J0969J1444
60875F92222J1637J2173J3648J5681J7279J8185J9006K0016K0755K0976K1050
60864H82628K1025K0181J8115J5525J3213J0948Q127N032K469M95j604m073o457
60851I85624q604j1035j3908j6402j7700j8074j8495j9377k0245k0534k0190j9544
60839G81516j8942j8647j8774j9176j9583j9897k0084j9804j8575j6615j5032
$$ plain form
60828 576387 561823 547425 534347 523721 514955 506328 497228 488815 482188 476746 471052 464780 459020
60815 459020 454883 452444 450975 449556 447429 444405 441114 438485 436852 435831 434979 434160 433255 432141 431106
60800 431106 430787 431404 432426 433274 433997 434984 436320 437755 439073 440095 440531 440224 439440 438563 437537 436031
60784 436031 434139 432556 431800 431526 430847 429292 427168 425045 423108 421209 419335 417691 416302 414865 413118
60769 413118 411103 408825 405974 402350 398407 394907 392034 389289 386251 382982 379562 375711 371199 366333
60755 366333 361697 357658 354338 351792 349855 348039 346049 344383 344017 345432 348189 351501 354877 358157
60741 358157 361286 364345 367567 370950 373871 375362 374854 372612 369469 366390 364193 363283 363372 363717 363908 364233
60725 364233 364955 365548 365150 363634 361600 359358 356656 353582 350879 348860 346731 343700 340216 337297 335015
$$ packed form
60828E76387j4564j4398j3078j0626q766q627r100q413o627n442n694o272n760
60815D59020m137k439j469j419k127l024l291k629j633j021q52q19r05j114j035
60800D31106l19O17J022Q48P23R87J336J435J318J022M36l07p84q77j026j506
60784D36031j892j583p56k74o79j555k124k123j937j899j874j644j389j437j747
60769D13118k015k278k851l624l943l500k873k745l038l269l420l851m512m866
60755C66333m636m039l320k546j937j816j990j666l66J415K757L312L376L280
60741C58157L129L059L222L383K921J491n08k242l143l079k197r10Q9L45J91L25
60725C64233P22N93l98j516k034k242k702l074k703k019k129l031l484k919k282
$$ plain form
60710 335015 332566 329615 326597 323685 320458 316862 313680 311635 310573 309839 308934 307589 305793 304084 303221
60695 303221 303218 303181 302439 301292 300276 299357 298454 298163 299095 300779 302017 302369 302604 303621 305456 307428 308831
60678 308831 309344 309154 308913 309379 310920 313336 316087 318601 320545 322011 323346 324738 326127 327646 329745
60663 329745 332574 335475 337589 338807 339807 341256 343383 346186 349523 352917 355730 357759 359457 361470
60649 361470 364066 367063 370092 372911 375555 378111 380202 380905 379501 376261 372120 367611 362574 356917
60635 356917 351160 345924 341244 336836 332844 329848 328039 326754 325073 322748 320357 318591 317644 317288 317245
60620 317245 317217 316759 315472 313451 311320 309791 309260 309724 310796 311802 312216 312146 312163 312555 313018 313164 313016 312820
60602 312820 312668 312555 312545 312690 312941 313331 313970 314735 315298 315673 316307 317337 318160 318237 317940 317995 318332 318153 317112
$$ packed form
60710C35015k449k951l018k912l227l596l182k045j062p34r05j345j796j709q63
60695C03221ll7p42j147j016r19r03k91R32J684J238L52K35J017J835J972J403
60678C08831N13j90k41M66J541K416K751K514J944J466J335J392J389J519K099
60663C29745K829K901K114J218J000J449K127K803L337L394K813K029J698K013
60649C61470K596K997L029K819K644K556K091P03j404l240m141m509n037n657
60635C56917n757n236m680m408l992k996j809j285j681k325k391j766r47l56m3
60620C17245k8m58j287k021k131j529n31M64J072J006M14p0J7L92M63J46j48j96
60602C12820j52j13j0J45K51L90O39P65N63L75O34J030Q23P7k97N5L37j79j041
$$ plain form
60583 317112 315755 314734 314194 314188 315109 317276 320315 323361 325895 328251 331347 335899 341820 348422 355325
60568 355325 363064 372471 383421 394461 403807 410453 414232 415157 413191 408705 402773 396673 391125 386180
60554 386180 381886 378743 377330 377671 379313 381955 385736 390915 397640 405991 415806 426434 437154 447994
60540 447994 459582 471854 483430 492682 499008 502629 503556 501486 496566 489689 482034 474670 468375 463296
60526 463296 458828 454292 449758 445881 442992 440785 438799 436834 434940 433378 432533 432513 432939 433528 434695
60511 434695 437125 440962 445911 451952 459293 467822 477400 488768 503310 521665 543218 567210 593627
60498 593627 622645 653833 686403 719716 752949 784540 812416 834531 848907 853641 847599 831162
60486 831162 805966 774027 737336 698095 658812 621842 588773 560029 534979 512657 492631
$$ packed form
60583C17112j357j021n40oR21K167L039L046K534K356L096M552N921O602O903
60568C55325P739R407J0950J1040R346O646L779R25j966m486n932o100n548m945
60554C86180m294l143j413L41J642K642L781N179O725Q351R815J0628J0720J0840
60540D47994J1588J2272J1576R252O326L621R27k070m920o877p655p364o295n079
60526D63296m468m536m534l877k889k207j986j965j894j562q45k0M26N89J167
60511D34695K430L837M949O041P341Q529R578J1368J4542J8355K1553K3992K6417
60498E93627K9018L1188L2570L3313L3233L1591K7876K2115J4376M734o042j6437
60486H31162k5196l1939l6691l9241l9283l6970l3069k8744k5050k2322k0026
$$ plain form
60475 492631 475127 460307 447748 436820 427279 419159 412238 405916 399612 393150 386826 381178 376509
60462 376509 372549 368739 364983 361820 359670 358137 356367 353904 350947 347912 345097 342688 340727 338976
60448 338976 337103 335127 333511 332640 332306 331915 331257 330871 331469 332981 334466 335034 334682 334036 333518 333141 332891
60431 332891 332806 332585 331617 329697 327459 325801 325011 324654 324168 323414 322695 322371 322428 322436 322086 321738 322182 323715 325692
60412 325692 327204 328019 328629 329458 330285 330528 329952 328984 328338 328427 329251 330783 333174 336391 339852 342748 344756
60395 344756 346240 347787 349719 352039 354573 357117 359619 362273 365297 368638 372025 375275 378362 381244
60381 381244 383830 386126 388312 390730 393810 397782 402309 406717 410772 414871 419075 422482 424171 424508
60367 424508 424765 425637 426880 428280 430066 432156 433848 434644 434808 434884 435276 436508 439161 443144 447672 452405
$$ packed form
60475D92631j7504j4820j2559j0928r541q120o921o322o304o462o324n648m669
60462C76509l960l810l756l163k150j533j770k463k957l035k815k409j961j751
60448C38976j873j976j616q71l34l91o58l86N98J512J485N68l52o46n18l77k50
60431C32891q5k21r68j920k238j658p90l57m86p54p19l24N7Ql50l48M44J533J977
60412C25692J512Q15O10Q29Q27K43n76r68o46Q9Q24J532K391L217L461K896K008
60395C44756J484J547J932K320K534K544K502K654L024L341L387L250L087K882
60381C81244K586K296K186K418L080L972M527M408M055M099M204L407J689L37
60367D24508K57Q72J243J400J786K090J692P96J64P6L92J232K653L983M528M733
$$ plain form
60351 452405 458035 465243 473553 481695 488665 494016 497632 499747 500764 500532 498300 493943 488748 484268
60337 484268 480742 477390 473947 471051 469173 467965 466769 465175 462999 460205 456934 453269 449048 444333
60323 444333 439836 436285 433416 430344 427001 424457 423614 424245 425717 428048 431724 436881 443357 451406 461793
60308 461793 475092 491363 510692 533581 560157 588881 616478 639572 656361 666442 669268 663601
60296 663601 648928 626933 600957 574075 548071 523965 502703 484983 470803 459565 450594 443518
60284 443518 438279 434888 433028 431926 430799 429463 428314 427688 427423 427089 426380 425191 423495 421358 419003
60269 419003 416690 414592 412860 411719 411250 411030 410174 408060 405042 402228 400379 399151 397616 395426 393172
60254 393172 391688 391279 391623 392093 392104 391471 390591 390028 389841 389598 389087 388620 388457 388378 388174 388192 388933 390215 391225
$$ packed form
60351D52405N630P208Q310Q142O970N351L616K115J017k32k232m357n195m480
60337D84268l526l352l443k896j878j208j196j594k176k794l271l665m221m715
60323D44333m497l551k869l072l343k544q43O31J472K331L676N157O476Q049J0387
60308D61793J3299J6271J9329K2889K6576K8724K7597K3094J6789J0081K826n667
60296F63601j4673k1995k5976k6882k6004k4106k1262j7720j4180j1238q971p076
60284D43518n239l391j860j102j127j336j149o26k65l34p09j189j696k137k355
60269D19003k313k098j732j141m69k20q56k114l018k814j849j228j535k190k254
60254C93172j484m09L44M70J1o33q80n63j87k43n11m67j63p9k04J8P41J282J010
$$ plain form
60235 391225 391437 391249 391692 393608 396996 400993 404529 407076 408684 409421 409223 408413 407846 408172 409228 410534
60219 410534 412091 414291 417222 420517 423789 426894 429830 432700 435707 438961 442423 446228 450780 456188
60205 456188 461866 467119 471937 476739 481492 485642 488972 492087 495879 500751 506340 511784 516286 519743
60191 519743 522805 526158 529803 533258 536215 538612 540219 540620 539620 537344 533998 529923 525726 521922
60177 521922 518439 514924 511500 508700 506618 504639 502165 499148 495826 492443 489443 487388 486241 485124
60163 485124 483243 480829 478787 477601 477090 477071 477692 478917 480197 481039 481662 482684 484250 485930 487520 489451
60147 489451 492072 494946 497302 498966 500361 501758 503194 505094 508327 513382 519954 527399 535005 541734
60133 541734 546575 549581 551890 554189 555854 556176 555724 555622 556006 556132 555679 554986 554248 553444 552989 553399 554314
$$ packed form
60235C91225K12j88M43J916L388L997L536K547J608P37j98q10n67L26J056J306
60219D10534J557K200K931L295L272L105K936K870L007L254L462L805M552N408
60205D56188N678N253M818M802M753M150L330L115L792M872N589N444M502L457
60191E19743L062L353L645L455K957K397J607M01j000k276l346m075m197l804
60177E21922l483l515l424k800k082j979k474l017l322l383l000k055j147j117
60163D85124j881k414k042j186n11j9O21J225J280Q42O23J022J566J680J590J931
60147D89451K621K874K356J664J395J397J436J900L233N055O572P445P606O729
60133E41734M841L006K309K299J665L22m52j02L84J26m53o93p38q04m55M10R15
$$ plain form
60116 554314 554820 554883 555513 557216 559140 560179 560249 560070 560247 560991 562183 563319 563745 563357 562739 562402 562212 561768
60098 561768 560897 559532 557554 555140 553037 552107 552684 554374 556296 557589 558099 558612 560041 562405 565010
60083 565010 567503 570048 572489 574151 574813 575110 575593 575976 575750 574979 574000 572805 571123 568723 565266 560306
60067 560306 553911 546863 539838 532805 525605 518524 511758 504840 497298 489513 482232 475569 469234 463490
60053 463490 459018 455868 453315 450801 448374 446113 443798 441424 439507 438627 439019 440716 443629 447288 450982
60038 450982 454483 458405 463479 469599 475810 481140 485320 488736 491835 494539 496222 496338 495015 492900
60024 492900 490405 487294 483092 477727 471628 465289 458931 452578 446352 440577 435642 431768 428826 426302
60010 426302 423563 420426 417548 415963 416007 416838 417230 416610 415061 412649 409441 406147 403963 403418 403845 404318
$$ packed form
60116E54314N06O3O30J703J924J039P0j79J77P44J192J136M26l88o18l37j90m44
60098E61768q71j365j978k414k103r30N77J690J922J293N10N13J429K364K605
60083E65010K493K545K441J662O62K97M83L83k26p71r79j195j682k400l457m960
60067E60306o395p048p025p033p200p081o766o918p542p785p281o663o335n744
60053D63490m472l150k553k514k427k261k315k374j917q80L92J697K913L659L694
60038D50982L501L922N074O120O211N330M180L416L099K704J683J16j323k115
60024D92900k495l111m202n365o099o339o358o353o226n775m935l874k942k524
60010D26302k739l137k878j585M4Q31L92o20j549k412l208l294k184n45M27M73
$$ plain form
59994 404318 404637 405071 405590 405988 406492 407579 409184 410624 411426 411889 412775 414743 418087 422552 427231 430990
59978 430990 433356 434889 436509 438562 440678 442325 443206 443199 442287 440714 438992 437501 436197 434914 433875
59963 433875 433654 434588 436414 438521 440380 441765 442860 444186 446071 448093 449416 449833 450005 450465 450975 451264
59947 451264 451790 453008 454357 454876 454618 454556 455123 455777 456067 456188 456258 455996 455449 455143 455027 454101 451743 448711
59929 448711 446132 444116 442160 440406 439520 439545 439780 439844 440153 441254 443202 445670 448279 450734 452999 455395
59913 455395 458292 461807 466029 471373 478332 486890 496361 505628 513368 518509 521015 522031 522749 523189 522545
59898 522545 520538 517875 515419 513483 511975 510706 509406 507882 506390 505529 505661 506726 508644 511509 515209
59883 515209 519243 523161 526967 530901 535091 539580 544378 549160 553097 555407 556136 556121 556043 555708 554403 551817
$$ packed form
59994D04318L19M34N19L98N04J087J605J440Q02M63Q86J968L344M465M679L759
59978D30990K366J533J620K053K116J647Q81pr12j573j722j491j304j283j039
59963D33875k21R34J826K107J859J385J095J326J885K022J323M17J72M60N10K89
59947D51264N26J218J349N19k58o2N67O54K90J21P0k62n47l06j16r26k358l032
59929D48711k579k016j956j754q86K5K35O4L09J101J948K468K609K455K265K396
59913D55395K897L515M222N344O959Q558R471R267P740N141K506J016P18M40o44
59898E22545k007k663k456j936j508j269j300j524j492q61J32J065J918K865L700
59883E15209M034L918L806L934M190M489M798M782L937K310P29j5p8l35j305k586
$$ plain form
59867 551817 548347 544521 540459 536045 531389 526873 522878 519777 518037 517932 519130 520945 523061 525733
59853 525733 529228 533419 537906 542171 545589 547783 549064 550058 550864 551201 551425 552470 554214 554710 551906
59838 551906 545786 538120 530517 523475 517034 511362 506639 503034 500884 500302 500652 501056 501485 502632 504592
59823 504592 506351 506925 506396 505421 504182 502291 499475 495919 492062 488417 485511 483728 483165 483797 485692
59808 485692 488820 492601 495835 497386 497065 495736 494414 493316 491982 490168 488165 486163 483848 480974
59794 480974 477972 475524 473738 472148 470426 468648 466959 465377 464005 463115 462875 463095 463189 462445 460595 458311
59778 458311 456699 456052 455415 453803 451501 449628 448759 448630 449004 450000 451492 452908 453904 454719 455635 456501 457102
59761 457102 457669 458671 460255 462077 463655 464840 466009 467722 470090 472674 475189 478020 481712 486220
$$ packed form
59867E51817l470l826m062m414m656m516l995l101j740j05J198J815K116K672
59853E25733L495M191M487M265L418K194J281R94Q06L37K24J045J744M96k804
59838E51906o120p666p603p042o441n672m723l605k150n82L50M04M29J147J960
59823E04592J759N74n29r75j239j891k816l556l857l645k906j783n63O32J895
59808D85692L128L781L234J551l21j329j322j098j334j814k003k002k315k874
59794D80974l002k448j786j590j722j778j689j582j372q90k40K20R4p44j850k284
59778D58311j612o47o37j612k302j873q69j29L74R96J492J416R96Q15R16Q66O01
59761D57102N67J002J584J822J578J185J169J713K368K584K515K831L692M508
$$ plain form
59747 486220 491177 496659 502992 509806 515962 520653 524114 527124 530275 533833 537691 541141 543206 543629
59733 543629 543199 542761 542260 541195 539699 538588 538328 538482 538343 537820 537415 537417 537454 536980 535994 534966 534112 533155
59715 533155 531910 530722 530023 529794 529811 530149 531002 532184 533302 534258 535181 536033 536816 538089 540590 544259 548160
59698 548160 551510 554329 556997 559652 562237 564713 566994 568968 570652 572006 572574 571811 569911 567880 566591
59683 566591 566166 566389 567205 568447 569511 569701 568752 566843 564338 561650 558961 555810 551383 545556 539425
59668 539425 534446 531214 529302 528003 526833 525520 523958 522281 520737 519419 518260 517231 516472 516248 516855
59653 516855 518473 520988 524048 527376 531015 535178 539851 544541 548446 550923 551816 551231 549103 545326 540374
59638 540374 535321 530902 526822 522378 517491 512733 508628 505440 503366 502290 501451 500016 497975 495890
$$ packed form
59747D86220M957N482O333O814O156M691L461L010L151L558L858L450K065M23
59733E43629m30m38n01j065j496j111k60J54j39n23m05KL7m74r86j028q54r57
59715E33155j245j188o99k29J7L38Q53J182J118R56R23Q52P83J273K501L669L901
59698E48160L350K819K668K655K585K476K281J974J684J354N68p63j900k031j289
59683E66591m25K23Q16J242J064J90r49j909k505k688k689l151m427n827o131
59668E39425m979l232j912j299j170j313j562j677j544j318j159j029p59k24O07
59653E16855J618K515L060L328L639M163M673M690L905K477Q93n85k128l777m952
59638E40374n053m419m080m444m887m758m105l188k074j076q39j435k041k085
$$ plain form
59624 495890 493876 491550 488922 486469 484149 481159 477040 472298 467546 462704 457585 452676 448701 445804
59610 445804 443703 442328 441749 441799 442300 443516 445854 449183 452796 455966 458292 459717 460555 461389 462574 463894
59594 463894 464959 465831 466964 468582 470364 471818 472784 473514 474253 474787 474570 473389 471674 469873 467754 464851
59578 464851 461463 458554 456540 454739 452214 448703 444495 440010 435812 432551 430438 429002 427680 426403
59564 426403 425399 424775 424481 424379 424188 423769 423538 424142 425571 427106 428321 429487 430865 432349 434163 436974
59548 436974 440758 444394 447163 449936 454006 459462 465695 472920 481985 493184 506658 523633 545296
59535 545296 569697 591104 603609 605205 598233 586835 574661 564065 556052 550621 547560 546951 548740
59522 548740 552191 556365 561016 566402 572183 577067 579861 580536 579888 578413 575927 572211 567492 562074 555842
$$ packed form
59624D95890k014k326k628k453k320k990m119m742m752m842n119m909l975k897
59610D45804k101j375n79N0N01J216K338L329L613L170K326J425Q38Q34J185J320
59594D63894J065Q72J133J618J782J454R66P30P39N34k17j181j715j801k119k903
59578D64851l388k909k014j801k525l511m208m485m198l261k113j436j322j277
59564D26403j004o24k94j02j91m19k31O04J429J535J215J166J378J484J814K811
59548D36974L784L636K769K773M070N456O233P225R065J1199J3474J6975K1663
59535E45296K4401K1407J2505J596o972j1398j2174j0596q013n431l061o09J789
59522E48740L451M174M651N386N781M884K794O75o48j475k486l716m719n418o232
$$ plain form
59507 555842 548473 540044 531135 522413 514321 507068 500552 494381 488255 482345 477016 472286 467954 464199
59493 464199 461555 460209 459807 460034 460825 461866 462464 462255 461600 461037 460804 461150 462470 464631 466711 468074
59477 468074 469384 471935 476167 481364 486567 491195 494889 497396 498758 499308 499428 499505 499872 500505 500928 500757
59461 500757 500194 499730 499652 500132 501420 503575 506371 509926 514957 521845 529847 537996 546434 555930 566259
59446 566259 576068 584412 591402 596978 600017 599376 595367 589554 583273 576714 569312 560730 551540 542997
59432 542997 535931 529912 523791 517139 510757 505790 502779 501682 502218 503924 506455 510228 516269 524950
59418 524950 535430 546943 560114 576086 594838 615770 639944 669675 704354 737559 760256
59407 760256 767359 760511 744975 725520 705571 688061 675168 667856 667003 674007 688185 703681 711334
$$ packed form
59507E55842p369q429q909q722q092p253o516o171o126n910n329m730m332l755
59493D64199k644j346m02K27P91J041N98k09o55n63k33L46J320K161K080J363
59477D68074J310K551M232N197N203M628L694K507J362N50J20P7L67O33M23j71
59461E00757n63m64p8M80J288K155K796L555N031O888Q002Q149Q438R496J0329
59446E66259R809Q344O990N576L039o41m009n813o281o559p402q582r190q543
59432E42997p066o019o121o652o382m967l011j097N36J706K531L773O041Q681
59418E24950J0480J1513J3171J5972J8752K0932K4174K9731L4679L3205K2697
59407G60256P103o848j5536j9455j9949j7510j2893p312q53P004J4178J5496P653
$$ plain form
59394 711334 705010 685515 658216 628337 599195 573034 551224 533652 519164 506889 496625 488298
59382 488298 481843 477408 474936 473741 473116 473165 474335 476362 478458 480313 482164 483982 485474 486895 489041
59367 489041 492233 495961 499645 503151 506414 509217 511651 514336 517835 522141 526853 531567 536112 540779
59353 540779 546368 553565 562160 571223 580169 589375 599724 611836 625732 640928 656743 672779 689103
59340 689103 705818 722572 738726 753805 767526 779544 789524 797177 801909 802782 799438 792805 784210
59327 784210 773951 761386 746416 730193 714294 699736 686795 675171 664234 653691 644123 636397
59315 636397 630496 625523 620957 617322 615402 615354 616943 620249 625654 633049 641032 646868 647690 642368 632339
59300 632339 620328 608391 597371 587617 579336 572358 566425 561792 558852 557146 555570 553686 552079
$$ packed form
59394G11334o324j9495k7299k9879k9142k6161k1810j7572j4488j2275j0264q327
59382D88298o455m435k472j195o25M9J170K027K096J855J851J818J492J421K146
59367D89041L192L728L684L506L263K803K434K685L499M306M712M714M545M667
59353E40779N589P197Q595R063Q946R206J0349J2112J3896J5196J5815J6036J6324
59340F89103J6715J6754J6154J5079J3721J2018R980P653M732Q73l344o633q595
59327G84210j0259j2565j4970j6223j5899j4558j2941j1624j0937j0543r568p726
59315F36397n901m973m566l635j920m8J589L306N405P395P983N836Q22n322j0029
59300F32339j2011j1937j1020r754q281o978n933m633k940j706j576j884j607
$$ plain form
59287 552079 551197 550656 550054 549722 550105 550959 551659 551977 552079 552053 551917 551995 552946 555353 559263 564093 569189 574716
59269 574716 581684 590700 600995 611299 621361 631753 642254 651452 658201 662635 665403 666612 665883
59256 665883 662795 656985 648400 637848 626710 615777 604876 593879 583397 574134 566202 559495 554156
59243 554156 550223 547359 545382 544566 545006 546242 547903 550166 553077 555997 558315 560244 562338 564562 566420
59228 566420 567657 568311 568368 567806 566727 565045 562383 558578 553905 548453 541889 534378 527131 521347 517025
59213 517025 513485 510548 508311 506169 503289 500159 498613 499779 502610 504871 505241 504092 502499 500978
59199 500978 499312 497400 495932 495929 497670 500473 503633 507152 511252 515612 519556 522821 525737 528824 532495
59184 532495 536962 541944 546595 550171 552795 555252 557994 560651 562604 563778 564761 566183 568039 569682
$$ packed form
59287E52079q82n41o02l32L83Q54P00L18J02k6j36P8R51K407L910M830N096N527
59269E74716O968R016J0295J0304J0062J0392J0501R198O749M434K768J209p29
59256F65883l088n810q585j0552j1138j0933j0901j0997j0482r263p932o707n339
59243E54156l933k864j977q16M40J236J661K263K911K920K318J929K094K224J858
59228E66420J237O54N7n62j079j682k662l805m673n452o564p511p247n784m322
59213E17025l540k937k237k142k880l130j546J166K831K261L70j149j593j521
59199E00978j666j912j468lJ741K803L160L519M100M360L944L265K916L087L671
59184E32495M467M982M651L576K624K457K742K657J953J174R83J422J856J643
$$ plain form
59170 569682 570601 571135 572275 574760 578581 583232 588126 592850 597455 602575 608758 615579 621897 627079 631430
59155 631430 635232 638054 639336 639076 637480 634432 629828 624048 617648 610960 604408 598692 594079 589887
59141 589887 585335 580535 576053 571775 567058 561869 557002 553090 550019 547475 545440 543912 542555 540982
59127 540982 539233 537780 537117 537399 538485 540327 543277 547695 553211 558742 563605 568401 574472 582562 592242
59112 592242 602436 612272 621561 630695 639943 648732 655947 661232 665684 670827 677029 683328 688661 692885
59098 692885 696638 700524 704536 707990 709954 709890 707990 705005 701815 699115 697213 696031 695387 695228 695330
59083 695330 694980 693407 690564 686999 682884 677691 670971 662933 654070 644725 635246 626077 617438 609314
59069 609314 601860 595281 589225 583025 576825 571644 567904 564705 561097 557367 554318 551923 549451 546449
$$ packed form
59170E69682R19N34J140K485L821M651M894M724M605N120O183O821O318N182M351
59155F31430L802K822J282k60j596l048m604n780o400o688o552n716m613m192
59141E89887m552m800m482m278m717n189m867l912l071k544k035j528j357j573
59127E40982j749j453o63K82J086J842K950M418N516N531M863M796O071Q090R680
59112E92242J0194R836R289R134R248Q789P215N285M452N143O202O299N333M224
59098F92885L753L886M012L454J964o4j900k985l190k700j902j182o44j59J02
59083F95330l50j573k843l565m115n193o720q038q863r345r479r169q639q124
59069F09314p454o579o056o200o200n181l740l199l608l730l049k395k472l002
$$ plain form
59055 546449 542858 538599 533870 529518 526328 524152 522299 520471 518700 516804 514668 512741 511509 510728
59041 510728 509889 509162 509027 509253 509125 508601 508427 509090 510435 512272 514633 517384 520267 523382 527002 530917
59025 530917 534638 538385 543252 550205 559378 570444 583162 597416 613057 629778 646857 663175
59013 663175 677867 690824 702089 710994 716474 718207 716928 713630 709004 703578 697852 692198 687019
59000 687019 682947 680511 679766 680687 683664 688934 695589 701769 705979 707935 708335 708313 708895 710258 711421 711104
58984 711104 708871 705107 700178 694237 687600 680616 673242 665431 657858 651592 647106 644220 642809 642811 643684
58969 643684 644874 646903 651063 657758 665943 674448 683053 691894 700651 708976 717156 725626 734059 741486
58955 741486 747228 751252 753527 753339 749618 742141 732238 721788 711374 699962 686710 672529 659321
$$ packed form
59055E46449l591m259m729m352l190k176j853j828j771j896k136j927j232p81
59041E10728q39p27j35K26j28n24j74O63J345J837K361K751K883L115L620L915
59025E30917L721L747M867O953R173J1066J2718J4254J5641J6721J7079J6318
59013F63175J4692J2957J1265Q905N480J733j279l298m626n426n726n654n179
59000F87019m072k436p45R21K977N270O655O180M210J956M00k2N82J363J163l17
58984G11104k233l764m929n941o637o984p374p811p573o266m486k886j411KQ73
58969F43684J190K029M160O695Q185Q505Q605Q841Q757Q325Q180Q470Q433P427
58955G41486N742M024K275j88l721p477r903j0450j0414j1412j3252j4181j3208
$$ plain form
58942 659321 648228 639320 632451 627388 623282 619016 614143 608798 602853 596056 588943 582613 577445 572875
58928 572875 568615 565200 563077 561969 561485 561638 562386 563246 563748 563790 563287 561959 559712 556859 553828 551083
58912 551083 549312 549076 550142 551689 553315 555338 558095 561566 565865 571517 578969 588197 598812 610129
58898 610129 621207 631305 640311 648351 655321 661392 667553 674757 682892 691644 702077 715995 733675
58885 733675 753600 774589 796809 820262 843738 865983 886639 905177 920058 930050 935699 938554
58873 938554 939470 938309 934521 927227 915423 899154 880180 860778 842227 824936 809342 795841
58861 795841 784261 774188 765440 757562 749375 739893 729393 718774 708144 696893 684936 673002
58849 673002 661589 650399 638989 627580 617086 608598 602665 598758 595594 592302 589059 586223 583258
$$ packed form
58942F59321j1093q908o869n063m106m266m873n345n945o797p113o330n168m570
58928E72875m260l415k123j108m84J53P48Q60N02M2n03j328k247k853l031k745
58912E51083j771k36J066J547J626K023K757L471M299N652P452R228J0615J1317
58898F10129J1078J0098R006Q040O970O071O161P204Q135Q752J0433J3918J7680
58885G33675J9925K0989K2220K3453K3476K2245K0656J8538J4881R992N649K855
58873I38554R16j161l788p294j1804j6269j8974j9402j8551j7291j5594j3501
58861G95841j1580j0073q748p878q187r482j0500j0619j0630j1251j1957j1934
58849F73002j1413j1190j1410j1409j0494q488n933l907l164l292l243k836k965
$$ plain form
58836 583258 579129 573627 567600 561865 556480 551309 546745 543423 541343 539664 537497 534715 531828 529186
58822 529186 526737 524589 523234 522773 522350 520999 518851 516892 515758 515481 516221 518258 521144 523829 525919
58807 525919 527995 530350 532230 532785 532117 530951 529868 529263 529427 530150 530730 530781 530558 530161 529125 527314 525572
58790 525572 524785 524706 524366 523353 522163 521539 521966 523601 526325 529952 534540 540173 546413 552571 558742 565807
58774 565807 573939 581773 587676 591311 593295 593798 592376 589008 584530 579944 575784 572172 569057 566204
58760 566204 563200 559650 555457 550957 546693 542955 539727 537279 536441 537766 540709 544276 548238 552921
58746 552921 557965 562303 565448 567886 570075 572020 574039 576917 580937 585650 590892 597002 603702 609924
58732 609924 615379 621176 628178 635801 643307 651256 660584 670940 681033 690063 697820 703859 707729 709837
$$ packed form
58836E83258m129n502o027n735n385n171m564l322k080j679k167k782k887k642
58822E29186k449k148j355m61m23j351k148j959j134k77P40K037K886K685K090
58807E25919K076K355J880N55o68j166j083o05J64P23N80N1k23l97j036j811j742
58790E25572p87p9l40j013j190o24M27J635K724L627M588N633O240O158O171P065
58774E65807Q132P834N903L635J984N03j422l368m478m586m160l612l115k853
58760E66204l004l550m193m500m264l738l228k448q38J325K943L567L962M683
58746E52921N044M338L145K438K189J945K019K878M020M713N242O110O700O222
58732F09924N455N797P002P623P506P949R328J0356J0093R030P757O039L870K108
$$ plain form
58718 709837 711175 712263 713084 713914 715534 718651 723465 729722 736895 744559 752751 761522 770013 776631 780430
58703 780430 781675 780752 777318 770941 761791 750159 736026 719670 701937 683353 663727 643176 622791
58690 622791 603677 586171 570588 557746 547923 540096 533072 526650 520925 515382 509631 504194 499555
58677 499555 495203 490669 486694 484216 482859 481656 480705 480912 482521 485071 488389 492526 497103 501852 507455
58662 507455 514740 523346 532170 540716 548905 555948 560662 562817 563208 562537 561105 559303 557428 555254 552682
58647 552682 550468 549311 548528 546716 543522 539843 536422 533169 529668 525499 520308 514381 508881 504762
58633 504762 501862 499782 498968 499952 502175 504702 507533 510944 514123 515960 516912 518584 521554 524911 527882
58618 527882 530623 533417 536339 539828 544479 550187 556473 563532 571917 581182 589890 596953 602082 605144
$$ packed form
58718G09837J338J088Q21Q30J620L117M814O257P173P664Q192Q771Q491O618L799
58703G80430J245r23l434o377r150j1632j4133j6356j7733j8584j9626k0551k0385
58690F22791j9114j7506j5583j2842r823p827p024o422n725n543n751n437m639
58677D99555m352m534l975k478j357j203r51K07J609K550L318M137M577M749N603
58662E07455P285Q606Q824Q546Q189P043M714K155L91o71j432j802j875k174k572
58647E52682k214j157p83j812l194l679l421l253l501m169n191n927n500m119
58633E04762k900k080q14R84K223K527K831L411L179J837R52J672K970L357K971
58618E27882K741K794K922L489M651N708O286P059Q385R265Q708P063N129L062
$$ plain form
58604 605144 606175 605971 605567 605126 604184 602840 601748 601092 600544 599976 599222 597441 593858 589026 584357 580659
58588 580659 578068 576949 577689 579927 583139 587607 593642 600403 606902 613647 621711 630628 638956 646629
58574 646629 654861 663835 672423 680287 688330 696785 704723 711982 719894 729482 740427 752399 765946
58561 765946 781478 798640 817312 838050 860956 885130 909603 933803 956779 977097 993776
58550 993776 1006378 1014203 1016776 1015270 1012034 1008268 1003356 996652 988552 979533 969484 958349 946159
58537 946159 932161 915269 895728 875069 854229 833093 812005 792090 773728 756347 740215
58526 740215 726829 716906 709522 703807 699966 697965 696825 696077 696515 698649 701671 704706 707762 710718
58512 710718 712699 713286 713120 712551 710982 708333 705804 704209 702726 700257 696971 693572 690057 686118 682020
$$ packed form
58604F05144J031k04m04m41r42j344j092o56n48n68p54j781l583m832m669l698
58588E80659k591j119P40K238L212M468O035O761O499O745Q064Q917Q328P673
58574F46629Q232Q974Q588P864Q043Q455P938P259P912R588J0945J1972J3547
58561G65946J5532J7162J8672K0738K2906K4174K4473K4200K2976K0318J6679
58550I93776J2602P825K573j506l236l766m912o704q100r019j0049j1135j2190
58537I46159j3998j6892j9541k0659k0840k1136k1088j9915j8362j7381j6132
58526G40215j3386r923p384n715l841k001j140p48M38K134L022L035L056K956
58512G10718J981N87j66n69j569k649k529j595j483k469l286l399l515l939m098
$$ plain form
58497 682020 678239 674925 672204 670214 668543 666596 664794 664219 664788 665155 664833 665029 666803 669843 673576
58482 673576 678005 682850 687424 692161 698727 707773 718058 728636 740248 753459 766983 779198 789967
58469 789967 799602 807177 811311 811732 808916 803109 794889 785829 777413 769901 763085 757364 753200 750297
58455 750297 748213 747148 747569 749835 754622 762572 772946 783642 793106 801108 807246 810242 809506 806052
58441 806052 801015 794530 786887 779394 773133 768050 764135 762284 763115 766180 771102 778130 786714 794935
58427 794935 801324 806063 809682 812081 813766 816461 821402 828194 836138 845154 854593 862814 868989 873656
58413 873656 876645 876393 872603 867593 863366 859009 852687 844678 836726 829693 823478 818044 812955 807123
58399 807123 800496 794918 791977 791174 791433 793120 797182 803512 811385 820196 828675 834941 838587 841249 844014
$$ packed form
58497F82020l781l314k721j990j671j947j802n75N69L67l22J96J774L040L733
58482F73576M429M845M574M737O566R046J0285J0578J1612J3211J3524J2215J0769
58469G89967R635P575M134M21k816n807q220r060q416p512o816n721m164k903
58455G50297k084j065M21K266M787P950J0374J0696R464Q002O138K996p36l454
58441H06052n037o485p643p493o261n083l915j851Q31L065M922P028Q584Q221
58427G94935O389M739L619K399J685K695M941O792P944R016R439Q221O175M667
58413H73656K989k52l790n010m227m357o322q009p952p033o215n434n089n832
58399H07123o627n578k941q03K59J687M062O330P873Q811Q479O266L646K662K765
$$ plain form
58384 844014 845946 846227 845587 844162 840187 832727 823771 815677 808462 801616 796600 795135 796586 799359 803429
58369 803429 809321 816116 822774 830116 839238 849257 858778 868301 879023 890571 902074 914126 927499
58356 927499 941251 954240 967090 980455 992773 1002171 1009287 1015902 1022139 1027268 1031888 1036902 1041681
58343 1041681 1045584 1049898 1055945 1062823 1069427 1077070 1087452 1099633 1111803 1124437 1138804 1153923
58331 1153923 1168146 1182382 1198507 1215761 1231897 1246803 1261784 1276284 1288521 1298544 1307581
58320 1307581 1315244 1320421 1324101 1328328 1333210 1337866 1343182 1350575 1359128 1367133 1375457 1386092 1398443
58307 1398443 1410387 1422069 1435255 1449858 1464527 1479882 1497722 1517823 1538752 1560893 1585208
58296 1585208 1609979 1632417 1652735 1673207 1694113 1714165 1733973 1755333 1777836 1799824 1821894
$$ packed form
58384H44014J932K81o40j425l975p460q956q094p215o846n016j465J451K773M070
58369H03429N892O795O658P342R122J0019R521R523J0722J1548J1503J2052J3373
58356I27499J3752J2989J2850J3365J2318R398P116O615O237N129M620N014M779
58343A041681L903M314O047O878O604P643J0382J2181J2170J2634J4367J5119
58331A153923J4223J4236J6125J7254J6136J4906J4981J4500J2237J0023R037
58320A307581P663N177L680M227M882M656N316P393Q553Q005Q324J0635J2351
58307A398443J1944J1682J3186J4603J4669J5355J7840K0101K0929K2141K4315
58296A585208K4771K2438K0318K0472K0906K0052J9808K1360K2503K1988K2070
$$ plain form
58285 1821894 1845899 1871489 1897340 1924669 1955664 1989449 2023530 2058051 2094581 2131986 2167956
58274 2167956 2203531 2241572 2281744 2321609 2361738 2405019 2451735 2500091 2550805 2606330 2666178
58263 2666178 2727774 2791301 2859004 2930661 3004503 3081483 3163483 3248380 3332139 3414659 3498143
58252 3498143 3581136 3660226 3736612 3814845 3895962 3978015 4062363 4152868 4249624 4349995 4455165
58241 4455165 4569047 4691517 4819444 4953546 5097440 5251023 5411953 5582412 5766935
58232 5766935 5964930 6173201 6394231 6633569 6890723 7161712 7448927 7758891 8091940
58223 8091940 8444450 8819839 9226507 9666335 10136643 10642284 11193772 11794729 12443977
58214 12443977 13148775 13922289 14769035 15687424 16686325 17784864 18997880 20338433 21834030
$$ packed form
58285A821894K4005K5590K5851K7329L0995L3785L4081L4521L6530L7405L5970
58274B167956L5575L8041M0172L9865M0129M3281M6716M8356N0714N5525N9848
58263B666178O1596O3527O7703P1657P3842P6980Q2000Q4897Q3759Q2520Q3484
58252C498143Q2993P9090P6386P8233Q1117Q2053Q4348R0505R6756J00371J05170
58241D455165J13882J22470J27927J34102J43894J53583J60930J70459J84523
58232E766935J97995K08271K21030K39338K57154K70989K87215L09964L33049
58223H091940L52510L75389M06668M39828M70308N05641N51488O00957O49248
58214A2443977P04798P73514Q46746R18389R98901J098539J213016J340553J495597
$$ plain form
58205 21834030 23523700 25441382 27621709 30121369 33016363 36383912 40313349 44935824
58197 44935824 50423644 56971413 64812252 74253422 85676189 99521251 116293312 136497903
58189 136497903 160457690 188223047 219769628 255091119 293479047 332149014 365668993
58182 365668993 387489481 392934789 381404268 356195715 322499365 285311865 248372389
58175 248372389 214013930 183399728 156864316 134264574 115235409 99311666 85998292
58168 85998292 74844543 65480255 57594467 50915683 45225587 40362598 36193177 32593713
58160 32593713 29464543 26737465 24356234 22263839 20414491 18779654 17332682 16040870
58152 16040870 14878752 13834871 12898377 12051155 11278658 10575868 9936460 9347405 8799981
$$ packed form
58205B1834030J689670J917682K180327K499660K894994L367549L929437M622475
58197D4935824N487820O547769P840839R441170J1422767J3845062J6772061K0204591
58189A36497903K3959787K7765357L1546581L5321491L8387928L8669967L3519979
58182C65668993K1820488N445308j1530521k5208553l3696350l7187500l6939476
58175B48372389l4358459l0614202k6535412k2599742j9029165j5923743j3313374
58168H5998292j1153749r364288p885788o678784n690096m862989m169421l599464
58160C2593713l129170k727078k381231k092395j849348j634837j446972j291812
58152A6040870j162118j043881r36494q47222p72497p02790o39408n89055n47424
$$ plain form
58143 8799981 8295448 7834312 7409585 7015380 6652445 6320169 6012007 5723527 5456690
58134 5456690 5211803 4983111 4766476 4563814 4376061 4199023 4029835 3870464 3721478
58125 3721478 3579304 3442939 3316383 3201010 3092207 2986924 2887918 2797046 2710740 2625870
58115 2625870 2544253 2467812 2394702 2323632 2256780 2195244 2136519 2079282 2025708 1976488 1928713
58104 1928713 1881293 1837205 1797515 1758405 1717202 1676455 1638854 1602893 1566762 1532116 1500633
58093 1500633 1470841 1441432 1413947 1389380 1365888 1342491 1321292 1303441 1286694 1269444 1253286
58082 1253286 1239001 1223900 1205993 1187187 1169613 1152215 1133638 1114980 1096992 1077923 1056950
58071 1056950 1036474 1018301 1000631 981602 962720 946006 930598 915018 900162 887378 876011
$$ packed form
58143H799981n04533m61136m24727l94205l62935l32276l08162k88480k66837
58134E456690k44887k28692k16635k02662j87753j77038j69188j59371j48986
58125C721478j42174j36365j26556j15373j08803j05283r9006r0872q6306q4870
58115B625870q1617p6441p3110p1070o6852o1536n8725n7237n3574m9220m7775
58104A928713m7420m4088l9690l9110m1203m0747l7601l5961l6131l4646l1483
58093A500633k9792k9409k7485k4567k3492k3397k1199j7851j6747j7250j6158
58082A253286j4285j5101j7907j8806j7574j7398j8577j8658j7988j9069k0973
58071A056950k0476j8173j7670j9029j8882j6714j5408j5580j4856j2784j1367
$$ plain form
58060 876011 865327 856359 849456 842410 833332 823061 812735 801606 789340 777752 767954 758337 747634
58047 747634 737334 728804 720670 711495 702461 694938 687825 679940 672637 667416 663001 657457 651238 645646
58033 645646 640143 633684 626955 620935 614804 607417 599194 590684 581138 570490 560742 553235 546450 538643
58019 538643 530681 524079 518212 511816 505466 500227 495581 490936 487428 485869 484611 481840 478375 475890
58005 475890 474008 471677 469850 470101 471775 473040 473707 474630 475398 475021 474069 473886 474473 475117 476248 478731
57989 478731 482255 486273 491570 498907 507035 513860 518731 521960 523310 522737 521455 520316 518200 513850
57975 513850 508194 502999 498402 493753 489656 487023 485128 482774 480444 479176 478209 475983 472769 470162
57961 470162 468592 467383 466662 467082 468072 468300 467528 466327 464478 461386 457579 454127 451144 448421 446764
$$ packed form
58060H76011j0684q968o903p046r078j0271j0326j1129j2266j1588r798r617j0703
58047G47634j0300q530q134r175r034p523p113p885p303n221m415n544o219n592
58033F45646n503o459o729o020o131p387q223q510r546j0648r748p507o785p807
58019E38643p962o602n867o396o350n239m646m645l508j559j258k771l465k485
58005D75890j882k331j827K51J674J265O67R23P68l77r52j83N87O44J131K483
57989D78731L524M018N297P337Q128O825M871L229J350n73j282j139k116m350
57975E13850n656n195m597m649m097k633j895k354k330j268r67k226l214k607
57961D70162j570j209p21M20R90K28p72j201j849l092l807l452k983k723j657
$$ plain form
57946 446764 446941 448007 448510 448728 449977 452443 455574 459911 466392 474235 481571 488050 495143 504022 514700
57931 514700 526825 539632 551429 560759 567851 573517 577179 577560 574819 570286 564525 557363 549382 541542
57917 541542 533582 524510 514464 504487 494739 484677 474806 466516 460196 455054 450726 447512 445116 442688
57903 442688 440208 438430 437389 436207 434354 431960 429026 425491 421953 419242 417420 416155 415610 415926 416430
57888 416430 416538 416891 418329 420400 422218 424115 426965 430505 433848 437038 440447 443255 444340 444167 443955
57873 443955 443418 441273 437661 434050 430802 426795 421512 415678 409756 403601 397760 393385 390548 388204
57859 388204 385991 384624 384449 385178 387086 390833 395882 400695 404667 408323 411467 412896 412361 411214 410552
57844 410552 410110 409401 408564 407568 405831 403075 399499 394918 388934 382206 376252 371660 367689 363856 360684
$$ packed form
57946D46764J77J066N03K18J249K466L131M337O481P843P336O479P093Q879J0678
57931E14700J2125J2807J1797R330P092N666L662L81k741m533n761p162p981p840
57917E41542p960r072j0046r977r748j0062r871q290o320n142m328l214k396k428
57903D42688k480j778j041j182j853k394k934l535l538k711j822j265n45L16N04
57888D16430J08L53J438K071J818J897K850L540L343L190L409K808J085j73k12
57873D43955n37k145l612l611l248m007n283n834n922o155n841m375k837k344
57859C88204k213j367j75P29J908L747N049M813L972L656L144J429n35j147o62
57844D10552m42p09q37r96j737k756l576m581n984o728n954m592l971l833l172
$$ plain form
57829 360684 358599 357444 357443 359343 363099 367563 371971 376767 382602 389446 396836 404024 409641 412329 412025
57814 412025 409819 406515 402297 397639 393265 389105 384544 379815 375878 372876 370071 367418 365702 364841
57800 364841 363549 361216 358734 356959 355620 354309 353302 352784 352355 351929 352113 353204 354768 356623 359114
57785 359114 361957 363910 364272 363796 363599 363992 364883 366415 368667 371490 375033 379668 385061 390129 394191
57770 394191 397367 399714 400968 401437 402067 403090 403419 401852 398151 392741 386194 379306 372910 367310 362523
57755 362523 359019 357281 356718 356109 355244 355020 355830 357002 357951 358672 358937 358368 357630 358232 360650 363788 366653
57738 366653 369434 372548 375854 379197 382552 385210 386036 384964 383018 380520 376680 371424 366060 361406
57724 361406 356722 351457 346728 343925 342797 341937 340402 338073 335293 332923 331955 332289 332596 331922 330623
$$ packed form
57829C60684k085j155jJ900L756M464M408M796N835O844P390P188N617K688l04
57814D12025k206l304m218m658m374m160m561m729l937l002k805k653j716q61
57800C64841j292k333k482j775j339j311j007n18m29m26J84J091J564J855K491
57785C59114K843J953L62m76j97L93Q91J532K252K823L543M635N393N068M062
57770C94191L176K347J254M69O30J023L29j567l701n410o547o888o396n600m787
57755C62523l504j738n63o09q65k24Q10J172R49P21K65n69p38O02K418L138K865
57738C66653K781L114L306L343L355K658Q26j072j946k498l840n256n364m654
57724C61406m684n265m729k803j128q60j535k329k780k370r68L34L07o74j299
$$ plain form
57709 330623 329292 327827 326141 324678 323569 322292 320874 320318 321090 322313 323290 324714 327375 330734 333836
57694 333836 336647 339378 341279 341360 339761 337447 335071 332986 331718 331441 331490 331279 331262 332325 334800 338720
57678 338720 344400 351977 361085 371753 385140 402725 425392 453933 489682 533907 587107 649050
57666 649050 717773 786949 845171 880132 884873 860647 814994 757773 697699 640381 588388 542764
57654 542764 503947 471429 443893 420602 401924 387853 377015 367974 360654 355454 351784 348568
57642 348568 345561 343021 340657 338077 335864 335053 335680 336732 337366 337480 337387 337644 338768 340407 341183 340160
57626 340160 338105 336533 335900 335458 334479 332831 330674 328349 326334 324743 323183 321569 320541 320546 321086 321505
57610 321505 321932 322758 323747 324383 324570 324311 323278 321426 319446 317917 316567 315098 314044 314007 314661 315322 315857
$$ packed form
57709C30623j331j465j686j463j109j277j418n56P72J223R77J424K661L359L102
57694C33836K811K731J901Q1j599k314k376k085j268k77M9k11j7J063K475L920
57678C38720N680P577R108J0668J3387J7585K2667K8541L5749M4225N3200O1943
57666F49050O8723O9176N8222L4961M741k4226m5653n7221o0074n7318n1993m5624
57654E42764l8817l2518k7536k3291j8678j4071j0838r041p320n200l670l216
57642C48568l007k540k364k580k213q11O27J052O34J14r3K57J124J639P76j023
57626C40160k055j572o33m42r79j648k157k325k015j591j560j614j028NN40M19
57610C21505M27Q26R89O36J87k59j033j852j980j529j350j469j054l7O54O61N35
$$ plain form
57593 315857 316285 316165 315364 314738 315127 316244 317438 318802 320503 321777 321855 321321 321308 321805 322038 322150 323153
57576 323153 325324 327783 329695 330914 331528 331629 331495 331317 330918 330310 330090 330599 331220 331302 331287 332085 333877 336349
57558 336349 339478 343143 346643 349677 353161 357899 363018 366950 369418 371158 372250 372131 370910 369182
57544 369182 366824 363402 359608 356935 356039 356666 358841 362655 367087 370681 373457 376690 380708 384376 386935
57529 386935 388893 390818 392551 393992 395426 396731 397353 397295 397093 396663 395350 393297 391540 390535 389843 389528
57513 389528 390532 393119 396163 398634 400860 403788 407837 412977 419090 425747 432255 438323 444088 449423
57499 449423 453972 457911 461756 465299 467773 469229 470735 472903 475245 477281 479236 481294 483202 485121
57485 485121 487839 491512 495022 497259 498467 499830 502256 505883 510178 514184 517129 518975 519931 519651 517746
$$ packed form
57593C15857M28j20q01o26L89J117J194J364J701J274P8n34j3M97K33J12J003
57576C23153K171K459J912J219O14J01j34j78l99o08k20N09O21Q2j5P98J792K472
57558C36349L129L665L500L034L484M738N119L932K468J740J092j19j221j728
57544C69182k358l422l794k673q96O27K175L814M432L594K776L233M018L668K559
57529C86935J958J925J733J441J434J305O22n8k02m30j313k053j757j005o92l15
57513C89528J004K587L044K471K226K928M049N140O113O657O508O068N765N335
57499D49423M549L939L845L543K474J456J506K168K342K036J955K058J908J919
57485D85121K718L673L510K237J208J363K426L627M295M006K945J846R56k80j905
$$ plain form
57470 517746 514986 512896 512027 511626 511127 510849 511008 511255 511590 512607 514395 516272 518048 520404 523469 526242
57454 526242 528204 530364 533780 537925 541525 544311 546925 549656 552265 554820 557843 561699 566305 571282
57440 571282 576071 580193 583644 586726 589435 591599 593662 596496 600172 603747 606734 609961 614456 620133
57426 620133 626175 632118 637916 643408 648348 652691 656485 659772 662847 666201 670002 674042 678277 682881
57412 682881 687675 692161 696288 700521 705072 709749 714622 719924 725253 729893 734104 738958 744575 749736
57398 749736 753807 757830 763021 769238 775717 782284 788883 794885 799913 804707 810216 816423 822946 830127
57384 830127 838528 847886 857496 867155 876779 885523 892338 897297 901633 906550 912538 919421 926449 932659
57370 932659 937822 942719 948008 953320 958145 963009 968847 975613 982461 989165 996475 1005077 1014857 1025255
$$ packed form
57470E17746k760k090q69m01m99k78J59K47L35J017J788J877J776K356L065K773
57454E26242J962K160L416M145L600K786K614K731K609K555L023L856M606M977
57440E71282M789M122L451L082K709K164K063K834L676L575K987L227M495N677
57426F20133O042N943N798N492M940M343L794L287L075L354L801M040M235M604
57412F82881M794M486M127M233M551M677M873N302N329M640M211M854N617N161
57398G49736M071M023N191O217O479O567O599O002N028M794N509O207O523P181
57384H30127Q401R358R610R659R624Q744O815M959M336M917N988O883P028O210
57370I32659N163M897N289N312M825M864N838O766O848O704P310Q602R780J0398
$$ plain form
57356 1025255 1035732 1045932 1055793 1065540 1075303 1084890 1094144 1103211 1112189 1120951 1129633 1138780 1148588
57343 1148588 1158436 1167671 1176403 1185068 1193661 1202012 1210401 1219344 1229057 1239562 1250921 1262891 1274779
57330 1274779 1286116 1297074 1307832 1318177 1328301 1339300 1352024 1365847 1379371 1392042 1404348
57319 1404348 1416729 1429143 1441513 1453916 1466397 1479076 1492300 1506298 1520944 1536155 1552000
57308 1552000 1568033 1583237 1597339 1611551 1627110 1643571 1659475 1674336 1688922 1703818 1718791
57297 1718791 1733594 1748453 1763628 1779237 1795566 1812873 1830806 1848631 1866129 1883770 1901945
57286 1901945 1920512 1939010 1956847 1973411 1988639 2003422 2018791 2034667 2049940 2063841 2076642
57275 2076642 2088909 2100608 2111231 2120592 2129303 2138564 2149341 2161631 2174701 2188196 2202674 2218770
$$ packed form
57356A025255J0477J0200R861R747R763R587R254R067Q978Q762Q682R147R808
57343A148588R848R235Q732Q665Q593Q351Q389Q943R713J0505J1359J1970J1888
57330A274779J1337J0958J0758J0345J0124J0999J2724J3823J3524J2671J2306
57319A404348J2381J2414J2370J2403J2481J2679J3224J3998J4646J5211J5845
57308A552000J6033J5204J4102J4212J5559J6461J5904J4861J4586J4896J4973
57297A718791J4803J4859J5175J5609J6329J7307J7933J7825J7498J7641J8175
57286A901945J8567J8498J7837J6564J5228J4783J5369J5876J5273J3901J2801
57275B076642J2267J1699J0623R361Q711R261J0777J2290J3070J3495J4478J6096
$$ plain form
57263 2218770 2236218 2254113 2271836 2289332 2306845 2324837 2343809 2363680 2383599 2402934 2422175
57252 2422175 2442327 2463674 2485678 2507860 2530098 2552246 2574107 2595764 2617461 2639186 2660758
57241 2660758 2682203 2703624 2724950 2746211 2767793 2789890 2812001 2833586 2855011 2877129 2900032
57230 2900032 2922892 2945121 2967052 2989376 3012354 3035703 3058933 3081657 3103842 3125813 3147898
57219 3147898 3170152 3192507 3214940 3237347 3259559 3281608 3303595 3325169 3345685 3365166 3384549
57208 3384549 3404525 3424673 3444222 3463117 3481813 3500566 3519577 3539324 3560041 3581244 3602450
57197 3602450 3624000 3646499 3669835 3693517 3717662 3742888 3769420 3796950 3825065 3853177 3880397
57186 3880397 3906337 3931820 3958017 3985018 4011973 4038397 4064542 4090595 4116338 4141626 4166587
$$ packed form
57263B218770J7448J7895J7723J7496J7513J7992J8972J9871J9919J9335J9241
57252B422175K0152K1347K2004K2182K2238K2148K1861K1657K1697K1725K1572
57241B660758K1445K1421K1326K1261K1582K2097K2111K1585K1425K2118K2903
57230B900032K2860K2229K1931K2324K2978K3349K3230K2724K2185K1971K2085
57219C147898K2254K2355K2433K2407K2212K2049K1987K1574K0516J9481J9383
57208C384549J9976K0148J9549J8895J8696J8753J9011J9747K0717K1203K1206
57197C602450K1550K2499K3336K3682K4145K5226K6532K7530K8115K8112K7220
57186C880397K5940K5483K6197K7001K6955K6424K6145K6053K5743K5288K4961
$$ plain form
57175 4166587 4191366 4216143 4241166 4266195 4290219 4312407 4333070 4352993 4372084 4389520 4405058
57164 4405058 4419330 4432921 4445885 4458107 4469444 4479586 4488386 4496205 4503335 4509362 4513837 4517210
57152 4517210 4520156 4522194 4522006 4519115 4514272 4508202 4500985 4492979 4485377 4479362 4475173 4472272 4470057 4468382
57138 4468382 4467835 4469523 4474107 4481118 4489585 4499114 4509798 4521395 4533331 4545315 4557187 4568316 4578006
57125 4578006 4586477 4594757 4603643 4613561 4625356 4640363 4659481 4682824 4710406 4742611 4779957 4822944
57113 4822944 4872147 4927997 4990548 5059994 5137417 5224720 5324087 5438024 5569699 5722877 5901937
57102 5901937 6112433 6361366 6656769 7008070 7427737 7932062 8539997 9272410 10153359
57093 10153359 11210687 12473569 13969308 15721869 17749816 20061186 22648612 25488180
$$ packed form
57175D166587K4779K4777K5023K5029K4024K2188K0663J9923J9091J7436J5538
57164D405058J4272J3591J2964J2222J1337J0142Q800P819P130O027M475L373
57152D517210K946K038j88k891m843o070p217q006p602o015m189k901k215j675
57138D468382n47J688M584P011Q467R529J0684J1597J1936J1984J1872J1129R690
57125D578006Q471Q280Q886R918J1795J5007J9118K3343K7582L2205L7346M2987
57113D822944M9203N5850O2551O9446P7423Q7303R9367J13937J31675J53178J79060
57102E901937K10496K48933K95403L51301M19667N04325O07935P32413Q80949
57093A0153359J057328J262882J495739J752561K027947K311370K587426K839568
$$ plain form
57085 25488180 28539182 31741405 35014155 38260924 41372619 44221618 46657419 48524750
57077 48524750 49703567 50141379 49852697 48893632 47338732 45272934 42790651 39992795
57069 39992795 36982347 33861045 30725196 27659270 24730513 21987685 19462693 17172490
57061 17172490 15120947 13301597 11701056 10302020 9085269 8030794 7118648 6329994
57053 6329994 5647983 5057691 4545413 4098688 3707153 3362808 3059174 2790589 2552344
57044 2552344 2340706 2152347 1984235 1834322 1701697 1585745 1485736 1401563 1334071 1283558
57034 1283558 1247524 1219593 1190510 1151131 1096292 1026922 948404 866839 786890 711985 644491
57023 644491 584993 532523 486133 445503 409927 377939 348573 322029 298565 277707 258947
$$ packed form
57085B5488180L051002L202223L272750L246769L111695K848999K435801J867331
57077D8524750J178817M37812k88682r59065j554900k065798k482283k797856
57069C9992795l010448l121302l135849l065926k928757k742828k524992k290203
57061A7172490k051543j819350j600541j399036j216751j054475r12146p88654
57053F329994o82011n90292n12278m46725l91535l44345l03634k68585k38245
57044B552344k11638j88359j68112j49913j32625j15952j00009q4173o7492n0513
57034A283558l6034k7931k9083l9379n4839o9370p8518q1565p9949p4905o7494
57023F44491n9498n2470m6390m0630l5576l1988k9366k6544k3464k0858j8760
$$ plain form
57012 258947 242200 226973 212170 197384 183436 171004 159701 149149 139847 132150 125378 118892
57000 118892 113164 108856 105669 103027 101094 100189 99943 100056 101105 103652 107229 111297 116559 124176 134161
56985 134161 145642 158368 172844 189086 205920 221290 232717 238077 236793 230070 219548 206288
56973 206288 191438 176845 163990 152984 143391 135280 128660 122874 117771 114700 115060 118494 123837
56960 123837 131226 141812 155789 172265 190815 211403 232415 250052 260271 260806 251670 234952
56948 234952 214281 193201 173387 154819 137583 122656 110880 102230 96455 93659 93863 96619 101585
56935 101585 109153 120164 135212 154430 177830 205453 236619 268464 295450 311408 312976 301095
56923 301095 279362 251729 221729 192329 165121 140068 116907 96413 79639 66538 56201
$$ packed form
57012B58947j6747j5227j4803j4786j3948j2432j1303j0552r302p697o772o486
57000A18892n728m308l187k642j933r05k46J13J049K547L577M068N262P617R985
56985A34161J1481J2726J4476J6242J6834J5370J1427N360j284o723j0522j3260
56973B06288j4850j4593j2855j1006r593q111o620n786n103l071L60L434N343
56960A23837P389J0586J3977J6476J8550K0588K1012J7637J0219N35r136j6718
56948B34952k0671k1080j9814j8568j7236j4927j1776q650n775k796K04K756M966
56935A01585P568J1011J5048J9218K3400K7623L1166L1845K6986J5958J568j1881
56923C01095k1733k7633l0000k9400k7208k5053k3161k0494j6774j3101j0337
$$ plain form
56912 56201 47906 41125 35066 29243 24078 20048 16701 13430 10694 9367 9270 9476 9776 10674 12173 13750
56896 13750 15458 17907 21199 24999 29752 36739 46750 59624 75300 94447 117743 145128 175760
56883 175760 207787 237937 262102 277018 281577 276939 265904 251851 237472 224271 213292 205697
56871 205697 202081 201862 204312 209829 219435 233396 251346 273505 300887 334492 375211 424238 482298
56858 482298 547897 616340 680031 729556 756218 755964 731650 690901 641717 590250 541208 497990
56846 497990 462043 433422 412436 399892 395893 399737 411289 431441 461114 500898 551816 615322
56834 615322 692249 782403 884478 993971 1100116 1186474 1236980 1243027 1206260 1136393 1046705
56823 1046705 949677 854305 765936 687671 621304 567325 525155 493912 472783 460934 457887
$$ packed form
56912E6201q295o781o059n823n165m030l347l271k736j327r7K06L00Q98J499J577
56896A3750J708K449L292L800M753O987J0011J2874J5676J9147K3296K7385L0632
56883A75760L2027L0150K4165J4916M559m638j1035j4053j4379j3201j0979p595
56871B05697l616k19K450N517R606J3961J7950K2159K7382L3605M0719M9027N8060
56858D82298O5599O8443O3691M9525K6662k54k4314m0749m9184n1467m9042m3218
56846D97990l5947k8621k0986j2544l999L844J1552K0152K9673L9784N0918O3506
56834F15322P6927R0154J02075J09493J06145Q6358N0506O047l6767o9867q9688
56823A046705r7028r5372q8369p8265o6367n3979m2170l1243k1129j1849l047
$$ plain form
56812 457887 464030 480159 506583 543341 591045 650489 720989 798990 877239 944449 987284 995910
56800 995910 969359 915189 843878 764176 682905 606179 538709 482303 436131 398450 368002
56789 368002 344419 327838 318077 314358 316269 324508 339879 361987 390018 424221 464600 507594
56777 507594 545502 570121 576559 563977 534688 493479 446388 398447 352405 309583 270980 237163
56765 237163 208056 183500 163436 147222 133622 121878 112042 103979 96970 90581 84955 79886 74670
56752 74670 69344 64955 62038 59810 57518 55462 53962 52383 50185 48091 47151 47219 47249 46606 45298 43427
56736 43427 41278 39599 39001 39265 39734 40058 40143 39847 39250 38831 38891 39153 39328 39666 40527 41800 43142 44394
56718 44394 45477 46223 46652 47058 47622 48291 49096 50104 51047 51615 52100 53086 54433 55385 55728 55990 56348 56307
$$ packed form
56812D57887O143J6129K6424L6758M7704N9444P0500P8001P8249O7210M2835Q626
56800I95910k6551n4170p1311p9702q1271p6726o7470n6406m6172l7681l0448
56789C68002k3583j6581r761l719J911Q239J5371K2108K8031L4203M0379M2994
56777E07594L7908K4619O438j2582k9289m1209m7091m7941m6042m2822l8603l3817
56765B37163k9107k4556k0064j6214j3600j1744r836q063p009o389n626n069n216
56752G4670n326m389k917k228k292k056j500j579k198k094r40O8L0o43j308j871
56736D3427k149j679n98K64M69L24Q5k96n97m19O0K62J75L38Q61J273J342J252
56718D4394J083P46M29M06N64O69Q05J008R43N68M85R86J347R52L43K62L58m1
$$ plain form
56700 56307 55637 54683 53529 51850 49828 48132 46711 44742 42161 40045 38966 38188 37019 35696 34267
56685 34267 31997 28900 26624 26548 27919 29064 29645 30479 31785 32946 33657 34194 34652 34832 34727 34514 34312
56668 34312 34431 35421 37295 39211 40493 41476 42791 44431 46136 48071 50424 52904 55363 58408 62673
56653 62673 67926 73475 78970 84271 89169 93861 99039 104777 109951 113564 116142 119061 122895 127105
56639 127105 130876 133591 135006 135618 136484 138101 139964 141622 143458 145822 148179 149852 150894 151470 151134
56624 151134 149620 147712 146350 145353 143851 141432 138027 133250 126882 119710 113006 107391 102750 98764
56610 98764 94905 90532 85757 81670 78937 76834 74443 72095 70693 70310 70503 71439 73510 76220 78553
56595 78553 80212 81582 82800 83827 85054 86876 88875 90323 91209 91912 92258 91811 90828 89969 89348 88750
$$ packed form
56700E6307o70r54j154j679k022j696j421j969k581k116j079p78j169j323j429
56685C4267k270l097k276p6J371J145N81Q34J306J161P11N37M58J80j05k13k02
56668C4312J19R90J874J916J282R83J315J640J705J935K353K480K459L045M265
56653F2673N253N549N495N301M898M692N178N738N174L613K578K919L834M210
56639A27105L771K715J415O12Q66J617J863J658J836K364K357J673J042N76l36
56624A51134j514j908j362r97j502k419l405m777o368p172o704n615m641l986
56610I8764l859m373m775m087k733k103k391k348j402l83J93R36K071K710K333
56595G8553J659J370J218J027J227J822J999J448Q86P03L46m47r83q59o21n98
$$ plain form
56579 88750 88497 89118 90381 91507 92180 92575 92652 92324 92099 92762 94546 97281 101005 105721 110957 116400 122577
56562 122577 130148 138975 148765 160061 173385 187609 200178 208966 213236 213303 210349 206377 203181 201206
56548 201206 199917 198943 198070 196577 193767 190043 186478 183425 180435 177400 174800 172775 170850 168697 166533
56533 166533 164707 163347 162363 161410 160158 158919 158429 158517 157803 155478 152654 150883 150041 148788 146589 144040
56517 144040 141601 139301 137477 136534 135966 134661 132191 128962 125370 121765 118960 117601 117093 116105 114164
56502 114164 111913 110018 108671 107953 107716 107324 106426 105731 106125 107334 108428 109237 110128 110802 110676 110279 110808
56485 110808 112236 113222 113118 112864 113450 114524 115059 114715 114112 114160 115337 117291 119136 120334 121119 121884 122716
56468 122716 123780 125385 127177 128175 128265 128667 130028 131203 131092 130566 131101 132409 133099 132925 132665 132295 131159
$$ packed form
56579H8750k53O21J263J126O73L95P7l28k25O63J784K735L724M716N236N443O177
56562A22577P571Q827R790J1296J3324J4224J2569Q788M270O7k954l972l196j975
56548B01206j289r74q73j493k810l724l565l053k990l035k600k025j925k153k164
56533A66533j826j360r84r53j252j239m90Q8p14k325k824j771q42j253k199k549
56517A44040k439k300j824r43n68j305k470l229l592l605k805j359n08r88j941
56502A14164k251j895j347p18k37l92q98o95L94J209J094Q09Q91O74j26l97N29
56485A10808J428R86j04k54N86J074N35l44o03M8J177J954J845J198P85P65Q32
56468A22716J064J605J792R98R0M02J361J175j11n26N35J308O90j74k60l70j136
$$ plain form
56451 131159 129617 128742 128570 128239 127708 127724 128287 128806 129596 131462 133843 135141 135008 134674 134863 135037 134876 134912
56433 134912 135366 135799 136159 136820 137463 137321 136621 136381 136774 137209 137953 139900 142553 144069 143698 142503 141311
56416 141311 139761 137894 136892 137353 138256 138442 137894 136941 135507 133800 132629 132359 132546 133019 134215 136078
56400 136078 137679 138321 137986 136584 133973 130888 128502 126893 125354 124318 125295 128397 131583 133049 133124
56385 133124 133266 134523 137439 142009 147025 150724 152714 154203 155952 157312 157712 157717 158064 158922 160551 163369
56369 163369 166832 169544 170937 171699 172277 172409 172442 173450 175459 177144 177964 179011 181008 182982 183844 183977
56353 183977 184357 185231 186322 187282 187376 186006 184027 183275 184250 185556 186052 186173 186725 187899 189973 193373 197517
56336 197517 201194 204572 209113 214961 220323 224170 227550 231338 234704 236986 239176 242145 245029 246737
$$ packed form
56451A31159j542q75j72l31n31J6N63N19P90J866K381J298j33l34J89J74j61L6
56433A34912M54M33L60O61O43j42p00k40L93M35P44J947K653J516l71j195j192
56416A41311j550j867j002M61R03J86n48r53j434j707j171k70J87M73J196J863
56400A36078J601O42l35j402k611l085k386j609j539j036R77L102L186J466P5
56385A33124J42J257K916M570N016L699J990J489J749J360M00NL47Q58J629K818
56369A63369L463K712J393P62N78J32L3J008K009J685Q20J047J997J974Q62J33
56353A83977L80Q74J091R60R4j370j979p52R75J306M96J21N52J174K074L400M144
56336A97517L677L378M541N848N362L847L380L788L366K282K190K969K884J708
$$ plain form
56322 246737 247539 247883 247136 244865 242031 239550 236970 233764 230652 228378 226496 224557 223238 223058 223284
56307 223284 223332 223994 225969 228383 230055 231136 232310 233478 234423 235696 237721 239994 242030 244026 245784
56292 245784 246434 246081 246218 247539 248906 249545 250470 252522 254758 256272 257968 260940 264581 267874 271115
56277 271115 274766 278076 280545 283364 287677 292643 296941 300934 305622 310718 315623 321200 328673 337640
56263 337640 346873 356225 366132 376203 385977 396256 408175 421700 436399 452710 471123 491194
56251 491194 512750 536878 564326 594247 626030 660941 700174 742555 786008 830044 874947
56240 874947 919790 963311 1005606 1046783 1084862 1117072 1142403 1160947 1171788 1173812 1167903 1156075
56228 1156075 1138923 1115945 1087973 1057247 1025278 992276 958350 923774 888540 853101 818970
$$ packed form
56322B46737Q02L44p47k271k834k481k580l206l112k274j882j939j319j80K26
56307B23284M8O62J975K414J672J081J174J168R45J273K025K273K036J996J758
56292B45784O50l53J37J321J367O39R25K052K236J514J696K972L641L293L241
56277B71115L651L310K469K819M313M966M298L993M688N096M905N577P473Q967
56263C37640R233R352R907J0071R774J0279J1919J3525J4699J6311J8413K0071
56251D91194K1556K4128K7448K9921L1783L4911L9233M2381M3453M4036M4903
56240H74947M4843M3521M2295M1177L8079L2210K5331J8544J0841K024n909j1828
56228A156075j7152k2978k7972l0726l1969l3002l3926l4576l5234l5439l4131
$$ plain form
56217 818970 787199 757057 727587 699563 674280 651358 629520 608737 589913 573141 557907
56206 557907 544254 532143 520554 508835 498061 489368 481936 474337 466869 460695 455659 450934 447026
56193 447026 445035 444501 443907 442814 441861 441281 440924 441054 441726 442247 442575 444014 447031 449791 450630 450576 451583
56176 451583 453692 455990 458808 462685 466526 469273 472181 476990 482917 487950 492097 496877 502567 508426
56162 508426 514722 522100 529888 537439 546176 557802 571425 584938 598301 612881 628626 644637
56150 644637 661754 681826 705095 730872 760083 794659 835266 882155 937280 1002881 1078878
56139 1078878 1164274 1259929 1366761 1481741 1598347 1710244 1812190 1899127 1968420 2022931
56129 2022931 2069101 2112238 2155496 2201112 2248379 2291043 2320729 2333475 2330877 2316307 2293373
$$ packed form
56217H18970l1771l0142k9470k8024k5283k2922k1838k0783j8824j6772j5234
56206E57907j3653j2111j1589j1719j0774q693p432p599p468o174n036m725l908
56193D47026j991n34n94j093r53n80l57J30O72N21L28J439L017K760Q39n4J007
56176D51583K109K298K818L877L841K747K908M809N927N033M147M780N690N859
56162E08426O296P378P788P551Q737J1626J3623J3513J3363J4580J5745J6011
56150F44637J7117K0072K3269K5777K9211L4576M0607M6889N5125O5601P5997
56139A078878Q5396R5655J06832J14980J16606J11897J01946Q6937O9293N4511
56129B022931M6170M3137M3258M5616M7267M2664K9686J2746k598j4570k2934
$$ plain form
56118 2293373 2266701 2239538 2209950 2172221 2121871 2056999 1976462 1881003 1775847 1668505 1563989
56107 1563989 1464932 1374970 1297825 1233383 1178622 1132188 1094549 1064302 1038441 1016160 998564
56096 998564 984826 972453 961110 952455 946422 941479 938097 937939 939948 941315 942093 944811 949831 955279
56082 955279 961170 969128 978209 985532 991096 997559 1005310 1012297 1018693 1027040 1037586 1048123 1058608
56069 1058608 1071274 1085937 1099952 1113056 1127575 1143629 1158938 1173560 1189899 1207827 1224908
56058 1224908 1241672 1261443 1284585 1308154 1331550 1356953 1383796 1408573 1430878 1453872 1477985
56047 1477985 1499951 1519050 1538476 1559442 1579778 1599505 1621889 1647615 1673673 1699235 1726964
56036 1726964 1757434 1788207 1819483 1854525 1893312 1932035 1969999 2010610 2054404 2097840 2140380
$$ packed form
56118B293373k6672k7163k9588l7729n0350o4872q0537r5459j05156j07342j04516
56107A563989r9057q9962p7145o4442n4761m6434l7639l0247k5861k2281j7596
56096I98564j3738j2373j1343q655o033m943l382j58K009J367P78K718N020N448
56082I55279N891P958R081P323N564O463P751O987O396Q347J0546J0537J0485
56069A058608J2666J4663J4015J3104J4519J6054J5309J4622J6339J7928J7081
56058A224908J6764J9771K3142K3569K3396K5403K6843K4777K2305K2994K4113
56047A477985K1966J9099J9426K0966K0336J9727K2384K5726K6058K5562K7729
56036A726964L0470L0773L1276L5042L8787L8723L7964M0611M3794M3436M2540
$$ plain form
56025 2140380 2185881 2235519 2286224 2337600 2393257 2453768 2515560 2578313 2645845 2718006 2789589
56014 2789589 2859137 2930879 3006140 3081311 3156384 3236674 3323601 3412606 3502743 3599178 3703473
56003 3703473 3810861 3920155 4036676 4162137 4291562 4423704 4564288 4715298 4871710
55994 4871710 5032828 5205909 5394168 5592322 5798606 6019751 6259250 6512517 6778888
55985 6778888 7066227 7378194 7709383 8058624 8434346 8841345 9276027 9740369 10245840
55976 10245840 10797456 11389857 12025886 12722362 13490486 14328807 15243757 16257862 17388777
55967 17388777 18641189 20030152 21591477 23359247 25357619 27627684 30238334 33260394
55959 33260394 36761717 40845353 45664672 51390869 58208629 66367302 76199482 88077103
$$ packed form
56025B140380M5501M9638N0705N1376N5657O0511O1792O2753O7532P2161P1583
56014B789589O9548P1742P5261P5171P5073Q0290Q6927Q9005R0137R6435J04295
56003C703473J07388J09294J16521J25461J29425J32142J40584J51010J56412
55994D871710J61118J73081J88259J98154K06284K21145K39499K53267K66371
55985F778888K87339L11967L31189L49241L75722M06999M34682M64342N05471
55976A0245840N51616N92401O36029O96476P68124Q38321R14950J014105J130915
55967A7388777J252412J388963J561325J767770J998372K270065K610650L022060
55959C3260394L501323M083636M819319N726197O817760Q158673R832180J1877621
$$ plain form
55951 88077103 102409465 119711862 140610194 165741329 195674467 230736990 270294387
55944 270294387 311521007 348822962 375215587 385311709 377798070 355568732 323784885
55937 323784885 287634150 251102420 216752314 185931348 159093718 136160276 116804364
55930 116804364 100586261 87016994 75638713 66078991 58031020 51220917 45421214
55923 45421214 40466757 36226869 32576572 29409741 26655391 24257696 22155052 20294051
55915 20294051 18645459 17188079 15890548 14723315 13673770 12734294 11887488 11116193
55907 11116193 10415847 9783871 9207496 8673945 8182438 7734896 7324208 6942000 6588703
55898 6588703 6265754 5966503 5684350 5421751 5182175 4961006 4752777 4559283 4381894
$$ packed form
55951H8077103J4332362J7302397K0898332K5131135K9933138L5062523L9557397
55944B70294387M1226620L7301955K6392625J0096122p513639k2229338l1783847
55937C23784885l6150735l6531730l4350106l0820966k6837630k2933442j9355912
55930A16804364j6218103j3569267j1378281r559722q047971o810103n799703
55923D5421214m954457m239888l650297l166831k754350k397695k102644j861001
55915B0294051j648592j457380j297531j167233j049545r39476q46806p71295
55907A1116193p00346o31976n76375n33551m91507m47542m10688l82208l53297
55898F588703l22949k99251k82153k62599k39576k21169k08229j93494j77389
$$ plain form
55889 4381894 4213471 4046593 3883094 3727662 3578844 3434210 3297649 3173351 3058280
55880 3058280 2947995 2844335 2750255 2662572 2576870 2494443 2417666 2343494 2268090 2193176 2121712
55869 2121712 2051996 1982103 1915480 1856101 1802399 1751547 1705125 1664818 1627074 1587966 1549322
55858 1549322 1514423 1481614 1447748 1414015 1382852 1352803 1321889 1292467 1267358 1244473 1220380
55847 1220380 1195857 1172910 1149810 1124341 1098687 1075859 1054301 1031221 1008341 989049 972390
55836 972390 955000 936744 919627 903330 886580 870893 858425 847900 836818 825726 816339 807559
55824 807559 797420 786872 777581 768069 756036 742537 729978 717999 705226 692940 682915 673553
55812 673553 662289 650182 640109 631990 623675 615061 607518 600672 593509 587358 584192 583187 582396 582542
$$ packed form
55889D381894j68423j66878j63499j55432j48818j44634j36561j24298j15071
55880C058280j10285j03660r4080q7683q5702q2427p6777p4172p5404p4914p1464
55869B121712o9716o9893o6623n9379n3702n0852m6422m0307l7744l9108l8644
55858A549322l4899l2809l3866l3733l1163l0049l0914k9422k5109k2885k4093
55847A220380k4523k2947k3100k5469k5654k2828k1558k3080k2880j9292j6659
55836I72390j7390j8256j7117j6297j6750j5687j2468j0525j1082j1092r387q780
55824H07559j0139j0548r291r512j2033j3499j2559j1979j2773j2286j0025r362
55812F73553j1264j2107j0073q119q315q614p543o846p163o151l166j005p91J46
$$ plain form
55798 582542 585713 591490 597609 603302 608915 613558 616302 618462 621743 625387 628027 630766 635336 640614
55784 640614 643833 643719 639618 629522 612496 591583 570930 551376 531941 513854 499400 488238
55772 488238 478750 471970 470216 472422 474407 473478 469663 463190 454143 444322 436254 430420 425907 423119
55758 423119 423047 424644 425818 426544 428174 430211 430540 428327 424089 417502 407918 396507 385237 374255
55744 374255 362815 351986 343623 337293 331099 325028 320629 317726 314379 309978 305712 302118 298702 295782
55730 295782 294254 293639 292708 291694 291511 291153 288450 283267 277513 272131 266470 260507 255306 251217 247767
55715 247767 245267 244502 244984 245560 246495 248941 252611 256002 258575 260750 262242 262545 262598 263746 265362 265603
55699 265603 264028 261425 257675 252153 245731 239968 234736 229010 223463 219694 217335 214651 211684 209992
$$ packed form
55798E82542L171N777O119N693N613M643K744K160L281L644K640K739M570N278
55784F40614L219j14m101j0096j7026k0913k0653j9554j9435j8087j4454j1162
55772D88238r488o780j754K206J985r29l815o473r047r821q068n834m513k788
55758D23119p2J597J174P26J630K037L29k213m238o587r584j1411j1270j0982
55744C74255j1440j0829q363o330o194o071m399k903l347m401m266l594l416k920
55730B95782j528o15r31j014j83l58k703n183n754n382n661n963n201m089l450
55715B47767k500p65M82N76R35K446L670L391K573K175J492L03N3J148J616K41
55699B65603j575k603l750n522o422n763n232n726n547l769k359k684k967j692
$$ plain form
55685 209992 209452 208264 206236 205222 205967 207278 208762 211715 216609 222043 226805 230801 233452 233543 231362
55670 231362 228868 227067 225185 222909 221291 220760 220295 219373 218870 219285 219804 219876 220099 220803 221255 220902 220043
55653 220043 218852 217136 215449 214985 216009 217686 219583 221869 224039 225188 225669 226674 227951 227769 225549
55638 225549 222669 220148 217284 213161 207948 202084 195681 189300 183895 179461 174985 170140 165754 162337
55624 162337 159527 157292 156244 156391 156934 157568 158655 159919 160337 159582 158235 156469 153938 151080 148932
55609 148932 147504 145847 143895 142608 142126 141476 140373 139623 139386 138753 137473 136479 136129 135562 134312 133075
55593 133075 132310 131489 130311 129292 128653 127886 126877 126219 126070 125928 125768 126147 127059 128010 129255 131498 134371
55576 134371 136873 139282 142862 147588 152165 156467 161796 168197 173691 176936 178720 179960 180078 178307
$$ packed form
55685B09992n40j188k028j014P45J311J484K953M894N434M762L996K651R1k181
55670B31362k494j801j882k276j618n31m65r22n03M15N19P2K23P04M52l53q59
55653B20043j191j716j687m64J024J677J897K286K170J149M81J005J277j82k220
55638B25549k880k521k864m123n213n864o403o381n405m434m476m845m386l417
55624A62337k810k235j048J47N43O34J087J264M18p55j347j766k531k858k148
55609A48932j428j657j952j287m82o50j103p50k37o33j280r94l50n67j250j237
55593A33075p65q21j178j019o39p67j009o58j49j42j60L79R12R51J245K243K873
55576A34371K502K409L580M726M577M302N329O401N494L245J784J240J18j771
$$ plain form
55562 178307 174907 170191 163972 156819 150243 144810 139605 134311 130039 127237 124611 121266 118218 116600
55548 116600 115873 115029 114099 113229 111734 109389 107415 106845 107063 107190 107734 109470 111659 112828 112663 111986 111451
55531 111451 111250 111520 112223 113148 114538 116910 119842 121938 122498 122108 121137 119062 115921 112991 111048 109278
55515 109278 106812 104074 101595 98875 95565 92572 90747 89549 88243 87426 88108 90113 92547 95045 97533
55500 97533 99609 101251 103307 106208 108913 110113 109722 108282 105842 102443 98816 95505 92054 88037 84141
55485 84141 81323 79727 79328 80546 83116 85382 86000 85568 85403 85592 85583 85738 86701 87755 87412 85449 83110
55468 83110 81476 80639 80199 79594 78255 76327 74884 74641 75008 75214 75614 76802 78175 78706 78666 79243 80659
55451 80659 81928 82368 82247 81955 81526 81074 80954 81394 82499 84383 86816 89083 90679 91745 92319 91869 90284
$$ packed form
55562A78307l400m716o219p153o576n433n205n294m272k802k626l345l048j618
55548A16600p27q44r30q70j495k345j974n70K18J27N44J736K189J169j65o77n35
55531A11451k01K70P03R25J390K372K932K096N60l90r71k075l141k930j943j770
55515A09278k466k738k479k720l310k993j825j198j306q17O82K005K434K498K488
55500I7533K076J642K056K901K705J200l91j440k440l399l627l311l451m017l896
55485H4141k818j596l99J218K570K266O18m32j65J89rJ55R63J054l43j963k339
55468H3110j634q37m40o05j339j928j443k43L67K06M00J188J373N31m0N77J416
55451H0659J269M40j21k92m29m52j20M40J105J884K433K267J596J066N74m50j585
$$ plain form
55434 90284 88651 88072 88188 87843 86841 86107 86310 87189 88118 88603 88377 87577 86727 86159 85806 85844 86852 88830
55416 88830 90805 92061 93098 94613 96184 96856 96488 95692 94834 93831 92540 90724 88158 85343 83467
55401 83467 82991 83023 82750 82666 83501 84753 85380 85264 84954 84607 84248 84452 85607 87042 87996 88944 90734 92892
55383 92892 94113 94098 93649 93137 92174 90750 89487 88663 87883 86805 85454 83934 82566 82055 82696 83661 83895
55366 83895 83421 82864 82053 80211 77382 74662 72978 72451 72866 73899 74979 75672 76174 76797 77266 77216 76979
55349 76979 77005 76861 75799 74121 73035 73298 74734 76797 78734 79534 78763 77299 76344 75909 75129 73798 72572
55332 72572 71918 71866 72627 74339 76329 77672 78407 79197 79939 79843 78857 77858 77400 77279 77356 77724 78029 77836 77767
55313 77767 79075 81734 84024 84446 83146 81167 79281 77926 77318 77064 76426 75474 75280 76439 78049 78750
$$ packed form
55434I0284j633n79J16l45j002p34K03Q79R29M85k26q00q50n68l53L8J008J978
55416H8830J975J256J037J515J571O72l68p96q58j003j291j816k566k815j876
55401H3467m76L2k73q4Q35J252O27j16l10l47l59K04J155J435R54R48J790K158
55383I2892J221j5m49n12r63j424j263q24p80j078j351j520j368n11O41R65K34
55366H3895m74n57q11j842k829k720j684n27M15J033J080O93N02O23M69n0k37
55349G6979K6j44j062j678j086K63J436K063J937Q00p71j464r55m35p80j331j226
55332G2572o54n2P61J712J990J343P35P90P42r6r86r99m58j21P7L68L05j93o9
55313G7767J308K659K290M22j300j979j886j355o08k54o38r52j94J159J610P01
$$ plain form
55297 78750 78356 77871 78130 78880 79214 78746 78254 78954 81007 83136 84107 84139 84325 85104 86029 86689 87002 86818 86149
55278 86149 85640 85910 86492 86325 85195 83821 82590 81297 80147 79827 80289 80556 80221 80173 81271 83062 84481
55261 84481 85195 85619 86035 86303 86289 86078 85817 85493 84902 83850 82530 81524 81117 80861 80247 79551 79414 79750
55243 79750 79749 79010 78053 77599 77801 78238 78271 77468 76035 74756 74167 74007 73808 73600 73518 73250 72664 72554 73819
55224 73819 76136 78369 80057 81493 82533 82515 81476 80344 79650 79006 78104 77317 76935 76614 76038 75516 75538
55207 75538 76236 77512 79197 80837 81804 81794 80978 79705 78485 78007 78553 79520 80188 80717 81627 82581 82709 82107
55189 82107 81879 82511 83252 83350 82955 82442 81796 81121 80991 81747 83019 84303 85448 86316 86604 86383 86214 86388
55171 86388 86515 86157 85437 84788 84524 84814 85640 86665 87569 88523 89905 91562 92866 93441 93339 92661 91569
$$ packed form
55297G8750l94m85K59P50L34m68m92P00K053K129R71L2J86P79R25O60L13j84o69
55278H6149n09K70N82j67j130j374j231j293j150l20M62K67l35m8J098J791J419
55261H4481P14M24M16K68j4k11k61l24n91j052j320j006m07k56o14o96j37L36
55243G9750jp39r57m54K02M37L3q03j433j279n89j60j99k08q2k68n86j10J265
55224G3819K317K233J688J436J040j8j039j132o94o44r02p87l82l21n76n22K2
55207G5538O98J276J685J640R67j0q16j273j220m78N46R67O68N29R10R54J28o02
55189H2107k28O32P41R8l95n13o46o75j30P56J272J284J145Q68K88k21j69J74
55171H6388J27l58p20o49k64K90Q26J025R04R54J382J657J304N75j02o78j092
$$ plain form
55154 91569 90529 89857 89229 88276 87349 86939 86740 86227 85756 85904 86116 85413 84260 84128 85129 85767 85338 84908
55136 84908 85396 86277 86900 87562 88382 88497 87473 86355 86209 86613 86662 86538 86913 87583 87828 87561 87108 86366 85179
55117 85179 84100 83841 84321 84989 85632 86161 86218 85799 85749 86685 87863 88007 86941 85544 84422 83503 82751 82463
55099 82463 82866 83962 85606 87266 88059 87560 86343 85211 84345 83682 83602 84495 86010 87461 88652 89674
55083 89674 90228 89973 89289 88908 88924 88866 88619 88570 88868 89141 89004 88388 87453 86626 86582 87677 89422 90911 91731
55064 91731 92139 92543 93141 93882 94414 94215 93151 91757 90720 90282 90377 90981 91949 92839 93358 93734 94268 94793
55046 94793 94976 94892 94910 95173 95508 95671 95442 94793 94160 94122 94539 94489 93410 91866 90788 90467 90723 91515 92752
55027 92752 93936 94608 94815 94659 93819 92172 90500 89875 90535 91915 93449 94675 94892 93638 91495 89726
$$ packed form
55154I1569j040o72o28r53r27m10j99n13m71J48K12p03j153j32J001O38m29m30
55136H4908M88Q81O23O62Q20J15j024j118j46M04M9j24L75O70K45k67m53p42j187
55117H5179j079k59M80O68O43N29N7m19n0R36J178J44j066j397j122r19p52k88
55099H2463M03J096J644J660P93m99j217j132q66o63q0Q93J515J451J191J022
55083H9674N54k55o84l81J6n8k47m9K98K73j37o16r35q27m4J095J745J489Q20
55064I1731M08M04N98P41N32j99j064j394j037m38R5O04R68Q90N19L76N34N25
55046I4793J83q4J8K63L35J63k29o49o33l8M17n0j079j544j078l21K56P92J237
55027I2752J184O72K07j56q40j647j672o25O60J380J534J226K17j254k143j769
$$ plain form
55011 89726 88981 88830 88546 87882 87041 86348 86039 86138 86555 87420 89061 91393 93623 94944 95268 95002 94471 93966
54993 93966 94003 94921 96404 97842 98923 99496 99199 97890 96284 95571 96282 97846 99167 99376 98340 96853
54977 96853 96143 96758 98037 98960 99229 99219 99221 99263 99458 99973 100750 101642 102651 103724 104488 104547 103863 102644 101264
54958 101264 100500 101253 103472 105819 107076 107507 108202 109397 110239 110044 109052 107987 107443 107680 108452 109024 108801
54941 108801 107894 106787 105677 104557 103715 103537 103900 104300 104529 104852 105590 106859 108534 110156 111145 111486 111920
54924 111920 113054 114631 116178 117897 120269 123132 125958 128887 132708 137814 143773 149916 155761 160895
54910 160895 165049 168292 170685 171763 170855 167871 163365 157933 152016 146134 140738 135821 131176 126963
54896 126963 123616 121197 119265 117318 115117 112822 111093 110616 111091 111143 109855 107959 106806 106593 106497 106211
$$ packed form
55011H9726p45j51k84o64q41o93l09R9M17Q65J641K332K230J321L24k66n31n05
54993I3966L7R18J483J438J081N73k97j309j606p13P11J564J321K09j036j487
54977I6853p10O15J279R23K69j0KM2J95N15P77Q92J009J073P64N9o84j219j380
54958A01264p64P53K219K347J257M31O95J195Q42j95r92j065n44K37P72N72k23
54941A08801r07j107j110j120q42j78L63M00K29L23P38J269J675J622R89L41M34
54924A11920J134J577J547J719K372K863K826K929L821N106N959O143N845N134
54910A60895M154L243K393J078r08k984m506n432n917n882n396m917m645m213
54896A26963l347k419j932j947k201k295j729m77M75N2j288j896j153k13r6k86
$$ plain form
54880 106211 106329 107305 109079 111736 115562 120223 124767 128780 132836 137577 143014 148956 155404 162055 167961
54865 167961 172116 174095 173910 171617 167367 161629 155172 148888 143514 139247 135652 132201 128801 125596
54851 125596 122610 119946 117933 116503 114787 112026 108670 105837 103922 102546 101599 101373 101665 101761 101489 101371
54835 101371 101590 101659 101401 101327 101679 101894 101539 101021 100859 100831 100443 99804 99453 99583 99900 100033 99789 99204 98634 98565
54815 98565 99118 99953 100777 101642 102586 103291 103354 102681 101531 100349 99606 99506 99801 100076 100159 100006 99419 98368 97449
54796 97449 97455 98408 99523 100144 100251 100102 100018 100546 102112 104272 105944 106628 106904 107491 108371 109150 109756 110412 111273
54777 111273 112425 113953 115683 117135 117962 118267 118482 119200 121104 124570 129137 133795 137943 141767 145633
54762 145633 149635 153872 158656 164101 169812 175156 179555 182419 183252 182046 179240 175160 169861 163697
$$ packed form
54880A06211J18R76J774K657L826M661M544M013M056M741N437N942O448O651N906
54865A67961M155J979j85k293m250n738o457o284n374m267l595l451l400l205
54851A25596k986k664k013j430j716k761l356k833j915j376r47k26K92R6k72j18
54835A01371K19O9k58p4L52K15l55n18j62k8l88o39l51J30L17J33k44n85n70o9
54815I8565N53Q35Q24Q65R44P05O3o73j150j182p43j00K95K75Q3j53n87j051r19
54796I7449OR53J115O21J07j49q4N28J566K160J672O84K76N87Q80P79O06O56Q61
54777A11273J152J528J730J452Q27L05K15P18J904L466M567M658M148L824L866
54762A45633M002M237M784N445N711N344M399K864Q33j206k806m080n299o164
$$ plain form
54748 163697 157593 152417 148350 145047 142167 139586 137354 135625 134454 133552 132444 130909 129051 126991
54734 126991 124785 122653 120957 119915 119568 119928 120844 121860 122604 123255 124264 125780 127732 130272 133595
54719 133595 137519 141817 146751 152595 158780 164313 168930 172979 176204 177585 176583 173678 169468 164121
54705 164121 158042 152208 147303 143190 139635 136882 135031 133469 131491 129033 126357 123519 120638 118277
54691 118277 116987 116631 116502 115946 114724 113037 111419 110302 109581 108871 108214 108073 108606 109422 110112 110517 110459
54674 110459 109819 108971 108506 108409 108153 107650 107379 107472 107535 107571 108146 109260 109933 109446 108266 107254 106699 106588 107149
54655 107149 108428 109841 110680 110727 110076 108929 107871 107683 108445 109428 110227 111218 112491 113234 112842 111875 111164
54638 111164 110620 109758 108835 108609 109299 110483 111775 112981 113864 114254 114145 113408 111889 110042 108816 108505 108418
$$ packed form
54748A63697o104n176m067l303k880k581k232j729j171r02j108j535j858k060
54734A26991k206k132j696j042l47L60R16J016P44O51J009J516J952K540L323
54719A33595L924M298M934N844O185N533M617M049L225J381j002k905m210n347
54705A64121o079n834m905m113l555k753j851j562j978k458k676k838k881k361
54691A18277j290l56j29n56j222j687j618j117p21p10o57j41N33Q16O90M05n8
54674A10459o40q48m65r7k56n03k71R3O3L6N75J114O73m87j180j012n55j11N61
54655A07149J279J413Q39M7o51j147j058j88P62R83P99R91J273P43l92r67p11
54638A11164n44q62r23k26O90J184J292J206Q83L90j09p37j519j847j226l11q7
$$ plain form
54621 108418 108152 108351 109529 110956 111573 111352 110902 110343 109544 108972 109292 110345 111362 111985 112374 112638 112824
54604 112824 113194 113847 114415 114654 114922 115499 116042 116302 116703 117422 117674 116871 115805 115562 115884 115787 115243 114942 114834
54585 114834 114351 113773 113875 114283 113739 112159 110979 111093 111731 111831 111440 111199 111364 111900 112823 113995 115102
54568 115102 116043 116755 116677 115241 113015 111468 111316 111979 112875 114232 116121 117592 117591 116291 114904 114397 114729
54551 114729 115113 114865 114194 114141 115446 117651 119757 121497 123264 125079 126552 127788 129276 130863 131908
54536 131908 132646 134185 136773 139116 140014 139710 139048 138230 137113 135881 134618 132964 130972 129636 129635 130135
54520 130135 129796 128589 127690 127868 128851 130071 131097 131425 130745 129546 128776 128711 128774 128558 128434 128897 129832 130723
54502 130723 131275 131575 131893 132508 133486 134481 134937 134696 134244 134207 134729 135480 136146 136657 136975 136943 136460 135693 134915
$$ packed form
54621A08418k66J99J178J427O17k21m50n59p99n72L20J053J017O23L89K64J86
54604A12824L70O53N68K39K68N77N43K60M01P19K52q03j066k43L22r7n44l01j08
54585A14834m83n78J02M08n44j580j180J14O38J00l91k41J65N36R23J172J107
54568A15102R41P12p8j436k226j547j52O63Q96J357J889J471jj300j387n07L32
54551A14729L84k48o71n3J305K205K106J740J767J815J473J236J488J587J045
54536A31908P38J539K588K343Q98l04o62q18j117j232j263j654j992j336jN00
54520A30135l39j207q99J78R83J220J026L28o80j199p70o5O3k16j24M63R35Q91
54502A30723N52L00L18O15R78R95M56k41m52l7N22P51O66N11L18l2m83p67p78
$$ plain form
54483 134915 134232 133612 133102 132815 132733 132838 133455 135071 137602 140170 141893 142710 143134 143454 143555 143336 142898 142399
54465 142399 142048 142155 142807 143617 144140 144476 145102 146184 147484 148857 150346 151719 152407 152132 151348 150858 151134
54448 151134 151955 152563 152195 150705 148622 146552 144714 143229 142455 142558 143055 143295 143207 143067 142743 141800 140261
54431 140261 138670 137408 136565 136380 137131 138488 139639 140221 140575 141037 141548 142063 142720 143441 143920 144186 144609
54414 144609 145253 145769 146014 146095 145715 144301 142137 140597 140722 142136 143787 145142 146110 146432 145894 144922 144308
54397 144308 144434 145104 145925 146539 146711 146626 146894 147970 149705 151622 153331 154469 154615 153668 152079 150471 149212
54380 149212 148494 148412 148724 148943 148959 149176 149750 150190 150178 150269 151138 152396 152898 152160 150908 150122 150004 150088 150045 150101
54360 150101 150651 151634 152471 152742 152737 153042 153740 154409 154813 155036 154959 154309 153377 152945 153177 153303 152916 152774 153679 155153
$$ packed form
54483A34915o83o20n10k87q2J05O17J616K531K568J723Q17M24L20J01k19m38m99
54465A42399l51J07O52Q10N23L36O26J082J300J373J489J373O88k75p84m90K76
54448A51134Q21O08l68j490k083k070j838j485p74J03M97K40q8j40l24r43j539
54431A40261j591j262q43j85P51J357J151N82L54M62N11N15O57P21M79K66M23
54414A44609O44N16K45Q1l80j414k164j540J25J414J651J355R68L22n38r72o14
54397A44308J26O70Q21O14J72q5K68J076J735J917J709J138J46r47j589j608j259
54380A49212p18q2L12K19J6K17N74M40j2R1Q69J258N02p38j252p86j18Q4m3N6
54360A50101N50R83Q37K71nL05O98O69M04K23p7o50r32m32K32J26l87j42R05J474
$$ plain form
54340 155153 156121 156431 156743 157097 156660 154967 152605 150422 148711 147372 146307 145365 144394 143586 143401 143876 144357
54323 144357 144159 143222 141884 140368 138850 137751 137474 137820 138049 137677 137001 136680 136938 137443 137910 138529 139637
54306 139637 141185 142736 143904 144606 144956 145128 145247 145223 144744 143683 142396 141357 140559 139649 138600 137772 137286
54289 137286 136862 136450 136542 137530 139065 140377 141014 140994 140526 139914 139554 139699 140251 140917 141468 141736 141554 140899 139993
54270 139993 139137 138580 138568 139309 140744 142526 144251 145540 145949 145180 143503 141692 140459 140106 140562 141337 141560
54253 141560 140723 139526 139362 140695 142502 143569 143781 143772 143915 144145 144303 144087 143077 141317 139636 138834 138775
54236 138775 138700 138220 137563 137109 137055 137373 137722 137663 137261 137122 137519 137906 137784 137587 138030 138907 139333 139046 138799 139450
54216 139450 141166 143478 145599 146757 146785 146406 146498 147098 147544 147447 146933 146053 144692 143225 142551 143106 144213
$$ packed form
54340A55153R68L10L12L54m37j693k362k183j711j339j065r42r71q08j85M75M81
54323A44357j98r37j338j516j518j099k77L46K29l72o76l21K58N05M67O19J108
54306A39637J548J551J168P02L50J72J19k4m79j061j287j039p98r10j049q28m86
54289A37286m24m12R2R88J535J312O37k0m68o12l60J45N52O66N51K68j82o55r06
54270A39993q56n57j2P41J435J782J725J289M09p69j677j811j233l53M56P75K23
54253A41560q37j197j64J333J807J067K12rJ43K30J58k16j010j760j681q02n9
54236A38775p5m80o57m54n4L18L49n9m02j39L97L87j22j97M43Q77M26k87k47O51
54216A39450J716K312K121J158K8l79R2O00M46r7n14q80j361j467o74N55J107
$$ plain form
54199 144213 144750 144208 142895 141387 140048 138933 137925 136959 136142 135682 135724 136317 137335 138304 138565 137886 136738
54182 136738 135758 135074 134435 133747 133152 132769 132752 133414 134878 136651 137981 138572 138622 138272 137490 136441 135503 134897
54164 134897 134632 134759 135282 135874 136130 136109 136180 136323 136030 134977 133400 131748 130404 129742 129987 130796 131412 131472
54146 131472 131411 131889 133135 134932 136878 138406 138936 138382 137430 137016 137560 138725 139844 140471 140626 140629 140702 140781
54128 140781 140783 140851 141155 141555 141768 141802 141948 142349 142905 143588 144537 145698 146636 146930 146599 146067 145779 145874 146140 146266
54108 146266 146171 146082 146255 146746 147450 148136 148373 147779 146635 145878 146122 146904 147291 146988 146383 145765 145147 144746 144987
54089 144987 145833 146730 147374 148074 149127 150280 151058 151334 151311 151228 151256 151442 151540 151133 150119 148920 148058 147699 147695
54070 147695 147911 148349 149082 150177 151579 153034 154275 155297 156341 157593 159022 160465 161732 162776 163928
$$ packed form
54199A44213N37n42j313j508j339j115j008r66q17m60M2N93J018R69K61o79j148
54182A36738r80o84o39o88n95l83j7O62J464J773J330N91N0l50p82j049r38o06
54164A34897k65J27N23N92K56k1P1J43k93j053j577j652j344o62K45Q09O16O0
54146A31472o1M78J246J797J946J528N30n54r52m14N44J165J119O27J55LP3P9
54128A40781KO8L04M00K13L4J46M01N56O83R49J161R38K94l31n32k88R5K66J26
54108A46266r5q9J73M91P04O86K37n94j144p57K44P82L87l03o05o18o18m01K41
54089A44987Q46Q97O44P00J053J153P78K76k3q3K8J86R8m07j014j199q62l59m
54070A47695K16M38P33J095J402J455J241J022J044J252J429J443J267J044J152
$$ plain form
54055 163928 165856 168997 173141 177840 183089 189255 196502 204714 213869 223818 233573 241391 245919 247011
54041 247011 245351 241795 237296 232961 229543 226911 224395 221635 218911 216701 215153 214067 213303 213066 213669
54026 213669 215020 216546 217756 218628 219177 218888 217104 213986 210642 208148 206699 205748 204639 203039 201064
54011 201064 199092 197276 195245 192654 189956 188100 187323 186725 185360 183344 181511 180278 179333 178294 177264
53996 177264 176660 176746 177392 178094 178214 177330 175519 173312 171363 170068 169314 168557 167262 165430 163738 162994 163343
53979 163343 163978 163843 162784 161827 162033 163257 164468 165206 166053 167461 168858 169440 169342 169388 169995 170938 171936 172892
53961 172892 173693 174406 175508 177336 179435 181044 182059 182886 183549 183761 183794 184426 185952 188070 190866 194950
53945 194950 200295 205820 210672 215292 220655 227045 234067 241426 249065 256831 264434 271515 277474 281564
$$ packed form
54055A63928J928L141M144M699N249O166P247Q212R155R949R755P818M528J092
54041B47011j660l556m499m335l418k632k516k760k724k210j548j086p64k37O03
54026B13669J351J526J210Q72N49k89j784l118l344k494j449r51j109j600j975
54011B01064j972j816k031k591k698j856p77n98j365k016j833j233r45j039j030
53996A77264o04Q6O46P02J20q84j811k207j949j295p54p57j295j832j692p44L49
53979A63343O35j35j059r57K06J224J211P38Q47J408J397N82r8M6O07R43R98R56
53961A72892Q01P13J102J828K099J609J015Q27O63K12L3O32J526K118K796M084
53945A94950N345N525M852M620N363O390P022P359P639P766P603P081N959M090
$$ plain form
53931 281564 283470 283540 282214 279624 276037 272208 268901 266321 264382 263218 263044 263792 265186 267021 269159
53916 269159 271512 274166 277171 280102 282306 283822 285501 287849 290246 291754 292297 292585 293294 294868 297776
53901 297776 302287 308107 314688 321902 330017 338972 347770 354388 356373 352228 342678 330235 317097 303835
53887 303835 290345 277308 265893 256493 248629 241924 236355 231624 227169 222947 219487 216947 214688
53874 214688 212095 209347 207047 205413 204151 202960 201864 201083 200685 200358 199539 197889 195621 193318 191434
53859 191434 190017 188757 187262 185404 183475 181837 180445 178968 177484 176643 176926 178093 179587 181101 182390
53844 182390 182896 182133 180363 178480 177264 176920 177214 177720 178104 178475 179368 181141 183536 185958 187904 188897
53828 188897 188432 186554 184290 182948 182943 183652 184301 184670 184961 185363 185804 186000 185802 185563 185906 187001 188376 189680
$$ packed form
53931B81564J906P0j326k590l587l829l307k580j939j164j74P48J394J835K138
53916B69159K353K654L005K931K204J516J679K348K397J508N43K88P09J574K908
53901B97776M511N820O581P214Q115Q955Q798O618J985m145r550j2443j3138j3262
53887C03835j3490j3037j1415r400p864o705n569m731m455m222l460k540k259
53874B14688k593k748k300j634j262j191j096p81l98l27q19j650k268k303j884
53859A91434j417j260j495j858j929j638j392j477j484q41K83J167J494J514J289
53844A82390N06p63j770j883j216l44K94N06L84L71Q93J773K395K422J946R93
53828A88897m65j878k264j342nP09O49L69K91M02M41J96j98k39L43J095J375J304
$$ plain form
53810 189680 191170 193183 195571 198155 201240 205110 209323 213173 216623 220118 223682 226879 229524 231759
53796 231759 233463 234239 234051 233360 232645 232303 232871 234664 237156 239391 241066 242589 244040 244776 244251 242619
53780 242619 240338 237728 235128 232894 230962 228888 226471 223905 221208 218173 215060 212644 211184 209942
53766 209942 208119 205771 203399 201199 199199 197630 196526 195361 193709 191993 190957 190610 190326 189860 189594
53751 189594 189780 190183 190587 191138 191926 192643 192940 192877 192827 193129 193971 195369 197034 198445 199334 200065 201329 203463
53733 203463 206260 209334 212370 214908 216318 216352 215619 215105 215184 215487 215784 216579 218504 221372 224245 226380
53717 226380 227865 229357 231385 233930 236528 238784 240787 242940 245423 248151 251257 255130 259692 264104
53703 264104 267621 270374 272808 274753 275788 276367 277775 280823 285164 290016 294945 299695 303847 307022
$$ packed form
53810A89680J490K013K388K584L085L870M213L850L450L495L564L197K645K235
53796B31759J704P76j88o91p15l42N68J793K492K235J675J523J451P36n25j632
53780B42619k281k610k600k234j932k074k417k566k697l035l113k416j460j242
53766B09942j823k348k372k200k000j569j104j165j652j716j036l47k84m66k66
53751A89594J86M03M04N51P88P17K97o3n0L02Q42J398J665J411Q89P31J264K134
53733B03463K797L074L036K538J410L4p33n14P9L03K97P95J925K868K873K135
53717B26380J485J492K028K545K598K256K003K153K483K728L106L873M562M412
53703B64104L517K753K434J945J035N79J408L048M341M852M929M750M152L175
$$ plain form
53689 307022 309161 310334 310519 309774 308345 306482 304352 302193 300277 298603 296963 295392 294266 293781 293630
53674 293630 293355 292820 292272 292103 292508 293125 293145 292170 290866 290190 290029 289299 287468 285248 283516 282263 281103
53657 281103 280156 279786 279907 280164 280489 280897 280978 280255 278961 277876 277431 277475 277897 278941 280711 282784 284572
53640 284572 285925 287198 288819 290852 293035 295191 297543 300399 303618 306690 309389 311995 314737 317465
53626 317465 320082 322868 325992 329142 332144 335578 340112 345427 350470 354809 359072 363955 369379 374873
53612 374873 380232 385388 390011 393739 396737 399687 403169 407154 411018 413984 415721 416726 418024 420241
53598 420241 422910 424863 425413 425060 424937 425656 426896 428074 429102 430238 431422 432169 432095 431186 429472 426840
53582 426840 423358 419450 415425 411111 406331 401583 397776 395333 393820 392469 390706 388212 384953 381458
$$ packed form
53689C07022K139J173J85p45j429j863k130k159j916j674j640j571j126m85j51
53674B93630k75n35n48j69M05O17K0r75j304o76j61p30j831k220j732j253j160
53657B81103r47l70J21K57L25M08Q1p23j294j085m45M4M22J044J770K073J788
53640B84572J353J273J621K033K183K156K352K856L219L072K699K606K742K728
53626C17465K617K786L124L150L002L434M534N315N043M339M263M883N424N494
53612C74873N359N156M623L728K998K950L482L985L864K966J737J005J298K217
53598D20241K669J953N50l53j23P19J240J178J028J136J184P47p4r09j714k632
53582D26840l482l908m025m314m780m748l807k443j513j351j763k494l259l495
$$ plain form
53568 381458 378734 377496 377412 377379 376619 375383 374507 374437 374889 375397 375871 376480 377247 378093 379216 381022 383618 386623
53550 386623 389618 392551 395646 399136 403172 407668 412159 416208 420206 425339 432383 440810 449465 457848
53536 457848 466286 475171 484712 495347 507655 521678 536851 552749 569414 586734 604082 620996
53524 620996 637841 655375 673931 693384 713658 734829 756900 780044 804982 832509 862438
53513 862438 893454 924263 954614 984924 1015281 1045219 1074379 1102893 1130954 1158346 1184712
53502 1184712 1210166 1235355 1260842 1286615 1312301 1337671 1362731 1387415 1411450 1434604 1456803
53491 1456803 1477879 1497478 1515517 1532643 1549919 1567989 1586751 1605789 1624786 1643417 1661185
53480 1661185 1677624 1692428 1705134 1714896 1720991 1723508 1723209 1720668 1715739 1707813 1696360 1681279 1663106
$$ packed form
53568C81458k724j238q4l3p60j236q76p0M52N08M74O09P67Q46J123J806K596L005
53550C86623K995K933L095L490M036M496M491M049L998N133P044Q427Q655Q383
53536D57848Q438Q885R541J0635J2308J4023J5173J5898J6665J7320J7348J6914
53524F20996J6845J7534J8556J9453K0274K1171K2071K3144K4938K7527K9929
53513H62438L1016L0809L0351L0310L0357K9938K9160K8514K8061K7392K6366
53502A184712K5454K5189K5487K5773K5686K5370K5060K4684K4035K3154K2199
53491A456803K1076J9599J8039J7126J7276J8070J8762J9038J8997J8631J7768
53480A661185J6439J4804J2706R762O095K517k99k541m929p926j1453j5081j8173
$$ plain form
53467 1663106 1642969 1622057 1601035 1580108 1559529 1539567 1519839 1499081 1475924 1449810 1421161
53456 1421161 1391062 1360925 1332001 1304763 1278908 1254113 1230475 1207953 1185907 1163769 1142035
53445 1142035 1122059 1104934 1091000 1080235 1072510 1067308 1063692 1060896 1058799 1057761 1058191 1060296 1064030
53432 1064030 1069218 1075875 1084351 1095011 1107825 1122452 1138609 1156155 1175028 1195438 1217912 1242724
53420 1242724 1269311 1296684 1324425 1352982 1383067 1415174 1449616 1486506 1525550 1566279 1608572
53409 1608572 1652764 1699275 1748471 1800747 1856304 1914898 1976232 2040434 2107474 2176177 2244621
53398 2244621 2311800 2378299 2445196 2513004 2581880 2651900 2722440 2791824 2858324 2921319 2981014
53387 2981014 3037382 3089977 3138575 3183462 3224932 3262719 3295900 3323443 3345171 3362197 3375895
$$ packed form
53467A663106k0137k0912k1022k0927k0579j9962j9728k0758k3157k6114k8649
53456A421161l0099l0137k8924k7238k5855k4795k3638k2522k2046k2138k1734
53445A142035j9976j7125j3934j0765p725n202l616k796k097j038M30K105L734
53432A064030N188O657Q476J0660J2814J4627J6157J7546J8873K0410K2474K4812
53420A242724K6587K7373K7741K8557L0085L2107L4442L6890L9044M0729M2293
53409A608572M4192M6511M9196N2276N5557N8594O1334O4202O7040O8703O8444
53398B244621O7179O6499O6897O7808O8876P0020P0540O9384O6500O2995N9695
53387B981014N6368N2595M8598M4887M1470L7787L3181K7543K1728J7026J3698
$$ plain form
53376 3375895 3386309 3392031 3391664 3384525 3369672 3345286 3309928 3263907 3208682 3145576 3076025 3002565
53364 3002565 2928197 2854514 2781205 2707470 2633257 2559198 2486248 2415637 2348466 2284938 2224354
53353 2224354 2166016 2109653 2054891 2000874 1946770 1892372 1838076 1784648 1733121 1684492 1639234
53342 1639234 1597271 1558478 1522883 1490385 1460724 1433923 1410420 1390543 1374026 1360052 1347460
53331 1347460 1334927 1321442 1306891 1291978 1277490 1263867 1251468 1240757 1231940 1224710 1218560 1213180
53319 1213180 1208453 1204351 1201024 1198863 1198417 1200353 1205316 1213319 1223227 1233457 1243521 1254559 1268080
53306 1268080 1284516 1303244 1323585 1345283 1368240 1392345 1417587 1444094 1472057 1501815 1533858
53295 1533858 1568413 1604997 1642489 1679546 1714887 1747523 1777189 1804412 1829791 1853153 1873743
$$ packed form
53376C375895J0414N722l67p139j4853k4386l5358m6021n5225o3106o9551p3460
53364C002565p4368p3683p3309p3735p4213p4059p2950p0611o7171o3528o0584
53353B224354n8338n6363n4762n4017n4104n4398n4296n3428n1527m8629m5258
53342A639234m1963l8793l5595l2498k9661k6801k3503j9877j6517j3974j2592
53331A347460j2533j3485j4551j4913j4488j3623j2399j0711q817p230o150n380
53319A213180m727m102l327k161m46J936M963Q003R908J0230J0064J1038J3521
53306A268080J6436J8728K0341K1698K2957K4105K5242K6507K7963K9758L2043
53295A533858L4555L6584L7492L7057L5341L2636K9666K7223K5379K3362K0590
$$ plain form
53284 1873743 1891221 1906002 1918464 1928135 1933888 1934728 1930245 1920688 1906979 1890529 1872525 1853198
53272 1853198 1831893 1807861 1780835 1750951 1718518 1684090 1648479 1612372 1575900 1538703 1500331
53261 1500331 1460554 1419489 1377680 1335975 1295140 1255715 1218321 1183748 1152207 1122600 1093108
53250 1093108 1062671 1031546 1000405 969378 938294 907396 877397 848966 822417 797748 774758
53239 774758 753322 733726 716519 701871 689228 677816 667269 657567 648683 640495 632748 624795
53227 624795 615682 604923 593055 581062 569396 557835 546046 533866 521204 508187 495319 483093
53215 483093 471461 460102 449167 439317 430971 423898 417548 411417 405085 398244 390850 383013 374771
53202 374771 366242 357872 350095 342715 335114 327210 319822 313862 309368 305541 301583 297431 293780 291367
$$ packed form
53284A873743J7478J4781J2462R671N753Q40m483r557j3709j6450j8004j9327
53272A853198k1305k4032k7026k9884l2433l4428l5611l6107l6472l7197l8372
53261A500331l9777m1065m1809m1705m0835l9425l7394l4573l1541k9607k9492
53250A093108l0437l1125l1141l1027l1084l0898k9999k8431k6549k4669k2990
53239G74758k1436j9596j7207j4648j2643j1412j0547r702q884q188p747p953
53227F24795r113j0759j1868j1993j1666j1561j1789j2180j2662j3017j2868j2226
53215D83093j1632j1359j0935r850q346p073o350o131o332o841p394p837q242
53202C74771q529q370p777p380p601p904p388n960m494l827l958m152l651k413
$$ plain form
53188 291367 290107 288996 287068 284319 281522 279332 277915 277195 276929 276581 275659 274248 272785 271346 269608
53173 269608 267502 265335 263223 261084 259303 258649 259133 259619 259095 257874 256938 256492 255895 254834 253838 253510
53157 253510 253754 253974 253717 252944 251891 250873 250082 249470 248838 248102 247370 246700 245884 244617 242948 241407 240525
53140 240525 240343 240520 240847 241317 241763 241890 241879 242466 244000 245822 247013 247438 247555 247529 247250 247038 247504 248684
53122 248684 250068 251567 253663 256407 258994 260767 262007 263307 264705 265926 266945 267747 267842 266648 264252
53107 264252 261405 258870 256997 255659 254239 251900 248335 244235 240807 238874 238493 239110 239834 239868 239039 237792
53091 237792 236500 235064 233454 232193 231837 232162 232377 232072 231568 231360 231582 232070 232648 233236 233813 234295 234443
53074 234443 233999 233022 231946 231216 230978 231146 231532 231752 231330 230130 228576 227284 226607 226515 226641 226377 225375
$$ packed form
53188B91367j260j111j928k749k797k190j417p20k66l48r22j411j463j439j738
53173B69608k106k167k112k139j781o54M84M86n24j221r36m46n97j061r96l28
53157B53510K44K20k57p73j053j018p91o12o32p36p32o70q16j267j669j541q82
53140B40525j82J77L27M70M46J27j1N87J534J822J191M25J17k6k79k12M66J180
53122B48684J384J499K096K744K587J773J240J300J398J221J019Q02R5j194k396
53107B64252k847k535j873j338j420k339l565m100l428j933l81O17P24L4q29j247
53091B37792j292j436j610j261l56L25K15l05n04k08K22M88N78N88N77M82J48
53074B34443m44r77j076p30k38J68L86K20m22j200j554j292o77r2J26k64j002
$$ plain form
53057 225375 224101 223525 223997 224852 225382 225742 226501 227722 228964 229926 230506 230458 229536 227939 226153 224370 222401
53040 222401 220174 218033 216555 216200 216962 218190 219032 219283 219473 219868 219813 218581 216499 214652 213708 213576 213997
53023 213997 214804 215733 216609 217643 218959 219933 219784 218837 218398 219141 220335 221043 221397 222143 223401 224537 225077
53006 225077 225164 225085 224805 224142 223182 222278 221670 221275 220962 220916 221450 222443 223281 223573 223614 223842 224167 224287 224440 225244
52986 225244 226778 228393 229558 230454 231560 233013 234555 235817 236523 236668 236636 236877 237408 237933 238517 239726
52970 239726 241898 244605 247159 249466 252030 255182 258482 260960 261877 261302 259963 258570 257320 256090 254854
52955 254854 253701 252583 251362 249992 248408 246393 243927 241584 240075 239349 238556 237000 234761 232335 230130
52940 230130 228476 227593 227215 226599 225328 223884 223076 223087 223421 223634 223715 223729 223492 222809 221884 221257 221245 221551 221594
$$ packed form
53057B25375j274n76M72Q55N30L60P59J221J242R62N80m8r22j597j786j783j969
53040B22401k227k141j478l55P62J228Q42K51J90L95n5j232k082j847r44j32M21
53023B13997Q07R29Q76J034J316R74j49r47m39P43J194P08L54P46J258J136N40
53006B25077Q7p9k80o63r60r04o08l95l13m6N34R93Q38K92M1K28L25J20J53Q04
52986B25244J534J615J165Q96J106J453J542J262P06J45l2K41N31N25N84J209
52970B39726K172K707K554K307K564L152L300K478R17n75j339j393j250j230j236
52955B54854j153j118j221j370j584k015k466k343j509p26p93j556k239k426k205
52940B30130j654q83l78o16j271j444q08J1L34K13Q1J4k37o83r25o27j2L06M3
$$ plain form
52921 221594 221212 220796 220635 220437 219823 219039 218669 218752 218810 218776 219207 220244 220972 220424 218862 217417 216616 215899 214685
52902 214685 213318 212619 212863 213573 214191 214593 214944 215371 215926 216624 217260 217357 216610 215402 214573 214614 215366 216497
52884 216497 217834 219071 219671 219522 219296 219579 219942 219534 218476 217913 218598 220047 221270 221808 221857 221919 222595 224281
52866 224281 226649 228779 230081 230841 231658 232683 233659 234357 234622 234299 233469 232566 231966 231670 231591 231815 232255 232344
52848 232344 231514 229815 227765 225758 223936 222393 221061 219517 217376 214834 212451 210429 208517 206659
52834 206659 205293 204772 204756 204497 203773 203388 204459 206999 209365 209646 207727 205497 204719 205161 205312 204460 203262
52817 203262 202450 201944 201509 201492 202372 204053 206094 208322 210689 212759 214055 214986 216815 220191 223962 225914
52801 225914 224822 221462 217556 214117 211119 208451 206486 205559 205396 205433 205449 205511 205530 205275 204746 204188 203760 203521
$$ packed form
52921B21594l82m16j61j98o14p84l70Q3N8l4M31J037P28n48j562j445q01p17j214
52902B14685j367o99K44P10O18M02L51M27N55O98O36R7p47j208q29M1P52J131
52884B16497J337J237O00j49k26K83L63m08j058n63O85J449J223N38M9O2O76J686
52866B24281K368K130J302P60Q17J025R76O98K65l23q30r03o00k96p9K24M40Q9
52848B32344q30j699k050k007j822j543j332j544k141k542k383k022j912j858
52834B06659j366n21j6k59p24l85J071K540K366K81j919k230p78M42J51q52j198
52817B03262q12n06m35j7Q80J681K041K228K367K070J296R31J829L376L771J952
52801B25914j092l360l906l439k998k668j965r27j63L7J6O2J9k55n29n58m28k39
$$ plain form
52783 203521 203693 204508 205697 206521 206564 206297 206563 207607 208831 209471 209311 208685 207917 206998 205900 205003 204912 205729
52765 205729 206823 207531 207862 208169 208302 207602 205824 203675 202205 201863 202346 203073 203579 203614 203200 202640 202354 202679
52747 202679 203884 206180 209415 212788 215141 215788 215072 214079 213821 214690 216526 219019 221934 225006 227790
52732 227790 229789 230852 231389 232088 233329 234869 236090 236535 236193 235360 234363 233426 232602 231701 230371 228468
52716 228468 226368 224727 223844 223365 222681 221531 220133 218871 218007 217565 217305 216814 215882 214837 214292 214454 214834
52699 214834 214747 213996 212961 212167 211939 212318 213075 213839 214464 215296 216804 218896 220916 222403 223511 224425 224775
52682 224775 224121 222800 221663 220997 220277 219140 217990 217317 216967 216547 216172 216233 216669 217086 217555 218644 220501
52665 220501 222378 223324 223140 222514 222419 223426 225355 227474 229228 230822 232887 235576 238256 240140 240951 240894
$$ packed form
52783B03521J72Q15J189Q24M3k67K66J044J224O40j60o26p68r19j098q97r1Q17
52765B05729J094P08L31L07J33p00j778k149j470l42M83P27N06L5m14n60k86L25
52747B02679J205K296L235L373K353O47p16r93k58Q69J836K493K915L072K784
52732B27790J999J063N37O99J241J540J221M45l42q33r97r37q24r01j330j903
52716B28468k100j641q83m79o84j150j398j262q64m42k60m91r32j045n45J62L80
52699B14834q7p51j035p94k28L79P57P64O25Q32J508K092K020J487J108R14L50
52682B24775o54j321j137o66p20j137j150o73l50m20l75O1M36M17M69J089J857
52665B20501J877R46j84o26r5J007J929K119J754J594K065K689K680J884Q11n7
$$ plain form
52649 240894 240227 239084 237547 235770 234031 232631 231631 230770 229831 228958 228381 228026 227740 227662 227917 228111 227800
52632 227800 227437 228083 230012 232325 234277 236282 239115 242717 246361 249508 251847 252899 252336 250509 248072
52617 248072 245265 242101 239019 236670 235160 234137 233583 233834 234795 235804 236428 236799 237030 236908 236428 236094
52601 236094 236338 237026 237848 238829 240093 241409 242298 242410 241610 239955 237925 236395 235987 236448 236975 237145 237229
52584 237229 237508 237594 236719 234732 232599 231639 232255 233624 234694 235236 235694 236337 236999 237568 238238 239129 239962 240265
52566 240265 239760 238562 237257 236675 237158 238008 238039 236864 235289 234254 233789 233309 232605 232077 232062 232355 232513 232445
52548 232445 232512 233009 233620 233637 232861 232087 232287 233416 234450 234628 234182 233686 233240 232670 232146 232118 232778 233884 234984
52529 234984 235604 235442 234671 233912 233636 233729 233852 233942 234060 234003 233504 232697 232039 231847 232183 232980 233974 234762 235443 236982
$$ packed form
52649B40894o67j143j537j777j739j400j000q61r39q73n77l55k86p8K55J94l11
52632B27800l63O46J929K313J952K005K833L602L644L147K339J052n63j827k437
52617B48072k807l164l082k349j510j023n54K51R61J009O24L71K31j22m80l34
52601B36094K44O88Q22R81J264J316Q89J12q00j655k030j530m08M61N27J70Q4
52584B37229K79Q6q75j987k133r60O16J369J070N42M58O43O62N69O70Q91Q33L03
52566B40265n05j198j305n82M83Q50L1j175j575j035m65m80p04n28j5K93J58o8
52548B32445O7M97O11J7p76p74K00J129J034J78m46m96m46n70n24k8O60J106J100
52529B34984O20j62p71p59k76R3J23R0J18n7m99q07o58j92L36P97R94P88O81J539
$$ plain form
52509 236982 240323 245150 250080 254054 256977 258981 259853 259503 258406 257069 255440 253288 250857 248679 246948
52494 246948 245492 244231 243281 242653 242145 241576 240961 240533 240610 241241 241835 241534 240242 239019 239043 240440 242470
52477 242470 244581 246680 248525 249619 249887 249883 250061 250278 250304 250369 250863 251850 253275 255402 258526 262303 265768
52460 265768 268100 269160 269327 269094 268825 268628 268293 267471 266059 264339 262651 260997 259025 256457 253477 250633
52444 250633 248336 246580 245208 244241 243711 243309 242627 241812 241569 242278 243423 244149 244158 243777 243371 243064 242968 243318
52426 243318 244303 245902 247849 249684 251060 252144 253522 255427 257291 258439 259092 260277 262800 266676 271536
52411 271536 277280 284255 293046 304011 316744 329996 342273 352247 358460 359347 354513 345782 336012
52398 336012 326722 317649 308610 300584 294452 289725 285476 281885 279876 279563 280001 280392 280816 281746 283418
$$ packed form
52509B36982L341M827M930L974K923K004Q72l50j097j337j629k152k431k178j731
52494B46948j456j261r50o28n08n69o15m28P7O31N94l01j292j223K4J397K030
52477B42470K111K099J845J094K68mJ78K17K6O5M94R87J425K127L124L777L465
52460B65768K332J060J67k33k69j97l35q22j412j720j688j654j972k568k980k844
52444B50633k297j756j372r67n30m02o82q15k43P09J145P26Rl81m06l07r6L50
52426B43318R85J599J947J835J376J084J378J905J864J148O53J185K523L876M860
52411B71536N744O975Q791J0965J2733J3252J2277R974O213Q87m834q731r770
52398C36012r290r073r039q026o132m727m249l591k009l13M38L91M24R30J672
$$ plain form
52383 283418 285703 288107 289898 290679 290850 291201 292133 293578 295480 297857 300531 303340 306569 310689 315655
52368 315655 320890 325951 330747 335119 338670 341123 342550 343255 343710 344394 345209 345257 343883 341887 341011 342132
52352 342132 344643 347663 351037 354831 358678 362240 365846 370110 375200 380928 387240 394260 402121 411060
52338 411060 421361 432879 445022 457583 471187 486446 502987 519851 536626 553715 571716
52327 571716 591027 611803 633740 656011 677938 699681 721782 744099 765720 785825 804128
52316 804128 820470 834663 846854 857537 866957 874971 881621 887400 892669 897213 900616 902683 903256
52303 903256 902053 899102 895086 890836 886657 882474 878374 874559 870814 866525 861401 855856 850560 845775
52289 845775 841264 836776 832532 829339 828199 829672 833583 839405 846894 856188 867317 879845 893184
$$ packed form
52383B83418K285K404J791P81J71L51R32J445J902K377K674K809L229M120M966
52368C15655N235N061M796M372L551K453J427P05M55O84Q15M8j374j996q76J121
52352C42132K511L020L374L794L847L562L606M264N090N728O312P020P861Q939
52338D11060J0301J1518J2143J2561J3604J5259J6541J6864J6775J7089J8001
52327E71716J9311K0776K1937K2271K1927K1743K2101K2317K1621K0105J8303
52316H04128J6342J4193J2191J0683R420Q014O650N779N269M544L403K067N73
52303I03256j203k951m016m250m179m183m100l815l745m289n124n545n296m785
52289H45775m511m488m244l193j140J473L911N822P489R294J1129J2528J3339
$$ plain form
52276 893184 907111 921744 937030 952492 967634 982430 997160 1011754 1025549 1037764 1048025
52265 1048025 1056231 1062179 1065732 1067302 1067757 1067668 1066921 1065196 1062526 1059186 1055245 1050569 1045134 1039083 1032578
52250 1032578 1025862 1019279 1012861 1005978 997834 988359 978160 967581 956279 943986 931188 918686
52238 918686 906780 895364 884624 875174 867533 861828 857931 855555 854274 853792 854205 855642 857697 859622
52224 859622 861136 862626 864508 866861 869811 873719 878603 883812 888711 893473 898782 904941 911723 918920
52210 918920 926580 934647 942696 950043 955871 959465 960771 960802 961052 962351 964479 966875 969314 971773 974040
52195 974040 975813 976957 977434 977155 976216 975156 974646 974866 975453 976144 977223 979037 981182 982506 982132 980253
52179 980253 977635 974501 970359 964939 958745 952391 945904 939168 932755 927673 924354 922453 921587 921685 922541
$$ packed form
52276H93184J3927J4633J5286J5462J5142J4796J4730J4594J3795J2215J0261
52265A048025Q206N948L553J570M55q9p47j725k670l340l941m676n435o051o505
52250A032578o716o583o418o883q144r475j0199j0579j1302j2293j2798j2502
52238I18686j1906j1416j0740r450p641n705l897k376j281m82M13J437K055J925
52224H59622J514J490J882K353K950L908M884N209M899M762N309O159O782P197
52210I18920P660Q067Q049P347N828L594J306L1K50J299K128K396K439K459K267
52195I74040J773J144M77k79r39j060n10K20N87O91J079J814K145J324l74j879
52179I80253k618l134m142n420o194o354o487o736o413n082l319j901q66R8Q56
$$ plain form
52164 922541 923714 925189 927620 931500 936507 942074 948181 954935 961638 966989 970341 972229 973474 974258
52150 974258 974420 974302 974765 976328 978707 981405 984550 988816 994500 1000972 1007349 1013582 1020578 1029147 1039103
52135 1039103 1049615 1060272 1071618 1084644 1099937 1117252 1135699 1154311 1172696 1191366 1211410
52124 1211410 1233666 1258112 1284043 1310735 1337740 1364501 1389981 1413016 1433005 1449983 1464003
52113 1464003 1474837 1482452 1487409 1490343 1491186 1489259 1484060 1475659 1464383 1450638 1435199 1419322 1404198
52100 1404198 1390308 1377473 1365485 1354631 1345571 1338729 1333774 1329833 1326318 1323444 1321803 1321534 1322120
52087 1322120 1322784 1322835 1321887 1320292 1319420 1320986 1325835 1333592 1343544 1355474 1369493 1385427 1402657 1420345
$$ packed form
52164I22541J173J475K431L880N007N567O107O754O703N351L352J888J245P84
52150I74258J62j18M63J563K379K698L145M266N684O472O377O233O996Q569R956
52135A039103J0512J0657J1346J3026J5293J7315J8447J8612J8385J8670K0044
52124A211410K2256K4446K5931K6692K7005K6761K5480K3035J9989J6978J4020
52113A464003J0834P615M957K934Q43j927n199q401j1276j3745j5439j5877j5124
52100A404198j3890j2835j1988j0854r060o842m955l941l515k874j641k69N86
52087A322120O64N1r48j595q72J566M849P757R952J1930J4019J5934J7230J7688
$$ [...]
##END NTUPLES=NMR SPECTRUM
##END=
