
##TITLE=AC1375_BRAA12187_7518783_2MIMsC2Fym
##JCAMPDX= 6.0         $$ Bruker NMR JCAMP-DX V2.0
##DATA TYPE= NMR SPECTRUM
##DATA CLASS= NTUPLES
##ORIGIN= BRUKER
##OWNER= Administrator
$$ 1.72 TOPSPIN		Version 2.1
$$ 2013-02-21 02:25:27.794 -0500  Administrator@X
$$ Compression mode = diff/dup
##.OBSERVE FREQUENCY= 400.02188249412
##.OBSERVE NUCLEUS= ^1H
##.ACQUISITION MODE= SIMULTANEOUS (DQD)
##.ACQUISITION SCHEME= undefined
##.AVERAGES= 8
##.DIGITISER RES= 22
##SPECTROMETER/DATA SYSTEM= spect
##.PULSE SEQUENCE= zg30
##.SOLVENT NAME= COFFEE_meoh
##.SHIFT REFERENCE= INTERNAL, COFFEE_meoh, 1, 14.98509
##AUDIT TRAIL= $$ (NUMBER, WHEN, WHO, WHERE, PROCESS, VERSION, WHAT)
$$ ##TITLE= Audit trail, TOPSPIN		Version 2.1
$$ ##JCAMPDX= 5.01
$$ ##ORIGIN= Bruker BioSpin GmbH
$$ ##OWNER= Administrator
$$ $$ E:\/data/COFFEE/nmr/AC1375_BRAA12187_7518783_2MIMsC2Fym/10/pdata/1/auditp.txt
$$ ##AUDIT TRAIL=  $$ (NUMBER, WHEN, WHO, WHERE, PROCESS, VERSION, WHAT)
(   1,<2013-02-21 02:25:19.513 -0500>,<Administrator>,<X>,<go>,<TOPSPIN 2.1>,
      <created by zg
	started at 2013-02-21 02:24:13.263 -0500,
	POWCHK enabled, PULCHK disabled,
       configuration hash MD5:
       86 BA 57 50 F2 9D 5C 9B 26 00 A9 28 5F 66 2E 89
       data hash MD5: 64K
       EA A3 DE 40 5F 57 79 A7 04 34 7A F6 52 6D 18 9D>)
(   2,<2013-02-21 02:25:22.607 -0500>,<Administrator>,<X>,<proc1d>,<TOPSPIN 2.1>,
      <Start of raw data processing
       efp LB = 0 FT_mod = 6 PKNL = 1 PHC0 = 0 PHC1 = 0 SI = 32K 
       data hash MD5: 32K
       3A A5 AD 65 32 FE EC 91 FA 9E C2 A1 35 BA 54 88>)
(   3,<2013-02-21 02:25:23.075 -0500>,<Administrator>,<X>,<proc1d>,<TOPSPIN 2.1>,
      <pk PHC0 = 70.7959 PHC1 = 0 
       data hash MD5: 32K
       D4 94 17 2F 57 33 D4 C6 D6 DD AB 26 1C DF 04 90>)
(   4,<2013-02-21 02:25:23.357 -0500>,<Administrator>,<X>,<proc1d>,<TOPSPIN 2.1>,
      <abs ABSG = 1 
       data hash MD5: 32K
       C1 26 1D 28 67 8B 61 57 27 3D 79 2B 55 97 95 11>)
(   5,<2013-02-21 02:25:23.513 -0500>,<Administrator>,<X>,<proc1d>,<TOPSPIN 2.1>,
      <abs ABSG = 2 
       data hash MD5: 32K
       B2 8E D1 02 8C BF 04 49 A9 8F D7 67 70 42 F6 99>)
(   6,<2013-02-21 02:25:23.653 -0500>,<Administrator>,<X>,<proc1d>,<TOPSPIN 2.1>,
      <abs ABSG = 3 
       data hash MD5: 32K
       53 1A 98 CC 13 68 05 E9 FE 4C 53 85 E9 48 07 A7>)
(   7,<2013-02-21 02:25:23.825 -0500>,<Administrator>,<X>,<proc1d>,<TOPSPIN 2.1>,
      <abs ABSG = 4 
       data hash MD5: 32K
       3A 8E BA 61 65 64 4D 45 77 7F D6 02 23 6B 13 CD>)
(   8,<2013-02-21 02:25:23.966 -0500>,<Administrator>,<X>,<proc1d>,<TOPSPIN 2.1>,
      <abs ABSG = 5 
       data hash MD5: 32K
       C4 99 26 17 40 A9 19 24 94 84 69 FA 52 9E 73 9B>)
$$ ##END=
$$ 
$$ $$ hash MD5
$$ $$ 3D DB 92 1B 0E 44 62 88 A5 F5 D2 58 43 26 C7 01
##$RELAX= 
##$RELAX= 
##$RELAX= 
##$RELAX= 
##$RELAX= 
##$RELAX= 
##$RELAX= 
$$ Bruker specific parameters
$$ --------------------------
##$DU= <E:\>
##$EXPNO= 10
##$NAME= <AC1375_BRAA12187_7518783_2MIMsC2Fym>
$$ [...]
##$TP= (0..7)
150 150 150 150 150 150 150 150
##$TP07= 0
##$TPNAME0= <>
##$TPNAME1= <>
##$TPNAME2= <>
##$TPNAME3= <>
##$TPNAME4= <>
##$TPNAME5= <>
##$TPNAME6= <>
##$TPNAME7= <>
##$TPOAL= (0..7)
0.5 0.5 0.5 0.5 0.5 0.5 0.5 0.5
##$TPOFFS= (0..7)
0 0 0 0 0 0 0 0
##$TUNHIN= 0
##$TUNHOUT= 0
##$TUNXOUT= 0
##$USERA1= <user>
##$USERA2= <user>
##$USERA3= <user>
##$USERA4= <user>
##$USERA5= <user>
##$V9= 5
##$VALIST= <valist>
##$VCLIST= <CCCCCCCCCCCCCCC>
##$VD= 0
##$VDLIST= <DDDDDDDDDDDDDDD>
##$VPLIST= <PPPPPPPPPPPPPPP>
##$VTLIST= <TTTTTTTTTTTTTTT>
##$WBST= 1024
##$WBSW= 4
##$XGAIN= (0..3)
0 0 0 0
##$XL= 0
##$YL= 0
##$YMAX_a= 551846
##$YMIN_a= -549707
##$ZGOPTNS= <>
##$ZL1= 120
##$ZL2= 120
##$ZL3= 120
##$ZL4= 120
##$ABSF1= 14.98509
##$ABSF2= -5.573092
##$ABSG= 5
##$ABSL= 3
##$ALPHA= 0
##$AQORDER= 0
##$ASSFAC= 0
##$ASSFACI= 0
##$ASSFACX= 0
##$ASSWID= 0
##$AUNMP= <proc_prof1d_extract_pilot.lims>
##$AXLEFT= 0
##$AXNAME= <>
##$AXNUC= <1H>
##$AXRIGHT= 0
##$AXTYPE= 0
##$AXUNIT= <>
##$AZFE= 0.1
##$AZFW= 0.1
##$BCFW= 0
##$BC_mod= 0
##$BYTORDP= 0
##$COROFFS= 0
##$CY= 15
##$DATMOD= 1
##$DC= 0
##$DFILT= <>
##$DTYPP= 0
##$F1P= 0
##$F2P= 0
##$FCOR= 0.5
##$FTSIZE= 32768
##$FT_mod= 6
##$GAMMA= 0
##$GB= 0
##$INTBC= 1
##$INTSCL= 1
##$ISEN= 128
##$LB= 0
##$LEV0= 0
##$LPBIN= 0
##$MAXI= 10000
##$MC2= 0
##$MEAN= 0
##$ME_mod= 0
##$MI= 0
##$NCOEF= 0
##$NC_proc= -8
##$NLEV= 6
##$NOISF1= 0
##$NOISF2= 0
##$NSP= 0
##$NTH_PI= 0
##$NZP= 0
##$OFFSET= 14.98509
##$PC= 1
##$PHC0= 70.7959
##$PHC1= 0
##$PH_mod= 1
##$PKNL= yes
##$PPARMOD= 0
##$PPDIAG= 0
##$PPIPTYP= 0
##$PPMPNUM= 2147483647
##$PPRESOL= 1
##$PSCAL= 4
##$PSIGN= 0
##$PYNMP= <proc.py>
##$REVERSE= no
##$SF= 400.02
##$SI= 32768
##$SIGF1= 0
##$SIGF2= 0
##$SINO= 400
##$SIOLD= 32768
##$SPECTYP= <>
##$SREGLST= <1H.CDCl3>
##$SSB= 0
##$STSI= 32768
##$STSR= 0
##$SW_p= 8223.68421052631
##$SYMM= 0
##$S_DEV= 0
##$TDeff= 65536
##$TDoff= 0
##$TI= <>
##$TILT= no
##$TM1= 0
##$TM2= 0
##$TOPLEV= 0
##$USERP1= <user>
##$USERP2= <user>
##$USERP3= <user>
##$USERP4= <user>
##$USERP5= <user>
##$WDW= 1
##$XDIM= 32768
##$YMAX_p= 455546162
##$YMIN_p= -809380
##$CURPLOT= <Network HP LaserJet P1505>
##$CURPRIN= <$Network HP LaserJet P1505>
##$DFORMAT= <normdp>
##$LAYOUT= <+/1D_H.xwp>
##$LFORMAT= <normlp>
##$PFORMAT= <normpl>
##$SURQMSG= 1
$$ End of Bruker specific parameters
$$ ---------------------------------
##NTUPLES= NMR SPECTRUM
##VAR_NAME=  FREQUENCY,     SPECTRUM/REAL,   SPECTRUM/IMAG
##SYMBOL=    X,             R,               I
##VAR_TYPE=  INDEPENDENT,   DEPENDENT,       DEPENDENT
##VAR_FORM=  AFFN,          ASDF,            ASDF
##VAR_DIM=   32768,         32768,           32768
##UNITS=     HZ,            ARBITRARY UNITS, ARBITRARY UNITS
##FACTOR=    0.250966925370066, 1,           1
##FIRST=     8223.43324360094, -83690,       43662
##LAST=      0,             22592,           -28812
##MIN=       0,             -809380,         0
##MAX=       8223.43324360094, 455546162,    0
$$ Real data points
##PAGE= N=1
##DATA TABLE= (X++(R..R)), XYDATA
$$ [...]
19557c4823i977j4604n39395J93905A05361e0736k31944g6237A10247a91149A1294
$$ -34823 -9977 -24581 -563976 -370071 105361 -50736 -282680 -76237 110247 -191149 11294
19545E1529h689j58612b3929l66749O0111a08102k01464c2193k04519g0004A17673
$$ 51529 -8689 -167301 -23929 -390678 -330567 -108102 -309566 -32193 -236712 -70004 117673
19533c3953H6412b46399J0055h6753I6468c4738l58596a25777C5658b01161O0077
$$ -33953 86412 -246399 -236344 -86753 96468 -34738 -393334 -125777 35658 -201161 -141084
19522a41084d8549H16e1609p0227K9326A40339a59100B2660c1058k3469F1580
$$ -141084 -48549 816 -51609 -121836 -92510 140339 -159100 22660 -31058 -54527 61580
19510A28093a7750A08268c9916m875B53753k7564a16755D6626b94925A53165b52655
$$ 128093 -17750 108268 -39916 -44791 253753 226189 -116755 46626 -294925 153165 -252655
19498a7042G4732c66902A5256b1671b000l76341E4943k4627c84061G3231k6626
$$ -17042 74732 -366902 15256 -21671 -2000 -378341 54943 30316 -384061 73231 46605
19487D6605K1070a8051A56944i3216A19162N8803a82935B8982d17591f5309j08630
$$ 46605 67675 -18051 156944 -93216 119162 177965 -182935 28982 -417591 -65309 -173939
19476a73939A04401P9396a260k71849J28140J4180l8747e3564a6309k32274j83152
$$ -173939 104401 183797 -1260 -273109 -144969 -130789 -169536 -53564 -16309 -248583 -431735
19465d31735e0693k07433O0348o9493g087A25161i3742b8647l3707F2845j5478
$$ -431735 -50693 -258126 -197778 -267271 -7087 125161 -93742 -28647 -62354 62845 47367
19454D7367a12456E394a99291A17711k0078J17408b39720h5833j14224B00987
$$ 47367 -112456 5394 -199291 117711 97633 215041 -239720 -85833 -200057 200987
19443A31770B1373K4819c75375A89629h8359k9887p3863A74106b48330N0199p8061
$$ 131770 21373 46192 -375375 189629 -88359 -118246 -192109 174106 -248330 -198131 -276192
19432b76192J36988d34j94872g8916H864J04610d6167p641k02183b1558m86790
$$ -276192 -139204 -434 -195306 -78916 8864 113474 -46167 -53808 -255991 -21558 -508348
19421e08348C3806b44669A00972a26799J9715M6272l6538l6915m2140A13978O1929
$$ -508348 33806 -244669 100972 -126799 -107084 -60812 -97350 -134265 -176405 113978 175907
19410A75907a99002G0147a19357k50992A01850a62918e4046B78241F6658a11826
$$ 175907 -199002 70147 -119357 -370349 101850 -162918 -54046 278241 66658 -111826
19399a04615K314j11536B81944b00316A30367E7139a01405k52218C2010i4395
$$ -104615 -102301 -213837 281944 -200316 130367 57139 -101405 -353623 32010 -94395
19388a54611o5717e8829E0536a66589M7286a9429k16345a579E0459b36292O7152
$$ -154611 -220328 -58829 50536 -166589 -119303 -19429 -235774 -1579 50459 -236292 -169140
19377a69140A94762a59829A5015a45501f3255c118E2474J03441N9858n1913d02271
$$ -169140 194762 -159829 15015 -145501 -63255 -3118 52474 155915 215773 163860 -402271
19365A03087A0774c5268k01716Q8991k3559H3673O6153c35644h9494j70237Q5224
$$ 103087 10774 -35268 -236984 -147993 -171552 83673 149826 -335644 -89494 -259731 -174507
19354a74507m1117a02887j85274F5659J19630F8182R8029n1676Q4705a47037g3506
$$ -174507 -215624 -102887 -288161 65659 185289 68182 166211 114535 199240 -147037 -73506
19342A86301a13978A15862b22306L4851b5797A3348a09790A5589P8959l5776b56652
$$ 186301 -113978 115862 -222306 -187455 -25797 13348 -109790 15589 94548 58772 -256652
19330e98854b29167i8853L7061j21515P3578p6252A73122e6049m4863A00132b44249
$$ -598854 -229167 -98853 -61792 -183307 -109729 -185981 173122 -56049 -100912 100132 -244249
19318b92895c0547J0621A42830B070f7730m5723k06635O3924N5688k3760g8624
$$ -292895 -30547 -19926 142830 2070 -67730 -113453 -320088 -256164 -200476 -224236 -78624
19306a11171J1899j53997H4179C7619j8173c0737E8748a28688H5186i4328A21349
$$ -111171 -99272 -253269 84179 37619 19446 -30737 58748 -128688 85186 -94328 121349
19294C35357A03763K6221c9688J817n1113G0006J7599a84562H6850b00694j94328
$$ 335357 103763 129984 -39688 -37871 -88984 70006 87605 -184562 86850 -200694 -395022
19283c95022e1535A62220n9358c09976a52567j05333A80624J03805F7676i2374
$$ -395022 -51535 162220 102862 -309976 -152567 -257900 180624 284429 67676 -92374
19272a30082p4090H3867h4677O121J0136j22877l5758a09000m8315H2207a5536
$$ -130082 -204172 83867 -84677 -78556 -68420 -191297 -227055 -109000 -157315 82207 -15536
19260a66419A44809b12507A07608a26531k27546I7371c35895d366A59283n3501
$$ -166419 144809 -212507 107608 -126531 -354077 97371 -335895 -4366 159283 105782
19250A05782b67315A63880J01694b35896i8290E304R4655J77671n8378j03602
$$ 105782 -267315 163880 265574 -235896 -98290 5304 99959 277630 219252 115650
19240A15650m8766h3569m9628k3650a2122n566k13681B57177j21284a23670m9636
$$ 115650 66884 -83569 -133197 -156847 -12122 -17688 -231369 257177 135893 -123670 -173306
19229a73306h469j8197N839q3106j85128A23241K92054a88730j5718G9475P94
$$ -173306 -8469 -26666 -20827 -103933 -289061 123241 415295 -188730 -204448 79475 80269
19218H0269g7609F5983h5531A79213F388K50945R6476a4053k99878J00636O1383
$$ 80269 -77609 65983 -85531 179213 6388 257333 353809 -14053 -313931 -213295 -151912
19207a51912B59315B8303c9793k82564O3378h1502r1717j43331a34295j63173
$$ -151912 259315 28303 -39793 -322357 -258979 -81502 -173219 -316550 -134295 -297468
19197b97468E8405a43584A6786J98796q5278c20789a1369m04256G830d6538F8160
$$ -297468 58405 -143584 16786 215582 130304 -320789 -11369 -415625 7830 -46538 68160
19185B65465a7499B207J15098i9763B9038g8928b7464j31563c9208q4590c2955
$$ 265465 -17499 2207 117305 -99763 29038 -78928 -27464 -159027 -39208 -123798 -32955
19173C4070J09753b59509i230k34257l9970R0325l69272a53661Q143C4263j4897
$$ 34070 143823 -259509 -9230 -243487 -283457 -193132 -562404 -153661 -145518 34263 19366
19162A9366f4224p0686q7642E1521Q772b38496R575m1134a04921A15518c96787
$$ 19366 -64224 -134910 -222552 51521 60293 -238496 -228921 -270055 -104921 115518 -396787
19150g7628j71110b2372k27401A50666B1339g6637A00054b49702L895b3928A54429
$$ -77628 -248738 -22372 -249773 150666 21339 -76637 100054 -249702 -245807 -23928 154429
19138c35904A12174O4076J72010a02823l56182F5643h3309q3812a4997k84105
$$ -335904 112174 176250 348260 -102823 -459005 65643 -83309 -167121 -14997 -299102
19128b99102J5497C08214g6553n6569A32180a65078E0676a25212B21105j09827
$$ -299102 -283605 308214 -76553 -133122 132180 -165078 50676 -125212 221105 111278
19118A11278b1864h214j0037l0480D563J82580j6876e968n9536B5267i7377M0352
$$ 111278 -21864 -8214 -18251 -48731 4563 187143 170267 -5968 -65504 25267 -97377 -57025
19106e7025j35077g1485B33568A316J21368e0331j33741e1630k1809L2576j09037
$$ -57025 -192102 -71485 233568 1316 122684 -50331 -184072 -51630 -73439 -40863 -149900
19095a49900J0584j09533e9215A9247f3310j62305F3302e1184A44637j9180c2270
$$ -149900 -139316 -248849 -59215 19247 -63310 -225615 63302 -51184 144637 125457 -32270
19083a53301j3637A98295I1742b62518Q6659O5502M9249k7199j41871A96800B9955
$$ -153301 -166938 198295 91742 -262518 -175859 -110357 -61108 -88307 -230178 196800 29955
19071a53786B2218d4224L572j34166k93482b32443B8277P9693a14671d6093a3329
$$ -153786 22218 -44224 -40652 -174818 -468300 -232443 28277 107970 -114671 -46093 -13329
19059c71483a35855k4775C4255f1618p1346q0215f6197b8611l32773a57441q1607
$$ -371483 -135855 -160630 34255 -61618 -132964 -213179 -66197 -28611 -361384 -157441 -239048
19048b39048b9944F9952c012B1716b65119g8616B00044m370a02458j96525G8681
$$ -239048 -29944 69952 -3012 21716 -265119 -78616 200044 195674 -102458 -298983 78681
19036a85622b5278k84517J32867B90416i879k29613g0476C82054A00872J4176
$$ -185622 -25278 -309795 -176928 290416 -9879 -239492 -70476 382054 100872 115048
19026A15048g7860B11568k2649n2479a47171c0796I820a44680A37031a35976K0974
$$ 115048 -77860 211568 188919 136440 -147171 -30796 9820 -144680 137031 -135976 -115002
19015a15002A7351J36077d22540A69130a92189f6182A34756c5246G4048c7515
$$ -115002 17351 153428 -422540 169130 -192189 -66182 134756 -35246 74048 -37515
19004A61983c02961P3680o3506c5507A91060I0099c15752e3712j25866P9253G8361
$$ 161983 -302961 -229281 -292787 -35507 191060 90099 -315752 -53712 -179578 -100325 78361
18992g7138A2524a847k13026g9670k04366L3389B00451g7886I2445M6995d74030
$$ -77138 12524 -1847 -214873 -79670 -284036 -250647 200451 -77886 92445 139440 -474030
18980i5752p7055C35475A04757c1416k46075H1267b83327a02543N07l6468G5039
$$ -95752 -172807 335475 104757 -31416 -277491 81267 -283327 -102543 -102036 -138504 75039
18968D6317b23961C5211r312d37426q8053A45925o6363J36626D1596a6896j00762
$$ 46317 -223961 35211 25899 -437426 -525479 145925 79562 216188 41596 -16896 -117658
18957a17658e6205I6762k4626a01847a3952A45323n3652b51184f5513A65761b27878
$$ -117658 -56205 96762 72136 -101847 -13952 145323 91671 -251184 -65513 165761 -227878
18945A00307l5573Q5419G1861h0636b886A13287a12911E4482b14494a0839j38717
$$ 100307 64734 150153 71861 -80636 -2886 113287 -112911 54482 -214494 -10839 -149556
18934a49556l2762G7107a04151d0275o7455k2730r3961g5024l18327B42104d305
$$ -149556 -182318 77107 -104151 -40275 -107730 -130460 -224421 -75024 -393351 242104 -4305
18922a09677j24781q5289a44134l6578B28025I6987b22584A01989a12437B755
$$ -109677 -234458 -319747 -144134 -180712 228025 96987 -222584 101989 -112437 2755
18911h8394j0757I1896i4233j5063b1585r174j2806I9272a98591I241e0988C2342
$$ -88394 -99151 91896 -94233 -109296 -21585 -30759 -43565 99272 -198591 9241 -50988 32342
18898I06Q7864c26793g3310F4940l1141a41217K4752n7548A38587b43508l1230
$$ 906 88770 -326793 -73310 64940 33799 -141217 -116465 -174013 138587 -243508 -274738
18887b74738A30996i0256E7198K50107a83388p3771B1535h0656F2391a7406n5602
$$ -274738 130996 -90256 57198 307305 -183388 -257159 21535 -80656 62391 -17406 -73008
18876g3008j18539g1981C7732b65506A85992g2467j15224r4861J29710a4G5860
$$ -73008 -191547 -71981 37732 -265506 185992 -72467 -187691 -282552 -152842 -14 75860
18864b35081A65824K91864k01986e797A79507b74649h8688j33826i9964A31659
$$ -235081 165824 457688 255702 -5797 179507 -274649 -88688 -222514 -99964 131659
18853H7233k2430A2170K4495R5636a0594A17517k2849J52664b0603A53884c18624
$$ 87233 64803 12170 36665 132301 -10594 117517 94668 247332 -20603 153884 -318624
18841a46065F5634f2432A69077e0872j7457k25094A51943a15702L054C7907K69269
$$ -146065 65634 -62432 169077 -50872 -68329 -293423 151943 -115702 -112648 37907 307176
18830C07176b31276G3937J14586E9181b8827j25895G3775e6807D1143J42122G5636
$$ 307176 -231276 73937 188523 59181 -28827 -154722 73775 -56807 41143 183265 75636
18818C67150j45367j950E7893J50259P7766J16678A66403C9742L7333b5223r1967
$$ 367150 221783 219833 57893 208152 285918 402596 166403 39742 77075 -25223 -117190
18807a17190C14883n7317b67347a31939B01238g5108l447k6152J8217B6211a292
$$ -117190 314883 257566 -267347 -131939 201238 -75108 -78555 -104707 -86490 26211 -1292
18795a15386j33997a06323B63064E0564g7744B7383a89390g6693j7572l52081
$$ -115386 -249383 -106323 263064 50564 -77744 27383 -189390 -76693 -94265 -446346
18785d46346G533a43979k2363l899A52332a74577m4200e8345J5180q0082p8058
$$ -446346 7533 -143979 -166342 -170241 152332 -174577 -218777 -58345 -43165 -123247 -201305
18774b01305A77141q4254D2772a77123a6302C09104a56774C7002P5605b15856
$$ -201305 177141 92887 42772 -177123 -16302 309104 -156774 37002 112607 -215856
18763I8566a42610H848J15201f7986j11465g685l00436F0517b19650A95345d3174
$$ 98566 -142610 8848 124049 -67986 -179451 -7685 -308121 60517 -219650 195345 -43174
18751A3774c43889J59651h0369j39640b3853j60346C46087a86633q9096f7890
$$ 13774 -343889 -184238 -80369 -220009 -23853 -184199 346087 -186633 -275729 -67890
18740a73984c0133F9085b9706r631A07505b38218h8043k50059B1210a90703p7586
$$ -173984 -30133 69085 -29706 -39337 107505 -238218 -88043 -338102 21210 -190703 -268289
18729b68289j3716l4772b3805l01133a50310B27123c36753C8001d76058N3510
$$ -268289 -282005 -316777 -23805 -324938 -150310 227123 -336753 38001 -476058 -422548
18719d22548J61143H2530f8304m519C7979J50307d0185j28448L2567A603L0767
$$ -422548 -261405 82530 -68304 -72823 37979 188286 -40185 -168633 -136066 1603 32370
18708C2370Q4565h5548j98951e2586R575l4615A05361b69736J07778l1968K7051
$$ 32370 116935 -85548 -284499 -52586 -43011 -77626 105361 -269736 -161958 -193926 -166875
18697a66875A64250Q3925b3404j53280e907H1951c29615A24525c8971r307l7278
$$ -166875 164250 248175 -23404 -176684 -5907 81951 -329615 124525 -38971 -48278 -85556
18686h5556A56844a39722d0789p936n8773q4941g8339j6212r4258f3070B4477
$$ -85556 156844 -139722 -40789 -48725 -107498 -192439 -78339 -94551 -188809 -63070 24477
18674B21005b20403n7658C5639a28845f2934m4936b7241E5674K8257a6785B502
$$ 221005 -220403 -278061 35639 -128845 -62934 -107870 -27241 55674 83931 -16785 2502
18662e399B5066f0422j55189e5106j19405I5426f7083C1703J6853a60597k6816
$$ -5399 25066 -60422 -215611 -55106 -174511 95426 -67083 31703 48556 -160597 -187413
18651a87413A16819J17456f8494m9442r6485Q6232o8021r0152a35430b9903l26212
$$ -187413 116819 234275 -68494 -117936 -214421 -128189 -196210 -286362 -135430 -29903 -356115
18640c56115g2166k5671o5003a6031c635A01416a22451C21601a487G0684a33608
$$ -356115 -72166 -97837 -162840 -16031 -3635 101416 -122451 321601 -1487 70684 -133608
18628A20695M4745C1115f8747E5806g6420G583P8535A5524J87059A7994a17526
$$ 120695 165440 31115 -68747 55806 -76420 7583 86118 15524 202583 17994 -117526
18616b12287A29404g341q3890k42492B239a18530k23748f798n1888j08177A51861
$$ -212287 129404 -7341 -91231 -333723 2239 -118530 -342278 -6798 -58686 -166863 151861
18604c3292g957I2994a15231l17696h1093c7887M636A46237l7565d4698j00310
$$ -33292 -7957 92994 -115231 -432927 -81093 -37887 -33251 146237 108672 -44698 -145008
18593a45008k19648B28708b21733g6410A7066c9551J7085a1130E473h2390J0995
$$ -145008 -364656 228708 -221733 -76410 17066 -39551 -22466 -11130 5473 -82390 -71395
18582g1395B38608b51910J05014j04741a25391K6664F5887P63g3472j84482A38548
$$ -71395 238608 -251910 -146896 -251637 -125391 -98727 65887 66650 -73472 -257954 138548
18570c65830F0461M9919n1763N1602a6690m9674J4884K4996k78480A65846E0158
$$ -365830 60461 110380 58617 110219 -16690 -66364 -51480 -26484 -304964 165846 50158
18558a76423c1418B34233a68219j45381h8680C34817a84429j01149J03154b1096
$$ -176423 -31418 234233 -168219 -313600 -88680 334817 -184429 -285578 -182424 -21096
18547D2030h1136I7948c03296a32066f1425A04819b22414h3571k48861H5395c72796
$$ 42030 -81136 97948 -303296 -132066 -61425 104819 -222414 -83571 -332432 85395 -372796
18535b84496I0063a68254l8384a6265C7448J9251J37817p6115d48264A49998a502
$$ -284496 90063 -168254 -206638 -16265 37448 56699 194516 118401 -448264 149998 -1502
18523b1615a966C14981f9239j09539D0435i5209j7173A7111e9076A79092d9405
$$ -21615 -1966 314981 -69239 -178778 40435 -95209 -112382 17111 -59076 179092 -49405
18511A03673P6374q3033b2510k66117a25000j19166N8462A12386a55023j24014
$$ 103673 180047 97014 -22510 -288627 -125000 -244166 -185704 112386 -155023 -279037
18501b79037f2189A66897a09517n4307r1075A75541a54317B14630b8577o5432
$$ -279037 -62189 166897 -109517 -163824 -254899 175541 -154317 214630 -28577 -94009
18491i4009j36849C6021a57095b7991C7418c211j59219I5177C1267a43537a6264
$$ -94009 -230858 36021 -157095 -27991 37418 -3211 -162430 95177 31267 -143537 -16264
18479g6530A53003l0387a48933N0391k4868j60000d3906E0297M62345A76204R1131
$$ -76530 153003 122616 -148933 -98542 -123410 -283410 -43906 50297 512642 176204 267335
18468B67335Q2169D732L8554G676O0163a18703I9956a14348A7250p872L2260J5015
$$ 267335 349504 4732 43286 7676 67839 -118703 99956 -114348 17250 9378 41638 56653
18456E6653J2800a32750b0732j91911j37308a27925j36573a25878n4732B3915
$$ 56653 69453 -132750 -20732 -212643 -349951 -127925 -264498 -125878 -180610 23915
18445a96977B55403o4054F8889d3115A36301n9612h4436B5396b31234J4609g1711
$$ -196977 255403 191349 68889 -43115 136301 76689 -84436 25396 -231234 -216625 -71711
18433B59398a21081d0725I3834a77861A51712D4755L1138L5824b44890L4976P4211
$$ 259398 -121081 -40725 93834 -177861 151712 44755 75893 111717 -244890 -209914 -135703
18422a35703B0361b68426I9756a07607A52653N2406J40895b18219A9732b76308
$$ -135703 20361 -268426 99756 -107607 152653 205059 345954 -218219 19732 -276308
18411G8693J37789G6387a1549F7709K70691A65583O9067F4730b10797e8002j02066
$$ 78693 216482 76387 -11549 67709 338400 165583 234650 64730 -210797 -58002 -160068
18400a60068f9710j42620c1670E8837K1523b44679P355a18098A89708b35956p8364
$$ -160068 -69710 -212330 -31670 58837 80360 -244679 -237324 -118098 189708 -235956 -314320
18389c14320D3739f9002q6502N6270d0626j51401A34510d3629a7392j25764B30598
$$ -314320 43739 -69002 -155504 -99234 -40626 -192027 134510 -43629 -17392 -143156 230598
18377A35519j5708J31278c58245B84388B1a82008O0955B35780e1513l69946A11085
$$ 135519 119811 251089 -358245 284388 21 -182008 -121053 235780 -51513 -421459 111085
18365b78107D0118A9934c04267b8555C15965b18015e0350D4395J45692a68667
$$ -278107 40118 19934 -304267 -28555 315965 -218015 -50350 44395 190087 -168667
18354e8934A55490G2699b01569b2075j21052O8569m7572M2827A38774c22965b01
$$ -58934 155490 72699 -201569 -22075 -143127 -74558 -122130 -79303 138774 -322965 -201
18342a75821P0226J2234q2430D7936a24470L9811B18690g9943n0591F1377a23637
$$ -175821 -105595 -93361 -175791 47936 -124470 -84659 218690 -79943 -130534 61377 -123637
18330A09331m0869a57370M1851d863D6380h7116F2089a89714N7175P932A62112
$$ 109331 68462 -157370 -115519 -4863 46380 -87116 62089 -189714 -132539 -124607 162112
18318B9551g7507A4141R4444G30K0039a46757L6842a1985l3048n1358M4499A82159
$$ 29551 -77507 14141 108585 730 20769 -146757 -109915 -11985 -45033 -96391 -51892 182159
18305a15427j43336C38045G5745b05040i5861G1121b78101A85618c3684C65491
$$ -115427 -258763 338045 75745 -205040 -95861 71121 -278101 185618 -33684 365491
18294B8859D412b99922J39264j5338d8712M675m0310c1924A28713e7808I7474
$$ 28859 4412 -299922 -160658 -175996 -48712 -44037 -84347 -31924 128713 -57808 97474
18282B14482E472M792a87664C57304A42985C7786b6921k24016E3307f5108b6794
$$ 214482 5472 10264 -187664 357304 142985 37786 -26921 -250937 53307 -65108 -26794
18270b2153I6883f7453B38942N6132i8077A57197J8014J55724a43069H3966d38265
$$ -22153 96883 -67453 238942 295074 -98077 157197 175211 330935 -143069 83966 -438265
18258h6336B94599a17595M7746n11286A00970d48454b18423a01166J793I241c3036
$$ -86336 294599 -117595 -69849 -581135 100970 -448454 -218423 -101166 -99373 9241 -33036
18246a20036M2277D8476J43359E3d9502BJ06824a44657A42480i0046k09172A22788
$$ -120036 -77759 48476 191835 53 -49502 2 106826 -144657 142480 -90046 -299218 122788
18233b4498q9710L479A10825B388c6916n4106n3095A83401L0256a69891j01297
$$ -24498 -114208 -110729 110825 2388 -36916 -91022 -144117 183401 213657 -169891 -271188
18222b71188D13786A28287P9593a2265G2333d7217o9001H7191c54901i7722A6965
$$ -271188 413786 128287 207880 -12265 72333 -47217 -116218 87191 -354901 -97722 16965
18210G127O8937J05A5532a91495B26029c36516c5418j50028e5905A06184f2426
$$ 7127 76064 76169 15532 -191495 226029 -336516 -35418 -185446 -55905 106184 -62426
18198G424b02921j73626A75054a03886A89594F2144c04464N8215a08002l45891
$$ 7424 -202921 -376547 175054 -103886 189594 62144 -304464 -246249 -108002 -453893
18188d53893M0044A07988b14295d4050B0697b45140l7944A97539A6401K89544
$$ -453893 -413849 107988 -214295 -44050 20697 -245140 -283084 197539 16401 305945
18178C05945b3276k13582A44599a57617J4141B03568G9677b43547d0870k78381
$$ 305945 -23276 -236858 144599 -157617 -143476 203568 79677 -243547 -40870 -319251
18168c19251h516j92465A01977b34961a4871q6634a1114A26599k4812Q6195r1018
$$ -319251 -8516 -200981 101977 -234961 -14871 -101505 -11114 126599 101787 187982 96964
18157I6964A6375h1365A59532a40365C20810j54431a54654A9938J69508b72962
$$ 96964 16375 -81365 159532 -140365 320810 166379 -154654 19938 189446 -272962
18146A26903b17278c0069k4227g195j36235D2099R1127a05304a6764k46743g2494
$$ 126903 -217278 -30069 -54296 -7195 -143430 42099 133226 -105304 -16764 -263507 -72494
18134c3132j0841o353G0217m347K00635B8919a14248b6566j3298A16213d5227
$$ -33132 -43973 -50326 70217 65870 266505 28919 -114248 -26566 -39864 116213 -45227
18122a20290N7859k7627k43914I8097e1153J7904m5342A12472a8573D9471i3850
$$ -120290 -62431 -90058 -333972 98097 -51153 -33249 -78591 112472 -18573 49471 -93850
18110g1010p7660A30475c1377j95274C75615g9668l5520l823p691A0116b00527
$$ -71010 -148670 130475 -31377 -226651 375615 -79668 -115188 -119011 -126702 10116 -200527
18098C4585b87947a07246k6966A46515b30795F493c21344J45461A98906n1672
$$ 34585 -287947 -107246 -134212 146515 -230795 6493 -321344 -175883 198906 147234
18088A47234j9175D4509J42433b77394B5741a09361G164b4508p45k54133N2358
$$ 147234 128059 44509 186942 -277394 25741 -109361 7164 -24508 -25253 -279386 -227028
18077b27028B4021b28315d8730J7814j25939b8702a2945B13037a99374M642a7758
$$ -227028 24021 -228315 -48730 -30916 -156855 -28702 -12945 213037 -199374 -194732 -17758
18065a81929a7654j10333b5702A00496c27324C52752j29467b02616A10605B0993
$$ -181929 -17654 -127987 -25702 100496 -327324 352752 223285 -202616 110605 20993
18054A58517n7231j5004k3957b3524A03375j4738C9624K89527b50608A11894L6386
$$ 158517 101286 86282 62325 -23524 103375 88637 39624 329151 -250608 111894 148280
18043A48280M1546m2196a57915H9515J27342B1519J81935g7684j03650A9695h1193
$$ 148280 189826 147630 -157915 89515 216857 21519 203454 -77684 -181334 19695 -81193
18031A32379a07664A85323b76246J5512M2859C4894R2253b73237O7357A0931i349
$$ 132379 -107664 185323 -276246 -260734 -217875 34894 127147 -273237 -205880 10931 -9349
18019f2150E8436j9296J34059n1084I337b1608E4620J37585O4454j17070o1442
$$ -62150 58436 39140 173199 122115 9337 -21608 54620 192205 256659 139589 78147
18008G8147k1468a54687c2514o075o7596a6872D939K23179A09457c53686J13012
$$ 78147 56679 -154687 -32514 -38589 -106185 -16872 4939 228118 109457 -353686 -240674
17997b40674B06991b80274A37084b32833B54538i7880j00342C3664K2825L1487
$$ -240674 206991 -280274 137084 -232833 254538 -97880 -198222 33664 56489 87976
17987H7976b51146N9762K688A61929O343b2117H656d34160A61079H903K9375h3414
$$ 87976 -251146 -191384 -188696 161929 168272 -22117 8656 -434160 161079 8903 38278 -83414
17974d6968f334A08152h6161j5044J0638k43787D900i3576b4884o0076r7958q2448
$$ -46968 -6334 108152 -86161 -101205 -90567 -334354 4900 -93576 -24884 -84960 -182918 -265366
17962b65366G0510a81772O1152a4404j20947O4510E1829b21485b9237j2326B3425
$$ -265366 70510 -181772 -120620 -14404 -135351 -70841 51829 -221485 -29237 -41563 23425
17950B64497R2976b46602B41160a78240H0738j625j5475R6188N7811g8586k4923
$$ 264497 357473 -246602 241160 -178240 80738 79113 63638 159826 217637 -78586 -103509
17939a03509A23882k2678J21219p9694P1220G0210a04237m9651N7576C18088j41047
$$ -103509 123882 101204 222423 142729 213949 70210 -104237 -153888 -96312 318088 177041
17928A77041m42q7992C764a92211A65357b627A43559e5190j26013C3840P7958
$$ 177041 176599 88607 3764 -192211 165357 -2627 143559 -55190 -181203 33840 111798
17917A11798J01196i4308k22481J00988o0221Q9026C03938C9922K25212c38643
$$ 111798 212994 -94308 -316789 -215801 -276022 -186996 303938 39922 265134 -338643
17906c7018J4850I7525j2804f8014A66644h2398A09808J84628a394C6192b21285
$$ -37018 -22168 97525 84721 -68014 166644 -82398 109808 294436 -1394 36192 -221285
17894B49451E4200j6078a2884C9985R3711b19045j5783k47471h9376J0341n8171
$$ 249451 54200 38122 -12884 39985 133696 -219045 -234828 -482299 -89376 -79035 -137206
17883a37206j21694A19931D7304d0162D8283b15689C8249b9763B560J69333g5769
$$ -137206 -258900 119931 47304 -40162 48283 -215689 38249 -29763 2560 171893 -75769
17871b14808F2109A72K8738J91837F1130a56846A80965k0399c8540o8690o7695
$$ -214808 62109 172 28910 220747 61130 -156846 180965 160566 -38540 -107230 -174925
17860a74925N3908j33325a1546G643e6163k11880j59216b4188m4312j45526P7849
$$ -174925 -121017 -254342 -11546 7643 -56163 -268043 -427259 -24188 -68500 -214026 -136177
17849a36177p3320l6040N2917D279d74534A04993k9387b25253A39492N6621a32244
$$ -136177 -209497 -245537 -192620 4279 -474534 104993 75606 -225253 139492 196113 -132244
17837c5245A08206c766B4100b88302g0144b7898h360D5044L36402H2450a88125
$$ -35245 108206 -3766 24100 -288302 -70144 -27898 -8360 45044 381446 82450 -188125
17825c5612p1035A33473P719o9662a20373d4021o1243H3352d78436A83357C2532
$$ -35612 -106647 133473 141192 71530 -120373 -44021 -105264 83352 -478436 183357 32532
17813a99188F3158f4492k68386a33668f323C21552D1910K0343J56351O4009b70515
$$ -199188 63158 -64492 -332878 -133668 -6323 321552 41910 62253 218604 282613 -270515
17801A59239A1239J25544m8229i7561o3740N0372k7651L8952H4578g5414K3107
$$ 159239 11239 136783 88554 -97561 -161301 -110929 -138580 -99628 84578 -75414 -52307
17790e2307p9777d2745B11088a28985b1703j45675Q533K5225c4208E9565K33429
$$ -52307 -132084 -42745 211088 -128985 -21703 -167378 -158845 -133620 -34208 59565 292994
17779B92994e8909J3726B12089E979h1226K1983K0524C53339H5066C7441c1458
$$ 292994 -58909 -45183 212089 5979 -81226 -59243 -38719 353339 85066 37441 -31458
17767B25697A5624e5182R849E0627i1070A38662L5416c2111j19512e1559j41446
$$ 225697 15624 -55182 -45333 50627 -91070 138662 174078 -32111 -151623 -51559 -193005
17756a93005Q2150d2387A14799E5107L3246J01704q4653J11999N2140r529d9014
$$ -193005 -110855 -42387 114799 55107 88353 190057 105404 217403 269543 260014 -49014
17744A98188L834a01762F8605d4111k9074C46877b46664h0534D930K92469a21629
$$ 198188 202022 -101762 68605 -44111 -73185 346877 -246664 -80534 4930 297399 -121629
17732b24081Q8444b0125B43411b17563f393j20406m7007d5487p9719k0101A2579
$$ -224081 -135637 -20125 243411 -217563 -6393 -126799 -173806 -45487 -125206 -145307 12579
17720C01997p7024b10774F3801c1981n5732A40150k3509b1489A47114a57752P3948
$$ 301997 224973 -210774 63801 -31981 -87713 140150 116641 -21489 147114 -157752 -83804
17709h3804n1573A77014d021l411A17480J32091b04549I9253b74442A85514i0973
$$ -83804 -135377 177014 -4021 -7432 117480 249571 -204549 99253 -274442 185514 -90973
17697a69382i318A10686j1030m4043J76060D8310L21848A34033b97802g0163A5093
$$ -169382 -9318 110686 99656 55613 231673 48310 370158 134033 -297802 -70163 15093
17685a66075b5516k8308A7093Q1618b41652o9555B39079b40919B02642h6385d2830
$$ -166075 -25516 -53824 17093 98711 -241652 -311207 239079 -240919 202642 -86385 -42830
17673a78993A68074b4885C3989L36382A01677a92496g7953D5540O1606N374C3597
$$ -178993 168074 -24885 33989 370371 101677 -192496 -77953 45540 107146 112520 33597
17661I579P9572a35016B89864I3453c45475a3459D2681R6866F3308J86415A4902
$$ 9579 89151 -135016 289864 93453 -345475 -13459 42681 139547 63308 249723 14902
17649H4592b06494B7278b83937G434e0959J8215k62622e0827r0007E7087a92938
$$ 84592 -206494 27278 -283937 7434 -50959 -32744 -295366 -50827 -140834 57087 -192938
17637A50083D265K75414c2864B58875b38393I0381D1677J07235a98820A56194
$$ 150083 4265 279679 -32864 258875 -238393 90381 41677 148912 -198820 156194
17626h6223G696J65938c32035h9340c3077n5466B54326E2806b17211E7680K6094
$$ -86223 7696 173634 -332035 -89340 -33077 -88543 254326 52806 -217211 57680 83774
17615H3774K22673b5740F5143K07993a1066B55527G2246b3789B44160I229L52150
$$ 83774 306447 -25740 65143 273136 -11066 255527 72246 -23789 244160 9229 361379
17604C61379G228M81033D3338J00599N8016j0939r2169B2840M56172e6066k3032
$$ 361379 7228 488261 43338 143937 201953 191014 98845 22840 479012 -56066 -79098
17593g9098I2078A4508h6593A17309I17c41095a06266l4956A40835h6783j20517
$$ -79098 92078 14508 -86593 117309 917 -341095 -106266 -141222 140835 -86783 -207300
17582b07300o6306a8777B4135a49372k37766A16433l4699J97842b25532e2441
$$ -207300 -273606 -18777 24135 -149372 -387138 116433 81734 279576 -225532 -52441
17571f9604A04397d824j82208D10a4244A7749d8507j25143L1735m2892K1247b4420
$$ -69604 104397 -4824 -187032 410 -14244 17749 -48507 -173650 -141915 -184807 -163560 -24420
17558B31305g4908k61297B48338n0656L1484m7511r196g5445A57644A5192J55837
$$ 231305 -74908 -336205 248338 197682 229166 181655 172459 -75445 157644 15192 171029
17547A71029n8733a95302A93364c8086A78860J61753I0372a30870A01249f0207
$$ 171029 112296 -195302 193364 -38086 178860 340613 90372 -130870 101249 -60207
17536a5265r9041C45518a30820B0025c68579C39523D8403P4501E7691o808O7256
$$ -15265 -114306 345518 -130820 20025 -368579 339523 48403 122904 57691 50883 118139
17525A18139r812f714C0994K25542F2493c03197D9777f4254a0638n3065A5136
$$ 118139 108327 -6714 30994 256536 62493 -303197 49777 -64254 -10638 -63703 15136
17513i3875A57893p1436a37214B41917a22543B44705a25882B16329K6543c66146
$$ -93875 157893 86457 -137214 241917 -122543 244705 -125882 216329 242872 -366146
17502A3236c491j12344A73041a38968B35389a49448b9776j8158E661c05057E9902
$$ 13236 -3491 -115835 173041 -138968 235389 -149448 -29776 -47934 5661 -305057 59902
17490E5217J32381B8666b3235F6026J65112C3826e2897A82323n9908J10226A12841
$$ 55217 187598 28666 -23235 66026 231138 33826 -52897 182323 122415 232641 112841
17478i9070F5733k9189P8488b6929j58803I5786c19637a3319A78975o545a48080
$$ -99070 65733 36544 115032 -26929 -185732 95786 -319637 -13319 178975 172430 -148080
17466b4234A66104n0607b35281B04588r3495a51026K7629B58118d2779p824A11697
$$ -24234 166104 115497 -235281 204588 111093 -151026 -123397 258118 -42779 -50603 111697
17454B90529R7562j25306F2964M25900I9133Q7226K04184j07980P9485j76859
$$ 290529 388091 262785 62964 488864 99133 186359 390543 282563 362048 185189
17444A85189B7329K94139j41501k6608k4907q898C4573L87571A54397l268b7760
$$ 185189 27329 321468 179967 153359 128452 119554 34573 422144 154397 151129 -27760
17432B71324k4850A13565Q1909J87049P6218M8443B51766l7240J66812q2839m5263
$$ 271324 246474 113565 195474 382523 458741 507184 251766 214526 381338 298499 253236
17421B53236m3350G5129N1320K36292P8053A42544J02202J9188k1055A6977K10788
$$ 253236 209886 75129 126449 362741 440794 142544 244746 263934 242879 16977 227765
17410B27765a08818B80191A8844L03502L4766H2646P986K083O5599C5426d1394
$$ 227765 -108818 280191 18844 322346 357112 82646 90632 92715 158314 35426 -41394
17398F2856P2659a91956A99337n3954K1770J43496o0256A10423J6592a1036B68361
$$ 62856 135515 -191956 199337 145383 167153 310649 250393 110423 127015 -11036 268361
17386B84629p9807r6031J890k4092h23D24908A35646a75115F6924K57921r9441
$$ 284629 204822 108791 110681 86589 -823 424908 135646 -175115 66924 324845 225404
17375B25404p9845O7050K62262a7845I9249K07301h6731G6257J36659B165Q4807
$$ 225404 145559 212609 474871 -17845 99249 306550 -86731 76257 212916 2165 86972
17364H6972B7481b8398A84085e4305B02942b49507B00974n5951f0887k19061h171
$$ 86972 27481 -28398 184085 -54305 202942 -249507 200974 145023 -60887 -279948 -8171
17352A53907R9040Q363l6124R6385d6117A72755f5619B41649I1320a45875O2308
$$ 153907 252947 261310 225186 321571 -46117 172755 -65619 241649 91320 -145875 -83567
17341h3567B15002J31684A67447J3568N722D3439j4075Q5988J76023d6352D00438
$$ -83567 215002 346686 167447 181015 186737 43439 29364 115352 291375 -46352 400438
17329A81489n8432o1231j496g4187j00075C36336a11400J6255C79592F5044J08708
$$ 181489 123057 61826 60330 -74187 -174262 336336 -111400 -95145 379592 65044 173752
17318A73752C2151L5485e0151m3407A59562L63813A41039L39672A98248G9211
$$ 173752 32151 67636 -50151 -93558 159562 523375 141039 480711 198248 79211
17307A96733M46362a87673B18473B2750a825A29111a47676D34909r187j79621
$$ 196733 643095 -187673 218473 22750 -1825 129111 -147676 434909 425722 246101
17297B46101F5180M11363a46552C10480A01234c57601a33492k2903e3819A18276
$$ 246101 65180 476543 -146552 310480 101234 -357601 -133492 -156395 -53819 118276
17286I8797K09567H0736a78314a1662B00641l7601J12544a13209B26256H6211
$$ 98797 308364 80736 -178314 -11662 200641 163040 275584 -113209 226256 86211
17275B1310i2611B21891C3931b03613e0807B11260K487b62400A4762P7672L46876
$$ 21310 -92611 221891 33931 -203613 -50807 211260 213747 -262400 14762 92434 439310
17264D39310A97172J34710j24659N2133j9922d3285G6679J24254A9449L74154
$$ 439310 197172 331882 207223 259356 239434 -43285 76679 200933 19449 393603
17254C93603r9932m9721m2224r6787J50804j19618B9766K26283k284l317k0297
$$ 393603 293671 243950 201726 104939 255743 136125 29766 256049 253765 250448 230151
17243B30151a527C4435P078L5248e069C20613a861j7242B91153A13021J75796
$$ 230151 -1527 34435 41513 76761 -5069 320613 -1861 -19103 291153 113021 288817
17232B88817n1251g8716B67299F9814a5752C89917j52671J31173j82097G9663
$$ 288817 237566 -78716 267299 69814 -15752 389917 237246 368419 186322 79663
17221E61801C1570M04325j59561e03D4143J10137K11395A48747b35977D81466
$$ 561801 31570 435895 276334 -503 44143 154280 365675 148747 -235977 481466
17210B76546J13855j39024N5301I0628c6595A36661e6453B01012J06946i3073
$$ 276546 390401 251377 306678 90628 -36595 136661 -56453 201012 307958 -93073
17199B49940J3824A20015J29368o0721n9630B0289e451C38443L5370A06114R4041
$$ 249940 263764 120015 249383 188662 129032 20289 -5451 338443 373813 106114 200155
17188B00155P8534b7935D49653a66145B96086J1166q6569j1426H4960a18521C50016
$$ 200155 278689 -27935 449653 -166145 296086 307252 220683 209257 84960 -118521 350016
17176A43444L75444A05663K29085j22920r2901J2637M7933k3797L5771L0322k9617
$$ 143444 518888 105663 334748 211828 118927 131564 179497 155700 191471 221793 192176
17165A92176a04954B47586B4288K55146a266B19066J7943R7743Q1121j05872a559
$$ 192176 -104954 247586 24288 279434 -1266 219066 237009 334752 415873 310001 -1559
17153D96556c2029E27849A18433J51993J71508A46743Q9049c734C22972j19851
$$ 496556 -32029 527849 118433 270426 441934 146743 235792 -3734 322972 203121
17143B03121m6194n6516m908L96731B43742O5272j18014J01107j03986O0046P5832
$$ 203121 156927 100411 95503 492234 243742 309014 191000 292107 188121 248167 323999
17132C23999j3099L25900k60069I6864K56384J64019h7964C45003L11134B73569
$$ 323999 310900 636800 376731 96864 353248 517267 -87964 345003 656137 273569
17121D03174A17439M12148A87955J18786j37787M31456j72526j03919J1934o5693
$$ 403174 117439 529587 187955 306741 168954 600410 427884 323965 335899 270206
17111B70206m6381K35361L5365o5786o1363m7014q9051N7460r2765K2806l808
$$ 270206 223825 459186 494551 428765 367402 320388 231337 288797 196032 218838 215030
17100B15030Q9199K17286j39110j51870n3140J41354L60537k86339O8708A1186
$$ 215030 304229 521515 382405 230535 177395 318749 679286 392947 461655 11186
17089E24827N5434B01951L41542A74066J57137Q5232R6947j47639J27788n3781
$$ 524827 580261 201951 543493 174066 331203 416435 513382 365743 493531 439750
17079D39750K18716j36113k48333k3114K73925k14893J12796J41950k10436Q2675
$$ 439750 658466 522353 274020 250906 524831 309938 422734 564684 354248 436923
17069D36923J20497B48217L00128j33765K1360j56408L6589J95688Q4380k35946
$$ 436923 557420 248217 548345 414580 435940 279532 316121 511809 596189 360243
17059C60243K72546L0924k49773o3079R4702J46726k17644M48226B40749N54401
$$ 360243 632789 663713 413940 350861 445563 592289 374645 822871 240749 795150
17049G95150B94651M3886L07481p0758E7828N40385j84144K64838A57610J75355
$$ 795150 294651 338537 646018 575260 57828 598213 414069 678907 157610 332965
17039C32965L86918K0834j06382j6297r816o9707m6168j96950L61440j78571A72259
$$ 332965 719883 740717 634335 618038 608222 538515 492347 295397 656837 478266 172259
17027G33807Q7816J16199k00745j34071k92939J97345L1426K06975J7171j34764
$$ 733807 821623 937822 737077 603006 310067 507412 538838 745813 762984 628220
17017F28220l4351k53649L92335j6206j27282N7136r0949M3270K0946k05742L62724
$$ 628220 593869 340220 732555 716349 589067 646203 555254 598524 619470 413728 776452
17006G76452k87594L61487D22019K80769j56892m0949R5669K72694l8219k98774
$$ 776452 488858 850345 422019 702788 545896 504947 600616 873310 835091 536317
16996E36317J11323K71338j5223q7893C92712K18525J36917k40086N4859K22485
$$ 536317 647640 918978 903755 815862 392712 611237 748154 508068 562927 785412
16986G85412n1879M30514E29497J75199j84348R8865J11912K683K28039j15270
$$ 785412 733533 1164047 529497 704696 520348 619213 731125 733808 961847 846577
16976H46577k10139j12042L86963k00908R4098K29975l63758j5898J83041Q3681
$$ 846577 636438 524396 911359 710451 804549 1034524 670766 654868 837909 921590
16966I21590p6643r5453J07567k15696K94037l26637P9198K54118q6523Q3143
$$ 921590 844947 749494 857061 641365 935402 608765 687963 942081 855558 938701
16956I38701j82166k53423O52887k40603R5554M817o7574K95969j42893j25165
$$ 938701 756535 503112 1155999 915396 1010950 1015767 948193 1244162 1101269 976104
16946I76104L93461l43732n280O8086j32410K28321n4469O2898M1165k18647P5729
$$ 976104 1369565 1025833 1020553 1088639 956229 1184550 1130081 1192979 1234144 1015497 1091226
16935A091226K72946k60242k35651L51382J51085m08836L0686L20366m40695N2006
$$ 1091226 1364172 1103930 868279 1219661 1370746 961910 992596 1312962 872267 924273
16925I24273J39298M36752k29078j55777O6368L50k13059o986M64975j20156r5435
$$ 924273 1063571 1500323 1271245 1115468 1181836 1182186 969127 962141 1427116 1306960 1211525
16914A211525J34801P8678J28076k28773j439J06843J25389n6325J62978n4567
$$ 1211525 1346326 1425004 1553080 1324307 1322868 1429711 1555100 1498775 1661753 1607186
16904A607186k19127m5407j82819K67892k8315M97602o2287l58112J05231J27380
$$ 1607186 1388059 1342652 1159833 1427725 1399410 1897012 1834725 1476613 1581844 1709224
16894A709224K91393k62708K49246k96589o1393J36659K99879k16966j09289o969
$$ 1709224 2000617 1737909 1987155 1690566 1629173 1765832 2065711 1848745 1739456 1732487
16884A732487O4662k12644L68664R0065l96477K44346J05722n9772L07843n5856
$$ 1732487 1797149 1584505 1953169 2043234 1646757 1891103 1996825 1937053 2244896 2189040
16874B189040J07531j16338j88345J62102J11475j8069M3718M656J013J08550
$$ 2189040 2296571 2180233 1991888 2153990 2265465 2247396 2291114 2295770 2296783 2405333
16864B405333r3302L45108j27657M2163q553q9117J97337k03620M45210k36406
$$ 2405333 2312031 2657139 2529482 2571645 2563092 2473975 2671312 2467692 2912902 2676496
16854B676496K46127l02822K53354k1249L06514j79902K11999j87584K27445j12958
$$ 2676496 2922623 2619801 2873155 2851906 3158420 2978518 3190517 3002933 3230378 3117420
16844C117420K70685p6129P6830O1483j5746J03623L6393k10506L84077j52846
$$ 3117420 3388105 3311976 3388806 3450289 3434543 3538166 3574559 3364053 3748130 3595284
16834C595284J22025L98223j6298r0613M1490k51353J14027L63315j74676J06936
$$ 3595284 3717309 4115532 4099234 4008621 4050111 3798758 3912785 4276100 4101424 4208360
16824D208360J34763K74615J76838j31143K13882j38339M30225j92061L67936
$$ 4208360 4343123 4617738 4794576 4663433 4877315 4738976 5169201 4977140 5345076
16815E345076m8034K28793k30062M28309K15817l46685M45011J31607j7592K17430
$$ 5345076 5297042 5525835 5295773 5724082 5939899 5593214 6038225 6169832 6152240 6369670
16805F369670P982K99825m519K58673n8693K78319J55315K47989K02741K17136
$$ 6369670 6377652 6677477 6672958 6931631 6872938 7151257 7306572 7554561 7757302 7974438
16795G974438O4132K12635J44466K90547O16795M1014m5988J92083N11102j98444
$$ 7974438 8038570 8251205 8395671 8686218 9303013 9344027 9298039 9490122 10001224 9802780
16785I802780O68677L13474J02957N12709L23096L59055K16672M90808M43212
$$ 9802780 10471457 10784931 10887888 11400597 11723693 12082748 12299420 12790228 13233440
16776A3233440K77947K94631N96199N16088L86275M02390O95723O20050M79780
$$ 13233440 13511387 13806018 14402217 14918305 15304580 15706970 16402693 17022743 17502523
16767A7502523N57651O33308P24781N83125R64720O82527Q16953J065737R30983
$$ 17502523 18060174 18693482 19418263 20001388 20966108 21648635 22465588 23531325 24462308
16758B4462308Q21324R76925J355595R16839J576773J031556J534418J901170
$$ 24462308 25283632 26260557 27616152 28532991 30109764 31141320 32675738 34576908
16750C4576908J332840J809876J946747J675102K084946K376156K925476K192332
$$ 34576908 35909748 37719624 39666371 41341473 43426419 45802575 48728051 50920383
16742E0920383K610690L191641L057107L599027L719948M128035M273362M756337
$$ 50920383 53531073 56722714 59779821 63378848 67098796 71226831 75500193 80256530
16734H0256530M881070N296362N691813O389644O519309O766290P171078P568268
$$ 80256530 85137600 90433962 96125775 102515419 109034728 115801018 122972096 130540364
16726A30540364P848374Q036200Q107773P975078P703674P831301O880741O238289
$$ 130540364 138388738 146424938 154532711 162507789 170211463 178042764 184923505 191161794
16718A91161794N311537L842547K896681J304184k85049j660078l132802m119096
$$ 191161794 196473331 200315878 203212559 204516743 204231694 202571616 199438814 195319718
16710A95319718n511862o311170p159982p613309q210659q280755p931208q145862
$$ 195319718 189807856 183496686 176336704 168723395 160512736 152231981 144300773 136154911
16702A36154911p903344q028756p255096o672899o355956o641692n567578n276740
$$ 136154911 128251567 120222811 112967715 106294816 99938860 93297168 87729590 82452850
16694H2452850n265707m507142m184388l986856m105347l199501k982325l068255
$$ 82452850 77187143 72680001 68495613 64508757 60403410 57203909 54221584 51153329
16686E1153329k500495k741281k422590k311840k044015j830948j791203j775611
$$ 51153329 48652834 45911553 43488963 41177123 39133108 37302160 35510957 33735346
16678C3735346j348651j765268j180167j121794j209354j605696o01388j135927
$$ 33735346 32386695 30621427 29441260 28319466 27110112 25504416 24903028 23767101
16670B3767101j178579j043015o37309p55377q69919l42777j057943o70325n33039
$$ 23767101 22588522 21545507 20908198 20152821 19282902 18940125 17882182 17211857 16678818
16661A6678818n90285p45988l31893k75443p01335k78833l94133m74274l70393
$$ 16678818 16088533 15342545 15010652 14735209 14033874 13755041 13360908 12886634 12516241
16652A2516241p35605m82646O2739n77892m41573j22813j60860j91966k55311
$$ 12516241 11780636 11297990 11360729 10782837 10341264 10218451 10057591 9865625 9610314
16643I610314k05740m05905l84015k52493K9635m50997k05832j98255o7542j91847
$$ 9610314 9404574 8998669 8614654 8362161 8391796 7940799 7734967 7536712 7469170 7277323
16633G277323l2630j37777m98441K60184m74075k03953k53963m3460j126l41072
$$ 7277323 7244693 7106916 6608475 6868659 6394584 6190631 5936668 5893208 5892082 5551010
16623E551010k8176l9109l74701J60566n9044j68425K02712m16139l08133J7727
$$ 5551010 5522834 5483725 5109024 5269590 5210546 5042121 5244833 4828694 4520561 4538288
16613D538288k44393L19678j42579l67148N432L96704o70060k76354J52017j17879
$$ 4538288 4293895 4613573 4470994 4103846 4109278 4505982 3835922 3559568 3711585 3593706
16603C593706j62002J11522j86779J38383j87268L36827l47799l77497M90761
$$ 3593706 3431704 3543226 3356447 3494830 3307562 3644389 3296590 2919093 3409854
16594C409854k58024j53294n8166j3407j87064Q6588k24542J28349J36337j08397
$$ 3409854 3151830 2998536 2940370 2926963 2739899 2826487 2601945 2730294 2866631 2758234
16584B758234r1073j7915q1936o5040J8563J77429k26030j76690o0622J96392
$$ 2758234 2667161 2649246 2567310 2502270 2520833 2698262 2472232 2295542 2234920 2431312
16574B431312j93719q5474N8463N7125J54815l86899K4987K50339k65685K30401
$$ 2431312 2237593 2152119 2210582 2267707 2422522 2035623 2060610 2310949 2045264 2275665
16564B275665m55359L01269j54698R4205k39746M3623k06840K11993q6836l8049
$$ 2275665 1820306 2121575 1966877 2061082 1821336 1864959 1658119 1870112 1783276 1745227
16554A745227K17246j32469j60090m6796J45302k06094j41294N8892j43281M51648
$$ 1745227 1962473 1830004 1669914 1623118 1768420 1562326 1421032 1479924 1336643 1788291
16544A788291r1542k07964R9048m1913p2725k6806P5129J19761j33102k24451
$$ 1788291 1696749 1488785 1587833 1545920 1473195 1446389 1521518 1641279 1508177 1283726
16534A283726K64941k3323m62536K27147K5571P8962k2006n5268P5883k88775
$$ 1283726 1548667 1525344 1062808 1289955 1315526 1394488 1372482 1317214 1393097 1104322
16524A104322k0128L51001n52109K17503J66587l83283Q3737M5057l4548J94483
$$ 1104322 1084194 1435195 883086 1100589 1267176 883893 967630 1012687 978139 1172622
16514A172622J2441k1722L1026m8640j63492L8047k78202J28051J8912O7652k0380
$$ 1172622 1185063 1163341 1194367 1145727 982235 1020282 742080 870131 889043 956695 936315
16503I36315m8550N32550F20817M03685k51962K06428j91350R1869N2949J12420
$$ 936315 887765 1420315 620817 1024502 772540 978968 787618 879487 932436 1044856
16493A044856D26303J86935l4305L77638m42899J01558L6391L53547Q3783l04649
$$ 1044856 426303 613238 578933 956571 513672 615230 651621 1005168 1088951 784302
16483G84302j89688J79553l5687p9313k93006N00247M803j30430J25587l00732
$$ 784302 594614 774167 738480 659167 366161 866408 871211 740781 866368 565636
16473E65636R4167j15473J79474O5979j03866l6331q1832j6653J58975j89543
$$ 565636 659803 544330 723804 789783 685917 649586 567754 551101 710076 520533
16463E20533J73101O7098l67366j46281M81531C09666K83054j19096j9191K8408
$$ 520533 693634 760732 393366 247085 728616 309666 592720 473624 454433 482841
16453D82841J96252j8n7897k81759L32940k01124Q3624k09955L09747k79387L00229
$$ 482841 679093 679075 621178 339419 672359 471235 554859 344904 654651 375264 675493
16442F75493m266k45421J015L0276P706K34118k84291J43593R8854k62545L1754
$$ 675493 671227 425806 426821 457097 464803 698921 414630 558223 657077 394532 426286
16431D26286m2045n4521L05530j73568A47012P8417K23458J11468B05365J64979
$$ 426286 384241 329720 635250 461682 147012 225429 448887 560355 205365 370344
16421C70344L0720j4224G7275L63498J10263q3377J01546j59724Q2300A05611
$$ 370344 401064 386840 77275 440773 551036 467659 569205 409481 491781 105611
16410C80151J29999k7613l2551P7474B23866J29953J33475j89232P967J96976
$$ 380151 510150 482537 449986 527460 223866 353819 487294 298062 306029 503005
16400E03005j91979L17467k91552k6831o9070j4454E1730L36963L0316j29899
$$ 503005 311026 628493 336941 310110 241040 226586 51730 388693 419009 289110
16390B89110K32145B41134M5913P2338A23889L02334j31362A33491J01471L42414
$$ 289110 521255 241134 287047 359385 123889 426223 294861 133491 234962 577376
16380E77376B85356j38594J86556A29862J18808p9120L1784Q9507q6060n927L99450
$$ 577376 285356 146762 333318 129862 248670 169550 201334 290841 204781 198854 598304
16369E98304A51920K23709K5935J02755B48299L5397A26861K2266l0483K69960
$$ 598304 151920 375629 401564 504319 248299 283696 126861 149127 118644 388604
16359C88604A12929K62254j67544J20238Q6380l6436D0543M08349C121K6918K08279
$$ 388604 112929 375183 207639 327877 414257 377821 40543 448892 3121 30039 238318
16348B38318R0342I9901k3774J86308a0664B66268K35443A85672f4650A29296
$$ 238318 328660 99901 76127 262435 -10664 266268 501711 185672 -64650 129296
16337B30224i3798B37862A6864K52078j9450H8677L18415j04897r1793M8282p32
$$ 230224 -93798 237862 16864 268942 249492 88677 407092 302195 210402 258684 257952
16326B57952K57234K76358E5219h0026B63160a36761a9849G059Q6568D6039M8170
$$ 257952 515186 791544 55219 -80026 263160 -136761 -19849 7059 93627 46039 94209
16315I4209a1709D16257b152m7800B57332A07341J34039j18912M06353A28136
$$ 94209 -11709 416257 -2152 -49952 257332 107341 241380 122468 528821 128136
16304A68006J02796J46823A42433o190M71976a33769D29541R0089j55402j32853
$$ 168006 270802 417625 142433 136243 608219 -133769 429541 519630 364228 231375
16294B31375n1666F9015K62237q5449L03459B5668L10067a62700A69105M2137
$$ 231375 179709 69015 331252 245803 549262 25668 335735 -162700 169105 211242
16284B11242D2745M2172H28K41561J433A19584N1442N8508g6785E4442J35008
$$ 211242 42745 84917 828 242389 243822 119584 171026 229534 -76785 54442 189450
16273A89450d4025A22671g1065o8777A25729h482D72571A52383K1747a89705H1878
$$ 189450 -44025 122671 -71065 -139842 125729 -8482 472571 152383 174130 -189705 81878
16261b00285A63253B4917f2298H8943J79758J21443j62334a67543C74182G1448
$$ -200285 163253 24917 -62298 88943 268701 390144 227810 -167543 374182 71448
16250a54257C55010c6231B63760H2095M3010J04498H2124M2128D2570K57246p2382
$$ -154257 355010 -36231 263760 82095 125105 229603 82124 124252 42570 299816 227434
16239B27434A13178J4810j0495b44798M8294C23822b68227f6058A05887N7845
$$ 227434 113178 127988 117493 -244798 -196504 323822 -268227 -66058 105887 163732
16229A63732H1574c2493I3395A3522e8297q5463A41878D0155M659O8461a43404
$$ 163732 81574 -32493 93395 13522 -58297 -143760 141878 40155 44814 113275 -143404
16217B52353b43716C05815a51706a9939E3431P2508g8256H6674l8811J75546G5030
$$ 252353 -243716 305815 -151706 -19939 53431 125939 -78256 86674 47863 223409 75030
16205A12396O6485p772l3781E3163k3502M3370L48211A85350b0146A9099K72783
$$ 112396 178881 171109 137328 53163 29661 73031 421242 185350 -20146 19099 291882
16194B91882D5365a19061J2922E0641J55460r9688a59264A46685a97359A7459
$$ 291882 45365 -119061 -106139 50641 206101 106413 -159264 146685 -197359 17459
16183a13744d9842A19J19577J51567b92487b4512A4844a55336A15615k4604a4599
$$ -113744 -49842 119 119696 271263 -292487 -24512 14844 -155336 115615 91011 -14599
16171b50791C5405c29381a23657B70379K35057I3374O2139P1924A5575a33977
$$ -250791 35405 -329381 -123657 270379 505436 93374 155513 227437 15575 -133977
16160A40274b38363B72395h2242A72936a32212O0415B67852A01214a05805k6095
$$ 140274 -238363 272395 -82242 172936 -132212 -71797 267852 101214 -105805 -131900
16150a31900B11718C8392a77537e2216q0420r4503B37389c29162I1449M6909E9636
$$ -131900 211718 38392 -177537 -52216 -132636 -227139 237389 -329162 91449 138358 59636
16138B47603j15495g311f64G9394a7920A32855D2907J55448j338A8655c11807
$$ 247603 132108 -7311 -664 79394 -17920 132855 42907 198355 197017 18655 -311807
16126a28869B4663b01867A27655a66862B8896h7765A53347h1307A11472a78333
$$ -128869 24663 -201867 127655 -166862 28896 -87765 153347 -81307 111472 -178333
16115I9548O1388a80090K1419P6651A29690B6422J47149E685K48677E9235B9231
$$ 99548 160936 -180090 -158671 -82020 129690 26422 173571 5685 254362 59235 29231
16103g829j69816C15641o1887F0257L7983a22601C19814H4570A6071b4778l2587
$$ -7829 -177645 315641 253754 60257 98240 -122601 319814 84570 16071 -24778 -57365
16092e7365i262k104C69064a13768C4702A5296K56607j15758B5765c43896E5308
$$ -57365 -9262 -11366 369064 -113768 34702 15296 271903 156145 25765 -343896 55308
16080b95793g803l7421a7213k025p4155p7146f4794a9449A74416g604r2707B85456
$$ -295793 -7803 -45224 -17213 -19238 -93393 -170539 -64794 -19449 174416 -7604 -100311 285456
16067B66958A23196a33118E6710b90034d8348o8132d4204a6651E8682b00378A18430
$$ 266958 123196 -133118 56710 -290034 -48348 -116480 -44204 -16651 58682 -200378 118430
16055a71266E7803P7368C6625c16006B41218h6238j6648G5881g1032B30545g8634
$$ -171266 57803 135171 36625 -316006 241218 -86238 -102886 75881 -71032 230545 -78634
16043B13489b03866E1294a71652M7874k55866A72412c38692D5038K10830i7987
$$ 213489 -203866 51294 -171652 -123778 -379644 172412 -338692 45038 255868 -97987
16032h6616d1813D47635a25873l80937K13315c4019a5076I6714J21604a62106
$$ -86616 -41813 447635 -125873 -506810 -293495 -34019 -15076 96714 218318 -162106
16021a21597L5880A19788d4458j88836c3961q8175e5190j55844A84870l8271R3157
$$ -121597 -85717 119788 -44458 -233294 -33961 -122136 -55190 -211034 184870 146599 239756
16010B39756b7545A60992C7696a45777H2846D1381K95090E8035a31783B01810
$$ 239756 -27545 160992 37696 -145777 82846 41381 336471 58035 -131783 201810
15999a9248A62859a71456A10926h5823k41205K9051C0920P2207b48687L3072c3139
$$ -19248 162859 -171456 110926 -85823 -327028 -297977 30920 103127 -248687 -215615 -33139
15987B0350N1654F169c5115B7040K34692r3842K93282H7691N0638Q4243f6328
$$ 20350 72004 6169 -35115 27040 261732 167890 461172 87691 138329 222572 -66328
15975a23519A33290a40669K6527m6568M9772C01756b7266m70107a15226A93601
$$ -123519 133290 -140669 -114142 -160710 -110938 301756 -27266 -497373 -115226 193601
15964E8972L338c15078h2293J6457A52360f9284A23357a28319D51139B6645b23180
$$ 58972 62310 -315078 -82293 -65836 152360 -69284 123357 -128319 451139 26645 -223180
15952f0853C55384a21723d3271k27409G6630d5324j13486j25117J21171A60602
$$ -60853 355384 -121723 -43271 -270680 76630 -45324 -158810 -283927 -162756 160602
15941b96868C602J67831b38138A88330J73390b1288j18253m0317r2872b1096j35644
$$ -296868 3602 171433 -238138 188330 361720 -21288 -139541 -179858 -272730 -21096 -156740
15930a56740A27293b9499A01792n0702M6341N3404b7385n5524A09578a53229r7056
$$ -156740 127293 -29499 101792 51090 97431 150835 -27385 -82909 109578 -153229 -250285
15919b50285e6589o0748C87570A31885c38763i5527A57859a78275H2468a08350
$$ -250285 -56589 -117337 387570 131885 -338763 -95527 157859 -178275 82468 -108350
15908d5912k54058H8696k2035A2222h1987I9235K65787a98386d3678C8521a45295
$$ -45912 -299970 88696 66661 12222 -81987 99235 365022 -198386 -43678 38521 -145295
15896c47989J2445d5028A52117F3771J27818A7343a94424k06654f8337j7856o1669
$$ -347989 -335544 -45028 152117 63771 191589 17343 -194424 -401078 -68337 -86193 -147862
15885a47862B98581e4982D9981J31267p9957R4109F833c81070a77620D49871A14547
$$ -147862 298581 -54982 49981 181248 101291 195400 6833 -381070 -177620 449871 114547
15873c30436E2939a91837k41578J32599J41570q6930c6590j14445M8025k40149
$$ -330436 52939 -191837 -433415 -300816 -159246 -246176 -36590 -151035 -103010 -343159
15863c43159g9359n9354a2296r1415F6465B5922d30836A52454c01441b7579j59343
$$ -343159 -79359 -138713 -12296 -103711 66465 25922 -430836 152454 -301441 -27579 -186922
15852a86922j33555D376J86854j9648H896a10047k3548A78023C0048b12792Q3651
$$ -186922 -320477 4376 191230 171582 8896 -110047 -133595 178023 30048 -212792 -129141
15841a29141e4080B12798I491J09321c39897J60916G915M454R7582e1476j15869
$$ -129141 -54080 212798 9491 118812 -339897 -178981 7915 12369 109951 -51476 -167345
15830a67345g5348j38712J2804d8878A8397d33528A54434A318g4815j10946B46441
$$ -167345 -75348 -214060 -201256 -48878 18397 -433528 154434 1318 -74815 -185761 246441
15818a91868F4623a99220H5843a77216Q7956O032j16742D59189a53528o6379A12590
$$ -191868 64623 -199220 85843 -177216 -89260 -83228 -199970 459189 -153528 -219907 112590
15806C31515b66950A33666B032J07194j2234c54791a60457A25225P6343d45586
$$ 331515 -266950 133666 2032 109226 96992 -354791 -160457 125225 201568 -445586
15795C1505J20493a94752C09121d3715A77815c91953h8107j9170K3697B4027g699
$$ 31505 151998 -194752 309121 -43715 177815 -391953 -88107 -107277 -83580 24027 -7699
15783a87625B18828h09380A31690N11606A05531P0473E2492a82270n7873L928
$$ -187625 218828 -809380 131690 643296 105531 176004 52492 -182270 -240143 -236215
15773b36215J8371f2230m04827A36709J18630a9059N387m2601A57123b08305R2204
$$ -236215 -217844 -62230 -467057 136709 255339 -19059 -13672 -56273 157123 -208305 -116101
15762a16101A08680K081J6529m0356a05632B95607G9834b73297G890i0086L6556
$$ -116101 108680 110761 127290 86934 -105632 295607 79834 -273297 7890 -90086 -53530
15751e3530k04518c4727A0894J02387H236R9534C4900P9060i9938a1397B27894
$$ -53530 -258048 -34727 10894 113281 8236 107770 34900 113960 -99938 -11397 227894
15739E5577c53620i5401M4458A7964J57161i9969m1519j85546A05344a0094F0544
$$ 55577 -353620 -95401 -50943 17964 175125 -99969 -141488 -327034 105344 -10094 60544
15727a47092A3291d99009a83502A3421M37643G2034a92799i4215o2826c7079d43
$$ -147092 13291 -499009 -183502 13421 451064 72034 -192799 -94215 -157041 -37079 -443
15715a36341E0753a15339A25000L04133E1998j6228K22315j24490i9202f956m53629
$$ -136341 50753 -115339 125000 429133 51998 35770 258085 133595 -99202 -6956 -460585
15704d60585c7467l01307A37866b0443j40586K7818A73793c92614B49784b29248
$$ -460585 -37467 -338774 137866 -20443 -161029 -133211 173793 -392614 249784 -229248
15693A64961g5459A11450L6887L4554a08913a7571H9359K7207b46024A64900G0398
$$ 164961 -75459 111450 148337 182891 -108913 -17571 89359 116566 -246024 164900 70398
15681b65351J6111n9875l55624B38212a55963N5612j01845r3850a11797C9827
$$ -265351 -249240 -309115 -664739 238212 -155963 -100351 -202196 -296046 -111797 39827
15670i3156j57927A24102f3964j06978e8323K6529J855A84597i9839b2467A5021
$$ -93156 -251083 124102 -63964 -170942 -58323 -31794 -29939 184597 -99839 -22467 15021
15658B66296j11850a81678e1192n1363A95698c44863c4376k82418J14150E6866
$$ 266296 154446 -181678 -51192 -102555 195698 -344863 -34376 -316794 -202644 56866
15647a05915B33758e2829C05291A13554B1722a15843B88294a33367j01178C0713
$$ -105915 233758 -52829 305291 113554 21722 -115843 288294 -133367 -234545 30713
15636d3881r3984a7306B04247B8285L7052a81011C4188d4090B9798b46983B0643
$$ -43881 -137865 -17306 204247 28285 65337 -181011 34188 -44090 29798 -246983 20643
15624B49443E4166J44178a18083B60389h720p5468d1931j49354r3912R3158C8847
$$ 249443 54166 198344 -118083 260389 -8720 -84188 -41931 -191285 -285197 -192039 38847
15612a68117F2042J52085b17036E524a39430J1864A19026c53006o8126J20637
$$ -168117 62042 214127 -217036 5524 -139430 -127566 119026 -353006 -421132 -300495
15602c00495A6395a5193k78995h4152j15852K8186J8602n804F4828J11722b4408
$$ -300495 16395 -15193 -294188 -84152 -200004 -171818 -153216 -159020 64828 176550 -24408
15590c35287a07248I0999C7755d2558D10956a33403A57345a29580n6700P0363
$$ -335287 -107248 90999 37755 -42558 410956 -133403 157345 -129580 -186280 -115917
15580a15917B78209d35j79811b2000k04286j02142H0202e252B01879a70744j6481
$$ -115917 278209 -435 -180246 -22000 -226286 -328428 80202 -5252 201879 -170744 -187225
15569a87225A50723b05675I2648K6653d0147Q216f364j02470a1753q5308A57652
$$ -187225 150723 -205675 92648 119301 -40147 -31931 -6364 -108834 -11753 -97061 157652
15557a92220A49395a14264B66701a16680e678B56162B0319b89237A87795a32489
$$ -192220 149395 -114264 266701 -116680 -5678 256162 20319 -289237 187795 -132489
15546c73931A16358a57946I4466f7221G4272d0970C21944a02680d681o6780k8453
$$ -373931 116358 -157946 94466 -67221 74272 -40970 321944 -102680 -4681 -71461 -99914
15535i9914J6069o6168B22337a89750N3032C88813F8917b40454b4744B6172b6956
$$ -99914 -83845 -150013 222337 -189750 -136718 388813 68917 -240454 -24744 26172 -26956
15523a72949j37219Q9175j27226f2877l7535F4681k5443a19138c9050A68930q3767
$$ -172949 -310168 -220993 -348219 -62877 -100412 64681 39238 -119138 -39050 168930 85163
15512H5163O1505M4365c7743k6613c0805k23333P7171i184p8365r5752m4881l474
$$ 85163 146668 191033 -37743 -64356 -30805 -254138 -176967 -9184 -87549 -183301 -228182 -231656
15500b31656c5642j90443d5544A05491M99c57877A91041g6360o6706q5085A15138
$$ -231656 -35642 -226085 -45544 105491 105990 -357877 191041 -76360 -143066 -228151 115138
15488B64542n8590c03479A68407a11323J1566k21785o7872A66958a88026A20041
$$ 264542 205952 -303479 168407 -111323 -99757 -321542 -389414 166958 -188026 120041
15477a45807B20465A05863c8013H629b87884B68954c07246e4047j44573A65504
$$ -145807 220465 105863 -38013 8629 -287884 268954 -307246 -54047 -198620 165504
15466A43857a94790D4532a49072A2748J97625d6874C9210a52207d3926A33669
$$ 143857 -194790 44532 -149072 12748 210373 -46874 39210 -152207 -43926 133669
15455F4650J75615b00159k77324a99236G9399i4536L8180k3440j37607a3429A67842
$$ 64650 240265 -200159 -477483 -199236 79399 -94536 -56356 -79796 -217403 -13429 167842
15443A99930b5587E7340a8031A66572a6933B10253b7632G3655a09489D0903b83612
$$ 199930 -25587 57340 -18031 166572 -16933 210253 -27632 73655 -109489 40903 -283612
15431a04646j23760f1234m4394C27534q2387c22181A80007m2475N0817g9353a715
$$ -104646 -228406 -61234 -105628 327534 245147 -322181 180007 137532 188349 -79353 -1715
15419F3080L8438d1543l19978g8813C44172A33010a93803l334J544F7441b7042
$$ 63080 101518 -41543 -361521 -78813 344172 133010 -193803 -197137 -195593 67441 -27042
15407A05949j6068J72211g1245D1896a24427I8660c01868N6590D5870J48124q5363
$$ 105949 89881 262092 -71245 41896 -124427 98660 -301868 -245278 45870 193994 108631
15396A08631i2313B55527d32507d9797G8126a9121B13472j8548A8873a96602C1565
$$ 108631 -92313 255527 -432507 -49797 78126 -19121 213472 194924 18873 -196602 31565
15384a11462A50225o6619i7504J6744C07343j1881a27100K7308q7703a2328o8975
$$ -111462 150225 83606 -97504 -80760 307343 295462 -127100 -99792 -187495 -12328 -81303
15373h1303A15760L672L4681E1729g3329B21638a49406M9721g980A36813a46774
$$ -81303 115760 119432 154113 51729 -73329 221638 -149406 -99685 -7980 136813 -146774
15361E3963g8407a1692N269A1428b10337M23Q8096q8565B9082K93574e28522a84502
$$ 53963 -78407 -11692 -6423 11428 -210337 -209914 -121818 -210383 29082 322656 -528522 -184502
15348A10716b9322j17108A3669J28236J13239R1037C0180R7051B9108Q1875J34130
$$ 110716 -29322 -146430 13669 141905 255144 346181 30180 127231 29108 110983 245113
15337B45113H7561h8762n8445l17287b00448H4320L9166J94426B7807b16209d9218
$$ 245113 87561 -88762 -147207 -464494 -200448 84320 123486 317912 27807 -216209 -49218
15325b12798L5049B68252c21361B54636A01468b08904A95096m6524A7726R2988
$$ -212798 -177749 268252 -321361 254636 101468 -208904 195096 148572 17726 110714
15315A10714h951A47187d2106B4959J89004A9871M6722k4246J14035a010l4740
$$ 110714 -8951 147187 -42106 24959 213963 19871 66593 42347 156382 -1010 -35750
15304c5750j48339B34430E346J2486K89203b71777C7299e7426H707e7960E00051
$$ -35750 -184089 234430 5346 17832 307035 -271777 37299 -57426 8707 -57960 500051
15292A26983H993d6150B24972a58141f2411A40048o7929a23566C1516b7735A14495
$$ 126983 8993 -46150 224972 -158141 -62411 140048 72119 -123566 31516 -27735 114495
15280c5745D9282I01L24891A35420a15665k33347I8133Q9225O8953L0961a95800
$$ -35745 49282 901 325792 135420 -115665 -349012 98133 187358 256311 287272 -195800
15268A63672p6713A4547d6304H7710f9772A39513D4564K433L3774d2569q7566
$$ 163672 86959 14547 -46304 87710 -69772 139513 44564 46997 80771 -42569 -130135
15257a30135o4368D0022R4048K27787c0272G4224j353K76568L78312M16983J47299
$$ -130135 -194503 40022 134070 361857 -30272 74224 72871 349439 727751 1144734 1292033
15246A292033j48719L05558B96612A23812K5826L8510J0926d5484A93497q0119
$$ 1292033 1143314 1448872 296612 123812 149638 188148 199074 -45484 193497 113378
15236A13378E029K84585b3678k01180A08958N4219b04894A33277c533n11378f1558
$$ 113378 5029 289614 -23678 -224858 108958 163177 -204894 133277 -3533 -514911 -61558
15224A42169K7520n8913a7767I1593c26472b7896B76039c94629A89964N1006p9875
$$ 142169 169689 110776 -17767 91593 -326472 -27896 276039 -394629 189964 240970 161095
15213A61095b48059A67679h2143D75161F311J36404a98143A80406K8254k3136
$$ 161095 -248059 167679 -82143 475161 6311 142715 -198143 180406 208660 185524
15203A85524C3195g8578A66515a38403A38951g5950j91499A82026H9192b59333
$$ 185524 33195 -78578 166515 -138403 138951 -75950 -267449 182026 89192 -259333
15192a11007k51828a22741e5444j44956c9466A31845L6543n7087R5575c0025B78645
$$ -111007 -362835 -122741 -55444 -200400 -39466 131845 168388 111301 206876 -30025 278645
15180b38833a08808N1446B93100j30375d6433n37A82203B2587h522n05829c1182
$$ -238833 -108808 -57362 293100 162725 -46433 -46970 182203 22587 -8522 -514351 -31182
15168A25242D2902K81519E32J03827a47344A36228L75105A74773J00866d3116
$$ 125242 42902 324421 532 104359 -147344 136228 511333 174773 275639 -43116
15157B32556G9147o100a70462a4764H6592a11114b1495B04101k3292d5104F3995
$$ 232556 79147 73047 -170462 -14764 86592 -111114 -21495 204101 180809 -45104 63995
15145B91480I7537n180j8053J80924b7846B1471L77575A75207R45N9786a0505
$$ 291480 97537 92357 74304 255228 -27846 21471 399046 175207 176152 235938 -10505
15133E4421P5624Q489O1896G7198f3117B15940b82495B26283A10903k3220Q1880
$$ 54421 130045 138534 200430 77198 -63117 215940 -282495 226283 110903 87683 169563
15122A69563A1869J6328J48978a59035B03757D7171K46015j25375A714J43215
$$ 169563 11869 28197 177175 -159035 203757 47171 293186 167811 1714 144929
15112A44929k8325n0425J57332l9097a17516G7410A7510a41567A43798e994A51835
$$ 144929 116604 66179 223511 184414 -117516 77410 17510 -141567 143798 -5994 151835
15100D3806a94663A07325N0129G2685N4810o0206L27337F4425B5374J0200a06127
$$ 43806 -194663 107325 157454 72685 127495 67289 394626 64425 25374 35574 -106127
15088g0023A16186C427K2075a63027B54201J07914j36133H5930R101J67242J06745
$$ -70023 116186 3427 25502 -163027 254201 362115 225982 85930 95031 262273 369018
15077C69018b06653E9319l474G687L57754A20925b48802A26873A5534b47968B32527
$$ 369018 -206653 59319 55845 7687 365441 120925 -248802 126873 15534 -247968 232527
15065C19696L3578E5742N2679a63294A28781N4692a62939B78964N8084f5654C85186
$$ 319696 353274 55742 108421 -163294 128781 183473 -162939 278964 337048 -65654 385186
15053B3429J95544b28624h4153r1368A72760p6618q871L89784k30522A08519b19373
$$ 23429 218973 -228624 -84153 -175521 172760 96142 87271 477055 246533 108519 -219373
15041B35298J24866p0810E3321M36453B05318a05849B39884b50342N7523B70960
$$ 235298 360164 289354 53321 489774 205318 -105849 239884 -250342 -192819 270960
15030B05076K02009O540B4348J14044J2411a11491B06874o8566J49069k333J47783
$$ 205076 407085 413625 24348 138392 150803 -111491 206874 138308 287377 285044 432827
15019D32827A91208K52676D2070M02280j24157j33232n1907A6238f2008D81219
$$ 432827 191208 443884 42070 444350 320193 186961 135054 16238 -62008 481219
15008d224C6877K33418c1839C52782M8248B4578O0741K28362P8499l1855A31351
$$ -4224 36877 270295 -31839 352782 401030 24578 85319 313681 392180 360325 131351
14996D38287A97688R9743j30899J83359o9725n9374K35547k25707m3164L6325
$$ 438287 197688 297431 166532 349891 280166 220792 456339 230632 187468 223793
14986B23793D7477M32121A74360j3505J27356N3390K5607f6726A64345P9333J07988
$$ 223793 47477 479598 174360 160855 288211 341601 367208 -66726 164345 243678 351666
14975C51666r7347O8811m7672o5258J4306h269C22037L41205A67420m9619J32033
$$ 351666 254319 323130 275458 210200 224506 -8269 322037 663242 167420 117801 249834
14964B49834J32315j05304N0336p3789J61934q9059j39797A1983L00944J02957
$$ 249834 382149 276845 327181 253392 415326 326267 186470 11983 312927 415884
14954D15884J91298h3132E34265O6996b47997C53659o6894A8746J73043O5168
$$ 415884 607182 -83132 534265 601261 -247997 353659 286765 18746 191789 256957
14944B56957A11963L80673A2240L24704P6903k1577A54069L06043A48542L58251
$$ 256957 111963 492636 12240 336944 413847 392270 154069 460112 148542 506793
14934E06793r4820A07901J9383E2097K36282f7269A72871K9138G7302L43836F9422
$$ 506793 411973 107901 127284 52097 288379 -67269 172871 202009 77302 421138 69422
14922E38571A93463L16299j16503J20206o1588k16488J87240A34723l7479K97474
$$ 538571 193463 509762 393259 513465 451877 235389 422629 134723 97244 394718
14912C94718p9459o8488J41063J59528A74960K5424J5386J92045j08739K58035
$$ 394718 315259 246771 387834 547362 174960 200384 215770 407815 299076 557111
14902E57111B41253J11208A68748P086B1196J5382K52640J74512N3556M1262A42359
$$ 557111 241253 352461 168748 175834 21196 36578 289218 463730 517286 558548 142359
14890A3080J67169A5512J76032M3794r8511K28041j54503A00123R1675A7604N70293
$$ 13080 180249 15512 191544 235338 136827 364868 210365 100123 191798 17604 587897
14879E87897j65010j20152A45585L75808J24191B81648E8803L58159j90088Q2680
$$ 587897 422887 302735 145585 521393 645584 281648 58803 416962 226874 309554
14869C09554A9761O4516L95569E4002L99542k22353P1340q4875J91615R021q3758
$$ 309554 19761 84277 479846 54002 453544 231191 302531 217656 409271 418292 334534
14858C34534K35357J29921k24882j24675o1525J1702K71752q0122C6586J34763
$$ 334534 569891 699812 474930 350255 288730 300432 572184 492062 36586 171349
14848A71349J87265J00300k22772L6372O0233K49211B55924K01040j05030J54828
$$ 171349 358614 458914 236142 272514 332747 581958 255924 456964 351934 506762
14838E06762J71907l32214R7897H2683M96537O522r4834k5343P1538I1406O51239
$$ 506762 678669 346455 444352 82683 579220 585742 490908 465565 537103 91406 742645
14827G42645B84402J84900A91360n362K24277j8841L81722C76557j31128J15982
$$ 742645 284402 469302 191360 185998 410275 391434 773156 376557 245429 361411
14817C61411R3381K2415R6318n7358A77781L813M46875k02863j00298L17604B28283
$$ 361411 454792 477207 573525 516167 177781 181594 628469 425606 325308 642912 228283
14805E06383L1497K9856m1386K76500j55722K85145B92534L23780R07n6327B69342
$$ 506383 537880 567736 526350 802850 647128 932273 292534 616314 617221 560894 269342
14793E21424P8797j43842J52162B57242L20688k21116K74417j62418J47540M9060
$$ 521424 600221 456379 608541 257242 577930 356814 631231 468813 616353 665413
14783F65413p5972k92312N8051k7169M12853j03401N1035j20555j98458J37904
$$ 665413 589441 297129 355180 328011 740864 637463 688498 567943 369485 507389
14773E07389J48926J04844l46910m8616K34291p6722Q9731j87285n1117O0951
$$ 507389 656315 761159 414249 365633 599924 523202 612933 425648 374531 435482
14763D35482J22468M8377j21405N1571M5659L03751l89724l6991K89943k04489
$$ 435482 557950 606327 484922 536493 582152 885903 496179 459188 749131 544642
14753E44642L4665M6224C01111M2131P72917n17407P6507Q9047l01178n0257N62582
$$ 544642 579307 625531 301111 343242 1116159 598752 675259 764306 463128 412871 975453
14742I75453j97704j42419J60989j58169L18300l12087j9826p7427R8148o3070
$$ 975453 777749 635330 796319 638150 956450 644363 624537 547110 645258 582188
14732E82188R2922J41882j96573Q6474J91694j59155M00411m76811n1789K30521
$$ 582188 675110 816992 620419 706893 898587 739432 1139843 663032 611243 841764
14722H41764L48872E33248L58259j1181k18099k57292M21773L5141j6452j41234
$$ 841764 1190636 533248 891507 880326 662227 404935 826708 861849 845397 704163
14712G04163j65618J0838M00979k27558K0915k4409j56522O13265j92894k95387
$$ 704163 538545 549383 950362 722804 743719 719310 562788 1176053 983159 687772
14702F87772K61169l38963K50153J19509l38801j3812M81362m73362J80759J29692
$$ 687772 948941 609978 860131 979640 640839 627027 1108389 635027 815786 945478
14692I45478j41269j00735P7270j37867M15368l74942K97277M21980F86123O43079
$$ 945478 804209 703474 780744 642877 1058245 683303 980580 1402560 686123 1329202
14682A329202k34738o4540m35301l355K58205Q8512O0409R7139K89930j95980
$$ 1329202 1094464 1029924 594623 591268 849473 937985 998394 1095533 1385463 1189483
14672A189483p6472J58287P8483n02093M14776m70312l25376J94962O21207l65044
$$ 1189483 1113011 1271298 1349781 847688 1262464 792152 466776 661738 1282945 917901
14662I17901l6915R1295R2303J91522l87925L4769L38334k98597L82332j59577
$$ 917901 880986 972281 1064584 1256106 868181 902950 1241284 942687 1325019 1165442
14652A165442n153m6145K46714j19238M3768J46795l26969M14936l90883J68364
$$ 1165442 1160289 1114144 1360858 1241620 1285388 1432183 1105214 1520150 1129267 1297631
14642A297631O3597k71124L3459M4681K53952m12068O8909J37708N03453m02568
$$ 1297631 1361228 1090104 1123563 1168244 1422196 1010128 1079037 1216745 1720198 1317630
14632A317630j84604J06448j17239J80201J08425L0084l62169K88915j69219j08062
$$ 1317630 1133026 1239474 1122235 1302436 1410861 1440945 1078776 1367691 1198472 1090410
14622A090410M91415l19748L17173n00750P56441q05401M87913k1037o4487O4131
$$ 1090410 1581825 1262077 1579250 1078500 1834941 1029540 1517453 1496416 1431929 1496060
14612A496060J60372R0492k05204k1484p8316J80174L79295m07249j34187J26518
$$ 1496060 1656432 1746924 1541720 1520236 1441920 1622094 2001389 1594140 1459953 1586471
14602A586471J95188l7339l748k79286R0679K2292K13229J96212n08896J11513
$$ 1586471 1781659 1744320 1740572 1461286 1551965 1574257 1787486 1983698 1474802 1586315
14592A586315K45030N0820k05929N9064k657o9001J17206n8519M06926J40213
$$ 1586315 1831345 1882165 1676236 1735300 1732643 1663642 1780848 1722329 2129255 2269468
14582B269468l74532M6420k86585L32453J34245k66042L60746j38685k00097J84041
$$ 2269468 1894936 1941356 1654771 1987224 2121469 1855427 2216173 2077488 1877391 2061432
14572B061432O8331j85207m9339K45766K66879k28797k2320K29189L57234k35544
$$ 2061432 2129763 1944556 1895217 2140983 2407862 2179065 2156745 2385934 2743168 2507624
14562B507624m7107K26498L2579R2957K41357j77875K78282J55040N53110L1292
$$ 2507624 2460517 2687015 2719594 2812551 3053908 2876033 3154315 3309355 3862465 3893757
14552C893757L50232M85440J110671K097229M318333Q262393J5159160O251545
$$ 3893757 4243989 4729429 5840100 7937329 12255662 20518055 35677215 41928760
14544D1928760j5917741A1253922n605365k041207q76211j52471k65450k03413
$$ 41928760 26011019 11253922 5648557 3607350 2731139 2578668 2313218 2109805
14536B109805j9072l1017J25698l13169J95339Q0309l33672M37175J74449l8014
$$ 2109805 2090733 2059716 2185414 1872245 2067584 2147893 1814221 2251396 2425845 2387831
14526B387831N2760N737N5154j98864J09851J22493M5259j06119J59905p2441
$$ 2387831 2440591 2446328 2501482 2302618 2412469 2534962 2580221 2474102 2634007 2561566
14516B561566M03683k16547l42533N03894L4695k12465K3695K26137j63000L02338
$$ 2561566 2965249 2748702 2406169 2910063 2944758 2732293 2755988 2982125 2819125 3121463
14506C121463K53266m74281M3330J89045j55788q8967N82083m70429K69766J44136
$$ 3121463 3374729 2900448 2943778 3132823 2977035 2888068 3470151 2999722 3269488 3413624
14496C413624m02198P6797M22140k446k16031M0038K34138p0658q3885J79329
$$ 3413624 3011426 3088223 3510363 3507917 3291886 3331924 3566062 3495404 3411519 3590848
14486C590848J0033J29301k32670J45380J90176m3573J95913j91787j58707K35310
$$ 3590848 3600881 3730182 3497512 3642892 3833068 3789495 3985408 3793621 3634914 3870224
14476C870224K90750k09590J25983j38524o7062L54860J06568n2331k05994M40154
$$ 3870224 4160974 3951384 4077367 3938843 3871781 4226641 4333209 4280878 4074884 4515038
14466D515038l894J87199j75397j81788K08915K12000r3593O10330o09053K90473
$$ 4515038 4511144 4698343 4522946 4341158 4550073 4762073 4668480 5278810 4669757 4960230
14456D960230k5178M53422O1907q7286j96703L7771J85816J72726O6179n2633
$$ 4960230 4935052 5388474 5450381 5363095 5166392 5204163 5389979 5562705 5628884 5576251
14446E576251J55035O5306J97599m8234N9013N5369r887L43559j7777J78089k11410
$$ 5576251 5731286 5796592 5994191 5945957 6004970 6060339 6050452 6394011 6376234 6554323 6342913
14435F342913M37074m58990N79309j84626L19505N0774L9750L97536k73283J12826
$$ 6342913 6779987 6320997 6900306 6715680 7035185 7085959 7125709 7523245 7249962 7362788
14425G362788k68390P72870j37684J6566J44710J68947k17035L12879K11859K98176
$$ 7362788 7094398 7867268 7729584 7746150 7890860 8059807 7842772 8155651 8367510 8665686
14415H665686Q5569J26254o1435L95240k24923K23590M00273k90112K78578J09251
$$ 8665686 8751255 8877509 8816074 9211314 8986391 9209981 9610254 9320142 9598720 9707971
14405I707971K72458J81549O6805N13396l69205L05804Q2461M73589J6190K18674
$$ 9707971 9980429 10161978 10228783 10742179 10372974 10678778 10761239 11234828 11251018 11469692
14395A1469692j39605N40455J51791J59416n8072P46518K34485O9934K24050K10164
$$ 11469692 11330087 11870542 12022333 12181749 12123677 12870195 13104680 13174614 13398664 13608828
14385A3608828K81468N81984K70344k66536L25855K91625M87164q6084P04810
$$ 13608828 13890296 14472280 14742624 14476088 14801943 15093568 15580732 15494648 16199458
14376A6199458n3729M51233K26620L65679N14824K32937K60165N46169K42394
$$ 16199458 16145729 16596962 16823582 17189261 17704085 17937022 18197187 18743356 18985750
14367A8985750L67780K18721M26846M13329Q14249K18073N38393J07513N95387
$$ 18985750 19353530 19572251 19999097 20412426 21226675 21444748 21983141 22090654 22686041
14358B2686041M02000R53457M18639N13911M86224R07804P70471L60645P22289
$$ 22686041 23088041 24041498 24460137 24974048 25460272 26368076 27138547 27499192 28221481
14349B8221481N58805P02528M54725Q58058R64663J075763L49710J312038Q75516
$$ 28221481 28780286 29482814 29937539 30795597 31760260 32836023 33185733 34497771 35373287
14340C5373287O82015R00513J005720J100646J339335J341069J117486J201360
$$ 35373287 36055302 36955815 37961535 39062181 40401516 41742585 42860071 44061431
14332D4061431J319527J104508J884375J125252J790405J783702J663482J801639
$$ 44061431 45380958 46485466 48369841 49495093 51285498 53069200 54732682 56534321
14324E6534321J950405K002415J913821J846045K707334K274956K663862K227033
$$ 56534321 58484726 60487141 62400962 64247007 66954341 69229297 71893159 74120192
14316G4120192K847266K924289L023330L197921L860675L263292L600943M361046
$$ 74120192 76967458 79891747 82915077 86112998 89973673 93236965 96837908 101198954
14308A01198954M224472M322352M692180N224100N111533N661804O108653O288395
$$ 101198954 105423426 109745778 114437958 119662058 124773591 130435395 136544048 142832443
14300A42832443O711172P109112P337923P892471Q650868Q870279R467069R751593
$$ 142832443 149543615 156652727 163990650 171883121 180533989 189404268 198871337 208622930
14292B08622930J0282974J1104005J1650823J2208957J2355626J3450917J3444664
$$ 208622930 218905904 230009909 241660732 253869689 266225315 279676232 293120896
14285B93120896J4142908J4165846J4626984J4945310J4487982J4672151J3823739
$$ 293120896 307263804 321429650 336056634 351001944 365489926 380162077 393985816
14278C93985816J3107657J2195615J1408932R905644Q313715N252077J376706
$$ 393985816 407093473 419289088 430698020 440603664 448917379 454169456 455546162
14271D55546162j40087p54399Q25756l5489m385771o053846q130021j0098058
$$ 455546162 455406075 454651676 455477432 455441943 451056172 445002326 436872305 426774247
14263D26774247j1259155j2216469j2973509j3496586j4993478j4999641j5523162
$$ 426774247 415515092 403298623 390325114 376828528 361835050 346835409 331312247
14256C31312247j4710132j4237544j3488034j3949675j3252710j2622608j2067706
$$ 331312247 316602115 302364571 288876537 274926862 261674152 249051544 236983838
14249B36983838j1226530j1170604j0460306r436192r259992q637420q089314
$$ 236983838 225757308 214586704 204126398 194690206 185430214 176792794 168703480
14242A68703480q070996p525270o831138o426090n830833n917225n613299n189317
$$ 168703480 160632484 153107214 146276076 139849986 134019153 128101928 122488629 117299312
14234A17299312m994517m973227l759737l869559l717705m256914l388742l449248
$$ 117299312 112304795 107331568 103571831 99702272 95984567 91727653 88338911 84889663
14226H4889663l320302l186087k548620k823352k665487k451851k233037k102949
$$ 84889663 81569361 78383274 75834654 73011302 70345815 67893964 65660927 63557978
14218F3557978k059969j914317k430530j384481j533863j329202k196247j600529
$$ 63557978 61498009 59583692 57153162 55768681 54234818 52905616 50709369 49108840
14210D9108840j263634j643462r16666j009991r19562j355747j464958j455445
$$ 49108840 47845206 46201744 45285078 44275087 43355525 41999778 40534820 39079375
14202C9079375j158782o68652n24610r00551j379829j024180o03478q50732o56257
$$ 39079375 37920593 37251941 36727331 35826780 34446951 33422771 32819293 31968561 31312304
14193C1312304p16328o90316n32385p64930j142051k31809r07109m67211q01106
$$ 31312304 30595976 29905660 29373275 28608345 27466294 27234485 26327376 25860165 25059059
14184B5059059m41625n95239l47561o90219n86928j54021n42278p42507m19274
$$ 25059059 24617434 24022195 23674634 22984415 22397487 22243466 21701188 20958681 20539407
14175B0539407j12895n02608n5665o55109m63136n17417k03797k90436k58104
$$ 20539407 20426512 19923904 19868239 19213130 18749994 18232577 18028780 17738344 17480240
14166A7480240n45355n23810J00891o37558J50727l09875n39005O3978m48030
$$ 17480240 16934885 16411075 16511966 15874408 16025135 15715260 15176255 15240233 14792203
14157A4792203m57165J17723m06898n96225K5609M5122m51113j89789k03638j32811
$$ 14792203 14335038 14452761 14045863 13449638 13475247 13520369 13069256 12879467 12675829 12543018
14147A2543018k10908m08363k41607q7917J8451k99282k02546J63387j85139m40407
$$ 12543018 12332110 11923747 11682140 11594223 11612674 11313392 11110846 11274233 11089094 10648687
14137A0648687N1358k13989j91145p35404J08603j7274k57456L33090l30077K9439
$$ 10648687 10700045 10486056 10294911 9559507 9668110 9650836 9393380 9726470 9396393 9425832
14127I425832m22023K43755l69885j83332J33813j09994l74388r0534r5582J65288
$$ 9425832 9003809 9247564 8877679 8694347 8828160 8718166 8343778 8253244 8157662 8322950
14117H322950k00935R6572l67233k14710k66430N0731k7794L5399k09876K40243
$$ 8322950 8122015 8218587 7851354 7636644 7370214 7420945 7393151 7428550 7218674 7458917
14107G458917k21997r9889j59687k51954J24752o86891K96588j13537K24654k94371
$$ 7458917 7236920 7137031 6977344 6725390 6850142 6163251 6459839 6346302 6570956 6276585
14097F276585L69041k06624m52911L99499m83108k1300p6285M9431j98479n2028
$$ 6276585 6645626 6439002 5986091 6385590 5902482 5881182 5804897 5854328 5655849 5603821
14087E603821p4961P3714j00497K56401m03477j5160M3481j35262j06669L35624
$$ 5603821 5528860 5602574 5502077 5758478 5355001 5339841 5383322 5248060 5141391 5477015
14077E477015j76366n38134J46028L50726l43496J5355K9644j59015k0151k78578
$$ 5477015 5300649 4762515 4908543 5259269 4915773 4931128 4960772 4801757 4781606 4503028
14067D503028L5495l22089O45840o45158L62113J9993R9798k60624K78406j25255
$$ 4503028 4538523 4216434 4862274 4217116 4579229 4599222 4699020 4438396 4716802 4591547
14057D591547j60623j70661j46809j28023K45728N878m57034M32037p11541m3009
$$ 4591547 4430924 4260263 4113454 3985431 4231159 4237037 3780003 4212040 3500499 3457490
14047C457490J96433Q2693j39975J52565J4236k80307O2146l84913J74292N6505
$$ 3457490 3653923 3736616 3596641 3749206 3763442 3483135 3545281 3160368 3334660 3391165
14037C391165P3919k81593L88442j32974P2698j75223R6038p8029K78323l82357
$$ 3391165 3465084 3183491 3571933 3438959 3511657 3336434 3432472 3354443 3632766 3250409
14027C250409j01884j63384q7594k7821L00063l83403M23317o26911J57209O50105
$$ 3250409 3148525 2985141 2897547 2869726 3169789 2786386 3209703 2582792 2740001 3390106
14017C390106n44486o9313k24402R584J28536k00102p6674J38789J21198m956
$$ 3390106 2845620 2776307 2551905 2561489 2690025 2489923 2413249 2552038 2673236 2668280
14007B668280m52815K43378J91331p7089m54229L27808J75214n66610K74540r0506
$$ 2668280 2215465 2458843 2650174 2573085 2118856 2446664 2621878 2055268 2329808 2239302
13997B239302m9682j55913P8704M33105k9256k41118O35312j3402J450307L230808
$$ 2239302 2189620 2033707 2112411 2545516 2516260 2275142 2910454 2897052 4347359 7578167
13987G578167O584603J5779448J0994637j1152438j4794897n591267k817044j064266
$$ 7578167 14162770 29942218 40936855 29784417 14989520 9398253 6581209 5516943
13979E516943q56200n46643l47384l49397j31473j8247j59424k62035J77264j80494
$$ 5516943 4660743 4114100 3766716 3417319 3285846 3267599 3108175 2846140 3023404 2842910
13969B842910k72848K15295k57981l69848J97373Q2366j45965J42369j588k07189
$$ 2842910 2570062 2785357 2527376 2157528 2354901 2437267 2291302 2433671 2432083 2224894
13959B224894R9740J3175l3967l14470o8669L31304j14307o8530j0784l3034K44808
$$ 2224894 2324634 2337809 2303842 1989372 1920703 2252007 2137700 2069170 2058386 2025352 2270160
13948B270160l04169L42346m39595J85456l62309K66994J47407k14714o3728l3179
$$ 2270160 1965991 2308337 1868742 2054198 1691889 1958883 2106290 1891576 1827848 1794669
13938A794669M69901m91298K08243l43111K9796M5990l412q6176k04809K30365
$$ 1794669 2264570 1773272 1981515 1638404 1668200 1714190 1710778 1624602 1419793 1650158
13928A650158j06427O6513J34258j54766N13989l74920j73179J96729K08106k39994
$$ 1650158 1543731 1610244 1744502 1589736 2103725 1728805 1555626 1752355 1960461 1720467
13918A720467l17949K91477J11054j90102p2109j16727P7921m0804J67800j46951
$$ 1720467 1402518 1693995 1805049 1614947 1542838 1426111 1504032 1463228 1631028 1484077
13908A484077k1082J35821j46784m5937J38174N2484J79391j84301l06688N4443
$$ 1484077 1462995 1598816 1452032 1406095 1544269 1596753 1776144 1591843 1285155 1339598
13898A339598p2455K27184k1302k72121J05619J69458J1348J3059r3681q1568
$$ 1339598 1267143 1494327 1473025 1200904 1306523 1475981 1487329 1500388 1406707 1325139
13888A325139l4269M28925l73888m0412l4707J77874j88416K10646n05346q7329
$$ 1325139 1290870 1719795 1345907 1305495 1270788 1448662 1260246 1470892 965546 878217
13878H78217K12104L0623J72170j36477J30475l27635J74440P9481K020P0885
$$ 878217 1090321 1120944 1293114 1156637 1287112 959477 1133917 1213398 1215418 1286303
13868A286303n34085K35414K88721L5234k08883J32818J26077l6038j62634j6861
$$ 1286303 752218 987632 1276353 1311587 1102704 1235522 1361599 1325561 1162927 1146066
13858A146066K90893K0928j69542k12072L01828K2132l54466K06411j5620k30864
$$ 1146066 1436959 1457887 1288345 1076273 1378101 1400233 1045767 1252178 1236558 1005694
13848A005694R6996K00747J77844n54602O8835l1161j37094J79180j03110K12183
$$ 1005694 1102690 1303437 1481281 926679 995514 964353 827259 1006439 903329 1115512
13838A115512J0539m5079K4341k37492K47660O094q5380l07387L33213Q2836j90279
$$ 1115512 1126051 1080972 1105313 867821 1115481 1121575 1036195 728808 1062021 1144857 954578
13827I54578k9703J13429n9842r6893k49509L61451k85573L43374n2667L5733
$$ 954578 924875 1038304 978462 881569 632060 993511 707938 1051312 998645 1034378
13817A034378k62370J32154J34204N1705R8367l99329L04287Q5091j35130j27375
$$ 1034378 772008 904162 1038366 1090071 1188438 789109 1093396 1178487 1043357 915982
13807I15982n8416k00045M09506j95193O8704P6088n5194k84599M23665K01026
$$ 915982 857566 657521 1067027 871834 940538 1016626 961432 676833 1100498 1301524
13797A301524m77034L11476p0440D64419N21671j26768j26672n9441K14886J68921
$$ 1301524 824490 1135966 1065526 464419 986090 859322 732650 673209 888095 1057016
13787A057016E24307K46742K52660j81301O9535k888k41076J67911K5403L15502
$$ 1057016 524307 771049 1023709 842408 911943 909055 667979 835890 861293 1176795
13777A176795D33253M70417j36150m5109Q476J62494J68693k86314K25521D58816
$$ 1176795 433253 903670 767520 722411 730887 893381 1062074 775760 1001281 458816
13766F80538K3013L89787j93137l00684p0347K39118j27329m3362k52003J61707
$$ 680538 703551 1093338 900201 599517 529170 768288 640959 597597 345594 507301
13756E07301L64362j1899k74170J45685K58894l68958L37711j82238P188C89327
$$ 507301 871663 859764 585594 731279 990173 621215 958926 776688 783876 389327
13745F29623n7730L28895l29910L40621J91930j88659k69034j521K61899q5135
$$ 629623 571893 900788 570878 911499 1103429 914770 645736 644215 906114 820979
13735H20979k57956J71276j68705j14489L81288j51944l0517J26890r7629Q1958
$$ 820979 563023 734299 565594 451105 832393 680449 649932 776822 679193 761151
13725G61151J8548j88115J53465k2101j32594l4924P8945J97118m02617L63675
$$ 761151 779699 591584 745049 722948 590354 555430 634375 831493 428876 792551
13715G92551k2398C55066J77686j8141p4493r5430K04846k10887K6674J13863
$$ 792551 770153 355066 532752 514611 440118 344688 549534 338647 365321 479184
13705D79184P2390M501j50934L00608n1198k74344N4907J95866K81660l10737
$$ 479184 551574 556075 405141 705749 654551 380207 435114 630980 912640 601903
13695F01903K52091C42904J87375J98054C39574j40800J27261K10920r5109J57479
$$ 601903 853994 342904 530279 728333 339574 198774 326035 536955 441846 599325
13685E99325j15039j1163J35964k2281j52188J88624M4752L38186D82607J22161
$$ 599325 484286 473123 609087 586806 434618 623242 667994 1006180 482607 604768
13675F04768K03666r0972J12992k13490C05104K06222k8274J0111L2777l030j84049
$$ 604768 808434 717462 830454 616964 305104 511326 483052 493163 525940 522910 338861
13664C38861J6019j75542J92039J4798J55905m3946M2574J59175B74681L98083
$$ 338861 354880 179338 371377 386175 542080 498134 540708 699883 274681 672764
13654F72764k24976J76118j31427K81889C59409J12564K0944m1550R400o2873
$$ 672764 447788 623906 492479 774368 359409 471973 492917 451367 460767 397894
13644C97894l7460n6089L35691D0991O19502J08961k02560K4214A56015L97535
$$ 397894 360434 304345 640036 40991 660493 769454 566894 591108 156015 553550
13634E53550J0364B05366N5201M32385A94072J24863j22159K18260j20456K29062
$$ 553550 563914 205366 260567 692952 194072 318935 196776 415036 294580 523642
13624E23642A19731N51246A24191K33987q6066J80109L7849k08700J47064J39625
$$ 523642 119731 670977 124191 358178 272112 452221 490070 281370 428434 568059
13614E68059k16742K57418k87841O820L7989K7822j76083J44328o3208L0522h4369
$$ 568059 351317 608735 320894 327714 365703 393525 217442 361770 298562 329084 -84369
13602C76209J7366A13529L96696L9869B43104J25626L8125L1161q1106M27788
$$ 376209 393575 113529 510225 550094 243104 368730 406855 438016 356910 784698
13592G84698j39963B29619n4072P26987l44488K949J48225k72510B09973M1714
$$ 784698 644735 229619 175547 902534 558046 560995 709220 436710 209973 251687
13582B51687J8813J45561I9473N17059k77946P7007J00140B34259K34341A85400
$$ 251687 270500 416061 99473 616532 338586 415593 515733 234259 468600 185400
13571A10752k7460L15589j3581R8499j66738m4326K64801B16018m0360J66366
$$ 110752 83292 398881 385300 483799 317061 272735 537536 216018 175658 342024
13561C42024K13139A70507J48325K0616R0022A58524K35847k8986J35747A87976
$$ 342024 555163 170507 318832 339448 429470 158524 394371 365385 501132 187976
13550D44549R5735A91371K35136j31304j14194E1810M05471D1028K17628A14996
$$ 444549 540284 191371 426507 295203 181009 51810 457281 41028 258656 114996
13539D71122A91955l4536k654Q4864r840R6325J62869k34333K76813E5885J77464
$$ 471122 191955 157419 154765 239629 229789 326114 488983 254650 531463 55885 233349
13528B33349L08287k03475K43686k02660j30821j03640K22081f7813B90727j14805
$$ 233349 541636 338161 581847 379187 248366 144726 366807 -67813 290727 175922
13518A75922M719l2947K70232H4005J72370C5208J12241J43665C6587J00078K27908
$$ 175922 180641 147694 417926 84005 256375 35208 147449 291114 36587 136665 364573
13507C64573J1514j58063N00678C28623A00127K68315q7999J50660J17757K72905
$$ 364573 376087 218024 718702 328623 100127 368442 280443 431103 548860 821765
13497H21765B67608J52087H7996L19236K07089B72563L90047B82338J59421j78315
$$ 821765 267608 419695 87996 407232 614321 272563 662610 282338 441759 263444
13487B63444K87113j23916F2241M18149J45886B91933k2663J07894a7185C95292
$$ 263444 550557 426641 62241 480390 626276 291933 269270 377164 -17185 395292
13476A04687L86900A86263R9416M9832J03189J1262j80408b075C6097J16605L09735
$$ 104687 491587 186263 285679 335511 438700 449962 269554 -2075 36097 152702 462437
13465D62437j60196G2752L55216Q9536j47385o8929K6113A17270M06816B25751
$$ 462437 302241 72752 427968 517504 370119 301190 327303 117270 524086 225751
13454A90363J83855k7229A65935J17434k088J10615b1266E41861k32437P7137
$$ 190363 374218 346989 165935 283369 281281 391896 -21266 541861 309424 386561
13444C86561A26513l8734N3712M09294a23543B31734E4445L08787A14943L56998
$$ 386561 126513 87779 141491 550785 -123543 231734 54445 363232 114943 471941
13434D71941n5555K0658l2578j35368Q4584j46430Q2226Q8351R7443B0508a0627
$$ 471941 416386 437044 404466 269098 353682 207252 289478 377829 475272 20508 -10627
13422C04693J68750j22578o9698l8259L8754j27591f9855d790B24006r1782K65357
$$ 304693 473443 350865 281167 242908 281662 154071 -69855 -4790 224006 132224 397581
13411C97581j31969L4175j08101e352B66969j4918J09478g5818B45318R1487j7172
$$ 397581 265612 299787 191686 -5352 266969 252051 361529 -75818 245318 336805 319633
13400C19633A05606K87678p9675k4252j14476q7432P4534R2632j14717J68802
$$ 319633 105606 393284 313609 289357 174881 87449 161983 254615 139898 308700
13390C08700E2599J61569r7642O0701L87229k56590j06037M1125A14840K79282
$$ 308700 52599 214168 116526 177227 564456 307866 201829 242954 114840 394122
13380C94122d9973D33800P4072A89896m7179n2484Q5427l3930K68339m7075J187
$$ 394122 -49973 433800 507872 189896 142717 90233 175660 141730 410069 362994 364181
13369C64181r0066l4378m8842L34252k58891e611D65027a01730C54583F5251K65234
$$ 364181 274115 239737 190895 525147 266256 -5611 465027 -101730 354583 65251 330485
13358C30485A64158F7837P1864p029R6154B0030J825N03751k03813K72592A96536
$$ 330485 164158 67837 139701 132672 228826 20030 21855 525606 321793 594385 196536
13346C8693J99316J6952I7545L37745k4518L73824l54881D7557R5278M409K6079
$$ 38693 238009 254961 97545 435290 410772 784596 429715 47557 142835 147244 173323
13335A73323L2114j9801Q4434L27153E3547K41684j45524j9742J04426J39366
$$ 173323 205437 185636 270070 597223 53547 295231 149707 129965 234391 373757
13325C73757E918L90833A68152d6861A97104K51756K53603C30301j55103N8274
$$ 373757 5918 396751 168152 -46861 197104 448860 702463 330301 175198 233472
13315B33472n8542p0800N3034m223N7150m5231P2092J1577n4694C7828K2893P130
$$ 233472 174930 104130 157164 152941 210091 164860 236952 248529 193835 37828 60721 67851
13303F7851B9495J5923J04366L0022J41978A30625m9949J97982b633I3045L6100
$$ 67851 29495 45418 149784 179806 321784 130625 80676 278658 -2633 93045 129145
13292A29145m5028O3768P517A8807a8819A41840L57222j56193A45772M7469o7489
$$ 129145 84117 147885 155402 18807 -18819 141840 499062 342869 145772 193241 125752
13281A25752I98a12921D47184A1409a60990D8865K62437b78911G3825M36491e1360
$$ 125752 998 -112921 447184 11409 -160990 48865 311302 -278911 73825 510316 -51360
13269D40489r2625b288C06322f0652H9185M9995a83894B00248A6197a21281A56360
$$ 440489 347864 -2288 306322 -60652 89185 139180 -183894 200248 16197 -121281 156360
13257f7563B53559a15155C21885F7620J18493a10202L7949A48059J33332K7708
$$ -67563 253559 -115155 321885 67620 186113 -110202 -72253 148059 281391 309099
13247C09099A44654a0941A61420J73692A51374L36469C6427e4120A67588R0406
$$ 309099 144654 -10941 161420 335112 151374 487843 36427 -54120 167588 257994
13237B57994j12926K03947l0726j12345J5524C5419J97252q0617F5908A8418J15420
$$ 257994 145068 349015 318289 205944 221468 35419 232671 152054 65908 18418 133838
13226A33838E816a20318A80012a04094D80819A31422J12093a5099D71057B7028
$$ 133838 5816 -120318 180012 -104094 480819 131422 243515 -15099 471057 27028
13215F6118g7606J4532C35262A64195j9807A2381a73486G2187J10104H0805K01399
$$ 66118 -77606 -63074 335262 164195 144388 12381 -173486 72187 182291 80805 282204
13204B82204p8608J80863j28585B2556b83513A91419a35362B03849D5196a45630
$$ 282204 203596 384459 255874 22556 -283513 191419 -135362 203849 45196 -145630
13193C25662i5693A31511M4762a35047E7901e5953A83523d4612J0012C30751b06421
$$ 325662 -95693 131511 176273 -135047 57901 -55953 183523 -44612 -34600 330751 -206421
13181A9533L02582A28731K45084A01039L1038E3130K14090E5488M30481B20678
$$ 19533 322115 128731 373815 101039 132077 53130 267220 55488 485969 220678
13170A94934G120J07919j1728K39028A00051j6532a34625B27820f6369E66621
$$ 194934 7120 115039 103311 342339 100051 83519 -134625 227820 -66369 566621
13159B22998A08766c7717I3447e8307B9390K09900N0427A6658J67909R413L6693
$$ 222998 108766 -37717 93447 -58307 29390 239290 289717 16658 184567 193980 230673
13148B30673J5908C1508N9322d5641C07214q2422G6999Q9273K5688d3472C3017
$$ 230673 246581 31508 90830 -45641 307214 224792 76999 166272 191960 -43472 33017
13136a07153B6441K1462K58935A23147L950K08011A47392C097a77174H9346J14692
$$ -107153 26441 47903 306838 123147 127097 335108 147392 3097 -177174 89346 204038
13125B04038J8705I6337J81908P6726r5943h397B43385j10647h4691A24833O1970
$$ 204038 222743 96337 278245 354971 259028 -8397 243385 132738 -84691 124833 186803
13114A86803L3813b7999n9149C63781j37479b1669C04145j38576G3627a17851
$$ 186803 220616 -27999 -87148 363781 226302 -21669 304145 165569 73627 -117851
13103B04597h2648D04678A50069O1573I3071K80947j61939l9918c39847A84470
$$ 204597 -82648 404678 150069 211642 93071 374018 212079 172161 -339847 184470
13092b73698A29697J5981J61928c72866a26987k2253c2494B69161a56793H9316
$$ -273698 129697 145678 307606 -372866 -126987 -149240 -32494 269161 -156793 89316
13081A21577K4962a0697F526O2780K23018e6268A23546c8407I5040a94866A81253
$$ 121577 146539 -10697 6526 69306 292324 -56268 123546 -38407 95040 -194866 181253
13069a4096C87227j17378I9834J38107K4159J7597i3494r498c8680C05406i6886
$$ -14096 387227 269849 99834 237941 262100 279697 -93494 -102992 -38680 305406 -96886
13057B15131l6658d6422l4881B15923G2931a59116J9454E296R6217b2360l2953
$$ 215131 178473 -46422 -81303 215923 72931 -159116 -139662 5296 101513 -22360 -55313
13046e5313F5638J80616C8574J71635a72112h967B12332d5177l4826B35562B6833
$$ -55313 65638 246254 38574 210209 -172112 -8967 212332 -45177 -80003 235562 26833
13034A15094b16659A00999c9273B01881b04269B86506J79925B27353b33045A31005
$$ 115094 -216659 100999 -39273 201881 -204269 286506 466431 227353 -233045 131005
13023B12827L5421O2257a61550D02513J30175A20851J07256F4498B8235a4667
$$ 212827 248248 310505 -161550 402513 532688 120851 228107 64498 28235 -14667
13012a27080o8930I8265P8601m241q4492j9546K86993M1484e5565A65637L46842
$$ -127080 -196010 98265 176866 172625 88133 68587 355580 397064 -55565 165637 512479
13001E12479k14738K33307B39269b3864B20249D6446a82816A33040K03191A24749
$$ 512479 297741 531048 239269 -23864 220249 46446 -182816 133040 336231 124749
12990D29938j71934A6838m343J71777F030J74480J34232e6765A28149h895j24370
$$ 429938 258004 16838 12495 184272 6030 180510 314742 -56765 128149 -8895 -133265
12979a33265A70044a39237o9543B58105a95938B93386a9271j94160I2083J24459
$$ -133265 170044 -139237 -208780 258105 -195938 293386 -19271 -213431 92083 216542
12969B16542j02857b50499A48753r553J1166n7190P9380P3931i9590C8324J5726
$$ 216542 113685 -250499 148753 139200 150366 93176 172556 246487 -99590 38324 54050
12958E4050j876R674b34471B52376a3133k4525B7069L0037a1808k9597A02610
$$ 54050 52174 61848 -234471 252376 -13133 -37658 27069 57106 -11808 -41405 102610
12946A28008c2998A2528N9499B345N2062b733D71342A95930c55l3475q3331C19556
$$ 128008 -32998 12528 72027 2345 54407 -2733 471342 195930 -355 -33830 -117161 319556
12933B30147o6638J72688j27556I8700L11072B01129p2098A614c7141j9563A07509
$$ 230147 163509 336197 208641 98700 409772 201129 129031 1614 -37141 -56704 107509
12921B63475b58329K1422A83017b82780D5822b99801A50086Q3298a57312B38862
$$ 263475 -258329 -236907 183017 -282780 45822 -299801 150086 233384 -157312 238862
12910B13250I2654L08497a3138k6139A14306a5190A76756D0118L43574j37970
$$ 213250 92654 401151 -13138 -39277 114306 -15190 176756 40118 383692 245722
12900B45722K9599j16111n943a9326j56030J1655C64765N0958G7388a18870B29045
$$ 245722 275321 159210 153267 -19326 -175356 -163701 364765 415723 77388 -118870 229045
12888E8690j7780K5811J86709J1340o0905K03047a64728J403B88485A02149N3967
$$ 58690 40910 66721 253430 264770 203865 406912 -164728 -163325 288485 102149 156116
12877A56116F0951J04550a15619J8111A8199d3840A86432d9762c53k59687C42989
$$ 156116 60951 165501 -115619 -97508 18199 -43840 186432 -49762 -353 -260040 342989
12865b35326o5091h8494A64873a735G7681L479P8041n0865J9662C5711f5553J5187
$$ -235326 -300417 -88494 164873 -1735 77681 81160 159201 108336 127998 35711 -65553 -50366
12853e0366k10898A32281A1298f5941I5678b41679h2082A58414a74475H7855L9716
$$ -50366 -261264 132281 11298 -65941 95678 -241679 -82082 158414 -174475 87855 127571
12842A27571a03457C18866j45608P8032I6667b8151H3088a28215N7667B59361
$$ 127571 -103457 318866 173258 251290 96667 -28151 83088 -128215 -70548 259361
12831A09366m5637a82378A63928C9834a22162F3641B2168g0345K7266h796A09841
$$ 109366 63729 -182378 163928 39834 -122162 63641 22168 -70345 -43079 -8796 109841
12819i3697m0147d5866F9284a73029B77006C9111e8364C38863q6016a16016j8927
$$ -93697 -133844 -45866 69284 -173029 277006 39111 -58364 338863 252847 -116016 -134943
12808a34943I4499K14766C910a9409j07825p6684L1821B25510E6210M2891b64153
$$ -134943 94499 309265 3910 -19409 -127234 -203918 -172097 225510 56210 99101 -264153
12796d9372M087j0807H4798K6598C3720L8552b09551A67506m7001O8554b1239
$$ -49372 -45285 -56092 84798 111396 33720 72272 -209551 167506 120505 189059 -21239
12784b63262a01218j36239B04284d3657p4995e4028k95363A00326i4662H5197
$$ -263262 -101218 -237457 204284 -43657 -118652 -54028 -349391 100326 -94662 85197
12773B20626o5499a20032J4631q6448A72193a28178B4420g3958j55022i6980j7370
$$ 220626 155127 -120032 -105401 -191849 172193 -128178 24420 -73958 -228980 -96980 -114350
12762a14350K930m186M1232e2m7088a2511o4732A44351R4498a60224G2642e1927
$$ -114350 -111420 -115606 -74374 -52 -47140 -12511 -77243 144351 238849 -160224 72642 -51927
12749A74467G5389R2112b54674a00740I9582M9269e6448j8620A68340b60080d3335
$$ 174467 75389 167501 -254674 -100740 99582 148851 -56448 -75068 168340 -260080 -43335
12737B96382J20034D1237M45750b44178B00790C1877K71668b19960A0459a77692
$$ 296382 416416 41237 486987 -244178 200790 31877 303545 -219960 10459 -177692
12726f3770k06437e9856E9231N1081k9825J18251m7652b96218D8583c6768k10110
$$ -63770 -270207 -59856 59231 110312 80487 198738 151086 -296218 48583 -36768 -246878
12715b46878A34571c4029A18841a00136B28336n322J07038L7336b64358F9886
$$ -246878 134571 -34029 118841 -100136 228336 223014 330052 367388 -264358 69886
12704H1282J21767j0245I4971J13745B0053a96773P354e0426B8808R2509B3197
$$ 81282 203049 192804 94971 208716 20053 -196773 -189419 -50426 28808 121317 23197
12692A69477a00622n79K2570m8084d4798j2525A5614J4348Q2585j7258i490B50868
$$ 169477 -100622 -101201 -78631 -126715 -44798 -57323 15614 29962 112547 95289 -9490 250868
12679a81778C1148O3953k1659g238B94333J54528I5854l3523L1892J24671A04948
$$ -181778 31148 95101 73442 -7238 294333 448861 95854 62331 94223 218894 104948
12667C8182b5004F5538J4828B7883a20046j2469j12151G5127J4407l017J41535
$$ 38182 -25004 65538 80366 27883 -120046 -132515 -244666 75127 89534 86517 228052
12656B28052N8437d2813B85275O1854A64222J06043r211i6222C20752J99337A98494
$$ 228052 286489 -42813 285275 347129 164222 270265 261054 -96222 320752 520089 198494
12644B5161j0843f0573B92979a49205C04389a15328J9519F3786K7553J53897B7857
$$ 25161 14318 -60573 292979 -149205 304389 -115328 -95809 63786 91339 245236 27857
12632D32042A75790F4746f3140B68997j01593K39193k00428b8226a0825C86681
$$ 432042 175790 64746 -63140 268997 167404 406597 206169 -28226 -10825 386681
12621A80175c7382C4032L7519J25293n286j4438e6485I2609b04692C9035b46518
$$ 180175 -37382 34032 71551 196844 191558 177120 -56485 92609 -204692 39035 -246518
12609c18004B68364G4799l6974a54304m56806a15489r0937g2948G03338B4996
$$ -318004 268364 74799 37825 -154304 -611110 -115489 -206426 -72948 703338 24996
12598A26907Q5233f80B16425a16214G1023K04028b2404j54091B40329G254J59934
$$ 126907 212140 -680 216425 -116214 71023 275051 -22404 -176495 240329 7254 167188
12587A67188a5762A28943J22912j13773A3929b9941A49598B6255J03472m353L21183
$$ 167188 -15762 128943 251855 138082 13929 -29941 149598 26255 129727 125374 446557
12576D46557E7026R92a0636j23482A76214J03498j36861P868M1203b8654A91352
$$ 446557 57026 58018 -10636 -134118 176214 279712 142851 150719 191922 -28654 191352
12564b50485B10280c76018a14487A74984Q0328B4927a99284D74222b79233D66410
$$ -250485 210280 -376018 -114487 174984 255312 24927 -199284 474222 -279233 466410
12553e4495j22012M6555l9261A94281b70856A20666a58252d0539Q396A89543B296
$$ -54495 -176507 -129952 -169213 194281 -270856 120666 -158252 -40539 -32143 189543 2296
12541a93502a0929B74929H3040M8833C8698e1851C24962e049A82908d34238B42755
$$ -193502 -10929 274929 83040 131873 38698 -51851 324962 -5049 182908 -434238 242755
12529d2728j74633D5778R7714J37169n4986l5080D3113K0117R5556j8316E9875
$$ -42728 -217361 45778 143492 280661 225675 190595 43113 63230 158786 140470 59875
12517g6066b1939m6618k35473a02414B34468D8397a38975C0639P0740a30923A78189
$$ -76066 -21939 -68557 -304030 -102414 234468 48397 -138975 30639 101379 -130923 178189
12505B0077J9859b0352A21265R235c93819a14342A71993i812C0924c27227B33122
$$ 20077 39936 -20352 121265 130500 -393819 -114342 171993 -9812 30924 -327227 233122
12493F711K35534A05985A2631g1941I1448c680j261n26588a19124c1879j32789
$$ 6711 242245 105985 12631 -71941 91448 -3680 -4941 -531529 -119124 -31879 -164668
12482a64668o394e8349q5794A13338D0216a66464A80621F6470b28351n9374E6336
$$ -164668 -171062 -58349 -144143 113338 40216 -166464 180621 66470 -228351 -287725 56336
12470A31207d5702j69825F1443P2905a89444R043C3729b1527j46689j1961m9819
$$ 131207 -45702 -215527 61443 134348 -189444 -180401 33729 -21527 -168216 -180177 -229996
12459b29996H8986C5805a06015M2263h379F0465a88408n840A43948J97571b2060
$$ -229996 88986 35805 -106015 -63752 -8379 60465 -188408 -194248 143948 341519 -22060
12447f0736F12953B5773b20907C57526a51119j22245N0799B5548h2000k3571d4941
$$ -60736 612953 25773 -220907 357526 -151119 -273364 -222565 25548 -82000 -105571 -44941
12435a05228r0158A47541J83843A18984b04952A21058Q0517I210K12301F4903
$$ -105228 -195386 147541 331384 118984 -204952 121058 201575 9210 221511 64903
12424a47900J0737H1842N1898b26454Q2098M2022A14147R9644J10788A46811a1912
$$ -147900 -137163 81842 133740 -226454 -144356 -102334 114147 213791 324579 146811 -11912
12412d2873A43283a00858M0542B94184j17107a8030j71142l78764C11593a74118
$$ -42873 143283 -100858 -60316 294184 177077 -18030 -189172 -567936 311593 -174118
12401A02569a64329p3940J05576F4902J61799A00688M9613D8680K24089F7302
$$ 102569 -164329 -238269 -132693 64902 226701 100688 150301 48680 272769 67302
12390f6977k8481D03287A729c12944H0183k2313O8377B9137N1356f635j90587
$$ -66977 -95458 403287 1729 -312944 80183 57870 126247 29137 80493 -6635 -197222
12379a97222b6176A88622b6842k58689K6674A82509P736a1257j10567A73981H0833
$$ -197222 -26176 188622 -26842 -285531 -258857 182509 190245 -11257 -121824 173981 80833
12367A97066B9334K78591d490o514D6614K71795I1R4456m3010j4454Q8510b3773
$$ 197066 29334 307925 -4490 -11004 46614 318409 91 94547 51537 37083 125593 -23773
12354E1981l822N4671k3974b40177b8172A68172d03322B72621j19394j5821J00449
$$ 51981 48159 102830 78856 -240177 -28172 168172 -403322 272621 153227 137406 237855
12343B37855K81123G1755c2724H7193b9898C4475K03316a47189B78864a63695
$$ 237855 518978 71755 -32724 87193 -29898 34475 237791 -147189 278864 -163695
12332F0610R1607E694a97599h7766q0776A59562F1523L72347A29891E4682L83809
$$ 60610 152217 5694 -197599 -87766 -168542 159562 61523 433870 129891 54682 438491
12321D38491A217b4908A7196J67856C3050P6794a10759K6260A07989k2907a739
$$ 438491 1217 -24908 17196 185052 33050 109844 -110759 -84499 107989 85082 -1739
12309E1040c1262A38080c79015a49960G3604g3236j03609A21013D2791a27553
$$ 51040 -31262 138080 -379015 -149960 73604 -73236 -176845 121013 42791 -127553
12298a40236H7217B457b8377A67160b58248C0669e14339B23465L37958A79030
$$ -140236 87217 2457 -28377 167160 -258248 30669 -514339 223465 561423 179030
12287c7325a6654A93078F1698k2180L06562A02682c0448A62103J58512b64514
$$ -37325 -16654 193078 61698 39518 346080 102682 -30448 162103 320615 -264514
12276B02153C1363g7227A27857k1946b7333B18629n169k0166g7419D17163C0882
$$ 202153 31363 -77227 127857 105911 -27333 218629 213460 193294 -77419 417163 30882
12264a39752C10560n6939k9277C1066e4269D69726b98018g9914A81799e333B83852
$$ -139752 310560 253621 224344 31066 -54269 469726 -298018 -79914 181799 -5333 283852
12252c46149D5116J7143k6922a958B89015A7394a15111G5335J90900a1258A82276
$$ -346149 45116 62259 35337 -1958 289015 17394 -115111 75335 266235 -11258 182276
12240b27966B46831C3238L44643A18656o383J31738f4997B33935L442N7531j27916
$$ -227966 246831 33238 377881 118656 112273 244011 -64997 233935 237377 294908 166992
12229A66992K06638j80702J43599I4206J36329n071J49996j09399E8205f3460
$$ 166992 373630 192928 336527 94206 230535 225464 375460 266061 58205 -63460
12218C74086a04641a0586E9827J39097P3681n6252O4326L41960A33044D0685K58455
$$ 374086 -104641 -10586 59827 198924 272605 216353 280679 622639 133044 40685 299140
12207B99140q582R8873A38416a24419E3092j7875K59049m9868p9036J24667a24848
$$ 299140 290558 389431 138416 -124419 53092 35217 294266 244398 165362 290029 -124848
12195I3770J70763E4940M26050c9318D59834I0405K13318a1120C50950D5847j5840
$$ 93770 264533 54940 480990 -39318 459834 90405 303723 -11120 350950 45847 30007
12184C0007J94100l4804P2820m4474D5318F174K93540q1265J44503H7633g4455
$$ 30007 224107 189303 262123 217649 45318 6174 299714 218449 362952 87633 -74455
12172A40780g9147n1032n6695C62147o7075b7392j09020d0787D27595A34013h141
$$ 140780 -79147 -130179 -186874 362147 295072 -27392 -136412 -40787 427595 134013 -8141
12160H0129K9643K6064b25249a3243j13702b6404E7220J73413P1408a5395q5871
$$ 80129 109772 135836 -225249 -13243 -126945 -26404 57220 230633 302041 -15395 -101266
12149a01266K1486A20276J94864j04129a81911b4750A95725q6266J44497M937
$$ -101266 -79780 120276 315140 211011 -181911 -24750 195725 109459 253956 258893
12139B58893a29378b9990j01287j17261d4520D24265A63077b09070A27011f035
$$ 258893 -129378 -29990 -131277 -248538 -44520 424265 163077 -209070 127011 -6035
12128A04208b44040C47298a3609j54184B3349c02227A49121b75569A15421L3717
$$ 104208 -244040 347298 -13609 -167793 23349 -302227 149121 -275569 115421 149138
12118A49138J75528a7166k6038A11831B4196a47131j92877B2027M4582g4860B08480
$$ 149138 324666 -17166 -43204 111831 24196 -147131 -340008 22027 66609 -74860 208480
12106f0671j0852I9434L8365F3350b48308O6147D7195i319p5503B60257a00863
$$ -60671 -71523 99434 137799 63350 -248308 -182161 47195 -9319 -84822 260257 -100863
12094C23788j19184b3557D0795J35839J2252B1064J53764k8365F8879R5944i9302
$$ 323788 204604 -23557 40795 176634 188886 21064 174828 146463 68879 164823 -99302
12082B79198j16115k8106d3756A64111a38604A87781e0509j86372B81644N9592
$$ 279198 163083 134977 -43756 164111 -138604 187781 -50509 -236881 281644 341236
12072C41236l6426R00491K98241G28828h863A53923o0966B8857L06030J4830e3718
$$ 341236 304810 1205301 1503542 728828 -8863 153923 92957 28857 334887 349717 -53718
12060b07006B52716I0311J6531J15519d9321B8456a50148f2670l530q6261m0739
$$ -207006 252716 90311 106842 222361 -49321 28456 -150148 -62670 -66200 -152461 -193200
12049a93200n7016I7038c2386D44862b47961g7963j25203D44392e7005l4362D3014
$$ -193200 -250216 97038 -32386 444862 -247961 -77963 -203166 444392 -57005 -91367 43014
12037B2535J13002G844c42205g9736B39554b17383q0171a33008k31388h2570R07
$$ 22535 135537 7844 -342205 -79736 239554 -217383 -297554 -133008 -364396 -82570 -81663
12026h1663k03884b7339n7245a7408G6534k5038c2458A9523K52791a00590A51223
$$ -81663 -285547 -27339 -84584 -17408 76534 51496 -32458 19523 272314 -100590 151223
12014A6000P5438a72310B54350I4595K2616N2526P7039a72485A55519i8564q5975
$$ 16000 91438 -172310 254350 94595 117211 169737 246776 -172485 155519 -98564 -184539
12003a84539A30730l744g347A66297i1362B61536j28981a31048H0857J1547e6052
$$ -184539 130730 126986 -7347 166297 -91362 261536 132555 -131048 80857 92404 -56052
11991A9960b17970e9132k24075P5197e0564l41954C92231F7227K33601B544c4385
$$ 19960 -217970 -59132 -283207 -208010 -50564 -392518 392231 67227 300828 2544 -34385
11979a25001J013j16144d0765B74490d341H0239c17441a27991I6746B1346d6562
$$ -125001 -123988 -240132 -40765 274490 -4341 80239 -317441 -127991 96746 21346 -46562
11967h5187B68665a2841G2878E044J43610A0675J71378C5970l150a89438G7501
$$ -85187 268665 -12841 72878 5044 148654 10675 182053 35970 32820 -189438 77501
11955H2184J3031K113J21383A4349M9115a48729n5377G7091K95491b44144A38245
$$ 82184 95215 97328 218711 14349 63464 -148729 -204106 77091 372582 -244144 138245
11943D7959b3458l79j29919j43606i5547C7558i765A46659h159j73691B79866
$$ 47959 -23458 -23837 -153756 -297362 -95547 37558 -9765 146659 -8159 -181850 279866
11931a41412e4883k90087I3993a16129r937B63673K02804b18880R1695k56209
$$ -141412 -54883 -344970 93993 -116129 -126066 263673 466477 -218880 -127185 -383394
11921c83394D4486J36222a43637A70036b12424b532I7681R01l3114K0884e3022
$$ -383394 44486 180708 -143637 170036 -212424 -2532 97681 98582 65468 86352 -53022
11909A09802j0518J10382j2059a26994K5258D75150a58578B07484J77594b7352
$$ 109802 99284 209666 197607 -126994 -101736 475150 -158578 207484 385078 -27352
11898A54848r075h5597E3885B6579c35356j3835B83041a39649f2740o396l90630
$$ 154848 145773 -85597 53885 26579 -335356 -349191 283041 -139649 -62740 -69136 -459766
11887d59766a49916l5807A79899h2199G1251A7095a48364C1464a84886H1608m871
$$ -459766 -149916 -185723 179899 -82199 71251 17095 -148364 31464 -184886 81608 76737
11876G6737r069J63194f6948j50508I7930c36979b861B36959a25684k42323A03535
$$ 76737 67668 230862 -66948 -217456 97930 -336979 -2861 236959 -125684 -368007 103535
11864A18885J18049F6302f0962A68991a12438p4663A6889h0790F1107b75446D5052
$$ 118885 236934 66302 -60962 168991 -112438 -187101 16889 -80790 61107 -275446 45052
11852c2794j52290A5324a00977M7549K3914k23992h2637p050A55792b35468k4458
$$ -32794 -185084 15324 -100977 -53428 -29514 -253506 -82637 -89687 155792 -235468 -259926
11841b59926a18436a9115f469l34726e5157C06317b06507f5083n35858a91037
$$ -259926 -118436 -19115 -6469 -341195 -55157 306317 -206507 -65083 -600941 -191037
11830A61299A6769J92017g1128A85187A2870b34177b2148q101k66206i9233M4136
$$ 161299 16769 208786 -71128 185187 12870 -234177 -22148 -30249 -296455 -99233 -55097
11819e5097B05861n0144J74799A52698a2534a100H3083J4455d87132b1366G6344
$$ -55097 205861 155717 330516 152698 -12534 -1100 83083 97538 -487132 -21366 76344
11807a25142j79854A56175F7464D873Q7201j1823K06a27549G8333a63937O9160
$$ -125142 -304996 156175 67464 4873 92074 80251 80457 -127549 78333 -163937 -94777
11796i4777G931l382b08243H5161a14957c1834B189c7990A00319M4490c6550A5036
$$ -94777 7931 4549 -208243 85161 -114957 -31834 2189 -37990 100319 144809 -36550 15036
11783B3975R0070L1765a37024B07267a68207B8091c250n5933F4215a15833j08498
$$ 23975 114045 145810 -137024 207267 -168207 28091 -3250 -59183 64215 -115833 -224331
11772b24331N1941l7128Q9104b8277j57331H0392J6474J77675F1599h2364A30562
$$ -224331 -172390 -209518 -120414 -28277 -185608 80392 96866 274541 61599 -82364 130562
11760a0251A0123a59929A61140b29596C6740K90681a71936A85428c131C1814a6336
$$ -10251 10123 -159929 161140 -229596 36740 327421 -171936 185428 -3131 31814 -16336
11748d37136J69799G1427J01998J17307a37323j01321d6786C84932A59281a35918
$$ -437136 -267337 71427 173425 290732 -137323 -238644 -46786 384932 159281 -135918
11737a39439B57042a80272e5812k698A40831a02021A8360O2746b9293B86009f4331
$$ -139439 257042 -180272 -55812 -58510 140831 -102021 18360 81106 -29293 286009 -64331
11725I525a52057l6149A20503b7099j60716L7824C6995O2781Q6240m3760g2415
$$ 9525 -152057 -188206 120503 -27099 -187815 -149991 36995 99776 186016 142256 -72415
11713a64734a5258C08087a04722e0317A32592H359h0857j60291A72303E8854b4941
$$ -164734 -15258 308087 -104722 -50317 132592 8359 -80857 -241148 172303 58854 -24941
11701C08348A07145a0899A60865i8726k62242A53509g0163k8630a1811j76038
$$ 308348 107145 -10899 160865 -98726 -360968 153509 -70163 -98793 -11811 -187849
11691a87849N4652N6561C26568A34238m3114R0998K07853H1400g726A20074K1137
$$ -187849 -133197 -76636 326568 134238 91124 182122 389975 81400 -7726 120074 141211
11680A41211d154q202B54182r4757c4387A90436b49870B26548G0883b16390A87822
$$ 141211 -4154 -12356 254182 159425 -34387 190436 -249870 226548 70883 -216390 187822
11668f7511A36261g1703C7704M7167P8573J25580e5441B99759A02995j7953J80112
$$ -67511 136261 -71703 37704 84871 163444 289024 -55441 299759 102995 85042 265154
11657B65154a43176D96646B18261N7253a03664B3224b21768B76515G8299c07248
$$ 265154 -143176 496646 218261 275514 -103664 23224 -221768 276515 78299 -307248
11646a15824C53499B4956N8620d9424A066J25276K7324a54225E7738a25473A64626
$$ -115824 353499 24956 83576 -49424 1066 126342 153666 -154225 57738 -125473 164626
11634b1845B01074r8222L10726f5142j65087B45915B9927f72k3407F2901a99113
$$ -21845 201074 102852 413578 -65142 -230229 245915 29927 -672 -24079 62901 -199113
11622B25368g584C0315g1635E7933j108j2867c2575B17231b02582B79868b082
$$ 225368 -7584 30315 -71635 57933 56825 43958 -32575 217231 -202582 279868 -2082
11610B97164G4344g3199C0623L9053R8895l7897b14440B8111K6664a05866K9205
$$ 297164 74344 -73199 30623 69676 168571 130674 -214440 28111 54775 -105866 -76661
11599g6661D2214O3689J45608A02036b4522r3585A29017e5197k67536b285B21828
$$ -76661 42214 105903 251511 102036 -24522 -118107 129017 -55197 -322733 -2285 221828
11587a1771A36387J84150L7672b5798k30843B94937G6182c0798A13982a51954
$$ -11771 136387 320537 358209 -25798 -256641 294937 76182 -30798 113982 -151954
11576A94615f0939j02365F7863M2852b93252f3320A95466C5828K18516j22447
$$ 194615 -60939 -163304 67863 110715 -293252 -63320 195466 35828 254344 131897
11566A31897b6828k9073A7971J25467a15015A93884O9274H5152a785C14621d868
$$ 131897 -26828 -55901 17971 143438 -115015 193884 263158 85152 -1785 314621 -4868
11554C05133J20234I4815M41121i3523J7762A61366m3564M5443j8448A0606L10630
$$ 305133 425367 94815 535936 -93523 -75761 161366 117802 163245 144797 10606 321236
11543C21236B1507a98750A44610D8720J2L00320I9968l4997J8114c2008l8365
$$ 321236 21507 -198750 144610 48720 48732 349052 99968 64971 83085 -32008 -70373
11532g0373E9363M35022A65600B2914J59291c12455c6467o0019K6089n1212B40419
$$ -70373 59363 494385 165600 22914 182205 -312455 -36467 -96486 -70397 -121609 240419
11520B9570J69134D9751g8545A15753h1093B20391B907h2841c3249A79409m1464
$$ 29570 198704 49751 -78545 115753 -81093 220391 2907 -82841 -33249 179409 137945
11509A37945m6812l7476K73409N0112A488L6632a92606B20342p8385K09834H1557
$$ 137945 91133 53657 327066 377178 1488 38120 -192606 220342 141957 351791 81557
11497h6703A2280K74611a4463B35258A15108R4255J17455a44774B64825o2520
$$ -86703 12280 286891 -14463 235258 115108 209363 326818 -144774 264825 202305
11487B02305a0720C41831j44687g6247F1292J9909J29325b44275A01764i9401
$$ 202305 -10720 341831 197144 -76247 61292 81201 210526 -244275 101764 -99401
11476a13171b9010D45113A89195f665k6921k53253C48001A1549a29856A77818
$$ -113171 -29010 445113 189195 -6665 -33586 -286839 348001 11549 -129856 177818
11465A46316L862J65557K46468B60232P1286D3709c2957A3764J15731F1991j1836
$$ 146316 150178 315735 562203 260232 331518 43709 -32957 13764 129495 61991 50155
11454E0155J19999i6511n7054f7742C71673P1322H83b2105A60238b2271l3633
$$ 50155 170154 -96511 -153565 -67742 371673 442995 883 -22105 160238 -22271 -55904
11443e5904E6274b8622j75350R2759A87244q6401g0934B00682N0573n7418g0075
$$ -55904 56274 -28622 -203972 -111213 187244 100843 -70934 200682 251255 193837 -70075
11431B90942j35105f2461b2388A89766h5492c8773B85550f450D2165a78872c304
$$ 290942 155837 -62461 -22388 189766 -85492 -38773 285550 -6450 42165 -178872 -3304
11419e2535G6541b7089j4516j44241r6351f9665I737h913l8396j29158r1962A38425
$$ -52535 76541 -27089 -41605 -185846 -282197 -69665 9737 -8913 -47309 -176467 -268429 138425
11406B80556b09904i3420A20742h761L113j12116l2195A02949f8022A92083c02157
$$ 280556 -209904 -93420 120742 -8761 -5648 -117764 -149959 102949 -68022 192083 -302157
11394A23596d1740J9623B08270a54774j9302J5631A30584K3300c302A07766b5294
$$ 123596 -41740 -22117 208270 -154774 -174076 -158445 130584 153884 -3302 107766 -25294
11382A51171n2640Q0710c1546F9301a16510F85280h9624A57109H4J80385H3198
$$ 151171 98531 179241 -31546 69301 -116510 685280 -89624 157109 84 180469 83198
11370A45535d1122B18910a37423j24349R7312B51982H8492b863j53396n2031A90398
$$ 145535 -41122 218910 -137423 -261772 -164460 251982 88492 -2863 -156259 -208290 190398
11358e3539A69942i3057A51013E8539J04639a38630A7508J23876m0695a05650
$$ -53539 169942 -93057 151013 58539 163178 -138630 17508 141384 100689 -105650
11347A75539J7485a35418L6415H4418K1403L6615J52877b76273C46809a58317
$$ 175539 193024 -135418 -99003 84418 105821 142436 295313 -276273 346809 -158317
11336I9134a51853B40673B9909J417J63604b94937j27797i8080N602H895b90710
$$ 99134 -151853 240673 29909 31326 194930 -294937 -422734 -98080 -92478 8895 -290710
11324H9710d29743D02931A15413A2316a77466g1459F2494a85687C0814a2735A27906
$$ 89710 -429743 402931 115413 12316 -177466 -71459 62494 -185687 30814 -12735 127906
11312D32228H615b95783g8629A66679d1300m1452A06559b48916I9317G394c00310
$$ 432228 8615 -295783 -78629 166679 -41300 -82752 106559 -248916 99317 7394 -300310
11300b41486E2386b63294A29825n5577d6931j75214K2569c3342A49854a07579
$$ -241486 52386 -263294 129825 74248 -46931 -222145 -199576 -33342 149854 -107579
11289F6829a35285B18261C2609J15732a45594d8191C9219b80900D713K39564K36500
$$ 66829 -135285 218261 32609 148341 -145594 -48191 39219 -280900 4713 244277 480777
11278D80777a00841n697l25321J50020D0665b9034j168A92280f0794A83514r0401
$$ 480777 -100841 -106538 -431859 -281839 40665 -29034 -30202 192280 -60794 183514 93113
11267I3113g3239A47306e0324B83333i8971M8242k14282A02794M5281m8538d5649
$$ 93113 -73239 147306 -50324 283333 -98971 -50729 -265011 102794 148075 99537 -45649
11255H5126a30370e1835f567o3844B08501E4534h6445j28019C13333G0482b55677
$$ 85126 -130370 -51835 -6567 -70411 208501 54534 -86445 -214464 313333 70482 -255677
11243d07761H4065A5024b39252R1347d6937j07848B73383A13683l2723n932a60805
$$ -407761 84065 15024 -239252 -147905 -46937 -154785 273383 113683 80960 75028 -160805
11231A64517R6878D4362J97310f4056m6049F1503a31097B94375G1574J93289H0913
$$ 164517 261395 44362 241672 -64056 -110105 61503 -131097 294375 71574 264863 80913
11219g6897I1395f5367q288J0547j38359A8083O199g75k78043h0302B78804j06242
$$ -76897 91395 -65367 -73655 -63108 -201467 18083 24282 -775 -278818 -80302 278804 172562
11207A72562q3185e4952K1278j26186J3597A54984b25359j38011g1913E9424e9291
$$ 172562 89377 -54952 -33674 -159860 -146263 154984 -225359 -363370 -71913 59424 -59291
11195a70905a9268I6871a39255B5008d7502a4613j00612A66472f6127L0855A01430
$$ -170905 -19268 96871 -139255 25008 -47502 -14613 -115225 166472 -66127 -35272 101430
11183c09609O8557A45674N7361a23017B39453c22744J35786B080J86756A4559
$$ -309609 -241052 145674 203035 -123017 239453 -322744 -186958 2080 188836 14559
11172B53112L0344A9040e7144j18299D2479b27207e8466A68065a32687D8708b11471
$$ 253112 283456 19040 -57144 -175443 42479 -227207 -58466 168065 -132687 48708 -211471
11160e2826C0036L10565A61387b14682L5037j03257D9857b77948c5254k16272
$$ -52826 30036 340601 161387 -214682 -179645 -282902 49857 -277948 -35254 -251526
11150b51526B63039j11111a51464j05906H7913c823A58786J83506A51504b9196
$$ -251526 263039 151928 -151464 -257370 87913 -3823 158786 342292 151504 -29196
11139c6906F9585i2208K6362A52011n9922B3325f1197A0892a91410D51426D531
$$ -36906 69585 -92208 -65846 152011 92089 23325 -61197 10892 -191410 451426 4531
11127a53633a6919d022A15980M14866C2008K22866C4021a80713B25413j07144
$$ -153633 -16919 -4022 115980 530846 32008 254874 34021 -180713 225413 118269
11117A18269K09138B5926J03643O4642q1173G226a60256K5656A34041n0972M3959
$$ 118269 327407 25926 129569 194211 113038 7226 -160256 -134600 134041 83069 127028
11106A27028K84691j51503E8035a2057B5030a2629B17641J41703q7283l2332J05725
$$ 127028 411719 260216 58035 -12057 25030 -12629 217641 359344 272061 239729 345454
11095C45454j27104E4378J03107a66088H7901K60986j25202a36944C2481A5579
$$ 345454 218350 54378 157485 -166088 87901 348887 223685 -136944 32481 15579
11084b23554A90174Q5473f1282a1934B18417j7271J44563j48592K66101j68683
$$ -223554 190174 275647 -61282 -11934 218417 201146 345709 197117 463218 294535
11074B94535J62050j15152R1581Q5P7433j96682J3818D733L40900k4627K51876
$$ 294535 456585 341433 433014 433099 510532 313850 327668 4733 345633 321006 572882
11063E72882j17532O2079k15960L91632j95820L94844l62062L0125j13222K52235
$$ 572882 455350 517429 301469 693101 497281 892125 530063 560188 446966 699201
11053F99201K81638j93665k02114l6028j90392M14805M461j50376K51202n6521
$$ 699201 980839 787174 585060 549032 358640 773445 777906 627530 878732 822211
11043H22211j91108J23152K15812j21926j68976K76627r8081r5431l9002L11320
$$ 822211 631103 754255 970067 848141 679165 955792 857711 762280 723278 1034598
11033A034598j5262Q3853m00611m4524J11245R0434j99518J28010k60802L11458
$$ 1034598 1019336 1103189 702578 658054 769299 859733 660215 788225 527423 838881
11023H38881J3802j9525j64698j94694P4554J80546J13364j6656j06659k48490
$$ 838881 852683 833158 668460 473766 548320 728866 842230 825574 718915 470425
11013D70425L39599k30825J2434J9257K60243j50111B72126M35970q4419M5254
$$ 470425 810024 579199 591633 610890 871133 721022 272126 708096 623677 668931
11003F68931K22937L1249l62913L62844l05651K00128o342o6482O057J57849k5128
$$ 668931 891868 923117 560204 923048 617397 817525 811183 744701 750758 908607 883479
10992H83479l24719L07734K08240j60373m48525M33330j18551J82405K27832l9617
$$ 883479 558760 866494 1074734 914361 465836 899166 780615 963020 1190852 1151235
10982A151235j48156K55715k99287L38294M24938J87645q3942O10976M18995l9699
$$ 1151235 1003079 1258794 959507 1297801 1722739 1910384 1826442 2437418 2856413 2816714
10972B816714o237n3718j1177J37831J89817n90628k53847n86401j32280K23485
$$ 2816714 2810477 2756759 2745582 2883413 3073230 2482602 2228755 1642354 1510074 1733559
10962A733559k28339M10653j97171K05302j72590L68981l95603q5092k9636m38580
$$ 1733559 1505220 1915873 1718702 1924004 1751414 2120395 1724792 1639700 1610064 1171484
10952A171484L16176k73495k13001k66116j66098Q0539k44998q0594j61262L00588
$$ 1171484 1487660 1214165 1001164 735048 568950 649489 404491 323897 162635 463223
10942D63223k2661N04190D28593A63190p0848R725J16282F1754K9373Q817Q6134
$$ 463223 440562 944752 428593 163190 92342 102067 218349 61754 91127 99944 186078
10931A86078M26796a28200A36518F877N4601h2177D36994A34629a91168L5099
$$ 186078 612874 -128200 136518 6877 61478 -82177 436994 134629 -191168 -156069
10921a56069C66858A45604a34101j49495E4279d6169A27705a08857B81274b56891
$$ -156069 366858 145604 -134101 -283596 54279 -46169 127705 -108857 281274 -256891
10910a78696f1771A34783k8798a51569A473J7986J3429j5154a75325B04171f4857
$$ -178696 -61771 134783 105985 -151569 1473 19459 32888 17734 -175325 204171 -64857
10898A55941F839c997l1192F2232O1841a8944r206j08917e9145j55602A02215
$$ 155941 6839 -3997 -35189 62232 124073 -18944 -28150 -137067 -59145 -214747 102215
10886F6979R4063H493e6241A20783a21358m5127q6650B68745c78169A19825b29582
$$ 66979 161042 8493 -56241 120783 -121358 -166485 -253135 268745 -378169 119825 -229582
10874A44169J07395a22748B86472A21899a90327A63446G5343h4453C8677b3421
$$ 144169 251564 -122748 286472 121899 -190327 163446 75343 -84453 38677 -23421
10863E273K63921I9754g6891k27458B18479a20328I126M53888I4696a87713O8437
$$ 5273 269194 99754 -76891 -304349 218479 -120328 9126 463014 94696 -187713 -119276
10852a19276K5017O771p9589j04864B27810o8875b68135J32160c0680G2967A996
$$ -119276 -94259 -87488 -167077 -271941 227810 158935 -268135 -135975 -30680 72967 1996
10840A41245c50597a6137G6865a4636A91610a10635M057A93359c90296F3436K871
$$ 141245 -350597 -16137 76865 -14636 191610 -110635 -106578 193359 -390296 63436 66307
10829F6307a2120l2042F88a94552a9205C812c8972A86756a60245f0276B0260a20578
$$ 66307 -12120 -44162 688 -194552 -19205 3812 -38972 186756 -160245 -60276 20260 -120578
10816B05360R971b01180m4019j27240a74595k8082M9129j38099a6135A10746a60619
$$ 205360 215331 -201180 -245199 -372439 -174595 -202677 -153548 -291647 -16135 110746 -160619
10804a32266B09864H4865J7866a28908O2392j11697k7722b7931A3155i0174D671
$$ -132266 209864 84865 102731 -128908 -66516 -178213 -205935 -27931 13155 -90174 4671
10792B518J71106i300j32629b2709j93156i0180b1975j73876h8617J7814A28915
$$ 2518 173624 -9300 -141929 -22709 -215865 -90180 -21975 -195851 -88617 -70803 128915
10780B33618a22153B48829A6874J06925i2168l4524k3812A95974L2480K01141
$$ 233618 -122153 248829 16874 123799 -92168 -126692 -150504 195974 228454 429595
10770D29595d053B71820b34156H4408K9670a200k02522A73674q5722d35603H0596
$$ 429595 -4053 271820 -234156 84408 114078 -1200 -203722 173674 87952 -435603 80596
10758a41681o1453f3480A94490k5921D880K20440b46617B0787a31418m8866B05987
$$ -141681 -203134 -63480 194490 168569 4880 225320 -246617 20787 -131418 -180284 205987
10746a4621j42798d2566j09904N0837C16265C3057b47176j22248h8463A49980
$$ -14621 -157419 -42566 -152470 -101633 316265 33057 -247176 -369424 -88463 149980
10735f2815a3928l06459a30350j881B25877a25439A35043J4630H570b13693B01023
$$ -62815 -13928 -320387 -130350 -132231 225877 -125439 135043 149673 8570 -213693 201023
10723c34151a54222N6487j60253P756A52115F603f6208k996k02408f2122j17073
$$ -334151 -154222 -97735 -257988 -250232 152115 6603 -66208 -69204 -271612 -62122 -179195
10712a79195B18271b60930J22343k45479C62111b00651C2982h2697F1059b34874
$$ -179195 218271 -260930 -138587 -384066 362111 -200651 32982 -82697 61059 -234874
10701g9748k02315e9741r8326P8412k71351M1557A45492J49532b8476A67960f2915
$$ -79748 -282063 -59741 -158067 -79655 -351006 -309449 145492 295024 -28476 167960 -62915
10689B10655F7862g7609j23463j234A14445m1636b21051b7100k49496p2631a13666
$$ 210655 67862 -77609 -201072 -202306 114445 72809 -221051 -27100 -276596 -349227 -113666
10677g8167k62862A47963k9277b83137C45991A20947A3950c64888B13237a72164
$$ -78167 -341029 147963 118686 -283137 345991 120947 13950 -364888 213237 -172164
10666A3239J48596n0611Q7127a56833K6598J6316n8465P7379K6306A40237J84053
$$ 13239 161835 111224 198351 -156833 -130235 -113919 -172384 -95005 -68699 140237 324290
10655C24290a7558A77921a80479J298A948L34018c03396B7224o834a65120A36191
$$ 324290 -17558 177921 -180479 -179181 1948 335966 -303396 27224 20390 -165120 136191
10643A93028a03401C2726b24316B76580a3799D8262g4468q1710j51443G9672H538
$$ 193028 -103401 32726 -224316 276580 -13799 48262 -74468 -156178 -307621 79672 8538
10631d4304A91007a97946C9569P5295d76358N3711A30728a15639C0578A134N5376
$$ -44304 191007 -197946 39569 114864 -476358 -422647 130728 -115639 30578 1134 56510
10620E6510a12802j07335B9515b86451I8207C2902p49J5180a42729a3794A2922
$$ 56510 -112802 -220137 29515 -286451 98207 32902 32153 47333 -142729 -13794 12922
10608c59306A10051b55585c0631A50426a19509j46281B78829a9694E9171a26839
$$ -359306 110051 -255585 -30631 150426 -119509 -265790 278829 -19694 59171 -126839
10597A47891a35998l6840O6064q206k12576a22554q318o2684B4874J47481e1960
$$ 147891 -135998 -172838 -106774 -114980 -327556 -122554 -130872 -193556 24874 172355 -51960
10585c6076I0857c6825j61812a6166A83932h2009l6212c0778j063A87782b14953
$$ -36076 90857 -36825 -198637 -16166 183932 -82009 -118221 -30778 -31841 187782 -214953
10573i5754A4038N5383J30926c77842H5335J60994b29201l1733g5793J3945B11168
$$ -95754 14038 69421 200347 -377842 85335 246329 -229201 -260934 -75793 -61848 211168
10561A34115F219J1459L1432b63142c1325r5489l71764H4207M0454f4886C3451
$$ 134115 6219 17678 49110 -263142 -31325 -126814 -498578 84207 124661 -64886 33451
10549f5873n2556C787b8310l0332m6252C948a76935A40457a68942A38126b2241
$$ -65873 -118429 3787 -28310 -58642 -104894 3948 -176935 140457 -168942 138126 -22241
10537A06179a11935b433I5751b19953h3128e583l9504A41311N5864a08203N3925
$$ 106179 -111935 -2433 95751 -219953 -83128 -5583 -45087 141311 197175 -108203 -54278
10526e4278G2353a7912A3573a66400L2667k14904h4366I6621j3556k4551L11121
$$ -54278 72353 -17912 13573 -166400 -133733 -348637 -84366 96621 83065 58514 369635
10515C69635a2478j31286G6982a2011C99364a55497A47766G3341a52390e3481
$$ 369635 -12478 -143764 76982 -12011 399364 -155497 147766 73341 -152390 -53481
10504d03j16641A27804a75324F8289e1237A98741b25169D209a08392j82334B0615
$$ -403 -117044 127804 -175324 68289 -51237 198741 -225169 4209 -108392 -290726 20615
10492a77100c8676j43014g5024F9318a83451b7329k6754H5089J92203n0267J07631
$$ -177100 -38676 -181690 -75024 69318 -183451 -27329 -54083 85089 277292 227025 334656
10481C34656M6245j76909K08898A30071M18949e278F073i532B04377a0805j32978
$$ 334656 380901 203992 412890 130071 549020 -5278 6073 -9532 204377 -10805 -143783
10470a43783C7276J43886a13659a1297A0765i1632A19104A2089K10764D3446Q2095
$$ -143783 37276 181162 -113659 -11297 10765 -91632 119104 12089 222853 43446 125541
10459A25541a48993j49791B2596a39652a1897o293A38939J8463a38265O6827A89419
$$ 125541 -148993 -298784 22596 -139652 -11897 -18190 138939 157402 -138265 -71438 189419
10447b47653A03181a29171A29347K93850i6439H764b00230F6816J0585J25749
$$ -247653 103181 -129171 129347 423197 -96439 8764 -200230 66816 77401 203150
10437B03150B0891a88418B14839a12998a5184r8877A67872a43358j16150N2747
$$ 203150 20891 -188418 214839 -112998 -15184 -114061 167872 -143358 -259508 -206761
10427b06761i5227B46311a16401d2382A38401J97643a75463H9352N4410a63551
$$ -206761 -95227 246311 -116401 -42382 138401 336044 -175463 89352 143762 -163551
10416a18993l74129g2200b5420j28084m4078f8505k9771k6860L9383f714j59890
$$ -118993 -493122 -72200 -25420 -153504 -197582 -68505 -98276 -125136 -85753 -6714 -166604
10405a66604B9747b89486a11023j93675c6542k39033M9236I7381R7499J04654
$$ -166604 29747 -289486 -111023 -304698 -36542 -275575 -226339 97381 194880 299534
10395B99534c82915A51828o8099Q2006R8487r8630J41615A614R1390B1122c7772
$$ 299534 -382915 151828 83729 165735 264222 165592 307207 1614 93004 21122 -37772
10383d0934a7616D28683f4898A31390L92397A1915L93567A76148L09549o2707
$$ -40934 -17616 428683 -64898 131390 523787 11915 405482 176148 485697 422990
10373D22990j0531r9374L4641M6042j30562J11687q9345M54802B44084R6072j49936
$$ 422990 412459 313085 347726 393768 263206 374893 285548 740350 244084 340156 190220
10362A90220O1061K55119B37373C0766P9547J77804A13797L29551B6424J73610
$$ 190220 251281 506400 237373 30766 110313 288117 113797 443348 26424 200034
10352B00034K56162J01760j47093J67280L5760A17268J77981l5589J83005R0225
$$ 200034 456196 557956 410863 578143 613903 117268 295249 259660 442665 532890
10342E32890j20976j54500J62551j56021H1062L3308d3874B9663L43066j64732
$$ 532890 411914 257414 419965 263944 81062 114370 -43874 29663 372729 207997
10332B07997E1324K68397F0061J59125D5545J93088g3401D5216L1195K45178B4161
$$ 207997 51324 319721 60061 219186 45545 238633 -73401 45216 76411 321589 24161
10320B12369J7252q9121H88b62017B11399k5227J40613j13016J60723D9815a12964
$$ 212369 229621 140500 888 -262017 211399 186172 326785 213769 374492 49815 -112964
10308b74461C9313g9113A27949b321j74102A88017b77488N9898c8268j22987E7190
$$ -274461 39313 -79113 127949 -2321 -176423 188017 -277488 -217590 -38268 -161255 57190
10296A59028n6520a00474B75229j16644m9650a42301k33512a0674j44425H0182
$$ 159028 102508 -100474 275229 158585 108935 -142301 -375813 -10674 -155099 80182
10285d18996K06598d9475m36962a94215M1368a8589C5684a5250k41264r615c7797
$$ -418996 -212398 -49475 -486437 -194215 -152847 -18589 35684 -15250 -256514 -266129 -37797
10273a12245A40205o2510a22356B97672j07376q4376e2561H7418a29477B88565
$$ -112245 140205 77695 -122356 297672 190296 105920 -52561 87418 -129477 288565
10262B285J95819M0628j11516M00453j72938j22447J04920A63752C0512a70444
$$ 2285 198104 238732 127216 527669 354731 232284 337204 163752 30512 -170444
10251b46823A25654k7717J06101l4757a49829c7822l04151J27048A97311P3016
$$ -246823 125654 97937 204038 169281 -149829 -37822 -341973 -214925 197311 270327
10241B70327j8980a90434B89728A16999E7857d9378J3861D6155P9977C2372a31695
$$ 270327 251347 -190434 289728 116999 57857 -49378 -35517 46155 126132 32372 -131695
10229b44240f1552k71351J50078g2416k58076A89917a54864q8317e4317C7376
$$ -244240 -61552 -332903 -182825 -72416 -330492 189917 -154864 -243181 -54317 37376
10218a5132k35057o7896j23718J56554J23393A11601h6538k5158M0416I2081o985
$$ -15132 -250189 -318085 -441803 -285249 -161856 111601 -86538 -111696 -71280 92081 85096
10207H5096C7771a47627k5561A64643l3408K18490a94279g8504A252b74685a18173
$$ 85096 37771 -147627 -173188 164643 131235 349725 -194279 -78504 1252 -274685 -118173
10195a03784k67473i7406q817B49779q035k0165g3437m4988o7719e9551m7242
$$ -103784 -371257 -97406 -106223 249779 241744 221579 -73437 -118425 -186144 -59551 -106793
10184a06793k77266a6043j31896b2989I7177O2859L8924D7000a01590A47991c85076
$$ -106793 -384059 -16043 -147939 -22989 97177 160036 198960 47000 -101590 147991 -385076
10172e1434B70785c24006E6295A8320b3114G9559a46994B40020h2414L3896q1915
$$ -51434 270785 -324006 56295 18320 -23114 79559 -146994 240020 -82414 -48518 -130433
10161a30433J9694c8397k15611D5823F832e1170j95303B08177a9363l30294J02841
$$ -130433 -110739 -38397 -254008 45823 6832 -51170 -246473 208177 -19363 -349657 -246816
10150b46816F127a06747j82441D9823L275Q0721F0929B5012N5659a82252g5393
$$ -246816 6127 -106747 -289188 49823 53098 133819 60929 25012 80671 -182252 -75393
10138A85430b96718j80878i7348l0683A72775b24721i7103m8401k41978e7747
$$ 185430 -296718 -477596 -97348 -128031 172775 -224721 -97103 -145504 -387482 -57747
10127a56671g5057k38463F0910i083k21182H6668a09229I9881b34944c4521o4175
$$ -156671 -75057 -313520 60910 -9083 -230265 86668 -109229 99881 -234944 -34521 -98696
10116i8696l0024A63533F717M3288J79672B8976h6376o10q9590C06282l8099G1314
$$ -98696 -128720 163533 6717 50005 229677 28976 -86376 -86986 -176576 306282 268183 71314
10103A55549f8406j69912f4888F3800J08104a36018c2378A43950a30342j34541
$$ 155549 -68406 -238318 -64888 63800 171904 -136018 -32378 143950 -130342 -264883
10093b64883C0765K0089E932J3739a06160b5953j40492a155l03853c3624r3324
$$ -264883 30765 50854 5932 19671 -106160 -25953 -166445 -1155 -305008 -33624 -126948
10082a26948A53097a91325O0536A16650a0587r2046C5011b19104q8024F9799g4798
$$ -126948 153097 -191325 -130789 116650 -10587 -102633 35011 -219104 -307128 69799 -74798
10070b5968B80153A02955a68967c5098j8556o1762k93941B46919e9479A9438c7380
$$ -25968 280153 102955 -168967 -35098 -53654 -115416 -409357 246919 -59479 19438 -37380
10058c8232o5286F7479K3098l3623k4083f7632j52240A74064d21835L5357a60848
$$ -38232 -103518 67479 90577 56954 32871 -67632 -219872 174064 -421835 -386478 -160848
10046B8585h0460r9573N6361n2333h1635D9578e7359C5340L9818K18182a23673
$$ 28585 -80460 -180033 -123672 -176005 -81635 49578 -57359 35340 75158 293340 -123673
10034b01393G782b54072a26313a8891A56262d2883J0119C2767a77818m30747a03245
$$ -201393 7782 -254072 -126313 -18891 156262 -42883 -32764 32767 -177818 -608565 -103245
10022a88487J1587j84448d8184a5278H3197b6306F0946d19029K08532Q5689L0624
$$ -188487 -176900 -361348 -48184 -15278 83197 -26306 60946 -419029 -210497 -124808 -94184
10011i4184N100j1046B01901b65960B14221a83630C2631a26737I707K2449d5094
$$ -94184 -89084 -100130 201901 -265960 214221 -183630 32631 -126737 9707 32156 -45094
9999i736D7770e2474F7592J96119d21715g7461A92107c9649j82917H0499a06504
$$ -9736 47770 -52474 67592 263711 -421715 -77461 192107 -39649 -222566 80499 -106504
9987c08346j30681G8045j9912M8487a49712C8088J35501a11951A98574d62712
$$ -308346 -439027 78045 58133 106620 -149712 38088 173589 -111951 198574 -462712
9976B2934c4043k84671B84957c1341B8508a01549A05716h6876L2978j76042F4712
$$ 22934 -34043 -318714 284957 -31341 28508 -101549 105716 -86876 -53898 -229940 64712
9964e45962a69018E3255M0310K0807i9908k5985L1377A25669f9189A06543a47904
$$ -545962 -169018 53255 93565 114372 -99908 -125893 -94516 125669 -69189 106543 -147904
9952A07883K0334d5400m0238A59629j8868m337a26535c3413k99575c8886H9024
$$ 107883 128217 -45400 -85638 159629 140761 136424 -126535 -33413 -332988 -38886 89024
9940h0589B75581G7503a87470n0480C4073b55842A25194a92508k50301A16029
$$ -80589 275581 77503 -187470 -237950 34073 -255842 125194 -192508 -442809 116029
9929c03068c7231j73500j57683d6146j45257Q4774m9025A8759g8073k40828n0919
$$ -303068 -37231 -210731 -368414 -46146 -191403 -106629 -155654 18759 -78073 -318901 -369820
9918c69820a74825l52752a624B22166H7179d402A36739c2019a0868j34513O2451
$$ -369820 -174825 -527577 -1624 222166 87179 -4402 136739 -32019 -10868 -145381 -82930
9907h2930M717q6788n706B33829a17520H954f1267A26765a07746r4732B55598
$$ -82930 -78213 -165001 -170707 233829 -117520 8954 -61267 126765 -107746 -202478 255598
9895I5678b58138B11345e2994l1084B11957P8911C0784K03809b08292A2616Q0614
$$ 95678 -258138 211345 -52994 -84078 211957 290868 30784 234593 -208292 12616 93230
9884I3230b39108a02638A21735L6965h0658j15599C59811A26893d05879f8272
$$ 93230 -239108 -102638 121735 158700 -80658 -196257 359811 126893 -405879 -68272
9873D3416K28571I4624f9847L3061l7805j16162j49876F9481R9712d45291h4015
$$ 43416 271987 94624 -69847 -36786 -74591 -190753 -340629 69481 169193 -445291 -84015
9861A69193b39975B1227a06347g095m4932B18143L6147a83390e0398G1770K73591
$$ 169193 -239975 21227 -106347 -7095 -52027 218143 254290 -183390 -50398 71770 345361
9850C45361F7936i7414B10775b53270a19520C2592h9748A43104h8004K0364m2103
$$ 345361 67936 -97414 210775 -253270 -119520 32592 -89748 143104 -88004 -67640 -109743
9839a09743B9604b29828h4829j56734O0398j96295G6084l0485h6842M2354k49410
$$ -109743 29604 -229828 -84829 -241563 -181165 -377460 76084 45599 -86842 -44488 -293898
9828b93898J11454B72855q9625c03523h2684A29103b06221e4317F0897d9647a4118
$$ -293898 -182444 272855 183230 -303523 -82684 129103 -206221 -54317 60897 -49647 -14118
9816A66572B0399c12973A67634c2023H5974d1572C61839A01652a31491A17059
$$ 166572 20399 -312973 167634 -32023 85974 -41572 361839 101652 -131491 117059
9805f6984j83550A06983N3899c20351B65874b25520d0370k27543j0121K8748A6080
$$ -66984 -250534 106983 160882 -320351 265874 -225520 -40370 -267913 -278034 -249286 16080
9793b47445B43300m8221C7232K92934b15906L4220P1424l06399J52087R7660k1842
$$ -247445 243300 195079 37232 330166 -215906 -181686 -110262 -416661 -264574 -166914 -188756
9782a88756B29610d9077C9868a28121G1523B9745J76931C6648a38548I5331C1204
$$ -188756 229610 -49077 39868 -128121 71523 29745 206676 36648 -138548 95331 31204
9770a66981o0416k1702R3388c4639I4096h032k7133n486n104r8116k02890F9877
$$ -166981 -227397 -249099 -155711 -34639 94096 -8032 -35165 -40651 -45755 -143871 -346761 69877
9757h1453A81982b70196f8390j42211q445h1618o2881k3019E558b45317N6812
$$ -81453 181982 -270196 -68390 -210601 -219046 -81618 -144499 -167518 5558 -245317 -188505
9746a88505f7860B9972i218E4962b95534A44436a31562E9647j9260J01683d7826
$$ -188505 -67860 29972 -9218 54962 -295534 144436 -131562 59647 40387 142070 -47826
9734d0929j25080k38978m8998a72513P5727a7292l13929J51935c2914D1519c92637
$$ -40929 -166009 -404987 -453985 -172513 -96786 -17292 -331221 -179286 -32914 41519 -392637
9722i677o1731j41749A01863a63034q7772R2466g94j43894A5620O6607a09056
$$ -9677 -71408 -213157 101863 -163034 -250806 -158340 -794 -144688 15620 82227 -109056
9710g2013k60201o2240q5615b25448R0872A9885e2747J0309F4716J12711h8551
$$ -72013 -332214 -394454 -480069 -225448 -134576 19885 -52747 -42438 64716 177427 -88551
9698b93435C9984c24986J24681c630j0053j58772f6355j42779C66193j8518E1367
$$ -293435 39984 -324986 -200305 -3630 -13683 -172455 -66355 -209134 366193 347675 51367
9686b53416a24455k23946E7908a78561c1853B5633N5096c10860J36057D4262P7720
$$ -253416 -124455 -348401 57908 -178561 -31853 25633 80729 -310860 -174803 44262 121982
9675A21982j4730b08033H553a79325j1290Q577L2580F5068M7116R0611g3469A71100
$$ 121982 107252 -208033 8553 -179325 -190615 -182038 -149458 65068 112184 202795 -73469 171100
9662c42272J66200j65J9888b892k01389e5655G8615B7859a83253C02755a08497
$$ -342272 -176072 -176237 -156349 -2892 -204281 -55655 78615 27859 -183253 302755 -108497
9650c2757m7350b9274k50339J13772A93049a31062o6175r7446A7889i9099L4672
$$ -32757 -80107 -29274 -279613 -165841 193049 -131062 -197237 -294683 17889 -99099 -64427
9639f4427A2589M7486i1361j5398J3337c2933o174R472C3107f0471I630J5739
$$ -64427 12589 60075 -91361 -106759 -93422 -32933 -39107 -29635 33107 -60471 9630 25369
9627B5369a2041A40416g6061k68994h0318J7309k47569L5556m1992A25429n7585
$$ 25369 -12041 140416 -76061 -345055 -80318 -63009 -310578 -275022 -317014 125429 67844
9616F7844i6122j5680M916A23253b83049i750B39943J33106j18502f0844D2759
$$ 67844 -96122 -111802 -106886 123253 -283049 -9750 239943 373049 254547 -60844 42759
9604C92267A32560l1833O4728i168p5623j89409G724f7684A71790b95120J07421
$$ 392267 132560 100727 165455 -9168 -84791 -274200 7724 -67684 171790 -295120 -187699
9593a87699A13599a14713A69581b42466G1950h5272A30281A6248R5575J26215
$$ -187699 113599 -114713 169581 -242466 71950 -85272 130281 16248 111823 238038
9583B38038e011j60999j90601e1754C3290e0883A06190M8817d4082k95346B57938
$$ 238038 -5011 -166010 -356611 -51754 33290 -50883 106190 155007 -44082 -339428 257938
9571A99685b21426E6691c75696E9919b41203J06018n2813r8147M1157K324A13849
$$ 199685 -221426 56691 -375696 59919 -241203 -135185 -187998 -286145 -244988 -242664 113849
9559h5627H8376a50232B03330K4644A06587k8415a56435g8149l11861i6574R262
$$ -85627 88376 -150232 203330 227974 106587 78172 -156435 -78149 -390010 -96574 -87312
9548h7312H2374a77038H9667b52865B11787o3971B799K5926a92977b7712j33548
$$ -87312 82374 -177038 89667 -252865 211787 147816 2799 28725 -192977 -27712 -161260
9537a61260j53616D885a06017A90598A1794J00969c6294A579J93076a10969a7047
$$ -161260 -314876 4885 -106017 190598 11794 112763 -36294 1579 194655 -110969 -17047
9525i2365k1088F2335a55223B1684c94048f6846j13177D68369A0263a74546f8660
$$ -92365 -113453 62335 -155223 21684 -394048 -66846 -180023 468369 10263 -174546 -68660
9513D7570a57729G7626g663p9887D5503c72835H6979a09317j35214G1147a11650
$$ 47570 -157729 77626 -7663 -87550 45503 -372835 86979 -109317 -244531 71147 -111650
9501c18903a46201A1598a07058j45717A58612a29802I8362g2035A12293l5602
$$ -318903 -146201 11598 -107058 -252775 158612 -129802 98362 -72035 112293 76691
9491G6691c03574a23989e0812A07486a27335k0384A43853i4704p3661B284i7109
$$ 76691 -303574 -123989 -50812 107486 -127335 -147719 143853 -94704 -168365 2284 -97109
9479a26977r3420D3464b1465A33859h7396H5406a42562G2810a85189j0904H7603
$$ -126977 -220397 43464 -21465 133859 -87396 85406 -142562 72810 -185189 -196093 87603
9467b48043h8086k84642b9796j34229n4655A45636e6635k5755j36101m8059C1934
$$ -248043 -88086 -372728 -29796 -164025 -218680 145636 -56635 -82390 -218491 -266550 31934
9455b2427A6762K15746j2309r0439D70K80538c1683k4743l89360R4821a51351
$$ -22427 16762 232508 220199 129760 470 281008 -31683 -56426 -445786 -350965 -151351
9443b29495a09490r6998A80451b10016f4676l27085J03019F5516L9963b20082
$$ -229495 -109490 -206488 180451 -210016 -64676 -391761 -288742 65516 105479 -220082
9432b66983R1896A36333c7807C949L42332F5037b71770A46132J22223a76268C12989
$$ -266983 -175087 136333 -37807 3949 346281 65037 -271770 146132 268355 -176268 312989
9420E4747a06844j88160a30986C1431d9466i552j56416j28922C76463f3203A86310
$$ 54747 -106844 -295004 -130986 31431 -49466 -9552 -165968 -294890 376463 -63203 186310
9408b9206j36792j54171A37058l491n3961b09674A70682a17735j06636f7243o9696
$$ -29206 -165998 -320169 137058 133567 79606 -209674 170682 -117735 -224371 -67243 -136939
9397a36939q1668B84998a95932A43428c06742P4127C7117i3979A9364J0105c56763
$$ -136939 -218607 284998 -195932 143428 -306742 -232615 37117 -93979 19364 29469 -356763
9385h2043D0763Q1281c5577J3630k5686A99970k826m610b24092A87O0726a81905
$$ -82043 40763 122044 -35577 -21947 -47633 199970 197144 192534 -224092 187 60913 -181905
9372a52092j51540i8050A3628P3919a34316m6869E8101b57293J03726B2560o154
$$ -152092 -303632 -98050 13628 87547 -134316 -181185 58101 -257293 -153567 22560 16406
9361A6406a15621k17599m302A45177g9919o3226l53253D2479a42223M442O716
$$ 16406 -115621 -333220 -337522 145177 -79919 -143145 -496398 42479 -142223 -137781 -131065
9350a31065b5345q671A35479J20323c00986b1985j85101q554L8119Q5594k35662
$$ -131065 -25345 -34016 135479 255802 -300986 -21985 -207086 -215640 -177521 -91927 -327589
9339c27589l0782a52193j03755A39589b13838f3251K3035m03299b15281E9495
$$ -327589 -358371 -152193 -255948 139589 -213838 -63251 -40216 -443515 -215281 59495
9328a2235I3275f5976E4025b45831I7704a4590E9126k9027O0889l5063J99668
$$ -12235 93275 -65976 54025 -245831 97704 -14590 59126 30099 90988 55925 255593
9317B55593c33709F4652c05603a1332F7639j3615e599G2927a69345b2065D5645
$$ 255593 -333709 64652 -305603 -11332 67639 54024 -5599 72927 -169345 -22065 45645
9305a98841N9733F850K34145i4897k17564j70078A05917b55210B0725J06384b86894
$$ -198841 -139108 6850 240995 -94897 -312461 -482539 105917 -255210 20725 127109 -286894
9293a76973B59866h1741b0808r1785j44484B9094a52144g5838n1098k9491H0523
$$ -176973 259866 -81741 -20808 -112593 -257077 29094 -152144 -75838 -126936 -156427 80523
9281A05492c0945j38878K5365B27305D2471a08673j13099Q0478A39249c2656j54096
$$ 105492 -30945 -169823 -144458 227305 42471 -108673 -221772 -141294 139249 -32656 -186752
9270a86752j91789J17544N5750C1630b5089A94979h2362a0884F9607L87017b00390
$$ -186752 -378541 -260997 -205247 31630 -25089 194979 -82362 -10884 69607 456624 -200390
9258i4294H7582b24425D2J85741f6813B5930A594a40942A15092n3809a85839e9833
$$ -94294 87582 -224425 42 185783 -66813 25930 1594 -140942 115092 61283 -185839 -59833
9245a68897a9277B95591a09917I1025J06208E469K83305e6134j22235B1532M3604
$$ -168897 -19277 295591 -109917 91025 197233 5469 288774 -56134 -178369 21532 65136
9234F5136M9930m2621l2980N2106i8175b0904k0192j0658j4141p6061k78047A7835
$$ 65136 115066 72445 39465 91571 -98175 -20904 -41096 -51754 -65895 -141956 -420003 17835
9221G67a48492e7989A89864f735o8027G8012a12207A25416b76593i7504k17075
$$ 767 -148492 -57989 189864 -6735 -74762 78012 -112207 125416 -276593 -97504 -314579
9210c14579a8252A61093a87072m5412A47116a29641o6921d4885D500a17888k0184
$$ -314579 -18252 161093 -187072 -232484 147116 -129641 -196562 -44885 4500 -117888 -138072
9199a38072r8672j01765a00299K4840H5285b3636j36779d5571j23637l38240a25675
$$ -138072 -236744 -338509 -100299 -75459 85285 -23636 -160415 -45571 -169208 -507448 -125675
9187b19244g2349k0797q0761f8310j59221I5928C4296a21787A91682r2927b99715
$$ -219244 -72349 -93146 -173907 -68310 -227531 95928 34296 -121787 191682 98755 -299715
9175b78269I7530m7464f3792C67942c05909A23915K12969f6113A13534b6305B32148
$$ -278269 97530 50066 -63792 367942 -305909 123915 336884 -66113 113534 -26305 232148
9163C6640a17903j23839f5405A05056P5735B7828M35954G292R1767q96k2853C168
$$ 36640 -117903 -241742 -65405 105056 180791 27828 463782 7292 99059 98163 75310 3168
9150A18294d32572C8958a20406A66914d17032a092l52288C4896a58517E074J50655
$$ 118294 -432572 38958 -120406 166914 -417032 -1092 -353380 34896 -158517 5074 155729
9139A55729a77995l7408H232R8421I3K06159a12956k5943O1510j5057A59953c2906
$$ 155729 -177995 -215403 8232 106653 93 206252 -112956 -138899 -77389 -92446 159953 -32906
9126b5724k55748Q1297D33293a42463j40076J26622A96241F5642k9920i4898L6678
$$ -25724 -281472 -200175 433293 -142463 -282539 -155917 196241 65642 35722 -94898 -58220
9115e8220l91144a03524q8395M2511j24886p2212D4165L8059f0024j48797F1880
$$ -58220 -449364 -103524 -191919 -149408 -274294 -346506 44165 82224 -60024 -208821 61880
9103A58001a14041L2481p8370j24456b1411k75204H5301a54110p2353A46745a94884
$$ 158001 -114041 -81560 -159930 -284386 -21411 -296615 85301 -154110 -226463 146745 -194884
9091h7754j10546d4466m0646c5774j28539A13131c47950e4320D90433b19850Q9013
$$ -87754 -198300 -44466 -85112 -35774 -164313 113131 -347950 -54320 490433 -219850 -130837
9080a30837A01757b3478F3485a31441B18248f1244r3380M5865e3176E6110K06370
$$ -130837 101757 -23478 63485 -131441 218248 -61244 -154624 -108759 -53176 56110 262480
9069B62480c46191a67545O3532G453c28630A67090h3171l87488K03949B16900
$$ 262480 -346191 -167545 -104013 7453 -328630 167090 -83171 -470659 -266710 216900
9058B14896b46243G9064i2243I2214h2897m9537q6942i0084k00735r2440P8044
$$ 214896 -246243 79064 -92243 92214 -82897 -132434 -219376 -90084 -290819 -383259 -305215
9047c05215f5224D3602a07341A86254b25169A27412a22795e2742A59212C7274
$$ -305215 -65224 43602 -107341 186254 -225169 127412 -122795 -52742 159212 37274
9036e1030F691c3661B98690A21226b02284A4815R137J1072J13863a02599d881
$$ -51030 6691 -33661 298690 121226 -202284 14815 23952 35024 148887 -102599 -4881
9024A62371a9411m18708g2647l20775A39165D6142b2800H5717a98546Q9776A63632
$$ 162371 -19411 -438119 -72647 -393422 139165 46142 -22800 85717 -198546 -108770 163632
9012c27324b5011k33608A12405k0336b51553G086i4925k26069a51947j65148a45329
$$ -327324 -25011 -258619 112405 92069 -251553 7086 -94925 -320994 -151947 -317095 -145329
9000b01598J1968a71l36980J61187A18857M2969e1272j6335A67875C0500J05871
$$ -201598 -189630 -171 -337151 -175964 118857 161826 -51272 -67607 167875 30500 136371
8989A36371B7697e5547l3014A51691i0625k11276A02363l4315H616d7781D19273
$$ 136371 27697 -55547 -88561 151691 -90625 -301901 102363 68048 8616 -47781 419273
8977E548e2843A43310g8165p4874A52877J36777b76086a170k60989J12291B79768
$$ 5548 -52843 143310 -78165 -153039 152877 289654 -276086 -1170 -262159 -149868 279768
8965B29888a66204j0562q5817Q8293l8865A7078O2767a08829O1J8889j9643p338
$$ 229888 -166204 -176766 -262583 -174290 -213155 17078 79845 -108829 -108768 -89879 -109522 -116860
8953a16860j47400L7059A29647p632b21820j40593B72930a82835A24282d69613
$$ -116860 -264260 -227201 129647 122015 -221820 -362413 272930 -182835 124282 -469613
8942b12330K9402N3788A47837A7784e3368D3283J99071J01109e8347j26377d9145
$$ -212330 -182928 -129140 147837 17784 -53368 43283 242354 343463 -58347 -184724 -49145
8930B63067b1751J0707A30070n0621L54669L89770Q13691L422182O445256l18848
$$ 263067 -21751 -11044 130070 79449 434118 823888 1637579 5059761 11505017 11186169
8920A1186169B598755H77761m36724B05938J92553a35034A36033h6972A42240
$$ 11186169 2598755 877761 441037 205938 398491 -135034 136033 -86972 142240
8910a58104B39981P6639n3975B0706J03832m7847b09998J2533j0001R8913j20698
$$ -158104 239981 316620 262645 20706 124538 76691 -209998 -197465 -207466 -108553 -229251
8899b29251B49332A10654a62963k86691a42712H8543a24470r6018N8873C23762
$$ -229251 249332 110654 -162963 -449654 -142712 88543 -124470 -220488 -161615 323762
8888b8616E718K08103N1922b16829j49628B21652g9822k39776a15295f110n38
$$ -28616 5718 213821 265743 -216829 -366457 221652 -79822 -319598 -115295 -6110 -6648
8877f648p6631j86896f3036A09970a19951H4431b11434A86204b17448i3805c64
$$ -6648 -83279 -270175 -63036 109970 -119951 84431 -211434 186204 -217448 -93805 -364
8865e3207k49534A46271J60211a17275J2061J2688o0047j59875F5910b09870C9079
$$ -53207 -302741 146271 306482 -117275 -105214 -92526 -152573 -312448 65910 -209870 39079
$$ [...]
##END NTUPLES=NMR SPECTRUM
##END=
