
##TITLE=AC1376_CRIAH12188_7519012_AIMBLYGeKM
##JCAMPDX= 6.0         $$ Bruker NMR JCAMP-DX V2.0
##DATA TYPE= NMR SPECTRUM
##DATA CLASS= NTUPLES
##ORIGIN= BRUKER
##OWNER= Administrator
$$ 1.72 TOPSPIN		Version 2.1
$$ 2013-02-20 22:10:24.036 -0500  Administrator@X
$$ Compression mode = diff/dup
##.OBSERVE FREQUENCY= 400.02188249412
##.OBSERVE NUCLEUS= ^1H
##.ACQUISITION MODE= SIMULTANEOUS (DQD)
##.ACQUISITION SCHEME= undefined
##.AVERAGES= 8
##.DIGITISER RES= 22
##SPECTROMETER/DATA SYSTEM= spect
##.PULSE SEQUENCE= zg30
##.SOLVENT NAME= COFFEE_meoh
##.SHIFT REFERENCE= INTERNAL, COFFEE_meoh, 1, 14.98509
##AUDIT TRAIL= $$ (NUMBER, WHEN, WHO, WHERE, PROCESS, VERSION, WHAT)
$$ ##TITLE= Audit trail, TOPSPIN		Version 2.1
$$ ##JCAMPDX= 5.01
$$ ##ORIGIN= Bruker BioSpin GmbH
$$ ##OWNER= Administrator
$$ $$ E:\/data/COFFEE/nmr/AC1376_CRIAH12188_7519012_AIMBLYGeKM/10/pdata/1/auditp.txt
$$ ##AUDIT TRAIL=  $$ (NUMBER, WHEN, WHO, WHERE, PROCESS, VERSION, WHAT)
(   1,<2013-02-20 22:10:15.786 -0500>,<Administrator>,<X>,<go>,<TOPSPIN 2.1>,
      <created by zg
	started at 2013-02-20 22:09:09.302 -0500,
	POWCHK enabled, PULCHK disabled,
       configuration hash MD5:
       86 BA 57 50 F2 9D 5C 9B 26 00 A9 28 5F 66 2E 89
       data hash MD5: 64K
       E7 7F 1E F4 54 EE 0F FB E3 22 45 97 8A D3 84 AA>)
(   2,<2013-02-20 22:10:18.896 -0500>,<Administrator>,<X>,<proc1d>,<TOPSPIN 2.1>,
      <Start of raw data processing
       efp LB = 0 FT_mod = 6 PKNL = 1 PHC0 = 0 PHC1 = 0 SI = 32K 
       data hash MD5: 32K
       5C B1 FB 0B 1C 49 8F 97 6F C6 69 F4 C8 EF 39 FF>)
(   3,<2013-02-20 22:10:19.396 -0500>,<Administrator>,<X>,<proc1d>,<TOPSPIN 2.1>,
      <pk PHC0 = 71.16394 PHC1 = 0 
       data hash MD5: 32K
       58 74 5C BA 30 07 48 E3 14 76 32 EF 81 3A D3 02>)
(   4,<2013-02-20 22:10:19.646 -0500>,<Administrator>,<X>,<proc1d>,<TOPSPIN 2.1>,
      <abs ABSG = 1 
       data hash MD5: 32K
       A4 1A 5C F2 4F 09 37 71 1F 23 58 81 F2 9D A8 C6>)
(   5,<2013-02-20 22:10:19.786 -0500>,<Administrator>,<X>,<proc1d>,<TOPSPIN 2.1>,
      <abs ABSG = 2 
       data hash MD5: 32K
       6C 05 94 65 4A BD B2 76 F5 B6 E0 63 4D AC DE 78>)
(   6,<2013-02-20 22:10:19.927 -0500>,<Administrator>,<X>,<proc1d>,<TOPSPIN 2.1>,
      <abs ABSG = 3 
       data hash MD5: 32K
       E9 56 23 DC 03 FC 58 0D B0 F7 2B 86 0C B5 46 38>)
(   7,<2013-02-20 22:10:20.067 -0500>,<Administrator>,<X>,<proc1d>,<TOPSPIN 2.1>,
      <abs ABSG = 4 
       data hash MD5: 32K
       24 94 80 AD 24 65 E5 8D A8 48 F0 E1 8F 74 86 DB>)
(   8,<2013-02-20 22:10:20.271 -0500>,<Administrator>,<X>,<proc1d>,<TOPSPIN 2.1>,
      <abs ABSG = 5 
       data hash MD5: 32K
       78 94 E0 A4 5A 50 A8 6A BD A3 86 45 0E 7C 18 94>)
$$ ##END=
$$ 
$$ $$ hash MD5
$$ $$ BE 9B 7D 12 97 FB F9 5F 49 58 32 32 37 73 03 6A
##$RELAX= 
##$RELAX= 
##$RELAX= 
##$RELAX= 
##$RELAX= 
##$RELAX= 
##$RELAX= 
$$ Bruker specific parameters
$$ --------------------------
##$DU= <E:\>
##$EXPNO= 10
##$NAME= <AC1376_CRIAH12188_7519012_AIMBLYGeKM>
$$ [...]
##$TP= (0..7)
150 150 150 150 150 150 150 150
##$TP07= 0
##$TPNAME0= <>
##$TPNAME1= <>
##$TPNAME2= <>
##$TPNAME3= <>
##$TPNAME4= <>
##$TPNAME5= <>
##$TPNAME6= <>
##$TPNAME7= <>
##$TPOAL= (0..7)
0.5 0.5 0.5 0.5 0.5 0.5 0.5 0.5
##$TPOFFS= (0..7)
0 0 0 0 0 0 0 0
##$TUNHIN= 0
##$TUNHOUT= 0
##$TUNXOUT= 0
##$USERA1= <user>
##$USERA2= <user>
##$USERA3= <user>
##$USERA4= <user>
##$USERA5= <user>
##$V9= 5
##$VALIST= <valist>
##$VCLIST= <CCCCCCCCCCCCCCC>
##$VD= 0
##$VDLIST= <DDDDDDDDDDDDDDD>
##$VPLIST= <PPPPPPPPPPPPPPP>
##$VTLIST= <TTTTTTTTTTTTTTT>
##$WBST= 1024
##$WBSW= 4
##$XGAIN= (0..3)
0 0 0 0
##$XL= 0
##$YL= 0
##$YMAX_a= 514975
##$YMIN_a= -514495
##$ZGOPTNS= <>
##$ZL1= 120
##$ZL2= 120
##$ZL3= 120
##$ZL4= 120
##$ABSF1= 14.98509
##$ABSF2= -5.573092
##$ABSG= 5
##$ABSL= 3
##$ALPHA= 0
##$AQORDER= 0
##$ASSFAC= 0
##$ASSFACI= 0
##$ASSFACX= 0
##$ASSWID= 0
##$AUNMP= <proc_prof1d_extract_pilot.lims>
##$AXLEFT= 0
##$AXNAME= <>
##$AXNUC= <1H>
##$AXRIGHT= 0
##$AXTYPE= 0
##$AXUNIT= <>
##$AZFE= 0.1
##$AZFW= 0.1
##$BCFW= 0
##$BC_mod= 0
##$BYTORDP= 0
##$COROFFS= 0
##$CY= 15
##$DATMOD= 1
##$DC= 0
##$DFILT= <>
##$DTYPP= 0
##$F1P= 0
##$F2P= 0
##$FCOR= 0.5
##$FTSIZE= 32768
##$FT_mod= 6
##$GAMMA= 0
##$GB= 0
##$INTBC= 1
##$INTSCL= 1
##$ISEN= 128
##$LB= 0
##$LEV0= 0
##$LPBIN= 0
##$MAXI= 10000
##$MC2= 0
##$MEAN= 0
##$ME_mod= 0
##$MI= 0
##$NCOEF= 0
##$NC_proc= -8
##$NLEV= 6
##$NOISF1= 0
##$NOISF2= 0
##$NSP= 0
##$NTH_PI= 0
##$NZP= 0
##$OFFSET= 14.98509
##$PC= 1
##$PHC0= 71.16394
##$PHC1= 0
##$PH_mod= 1
##$PKNL= yes
##$PPARMOD= 0
##$PPDIAG= 0
##$PPIPTYP= 0
##$PPMPNUM= 2147483647
##$PPRESOL= 1
##$PSCAL= 4
##$PSIGN= 0
##$PYNMP= <proc.py>
##$REVERSE= no
##$SF= 400.02
##$SI= 32768
##$SIGF1= 0
##$SIGF2= 0
##$SINO= 400
##$SIOLD= 32768
##$SPECTYP= <>
##$SREGLST= <1H.CDCl3>
##$SSB= 0
##$STSI= 32768
##$STSR= 0
##$SW_p= 8223.68421052631
##$SYMM= 0
##$S_DEV= 0
##$TDeff= 65536
##$TDoff= 0
##$TI= <>
##$TILT= no
##$TM1= 0
##$TM2= 0
##$TOPLEV= 0
##$USERP1= <user>
##$USERP2= <user>
##$USERP3= <user>
##$USERP4= <user>
##$USERP5= <user>
##$WDW= 1
##$XDIM= 32768
##$YMAX_p= 460058760
##$YMIN_p= -747485
##$CURPLOT= <Network HP LaserJet P1505>
##$CURPRIN= <$Network HP LaserJet P1505>
##$DFORMAT= <normdp>
##$LAYOUT= <+/1D_H.xwp>
##$LFORMAT= <normlp>
##$PFORMAT= <normpl>
##$SURQMSG= 1
$$ End of Bruker specific parameters
$$ ---------------------------------
##NTUPLES= NMR SPECTRUM
##VAR_NAME=  FREQUENCY,     SPECTRUM/REAL,   SPECTRUM/IMAG
##SYMBOL=    X,             R,               I
##VAR_TYPE=  INDEPENDENT,   DEPENDENT,       DEPENDENT
##VAR_FORM=  AFFN,          ASDF,            ASDF
##VAR_DIM=   32768,         32768,           32768
##UNITS=     HZ,            ARBITRARY UNITS, ARBITRARY UNITS
##FACTOR=    0.250966925370066, 1,           1
##FIRST=     8223.43324360094, 182054,       -105691
##LAST=      0,             -50136,          -1296
##MIN=       0,             -747485,         0
##MAX=       8223.43324360094, 460058760,    0
$$ Real data points
##PAGE= N=1
##DATA TABLE= (X++(R..R)), XYDATA
$$ [...]
23873 -357853 42821 269186 283014 -224272 -144485 30638 -341916 44217 75204 359868 42458
23861 281232 -203969 -374439 221182 -230102 154824 4352 -50585 94079 148718 357051
23851 357051 -68249 -235891 -102322 -110179 123294 24959 -79994 -191077 -22167 -365044 103344
23839 -13386 -6815 -115399 -283735 -264601 -60966 299969 -136927 135938 168158 -377454 -336704
23828 -336704 -132461 79817 92954 -87206 150821 -281731 -65000 156 35114 226670 245537
23817 245537 -329085 571 81122 19643 36831 -198577 75826 15006 -66434 34440 -167112
23805 19232 -11458 -172652 -245480 -67756 -135188 -118408 245634 -2883 89075 68793 -199932
23793 -5162 169479 26699 131555 -2046 87537 204291 -123117 225276 -354758 36550 -6784
23781 -71787 260137 27272 -224140 170070 -33884 -276701 -346444 -115082 -302359 34836
23770 28822 9753 302780 -302548 -126097 -232564 31798 -179936 135274 15684 12550 -37881
23758 78291 -239562 -237766 98069 -41579 71060 -69624 -337461 -151740 -150388 -190132 -23037
23746 -158900 220662 -101017 -204443 81383 199143 -68734 -73308 -112814 103393 -281495
23735 -4878 318605 251271 -78682 52041 -53734 136780 -26663 -193263 -135092 81367 -195654
23723 114097 -50281 -335084 89910 -78757 -113201 -235812 -312315 -19774 149747 20540 -236106
23711 -211228 -159269 110869 221526 -18805 5117 -373387 5848 -134713 93746 106830 356352
23700 356352 227884 -62969 118311 -104661 30610 60690 -320999 -205381 410732 -144101
23689 249255 -69671 -174550 -206988 -243729 -51939 157578 -70807 -101797 159034 85034 -73572
23677 346881 70803 -43155 82667 195116 -40251 275085 19465 158802 340619 -44353 80164
23665 167742 260133 -24468 -30163 -10801 -109139 25052 2992 -45581 -70746 59085 39072 -66129
23652 -118796 226485 -125898 -89458 195537 324663 190136 71249 -221758 178283 -142642
23641 -80619 25650 -13273 160437 169858 -204239 218429 66427 156150 -125279 253214 -96235
23629 -194752 -260449 19288 143846 152376 -267117 -61655 -25530 -319327 147660 -165058 181230
23617 -80889 -44771 260022 -1099 -287619 -102594 100583 -168815 -75284 -142556 -172146 -40355
23605 -161073 155599 38052 112681 -59271 -5901 137726 -312551 381587 -38502 -75087 63144
23593 93173 246304 33671 5672 -96423 -158124 395624 193658 -195470 167486 -23005 42010
23581 -117505 -189515 -91193 161082 -242425 61562 245723 -265160 -122865 72836 250160
23571 250160 115189 -117137 -254888 64083 -270163 -40848 50400 193917 75052 -172024
23560 -148088 -311477 -106905 107001 380386 -22814 -100631 156229 -236964 -429578 -187949
23549 357254 180174 -305868 77015 121104 -129877 -114892 -120621 28054 -79573 296262 -35617
23537 -85520 44507 340144 -27160 -93231 -24195 707 72981 23556 111308 123461 147929 -125795
23524 -19522 -140329 -54729 -138310 -482857 79955 37018 -84530 -84150 -41814 45491 52303 28376
23512 28376 -44923 89054 -69963 1480 -472737 -82947 31531 -84733 -266616 -27548 54164
23500 -80250 -67019 -177026 340695 5620 -311950 91048 -225448 121481 -126343 -92878 81592
23488 -119491 113666 169299 56700 -136472 -84291 186247 -41690 -29625 121623 80918 237349
23477 237349 -26816 -263385 -139977 210479 100349 141291 81302 -214575 -67755 -9681 -229664
23466 -229664 -320773 -155700 -256647 -28442 212495 -259025 -88761 84513 -241477 95879
23455 -45115 -269556 -199089 178278 -53741 11574 56874 59294 -14213 -223469 -170877 -251991
23444 -251991 149695 63216 81778 -265748 80719 2101 -164965 254822 108276 -151422
23433 -76126 -84379 91759 -68512 -113059 -144980 36528 -108810 -126758 -101852 34086 -335031
23421 214638 150758 88825 349293 140806 189706 166077 6258 1762 -70545 149081 -199919
23409 -169977 382897 -133946 -305742 248292 -121413 120964 -65814 198048 -82136 -246143
23399 -246143 181542 -38693 188402 -218885 91249 -140124 -232585 384745 -183709 162768
23388 -114629 221946 70024 112165 -187157 106993 -247002 294215 1304 133377 -104957
23377 -61631 -178119 -172907 110005 -54403 -105421 -96098 -101770 127503 -252671 223849 47016
23365 -142288 -97696 -53360 -102834 375218 -55978 67531 247780 190244 -37530 108232 -142513
23353 -32887 -223233 -26459 -155816 51880 296688 157816 214398 -32080 -148025 -157498 139100
23341 -67084 82461 123512 97470 -143881 98321 63153 -3148 -51585 215060 -93903 -295952
23330 -295952 47352 -150351 117934 -25239 -185097 -12133 -204954 -133833 -184661 97289 431538
23319 431538 40749 42888 -58642 77464 -71040 68497 92603 -70944 266443 52204 -126718
23307 -131398 -50137 -68530 106348 -60767 199331 -508067 45316 -34953 -149001 211067
23296 172002 -14746 -40016 -75647 65773 -181451 -238876 44375 -43980 -5138 224632 -195216
23284 298652 -186620 517254 59608 -93796 109551 142787 35902 236876 244064 -515535 279212
23272 143547 -7943 -59960 -174593 -155517 -99941 -41488 -251207 -169249 -175588 102522 90613
23261 90613 53201 118908 -24083 85582 114346 72278 38726 233320 61513 -166208 202303
23249 100342 10149 -69021 -105395 152299 -76212 -34840 -250535 -235304 290592 -307311 -44985
23237 -48411 -24899 -165444 -40887 -33438 -73444 -151346 233817 -156887 157686 -113330 77924
23225 -366324 -39693 -25889 -224629 213005 127208 209555 -29741 -576049 2972 99174 -49651
23213 -119297 66865 -244938 82333 167012 13112 68908 -180420 -195863 -15415 -73542 104057
23201 -215799 20712 9589 20040 144579 -64029 -235460 -125213 4346 -169073 405683 -218116
23189 -120926 -190784 -58530 -520152 37185 -77971 -290584 -330632 -112534 68856 -176314 -42727
23177 -145446 -246394 133055 108162 -83147 120685 -211406 235166 -49028 -130199 223103
23166 -21374 -35979 117563 -171400 135278 6855 -65377 47281 139554 -133608 -123234 -202356
23155 -202356 184981 2318 -7118 176826 -151681 80746 -182710 107858 207224 -178873 -45055
23143 -212369 40618 -276221 -68036 6093 -77792 11107 -245102 -128998 72664 -23674 43987
23131 71098 -77566 239790 139090 -291593 -1940 1328 -144929 224306 299393 -138505 125332
23119 39015 51918 52436 349598 -156916 9470 178021 -113604 -23093 -341132 -237664 -62130
23107 -129043 229579 195871 -253661 105208 -8429 -161583 -57173 -120264 41184 227119 -5755
23095 -154072 -34179 354495 213446 -143091 83179 -298186 -181263 200334 244538 249302
23085 249302 -154699 30344 70549 167645 124982 13321 29741 37017 -13736 -25506 -17216 -121134
23073 -121134 230957 90132 -237693 -113044 -99233 156664 -185055 60304 -351910 -131117
23062 -278936 -133016 232932 -73622 413194 -118472 22125 126327 -30356 248420 -133919
23051 -70359 -319836 -23158 57109 81468 -94475 270492 -122017 14513 4431 59060 -118662
23039 188524 122914 317697 278782 6621 -180124 17893 -201471 58900 75955 -76209 147407
23027 75250 44658 -266390 188922 194758 -68076 -91827 45256 257845 -159904 78601 -249892
23015 237166 241185 -18662 -68742 -92676 -401705 66096 -4406 -92585 -137321 91891 21030 -64801
23002 -151596 -372782 -18841 -33629 -186095 -138471 -241282 -145629 -51679 -30262 221941 -88919
22990 167914 41965 221744 4671 62152 -465941 43654 -67931 -36773 156470 -340620 79904
22978 152557 -55205 6046 71384 328539 -188923 -210986 138362 66761 -273446 43796 -396468
22966 26509 -49085 335860 185140 -7156 11922 -150534 -25633 139847 135450 217619 -172813
22954 142774 -118504 220313 70807 -112793 -234848 -131454 -129720 5493 372340 -172791
22943 -517029 129857 -72798 62161 221500 -300700 314178 -89554 1742 -142611 290223
22932 62684 -10402 155031 66788 -33174 131955 -271173 -186012 3850 -275374 -83352 21133
22920 32097 -67028 155389 281277 45936 138878 -6744 -68704 -175029 -227548 -168182 -94476
22909 -94476 14892 -30366 -252300 -236195 -31755 -53879 -342650 167456 -6646 -168012 57260
22897 -37140 191040 4778 75063 128107 -178736 -331881 173654 348843 -247130 -346111 -154661
22885 -131669 193767 -96633 -111454 -182285 -96322 -46904 27708 74477 -84181 -127086 -324175
22874 -324175 -214188 -18945 -162711 -159181 155268 -248910 -297337 -103389 -18423 30391 -127417
22862 -341484 101989 -28534 -332898 -57747 -111863 100748 -226646 -157016 -28168 -244665
22852 -244665 73607 -167530 -297450 -140912 77507 -127542 -119060 88074 -284438 74942 -242557
22840 99849 192617 -100838 -26321 46702 -61952 -141443 -94401 114280 -33162 32466 230296
22829 230296 -170626 -169135 105835 53987 -253125 222851 -284273 145309 -62061 -54933 -316946
22818 -316946 161985 198842 -64380 224994 277387 70307 367632 65572 164710 -352534 -7752
22806 333539 -241128 144331 56014 177012 56562 -96095 12717 42340 74894 148553 -140317
22794 159726 -123530 154825 -117851 19527 -352624 -133567 10309 32770 215586 190950
22784 190950 -255232 -425392 1474 87079 -190177 169251 -241572 -219524 -89971 149946
22773 261943 -303701 -9087 -2747 133541 -113054 69562 -653499 -23199 2665 -94188 -319308
22762 -319308 -84871 108795 -71996 118483 -12506 341732 -288336 15453 -46191 81846 -233930
22750 161521 85308 81951 -17071 -24209 -341864 6763 -184194 -172707 154137 -232698 273415
22738 -165374 -167361 78400 153684 100036 -13638 53662 319964 95636 215270 -14029 155170
22726 -53724 148369 -291579 -121826 -191176 -186229 -289746 -212020 -147267 171995 -54875 -177117
22715 -177117 174126 171140 107241 -249207 -282717 -92102 10545 58931 276356 -253692 -428678
22704 -428678 18495 -21906 236245 -185063 -16416 36484 -13119 27434 38583 33468 35859
22693 35859 133295 59437 -58972 -238334 -136626 138131 53378 -101504 11640 -132528 -26496
22681 -162434 44892 41628 -90316 97204 421560 99305 -36270 230663 -256302 67687 -200961
22669 -3830 -152036 100929 -331266 -30870 -278643 -19673 183904 -105666 -51238 -9712 -13680
22658 -13680 -216254 -260975 125243 -131403 255950 62344 -320819 68063 -96998 -81498 -161448
22647 -161448 -127728 -174135 234746 39445 113873 40289 -124298 -217250 -370485 -111649 -202866
22636 -202866 -93388 -388052 -37729 -151349 339442 98568 16234 173773 147809 59225 80013
22625 80013 77926 77801 -243094 218155 -322923 23973 200167 -29881 -43854 -38406 46273 113132
22613 113132 495942 71778 -127016 -12322 -54073 -112581 264519 -74908 -147354 -416454 42390
22601 90290 122273 149983 77028 -368462 -68223 10079 282556 -26092 -256857 358673 106162
22589 -10674 -254059 -138791 -93647 -116443 -69645 105563 258108 76373 -147229 -324406
22579 -324406 -36184 -67324 -203280 348071 -118305 116601 -157638 113272 -87894 -108240
22569 -108240 56216 -113516 7686 -115621 70208 -62548 261565 -81806 -15368 -253866 227993
22557 -242877 -251601 223770 187513 -102232 -60886 78596 -38215 -328605 -204690 -19244 -198319
22546 -198319 -65235 -229769 -290574 -23593 -64005 -123676 -19931 96102 6132 40829 -103448
22534 102281 -147253 -92281 -200973 -46909 -182744 -350004 -105181 174585 -40671 5568
22523 22877 -46257 116969 -207766 -164409 268375 -119433 -91377 187905 -340685 -126647
22512 20588 -179229 -119157 116867 -36001 -78108 251701 77431 245639 -395621 -101110
22501 116752 95202 -264323 -20054 -133278 264579 92308 -199714 61392 -153199 -396411
22491 -396411 -58781 -47774 -31608 62270 40839 42608 -298919 107677 218132 -232570 -261272
22480 -261272 60964 178151 -226052 313190 -181032 -172636 -73126 191049 30967 178927
22470 178927 -204446 222411 58318 25143 6749 243661 -97538 -231345 -187910 40805 -57009
22458 136502 146427 -85613 -198728 -254054 -17043 151204 -940 9740 16034 157525 199963 -401976
22445 44513 -284174 -107370 61717 89548 21293 -267035 197771 -152308 -344547 322997
22434 -11402 -127440 75099 367637 -83042 -168665 -23554 -61048 -111963 21301 94266 -310103
22422 132493 -106440 297060 -196025 -77542 96012 -100082 65069 162351 140658 -214791
22411 96904 -28885 41786 49985 -273030 -51463 -27292 -310967 23565 3834 -311699 -211314
22400 -211314 182072 122251 -194569 -293124 57223 -8982 -229112 -343624 -330359 -26515 40885
22388 153635 -5210 -68823 -8271 -96622 -61841 -154241 36199 -19281 -328713 205660 251213
22377 251213 -166213 -124184 -37344 66377 159336 185503 -399393 -402392 102759 201676 -99147
22365 -315288 -207671 58185 -140666 -1065 -295387 389508 233617 -64483 310101 -48933
22354 -103157 -199562 86444 80915 176768 59697 -191908 -33543 -54045 183325 89436 47254
22343 47254 97014 413083 204797 111481 -77865 12781 99925 -99311 292204 -80424 187569
22331 -278403 106889 177043 126590 111114 130950 122487 -34180 -91532 -244828 -398001 -181102
22319 157439 -176882 -216531 49486 -109749 -73033 -111048 -321213 -45067 211311 -100181
22308 -289828 -82730 27546 211224 252069 -319259 29515 -11532 110754 -72740 -227365 -25376
22296 -113534 176372 -81273 -165017 121333 -1598 -216021 -102219 162106 -163184 -95219
22286 -95219 108815 -165327 165870 -156630 -31598 -106606 -118886 8978 -81919 174694 -164752
22274 231530 -115172 44865 -108241 120543 6921 -234472 136526 225624 -195283 2950 259898
22263 259898 156576 -19450 -103907 -3814 -54993 -306969 -262483 -452329 25728 89104 -35839
22251 -87555 -117543 136501 44447 -496284 284601 -3840 -269469 -109200 79525 18006 -98962
22239 228041 -431116 -144745 -26313 135073 -286963 196350 -369416 242933 67370 -15547
22228 -204178 -34360 22334 -28535 -66316 30689 -52161 -89472 402488 -294670 -95307 318549
22216 -18734 -310740 -239162 -173674 -176266 299430 -157608 -121061 199756 -82183 -318129 -358735
22205 -358735 -226574 -135186 -176536 210724 -189824 55430 -162834 537240 -325785 -33911
22194 338786 -159937 151420 -97138 -161213 115263 -156807 61115 -167644 -135118 -99655
22184 -99655 -110476 -259523 -463473 -226368 136089 46417 45921 -170042 191026 -84499 -217082
22173 -217082 -178892 -100989 -11707 -621 -139838 -112735 -115991 -248441 128622 -131326 165303
22161 -32127 237998 26049 140956 -172091 -154262 265023 -298548 33227 80178 -13117 114257
22149 -23570 -331296 -262772 -210206 81781 29033 68998 -210302 157126 145580 16792 -389638
22137 -110927 -113089 -190991 70204 -14351 -301971 -6469 -197287 -223422 -156737 165709 -284872
22125 -234620 10941 -129052 213179 -82172 37331 131513 -33732 -189910 -61490 211043 -175805
22113 -75632 -108975 154917 -89494 87574 135573 -458472 -140582 76849 72385 -166366 64248
22101 -164573 205142 66828 230329 -247413 -104259 -118055 97902 -17011 34639 147713
22091 147713 56361 85618 142702 -155073 98645 121744 126583 -360391 62953 -183202 76882
22079 64040 -78024 100683 -45456 17426 -172074 306179 -253980 180520 -166800 30047
22068 -166858 -14861 8947 210936 -427655 -9963 14531 -108550 -158558 -49515 -193230 -146949
22057 -146949 -430933 -47134 -43695 -130450 -20729 73366 -72329 -116144 -38213 -17613 -28653
22046 -28653 13533 -355257 -311376 -251041 159800 81032 -153514 -7082 -205303 -82745 -353991
22035 -353991 -60686 -119828 -336406 -279108 -2264 122174 -250764 -91070 10550 -148359 -200219
22024 -200219 -50653 53083 -202277 68645 -18745 70229 102777 -30898 -129980 56001 110992
22013 110992 134186 176966 63384 206050 93195 105031 -64165 -322460 183911 -103295 -278097
22002 -278097 -69558 53408 88909 55776 -111564 -116311 114975 -405297 -138158 87437 204990
21991 204990 -46723 339028 -52232 384911 63215 -80572 -192550 32904 188615 -532588
21980 214099 -69814 -6893 -206434 -64209 -14816 53306 -179303 -282106 238891 -186843 -20699
21968 -14750 81405 -43110 -165033 181146 -239115 121017 -187827 -33972 123602 -33139
21957 77701 30542 -203441 -102062 -55158 32155 -119074 -67456 -62755 -57747 313104 139144
21945 -23589 -21641 -59755 290484 123570 -1090 -278707 150964 198295 49553 78487 -311852
21933 152761 21817 82904 72435 -215540 -75576 -112428 -373012 121467 141137 -8620 112500
21921 118727 88439 -29351 107442 324372 169041 -107284 -217249 -25131 29309 69004
21911 69004 -50195 4910 24457 117633 47337 -296009 -65857 147648 -87787 -58806 132151
21899 -184481 39282 129796 70341 -96082 -195598 -465591 -285203 -82405 122188 -311177 48376
21887 -347336 -147195 -204671 -78305 18999 162902 332266 118596 -85566 -313624 19087
21876 41658 227757 -101491 49446 -136411 65014 -216895 -5805 60198 -4596 -78633 128127
21864 -72965 108450 -65675 83122 -105027 -188138 68562 175866 98570 145630 -300164 125015
21852 37230 -82872 -31220 -215078 132780 -283931 67315 15147 -198524 -331039 -102067
21841 48718 -282832 -234108 77481 129587 132799 75523 -112709 -194784 -154466 123729 -17841
21829 193342 185619 -219427 95370 -173079 -70694 -38091 -83441 203499 -81271 -258337 273974
21817 140869 -128317 78405 -139605 -231750 -90429 -64862 -117889 188128 150874 144115 -137903
21805 85515 -137480 34269 -268803 124392 24522 -118510 243284 -70590 -24503 -136849
21795 -136849 342077 -220644 56388 -15654 263940 -48276 -172076 254465 142317 20912
21784 -23611 129058 -17703 12825 87119 289844 -66797 237297 174386 -66562 -9044 -129665
21773 -129665 -194841 187382 77791 -115258 -88497 -58593 -176308 -188111 -125531 -265574 -135284
21762 -135284 122285 -184112 71623 -299232 221577 193156 -341875 72134 219589 -356423
21751 -190855 -132213 134236 -406884 23992 -68178 238036 -159870 105418 -41055 2803 -165670
21739 215345 -166083 -100626 29874 -190946 58084 -94839 -308095 -74457 -290291 -241730 -236806
21728 -236806 -120615 3795 59918 127895 -40282 33884 -27781 -54664 -296383 -71325 -86909
21717 -86909 43211 83923 -169332 -150177 -343295 176860 -133936 -155030 -64987 -210056 209554
21705 -18038 -195108 -143553 41238 101337 -116904 345997 -76311 -58605 170395 23349 -200834
21693 -137111 -157001 -303732 61422 42963 5188 -234449 -26264 5443 226292 -222720 117464
21681 -236947 -69573 82879 -161353 20926 -139468 -307494 -40743 61790 -63027 149470 -26819
21669 145474 -68225 -283850 -74155 256093 -399649 -74669 81156 137209 16663 -27022 167265
21657 262884 107575 -121945 142290 -246972 -41594 99246 -23176 185911 60877 -218541
21646 167248 -45835 -47616 198006 -199136 24210 -285775 221311 -64922 -252833 -111478
21635 -196955 -36377 235590 215071 -166034 -158809 126180 -162801 130357 66658 -38565 -200523
21624 -200523 -101453 -99811 -200233 44926 -83321 85062 246558 -152137 73915 4825 -86774
21612 60617 94831 2657 -227573 -364728 -64154 41860 225203 -276396 -196840 -42991 176599
21600 -228606 -209196 144812 36355 -160132 281854 80830 -159018 60846 3180 -51796 289331
21588 -113457 -28568 317576 -110326 134823 -3404 -287945 8630 18687 -115767 48332 126906
21577 126906 122905 -181672 -92469 -165789 -147720 51408 56768 93049 40317 -10737 -141991
21566 -141991 -180048 -80915 225454 -16848 -104539 5224 261610 -429537 90225 -272402 -178932
21555 -178932 -169964 323192 23981 33432 -180980 201562 5425 152254 317419 -114189 82179
21543 109013 -583 -28425 129203 -62702 -21286 -110381 -204700 -161383 -26123 226888 -36684
21531 187868 -55499 39423 -234887 61423 -76166 151549 245133 -53585 10315 -178858 -159083
21520 -159083 175611 -451222 -83257 -341707 234185 -116952 16143 30520 -12349 -129180
21510 -129180 -129420 174649 56258 235345 -42406 196344 9787 -230469 -18389 129373 -454898
21498 -95352 -257850 -441736 -166157 -53456 -275132 -63540 112471 277500 -119064 402006
21487 -37455 97924 -189942 -79615 49817 -90887 -229249 -38572 -317500 -18127 -233307 -201022
21476 -201022 95408 -94154 -37427 -297007 334170 561 230765 -202505 161029 -534620 -341558
21465 -341558 -99361 -202710 61524 -77219 -105794 -104876 -161554 139913 -4530 185423 -96717
21453 -315412 -59742 -134923 133352 46264 -45661 109918 -65642 -193603 -152323 -85046 -73586
21442 -73586 -23270 367620 218521 319078 70210 338097 208142 376979 421721 -25541
21431 -162792 -173669 385761 -43196 -64766 245405 -49360 -148815 -117039 -14845 -40286 91421
21419 -205822 -128009 -78749 -85826 -531732 -15955 -237494 9182 -114241 80290 113369 80081
21408 80081 -306751 -203996 -81364 -54945 265989 -107856 -200502 -256319 -323938 -424678 47425
21396 50009 69466 83473 162376 -52537 93466 163867 -167498 249192 168515 54357 282649
21385 282649 91010 71117 33106 -29263 -31854 -59754 -467768 -356177 14423 -156490 -104363
21374 -104363 -150864 -284333 -77431 107809 -207658 139050 207117 -281107 -58937 -158428
21364 -158428 -131032 -296020 -148538 -114266 169125 277794 -19746 -61932 138505 -13126
21353 -211778 -56140 19007 -322812 -127307 -118809 -92627 192564 99088 43717 -290883 -295529
21342 -295529 187511 44437 -123364 45391 128417 -178597 -260550 214550 -125578 -31359
21331 35869 281372 194109 -80098 172447 -94470 -397709 -127233 -242011 198511 -196525
21320 -67197 96256 -124985 -151639 -122437 -74353 -460489 -4789 -206013 166407 58981 -371138
21308 89754 -5191 -171762 -334497 71038 -19127 -138473 203521 -234692 -9773 -44213 -17832
21296 -38218 -40479 -236895 -231270 -7021 120262 -16910 181558 270086 2493 -88791 62691 -148129
21283 62058 176740 12283 163738 -264061 -7643 -32457 111515 -249373 -178085 418201 -54830
21271 -94122 376861 -265183 65792 -342024 -33557 -203037 -289126 -268020 105281 167444 22148
21259 52102 -650279 -146232 -121607 -89592 -272143 -198285 -234217 -72123 -103352 -305693 -142839
21247 335676 -38443 67000 -52782 -136556 -330355 -15707 -117460 -143051 -97284 113892 15491
21235 -265099 260797 249528 26258 -8359 -136834 17987 72784 -124874 -65700 94488 -187780
21223 30419 124808 197666 72732 -238170 -186155 -206154 -292379 -146381 -79309 -67824 245460
21211 -23674 -267975 -349280 -282742 -60877 -98067 221647 -66158 -180935 -17138 -47439 -112961
21200 -112961 30562 51254 -171014 -120804 19607 -19750 -225705 -4372 304422 -15187 74323
21188 86968 -184610 -129508 -213997 35788 35802 -18573 124080 226948 39589 -271477 -15967
21176 208443 -59554 -66934 -185254 305902 180508 -302352 67878 -19552 -63808 46266 -258840
21164 -294349 -3318 -231628 -303071 30068 -136118 -137318 166274 -135490 -358346 -55121 6643
21152 223957 42354 67044 -74399 -1898 -80655 130763 -70569 -294631 43336 210175 -103979
21140 -46911 -227390 156593 -44183 -168623 229003 42009 -383835 -396602 -148452 271073
21129 113666 329143 232722 11258 13865 -54268 -287660 77175 128183 -206110 -77527 -31207
21117 21758 22300 89669 -41459 -24659 21590 -103847 -185229 69784 -133352 -182479 -147938 -380899
21105 -380899 -137353 98702 -313899 83629 -10038 -75045 142036 -45376 -5334 -203335 -87007
21093 23928 83132 -111709 -195478 -253010 74089 -82095 -63532 -190283 142602 -144962 -122939
21082 -122939 144409 -284705 115360 -48333 -14060 19786 67069 53265 -206887 56442 63298
21071 63298 32728 162364 210334 -209947 213989 122061 -56565 -14800 -361148 -56635 -187364
21060 -187364 -6966 85779 91037 333068 -163452 220040 -25757 -235946 310324 -223860 -61949
21048 -5294 13531 96265 -52422 -102597 168464 -434181 -647712 65408 19401 -152768 153556
21036 -10654 -173476 212640 120246 -38416 12329 -47554 -129044 -122411 154360 77156 -221685
21024 -176301 17454 -204871 -108851 45406 302063 -153162 117702 123424 190420 -141557 -2181
21012 83225 -487185 -113301 373664 -83978 -424284 -301934 35522 -99828 53675 171284
21002 171284 -123833 32049 -207675 123713 25886 102376 -104645 -306449 64788 -44228
20991 108660 -138964 -41738 -205437 102897 199952 179964 -243379 -103223 -268218 128244
20980 318474 133686 25222 -245995 -61761 -477190 -222195 -172751 70652 -423315 -208725
20969 313307 -305203 156305 -216099 -34500 37083 -48998 -109707 144272 -24083 -123113 -201807
20958 -201807 -132992 -58973 -264236 -173816 -230997 -195113 -258779 78815 257900 -64910 -5063
20946 -190764 -179131 68966 25237 -95931 -249960 -86232 -18697 167292 -198037 190668 -155164
20934 135243 45737 45190 -18224 -147667 297349 103949 114504 -80295 -321776 -248811 -12819
20922 -373597 -265828 17044 316430 -245813 33326 207429 -246384 -59795 53898 -189788
20911 -77823 -176679 80457 -252662 -109916 2776 143118 -26893 30439 127231 -2872 -132466
20900 -132466 -21361 97109 83868 179074 -8305 -100183 -89810 20193 -258658 64604 -147819
20888 30331 200649 -167303 -267706 -141225 67042 68997 85108 -327968 -70169 -186517 69590
20876 206633 -21035 -124326 -97753 212463 -131269 -132439 79007 -84770 162993 -109020 -27533
20864 -109233 56380 -189823 -78613 340995 42406 -102717 -115352 -381212 -59542 177874
20853 60780 117678 -47251 -173984 -8809 -131658 -315699 -224211 -77827 -74643 -178421 8057
20841 51288 -747485 177851 273498 142538 84695 -106115 -258669 -394662 -238826 88446
20830 -131401 392911 -136501 -61283 -371534 -23581 63988 -75648 160478 -39562 -177771
20820 -177771 201718 -39404 -150043 -163976 -118560 539052 51433 -89723 264843 -204876
20809 33454 -44446 120870 -349844 81977 -334065 -146931 12215 96813 85753 -73051 -237073
20798 -237073 45555 -161822 -262622 157491 -117666 -50318 69225 9260 135551 -62913 -201575
20787 -201575 -91218 -188075 -499161 -63945 48646 45959 283461 -59208 1301 248207 -173714
20775 15022 2580 61237 127102 -344615 -65595 -7436 -108206 257354 95564 192547 -134535
20763 -11814 -195174 -264721 -27178 21331 168545 -224973 -421186 -69432 -244670 -387587
20753 -387587 18780 -315530 38261 -13778 66609 -71227 -11152 50246 -144763 -301203 498183
20741 -84305 -48777 253489 -306042 -391389 -379446 297110 -148046 280058 -85889 -68024 -90498
20730 -90498 -203037 -254938 -312291 35765 29460 -177710 -8505 132653 260529 -34908 53339
20718 -267987 -140058 -63542 -174107 -102461 168514 278690 216919 -49222 62471 -164572
20707 -74830 -168778 11930 -230917 -8769 -53406 -89825 -99869 -258322 220592 -132872 158059
20695 -153777 -75786 130338 19850 -109715 100651 -162803 102735 -72741 -158588 -107189
20685 -107189 199531 -424509 315120 85295 112294 -37048 6449 -96648 -339683 -214110 -209606
20674 -209606 -3943 -110706 -39633 -133102 32726 92530 -112510 -134447 -210236 -129519 -266568
20663 -266568 -41244 -114438 -180790 -228992 150244 -68586 -91113 -73654 44301 -334881 -129466
20651 10818 -149437 20897 61356 -90657 138306 109334 -73067 29028 67271 249505 40900
20639 -49488 -211501 -326885 15284 -63054 -171973 46983 -244514 -69866 78490 46972 -147668
20627 -143985 -135979 -270664 76259 52928 -299561 -30086 -54778 -87141 -59394 63605 45668
20616 45668 -142048 96794 67385 -95765 -10894 -37796 -228936 -88134 -4660 -85849 41337
20604 -52928 335558 -32677 49505 -378398 122574 93228 6668 -53859 184197 24902 -127620
20592 27872 14566 -218997 151864 -185301 -210401 99563 195917 42394 16903 -71880 216413
20580 -49693 -160107 108287 304395 -150198 -65181 -49995 -77122 99257 161801 -102849 -319025
20569 -319025 -139941 -174725 -20507 -107860 84613 73714 -199042 -109825 -183969 -385102 36525
20557 -151786 -19860 64146 -162191 -85023 -150294 -171161 112228 13617 132341 -34201 -340216
20546 -340216 20844 -19284 209353 -107104 11214 -232546 -183347 154441 245663 21115 257923
20535 257923 -71617 103500 15226 -100115 222680 -147157 122286 -186619 -180830 101412
20524 -113770 18285 -101932 -233508 235671 146247 -622 -125935 -53730 -337717 -152020 -216860
20513 -216860 257203 191155 36593 99755 -242473 84259 -375321 -317262 179962 -146186
20502 106989 99503 62690 611 -221983 -31476 -264381 -70818 168256 241011 223940 -198145
20490 -224228 -17706 157001 -156613 -175946 93189 -112174 -308595 61694 -163514 -228799
20480 -228799 247657 -308498 88605 -257854 180900 -150302 39211 -40156 -80829 -215277
20470 -215277 -197197 -90021 179149 152072 54204 287189 -269093 18012 76708 -51622 -63350
20459 -63350 -163716 -86466 -133725 101713 252076 64033 202811 213029 -20151 -216869 -141629
20448 -141629 93371 -308633 69480 -292332 -61075 -168736 184106 -18123 -426178 -51551
20437 -153545 9083 -13782 -215305 220020 77841 -47391 -161485 29794 9992 48144 6719
20425 -349835 4399 -97140 73941 412976 208460 96762 205125 -110491 -77999 6805 -118745
20413 -189751 -243059 -127862 -225651 19769 -147589 -127695 -209845 -12652 -148016 105998 -230487
20401 -67787 -230170 125597 18631 -184722 -65079 -108081 89164 -428304 -192583 59460 -248449
20389 -355199 -129556 79387 70989 45403 79990 332862 271732 -142966 -155863 65810 -191608
20377 207636 -62352 -47912 -189961 -50473 -413462 -64980 -373625 49221 -124340 -111596 -32339
20365 -34705 -191102 -280351 124924 -144673 -187341 110224 53854 -200394 -58247 92298 -50448
20353 229901 -428683 -203647 77032 89346 98593 -214401 125538 -399499 -178494 -21571
20342 62921 -114300 78396 -174481 99870 -121910 24886 -292537 -36222 167511 12763 104175
20331 104175 -517166 -373550 -267112 -155990 601 106216 -16106 -124764 -7618 162920 -49363
20319 -32297 -54643 -461046 -209373 245222 -77737 -89860 107748 223361 -132610 40040
20308 28387 -120855 10239 -247650 6704 -88626 97663 -198737 -175172 -226850 -170479 11690
20296 -59326 81876 299990 -185793 -252469 -51641 -171413 -130748 -153560 -173542 352030 -132810
20284 69018 -103755 -33369 222073 16970 -244402 -264721 -28114 -8117 -80249 80583 -100165
20272 215774 23906 -152272 153056 48538 -5391 -143565 317585 73031 -11704 10860 103206
20261 103206 24006 -291276 -296402 126744 69642 158691 72823 -391106 -100085 -257541 -26520
20249 -81873 -194822 197477 190393 -139342 -234426 -129164 -173678 93252 -247748 -99419 49739
20237 -149527 -63288 4155 -211065 81287 40846 -76328 -110075 -81236 -260497 65963 -162493
20225 146035 17005 -102663 83435 82436 -138038 -15480 381528 -19777 -192162 90850 51158
20214 51158 -380058 -43514 -100365 124629 -17338 -310485 -77474 162715 -111854 -164162 -254461
20203 -254461 135849 -243307 291135 68939 -133640 23658 -249064 -311642 -26668 11876
20192 -99234 -381198 -18474 -181395 295766 28045 -88001 -329862 -41273 -168228 -12983 101633
20180 36604 -135625 32665 -308155 -177371 -177730 -172623 167152 123925 -199607 -7352 -264198
20169 -264198 -185838 -133147 249681 -92680 105836 57670 -544316 51248 18345 418029 -272147
20157 -14547 132735 -118780 25976 -357825 -2456 179417 -494675 -40264 38182 -465769 154739
20145 -138579 30181 97144 -80486 -253074 116820 -69673 244632 -120380 113500 -260840
20134 287171 -154120 63747 -33197 -56025 -18848 -42235 -233024 -162570 199412 -228281 -169259
20123 -169259 -144486 -47587 -226762 109352 64198 -245183 -17967 -233756 -218387 -199413 -248011
20112 -248011 -72016 95123 -153671 -76708 284257 113873 -446416 85190 240954 63983
20101 110137 -15976 -96673 261996 -25169 -14878 103583 145703 -276249 -273988 -142966 -152196
20090 -152196 -285364 -322439 -105231 114401 139382 -131793 -193205 -326337 -106830 -95155
20080 -95155 -91455 -28424 -40252 -313156 105931 15513 -123254 -221344 142607 203868 283622
20069 283622 -54152 -221512 -68637 184268 -366049 -13919 294803 -145349 70610 176958
20059 176958 -182023 161763 -11411 -77759 -135852 -174681 38074 -89324 166645 -280582 -172396
20048 -172396 58084 -148524 104565 -58597 37596 190218 463025 150043 -222530 10576
20037 -215318 90195 -127413 -245262 -134140 -92189 -121668 -168582 -140305 -14669 -190588 64359
20025 -29750 256070 -88341 -41575 -557959 -16463 -163993 -128264 29972 -139242 -94915 -338421
20014 -338421 -367706 28150 -2158 -42167 28158 -53574 326489 -307832 76012 -37969 -137735
20003 -137735 15956 -347032 141208 -30183 -200170 -95432 38830 -67080 136845 -46496 -80632
19992 -80632 107629 -125521 -37168 -4975 -128453 -2037 100649 -183858 77780 164876 -28577
19980 -81097 122377 48725 -288009 -91159 -10455 -143349 47508 -239466 -97379 -267078 79784
19968 102122 -1703 -47163 -186721 18996 -38327 -68570 -204170 -308322 -138395 -1275 -186559
19957 -186559 260698 -49017 258503 345608 57890 -15819 -230853 -180813 -215535 -241351 -288057
19946 -288057 322604 73857 238356 -115273 -192169 44112 52837 112551 206749 -28997 90780
19934 -182650 -134788 -103636 -244199 12604 55922 -183164 -245915 -108752 -102565 -192072 86457
19922 -69765 -186425 -140104 -215524 9509 192998 -150821 140824 -69309 -49244 69798 63805
19911 63805 70727 -154434 84810 -460755 -308844 85015 -259786 -311894 8414 -87967 -88611 -252816
19899 -252816 -187183 63161 -557424 -134100 -331133 -355396 -74113 186657 106905 178157 366694
19888 366694 37858 215276 -361268 -60990 142932 46221 -42028 27282 -138551 -846 -195973
19877 -195973 390885 157242 41546 41836 -114966 77563 158111 49528 129792 47606 -8390
19865 -3700 -107488 -72072 117871 -122296 -212061 118578 -14412 -214307 122361 -370106
19854 110384 -294618 27521 47690 113248 -101587 -291523 -335782 -165476 -421811 -80324
19843 -84892 -59260 -249725 128882 -257077 -112276 60385 11204 -191839 -318115 381590
19832 -37115 147461 141330 -214160 -74534 -129584 -142572 -268497 -263641 -100403 46031 195193
19821 195193 -18160 -226152 258295 -241758 -280670 168445 -65565 -174034 41176 184614
19811 184614 -212662 -119865 -21583 64160 -444751 118097 -57746 -143607 -215922 -152877 -43851
19799 113482 87951 66850 77507 -151601 -67213 96924 290007 191981 -82163 -64004 -5182
19787 -200575 192510 -289102 -46528 -121926 76786 126656 -72674 -130095 -96315 -281923 40620
19775 -203006 -152600 -26140 116297 -160538 133896 237607 -225077 213680 1289 207078
19765 207078 -20961 40344 -208349 41160 -140002 40683 280 -167943 -512026 36498 17513
19753 175822 35233 2025 -102729 -247099 -405036 15855 -330422 19446 -261517 -237249 -142555
19742 -142555 24531 -86122 34284 10790 -105577 -105096 210854 -24758 31811 -162533 -294538
19731 -294538 140913 -61888 216278 -243129 113141 -122641 -154671 299992 6202 -290417
19720 55570 -21086 -203705 86227 81220 -286084 246852 -138435 205845 -128645 171180
19709 -341503 74816 -453401 237301 140021 -106180 -354637 -49076 -240761 -132270 -394657
19699 -394657 -176778 -90746 -148865 -92701 22087 154950 208078 -113633 -219788 172997
19688 62050 86507 -104212 -208498 -233598 -424300 -136681 -275515 -103527 118416 155904
19678 155904 178311 -156435 -116212 -470640 157328 -160670 5621 -63993 -4973 9169 -259193
19666 298788 41656 113533 93011 27935 37560 -172822 69782 -71618 -240528 -133183 -183134
19655 -183134 -64336 -103673 -14344 222259 32598 -153089 532 207455 47823 6506 -294798
19643 -48338 -136682 249927 101895 -241632 -13773 -135453 79174 -50826 -381356 -162818
19632 39393 -8662 42259 181898 172051 -160121 -194127 -133894 -88574 143478 -193138 -155629
19621 -155629 90471 -21583 -30218 20665 256171 53222 -205569 200390 -276039 -494703 -423221
19610 -423221 39621 100963 -151283 -97935 820 -204825 -268131 112725 -56940 -42955 -170698
19599 -170698 -174786 -382169 57952 -83949 -181574 -140067 -154966 -165967 316335 -170315 -10489
19587 -240587 -179296 180216 5354 123266 -295055 -57887 -32250 144710 36407 524983 81965
19575 151976 66223 -238202 -83489 -211306 131112 -104754 102821 -124916 -296219 -86688
19564 -149349 -310402 -117142 -347961 -15977 -9746 124374 -311836 -119388 17534 273856
19554 273856 -33372 -152663 29073 55480 -107068 128938 -39179 132762 -38586 -31428 222206
19542 63881 221911 86069 -344869 -306519 36001 39498 115132 -33195 193122 -246138 -133759
19531 -133759 84407 -106927 280142 437154 336631 72488 -205171 -65636 -70109 223187
19520 -55447 -7382 427702 -124388 301879 -117786 -40549 -143569 -100655 -85118 -105533 -183273
19509 -183273 303302 -11627 -183247 31334 -185464 215813 100887 -160567 163737 -349408
19498 301703 55126 -168611 -163138 -246171 242794 110062 -33892 -291035 100807 11603 -101958
19486 58539 88482 -285828 -1129 -37916 -192898 -29239 91271 -278588 -160915 200030 270128
19475 270128 132631 -188920 187420 -110003 82400 -127713 149827 7434 -140821 -155612
19465 -155612 -62118 -215201 -280428 -184115 120438 193645 -64717 -260618 -150290 -21871 -203529
19454 -203529 45905 -406635 -264655 73322 -223463 33082 -283952 -43795 169832 -254235
19443 -232743 163891 -124729 -228034 -31735 47294 5425 202863 -112086 -118773 3012 -227110
19431 -289329 201855 1526 -111180 -196758 -192196 -70342 -176799 -179879 75494 -142533 -71715
19420 -71715 -177473 -16698 16624 -485360 184569 -183070 56180 -121856 23686 -119618
19409 -158121 -77039 -103766 -1508 271316 -116745 42952 -11252 9491 -172255 212673 27164
19397 32970 -68810 -279332 155144 29359 20059 -87312 -88762 77290 -161551 -26003 4968 -250474
19384 -198280 -65461 32896 -51747 -293677 154968 -134446 -271846 -30066 -218635 190841
19373 72232 -120800 -279530 -198338 88389 131826 290016 -149776 -3574 46086 235665 -260573
19361 181659 304775 -91015 -341698 -388683 -204332 -157919 334501 360345 -175156 57769
19350 -164514 -47512 -217956 -20073 -152891 -163489 135986 -134951 -212520 66333 14281 -64592
19338 -246986 -2759 -260566 -112263 -207277 -18930 177141 -175573 9310 82274 386223 136262
19326 18686 63032 -355949 137501 -32730 100160 -110820 -8712 107343 -88516 -188038 33163
19314 -265003 -3861 -4353 -2629 -41848 126910 292641 -152066 -333407 -92297 50112 -318161
19302 -129066 -361814 -57772 23175 -127532 -54312 -117577 -325227 -118624 -63640 -153575 -114698
19291 -114698 -160329 -75785 -231909 172466 -250081 -47566 -321499 -43168 33421 -178491
19280 -353781 -450616 -76252 10625 170620 -73512 287444 -140704 286341 147458 -254579
19269 -24865 -272276 44818 19502 34979 -33962 63873 111105 -61338 192385 149790 71616
19257 63787 -216834 -15169 -161254 166333 52764 -22831 -52001 -79400 138900 96667 -94194
19245 277448 8168 182117 2207 30480 -195480 24160 -147523 -130836 -253615 -222448 -73959
19233 123763 72898 -35770 -115580 -19375 -258903 -159930 -23112 -95349 101567 -433891 280276
19221 19269 41861 103383 -109891 -97434 -332049 97412 -147317 117641 24190 -18764 -136983
19210 -136983 -40890 -267630 -185177 -58003 115668 -65457 220970 209516 -22582 49403 -57709
19198 -134949 25932 -11554 148960 97225 225798 163929 -15124 -122409 58681 77750 86392
19187 86392 -93131 -214809 76149 -120930 -39918 -254704 -189203 -112294 -116301 -47323 -61036
19176 -61036 -42755 -157359 177500 48180 -174340 50902 79409 229940 -264630 -138821
19166 -138821 364607 -188540 -89318 72561 42291 -186260 -215086 -207428 -110744 -154355 -33954
19154 -210359 181644 97294 -107537 -473538 -12426 -569 -158996 -279770 80341 162777 -1332
19142 -40188 -352164 -29656 254707 131615 32657 -66422 -15465 -199127 149626 171847 -352891
19130 -379150 112502 72475 -117076 90565 7458 244 -114058 236162 112228 -135402 -1894
19118 -4268 -163924 -153491 -59531 189793 -75603 -122382 18943 -73642 40957 -3517 63640 113229
19106 113229 149806 -52662 95197 -54546 85883 -183215 38769 -294120 -258051 11153 64696
19095 64696 131706 -187194 -122476 -85464 156264 287535 39805 -82883 -152895 50041 105597
19084 105597 -203174 209091 112091 -170475 123757 -32582 -154775 -70099 -73008 -208686
19074 -208686 -96639 -106411 -170313 -22544 -97466 -129335 -343361 -333377 -65710 -23838 -127231
19063 -127231 17095 -46101 139120 332502 -123269 138630 -145256 -149967 -43493 95623 -50464
19051 -116349 -364485 -136140 113487 174321 -6744 38055 4053 -128547 -25086 202504 -633980
19039 -180146 -224202 -54806 158480 298164 10813 -57440 -90026 -15668 110773 -229595 -284471
19028 -284471 70051 97124 210606 -235080 154935 158638 62234 29097 -143889 -356582 155331
19016 -394450 343801 63643 86171 -292430 289482 -12211 5360 309978 -101771 -362833
19006 -362833 -96495 -434801 -141287 -592098 -179137 -73231 -215547 19561 -123686 -79442
18996 -79442 -79188 145195 83525 -229083 -145031 -93282 73210 178737 -55179 60631 -121134
18984 -247959 42097 -142500 -147811 -105983 21888 -232304 135838 -5847 -252596 16965 -16272
18972 68213 -12150 256122 180677 -215634 -128024 75665 -152312 -159509 -69692 -163577 -73629
18960 17522 -330688 53033 -184441 408532 -43930 12247 -124040 94882 57779 30182 -65980
18948 6690 -145321 164063 291858 115940 -66514 -215381 22278 -35735 -209396 -164200 59681
18936 23749 233906 13830 36474 -343252 -340820 148312 -57524 29424 -97120 -235727 260041
18924 54238 41698 215754 274049 -105979 284214 -173713 201331 -257701 -235699 -326676
18914 -326676 -169955 -24239 -90485 6846 -361012 -114235 357362 -98881 105927 -126701
18903 -28943 -25564 301550 11652 258009 -5438 351007 136498 -82353 -71869 -87993 -43176
18891 -315581 -220254 -89159 -14401 110358 239699 -98626 23776 -232282 43983 -410174 -56450
18879 -181237 -146681 30444 69717 23325 103224 7118 -98297 -324063 330218 81429 95409
18868 95409 129553 106124 30265 74077 134383 31590 -83238 -57604 233083 123188 23652
18856 -27884 -18650 7684 129767 -92450 72495 277359 -201169 239826 -274822 146592 171280
18845 171280 -17462 65745 226391 -226145 -155070 -21796 109833 -141271 -329811 130306
18834 -136288 -192732 182078 142937 83677 -79048 -144934 -387171 -330759 88467 -258131 -168029
18823 -168029 36714 -140640 227311 -59236 176761 98404 285069 49375 33329 -55996 -184522
18812 -184522 188669 73473 6618 -17988 -59084 31226 -118073 -190554 -18990 -59092 -171323
18801 -171323 263561 -204755 161279 200585 -184403 -332977 -4746 -96887 -161835 240236
18790 -342475 -164997 -45272 -220601 -480686 -88348 19275 216995 125433 64533 -115491
18779 -37846 -106805 -341284 -57646 -38626 -110714 282487 -173050 -8361 18090 -8071 -66838
18768 -66838 -35175 -139880 -62039 -140450 -348778 -66176 -260326 -220928 -89183 -117839 -228645
18757 -228645 244386 125085 223837 56805 -43703 -318685 -416794 -387707 -320767 -55062 17982
18745 -199629 -348560 -315205 -196763 -107842 -156931 -35055 39922 -7722 64655 30104 -152025
18733 236699 -76311 85143 340878 395948 -108062 89351 -97840 -41377 -227543 484 -65262
18721 150941 -169325 21267 -210062 -43618 -77944 82375 83844 -211396 -30960 298952 -7728
18709 -40184 10574 -14508 17503 -60923 -97043 -196814 373683 132608 -49239 111974 126153
18698 126153 95495 -101369 -184442 -14322 -11738 8371 -233242 144982 165722 90082 41535
18686 98280 -146793 -178580 115386 13691 -62617 -84172 -207584 -168472 -177522 207191 -67522
18674 -349587 -250835 -183547 -198113 76270 -16438 -318491 101049 -33665 -131468 25544 -15821
18662 -79882 -186394 -44547 71969 -267456 -221559 -280680 -205268 82292 110893 -201164 -38672
18650 -133273 85360 -83186 -74157 -97 -84300 164603 -19802 -77960 -42507 77100 62370 154508
18638 154508 -413028 307069 39873 -51353 -94401 -151878 -149863 -229556 163101 -127277 64868
18626 -191572 -94432 67425 -112001 507 -233916 -110086 -45293 52736 -97946 -141460 -1909
18614 -392914 17108 -3362 -132338 -446519 -31951 112225 -228626 -68784 -62316 232355 -257001
18602 -11229 -64244 -79495 -729 160301 254098 -200975 -106069 72344 80638 -217191 -124999 -13215
18589 19008 -109573 87803 29322 -250170 -85668 195821 -202979 -274516 16743 172318 313051
18578 313051 24780 328343 -253008 132364 -106049 -85480 12055 -117335 -77621 -334348
18568 -334348 -260176 194624 -224061 351813 -23599 -106992 29178 -178690 -92125 54592 -34634
18556 109879 -201586 -135451 80640 -243308 -77213 60777 -68932 -251663 106640 -180416
18545 -77971 -109101 82505 223185 118390 -115921 66592 136146 -8228 76703 -201764 -124268
18534 -124268 -116437 30642 -604612 6457 -36663 41143 -150496 -223921 -145157 -261845 137229
18522 -223443 206271 77384 -21346 267228 -365827 -172504 278055 70438 118406 -186738
18511 -410264 -137262 -298427 -252953 87905 -15843 -78706 -54714 -67967 -169754 185671 95487
18500 95487 -171765 179328 -290632 68194 3855 -159664 -98796 -75015 -389537 -140637 84684
18488 -243912 -158831 248318 -232982 19000 -198179 -53731 -178346 -140489 -212194 -92525 -131135
18477 -131135 -104243 -69929 199169 -127033 -32767 207356 165067 -196691 166816 108907
18467 108907 -229835 -104392 142169 -391277 -259397 62668 -302161 -272281 -111596 -218957
18457 -218957 -289406 -1142 11779 -183577 29913 -295541 240044 -281839 232225 42743 -81221
18445 6242 106280 -30076 -146186 -123724 37510 14599 27433 323801 187795 -150235 -146299
18434 -146299 -41166 -430184 -111230 87464 -350883 106320 135914 75583 13820 161963
18424 161963 78327 -64933 -164769 23292 35710 -320121 -146510 74936 393534 -207863 -246499
18413 -246499 72472 88748 -80838 -98452 7857 -9469 -122127 -184844 203466 203442 213057 -49610
18400 179594 215830 34939 49207 -26999 -4099 -21352 -23315 132146 72147 -84043 -71227 -144240
18388 -144240 177841 -167766 55351 -68181 37793 132525 -19684 401632 -107186 52769 -361939
18376 150938 -107032 53520 -376992 -177484 141672 -29193 -322283 -29206 164599 -217953
18365 52365 -53783 -150096 -38892 -28459 34639 -169828 -87757 378937 214648 -175252 -76283
18353 -73235 -86307 -55245 239486 98389 -56515 -30580 75309 6285 -238807 -60965 -424532
18342 -424532 -118814 174022 -225110 -277706 40172 -147685 -40372 107353 -270698 -241160
18332 -241160 113806 -151003 -120 272110 -139285 -299724 85845 179440 -224057 76659 48539
18321 48539 83748 182915 33079 -437401 -206066 -241857 72599 24243 -194459 -191293 -10885
18309 -101387 -234654 255267 -229782 -85572 -195285 -148893 -215808 178194 -96910 -144008
18299 -144008 -49150 -166255 39195 -73090 -94872 -133768 70414 203401 35343 301648 57083
18287 -65839 54189 -207794 -155225 141603 -256318 253003 -63803 -249221 -52216 2786 23127
18276 23127 -120871 -123712 -163881 45836 359827 148575 200557 223209 63793 249046 -68952
18264 -379760 -52531 72703 38014 -249880 -91964 95296 -64637 -216373 -215217 -67332 -120661
18253 -120661 336251 -125748 -3574 65620 56966 -392777 -198732 220216 -77370 -176698 283626
18241 -50656 -27984 -244092 -164198 111451 -77909 19176 77897 168931 -115306 33366 38614
18230 38614 213617 272775 268748 136652 -16527 -105121 77601 -172738 -223423 -43940 -192611
18219 -192611 -110860 -208528 -115306 -49753 43930 2990 93868 17031 -78915 -44290 -199428
18208 -199428 -67416 -442972 -71042 84654 -107023 -319100 6407 -256755 -138871 166663
18197 -314115 -26049 -233644 -140705 19531 170593 -123308 -186557 -353396 -115036 -77990
18187 -77990 25208 36471 -28454 -385148 -242974 -55195 207575 -152435 25135 -239373 -96088
18175 144858 145392 47586 -67897 53497 -64665 38483 47504 101020 -73845 33621 -277193 -420454
18163 -420454 73824 155896 13940 -57038 -5392 -69480 244156 288403 -278549 -169482 -140186
18152 -140186 -300065 63916 -482488 145293 275984 64172 74659 -213991 -47918 -23830
18141 -150596 -141504 -73491 41506 267339 -106095 -151487 129494 -175216 94881 137752 585
18129 126057 -105341 242905 -18555 -154495 -193343 -10512 -104613 -68953 -63512 64085 -119179
18117 -3136 223719 -7668 80961 -40610 -251603 120621 -98106 -97004 57264 81172 -222036
18105 -111758 -109458 -50510 121712 5035 99725 -42611 -357783 277560 -81203 -124297 104450
18093 153331 -253467 72724 -198625 81961 -15009 -445578 346688 55903 75081 107947 -252537
18081 -235709 179609 115649 -676481 -150370 -71125 150351 174221 65483 106254 -539857
18070 382494 72868 -111051 -31897 51469 -120675 220444 79092 -231955 -177509 116083
18059 159526 -218205 -53281 342336 -174678 -15337 76345 -158460 123034 650431 120742
18048 -151423 -127364 -361330 6737 309333 -11628 200809 -274229 52586 67523 42891 -122748
18036 -136800 -128569 141267 271447 106273 177198 -139229 -27943 33225 -338267 -48782 343543
18024 56630 91883 -95255 154764 -216123 -4925 -228789 131820 -49335 -291800 -37486 213941
18012 -37803 323650 -37143 -122625 69281 140362 50429 70487 20422 180380 -73795 -113975
18001 -113975 -139555 -38334 30935 -187651 208030 -219737 -24063 89124 -294714 281994
17990 -66800 141294 -169395 -100837 24321 -157057 -66448 4072 -88085 -50994 -82739 36083
17978 354162 -3399 -237989 -9913 80192 -56069 -99211 29259 -225488 -190797 13785 -65026
17966 48334 54109 -480625 90213 51907 -43108 -99759 161498 -7875 -146154 -142196 89338 104349
17954 104349 -144560 -121079 92185 243514 -61010 -102832 -24342 250398 68914 154034 77647
17943 77647 31680 -218582 95709 -33306 -26329 60615 122143 -5149 301854 244660 -286641
17931 124386 124337 -411271 113373 107014 -128404 -7940 104523 88418 -195315 4500 44100 89887
17919 89887 339102 142685 -19242 -36683 -66946 96950 179944 349706 -254949 53343 192478
17908 192478 -190310 -253338 -150429 -59740 -318734 42862 -155574 7211 -37763 -229329 294774
17896 -1166 -19993 237499 289276 64552 292992 -357824 -406013 202758 5454 74032 -179073
17884 -55601 -25242 19187 -160168 132985 -49870 23712 33402 -36841 -42416 -9969 -113171 214467
17871 -304380 23326 -252274 -318956 -107659 78469 -186918 110066 -187597 -148955 -51809
17860 199625 -99469 -143445 13815 -103732 -127701 120693 43438 165521 -201409 -33020 41937
17848 162214 145891 -8607 49255 -20357 -95399 330630 -10982 339 110425 299410 284955
17837 284955 78385 18403 -102052 274798 160263 -33837 47286 -200154 170721 -106832
17826 70682 98672 -390531 -60995 -23522 -313562 237392 -124379 244002 20856 47839 48367
17815 48367 -9239 189967 255950 -74005 -224430 -127053 29893 -186480 -66679 106768 71603
17804 71603 -428704 436220 -215107 200735 -63740 48266 227528 84151 -91789 -157388 -55155
17792 10238 -163870 54654 220205 30761 -15058 -157872 158337 12782 -175802 271783
17781 43897 116302 41215 -36112 -56431 -136880 265490 -310777 77208 58370 -54079 214291
17769 153301 124215 -64095 182717 -136175 -42083 70337 61527 -214728 -314496 -224809 89844
17757 -154496 48168 -37450 -222698 -68658 -157646 64142 -18882 169224 -172845 -142473 12193
17745 -30536 -216601 -343208 -18472 -40062 95082 71641 -131056 -180695 30876 415608 15869
17733 -289044 -260660 -41922 -724 -31217 60850 -29064 11132 -40808 28363 -143650 391982
17721 143213 90809 255814 124294 8755 -13444 162772 -46017 343324 -132689 -116461 207931
17709 340801 119433 -3195 259170 -198057 97053 169839 -13493 -231224 160460 69027 -51441
17697 2249 264418 -24086 104251 7812 30076 -150077 -83658 201158 273546 -169476 69051
17685 -330650 -82381 -45983 258577 -130479 -28273 326473 -144755 155572 163347 157235 -92790
17673 51027 -352228 -15232 125043 -95633 238013 182209 -16032 6179 -34812 246390 -164294
17661 -37446 -5193 -132172 104822 -106884 -46078 47392 232556 -233682 -111988 -111605 82357
17649 45742 41056 -105029 -390179 -266990 -51038 416801 74305 16366 -263568 114705 95057
17638 95057 54226 -326678 -205668 81655 124518 200132 46390 58294 -55244 381133 -57966
17626 105894 104706 -14919 -83240 180623 -177052 126694 -112339 398042 288045 -66398
17615 136806 109433 180651 -138289 141206 -155325 -115070 -137696 286317 -180233 64108
17604 113674 -322702 106436 -67217 78443 -209543 35409 136469 -173165 163595 48854
17593 20278 358682 50259 351369 144536 -26732 226661 -285597 -45292 86025 -2841 -82735
17582 -82735 -99909 -362669 38480 -21128 77545 168707 -48308 159162 96542 41427 -139166
17570 -142188 -219710 41194 200482 311554 221121 -151670 81871 182091 -272591 -157202
17560 -157202 51921 -199882 -63146 220264 -86624 48267 515723 -58470 43085 -55127 52517
17548 -251926 111496 105116 24579 97432 37540 -57774 16106 73990 -53177 -106837 -138562
17537 -138562 252696 -6360 4304 48994 15852 -108289 451595 1573 -153442 79130 25106
17525 97616 185410 -276253 -64812 103389 -135360 14828 300642 329980 -35688 -122482 148934
17513 42697 86820 135776 -152686 -152730 38796 -90665 42460 74087 -94668 377063 29115 68586
17501 68586 -150865 188793 94883 46866 235977 226657 131444 280014 -38157 -57275 171219
17489 185148 162886 176577 112118 236417 29559 16038 -23093 127523 140131 -210514 -69302
17477 154504 -16803 112947 277047 -38392 -113641 -139855 8594 423130 137414 108974 -68738
17465 -14746 165891 -181524 147247 -232798 -20821 255201 111068 156538 195258 113092
17455 113092 -109742 234630 244388 -121414 119667 302819 -133366 335061 50154 291730
17445 291730 418666 96649 167705 267319 227512 61959 454177 446183 -20286 131306 425229
17434 425229 -135484 -7719 63316 162114 228309 562517 32343 278626 483149 551909 442496
17423 442496 249223 104036 314322 13600 190985 396673 116709 280869 258811 273945
17413 273945 441782 23403 85414 -99657 131479 44416 229767 51539 499341 -91973 216555
17401 134458 83311 -33253 27264 177635 100749 42265 127164 431342 158453 132422 230862
17390 230862 365252 120665 253821 148985 157661 115397 227783 276721 210252 88478 224037
17379 224037 247778 -115888 86236 -71411 84161 58915 117424 -50708 -55343 -34603 377291
17367 -53219 -22583 445856 158931 12316 127761 -36346 -263155 -23619 103415 -1023 76467
17355 108733 198426 259700 13661 -112296 8367 118483 175829 62835 85187 387084 -41529
17343 -143925 189671 188605 203550 228777 130544 126582 523831 -13046 98399 -137019 -175692
17332 -175692 62819 179450 49261 -333797 397892 3007 256326 -81528 -177923 216309 252115
17321 252115 -12630 -151623 117216 -74173 373109 -1238 56398 229723 196025 155876 159447
17310 159447 179936 87806 224532 221641 -9241 137552 293762 274068 333911 -135368 -12008
17298 244727 298628 -248397 74245 264424 36374 -208001 128950 283412 144595 240411
17288 240411 -7927 143850 40429 190310 319984 -119606 -59952 256436 377587 203153
17278 203153 320176 -178429 323947 -365829 188994 195708 264739 74647 -81128 304775
17267 233558 108839 123806 59673 244275 101038 181148 381439 27674 390279 102563
17256 271956 84144 433080 -64983 261829 114546 339244 -156953 58197 135544 277031
17246 277031 483997 -148871 318961 157768 309919 242469 167422 84224 223421 40184
17235 426380 151318 92433 306901 202271 77271 -78447 237774 -21093 124519 376417
17225 376417 7295 -7602 -40073 68822 -30764 266197 202599 -124743 178601 147915 249084
17214 249084 419971 363775 469314 235896 32118 70267 227647 205678 105404 163007
17204 163007 143346 246153 285532 61493 77808 240300 209994 39595 -151397 449086 128033
17192 181345 391087 326395 42203 104781 165808 -13256 -71646 63107 7376 384804 203558
17181 203558 271704 141297 186821 377277 -205845 291531 431236 397476 236090 208418
17171 208418 97965 425839 470419 -111686 420314 374360 254691 67155 -42223 377101
17160 181534 51144 96076 8512 201745 78141 199450 389701 328539 287541 -15290 547342
17148 196092 -60874 132488 420959 504448 347122 313099 188809 102815 189024 410785
17138 410785 231475 486598 194402 -54684 211915 509249 459248 531970 249223 224561
17128 224561 325340 500279 303785 470349 164943 520867 412719 98181 438746 268783
17118 268783 366880 84231 374902 391708 110210 369406 415713 132124 525054 195314
17107 199496 438631 70987 389307 430759 249077 513180 271283 -115908 141493 50416
17096 403796 388294 299475 -18585 548737 392413 108574 342017 70503 500008 264901
17086 264901 626013 389319 140978 402343 230846 404716 668856 264883 279374 409394
17076 409394 263409 360049 436042 122328 793209 323684 66362 554232 585843 196412
17065 596962 677070 609417 446125 541471 503053 245724 564789 584471 728781 865477
17055 865477 471485 329456 307348 611131 504456 296327 514561 547761 668177 518606
17045 518606 316043 490819 369848 452237 558158 661158 102265 367408 374011 546691
17035 546691 369765 269641 422046 458906 645013 489388 621145 557835 558830 408076
17025 408076 310595 684540 764962 495387 492441 420425 685761 646911 859052 345897 422830
17014 422830 669837 766707 223367 804047 522194 113878 519408 572063 463377 380606
17004 380606 417466 381341 665867 421468 516662 384109 733925 418616 538810 744246
16994 744246 533987 690029 539069 712114 685901 750835 943157 782907 939274 752992
16984 752992 613495 708951 967546 686725 826837 768809 599722 895084 683273 715066
16974 715066 874851 744083 1157840 975915 849850 807141 1044620 664509 924333 947611
16964 947611 524314 1043290 1141228 899841 583529 858445 1068641 830056 934083 955468
16954 955468 820110 805542 1058702 756984 816450 850963 1158928 694033 971089 1223303
16944 1223303 982876 872343 1060776 1146615 1044436 1280893 1115549 1207963 845051 1095233
16934 1095233 950331 1121331 1161344 1199065 895926 1262998 879371 1279045 1170319 1277986
16924 1277986 1290443 1179923 1332265 1434907 1395733 1346136 1094824 925640 1326498 1293771
16914 1293771 1419278 1278117 1242450 1068681 1546098 1261562 1215469 1324929 1323528 1518663
16904 1518663 1424184 1767893 1597563 1616474 1713381 1619566 1291728 1525810 1564550 1373003
16894 1373003 1790927 1575040 1608224 1755779 1699866 1920911 1677307 1656824 1737591 1928986
16884 1928986 1688466 1383508 1768377 1724293 1848242 1959492 2099030 1899577 2003565 1807930
16874 1807930 2198831 2138580 2138298 2190656 2181926 2264875 2056966 2255911 2305372 2468846 2404687
16863 2404687 2426131 2589312 2323398 2543930 2335103 2585067 2489511 2737420 2820710 2528175
16853 2528175 2999201 2580160 2739762 2613114 3119550 3024820 2964027 2858456 3299177 2959010
16843 2959010 2989712 3503742 3077269 3141493 2914694 3309232 3548330 3580651 3691983 3421995
16833 3421995 3841353 3626076 3692192 3379113 3690530 4287065 4170414 4046340 4222084 4293217
16823 4293217 4367195 4743128 4600329 4660664 4683000 4556704 4612376 4921147 4899384 4862500
16813 4862500 5416395 4951824 5366544 5719080 5809505 5985403 6040686 5970762 6209039 6088816
16803 6088816 6696274 6687449 6713308 6721575 7467964 7332634 7214738 7486913 7784715 7775315 8011259
16792 8011259 8345132 8675188 8609620 9035306 9550205 9259102 9480631 9983530 10030246 10420174
16782 10420174 10680853 10829691 11280588 11878151 11999951 12159778 12685376 12838043 13781207
16773 13781207 13784760 14446146 14772791 15345676 15881114 16248015 17206558 17464458 17888705 18856501
16763 18856501 19121751 20148945 20782840 21424307 22270948 23279226 24492610 25538689 26480656
16754 26480656 27565170 28845407 30185813 31446778 32448501 34401234 35677902 37665663
16746 37665663 39570694 41848212 43462917 46296306 48647957 51255523 53902524 57016340
16738 57016340 59939616 63690718 67279905 71370316 75832857 80535159 85235597 90796367
16730 90796367 96330695 102410429 108559010 115330281 122267227 129815775 137162706 144516103
16722 144516103 152616708 159378526 166357440 173022400 179031342 183802074 187644150 189911582
16714 189911582 190916049 190863730 189127089 185972272 181689515 176386129 169885793 162983006
16706 162983006 155754562 147983722 139978593 132355885 124716072 117271999 109963816 103198053
16698 103198053 97010795 90971587 85430134 79802855 75263445 70588001 66478528 62679163
16690 62679163 58738215 55379715 52420174 49427057 46816837 44140338 41890436 39816228
16682 39816228 37771651 35799484 34379067 32527622 30990828 29599910 28517029 26902974
16674 26902974 25623691 24752290 23596734 22650804 21390261 20968934 19827882 19156113 18451817
16665 18451817 17664635 17161486 16532684 15993380 15253717 14955046 14320733 13524828 13213363
16656 13213363 13148373 12446895 11913590 11773911 11049481 10979768 10794412 10044104 10073592 9334936
16646 9334936 9514801 9251219 8621690 8876176 8313736 8278182 7458591 7789324 7534360 7352733
16636 7352733 7304642 7131962 6653529 6276559 6545868 6080572 6034354 5872895 6039782 5325474
16626 5325474 5701312 5595006 5343513 5404432 5033637 4708621 4698519 4784030 4649749 4682492
16616 4682492 4335548 4232665 4579097 4005115 3986567 4013290 3955254 3700399 3907765 4095771
16606 4095771 3827254 3839670 3698561 3365027 3557056 3263573 3282281 3452528 3287925 3096720
16596 3096720 2998130 3127569 3035023 3034235 2756181 2866745 2715819 2780302 2466721 2672944
16586 2672944 2387148 2498924 2477916 2406291 2537722 2160476 2239289 2341395 2100745 2175837
16576 2175837 2080463 2115796 1994192 1712823 1957172 2021984 1995367 1689611 2039287 1746820
16566 1746820 1773131 1819070 2022525 1494668 1915990 1826363 1882875 1810999 1523793 1538094
16556 1538094 1576104 1559996 1419951 1436368 1866638 1442100 1352772 1693771 1183982 1624363
16546 1624363 1624120 1345116 1567897 1246906 929253 1237099 942928 1542015 1197176 1260115
16536 1260115 1322213 1432430 1292429 1053216 984511 1071457 1037250 1053719 809913 1081615
16526 1081615 1144721 1104859 1386069 1053115 831821 778574 1184090 1059263 1043702 892617
16516 892617 1042164 816266 854176 1113568 1096764 1098033 741433 901247 838344 788509 1105675
16505 1105675 940021 952281 1056085 968006 972547 825142 882242 1095041 726179 738941
16495 738941 1033297 741598 927480 933833 860567 574954 980572 520957 754600 660346
16485 660346 584071 970217 454113 737417 371186 590914 496670 529273 732991 865416
16475 865416 614017 475800 594207 513531 279672 485251 709642 557385 585977 168534
16464 543912 753417 465725 831121 505946 703444 421031 766929 547642 473299 801280
16454 801280 343893 841088 675576 449417 266426 472990 391952 278127 616638 357283
16444 357283 498347 472844 756982 391093 674565 566899 166718 592900 230416 263572
16434 263572 263197 179397 172395 267884 559893 607875 176186 590119 410034 356454 451872
16423 451872 401807 58036 87381 354116 356492 936583 455811 402208 305687 398062 471055
16412 471055 412821 271474 405783 754073 -123427 289706 191811 402605 402502 768115
16402 768115 545330 598821 161829 529356 272108 364281 467365 181880 478690 242996
16392 242996 694322 207224 400740 240091 197854 323366 221402 152664 321879 104414
16381 356789 221072 90730 506389 -40218 180182 358098 490775 460907 84670 -45991
16370 23717 276928 -13342 342027 55937 614024 608976 368015 122313 104661 -36160 148189
16358 337236 -109 591953 318139 183779 157344 262691 12675 136307 -77204 625017 188085
16346 209148 275240 50818 331510 158191 168052 314433 151435 12674 22578 144212 151678
16335 151678 475855 68598 275500 7119 28873 55760 520 184115 30567 424452 144764
16323 222864 68126 486208 203001 221042 93778 78225 544188 -106731 107498 -48596
16312 -309507 128401 121991 -48580 60510 248724 124867 87599 -210447 188120 196416 26264
16300 4007 -74782 -3823 -12092 -76017 380586 242988 232060 286806 145823 108821 103820 307910
16288 307910 172704 129540 -114861 256814 304617 -262707 -141606 208068 366966 218091
16278 218091 134789 7806 379620 128381 7750 -153183 5755 -303797 242391 206927 -240060
16266 401513 -32947 359159 154101 272951 -129577 9861 -41614 186263 26244 63769 259136
16255 259136 -160746 92000 76077 -252483 41567 88687 -181471 -69171 133702 -60403 16093
16243 -74788 30788 107410 151389 -39095 68271 -170423 252084 47241 -141554 277165 113071
16231 -28802 93146 276928 278673 198050 14250 -18006 -14623 204166 -79597 83835 -103402
16219 215537 262847 -116087 -49605 -117056 413504 -53288 -74751 154636 402177 -123785
16208 247148 -301766 33052 61700 -179646 8159 -41605 -74292 -18389 130871 260952 389908
16197 389908 253955 46063 155156 -54978 -203860 -122057 39442 -203228 213264 -111531
16186 111179 -40441 139896 59689 -213123 139946 159408 -145970 104959 121740 -54656
16175 120060 261881 -28342 -132676 -143523 -195568 305979 245284 -290632 -74732 44307 128982
16164 128982 -277373 -89482 103458 -51403 -572 -15342 141798 -274767 -297605 -63301 -18735
16152 9483 191509 -130643 118169 -61295 -279572 124879 297920 262843 84490 -177708
16141 169867 -161873 -102086 40628 36414 256542 -286429 -338999 146893 114838 365461 121590
16129 -32078 146029 20162 181897 63148 181947 298533 66117 51286 -236156 459291
16118 -444076 90965 -57637 157092 279028 -125901 61630 12296 317707 52890 -35155 118041
16106 45267 -120690 174449 -67215 -63832 -83016 15856 42858 -118232 254884 167419 109457
16095 109457 -218129 701 -13735 221921 236588 -8568 151656 221353 44194 278812 78263
16083 -13331 -191532 66735 -201369 -35294 -83544 64805 -273817 -122950 -154632 -267388 77709
16071 112985 -124720 207545 69844 139074 -294026 -74062 197302 63959 -90623 -36598 235935
16059 -38899 247037 -288105 211467 -97006 -119175 -78617 131984 -41543 -41534 18808 -84049 134047
16046 -265193 -207933 139925 -67318 401138 -107642 119243 77774 -36732 -71408 1607 -43182
16034 101503 -126016 -146464 -245656 107317 -270298 74153 130455 204892 362752 -145726
16023 -435140 50533 90140 197454 -2752 93968 -321060 -18487 17134 -45203 165152 -69988
16011 -79047 -143432 48466 -296090 -99981 -52279 -171291 126640 101152 15738 -41114 -506
15999 -66883 -8263 188966 30620 -244415 -28018 -311248 -228569 -95541 -59160 -60545 61963
15987 24118 -251171 382622 30849 366081 457069 308109 374667 23507 119596 -109934 259340
15975 -247291 -282252 27001 -190155 -151899 -210125 -164935 -448898 115461 -67820 81087 -422024
15963 154864 -21804 -40815 268118 -139788 189739 -129358 -65107 -71834 -235022 -124599
15953 -124599 63639 168828 -33716 -13691 61535 58796 -41862 -236312 -354594 -18610 -170517
15942 -170517 -161089 -164466 -278852 132061 -172638 -27479 89453 -62914 -145055 -81241 41151
15930 62032 -123642 -103919 31569 82826 304816 238613 224924 -199413 -75237 249112 -235357
15918 -85814 -155121 117969 185698 -209959 34713 99337 51125 -128215 229167 76566 101017
15907 101017 -155885 126771 221532 55104 -70937 -246088 -87583 955 -45120 3238 107183
15896 107183 164268 201200 -232392 75265 -21807 339533 -3984 -125208 -230163 -470494 -118510
15884 253444 30993 -362371 377950 10948 58254 146036 -209357 -11434 -230618 -300246 -437920
15873 -437920 170308 -124223 -153789 -38640 -480119 -295380 -276797 58712 213834 -103503
15862 -97005 155733 174023 126077 155930 -31163 190184 -37219 -257475 -170747 141701 145076
15851 145076 -107686 343579 -43584 16152 -56775 234356 -64085 100736 -6743 -139736 143194
15839 -222501 182890 -120623 242051 82467 -145779 -259768 275227 -104044 80139 -119935
15828 26255 -178206 -121847 169739 -220096 162560 -144444 -130265 -148796 -209894 -205897 -428971
15817 -428971 -60116 -226462 198042 -53487 419902 -108808 -143138 -42516 97574 39496 -200302
15805 128176 170272 -32734 -251873 2128 19713 -259824 52763 104651 57196 -451319 -170215
15793 -257005 61803 -64625 -299239 -36280 -95801 -77913 277408 -19632 71795 -45745 -131683
15782 -131683 -205931 23167 -214439 62572 85222 127416 418141 -21294 76584 -7957 41656
15770 -418316 25348 125032 190056 -59282 -110643 130498 -125712 -327632 36398 -39176 389360
15758 -182693 12597 -77401 313987 -82036 59205 -20846 239346 -321671 -477415 19496 329582
15747 329582 15727 84012 16775 110850 -2958 223653 -52340 -214047 341043 159927 6877
15735 -53576 162459 -50648 140181 -95864 -96906 -103460 -97197 -203180 -302758 -125676 81464
15723 44489 -308695 -242785 -12354 101107 -77252 227079 144786 -34411 68341 6919 -53742
15711 -160978 -89402 -212565 -124800 -93323 -214922 270901 13250 54632 103997 -157689 -82486
15700 -82486 -205279 72300 92109 -48910 -363720 208497 -184748 -37184 97561 152274 -39299
15688 290386 238409 88565 53501 21486 58344 -157207 84778 -12139 -1445 39853 -173680
15676 -42766 -51892 -78628 137146 43866 -78100 355963 -13297 -89758 30903 -104950 45501
15664 33127 -31506 197413 -44102 -122580 -140876 -197125 203324 21236 237087 -100537 51801
15652 -86826 57593 8056 -12108 -179601 -36259 15016 -150796 -109240 -213140 -179214 -252825
15641 -252825 -233235 35161 -278433 165791 3949 -98391 179577 96873 194189 -64604 -165747
15630 -165747 -37551 348900 -22827 -87938 264765 -230028 73048 29228 41021 -41460 282459
15618 169623 -204368 201060 45362 142524 -51369 330591 415035 -91873 -19270 -147547 142147
15606 -213075 216777 -232086 -125307 -54775 149065 -54763 -63471 171103 -180215 23147
15595 -33488 61121 257797 291738 97062 105393 6420 91948 -109990 -163255 37956 215846
15584 215846 -147188 -72689 78780 117058 -81534 205452 16125 -122507 -274955 -12721 -122194
15573 -122194 287822 -132743 -216827 151337 99000 -228677 -30304 -114717 -18770 53521 55624
15562 55624 146447 -145358 -235728 -160077 -99057 -63529 -110532 -46410 103678 254430 -84498
15550 -128498 19654 -410220 -391572 64863 -148762 -44838 145148 -91912 298295 320571 -135218
15538 57186 67636 -175183 -25451 147185 -163286 265320 -52247 -222044 -65449 -240567
15528 -240567 183347 -197562 -68196 -250765 -330702 42907 -196994 119974 -56017 186974
15517 169375 -225121 445063 264474 -28062 275605 317476 176214 323264 114350 -75985
15506 6221 -259340 19568 235152 112182 -1483 -64829 -69802 -220193 159827 -30020 6236
15494 -359513 10167 -172838 -192716 -112755 -314930 -77804 241628 -88388 -206004 227251
15483 65142 -141932 44196 331176 -69221 48237 89908 -298579 472995 -1325 -47720 -159883
15472 -159883 -70380 115692 9674 242956 170424 -390541 50559 20634 209686 113969 -80633
15460 297354 60941 9611 111754 -8628 219056 39724 23721 -40350 328312 86641 -112220
15448 -394500 -150492 -17928 -39641 9402 376712 -256894 -105266 -31391 -270038 -128994
15437 -149878 201370 -215177 -141251 -185270 -165223 -474340 -48512 -314024 224342 97977
15426 5589 -242705 61990 139123 196423 103320 12581 339255 -289747 229117 98661 -51333
15414 -383260 52312 80226 -278990 -363736 21154 51938 -126782 154661 -82161 247939 -216749
15402 -142988 173456 -108984 -124640 -166773 -196234 -64923 -102625 -125794 -126748 160084 99963
15391 99963 68364 -110543 -172336 258293 -57431 33462 -167261 -187566 35989 436722 208280
15379 16225 -667 -409335 -21701 -198350 -83246 546891 -56630 -133251 -65280 -305054 120872
15367 138639 132571 -252503 334523 -162962 341766 -94157 54266 -286026 421115 -139326
15356 -140608 -135872 -121868 101195 -266374 -127420 -122317 -24187 67761 128625 8786 -86378
15344 335528 -56368 -235038 -230020 -151008 -285941 -30733 164967 152535 -36950 110771 -253397
15332 -224591 -222533 27018 222798 15241 -79742 -184266 -237171 77004 -173793 -38317 -304649
15321 -304649 -201259 189327 -106986 -252900 -33106 -81156 47068 72622 121434 9316 82832
15310 82832 -17323 -164026 20228 233232 145745 -148290 -229441 61346 31226 -67043 245126
15298 264586 65528 -98969 167523 164033 181300 150723 -39425 49640 -22153 -168366 48610
15286 227111 385277 -296315 -138437 93880 -82939 -215771 21814 290929 -11902 -160270
15276 -160270 -98258 177639 -43450 93476 -6851 26514 352288 -62667 17886 -114976 -141375
15265 -141375 -244497 232076 217865 101720 6406 166408 -69006 -37811 282966 34550 7479
15253 -83615 155374 144391 74496 289994 535502 1394338 1478465 1297663 1774434 776197
15242 223908 188448 63695 207258 33267 -193477 95129 147784 182767 12105 -104793 113411
15230 145971 -45003 55763 46580 9766 145172 285866 -177250 -28701 175071 125630 234408
15219 234408 89927 73930 -35005 109754 82859 -210450 -93103 148999 -132404 72840 219467
15208 219467 75590 -321970 222606 16052 -144989 170238 115917 54598 64130 271931 -402996
15196 187760 -66831 -68214 -44516 89168 -87277 -56230 -142963 126605 85968 430348 -126618
15184 305554 144184 172980 43508 -73624 257398 256772 36461 257757 16595 294232 45629
15172 -24984 5836 225029 92789 -68392 -219916 315817 272489 14784 -275940 133344 223660
15161 223660 -336603 183244 155771 19073 -74728 -55151 174163 299639 -90939 144158
15150 14487 25298 101512 -77405 94746 40676 127221 95547 92324 29026 122160 274621 258271
15138 258271 -91535 418895 27482 213209 50678 146757 238559 -8884 -178834 -219482 288980
15126 -22457 205651 -19904 345321 247173 272617 -86118 166383 155378 372208 230563 4347
15114 -168100 -90655 89584 112123 -61510 245781 137891 74058 75296 -252094 213791 607993
15103 607993 150549 -34308 117407 -39134 109211 -107214 154287 -117031 114130 -109389
15092 65029 -97203 145315 -126758 144384 266031 56955 383974 128681 245158 249314
15082 249314 -207272 86895 273314 431631 -144860 -149073 122032 -9453 225070 62720 55057
15071 55057 44309 -27120 57444 -386 106869 -233532 37676 35767 203974 -184711 -163267
15060 -163267 -241680 58569 58284 35215 206509 43012 88805 446558 269137 342081 121930
15048 311198 462045 -93985 252872 374657 185724 315999 -17366 155025 374683 47924
15037 156863 134304 -105965 100386 111378 266559 132782 -76355 17662 36556 176851
15027 176851 124146 -110837 314767 188953 486569 -36606 112567 341163 390176 107849
15016 246060 -53745 303916 187912 408234 253393 47340 -8627 194279 73365 244780
15006 244780 -82908 342857 200509 28341 412830 530099 17682 165302 -61132 102061
14995 -160757 365882 183581 354723 49577 20213 379482 99287 115097 -125379 204620
14984 336257 112460 476783 117428 278663 204843 236853 223310 -7019 6677 302285 67391
14972 325956 251159 551143 319495 103217 225099 342927 175526 371315 176563 612498
14962 612498 489452 66592 242542 81636 72114 279252 269163 243606 81532 219050 303222
14951 303222 196915 132793 367029 -81124 334072 360722 470981 297938 -7468 345448
14940 197735 187816 -66722 292843 616590 199884 350705 408130 172909 587078 49559
14929 388545 239981 322232 168899 256170 355346 252891 676959 266888 -48818 81583
14918 405492 604503 284588 293881 96729 218132 480389 417744 247566 277628 418748
14908 418748 209919 11438 147377 300073 13603 230898 -37566 460255 139505 110568
14898 110568 261774 -9212 148580 51104 569505 654090 318192 467613 174135 237791
14888 237791 426747 21951 53508 239614 243770 429917 492224 279035 314553 354821 30409
14876 130890 483219 222408 406658 268911 232550 295392 527233 231158 28215 382690
14866 382690 475659 295555 520903 199534 325027 260849 299162 85558 505256 375922
14856 375922 299745 306606 558530 410671 356141 442188 167406 279099 225345 510677 156503
14844 627470 284497 260100 411721 287221 494185 206791 267008 482005 327170 465567
14834 465567 414215 192631 134914 512231 421829 159987 452367 307407 187138 498164
14824 498164 616711 771218 478490 463976 512655 488658 410064 421531 611608 434229
14814 434229 195908 396329 457583 553443 577768 644750 447901 251852 516694 330818
14804 330818 255131 246555 590751 405503 588179 92548 714281 305966 710709 504668
14794 504668 418304 558325 257478 234826 422436 547907 611049 427437 25313 537588
14784 537588 606936 646602 392590 375530 467072 525491 763807 314949 795429 581785
14774 581785 533826 508381 509414 691146 733812 564664 863327 559352 665556 397801
14764 397801 561470 715480 539623 551913 664949 597980 648270 479359 349500 616380
14754 616380 450269 675105 572129 585584 406848 654037 652069 724991 775781 812614 684704
14743 684704 392715 916017 869440 534117 668852 945278 533036 741698 506261 173051
14732 547203 850228 589072 710950 684682 858142 638076 538213 1119625 1084414 723270
14722 723270 947384 723452 555431 769074 431701 908376 560501 661920 816447 765663
14712 765663 417617 874710 519470 853031 743972 394285 559857 525112 765066 654069
14702 654069 807122 487517 707758 625290 732153 958063 882104 829812 1015128 880237
14692 880237 943369 629296 716801 817042 1163372 1071173 1036305 901483 1010747 741730
14682 741730 714872 932989 979095 701849 1161776 550213 1029350 872481 621448 558367
14672 558367 981227 917610 937382 872692 1142334 991807 969960 1165612 1041269 824621
14662 824621 812274 483821 590242 718786 1181955 873441 937508 1187474 1182862 907244
14652 907244 1101813 868285 1142830 939014 1086627 957756 1218988 1245432 1276967 1060584
14642 1060584 952481 1177721 925615 1059407 1080595 1063438 1289448 1186824 927535 1296491
14632 1296491 1106497 1199579 1297759 969409 1390415 588762 1276764 1134797 1021074 1338298
14622 1338298 1162062 1392171 1253165 1368039 1220905 1520942 1157674 1491083 1515123 1072139
14612 1072139 1455606 1479324 917868 1325708 1474652 1485794 1446426 1081051 1719657 1621918
14602 1621918 1467916 976748 1456924 1355276 1640614 1405975 1771532 1307872 1576149
14593 1576149 1801106 1585097 1532689 1722057 1929653 1623488 1533573 1787569 1689324 1904897
14583 1904897 1504347 1814878 1735853 1797620 1504225 1902148 1586015 1951367 1966344 1733827
14573 1733827 1848456 1822335 1923485 2228258 1892402 2173007 2046140 2239149 2375725 2044353
14563 2044353 2304794 2466361 2447137 2356058 2419695 2605211 2485772 2617006 3432786 3038863
14553 3038863 3327212 3663622 3951320 4655050 6234236 9459905 17062094 35318081 47821464
14544 47821464 23207784 9338282 4312948 2562675 1855099 1693118 1835974 1784425 1716067
14535 1716067 2016663 1613038 1889738 1913472 1921975 1970056 2183673 1870473 1948820 2064439
14525 2064439 1918928 2404670 2172552 2608394 2164148 2098459 2411789 2295894 2420452 2206593
14515 2206593 2284451 2411900 2419888 2244777 2511171 2613190 2555530 2474316 2578332 2743705
14505 2743705 2878503 2774004 2882932 2989898 2686866 2614176 2309104 3113267 3017683 3211499
14495 3211499 3121856 3293392 2825739 2971697 2868365 3119439 3544002 3218687 3303478 3135888
14485 3135888 3507811 3394427 3231204 3564120 3765027 3516067 3480745 3180757 3468615 3367816
14475 3367816 3631584 3649118 3911300 3900000 3615294 4111884 3947781 3874929 3861052 4207657
14465 4207657 3831313 3985811 4094682 4029184 3968376 4593135 4693014 4225034 4431198 4559808
14455 4559808 4689978 4846478 4592225 4667037 4984676 4940461 5085223 5174966 5095869 5366520
14445 5366520 4856664 5110682 5242807 5659036 5450812 5768958 5717119 5802604 5815449 5913255
14435 5913255 6189693 6030789 5976892 6183183 6101659 6445785 6263647 6576464 6481164 6868740
14425 6868740 6935210 6679400 6980259 6770489 6978449 6871943 7099996 7332629 7074376 7737241
14415 7737241 7824363 7892709 7742347 7918258 8244266 8128988 8288006 8293262 8467710 8827146
14405 8827146 8507922 8980229 9127604 9350365 9452885 9600638 9568302 9836947 9856912 10075396
14395 10075396 10486529 10183859 10681651 10725816 10967692 11330905 11410421 11600751 11684268 11826825
14385 11826825 12246259 12692410 12499112 12765090 12833274 13211850 13791777 13897775 14358184
14376 14358184 14621288 14422506 15020231 15262743 15191371 15945037 16435065 16350715 16840857 17425479
14366 17425479 17674622 18130027 18152489 18662371 19031759 19506509 19865948 20584580 21148766
14357 21148766 21344502 21936316 22481065 23088934 23541184 23997060 24693382 24949154 25825840
14348 25825840 26202080 26898272 27776732 28272381 29196135 29897129 30653956 31258142 32177118
14339 32177118 33314614 34117867 35113986 36122043 36883051 38602855 39345161 40618070 41639511
14330 41639511 43228129 44328280 45767266 47175282 48347243 50357626 51810672 53638658
14322 53638658 55375293 57184654 59676341 61988537 63978131 66206721 68740617 71183156
14314 71183156 73998943 77138713 79731866 83260907 86405424 90176896 94103191 98409857
14306 98409857 102589862 107045356 111911393 117013981 122355479 128235227 134584753 141139947
14298 141139947 148071490 155150295 163411957 171517374 180019842 189474790 199504476 209914520
14290 209914520 220864711 232338206 244582472 257398544 270924085 285107023 299189679
14283 299189679 314130526 329644289 344874962 360722562 375829036 391024907 405795100
14276 405795100 419779769 432555967 443842787 453242027 458514785 459618650 459729498 460058760
14268 460058760 458011587 455193346 449914528 440421058 428821811 415287710 400568708
14261 400568708 384977644 368534998 352119804 335479622 319044244 302831625 287590415
14254 287590415 273781880 259467925 245684882 232865753 220639500 208991482 198137779
14247 198137779 187854723 178188230 169393702 161419553 153323384 145744407 138550162 131913651
14239 131913651 125784595 120497011 114712023 109789924 104948480 100073069 95845972 91979257
14231 91979257 89109575 84922108 81586083 77886008 75061976 72205409 69495027 66759874
14223 66759874 64120360 61981357 59719448 58065224 55555952 54007698 51852278 50017375
14215 50017375 48417425 46971639 46143477 44615529 43150387 41836374 40181958 39291476
14207 39291476 38819542 37764775 36120613 35247433 33979612 33404712 32418952 32112606 30868268
14198 30868268 29999004 29043339 28094409 27402944 27309658 26352576 25604282 24827236 24425113
14189 24425113 23832367 23137504 22698357 22154845 21603945 20949573 20774738 20358814 19615053
14180 19615053 19374148 19005544 18541443 17695044 17966795 17084675 17193436 16747367 16559603
14171 16559603 16212353 15857625 15487241 15146592 14968843 14933834 14200615 14031892 13968968 13418395
14161 13418395 13311148 13111988 13137603 12389084 12423370 12268677 12250531 11777020 11853982 11504902
14151 11504902 11505698 11368396 10691772 10884080 10446917 10215915 10342031 9944034 9771654 9607240
14141 9607240 9589407 9623168 9066105 9241897 9147135 9263787 8751415 8693639 8610667 8282239
14131 8282239 8154436 8077225 8030800 7864161 7649212 7584498 7414440 7632959 7541262 7277679
14121 7277679 7099383 7487560 7116606 7055049 6969198 6398690 6839282 6385971 6375963 6424293
14111 6424293 6269943 6280634 6210864 6157239 5998923 5664075 6007069 5737353 5725890 5611585
14101 5611585 5402995 5521703 5537603 5555064 5365757 5204885 5036968 5008456 5180160 4892821
14091 4892821 4665990 5171057 5055479 4930449 4678048 5097809 4802060 4618282 4520112 4335725
14081 4335725 4352224 4400988 4376121 4042674 4079406 4366460 4002248 4221878 4269112 4082061
14071 4082061 4062052 3868237 3830659 4009038 3573644 3767469 3893497 3580114 3536897 3436147
14061 3436147 3625279 3769953 3490317 3496190 3696183 3315559 3419652 3169003 3308126 3333250
14051 3333250 3572800 3627226 3381346 3296175 2605313 3100118 2889364 2883763 2939273 3019767
14041 3019767 3110308 2799057 2817187 2941923 2576300 2873932 2845098 2761347 2701735 3033276
14031 3033276 2462461 2850569 2813715 2353852 2956126 2796195 2405459 2449916 2109395 2369634
14021 2369634 2422568 2501278 2609206 2726661 2222607 2302649 2360974 2393512 2443555 2365463 2365085
14010 2365085 1744563 2266262 1995061 2069382 2004429 2432459 2274385 1717477 2166832 2100703
14000 2100703 1597980 1597957 2260907 1926321 1913405 1732030 2061256 2306696 1868954 2260437
13990 2260437 2432863 2433095 4980910 10539516 27745812 48568360 26934164 12963445
13981 7465866 5182590 4573527 3696589 3239287 3311766 2872859 2642094 2710949 2573006 2214365
13971 2214365 2353971 2143691 2172054 2248142 2094757 1901480 2095206 1994650 1760174 2027211
13961 2027211 2069859 1836831 2019022 2147882 1865754 1699000 2038475 1757107 1538591 1600747
13951 1600747 1621697 1776956 1481831 1449763 1594652 1675750 1688299 1655781 1893815 1728622
13941 1728622 1533607 1824121 1663707 1494488 1525361 1568108 1641958 1471086 1431008 1736048
13931 1736048 1676784 1406510 1088099 1422872 1634374 1535920 2054745 1286672 1666419 1404398
13921 1404398 1097005 1177164 1321466 1217920 1194802 1383739 1326400 1507623 1442563 1698221
13911 1698221 1429583 1646609 1233872 1252704 1445297 1299241 1360673 1307265 1110909 1390227
13901 1390227 1268841 1093594 1152849 1306771 1259884 896789 1217118 1078131 1512922 1683741
13891 1683741 1361858 1094166 1085119 1082902 1147813 1079147 1287819 1437912 931532 1000951 952646
13880 952646 1079029 1105482 954339 1076011 1109294 1284938 1020221 988116 851031 893143
13870 893143 711479 1063206 1080715 839121 959766 881084 1243263 921296 1034977 886329
13860 886329 987055 1034209 640434 780390 1267977 1070281 686124 1134175 850071 937870
13850 937870 996666 954039 831567 1044620 1026188 794314 904347 958720 995825 741601
13840 741601 1110005 894628 642441 771189 1060752 883647 859616 871179 794247 840057
13830 840057 925317 945387 577799 925041 718490 889244 542862 1024445 832860 794483
13820 794483 833888 930877 867409 843503 804717 917959 862458 1054609 754201 973054 541062
13809 541062 638295 789166 682408 734174 436391 813090 642876 735375 993917 665687
13799 665687 905781 711046 645565 813343 617845 569015 343941 672125 643417 454677
13789 454677 559824 775847 1075840 656252 958404 639130 616195 516857 703068 681798
13779 681798 925325 463016 419749 277284 430627 872037 560856 646231 574640 303286
13769 303286 844808 579896 513476 763941 503821 476810 415046 656696 589934 346122
13759 346122 550876 550097 305796 375051 698952 198333 508172 747787 539672 512580
13749 512580 848651 285564 499380 683711 328597 343883 336617 812013 729321 534002
13739 534002 560822 654786 511074 449823 469267 773262 550296 -111764 381394 609697
13729 609697 200867 295615 710383 501065 443501 792432 566189 659949 735142 710561
13719 710561 340497 494659 605284 765004 328840 352498 564537 647313 291439 745622
13709 745622 202409 211925 346149 541487 372085 235031 660491 824686 706915 558643
13699 558643 627409 179288 171999 663447 377469 566447 398072 226907 36575 645672
13689 645672 160046 325466 648714 585355 237694 439433 191164 235945 481589 474853
13679 474853 164453 298000 96776 353502 521008 505260 366162 233717 806209 387788
13668 450657 287654 541670 471661 161344 453535 395094 163863 129288 520230 329669
13658 329669 768672 455751 312627 226294 483491 333864 377442 424037 590230 564455
13648 564455 475306 453837 109432 701863 822664 313697 495144 735752 561540 352001
13638 352001 472129 465424 304532 540111 415754 492470 419770 579072 384550 598060
13628 598060 333477 252098 316754 235744 181074 398944 121396 280886 272523 422164 354794
13617 354794 602669 218984 496145 715884 222143 411619 257969 433960 20867 128244
13607 128244 365129 550335 360784 771085 385216 459027 122238 324656 252649 246834
13597 246834 453072 431598 77252 236865 1680 201461 327911 272080 126940 208535 425136
13586 425136 46592 420044 507276 287270 458449 234688 302374 271430 404021 279987
13576 279987 460359 505931 462407 373783 -8565 187202 477989 359940 100063 262122
13566 262122 434827 413060 92215 485574 416152 155910 487163 230009 80520 186225
13556 186225 39013 353058 167179 399587 287197 407086 227043 103945 151770 196530
13546 196530 392188 542838 314403 122421 263006 561368 100180 167408 -12633 206223
13535 262948 180577 199979 326091 227098 513694 433121 470029 444800 270857 500533 208983
13523 71438 28941 506218 50115 -19648 422684 227744 347582 272148 298948 368129 466467
13512 466467 413547 281398 250543 102097 287311 323885 183513 74922 305245 343547
13502 343547 341342 272821 234993 -15052 117703 99731 307400 314616 135514 129689 215732
13491 215732 15404 269078 56199 323076 188287 143829 205248 242025 320008 437107 246442
13480 246442 480049 204934 243516 -23840 475506 122719 -130224 294511 258189 628705
13470 628705 316919 125596 78301 317436 455611 153809 45391 456654 43549 -61402
13459 174818 278562 183046 172062 149287 213336 399549 338265 190420 99750 204693 223511
13448 223511 2607 301659 72651 59530 445390 126213 369906 221141 217115 348010 108180
13436 37826 521314 211776 -66084 271546 -14029 74756 -116535 249584 398545 277095
13426 277095 224334 250016 116341 195585 226141 443040 291874 110234 254520 203416
13416 203416 255148 213883 -217425 -4137 223954 -14446 112194 127720 -28171 25106 252209
13405 252209 115993 258890 262087 101538 328486 385476 19613 -108576 184798 312101
13395 312101 438177 -45084 244323 45485 185477 -262447 235887 286648 274802 39552
13384 52539 115106 200686 101255 156315 309034 246207 361244 175331 370195 378547 235532
13373 235532 297681 585787 30030 362681 273844 306304 277835 68856 467958 226661 617330
13362 617330 -161652 -236799 246128 -74966 249866 38151 -12533 528144 73276 394532
13352 394532 51716 137607 -34421 397727 60546 272842 99886 603059 204124 191889 344613
13341 344613 210583 548841 333828 23595 369784 194369 189631 102459 261723 238242
13331 238242 212561 80979 397925 98864 165484 -78191 267521 -73640 497780 65697 154014
13320 154014 271480 216779 287788 332250 282980 -50917 222861 503455 -124140 363272
13309 168622 175922 -102646 406603 180125 293310 221689 -92503 71573 65569 223511 -126315
13297 18368 270394 241566 90658 -77579 -2583 296718 298697 262623 -107432 371263 461495
13286 461495 79254 283106 32135 -52129 138504 106463 55353 -100462 107985 275486
13276 275486 254862 -191479 29330 -125371 -19666 174871 44424 -130587 186302 145284
13266 145284 -92719 123440 -32680 28829 -43606 36291 240405 17221 54619 -30467 14895
13254 97187 23043 29110 291269 181600 84692 148980 170993 20710 100160 171906 115586
13243 115586 75518 49642 -19343 316800 51096 3932 326636 -243442 473093 84077 -226176
13231 -128149 156392 310635 470229 310145 104483 -54359 -157405 235592 322224 68729
13220 184250 65228 161828 47591 -25005 231764 171740 130543 -156497 45832 288372 17745
13208 94618 59120 -212913 82232 202283 363654 80905 53456 259691 -64849 134194 329776
13197 329776 -158757 198056 77634 413072 96943 38881 212418 120312 12795 -267052
13186 202974 -64026 210730 201522 105341 -231522 107237 125253 229186 187247 251034 144192
13175 144192 65438 185593 257152 376821 29727 -112458 -67105 154540 318005 76021
13164 275221 146419 134902 75812 71533 238761 4597 239160 318810 -10638 277666 -81376
13152 43525 73330 52963 2791 305984 -155189 158928 -164047 66028 184666 120527 -348150
13140 -39929 203535 -300024 357945 172610 150009 25334 239244 198608 12540 282839
13130 282839 -152725 -99809 -124813 -110349 132984 -47984 194841 455788 212264 60080
13119 133280 25471 247556 159263 -167075 -40361 -93923 -32426 425148 141345 173532 279221
13108 279221 -39514 325889 7422 265078 36583 86381 -76911 88228 70562 138175 -124385
13096 70709 -12076 181870 163347 27252 278430 65854 -97977 218965 354462 -24338 54825
13084 -107078 37720 67580 -208668 221069 -209229 6831 307947 -7050 -301310 -35889 -2512
13072 354888 178990 61379 19540 141346 64724 9944 290422 -47735 -152493 -152013 -56285
13060 259360 113610 -106856 96809 -222410 143273 107079 232383 -62048 71118 258215
13050 258215 -130877 -71647 -60155 -94566 151195 -36179 -4827 42952 18461 437352 120701
13038 -137507 47442 344816 -317357 90534 292786 155952 445142 -80647 64628 203635
13028 203635 50641 333928 54666 306493 -175918 -64959 131885 96415 -146357 119714
13017 -205436 -35840 -100104 151760 11051 384715 53670 87417 155485 70271 156842 -112474
13005 106665 142928 -165440 217427 22981 41146 100699 100574 61534 247965 -28334 313838
12993 130973 7439 425507 133600 416685 245630 229101 89679 -61145 54527 108939 93578
12982 93578 189290 91240 173269 90924 268375 -182898 157100 -128228 -230791 273546
12971 -202169 -52993 -219007 -298290 47686 18768 -99595 -20551 -87473 344381 246106 46214
12959 123452 206634 -418129 83781 -66384 -145734 49706 16215 -231827 567348 -209478 -87614
12947 66571 2431 -120159 -351381 -83620 -103949 -194533 21961 -281566 -24779 -184663 -224979
12936 -224979 -76468 59938 -251311 18074 244713 -74869 -144247 -415636 185430 343145
12926 343145 -129747 -83702 233980 40932 320011 259684 -59038 30261 -144579 22056 -45989
12914 145433 294887 252852 -28116 44838 -159284 -109979 -137548 -218471 -76104 76651 242744
12903 242744 102070 177086 19134 -251666 -249909 261726 52300 53572 22102 49711 29190
12892 29190 -65310 89652 -143539 -123629 232840 297796 289274 25052 -99237 116711 206561
12881 206561 93575 26008 108665 78343 -296961 296814 -171209 92407 81611 -16492 -7700
12869 -59599 75974 60842 -29526 807 274355 -107618 195958 -364474 -13580 -116639 -131341
12858 -131341 -224179 -34644 106236 -116488 -138495 -182813 14687 -184583 36585 89589 32994
12846 -354933 -226043 -2889 231184 -328359 33077 27024 -33314 169087 -121115 193643 -31740
12834 -173271 -86450 -92222 145275 213576 67002 96720 403863 -331271 -78702 -53786 246728
12822 17065 262340 -251285 -186206 -214739 8268 20568 -39023 25006 243357 175288 -188920
12810 9950 -286165 -159464 -25247 -183648 -252283 -163415 -93312 -111337 -105198 -219175 -150606
12799 -150606 147032 42637 233947 140183 -287180 109995 241097 27570 -209386 171272
12788 -49630 -37301 197845 180571 -180566 -139451 134041 -173463 -55797 210350 383994
12778 383994 156032 21769 101935 81253 -97498 -175905 -20224 130654 -67712 -8177 -37350
12767 -37350 -18273 -25194 -25421 134225 102715 -57509 66016 109142 182386 84218 104678 104102
12755 104102 -219700 -109797 -131540 -65596 -175596 38222 137059 -271909 -34657 -24478 254640
12743 57961 99954 193474 -16718 94099 84015 31816 190615 213317 -368262 268926 200931
12732 200931 13359 -243270 111710 259582 -267750 116267 -58970 -30303 54196 103765
12722 103765 -39569 -250866 -53745 278478 104376 -172291 -77511 264070 833 -173183 257938
12710 100874 340570 194936 -14508 111376 453613 132829 15742 255213 239296 114188
12699 242321 137788 -93164 133100 -155496 115672 167835 221462 -236638 -93008 -61493
12689 -61493 205387 294901 -20019 -125891 147278 38575 5861 148528 34231 503413 -219023
12677 87845 9046 526532 -201227 89881 114504 256655 -11019 5271 18344 -106687 195564
12665 124090 -56658 227682 -122336 -38825 49401 12334 396943 26315 38259 101684 368871
12654 368871 155832 39463 -120152 -231931 -86875 110126 162957 -170653 -227415 -106805
12643 -39930 210807 -33197 -33821 -473721 194447 -196344 68353 113180 -208909 414960 113125
12631 -191528 29832 64909 1968 187226 -12244 394131 -155423 188497 153039 11224 437399
12620 437399 185984 218011 243587 -155689 462480 5191 -250204 16416 -60167 216124 90802
12608 150360 -188986 -119317 114084 -58934 213415 -85855 -16664 125949 -73471 142229
12597 213589 77916 147180 -76718 -14266 -44253 137839 -75769 14384 -310834 -1029 -132198
12586 -132198 76931 -137135 104385 -140530 -87302 -50486 127732 -6447 195256 284641 -34173
12574 8973 149515 -44678 -131847 312054 88253 165584 145473 -144119 130519 3437 -98215
12562 -94610 122632 71820 -80180 148030 -44501 55094 -90659 27350 121788 -93989 88837
12550 20081 374187 -55163 248181 -29296 -10132 -170057 -18534 -146351 -246169 424632 -97307
12538 -278190 252844 -72954 -32727 15181 -54481 -327473 -6848 36883 -236358 62649 76436
12527 76436 -136979 148805 -232908 89368 -180567 -70972 -330731 -96315 287385 -107167
12516 -36987 -127154 159897 -168492 131831 -201571 -23932 167674 312065 -98854 283940
12505 -91390 513047 202283 168777 129117 80839 -209570 -84509 65351 -160610 -77692 -119312
12494 -119312 28450 -144933 -56490 77708 267098 -104892 -7709 160859 -18292 236103 12208
12482 218439 280387 85009 -84970 51998 1523 -162755 201108 109760 57472 -251295 -127946
12471 -127946 400420 5646 -222573 -218728 -178151 194440 -196124 -186061 -102128 -89631 46784
12459 -149779 -116407 -73068 95452 -61302 212871 -432490 -108977 113613 -339309 -119840
12448 211059 67315 -10531 276683 -104093 454873 -260323 210894 -288033 196596 -168937
12437 20227 84987 -138611 242634 503844 -9237 17655 325523 113860 -71747 -73956 -290301
12426 -290301 117316 -7436 -228605 57145 -236261 -158799 -317003 -19434 -183297 -126471 -138704
12415 -138704 -53397 177549 55732 -128449 -57068 142612 -141390 -103433 32812 41799 62947
12404 62947 -108916 254102 -34349 77323 -333803 -130397 46890 -156372 263531 163508
12394 163508 226821 -7153 -117037 126251 62669 188194 184455 -64080 -44015 34919 -14727
12382 14000 174074 78153 -246164 -119128 -73553 129778 -29801 -306414 120717 -32302
12371 23461 -182332 -98368 -45471 111155 364644 -221263 -23180 190525 -198787 168332
12360 -237128 332790 53864 -208433 114221 -33762 94469 -18122 -54521 -305859 -150377
12349 -233765 271251 -52821 197514 322664 -39301 71815 -405852 87614 308 -121202 -77851
12338 -77851 84375 -218920 -18748 -105468 129479 -144237 216047 -175144 -275491 -97974
12327 -186926 178768 163955 -17423 85321 -26481 80170 -127939 292864 122008 -170715
12316 -47776 -69620 -82555 -31837 -195739 -16494 -59678 26387 -68893 -242549 -116504 -160091
12305 -160091 58006 -217669 47163 45473 -135335 17278 -308389 -79453 -49909 -268652 14050
12293 -123327 -73890 97782 14207 72125 -113609 124560 -23700 70870 191270 360545 -79697
12281 -160308 -75420 435719 4077 56426 -11791 154870 76384 195804 92094 470879 199516
12269 43876 -274864 -115539 158457 -19614 64167 2216 -35365 -131875 -43125 -62421 -3422
12257 -74619 253288 145292 307690 177557 2407 -56209 -37710 216499 273228 267801 17757
12245 -130632 -80865 457598 1030 -167496 -73332 128664 166455 102893 133648 50573 -36463
12233 197241 52421 72739 191660 264352 422404 130039 127087 251508 192880 149083 453654
12222 453654 461710 192335 242477 339555 225855 125544 213995 435742 158888 107568 424940
12211 424940 53583 330680 241308 -192747 128168 304635 251643 332032 219626 282444
12201 282444 -2410 175293 246031 6988 -140672 112444 379375 44762 72221 195184 37971
12189 378150 108371 438602 99180 28464 494321 10696 221035 316835 338052 -291394
12178 283483 85812 338882 63218 -14632 74556 84213 155603 140963 -539 472175 367033
12167 367033 176197 -206877 1774 -243856 283298 138826 -40858 22104 316702 -133399
12156 79642 90303 -97275 147078 144059 -140736 -293941 -27120 -240425 -130925 343980 -412835
12144 84155 265374 47189 -66158 -22213 226108 -44641 476693 157122 -180622 74657 9211
12132 -42859 164250 263379 -196808 -67074 -258414 -177674 313996 -183187 268843 -127696
12121 158540 61828 196515 171820 46837 -206242 -149495 292646 -120109 -213266 -24630 39629
12109 274762 110844 -270189 103155 19386 106004 156304 -129656 1679 -148145 -70821 -128258
12098 -128258 -208128 -92553 83227 74999 2398 -20067 -92580 -331697 -77131 54689 25736 -174945
12085 -254455 -203593 75241 17741 77387 177979 126401 -79587 66668 -227302 204839 1414475
12074 1414475 1677227 81116 104580 -30658 10924 169368 -4470 207123 403806 77139 -60038
12062 -2503 75775 -282918 -17803 -162116 -5105 172118 -172062 -118698 313930 87563 236722
12051 236722 25529 -172620 -6472 -129474 210404 48751 -357035 308777 -108640 59075
12040 135972 68648 163890 -266508 -25277 -80254 30529 -318764 154351 -149629 -108022 -21755
12028 61298 71718 -461001 20883 -81850 -13370 -104156 89665 -46841 -149853 -13774 241915
12016 -289130 209206 67587 -149946 -153589 -371212 234606 -92588 -292434 106383 39641
12005 27521 -127392 -174721 256084 -101904 -293067 -56045 -91575 135494 125785 450341 -114106
11993 321109 -141151 -101835 -16442 -31200 -215503 -192812 -124264 -29106 -53051 -113491 -9577
11981 -108955 136360 24592 -58920 -35788 -118515 -130121 -42224 38096 -31015 188277 -66407
11969 52223 158345 255524 -126760 -63785 -10593 -180371 -91153 -95129 -246101 -204547 31573
11957 -136405 87707 -318151 -33358 60862 -59555 223468 49003 -28204 -79529 224645 -33253
11945 -186999 -103291 -13709 -37984 71917 124220 -4811 346518 -81185 51281 -75946 282112
11933 -144428 109838 -98202 -94895 189834 128073 -27697 69566 -125891 76793 -16501 -71307
11922 -71307 -239320 -128538 -134472 -260353 131459 -18641 93689 -148043 -77904 81489 43816
11911 43816 180547 -51655 90703 -131723 -116756 -22254 -160837 49551 -83046 1549 45129
11900 45129 -36308 205740 -310098 77210 71445 117436 195969 351209 -14391 -214299 -42903
11888 -26249 117136 340818 -21520 133182 -50645 211781 -41236 81655 -378110 -121204
11877 124890 -221211 -90483 32811 108826 -204274 -90913 37377 -132880 254400 318078 89766
11865 -325426 -36842 -141895 -224780 -310029 231069 136113 -26555 131215 50063 220726 -151088
11853 -7464 -139501 -184253 41475 299727 42712 166098 -275664 -273265 57952 -146632 84989
11841 -69990 359051 -35501 -33384 -155306 107408 82569 -287253 358417 -424246 50174 -41283
11829 224772 -206461 -150089 173577 78262 142682 -384694 -528058 226193 37174 -136253
11818 -200319 -4004 185961 -59862 -143122 -98086 122691 -164961 126142 -151655 139664
11807 -159631 133686 66025 114561 -338783 -10455 246513 107003 -254192 -185426 -361290
11797 -361290 -249558 -151610 -328311 -115855 80260 188729 -92491 -304621 -41048 -177595
11787 -177595 140716 20880 -63182 -178031 -211426 -117874 -41036 59738 -93085 87819 160566
11776 160566 -138977 63949 -82810 -74872 162426 -167561 339998 -129029 17181 -194273
11765 28648 -141817 -147663 164180 -295088 -34592 -137701 -97962 15866 116286 -129813 -163444
11754 -163444 -88023 133626 -120244 -335423 -59272 -21001 150704 -107945 21310 201044
11744 201044 227838 -26803 -232553 -286341 -184667 -54808 -137471 -27882 163729 11313 43013
11733 43013 -171995 -40459 -115615 -329702 -76974 250424 93293 21600 -71689 279427 -68836
11721 173114 334260 -20412 -107994 -196772 -213177 124737 14183 153043 -72746 121325 -48890
11709 -139005 -111385 -71378 -143142 139579 -219697 -83346 161772 -146780 230049 279928
11699 279928 -16704 168100 -3026 -127797 50890 81049 31892 -147650 -124727 -99529 -50174
11688 -50174 106827 86340 154688 222240 11921 106100 -109126 -144336 -81398 108143 -197954
11676 -33471 -100258 -162079 64264 -98428 -11515 -158711 -105145 -144714 -180648 40846 -39380
11664 -38920 -147418 -224580 -375317 -182643 -23745 127697 -23746 146409 -115719 -36535
11653 129189 -72358 47408 -7293 -18351 -183619 -229892 42348 137930 202029 102391 -64865
11641 198720 106334 155693 130338 193139 -229575 255083 -138563 223778 185195 147854 260477
11630 260477 135299 220567 -170469 -153623 225293 -98731 345768 234817 -99633 76877
11619 175365 261437 327979 2173 -169579 -75591 -102240 -99487 -202778 241164 40674 120968
11608 120968 67577 -23238 75332 230543 184692 -118599 72133 -22899 -254672 17619 133384
11597 133384 232473 448283 110766 49390 43559 192139 61525 -307762 52519 33891 295490
11586 295490 83684 -368471 -128526 -62111 198022 -332508 147304 32453 124468 -315962
11575 51608 124944 202541 -191904 -375935 231739 180599 224242 -229685 493218 -213629
11564 -1774 -29331 149940 -40122 141647 318169 285526 240160 301177 28799 -38607 -237038
11553 -237038 230850 -40672 -22295 -176847 140083 -129212 112837 51603 98735 98053 -40123
11541 103732 -112931 -28012 -418616 -72136 -99078 -79095 -68412 223527 252473 -299935 364732
11529 -88835 -46634 164310 305660 32795 168239 105280 33405 -91937 216781 57056 175639
11518 175639 27532 134929 -301590 114071 129076 283071 312444 -71099 180577 163778
11508 163778 174756 223530 263191 -135180 97400 -105044 -25157 479182 267448 44256 -37015
11496 1185 157430 -174486 71454 51472 153344 -37310 199350 224183 207785 245978 192561
11485 192561 400827 -277 511435 -23632 54275 147869 -146781 -111947 -181596 17621 380808
11474 380808 -181222 104194 -235867 -85456 264701 124884 136267 424972 55258 -149075
11463 -47399 -105599 301187 127863 114014 68942 169982 34174 -43994 -257591 335267 311656
11452 311656 -109652 36194 153534 281334 -7826 230156 -24675 169531 -33888 -340699
11442 -340699 145518 498792 21285 82752 282348 52657 125613 205102 367432 -8312 -200329
11431 -200329 -115485 43874 -42673 48922 79614 -48182 323177 24461 224596 -232467 46488
11419 339319 -262941 28674 104286 238793 -47479 -5908 -293227 -42130 37405 -78620 -105806
11408 -105806 -197676 120386 -472138 69572 -9954 233261 -3244 -230405 -29248 -22683 317178
11396 -117248 4248 -291255 -90369 64777 -94136 -145881 -50281 -116118 273439 267767 -32314
11384 -259577 -380743 205181 241368 112122 124431 271618 142017 -117052 340331 -26694
11373 -10660 -97338 -16733 134307 -82091 142730 45908 -342030 28146 78656 238674 -43681
11361 -270005 -307685 151605 -108329 318170 -168523 28409 -80795 199421 -158483 -230995
11351 -230995 88363 -14093 -83823 -58891 168181 131882 -88712 36138 37632 157530 -238994
11339 -5101 68192 169659 102600 359361 194781 -67916 68073 -12164 -14467 -295352 -113216
11327 -54565 344608 -52562 15818 -157570 36258 125468 211715 -236140 156992 -225124 72809
11315 -76913 314177 -170656 -31808 43639 6421 109015 260880 -236308 -283999 194127 29800
11303 -20871 35596 54200 -78691 18355 17663 -90265 -215359 219637 218191 -112191 210471
11291 -154250 -64722 -88717 -63483 -41861 -93615 -340548 -22322 90727 137141 -13764 -146830
11280 -146830 -39469 -364405 107275 -320 256870 113709 87042 218690 107032 -206911
11269 -128307 -117293 -239604 -486107 148451 -236330 52913 152200 123902 150025 -67081 -128224
11258 -128224 31426 144565 -365869 178905 -196407 -47275 -12829 63086 -27157 -92952 -287156
11247 -287156 -133841 165752 -92149 -54885 -119949 -169718 -103897 -70820 -152246 181173 -15142
11235 -110393 -17700 -56266 319295 -347860 -235995 -68685 -84660 258668 239899 78099 -383659
11223 -183365 -205962 -155328 -75736 46417 127123 -16166 -116176 -167277 -10631 -57064 -152200
11212 -152200 -130764 174404 -42323 233803 -241050 -206398 -169795 302841 230385 29996 -1690
11200 -124457 106952 207098 -227604 52709 41547 -188998 -60717 1141 56599 -30616 -27985
11189 -27985 -101124 169510 164582 189466 46558 -150372 -33891 26175 88660 254794 -184241
11177 -333284 -121461 104254 179269 65599 -170704 -40834 -112857 269067 -310796 132237
11166 -81403 46478 -116263 -40596 143098 128812 82032 258759 -42363 107022 -221333 -49527
11154 -13411 400819 169477 476529 -35441 39003 229824 137741 -209153 -107673 -412116
11144 -412116 -280446 4126 182688 240625 147121 321834 143340 251030 203560 -38153 42267
11132 113283 -20736 573 139473 -26377 48824 -13615 305276 201220 138991 46695 188598
11121 188598 -18094 -35992 104380 -169795 -11203 -104700 229569 -99016 -35213 141738 323258
11110 323258 32750 119374 63146 -75542 -5637 180321 158275 -34018 135828 392590 81538
11098 304816 -22279 369873 -58727 -38623 67999 283042 390067 412076 192182 315586
11088 315586 302443 59116 221326 60423 389160 199353 261467 234176 543516 234294
11077 85465 495976 74534 401247 60669 559812 534966 260281 487402 334962 124532
11066 359377 534952 372280 625319 385371 675545 536938 350901 668734 788528 570420
11056 570420 556323 427465 529478 774487 735206 737332 564429 968296 549180 682790
11046 682790 713737 775624 580437 807836 534374 695565 837201 709259 630452 534299
11036 534299 681119 896300 790966 403000 305434 783167 397257 672412 425151 632881
11026 632881 556549 716034 729865 615836 566103 358014 633666 465360 682768 594468
11016 594468 831527 576480 695707 599137 650869 592057 676256 461461 333762 650606
11006 650606 623651 504334 619995 571048 437728 563304 717429 649450 826286 662652
10996 662652 722309 374120 489715 954874 733082 869355 785827 300131 721395 634544
10986 634544 765704 915367 1078221 963622 1089602 878816 1224721 1236681 1086516 1499001
10976 1499001 1605011 2028598 2212269 2523241 2458265 2771890 2367452 2523083 2240122 2101930
10966 2101930 1548567 1289095 1318281 1293465 1449031 1409417 1435691 1666004 1734768 1385421
10956 1385421 1527722 1593446 1246149 1136394 720819 489214 793659 683797 565557 120732
10945 379320 54990 276710 76142 86779 164296 428817 180499 100495 622450 314927
10935 314927 145059 291525 69790 32285 213558 46862 -190504 -173770 327600 141239
10924 -355578 77998 350356 -33854 -28213 -122254 228022 -56575 -18008 -224784 -239396 92984
10912 -7470 -51789 47468 114449 -13720 -80672 -27519 -210524 -177891 269183 -213073 260316
10900 60662 23446 -148043 68048 -60872 123973 -94330 -300583 -84417 164001 14599 -59522
10888 -103636 -145213 -243440 66813 208526 201963 120246 -308372 -84071 185080 -38323 -109665
10877 -109665 44178 -117443 -56260 -164034 101052 -118557 89514 -73909 -28211 -281693
10867 -281693 -147249 -56728 140429 -27741 -49390 -44375 -17436 56303 316690 -67061 -54335
10856 -54335 -81056 -42823 -61397 -84289 -173883 -71671 -127338 -121341 -89535 285463 -109744
10844 -131963 -103811 -10144 3688 -251327 -311613 -192092 -42060 -123568 236583 126361 -136412
10832 -172573 -245187 439261 -114632 -294327 255855 -108721 8382 -50517 173996 -50434
10821 -85828 211699 39796 64739 -10352 -13572 12387 -105989 -35225 59219 96993 350864
10810 350864 -183019 78414 109444 44405 108897 -145687 202715 -224660 452014 -158115
10799 188924 -311452 -405503 -115692 -124299 -68366 270119 -310951 98015 12383 27396 156540
10788 156540 -156659 320532 131184 -323450 124125 -350971 -74350 -60063 -42950 -186470
10778 -186470 208421 187867 163735 167735 51956 182448 148862 -12278 -87290 202145 -191709
10766 5437 -142913 -132426 48815 -212555 -176228 -396796 -143298 51863 -158957 61144 -140254
10754 335777 200246 111085 -296274 109054 266443 -278038 -200147 -45265 108088 207320
10744 207320 37841 -101356 66555 28642 -262905 -29639 -85547 -149644 366355 -91350 -148020
10733 -148020 173133 -183443 96136 -156900 -290565 -282258 -25634 25177 52535 -31706 127859
10721 -194010 -155774 72078 -112377 36575 -227952 15179 9769 -29182 -39239 -254094 -180117
10710 -180117 -101411 108091 -160227 -215790 -137509 -178493 -189741 -309239 83880 -10859 -106754
10699 -106754 -32794 126437 -22921 -142754 29736 -171189 64654 -19421 13994 -28547 -71127
10688 -71127 -114308 11734 -75902 -140813 27344 96033 107611 43085 -71544 -241278 -47138
10676 -180852 -245770 -90861 86724 -67803 125651 -267822 143897 -179853 130889 127899 -299079
10664 -271743 -302959 -31499 75647 121153 54103 115463 88562 -51646 -103030 5218 -132605
10652 217417 86820 -307890 -59084 -88945 91653 96870 -128444 -193934 35075 76971 -15511
10640 122724 -166655 197896 -160243 -6539 -175527 -173192 276553 -7040 43009 -21701 159093
10628 -242917 275776 193790 -84960 84005 172964 14942 -142742 -108247 -91462 -143796 -131442
10617 -131442 -92569 -128169 -32539 54877 13275 -6955 -163716 -114975 182281 -69779 -34510
10605 367398 -149939 80475 144683 148867 -16819 120411 -241993 -187565 -95095 26252 -123151
10593 -81426 -307657 -150684 248655 -124855 74583 -151367 -323663 44063 -149016 -136626
10583 -136626 -279873 220324 -209373 -133050 -189147 49629 199487 349620 100435 -143250
10572 97755 -256450 -46096 -158909 125781 -242772 -173489 242084 -29267 123126 232501
10562 232501 -78193 192274 101648 -100231 -15128 -216828 -173727 63618 -68555 -158048 -26873
10550 -169920 43273 13147 -17368 -221563 -158692 -264986 27275 -143333 -8511 203626 4695
10538 -767 -12073 -240411 -233643 135574 228465 191031 -214539 -32121 211332 -229562 -68951
10526 -273565 -37386 -41627 -21559 50493 -271933 -45110 318098 -65988 105062 -19401 82654
10514 77690 116703 -130643 -250627 74983 -84444 62306 -177947 -199345 15004 22133 -6430
10502 -67776 98766 -38071 -163500 86845 -135582 -20692 -91543 139938 109957 25951 -89821
10490 47227 -80684 -135297 -92768 -82551 115965 157325 193284 257451 277150 655502 588109
10479 588109 248109 219818 119604 188288 250421 75198 146014 92597 -171950 -32328 16815
10467 -162344 -53907 245588 -123715 -303015 -53183 -61896 74492 245315 -168622 -199100 100355
10455 -49066 -35381 180350 -133640 361478 -46467 -383181 221821 110106 -119386 -172922
10445 -172922 -337260 -47646 -166510 -77097 42156 -116148 -330877 270591 -164182 -115186
10435 -115186 -137845 -78922 -276066 111542 -78597 112609 155621 5909 179851 -70236 147911
10423 -16198 115220 131329 -137139 -67557 -105212 34568 204378 17041 -310953 174091 16510
10411 -202268 -263350 -11092 2140 313911 -145483 54336 -244158 304530 -275473 4659 -206041
10399 278762 155474 31262 -95893 -256288 -162037 302319 -103830 187015 -73878 422617
10388 156274 367258 79850 157016 245293 230803 377023 181843 178134 50134 -130732 192423
10376 169502 208217 232239 325631 157220 271818 122474 533593 268440 323246 90496
10365 351021 346115 698180 465058 179979 195396 346026 -31917 -44178 -29135 -108610 404996
10353 89827 389868 456773 277948 254827 464244 154356 240322 147980 406070 445455 338080
10342 338080 168657 187832 220341 165755 289106 270464 634571 282512 -226164 206890
10331 329042 185383 -166910 228035 50417 -252149 -11596 32462 59939 231101 750244
10321 750244 64880 234992 -153632 130229 -161917 -162838 102106 -125818 11243 -172198
10310 -148574 67846 -220251 160754 -184756 -170082 221940 210617 -237129 226143 41250
10299 -449888 -30707 -296379 409260 -60678 330742 -74580 18519 389935 -245428 -190809
10289 -190809 -172347 -248504 -292287 161751 268895 -139768 301672 256732 82427 -151400
10278 64109 424788 -153281 3266 332750 -87532 -220311 54886 -186103 -265085 88213 -91442
10266 -66761 -33924 -234107 -189845 58859 224148 65941 -74182 335873 216394 291668 556751
10255 556751 78341 -263394 -123684 158832 -109155 -314001 4286 -151275 -127749 -35699
10244 -106808 -91754 134412 -263622 90508 -39001 -22133 264692 72323 -226945 -215434 -66425
10232 -145981 -6984 -155063 79760 119442 171760 12783 -250132 -8617 19355 25971 -99021 -79307
10220 -79307 28941 198529 107646 -3487 155293 50475 66593 170161 146633 23261 -105635
10208 -50063 -12852 -241040 -139957 203450 8577 132149 177655 -235878 -110420 148311
10197 152115 -73549 144654 -150685 -168689 -56546 -39698 112555 -93229 34545 -171887 -131735
10186 -131735 -230131 -103917 -277874 699 -47187 -129681 -134941 177036 -130112 -180472 45212
10174 -314002 -75865 -233176 263126 167111 -189077 -205281 -207016 -329586 47440 166162 -84487
10162 -6958 73167 -72813 -39516 19051 -10586 -269169 -31564 13694 -60988 239580 -3323 -84357
10150 -84357 -351981 -39223 -14607 57218 -196362 -90014 -171535 109364 -83946 -276063 -191864
10139 -191864 -300093 -26835 -83685 34460 127150 171406 -142138 -13512 26939 67818 -86772
10127 155377 -45423 36478 98769 -25886 15825 137405 113209 201930 143222 -35231 94443
10115 -237831 -45228 -152373 16800 6830 -151580 165001 -93204 189581 10476 -109200 149225
10103 -45751 103686 -310725 100460 -208589 408048 58952 20118 -213478 38542 -347798
10092 31431 -278858 117732 -331793 -57878 69497 229908 -488214 72528 56059 -299072
10081 17389 95188 -173127 -89741 132358 -110005 -349903 -81373 -269493 92246 -106053
10070 -4856 339454 117333 304619 -456093 -170517 46225 254506 113429 -329161 11950
10059 -523189 85228 57143 15150 -129331 -85127 -111969 32049 -153300 -94221 364514 -1068
10047 71111 73713 -175094 -120656 -45625 -194647 165609 145495 -18862 14693 -210336 -139808
10036 -139808 -345908 -43621 -174361 -418087 -420552 -53363 -245553 -109741 184795 63060
10025 -7585 -1508 386976 -52573 -474145 -131751 -23304 -88239 92871 -27584 286475 -367622
10013 -82368 -141727 221460 124653 51481 -103886 70127 -210010 287140 -433753 -142360
10002 50091 -236158 -146190 -108683 -90789 -138581 49175 59706 244743 221047 10640 -242118
9990 -247500 -237266 -193064 135255 22885 18788 294115 -74122 -35994 108584 23641 -119191
9978 -76244 23724 263008 -142581 -35654 38064 137567 -257383 -74229 -223473 -209392 41427
9966 119363 -87321 185119 -241119 255753 165498 238714 -291867 -239802 86158 -113798 -36409
9954 -182415 -138120 -409820 147065 91989 -208531 61329 30405 -186280 78733 -249683 106328
9942 -258835 -94833 -111777 -188900 -61057 -268862 -103567 -34677 -182821 -364859 -146805 -52921
9930 173885 -136392 -148202 39682 -307320 43615 -120692 103088 -266465 -56234 69114 -552
9918 -78850 152687 -187114 -388936 -414718 144659 113106 -40854 37106 -357098 -123541 307599
9906 -96013 -64355 -111117 64805 -241718 -64754 -140229 45490 -241266 -121680 -151675 90883
9894 -209150 305547 -28280 -106058 -55675 -54067 -189204 57742 162175 -138528 -271166 -15302
9882 -192432 213590 -168248 -153232 -168415 -94695 -17886 -38106 -125441 -213974 156942 -263696
9870 -67897 235235 -266677 -192025 66559 -248276 262698 34536 -152308 -34190 151091 -282304
9858 -328026 69750 82553 207124 -300117 34971 -66601 -185776 156953 -287027 -63745 184356
9846 41290 -70175 229417 -263815 -145103 10161 51603 145696 -124435 -46392 53830 -787
9834 -125043 -290342 -270183 -234612 38389 68801 -129832 325432 237532 -4935 65052 -18550
9822 -307941 -37045 287274 -220561 -233081 153928 -490809 304728 12633 -187301 272824
9811 -98119 -71999 -181677 88706 -147087 140758 -47897 -252495 -12678 -196912 183170 -211395
9799 260854 78748 -2438 -28879 208833 -158196 230611 49140 -169613 297659 -147913 4616
9787 -404530 -224127 -17458 -215915 -237936 -198338 -64871 -332588 -145401 -311926 -10399 -389647
9776 -389647 -203259 -87683 -82818 -48229 -71246 65911 -116544 -204649 -153531 125680 8206
9764 -247900 -240827 -261429 -276873 -82518 -56620 -275975 -101671 -234159 -8620 -165969 -295227
9753 -295227 70890 -294982 -347689 -137974 151260 95615 -245986 -100348 208366 -242866
9742 -9955 114201 -310739 -137984 -48977 -293647 -201592 -78304 -34180 -245909 146414 88988
9731 88988 -131387 -59667 145536 25256 215988 -54706 26376 -307297 -94535 -60979 -72473
9720 -72473 16618 -175221 -10541 125642 52756 -74526 50079 -278548 -209079 182070 -287007
9708 65115 31740 -5387 -188423 -16631 -137455 -23805 11747 299885 3574 -256979 28528
9696 245124 211354 -7536 -207609 90225 105261 91249 103861 -116858 139471 -111672 27016
9684 148841 -46527 -247511 195234 -95017 24525 94196 161912 11449 -50955 160489 -274119
9672 98792 81237 120355 -386791 38581 -362653 -151986 -230854 -222680 -89541 75641 -39256
9660 36163 176366 -22190 144459 1972 -135805 -14202 184850 -312797 39812 144719 370844
9649 370844 440288 -57343 -71545 -50445 77193 -78119 69113 -123380 -257685 -317725 308789
9637 142246 123014 -80664 93571 52523 -228626 -26925 104364 -113467 -153576 158425 62824
9625 -69708 61751 -121811 -89925 265900 77941 -310194 -402329 -282562 89780 124201 -34077
9613 177444 162296 -77165 166429 -172657 94624 -11921 -57883 -590245 -243179 95867 129801
9602 129801 312292 -63266 133689 80922 138420 -96432 -120548 10312 -167530 -2520 21588
9590 6461 -155257 53018 -83846 -137862 282806 29290 -31290 213223 349 71337 -46514 -507655
9578 -507655 177258 -392683 53775 23210 151471 69149 66871 150231 122116 -241335 -137815
9567 -137815 -118804 125131 -293102 -175755 -217830 20994 -228620 167538 -83186 129889
9556 -140548 138870 191180 22676 -61451 207221 -28869 -8199 -40771 157880 -371243 -30449
9544 -69301 -68785 -287778 -326889 -138054 -38137 -6895 -18100 109875 -141974 -536343 -166800
9532 -161083 -80537 -64818 35274 75045 -34244 -579190 -35800 -282941 -63091 -125857 179506
9520 -503602 -46332 4746 -95082 -299882 -363128 6950 -218088 -447911 136726 -83974 -53 -15533
9508 -15533 -118656 -251744 160752 -15172 258496 80423 -68521 146653 357684 -106188
9497 15048 -155644 -114301 107168 -72350 -78979 59849 -334562 -137445 -15890 -51704 19642
9485 -292898 3570 -127800 -289346 -277667 -38245 -94412 -90268 -333324 185109 111691 259838
9474 259838 -157592 -219650 69746 105459 209486 56027 -13978 -308351 -52497 63374 105793
9463 105793 -36701 -223442 -24615 -136934 -238921 -33760 -46981 -85718 -136351 -103000 -3092
9451 109795 -18361 -25622 -46058 3319 -131437 -175430 281888 446954 -246566 -396498 -98696
9439 331196 -79590 141149 184814 -259616 -27389 45910 66888 7397 153548 2459 -125163
9427 63600 -67275 190664 -108182 47620 38044 -255923 204458 -298200 36288 68299 -55495
9415 91515 -173516 161463 97282 -10143 -165302 190000 -77818 252736 9639 -253997 -167358
9404 -167358 -243902 -172655 -1458 -376618 -48864 -183887 135338 30229 -4160 -201801 -47395
9392 -224510 133963 8811 -92744 86581 -166934 -114419 68906 105967 -269462 -57222 -16217
9380 -69826 207538 200040 81956 -153521 -266497 -143016 -66697 145389 271358 -41579 91188
9368 -72569 112838 112358 -12092 -144698 -98989 146814 45055 -167822 -111334 -403665 112855
9356 -111428 -57182 -102944 -65613 -288607 101624 183648 15856 -148699 -208189 -383002 260714
9344 -216415 -79189 -328074 -274077 -354162 224628 -317969 -320857 87995 -86716 -148454 -11737
9332 -228626 -163596 -150591 16474 -36073 -147212 -55637 -213840 -61721 -126163 133373 -71857
9320 42946 45907 282852 44121 256181 -129215 -49040 124650 -209199 -26166 124643 -300866
9308 167666 -64178 -130662 -78941 -15316 89972 -36189 -144096 -307140 -157526 -43266 -40658
9297 -40658 -74574 61559 -66992 -52462 -49068 395953 21292 -226518 -11948 -61692 4282 -152179
9284 59198 71588 -31168 -58019 -171985 -156935 82993 -192984 36263 155428 124241 108914
9273 108914 -264491 74057 -147493 273195 -159683 1588 -118631 -12361 217833 -121215
9262 -284718 -127271 -241571 -12625 205235 -87840 -194616 42429 -151475 -59973 -391076
9252 -391076 -95715 160699 65303 96988 -443223 167564 231087 -320713 -70637 124423 68991
9241 68991 -90307 302084 -52039 22657 127364 -97202 -104629 -287331 216898 67700 -139849
9229 62376 -235746 -39538 286746 -66799 -153578 -98319 -27858 -158000 -353195 -18533 -45834
9218 -45834 11198 -11954 399974 -38781 -14905 -235974 -181330 -178930 124447 -59439 261304
9206 301448 -269647 -32763 -60423 27378 -21034 139923 -20521 -85119 -27424 254522 -257644
9194 -312169 -167690 -39232 55689 103468 -179699 -68513 25117 144051 195714 -17176 239237
9182 -102833 -198532 -31823 -522343 -179782 -359801 -208788 -195259 68522 -212169 -298639 54795
9170 -215006 77110 -11652 -95087 334790 57608 99617 -176377 99018 88031 181139 -128992
9158 -207995 216223 -125391 39946 -67611 -144833 101714 -209725 -11882 27404 -26204 -142705
9147 -142705 -208027 -92515 -97020 -82130 -28070 3290 105896 -96045 34037 -10705 -7074 -195048
9135 -195048 221983 75001 -38898 -380842 91070 124355 -464443 -147325 40484 -80404 -25821
9123 -214611 -296261 -353376 173903 -10509 -165905 -40914 -59866 -124813 -86134 -193121 -65950
9111 -103233 -14129 -138383 -270220 -256864 -248228 -24197 -462188 -372269 -100928 -39855 163744
9099 174580 -123971 -307862 -42114 -222644 -59541 449352 -210238 99960 -206578 55246
9088 -304867 -261111 16516 -127617 82346 -204266 8709 35510 225358 139794 -91399 78506
9076 -192434 1523 -228805 14286 106264 -357272 -341773 97913 395249 41323 -108282 -146903
9065 -146903 -82470 -154057 226623 219943 -39342 53780 -191066 -237650 32305 24580 -67591 102280
9052 214528 164144 -11312 103787 4742 -207937 -58042 -259175 30648 176590 -7794 3067
9040 -113820 -139902 100356 -82386 -182255 -10449 -254820 16979 -164058 95786 -63122 -156274
9029 -156274 91251 -70013 3886 -131126 -176596 328484 65238 -56985 -327690 -112736 -77273
9018 -77273 -145274 71844 -153553 -41709 35629 -151179 398 -134042 -241217 -139091 34040
9006 1663 5272 -188778 159705 -204094 -163951 188957 -33918 219281 242603 -89020 -265497
8995 -265497 -183419 -245253 132030 223662 -70620 -38939 -11397 156214 55268 261797 113158
8983 31487 -360003 -48601 -152353 414476 -115289 117834 -85574 93185 -136180 -11695 -56222
8972 -56222 -180310 -3614 -165484 -2921 -66360 171388 -227030 -385413 -126848 -93200 -72731
8961 -72731 -129872 93421 -195627 -163897 250787 221301 -217818 -39761 32243 -208771 66920
8949 -305871 634 -184832 -94222 -52236 -247414 -76777 -150631 -103823 153957 -160356 185048
8937 44988 86596 107936 61911 362725 323614 308635 25299 54008 107749 192803 316760
8926 316760 223436 550530 1038304 2565210 10825697 11055821 2701584 794130 274773
8916 477042 174856 55660 111305 -4620 -386030 173023 8329 349836 315468 -144616 -32258
8904 -145527 -261812 15427 121353 127499 57974 -95982 -135083 -186395 -250124 -112112 -321599
8893 -321599 237609 -276935 73066 -36045 -5918 255340 -121634 -261310 179110 -161807
8882 -36574 8430 349696 -170803 -116712 -136385 133458 -86524 -143645 -43452 -129347 11637
8870 168477 40223 -146938 -66557 -38936 -402960 -318531 53455 90779 -1409 245079 191405
8859 191405 305116 239797 93392 189807 -167760 -113703 -178181 -154741 54893 93640 -22225
8847 -122011 -195692 -192 -331838 -207361 7357 -270525 -113033 -359893 123909 -75187 103869
8835 -78668 -104275 -287349 227666 -132488 -334076 -34600 44549 -81047 -145280 133915 -14296
8823 -166733 -336651 -216975 -96203 303040 97878 35890 -264028 -44433 70692 -220232 81281
8811 -180780 112475 -40763 -23255 -148849 -330005 -9722 -1990 -10730 -53205 -285342 67175
8799 -311880 128882 193789 -173059 -5962 253214 -37688 -183069 67577 13385 56589 5603
8787 163594 -121542 -214593 -64011 325193 -106555 -252976 48810 -423502 -328820 190506
8776 -35975 -178047 -114300 82807 -290607 -338241 -163338 -73354 110146 -190996 402235 -289971
8764 -135143 161313 -423094 -149803 -18035 16190 -293072 104858 -217522 -18002 70236
8753 -76250 -249752 -24945 126528 -55956 148705 -163870 -109481 -8052 76027 133563 -7688
8741 -207150 -288667 -287303 -380376 -53114 58698 -250246 -103237 153865 -130369 104295 126721
8730 126721 165762 37960 230236 -26420 -309426 -40956 -87547 136346 -245116 171807 -139918
8718 -144067 258371 -158069 -115957 16657 -128466 -161797 -357839 -31670 -109921 119518 130316
8707 130316 -93159 -189275 94167 -71429 140871 -272796 195382 69604 238815 115813 -114734
8695 166881 141940 -215222 19703 -145376 -7357 -155270 37946 112003 -234352 2945 63411
8684 63411 -150583 261723 58188 -168592 87370 282242 23834 68833 -484473 -240671 273348
8672 -146594 41595 22798 -253006 -316288 -178283 553988 -145724 125160 -300181 -107306
8661 -101134 -14395 -231083 -137405 -237636 189245 -90621 -117777 -113733 -88739 -170416 -22534
8649 -34031 -167735 140552 -185480 107639 2729 -347536 101327 75688 -78554 222582 254395
8638 254395 76790 3512 11737 -187268 -64826 -13317 68844 84329 -149415 86058 -256736
8626 -155777 44597 -477918 -126947 -87513 -286669 -130877 -164100 50820 217118 73888 81122
8615 81122 5342 225046 129244 -34071 140279 41942 343796 -213126 -398288 -193379 -30739
8603 -265618 32118 -1947 -281164 18354 189241 56938 -45495 55851 -98292 -17483 -144791
8592 -144791 -276224 93367 -121796 -135312 219740 208336 -328657 91594 -27480 -191758 -96772
8581 -96772 -374208 46259 439664 78007 8858 -26499 117553 27046 -224584 -248738 -450771
8570 -450771 -32438 96953 27846 -321207 104803 -166437 -140857 -68039 -116917 -108034 104323
8558 -51806 -144881 -230244 43446 272658 -34585 19482 -124705 62111 27152 -109151 -45052
8546 81147 45831 351093 303807 13051 -283004 -71606 -9695 -4553 112391 -68089 -327876
8535 -327876 21957 -92253 -76252 2450 -147893 -91517 -149409 137531 52235 95935 57361
8524 57361 200638 -206773 187974 -112423 -57084 -16591 -61966 12724 -24754 135417 92367
8513 92367 -234657 111767 -115908 -235207 216054 -157689 -6064 -36896 -205395 -213526 -157580
8502 -157580 -127010 -65788 -161281 -327878 -140359 33815 111245 -45204 262185 -177728 24733
8490 92959 -352635 -92486 -208915 164101 -78494 99801 -88822 -111814 -21048 136938 257601
8479 257601 -150884 86815 -7343 -436171 -52778 34016 148291 -172901 -99609 -163085 58918
8467 251362 68325 -141982 -123835 -212260 121323 -56920 -444735 331800 -139596 136140
8456 -84323 -117121 -171462 -318972 185812 -50799 66778 133294 195502 -153469 193496 248659
8445 248659 -33164 126810 -31479 -262318 -117964 39271 -183639 88986 -46179 -58015 39692
8433 155425 94672 -125845 -16147 -324903 113473 -26823 -290051 -243674 132174 249866
8423 249866 -441218 7297 -25314 186957 177231 53473 -134456 1557 -220181 14981 171898
8412 171898 -17056 -148622 -267310 -134281 -21738 -177644 91563 -51281 68536 223032 -159336
8400 -238473 -285743 -133021 -273582 -172284 91005 -18758 -24766 49081 -101341 -303897 -64867
8388 57430 149164 -139731 -43653 -133670 -29204 156164 -121473 74346 79608 -32999 16650
8376 94153 -12831 -364952 324361 -92704 -48935 -341059 -27925 -155056 50204 105578 86272
8365 86272 -291141 -55969 -171871 -325006 153666 -37423 -54905 -180080 -133009 -141627 -326209
8354 -326209 -194547 -363588 -110154 39540 -137941 -32545 7523 -300564 -13031 -24734 275259
8342 126445 -178444 337894 -453209 -153332 -235431 109411 87014 91649 -232315 36364 -366722
8330 199950 -176845 280590 -185714 -59245 242805 61225 -428328 -315580 -33025 170536
8319 -104316 63524 -95790 311762 119515 -58828 114628 -220301 -302613 -84241 -46653 144050
8307 -39104 280080 216477 -215552 -109718 28046 82939 237804 26939 -55245 -290491 138573
8295 16448 -119367 -61301 -168922 -230615 -254343 94699 43962 150045 38966 -16987 -216556
8284 -216556 -39248 -92340 33933 -205229 34924 -80962 -30966 -12388 -77677 -277515 -145821
8273 -145821 -96464 119095 89114 43326 -192308 -88918 -259672 -135918 24094 86299 54313
8262 54313 116091 240685 -53084 -100151 78683 22852 54286 298319 -85686 176520 319469
8251 319469 156040 -253126 -288751 120374 33060 -231339 -109779 -188917 -245867 -372253
8241 -372253 9772 -200252 317318 -194019 -51846 -116769 -207915 45504 -159075 -8799 -120260
8230 -120260 332051 22502 316162 273525 -64568 44843 51057 -97317 -139781 -188829 -393541
8219 -393541 -290446 -148684 103581 -169529 -316194 28940 -291167 -350498 58000 57990 -140616
8207 -128434 -132167 192944 9446 -179105 50493 19953 255798 -239142 66650 -17634 40288
8195 353515 -111038 -147568 -186587 -250663 -115503 234951 76244 -232793 -88259 84548 -136671
8183 125614 -329117 -146358 -266761 131649 -91287 -145563 -190020 -13763 -123910 -49145 40837
8171 -185804 215663 -339547 -56449 57107 -198844 2292 -380817 -267004 12486 -24123 42307
8159 268353 14839 -20495 -27259 -62206 -241392 -205826 74670 -120886 -183929 84167 15680
8147 115449 -166368 25085 -56140 151158 4203 143757 -295579 246390 36520 -41441 -278
8135 17538 -446316 -140677 139494 78975 -20405 -76543 -252001 -144989 -80026 -276979 10348
8123 -220001 138668 176143 -22870 -20500 -87908 -159869 -21844 63571 68280 -125089 -75454 -157237
8111 -157237 -226876 -9732 -268705 -210248 -114889 -277837 119616 587 -443403 187272 -161443
8099 -13976 -248493 259522 -107766 -325821 121035 122382 -142441 162480 243976 93729 5481
8087 -33412 -112409 197439 65799 -139891 112585 203657 -256814 98764 -93216 -183478 -223292
8076 -223292 -255531 16668 -131114 -258109 -239898 22769 -125524 47748 -208015 -252501 95723
8064 -17081 111261 -28742 12572 156698 320428 -68079 -4816 173257 -20139 253207 95481
8052 -224923 -88937 -103689 55209 124432 -163643 104633 36690 -340026 291176 69316 2433
8040 196013 200427 -17711 -214574 -91889 -358599 256451 18246 -224499 -28332 904 -210562
8028 -145814 -60708 -219661 -36361 111255 -276991 -85773 140823 -79667 -56969 -158579 -88490
8017 -88490 -248810 -14709 251822 52782 -161265 -161042 75564 -132004 58442 263994 -267009
8005 98926 -103382 -218383 -317651 -240268 -438170 -91921 -55131 47095 152849 -109577 -281198
7994 -281198 176467 -8475 -61706 351435 -269818 83963 17113 -212549 43426 81632 135627
7983 135627 53115 -284903 187309 -400300 126347 -286155 -46852 21632 21378 -282812 -44449
7971 86646 -97617 35124 48147 -172242 56859 127563 75863 19039 -304515 -290441 214099
7959 206104 -209403 -127754 -150457 180524 -123780 -338557 -184368 5248 20080 60926 -134073
7947 -143092 17370 -267026 186699 -331471 143389 577448 -130644 -199461 146134 31686
7936 15954 19996 -46207 -221075 4402 216646 -86146 -257129 22734 -121959 -207378 -219620
7925 -219620 205443 48836 -171357 56720 13928 47402 -135814 18358 -279438 -1850 203454
7913 265453 -117615 -63429 66826 -252896 -91533 125730 -102962 -129348 197734 -125971
7902 -418216 65550 -139468 106486 38603 91726 53482 49725 -188677 -3803 -164516 -61198
7890 -202597 16840 68247 47553 10630 -93673 270041 -7855 -173503 70605 -98180 -109701
7879 -109701 253416 -180868 121349 125243 9147 -20588 -151766 -283444 32531 -119371 -342479
7868 -342479 -56773 125062 -165037 16324 -119329 -49064 -111920 118529 -282018 -265401 -159552
7857 -159552 -89192 87719 -126649 -2988 -68773 -11977 -28460 289279 -150649 -76395 -27106
7845 79318 65414 -174100 464676 -373100 133617 131915 -277634 149072 74469 215857 -166809
7833 228524 -134310 -151263 2190 -217976 1505 -14705 -204433 -276508 -198559 233031 -24310
7821 -188496 264810 -30302 133240 2607 -172505 -121740 -49819 -263134 165118 347693 -79352
7809 -107600 81598 115285 -163290 72109 97182 -80240 -99647 87361 109852 64667 -264784
7797 -63688 -124524 -252296 249385 131141 81910 28571 -74372 -54891 -120858 -60208 95150
7785 106423 86344 -199987 317077 -93012 -262927 -305005 -238914 -54677 -72834 -63651 46509
7773 -142958 50868 148430 177491 -44521 -154498 -242202 -226125 -72369 -45266 -135503 -207694
7762 -207694 -387837 266909 -329269 30627 38888 18343 -217711 -274820 34146 343933 150725
7750 -185526 -29561 -222586 -458672 -525484 -87839 141571 -118285 -112401 345492 10387 191483
7739 191483 26645 -17515 -184286 46518 -152633 -261141 -72195 -101602 -137766 79191 522
7727 -31680 251341 -95355 13170 -22507 -15467 -69204 -46236 31674 -167454 -89932 -18144 -260706
7715 -260706 -53147 -304085 81951 -199491 -3142 43784 -11096 -124467 266428 107773 -123032
7703 94553 -105841 104880 101532 135613 -62394 -136400 -33460 61780 -26819 66444 -243302
7691 -119401 252786 -44357 139123 317331 30261 -143992 16443 -12820 -216479 84316 -432795
7679 -84891 -122225 -160131 -62282 84899 136977 64337 -206971 184712 -182860 -215699 -210940
7668 -210940 26734 -18354 73331 5794 64291 34317 200511 -8115 -2645 99579 -187974 232190
7655 -78357 -187019 -70863 -12184 -143016 -225848 -135692 -253118 386249 -244318 31360 -257415
7643 76011 -69515 -93213 273821 -136166 -71918 -135452 332451 -28913 -86187 76129 -12656
7631 233736 167684 108409 161674 -172057 4047 111450 -205655 41888 -56433 152734 -30118
7619 -74851 -165894 -245473 231971 -256626 -100165 -178426 17160 -17605 -72186 -249402 -177863
7608 -177863 99090 -118974 -64675 -295527 208650 113895 -193098 57099 147108 121730 288215
7597 288215 -395966 202727 -93573 -123618 -321599 -65444 298049 274559 289300 -154503 54243
7585 153760 -176415 173558 98373 31856 -282405 -182929 -55994 165849 -207125 -120118 -28974
7573 -51411 109399 -108605 69622 50282 329557 92068 224486 -133397 -71170 110771 -81383
7561 -267829 -353224 -438433 151313 -177389 126539 113347 -173509 8702 -323343 80137 14186
7549 93353 21181 -6485 242315 5865 189867 -39577 -312951 48608 -236506 -152360 -95415
7538 -95415 48841 111553 -64208 85685 175801 -215142 -333328 -115351 129543 -125122 -39686
7526 -32530 -265404 -451956 147478 53785 128955 105492 180521 101525 -131980 -156161 270505
7514 -362340 -109750 84200 153241 248565 -269532 -139954 -40170 -503570 11454 -79868 85767
7502 63536 -144521 -25767 -237910 112121 271846 -204640 -200281 -254839 -23356 -475299 -73780
7490 238263 346951 -75366 83368 -97733 -133752 6095 13006 321517 181750 204313 241844
7479 241844 39049 431649 46625 -140278 -40538 -223761 -122719 61652 398627 -184446
7468 27180 -75110 52865 318721 -177086 57094 222598 -271766 172848 16631 25236 -389
7456 -378502 218601 30159 203140 139139 236901 -9799 -203650 -57077 -73018 -76753 268 198052
7444 198052 129692 392185 77102 -188064 -30623 24423 -135859 -213094 180362 -25102 -179762
7433 -179762 349075 -62497 53521 -177852 -342844 -135127 -280742 143861 -257580 6446
7422 61577 98206 270081 53487 37578 79498 289574 191138 11723 -361334 49690 92999
7411 92999 -166177 -39546 -22321 -43838 168197 -68424 250257 -176182 -202466 -136752 82318
7399 -262386 43263 65665 207430 -69665 -391432 -94147 -227793 -102249 128826 -321627
7388 296837 -32593 -108909 -73085 171684 25676 80014 -39330 -6015 -317206 -140514 -172059
7377 -172059 -199424 -76518 81503 -418312 -298675 -48303 76179 -312613 72114 -40015 -11696
7365 -37604 41103 -32985 127797 -101648 38220 5347 -24812 -340764 -40131 -72153 -103184
7354 -103184 -341386 -446423 -83437 -21097 86940 -146854 -103931 51504 -166654 -39516 38103
7342 -168534 -270406 183171 -252726 150851 -377292 338014 -394263 -25475 -30188 182891
7331 -142688 31668 44627 131998 55944 -4862 169222 46249 -90383 51197 -107313 45552
7319 -111478 -189157 -177492 -172877 32451 -12309 -255990 -115943 59706 -58852 -332705 -34869
7307 -28148 -104324 237595 315149 45195 -105031 -165925 -47043 188434 -251810 -63287 123308
7295 -337103 -29455 162999 -209267 337359 -181152 87240 -70720 156 78396 38642 -15142
7283 227606 16131 -36891 133738 -10550 -3441 100525 98575 -74501 -236971 -208740 -185397
7272 -185397 -108827 -584790 -217300 -211483 -119801 86943 201699 294842 210809 -215374 -163848
7261 -163848 180789 161908 -136802 -304660 -175942 -301328 -57588 135821 6531 6344 25526
7250 25526 -176242 -49711 284273 149321 254619 -255715 12703 51126 -120602 154077
7239 39883 -63471 -457557 66918 -84710 -97356 56939 -26709 -77435 65918 -6423 103021 237774
7227 237774 9868 -181909 -144700 69689 75338 -135357 301856 -46563 50959 -275145 -39779
7215 142122 32534 29341 -104726 -232140 -173627 53813 92511 -296417 -6412 112813 -51340
7203 -16211 -129963 -69549 -54517 -204873 192923 15045 6896 155673 59688 -172682 22468
7191 -103158 61875 271826 190426 48592 -287759 -371097 272741 -34152 -75126 216750 66497
7179 48324 99684 -286782 24546 -84539 9524 -305740 40568 215173 -26085 164245 -34243
7167 -237142 -228117 45153 55323 18631 -76801 241129 88035 -223417 -67440 -268028 220868
7155 -7447 -147908 -175623 87580 -97150 -124753 -149234 -138855 -136919 14017 -122504 -81559 18111
7142 13926 94061 148410 -278680 -201436 -416922 34588 -62897 50838 140554 37768 -182801
7130 -308612 -132737 -171753 -121036 -27075 -356419 126480 -277463 -51236 23590 219962 -91891
7118 97469 -74815 -127527 336008 137832 -186419 182949 42954 160936 135946 107946 2209
7106 -43212 -19591 -50076 -114502 -132131 51059 -46104 -400974 -40819 -199687 215950 32616
7094 -60871 -450499 113577 21682 -17781 86989 -194093 -80075 -359005 50828 64190 -14994
7082 -136635 -101755 -116946 -249854 461510 246858 -210817 -122723 -103592 -73010 279489 109579
7070 -128118 318999 253048 -77384 66209 -60221 -87551 24597 -136224 72369 -241348 -64352
7058 154026 -3532 70131 317619 -169396 -96320 183621 127783 -22938 154697 -127041 32774
7046 -54359 -264648 -107980 124000 20706 31638 339675 37161 52352 -69552 20937 4517
7034 -317196 -130516 83900 -185091 -18265 -38196 -384951 48316 218901 -106655 -186604 -228579
7023 -228579 154366 224252 54135 119962 -158779 28397 115047 -140472 -290153 328798 37836
7011 1578 -313183 -107415 -84101 -8335 -230118 182344 -199775 -102579 -52947 141811 -312198
6999 102280 -196776 -291819 -208926 -25851 -80239 -95964 3068 20277 500 126300 -142483 -178631
6987 -178631 -165218 41107 -175878 -270027 476056 -89555 -228411 292981 -34446 148856 59557
6975 -31011 197746 5066 -200743 -53319 147699 -261306 47634 -216110 83434 -465625 -162355
6963 -93171 -110048 -505567 85059 104792 -280173 -230390 -60590 -53622 84309 389922 -181818
6951 172824 -222803 48431 138404 194693 42126 2116 347952 -115203 -24453 371399 52991
6939 -168182 7489 62621 -113114 -36857 -135006 26225 -252695 20665 -5843 30224 90698 279095
6927 279095 290751 -38255 -212855 -72746 -138976 -164893 -136855 -19879 258352 27639 290166
6916 290166 -10236 14394 65074 56295 -115275 -51543 -221429 -199602 -107255 -405517 -139086
6904 -11879 -40409 -137605 122263 77149 269567 -84676 94362 -41203 144954 -202011 -452046
6893 -452046 256580 -22105 -137348 -146691 284895 -163496 -29179 -118497 -44424 89719 -286808
6881 137023 -437902 131988 -43567 -206107 246520 -249384 145825 296105 -127831 139199
6870 -35869 -76228 37034 145734 67170 487506 -108102 -114878 -161710 -381353 -217706 -11683
6858 -170653 -87258 -105414 243082 -125847 110835 79137 -29421 108703 185070 133159 77398
6847 77398 -61799 -526688 39493 -210541 188553 61638 147660 -180325 108738 -174005 330153
6835 68604 388709 -67191 234221 -23736 -118381 -106345 -60371 -125708 -324381 254014 -111415
6823 -323964 7847 -41662 -111755 -93410 14747 -230474 -254590 -98036 43384 134033 112317 242850
6811 242850 -276668 1843 60712 -51198 -179898 16271 -1001 155734 23277 -81509 -31699
6799 141002 155668 192452 182981 -30404 -120195 313187 173633 26772 -45215 132112 -5110
6787 -65291 -326792 302258 245892 87316 -12545 -306047 163004 -94356 -244662 10117 -153776
6775 369596 173609 7577 20026 -164943 80313 150892 -162860 60643 84410 99651 -200760
6763 218113 -77157 54206 221745 -62674 40115 -297399 -34899 -85410 34170 -199757 -187564
6752 -187564 -253995 138117 -200574 281855 159246 -400555 85075 -280183 177812 -325209
6741 141614 176183 30232 89607 -67806 1248 -24329 358593 -122802 104809 194401 -107728
6729 58141 -106156 -36730 -85159 -16088 300946 -191149 403714 105167 -122381 -169762 -261479
6718 -261479 -60871 -76611 245874 2214 -101816 149699 -249556 42064 57628 47637 -255127
6706 -73448 -172981 -202541 -96953 150031 -296789 287455 163679 -179344 -76099 49091 -72251
6694 -191322 -162085 17686 -203944 147441 179458 88595 189143 -2018 83259 31003 -7336
6682 19540 1671 202957 154015 7146 136736 -16007 -79623 -67316 -17812 -105561 237945 320491
6670 320491 -43635 199547 -20007 -159124 -247299 -209010 -130893 -194128 54086 -323824 -54966
6658 2965 -88882 74866 -84532 -55454 -133531 2164 139095 224560 116018 214138 9562 -221479
6645 84718 99531 -246785 -45327 32830 -209834 33425 -144033 25243 -121267 -201755 -51254
6633 117416 341063 -145986 -8797 -168472 -183621 165279 -47848 -4616 -54241 -250797 121774
6621 170515 40244 220771 230832 3240 -218925 309887 -43031 116848 -188580 277411 -180264
6609 -9142 -45369 -82244 15436 -122571 221802 145675 -64103 13129 -37550 214396 41041
6597 47425 -303805 -136549 -55728 -110142 -126526 141224 226156 -40020 189859 222221 123263
6586 123263 -62121 73577 -178344 -101501 -105384 -103075 -60431 -116548 -52567 -84007 72674 -162547
6573 152731 -167474 72299 -233621 -42525 -41067 179277 -234373 118522 -174856 -143378 -210124
6562 -210124 -22325 11339 -210293 12237 -289570 -49488 193670 108152 95090 -410143 -4103
6550 34779 -249848 -152904 19832 -35612 -82506 -6028 9984 -16634 -31834 252410 -197841 -78533
6537 -57932 -43803 -114620 -35710 -251376 -133136 -235014 -226310 32573 -57485 124024 40117
6525 -219248 237566 217841 -62556 39909 -15772 243440 9703 250023 -37901 174290 153388
6514 153388 -134481 -209669 -190898 214225 -46931 154685 220263 147111 201229 -10955 125014
6502 13287 44088 -214457 -385226 -338146 71565 19966 -416081 -2543 72547 7729 40699 -301842
6489 196929 203420 -80763 -359146 -22589 90155 106924 -35197 -166693 116262 66651 -83166
6477 156275 -236812 174586 74732 -69956 -3580 -112285 287392 110060 -406180 -262107
6467 -262107 315354 117259 200685 81614 -21916 -88644 242905 -149943 -173812 162059 143631
6456 143631 333798 -27641 244477 55570 -104736 -88115 -246829 38660 303818 73070 -21875
6444 71192 -210718 -94177 -267197 -133551 143900 -32750 -36207 -3795 -45706 23957 -371358
6432 -201994 -238558 -125112 -27432 -168410 106689 -323105 118478 155792 11185 384535
6422 384535 74837 -599008 -253970 32929 295651 -154571 131688 -34374 65123 263142
6412 263142 -202134 132014 -20184 51810 32015 -92044 -117651 -168065 77485 145696 88704
6401 88704 201283 -83640 227788 -81111 66734 134390 -151430 -38936 -318127 -106065 -78363
6390 -78363 -442999 -54759 -121246 -116001 78887 -338130 -5701 164130 26308 10394 -56969 197186
6377 135269 -101633 293836 137160 -327983 213997 83579 -203551 102176 47575 -225468
6366 -116318 22746 -203460 107316 16075 -47140 213150 273748 1615 86569 8080 48661
6355 48661 275796 103521 -16920 -409485 -155198 -115856 24054 -444497 49472 -72705 493081
6343 57010 -227967 -74375 316166 76946 130978 32 159853 82001 -118866 -73047 -151156 -212984
6331 -212984 -156337 67211 -289355 115605 -91570 -155110 -354877 -63743 143754 -39806 -256667
6320 -256667 283839 -203983 -322345 28824 756 -116583 -14080 -30548 244109 72727 368398
6309 368398 292587 48627 155453 -174912 327541 159727 -325045 167020 104791 -16969
6298 -42435 -101443 -406924 14834 76891 -116631 -38723 111017 -140007 10451 249963 54156
6286 -61228 53321 -49417 -101299 -355307 153520 27897 -91816 78557 91435 242960 -71658
6274 -140212 155843 -47506 -78496 -114622 -82166 94791 125565 -39388 -3827 1713 -8692 -116260
6262 -116260 -97201 -181770 64825 143319 -25603 -298149 -10902 -6811 286979 214581 -98406
6250 112412 131127 60944 -71903 -225870 -91557 50663 -133182 -196388 135260 -194427 -20131
6238 151867 -175824 179531 -15592 -200978 -266388 4136 131526 -226237 -77357 -26827 90864
6226 63303 -24004 75388 44556 91137 105915 145767 29970 -237041 -222209 -67601 -218134
6215 -218134 -30209 -80087 -278920 -318604 164728 1444 130708 228688 -49020 -106925 -134220
6204 -134220 -269972 -246389 -190396 119521 -59626 -149324 751 -141227 43548 -239644 -251957
6193 -251957 -189216 -218672 -359836 -336268 -87842 -78439 -125785 289483 -190430 -60637 -94680
6182 -94680 -58569 483081 8631 5275 -76505 -212935 298931 185236 -226874 118653 -6062
6170 1440 151267 -10841 -99821 93754 -287007 -149280 -101522 63228 -185369 -227887 -8557
6158 96214 109637 68757 -78099 180905 73026 31386 73093 -179900 155743 91264 -291905
6146 -141599 -127265 150819 69001 -367073 -127611 -5696 166016 -34549 -2187 85963 134245
6135 134245 86038 -88736 50438 205139 -92274 -40082 115335 -17307 -323843 181472 89240
6123 -216078 -47876 238699 -208845 133961 10208 -452318 -145558 37035 131378 113165 -224230
6111 130172 20509 260029 -213021 -176712 115167 2600 64960 -51602 253728 -137813 -141026
6100 -141026 -175297 143597 -37753 7504 199324 252240 -251035 294011 43576 371357 -59203
6088 201535 -223764 -26794 -57360 27766 -121041 263469 -165611 -37203 209915 -44611 307957
6076 361630 -132740 -112648 -160565 -292180 -80767 183012 -40932 -202025 139015 231135 182242
6065 182242 265990 206966 64623 82237 -44318 49897 -174501 -137296 -257385 -416435 248359
6053 -106467 -475038 19608 -376454 -36107 -50395 74764 -54131 -166949 89492 294784 111979
6041 150689 126300 -24394 7173 -135950 24864 25414 214682 -23411 -34553 85802 258556 77435
6028 -20701 -157300 2950 195767 -106101 -133310 44930 67693 -29280 79305 -90522 -92418 -54843
6016 -54843 -59151 72068 -41177 -345974 116822 56291 -18853 316356 35975 72530 -15425
6004 26301 250267 105533 61749 20506 81896 81401 162217 -25456 190449 -180597 166056
5992 201182 170140 139924 -178682 125965 -41573 -165318 -71865 -252208 -140808 8639 82513
5981 82513 -185285 54389 -133913 11647 -165082 -23259 -12714 106838 220259 -70676 264160
5969 -68259 -207486 176711 95056 -168987 -49111 -86758 35211 -32595 109749 -57333 -71777
5958 -71777 -244265 -139179 42617 -129788 352529 -43803 -21381 -135384 -292375 -320557 -221291
5947 -221291 5683 376444 -310142 -11993 215033 108360 -128585 -75056 -218477 -305435 119663
5935 -16282 -238502 -187915 -156936 171886 -11921 -148493 -4909 -82221 22073 -97068 -160882
5924 -160882 -7044 19261 27633 165543 224444 -55929 159368 223872 78185 135254 97683 -295894
5911 113583 -13852 100261 -93229 151604 126598 98455 111485 -254403 -259685 -166730 -102819
5900 -102819 -3655 -102343 -143353 -121953 178210 83892 32660 166226 -62237 286312 -208123
5888 115004 -218733 -345461 80533 -249006 -9147 -13245 197514 169854 110144 199385 372062
5877 372062 37740 261883 -103006 41650 29998 -10901 33037 106277 102837 105859 -171782
5865 -78466 101048 -98582 -71993 -40921 -346730 168953 -22082 -274255 -156357 111447 -153698
5853 -293582 15913 562155 -238215 -119528 2643 -54913 93169 240651 -26704 -54621 181159
5841 -205042 46391 76792 281835 24422 53577 155207 -65966 36701 151908 -2133 -93991
5830 -93991 -291625 -402578 -122808 -28454 -127909 -83434 241154 37343 -108689 -22879 -307041
5819 -307041 351470 39275 78906 -81487 -114691 -7484 36660 -210296 245058 -340017 76353
5807 427641 -386744 -27661 33018 127574 97903 9669 136419 308974 197188 -131302 85463
5795 30293 -113280 222956 -142807 -15420 74617 173707 -165212 -139812 302151 -151708 -75935
5784 -75935 103013 28977 -54986 87896 26883 63950 -7058 -453403 -75230 74448 -185807
5772 243657 -358697 180376 -90207 -186680 -15936 -345394 -330850 -278717 -62350 -52546 -199322
5761 -199322 -21378 -50189 -250336 52238 78620 6357 -35891 5938 -71068 288530 147532
5750 147532 59716 174455 98568 -18137 -132737 46989 -130878 -121247 -262206 -133192 413430
5738 -34006 -151534 53100 -132941 -16292 -125413 -123667 -44451 -386761 441330 -235979 -56266
5726 -181784 -185653 3664 5821 -20180 -98421 10913 -93151 139206 -142033 -121506 259914 53358
5713 210491 41606 323152 37149 -68319 216679 -22264 198962 -189118 76870 -27634 42352
5701 -159270 67616 -180829 -51718 -190829 40396 -43007 143738 -113632 -86279 227521 14172
5689 205361 31430 146966 -33682 -244861 168867 81146 -211032 218730 4271 143175 -321904
5677 94223 23703 24396 27967 167133 -115007 -341870 63958 -224605 -86324 -146148 241292
5665 -2005 -192256 90914 121767 -59488 45476 -171940 -124649 21016 -306899 -114936 -125476
5654 -125476 -203301 165140 -147568 156487 339167 -291297 88986 107670 26869 96874 208140
5643 208140 -18618 39017 18271 1671 234641 56193 146501 -213374 -201118 42232 150830
5632 150830 -34767 115958 14975 429001 171469 157485 -312454 -29330 264331 -56747 119983
5620 -166000 -11130 39908 160965 37872 -27070 -46091 124585 -332175 163228 -176129 57050
5608 25677 60523 290466 -99173 -56359 -160515 -46001 -84826 -90450 152164 -51206 147374
5596 -303171 170058 194529 -261291 194743 -132275 -128751 -213163 -50963 230242 -239206 -25657
5584 40371 -279969 -167117 -148951 -16066 -21808 -20246 70142 -367009 364311 82528 -228231
5572 -54623 134400 29647 -84265 -60731 96531 -121739 10913 -78252 -243153 -63204 85009
5560 -15932 60101 24738 221658 2189 45442 -259182 144400 -280054 -155094 -155853 135867
5548 -153194 41506 167039 -170995 7823 -43669 -153068 166236 86516 21262 82648 -186577
5536 49280 -51985 -277034 333594 16487 -39131 303952 -124119 -2558 140925 100506 -177256
5524 -117969 94101 79069 113307 -51999 -8423 -143994 49897 171877 -127887 -47900 -82700
5513 -82700 72034 -34136 -195682 20796 -47360 33520 247314 -38246 -397266 -310413 214989
5501 89126 -103189 -38652 -23509 -224445 290463 71329 253689 145181 -61171 154938 -105947
5489 -35307 -478061 -44411 203821 30308 358313 99444 -51227 -97669 112487 -133473 -352703
5478 -352703 149362 -465332 236517 -178285 195612 194653 -149864 16384 52230 3686 100959
5467 100959 -25284 141477 212646 -167551 17636 238332 329820 -148181 223652 -161822
5456 50417 61699 189901 181577 85902 -257049 175834 -231701 151351 -253405 81184 23245
5444 149581 -148918 34764 -195629 -127623 106491 16775 323233 -210383 -215004 22378 -408326
5432 217070 72169 -96485 -95031 -172182 102580 43523 -472092 -192285 -98357 -44714 -122086
5421 -122086 -515215 -179228 125614 59421 -156670 -16805 211183 233144 -180849 -139889
5411 -139889 167906 81147 22484 -244707 -113729 114981 -83450 170035 -318369 365331
5400 31661 88722 214926 95460 -220994 -23920 75380 223831 -26716 164438 49987 -100772
5388 30176 28776 137435 -365877 -11698 4803 -30928 -34742 -40384 -244339 -183868 -21911 377038
5375 70751 -15174 178535 -45236 71109 -88973 269435 -45775 116832 -62439 -182332 -761
5363 -227251 -103574 -64286 156567 256387 -206503 128034 -128818 -134013 -169310 173372 237361
5352 237361 70923 244956 298002 -63369 127775 47368 -78729 325154 184348 45512 26909
5341 26909 279270 -130740 -8799 -161824 10358 -39895 -60616 44526 -62850 125798 -85419
5329 -291489 470336 -95799 46600 132112 -118900 -464228 4028 -193989 -162454 -273338 125752
5317 51765 -88440 63400 -112443 96419 -156721 -152224 -103048 -61406 110981 385853 -411114
5305 -315697 -20013 132471 142793 111602 -43427 285481 562943 -14518 -374864 -345127 57181
5293 -88784 34844 -150564 280256 -89564 -63307 58427 209195 2855 -81000 -210049 -140108
5282 -140108 149329 92632 -131197 146686 71322 -110019 -201065 90285 -30621 356016 286837
5271 286837 -164670 266316 2078 -245649 4782 -80611 -62927 66179 -24271 250109 123231
5259 -110375 -287155 20285 -201170 245051 -121677 -191943 16699 209882 18498 -110300
5248 -273826 -175564 312953 125230 149296 177065 272722 -62714 -42411 -154401 -132264 119109
5236 -336117 85597 40567 -120466 218401 -240065 69002 -86859 40368 36662 189737 199357
5225 199357 -31512 53862 179810 10349 231859 -115057 -118228 -134163 49473 111431 133339
5214 133339 -133912 11056 -328980 304886 88809 -17065 -18139 164014 370630 -147275 274538
5202 -249944 86781 -284646 -266612 119933 134732 239466 -140152 -78920 120758 -8385 -82185
5191 -82185 -36671 -187728 -7946 286074 -376284 115952 -229302 184144 -139379 -3384 -97770
5180 -97770 -14219 -10433 29910 139154 -355222 -118362 28254 201439 40418 -37764 -220900
5169 -220900 -293864 -39333 204206 -6787 -16710 214790 98260 -35330 99337 -85694 166134
5157 159842 -131714 -368335 -86209 -6206 -311393 -269207 211437 -199558 8387 -65580 288442
5145 -46788 -308196 -87734 204715 -33396 -30686 -56931 162552 159302 126260 -100100 -59498
5134 -59498 -166549 -64707 43202 -71785 262969 -27577 -66991 -123734 43614 -113921 -305592
5123 -305592 -59820 89162 28026 -101184 54226 23618 220323 -13759 -137615 328557 17532
5111 90304 212321 -15261 -59484 -160975 60057 380310 -35639 64788 -79868 28513 50002
5100 50002 193968 -112131 -96336 -172943 132001 -30626 -162731 -100144 -68849 -119526 75752
5088 411885 159374 659575 -150369 -50284 126551 31171 -27067 -116230 147374 -53245 45656
5076 397475 243190 200765 27013 -315338 -117198 -67891 282054 22 -107563 -73788 45305
5064 430355 311148 169187 91595 17241 -87354 60643 -39118 -3176 -113801 144924 -75343
5052 268216 59971 -87072 412543 111968 34912 -153770 -340505 230322 -159103 -125351
5042 -125351 106184 -323713 80931 25976 -19466 -224487 -64649 -151362 199097 31683 -81224
5030 -78158 25661 149988 -269277 -382212 -66232 -166401 -169435 414 -203596 228063 -34546
5018 242563 -130037 894 -19572 -222404 -342460 154389 -223665 -101995 -45795 -20612 -106411
5007 -106411 48224 -98498 -75148 29141 -519053 186773 217660 134671 30944 -162069 66935
4995 -309812 -9088 162388 -294940 82818 188544 -42637 -260108 -299791 87646 326872 28702
4983 274612 299086 131137 155899 -120747 -241743 -97415 -25544 439637 -186291 218321
4972 -79522 31885 -102461 134686 44171 -231741 12012 52946 276567 106856 85884 -35274
4960 85010 138667 164544 -3709 -18134 77392 -99714 74558 177441 -112484 -3698 -39580 -75322
4948 -75322 80265 99278 -283581 -310661 -184976 -435598 -226166 -4798 -94812 78497 -217303
4936 -175390 144477 65702 294337 -91353 59640 -103475 -128376 164258 -15648 57981 107921
4925 107921 -135445 270921 152553 109455 -87239 -159288 -70313 345385 -351 -223204 -74120
4913 136739 -102682 73115 161924 -5789 7749 220039 -73953 -116595 -105705 -180128 -113802 -119614
4901 -119614 231755 -167076 -151651 -60759 187858 -37138 143545 138187 -77596 32732 -89788
4889 291555 55799 87558 -28408 -56481 -106484 -98368 109318 265046 -440407 44897 -174832
4877 -191309 -8537 -34805 64082 -182249 161750 -237211 51948 -121679 -149222 -136479 14418
4865 -56508 30478 241311 68677 91802 -16531 20531 150390 -653 -101418 101670 -123433
4853 274962 212617 272896 -33713 72185 99398 243691 182495 70659 81743 -90301 116571
4841 -106004 165049 48399 27576 162091 -493470 190500 428451 -170399 112636 486746
4831 486746 -73667 295560 16703 14390 -99558 -34784 18244 -236173 152664 142460 -276481
4819 -325623 59717 304654 160899 224621 -159002 -317500 -5556 169868 -154478 99908 -289009
4807 -127680 195742 -191723 91441 36968 -21958 -136346 -125673 124549 -867 117629 10752
4795 -355856 85511 -206511 -232731 28133 -82239 -64308 16090 148658 336535 -18476 134690
4783 35470 217915 -153392 216268 -89231 267489 126528 -149677 -224964 2629 -215392 71519
4771 -30940 -133341 85077 100809 201794 -210890 199199 -7250 149747 -149261 248536 175535
4760 175535 99561 239806 -306725 140211 413426 87078 49001 137767 -99350 318820 -176270
4748 112309 529991 -134281 -231782 -253015 167378 284380 25438 89987 59152 -29709 -256214
4737 -256214 -185186 254388 -175204 25781 -46491 -1025 97069 -289271 -22577 -54618 -269683
4726 -269683 538321 84736 -105999 -8799 -341149 112689 -22655 -95586 268166 137468 160151
4715 160151 128590 -12658 68581 182537 163412 -265866 149016 -107967 -47388 -39836 -62824
4704 -62824 -176488 70786 131570 42192 -224341 -239564 -232206 -20885 987 -74564 -207950 -378887
4692 -378887 213632 -53014 45005 -140413 -34613 245131 -229833 172551 -162614 -17939
4681 -1866 -7827 -136063 38011 -118121 -258757 -114163 -132864 127517 241347 52971 231143
4670 231143 13336 -149366 88609 160969 -59716 100923 73964 -166281 174290 106356 76906
4659 76906 37328 -36066 283071 374820 114231 100329 -120379 127559 125726 -58921 -74895
4648 -74895 -152424 7367 -188744 -61962 -84278 -21260 197795 -508508 115802 269575 -178860
4636 -31762 353429 -127416 138912 -30326 96660 374095 217642 58234 -92892 -102305 -427376
4625 -427376 79893 229165 30936 -302467 -141738 -28517 -13594 232715 4927 -159083 92090
4613 159848 61125 238557 -46618 -90082 -27728 207220 4646 -35924 -75675 -168694 194917
4601 -19166 -188368 224772 286093 -51365 -21344 -193555 105149 96185 -253747 167509 88224
4590 88224 48071 -18508 124838 -301509 -159570 171521 -4627 -118571 -335370 -95666 -175694
4579 -175694 -49443 81701 84503 86640 143139 -53836 95431 -96378 -14475 -39655 16158 26631
4567 26631 89233 153093 99073 -114962 35742 -39170 126799 -109565 -62069 227812 -357265
4555 80188 -83550 221816 113138 22626 -371271 98430 -17142 16233 -26609 -20447 92417
4543 -183768 52390 -165028 -200093 -14923 -41049 127637 -196943 194807 -156905 -39633 109729
4531 -68121 82137 -215873 303250 89954 -27422 -138944 273785 444687 -98700 -124564 76657
4519 269218 -152629 111058 113307 -276161 -62392 41110 141693 -121004 -187689 161368 -272287
4507 -66013 -39777 9587 -45269 135783 -13590 29150 -176802 34067 230520 -172016 63882
4495 279740 -142060 223752 65180 61733 -75692 119082 -181406 -134408 114099 -138811 -51815
$$ [...]
##END NTUPLES=NMR SPECTRUM
##END=
