
##TITLE=AC1376_CRIAH12188_7519012_AIMBLYGeKM
##JCAMPDX= 6.0         $$ Bruker NMR JCAMP-DX V2.0
##DATA TYPE= NMR SPECTRUM
##DATA CLASS= NTUPLES
##ORIGIN= BRUKER
##OWNER= Administrator
$$ 1.72 TOPSPIN		Version 2.1
$$ 2013-02-20 22:23:27.618 -0500  Administrator@X
$$ Compression mode = diff/dup
##.OBSERVE FREQUENCY= 400.02188249412
##.OBSERVE NUCLEUS= ^1H
##.ACQUISITION MODE= SIMULTANEOUS (DQD)
##.ACQUISITION SCHEME= undefined
##.AVERAGES= 64
##.DIGITISER RES= 22
##SPECTROMETER/DATA SYSTEM= spect
##.PULSE SEQUENCE= noesygpps1d.comp
##.SOLVENT NAME= COFFEE_meoh
##.SHIFT REFERENCE= INTERNAL, COFFEE_meoh, 1, 14.96084
##AUDIT TRAIL= $$ (NUMBER, WHEN, WHO, WHERE, PROCESS, VERSION, WHAT)
$$ ##TITLE= Audit trail, TOPSPIN		Version 2.1
$$ ##JCAMPDX= 5.01
$$ ##ORIGIN= Bruker BioSpin GmbH
$$ ##OWNER= Administrator
$$ $$ E:\/data/COFFEE/nmr/AC1376_CRIAH12188_7519012_AIMBLYGeKM/12/pdata/1/auditp.txt
$$ ##AUDIT TRAIL=  $$ (NUMBER, WHEN, WHO, WHERE, PROCESS, VERSION, WHAT)
(   1,<2013-02-20 22:23:21.618 -0500>,<Administrator>,<X>,<go>,<TOPSPIN 2.1>,
      <created by zg
	started at 2013-02-20 22:11:51.069 -0500,
	POWCHK enabled, PULCHK disabled,
       configuration hash MD5:
       86 BA 57 50 F2 9D 5C 9B 26 00 A9 28 5F 66 2E 89
       data hash MD5: 64K
       14 E2 C4 78 41 20 1A 81 4E 5B 61 5E 30 AA 44 22>)
(   2,<2013-02-20 22:23:24.727 -0500>,<Administrator>,<X>,<proc1d>,<TOPSPIN 2.1>,
      <Start of raw data processing
       efp LB = 0.3 FT_mod = 6 PKNL = 1 PHC0 = 0 PHC1 = 0 SI = 128K 
       data hash MD5: 128K
       B3 97 4A 36 76 EB D7 1D B1 A3 C4 CD 01 0E FD 75>)
(   3,<2013-02-20 22:23:25.805 -0500>,<Administrator>,<X>,<proc1d>,<TOPSPIN 2.1>,
      <pk PHC0 = 253.5754 PHC1 = 0 
       data hash MD5: 128K
       FB B6 3B 11 24 74 50 74 80 D4 4C 7C 5E 31 68 3A>)
(   4,<2013-02-20 22:23:26.493 -0500>,<Administrator>,<X>,<proc1d>,<TOPSPIN 2.1>,
      <abs ABSG = 1 
       data hash MD5: 128K
       94 12 29 9E 1D 2E 95 64 10 96 95 09 76 82 46 A4>)
(   5,<2013-02-20 22:23:26.665 -0500>,<Administrator>,<X>,<proc1d>,<TOPSPIN 2.1>,
      <abs ABSG = 2 
       data hash MD5: 128K
       91 54 5E E5 D3 15 D6 F0 25 45 85 C5 DE C7 E3 CB>)
(   6,<2013-02-20 22:23:26.852 -0500>,<Administrator>,<X>,<proc1d>,<TOPSPIN 2.1>,
      <abs ABSG = 3 
       data hash MD5: 128K
       E6 C7 F3 12 15 63 AA 55 B7 87 76 B3 1F 79 0E 86>)
(   7,<2013-02-20 22:23:27.055 -0500>,<Administrator>,<X>,<proc1d>,<TOPSPIN 2.1>,
      <abs ABSG = 4 
       data hash MD5: 128K
       5A A7 2F F7 59 C7 80 95 95 64 40 8A 73 9F C4 2D>)
(   8,<2013-02-20 22:23:27.274 -0500>,<Administrator>,<X>,<proc1d>,<TOPSPIN 2.1>,
      <abs ABSG = 5 
       data hash MD5: 128K
       81 37 8C 1E 3C 4B 88 7D 30 90 37 75 5A 7F C1 F6>)
$$ ##END=
$$ 
$$ $$ hash MD5
$$ $$ F9 C7 8D 25 B9 B0 6C 7A 2B FE 21 62 08 56 61 16
##$RELAX= 
##$RELAX= 
##$RELAX= 
##$RELAX= 
##$RELAX= 
##$RELAX= 
##$RELAX= 
##$RELAX= 
$$ Bruker specific parameters
$$ --------------------------
##$DU= <E:\>
##$EXPNO= 12
$$ [...]
150 150 150 150 150 150 150 150
##$TP07= 0
##$TPNAME0= <>
##$TPNAME1= <>
##$TPNAME2= <>
##$TPNAME3= <>
##$TPNAME4= <>
##$TPNAME5= <>
##$TPNAME6= <>
##$TPNAME7= <>
##$TPOAL= (0..7)
0.5 0.5 0.5 0.5 0.5 0.5 0.5 0.5
##$TPOFFS= (0..7)
0 0 0 0 0 0 0 0
##$TUNHIN= 0
##$TUNHOUT= 0
##$TUNXOUT= 0
##$USERA1= <user>
##$USERA2= <user>
##$USERA3= <user>
##$USERA4= <user>
##$USERA5= <user>
##$V9= 5
##$VALIST= <valist>
##$VCLIST= <CCCCCCCCCCCCCCC>
##$VD= 0
##$VDLIST= <DDDDDDDDDDDDDDD>
##$VPLIST= <PPPPPPPPPPPPPPP>
##$VTLIST= <TTTTTTTTTTTTTTT>
##$WBST= 1024
##$WBSW= 4
##$XGAIN= (0..3)
0 0 0 0
##$XL= 0
##$YL= 0
##$YMAX_a= 5973641
##$YMIN_a= -9740733
##$ZGOPTNS= <>
##$ZL1= 120
##$ZL2= 120
##$ZL3= 120
##$ZL4= 120
##$ABSF1= 14.96084
##$ABSF2= -5.597342
##$ABSG= 5
##$ABSL= 3
##$ALPHA= 0
##$AQORDER= 0
##$ASSFAC= 0
##$ASSFACI= 0
##$ASSFACX= 0
##$ASSWID= 0
##$AUNMP= <proc_prof1d_extract.lims>
##$AXLEFT= 0
##$AXNAME= <>
##$AXNUC= <1H>
##$AXRIGHT= 0
##$AXTYPE= 0
##$AXUNIT= <>
##$AZFE= 0.1
##$AZFW= 0.1
##$BCFW= 0
##$BC_mod= 0
##$BYTORDP= 0
##$COROFFS= 0
##$CY= 15
##$DATMOD= 1
##$DC= 0
##$DFILT= <>
##$DTYPP= 0
##$F1P= 0
##$F2P= 0
##$FCOR= 0.5
##$FTSIZE= 131072
##$FT_mod= 6
##$GAMMA= 0
##$GB= 0
##$INTBC= 1
##$INTSCL= 1
##$ISEN= 128
##$LB= 0.3
##$LEV0= 0
##$LPBIN= 0
##$MAXI= 10000
##$MC2= 0
##$MEAN= 0
##$ME_mod= 0
##$MI= 0
##$NCOEF= 0
##$NC_proc= -2
##$NLEV= 6
##$NOISF1= 0
##$NOISF2= 0
##$NSP= 0
##$NTH_PI= 0
##$NZP= 0
##$OFFSET= 14.96084
##$PC= 1
##$PHC0= 253.5754
##$PHC1= 0
##$PH_mod= 1
##$PKNL= yes
##$PPARMOD= 0
##$PPDIAG= 0
##$PPIPTYP= 0
##$PPMPNUM= 2147483647
##$PPRESOL= 1
##$PSCAL= 4
##$PSIGN= 0
##$PYNMP= <proc.py>
##$REVERSE= no
##$SF= 400.020009700946
##$SI= 131072
##$SIGF1= 0
##$SIGF2= 0
##$SINO= 400
##$SIOLD= 131072
##$SPECTYP= <>
##$SREGLST= <1H.CDCl3>
##$SSB= 0
##$STSI= 131072
##$STSR= 0
##$SW_p= 8223.68421052631
##$SYMM= 0
##$S_DEV= 0
##$TDeff= 65536
##$TDoff= 0
##$TI= <>
##$TILT= no
##$TM1= 0
##$TM2= 0
##$TOPLEV= 0
##$USERP1= <user>
##$USERP2= <user>
##$USERP3= <user>
##$USERP4= <user>
##$USERP5= <user>
##$WDW= 1
##$XDIM= 131072
##$YMAX_p= 420433140
##$YMIN_p= -11865
##$CURPLOT= <Network HP LaserJet P1505>
##$CURPRIN= <$Network HP LaserJet P1505>
##$DFORMAT= <normdp>
##$LAYOUT= <+/1D_H.xwp>
##$LFORMAT= <normlp>
##$PFORMAT= <normpl>
##$SURQMSG= 1
$$ End of Bruker specific parameters
$$ ---------------------------------
##NTUPLES= NMR SPECTRUM
##VAR_NAME=  FREQUENCY,     SPECTRUM/REAL,   SPECTRUM/IMAG
##SYMBOL=    X,             R,               I
##VAR_TYPE=  INDEPENDENT,   DEPENDENT,       DEPENDENT
##VAR_FORM=  AFFN,          ASDF,            ASDF
##VAR_DIM=   131072,        131072,          131072
##UNITS=     HZ,            ARBITRARY UNITS, ARBITRARY UNITS
##FACTOR=    0.0627417313425164, 1,          1
##FIRST=     8223.62146879497, 3578,         -56523
##LAST=      0,             5782,            -56013
##MIN=       0,             -11865,          0
##MAX=       8223.62146879497, 420433140,    0
$$ Real data points
##PAGE= N=1
##DATA TABLE= (X++(R..R)), XYDATA
$$ [...]
$$ plain form
61622 405653 402111 397598 392417 387138 382528 379188 377136 375859 374760 373449 371760 369822 368127 367246
61608 367246 367146 366783 364604 359759 352880 345533 338839 332874 327423 322795 319347 316582 313451 309612 305775
61593 305775 302630 299990 297268 294375 291761 289842 288652 287901 287230 286504 285828 285117 283820 281520 278711
61578 278711 276394 274895 273681 272411 271484 271376 272045 273226 274586 275386 274817 273156 271839 271850 272763 273890
61562 273890 275480 277907 280539 282549 284225 286257 288089 288395 287141 285904 285900 286825 287885 288865 289773 290463
61546 290463 291206 292763 295195 297261 297772 297131 296817 297711 299533 301735 304174 306830 309377 311283 312280 312693
61530 312693 313238 314304 315407 315642 314678 312995 311102 309075 307065 305646 305163 305073 304475 303088 301292 299504
61514 299504 298023 297264 297444 298027 298100 297470 296892 296991 297455 297621 297459 297508 297955 298315 298122 297577 297293 297522 297933
$$ packed form
61622D05653l542m513n181n279m610l340k052j277j099j311j689j938j695q81
61608C67246j00l63k179m845o879p347o694n965n451m628l448k765l131l839l837
61593C05775l145k640k722k893k614j919j190p51o71p26o76p11j297k300k809
61578B78711k317j499j214j270r27j08O69J181J360Q00n69j661j317J1R13J127
61562B73890J590K427K632K010J676K032J832L06j254j237mR25J060R80R08O90
61546B90463P43J557K432K066N11o41l14Q94J822K202K439K656K547J906R97M13
61530C12693N45J066J103K35r64j683j893k027k010j419m83r0n98j387j796j788
61514B99504j481p59J80N83P3o30n78R9M64J66j62M9M47L60j93n45k84K29M11
$$ plain form
61495 297933 298166 298386 299098 300583 302760 305587 309111 312911 315867 316989 316516 315759 315809 316682 317771 318710
61479 318710 319530 320341 321260 322529 324357 326684 329267 331854 334037 335242 335352 335165 335606 336457 336564 335471
61463 335471 334148 333692 333965 334142 334079 334234 334516 334171 332938 331495 330489 329804 329177 328968 329733 331322 332897
61446 332897 333777 333954 333878 334014 334606 335634 336971 338544 340276 341913 343224 344397 345995 348371 351352 354520
61430 354520 357492 359859 361255 361780 361970 362062 361591 360103 358022 356400 355936 356572 357958 359845 361978 363907
61414 363907 365138 365472 365206 364957 365151 365592 365698 365166 364176 362913 361280 359303 357436 356085 355009 353540
61398 353540 351338 348673 346077 343962 342491 341627 341293 341497 342200 343136 344084 345284 347139 349352 350889 351099
61382 351099 350475 350041 350414 351709 353863 356578 359423 362349 365698 369306 372272 374201 375993 378565 381378
$$ packed form
61495B97933K33K20P12J485K177K827L524L800K956J122m73p57N0Q73J089R39
61479C18710Q20Q11R19J269J828K327K583K587K183J205J10j87M41Q51J07j093
61463C35471j323m56K73J77o3J55K82l45j233j443j006o85o27k09P65J589J575
61446C32897Q80J77p6J36N92J028J337J573J732J637J311J173J598K376K981L168
61430C54520K972K367J396N25J90R2m71j488k081j622m64O36J386J887K133J929
61414C63907J231L34k66k49J94M41J06n32r90j263j633j977j867j351j076j469
61398C53540k202k665k596k115j471q64l34K04P03R36R48J200J855K213J537K10
61382C51099o24m34L73J295K154K715K845K926L349L608K966J929J792K572K813
$$ plain form
61367 381378 383271 384314 385628 387568 389327 390435 391455 392862 394353 395704 397422 399937 402921 405984
61353 405984 409398 413612 418608 424269 430846 438423 446333 453667 460033 465337 469217 471376 472233 472687 473286
61338 473286 474075 475105 476579 478477 480398 481829 482438 482213 481527 480947 480693 480380 479413 477538 474871 471619
61322 471619 467964 464115 460294 456834 454242 452863 452422 452276 452273 452922 454552 456950 460214 465329 473110 482944
61306 482944 493375 503822 514991 527555 541100 554466 566435 575883 581926 584501 584480 582831 579840
61293 579840 575479 570190 564772 559521 553994 547813 541328 535190 529474 523625 517323 511064 505708 501588
61279 501588 498295 495340 492830 491447 491829 494023 497491 501575 505883 510170 514042 517098 519478 521892
61265 521892 524840 527942 530380 531928 533329 535743 540060 546546 554727 563520 571740 578561 583564 586707
$$ packed form
61367C81378J893J043J314J940J759J108J020J407J491J351J718K515K984L063
61353D05984L414M214M996N661O577P577P910P334O366N304L880K159Q57M54N99
61338D73286P89J030J474J898J921J431O09k25o86n80k54l13r67j875k667l252
61322D71619l655l849l821l460k592j379m41j46lO49J630K398L264N115P781R834
61306D82944J0431J0447J1169J2564J3545J3366J1969R448O043K575k1j649k991
61293E79840m361n289n418n251n527o181o485o138n716n849o302o259n356m120
61279E01588l293k955k510j383L82K194L468M084M308M287L872L056K380K414
61265E21892K948L102K438J548J401K414M317O486Q181Q793Q220O821N003L143
$$ plain form
61251 586707 588546 590081 591837 593343 594086 594677 596156 598193 599002 597417 594189 590754 587502 583956 580048
61236 580048 576345 573208 570416 567576 564433 560895 557213 554032 551878 550669 550040 550009 550934 552985 555984
61221 555984 559612 563388 566638 568987 570876 573203 576441 580385 584641 588995 593335 597565 601585 605052
61207 605052 607243 607601 606476 605019 604285 604672 606214 609005 613160 618608 625153 632765 641752 652653 665774
61192 665774 680711 696390 711661 725690 737661 746530 751588 753238 752860 751832 750859 750124 749683 749532
61178 749532 749448 748894 747135 743636 738512 732462 726101 719497 712509 705312 698267 691432 684538 677369 669829
61163 669829 661700 652721 642987 633061 623557 614675 606060 597113 587746 578936 572197 568152 565967 564546
61149 564546 563964 565177 568546 573199 577709 580719 580965 577543 570583 561315 551206 541278 532172 524287
$$ packed form
61251E86707J839J535J756J506P43N91J479K037Q09j585l228l435l252l546l908
61236E80048l703l137k792k840l143l538l682l181k154j209o29l1R25K051K999
61221E55984L628L776L250K349J889K327L238L944M256M354M340M230M020L467
61207F05052K191L58j125j457p34L87J542K791M155N448O545P612Q987J0901J3121
61192F65774J4937J5679J5271J4029J1971Q869N058J650l78j028r73p35m41j51
61178G49532q4n54j759l499n124o050o361o604o988p197p045o835o894p169p540
61163F69829q129q979r734r926r504q882q615q947r367q810o739m045k185j421
61149E64546n82J213L369M653M510L010K46l422o960r268j0109r928r106p885
$$ plain form
61135 524287 517514 511332 505596 500978 498289 497581 498298 500187 503648 509063 515994 523271 529949 536203 543255
61120 543255 552332 563693 576633 590332 604576 619789 636547 655039 674844 695228 715691 736199
61108 736199 756860 777601 798261 818756 838928 858386 876620 893084 907033 917614 924350 927287
61096 927287 926521 922033 914269 904344 893061 880161 865167 848661 831966 815759 799787 783871
61084 783871 768398 753728 739802 726504 713819 701537 689426 677842 667623 659201 652277 646489
61072 646489 641902 638691 636814 636058 636080 636488 637351 639455 643417 648694 654166 659557 665459 672083 679027
61057 679027 686312 694604 704244 715070 727367 741774 757904 774316 790425 807284 825864 845723
61045 845723 866158 887502 910335 934468 959822 987347 1017846 1050559 1084119 1118353 1154004
$$ packed form
61135E24287o773o182n736m618k689p08P17J889L461N415O931P277O678O254P052
61120E43255R077J1361J2940J3699J4244J5213J6758J8492J9805K0384K0463K0508
61108G36199K0661K0741K0660K0495K0172J9458J8234J6464J3949J0581O736K937
61096I27287p66m488p764r925j1283j2900j4994j6506j6695j6207j5972j5916
61084G83871j5473j4670j3926j3298j2685j2282j2111j1584j0219q422o924n788
61072F46489m587l211j877p56K2M08Q63K104L962N277N472N391N902O624O944
61057F79027P285Q292R640J0826J2297J4407J6130J6412J6109J6859J8580J9859
61045H45723K0435K1344K2833K4133K5354K7525L0499L2713L3560L4234L5651
$$ plain form
61034 1154004 1191229 1229591 1269186 1310704 1354669 1401478 1451772 1505821 1562910 1622021 1682465
61023 1682465 1743170 1802530 1860308 1918864 1981223 2048938 2123223 2206715 2301675 2407161 2520309
61012 2520309 2640073 2767791 2905408 3056634 3229871 3437010 3689397 3998054 4377331
61003 4377331 4844323 5415501 6110323 6959780 8005817 9292895 10869973 12795401 15097584
60994 15097584 17675721 20225387 22309793 23576617 23955551 23669578 23075649 22502517 22196606
60985 22196606 22317104 22876569 23655743 24230720 24165795 23242130 21541309 19343812 16961132
60976 16961132 14630127 12493915 10620555 9023820 7684762 6573658 5661349 4918289
60968 4918289 4313581 3820010 3417554 3090211 2822120 2598570 2408435 2243720 2098244
$$ packed form
61034A154004L7225L8362L9595M1518M3965M6809N0294N4049N7089N9111O0444
61023A682465O0705N9360N7778N8556O2359O7715P4285Q3492R4960J05486J13148
61012B520309J19764J27718J37617J51226J73237K07139K52387L08657L79277
61003D377331M66992N71178O94822Q49457J046037J287078J577078J925428K302183
60994A5097584K578137K549666K084406J266824L78934k85973n93929n73132l05911
60985B2196606J20498N59465P79174N74977o4925r23665j700821k197497k382680
60976A6961132k331005k136212j873360j596735j339058j111104r12309p43060
60968D918289o04708m93571m02456l27343k68091k23550j90135j64715j45476
$$ plain form
60959 2098244 1968064 1851565 1747442 1653422 1567716 1490372 1422096 1362716 1311561 1267993 1230452
60948 1230452 1195965 1161787 1126946 1091620 1056098 1021179 988393 958538 930723 903851 878224
60937 878224 854648 832763 811511 790608 770347 750446 730436 710799 692473 675446 659063
60926 659063 643566 630050 618775 608672 598800 589350 580918 573573 567107 561541 556928 552930 548940
60913 548940 544621 540319 536947 535142 534382 533410 531872 530930 531658 533461 534938 535782 536769 538100 538995 539019
60897 539019 538744 538789 539028 539025 538496 537095 534504 531100 527897 525478 523542 521674 519826 517591 513774 507433
60881 507433 498989 489738 480558 471594 462954 455047 448183 442275 437072 432440 428321 424582 421045 417708
60867 417708 414838 412746 411491 411028 411617 413674 416954 420404 423383 426696 431646 438112 444255 448254 449797
$$ packed form
60959B098244j30180j16499j04123r4020q5706p7344o8276n9380n1155m3568l7541
60948A230452l4487l4178l4841l5326l5522l4919l2786k9855k7815k6872k5627
60937H78224k3576k1885k1252k0903k0261j9901k0010j9637j8326j7027j6383
60926F59063j5497j3516j1275j0103r872r450q432p345o466n566m613l998l990
60913E48940m319m302l372j805p60r72j538r42P28J803J477Q44R87J331Q95K4
60897E39019k75M5K39ln29j401k591l404l203k419j936j868j848k235l817o341
60881E07433q444r251r180q964q640p907o864n908n203m632m119l739l537l337
60867D17708k870k092j255m63N89K057L280L450K979L313M950O466O143L999J543
$$ plain form
60852 449797 449872 449830 450848 453586 457793 462453 466545 469449 470744 470307 468765 467133 465611 463286 459451
60837 459451 454676 450106 446176 442630 439388 436668 434356 431880 428751 424950 420869 417207 414675 413346
60823 413346 412376 410823 408706 406870 405798 404997 403655 401520 398899 396045 392833 389035 384720 380262 375939
60808 375939 371651 367185 362685 358667 355516 353115 350986 348657 345935 343084 340741 339363 338670 337856 336446
60793 336446 334708 333202 332186 331535 330880 329754 327935 325835 324205 323333 322894 322681 322982 323966 325233 326402
60777 326402 327692 329409 331179 332330 332869 333568 335107 337531 340455 343340 345608 346995 347903 349125 351073
60762 351073 353488 355878 357995 359860 361546 363022 364102 364530 364222 363374 362232 360885 359335 357614 355712
60747 355712 353649 351799 350885 351360 352914 354840 356675 358132 358649 357529 354636 350627 346407 342479 338769
$$ packed form
60852D49797P5m2J018K738M207M660M092K904J295m37j542j632j522k325l835
60837D59451m775m570l930l546l242k720k312k476l129l801m081l662k532j329
60823D13346r70j553k117j836j072q01j342k135k621k854l212l798m315m458m323
60808C75939m288m466m500m018l151k401k129k329k722k851k343j378o93q14j410
60793C36446j738j506j016o51o55j126j819k100j630q72m39k13L01R84J267J169
60777C26402J290J717J770J151N39O99J539K424K924K885K268J387R08J222J948
60762C51073K415K390K117J865J686J476J080M28l08q48j142j347j550j721j902
60747C55712k063j850r14M75J554J926J835J457N17j120k893m009m220l928l710
$$ plain form
60732 338769 334861 330430 325665 321235 317677 314930 312663 310923 310063 309996 309943 309150 307736 306668 306788 307908
60716 307908 308973 309243 309175 309868 311680 313798 315208 315587 315123 314057 312895 312541 313559 315506 317559 319612
60700 319612 322203 325495 328941 331932 334208 335670 336392 336922 338013 339799 341729 343473 345428 348031 350980
60685 350980 353446 354819 354986 354227 353121 352378 352383 352970 353773 354617 355480 356265 356942 357718 358839 360263 361767
60668 361767 363190 364253 364238 362377 358776 354611 351074 348262 345407 342068 338676 335870 333782 332234 331229
60653 331229 330831 330815 330937 331478 332978 335411 338051 340279 342138 344015 346136 348461 350655 352030 351932 350418
60637 350418 348156 345528 342253 338085 333389 328786 324730 321694 320152 319913 319997 319747 319639 320444 321993 323446
60621 323446 324390 325013 325399 325435 325293 325360 325745 326348 327231 328313 328922 328382 327003 325833 325494 325922 327113 329192
$$ packed form
60732C38769l908m431m765m430l558k747k267j740q60o7n3p93j414j068J20J120
60716C07908J065K70o8O93J812K118J410L79m64j066j162l54J018J947K053K053
60700C19612K591L292L446K991K276J462P22N30J091J786J930J744J955K603K949
60685C50980K466J373J67p59j106p43NN87Q03Q44Q63P85O77P76J121J424J504
60668C61767J423J063j5j861l601m165l537k812k855l339l392k806k088j548j005
60653C31229l98j6J22N41J500K433K640K228J859J877K121K325K194J375r8j514
60637C50418k262k628l275m168m696m603m056l036j542k39Q4k50j08Q05J549J453
60621C23446R44O23L86L6j42O7L85O03Q83J082O09n40j379j170l39M28J191K079
$$ plain form
60603 329192 331611 333186 333330 332750 332601 333385 334826 336274 336993 336568 335367 334302 334000 334524 335873 338145
60587 338145 341048 343833 345956 347411 348286 348583 348695 349357 350710 351922 352248 352028 352118 352759 353642 354874 357178
60570 357178 361080 366409 372789 380238 388958 398715 408810 418766 428785 439199 449551 458571 465143
60557 465143 468946 470092 468690 465126 460255 454808 448963 442967 437667 433724 430777 428314 427101 428612
60543 428612 433069 439148 445871 453746 463639 475472 488626 502918 518514 535341 553062 571234
60531 571234 589072 605334 618691 627988 632226 630976 625007 615871 604677 591938 578638 566356
60519 566356 555789 546111 536480 527436 520041 514355 509673 505778 503004 501412 500728 500947 502319 504877
60505 504877 508618 513893 520995 529654 539662 551808 567482 587450 611683 640210 673308 710770
$$ packed form
60603C29192K419J575J44n80j49P84J441J448P19m25j201j065l02N24J349K272
60587C38145K903K785K123J455Q75K97J12O62J353J212L26k20R0O41Q83J232K304
60570C57178L902N329O380P449Q720R757J0095R956J0019J0414J0352R020O572
60557D65143L803J146j402l564m871n447n845n996n300l943k947k463j213J511
60543D28612M457O079O723P875R893J1833J3154J4292J5596J6827J7721J8172
60531E71234J7838J6262J3357R297M238j250n969r136j1194j2739j3300j2282
60519E66356j0567r678r631r044p395n686m682l895k774j592o84K19J372K558
60505E04877L741N275P102Q659J0008J2146J5674J9968K4233K8527L3098L7462
$$ plain form
60493 710770 751677 795092 840336 886373 931463 973828 1012370 1046430 1074995 1096417 1108901
60482 1108901 1111240 1103036 1084361 1055495 1017353 972023 922406 871146 820159 771063 725286 683423
60470 683423 645160 610323 579519 553288 531125 512004 495431 481344 469334 458756 449445 441539
60458 441539 434620 427780 420707 414182 409237 406094 404020 401961 399215 395716 391773 387624 383415 379527
60444 379527 376477 374313 372570 370988 369842 369312 369097 368987 369170 369433 368756 366447 363259 360670 359423 359392
60428 359392 360352 361961 363367 363853 363731 363795 364084 364057 363726 363526 363243 362278 361070 361013 362589 364650 366056 367046
60410 367046 368401 370170 371989 373979 376388 378662 379734 379286 378242 378027 379574 382871 387147 391519 395586
60395 395586 399360 402734 405423 407517 409634 412256 415203 418014 420486 422584 424162 425211 426247 428066
$$ packed form
60493G10770M0907M3415M5244M6037M5090M2365L8542L4060K8565K1422J2484
60482A108901K339q204j8675k8866l8142m5330m9617n1260n0987m9096m5777m1863
60470F83423l8263l4837l0804k6231k2163j9121j6573j4087j2010j0578r311p906
60458D41539o919o840p073o525m945l143k074k059k746l499l943m149m209l888
60444C79527l050k164j743j582j146n30k15j10J83K63o77k309l188k589j247l1
60428C59392R60J609J406M86j22O4K89k7l31k00k83r65j208n7J576K061J406R90
60410C67046J355J769J819J990K409K274J072m48j044k15J547L297M276M372M067
60395C95586L774L374K689K094K117K622K947K811K472K098J578J049J036J819
$$ plain form
60381 428066 431045 434794 438478 441401 443456 445188 447386 450499 454363 458437 462205 465426 468148 470548
60367 470548 472731 474690 476387 477731 478547 478933 479660 481697 485035 488419 490681 492023 493579 496204 500257
60352 500257 506194 514530 525180 537485 550769 564333 577024 587583 595488 600829 603384 602509 598043
60339 598043 590650 581167 570296 559042 548604 539453 531133 523351 516572 511120 506331 501195 495472
60326 495472 489639 484100 478960 474318 470190 466297 462412 458865 456293 454912 454373 454402 455248 457402 461039
60311 461039 465923 471837 479031 488181 499872 514117 530320 547548 564889 581820 598291 614061
60299 614061 627821 637493 641813 641261 636953 629043 616893 600508 581065 560218 539705 521507 507256
60286 507256 497056 489520 483329 478267 474525 471763 469386 467264 465675 464635 463670 462156 459794 456832
$$ packed form
60381D28066K979L749L684K923K055J732K198L113L864M074L768L221K722K400
60367D70548K183J959J697J344Q16L86P27K037L338L384K262J342J556K625M053
60352E00257N937Q336J0650J2305J3284J3564J2691J0559P905N341K555q75m466
60339E98043p393r483j0871j1254j0438r151q320p782o779n452m789n136n723
60326D95472n833n539n140m642m128l893l885l547k572j381n39K9Q46K154L637
60311D61039M884N914P194R150J1691J4245J6203J7228J7341J6931J6471J5770
60299F14061J3760R672M320n52m308p910j2150j6385j9443k0847k0513j8198j4251
60286E07256j0200p536o191n062l742k762k377k122j589j040r65j514k362k962
$$ plain form
60272 456832 453805 450889 447709 444045 440414 437374 434587 431302 427606 424291 421482 418471 415142 412537
60258 412537 411497 411511 411476 410945 410114 409170 408267 407674 407434 407239 407030 407281 408302 409777 411394 413364 415799
60241 415799 418089 419512 420074 420203 419970 419232 418259 417606 417490 417667 417852 417958 418152 418928 420834 423890 427547
60224 427547 431356 435216 438841 441677 443718 445854 448926 453004 457960 463988 470927 477772 483768 489497
60210 489497 496004 503234 510272 516883 523819 531556 539597 547224 554312 561303 568768 576994 585553 593386
60196 593386 599748 604957 609768 614306 618154 621227 623802 625782 626725 626643 626068 625158 623349 620074 615386
60181 615386 609783 603894 598323 593218 587870 581379 573963 567081 561926 558200 554721 550867 546991 543646
60167 543646 540892 538442 536187 534304 532860 531445 529388 526351 522616 518785 515480 513340 512850 513853
$$ packed form
60272D56832l027k916l180l664l631l040k787l285l696l315k809l011l329k605
60258D12537j040J4l5n31q31r44r03n93k40j95k09K51J021J475J617J970K435
60241D15799K290J423N62J29k33p38r73o53j16J77J85J06J94P76J906L056L657
60224D27547L809L860L625K836K041K136L072M078M956O028O939O845N996N729
60210D89497O507P230P038O611O936P737Q041P627P088O991P465Q226Q559P833
60196E93386O362N209M811M538L848L073K575J980R43q2n75r10j809l275m688
60181F15386n603n889n571n105n348o491p416o882n155l726l479l854l876l345
60167E43646k754k450k255j883j444j415k057l037l735l831l305k140m90J003
$$ plain form
60153 513853 515459 516771 517549 517976 518117 517992 517902 518198 518819 519504 520312 521575 523348 525330 527347 529598 532447
60136 532447 536235 541212 547353 554293 561626 569175 576782 584081 590747 596729 601920 605860 608252 609544
60122 609544 610557 611657 612764 614006 615809 618342 621311 624400 627571 630976 634833 639253 643833 647650
60108 647650 650096 651625 653143 654766 655692 655248 653509 650849 647463 643522 639356 635299 631584 628451 626012
60093 626012 624028 622210 620766 620236 620707 621596 622253 622408 621955 620765 618923 616777 614525 612011 609056 605811
60077 605811 602679 600081 598265 596993 595362 592349 587738 582281 576777 571229 565139 558421 551725 545743
60063 545743 540339 534537 527551 519781 512560 506871 502553 498845 495264 491720 488241 485112 482955 482123
60049 482123 482115 482121 482057 482575 484123 486509 489411 492834 496918 501624 506743 511996 517196 522516 528416 534930
$$ packed form
60153E13853J606J312P78M27J41j25r0K96O21O85Q08J263J773J982K017K251K849
60136E32447L788M977O141O940P333P549P607P299O666N982N191L940K392J292
60122F09544J013J100J107J242J803K533K969L089L171L405L857M420M580L817
60108F47650K446J529J518J623R26m44j739k660l386l941m166m057l715l133k439
60093F26012j984j818j444n30M71Q89O57J55m53j190j842k146k252k514k955l245
60077F05811l132k598j816j272j631l013m611n457n504n548o090o718o696n982
60063E45743n404n802o986p770p221n689m318l708l581l544l479l129k157q32
60049D82123qOo4N18J548K386K902L423M084M706N119N253N200N320N900O514
$$ plain form
60033 534930 541155 545866 548640 550065 550924 551501 551557 550539 547977 544077 539809 535943 532193 527737 522333
60018 522333 516311 509649 501893 492988 483532 474169 465409 457952 452329 448027 443847 439433 435721 433454
60004 433454 432010 430214 427741 425125 422842 421018 419778 419260 419338 419715 420250 421006 422074 423544 425485 427803
59988 427803 430326 433122 436509 440637 445248 449949 454455 458532 462062 465234 468319 471057 472662 472625 471288
59973 471288 469412 467412 465123 462121 458241 454029 450587 448561 447347 445829 443915 442733 443204 445100
59959 445100 447708 450653 453638 456079 457741 459287 461452 463882 465445 465624 465032 464535 464363 464202 463818 463360
59943 463360 463171 463422 463896 464181 464047 463487 462446 460772 458527 456085 453778 451730 450195 449695 450539 452348
59927 452348 454378 456300 458528 461833 466670 472793 479474 486163 492824 499442 505429 509928 512660 514012
$$ packed form
60033E34930O225M711K774J425Q59N77N6j018k562l900m268l866l750m456n404
60018E22333o022o662p756q905r456r363q760p457n623m302m180m414l712k267
60004D33454j444j796k473k616k283j824j240n18P8L77N35P56J068J470J941K318
59988D27803K523K796L387M128M611M701M506M077L530L172L085K738J605l7j337
59973D71288j876k000k289l002l880m212l442k026j214j518j914j182M71J896
59959D45100K608K945K985K441J662J546K165K430J563J79n92m97j72j61l84m58
59943D63360j89K51M74K85j34n60j041j674k245k442k307k048j535n00Q44J809
59927D52348K030J922K228L305M837O123O681O689O661O618N987M499K732J352
$$ plain form
59913 514012 514310 513630 512436 511768 512362 514000 516096 518551 521630 525292 529091 532521 535176 536736 537155
59898 537155 536720 535685 534040 531874 529745 528363 528095 529039 531324 534880 539074 543078 546727 550717 555830
59883 555830 562093 568732 574835 580051 584786 589807 595625 602201 609117 615891 622128 627491 631599 633937
59869 633937 634067 632085 628739 624829 620589 615889 610850 605808 600853 595931 591417 588007 585856 584339
59855 584339 582847 581390 580248 579549 579506 580612 583251 587455 593366 601459 611745 622935 632838 639634
59841 639634 642658 642323 639764 636493 633870 632594 632635 633543 634670 635220 634340 631371 626180 619330 611831 604578
59825 604578 597998 592225 587374 583442 580211 577461 575046 572464 568826 563854 558564 554219 550776 547148
59811 547148 542909 538831 535674 533314 531302 529389 527221 524333 520922 517943 516031 514894 514035 513302 512384
$$ packed form
59913E14012K98o80j194o68N94J638K096K455L079L662L799L430K655J560M19
59898E37155m35j035j645k166k129j382k68R44K285L556M194M004L649L990N113
59883E55830O263O639O103N216M735N021N818O576O916O774O237N363M108K338
59869F33937J30j982l346l910m240m700n039n042m955m922m514l410k151j517
59855E84339j492j457j142o99m3J106K639M204N911Q093J0286J1190R903O796
59841F39634L024l35k559l271k623j276M1R08J127N50q80k969n191o850p499p253
59825F04578o580n773m851l932l231k750k415k582l638m972n290m345l443l628
59811E47148m239m078l157k360k012j913k168k888l411k979j912j137q59p33r18
$$ plain form
59796 512384 510697 508364 506516 505902 505830 505190 503932 502798 502234 502353 503410 505332 507148 507891 507873 508203 509129
59779 509129 509766 509406 508284 506947 505609 504378 503556 503418 503977 505064 506445 507938 509607 511689 514077
59764 514077 516215 517859 519648 522442 526293 530513 534540 538287 541857 545459 549504 554308 559828 566026
59750 566026 573260 581833 591372 601123 610681 619974 628804 636978 644681 652138 659017 664706 669020 672138
59736 672138 674026 674562 674080 673156 671963 670436 668928 667947 667315 666320 664747 662991 661061 658331 654604 650738
59720 650738 647766 645833 644384 642907 641162 639001 636463 633850 631400 628946 626149 622990 619894 617421
59706 617421 615902 615292 615298 615697 616536 618044 620430 623846 628323 633631 639280 644847 650228 655567 661145 667280
59690 667280 673893 680059 684485 686741 687544 687549 686439 683781 680241 677138 675005 673341 671616 669772 667642
$$ packed form
59796E12384j687k333j848o14p2o40j258j134n64J19J057J922J816P43j8L30R26
59779E09129O37l60j122j337j338j231q22j38N59J087J381J493J669K082K388
59764E14077K138J644J789K794L851M220M027L747L570L602M045M804N520O198
59750E66026P234Q573R539R751R558R293Q830Q174P703P457O879N689M314L118
59736F72138J888N36m82r24j193j527j508r81o32r95j573j756j930k730l727l866
59720F50738k972j933j449j477j745k161k538k613k450k454k797l159l096k473
59706F17421j519o10OL99Q39J508K386L416M477N308N649N567N381N339N578O135
59690F67280O613O166M426K256Q03Nj110k658l540l103k133j664j725j844k130
$$ plain form
59675 667642 664555 659839 653416 645843 637991 630597 623856 617485 611371 605848 601088 596681 592373 588815
59661 588815 586887 586474 586631 586889 587704 589635 592695 596625 601274 606601 612670 619662 627507 635593 643196
59646 643196 649944 655402 658557 658501 655538 650907 645388 638825 630963 622052 612538 602797 593265 584317 575959
59631 575959 568173 561465 556452 552939 550036 547143 544116 540617 536263 531504 527317 523701 519397 513540
59617 513540 506797 500379 494678 489428 484522 479990 475643 471411 467772 465314 464126 464055 465198 467621 470774
59602 470774 473712 475922 477591 479102 480508 481517 481845 481577 481168 480998 481065 481271 481828 483025 484670 486245
59586 486245 487587 488957 490404 491503 491853 491365 490011 487771 484963 482127 479467 476877 474583 473050 471984
59571 471984 470159 466837 462946 460194 459206 459041 458477 457226 455776 454440 452961 451064 449087 447766 447384
$$ packed form
59675F67642l087m716o423p573p852p394o741o371o114n523m760m407m308l558
59661E88815j928m13J57K58Q15J931L060L930M649N327O069O992P845Q086P603
59646F43196O748N458L155n6k963m631n519o563p862q911r514r741r532q948q358
59631E75959p786o708n013l513k903k893l027l499m354m759m187l616m304n857
59617E13540o743o418n701n250m906m532m347m232l639k458j188p1J143K423L153
59602D70774K938K210J669J511J406J009L28k68m09j70O7K06N57J197J645J575
59586D86245J342J370J447J099L50m88j354k240k808k836k660k590k294j533j066
59571D71984j825l322l891k752r88j65n64j251j450j336j479j897j977j321l82
$$ plain form
59556 447384 447458 447387 447088 446839 446840 447234 448169 449449 450506 451151 452025 453857 456716 460459 465363 471510 478104
59539 478104 484395 490983 499353 510599 525648 545802 570861 596413 615176 622381 619041 609582 597768
59526 597768 585806 575617 568720 565033 563210 562414 563006 565521 569674 574376 578249 580240 580172 578621 575991
59511 575991 571968 566148 558804 550658 542248 533887 525919 518599 511934 505881 500409 495142 489452 483283
59497 483283 477491 473016 470058 468308 467454 467093 466673 466039 465653 465833 466216 466472 467122 469087 472642 477283
59481 477283 482334 487272 491762 495824 499843 504138 508792 513993 520003 526443 532179 536347 538998 540361
59467 540361 540212 538637 536812 536029 536179 536061 535074 533847 533183 533139 533352 533749 534673 536547 539587 543730 548858
59450 548858 555148 562927 572033 581517 590230 597599 603654 608531 612060 613632 612410 608001 601123 593355
$$ packed form
59556D47384P4p1k99k49JL94R35J280J057O45Q74J832K859L743M904O147O594
59539D78104O291O588Q370J1246J5049K0154K5059K5552J8763P205l340r459j1814
59526E97768j1962j0189o897l687j823p96N92K515M153M702L873J991o8j551k630
59511E75991m023n820p344q146q410q361p968p320o665o053n472n267n690o169
59497D83283n792m475k958j750q54l61m20o34l86J80L83K56O50J965L555M641
59481D77283N051M938M490M062M019M295M654N201O010O440N736M168K651J363
59467E40361j49j575j825p83J50j18r87j227o64m4K13L97R24J874L040M143N128
59450E48858O290P779R106R484Q713P369O055M877L529J572j222m409o878p768
$$ plain form
59436 593355 586092 579855 574444 569308 563879 558154 552926 548871 545519 541954 538450 536398 536466 537911 539999
59421 539999 543015 547401 553057 560111 569331 581114 595041 610990 629498 650404 672729 696872
59409 696872 724945 756726 786301 805130 808602 798497 780037 758650 738976 724121 714902 711263
59397 711263 714645 726874 745806 763863 772481 767665 751050 727148 700725 675594 653922 636175
59385 636175 622140 611838 605182 601394 599484 599074 600203 602596 605652 609103 613250 618481 624702 631250
59371 631250 637304 642513 647169 651593 655495 658234 659611 660057 660145 660320 660927 661956 662866 663272 663796 665590
59355 665590 668877 672641 675981 679231 683417 689047 695761 702887 710084 717699 726652 737727 750849 765183
59341 765183 779930 794738 809424 823660 836971 848695 858050 864608 868728 871089 871821 870506 866994
$$ packed form
59436E93355p263o237n411n136n429n725n228m055l352l565l504k052O8J445K088
59421E39999L016M386N656P054R220J1783J3927J5949J8508K0906K2325K4143
59409F96872K8073L1781K9575J8829L472j0105j8460k1387j9674j4855r219l639
59397G11263L382J2229J8932J8057Q618m816j6615k3902k6423k5131k1672j7747
59385F36175j4035j0302o656l788j910m10J129K393L056L451M147N231O221O548
59371F31250O054N209M656M424L902K739J377M46Q8J75O07J029R10M06N24J794
59355F65590L287L764L340L250M186N630O714P126P197P615Q953J1075J3122J4334
59341G65183J4747J4808J4686J4236J3311J1724R355O558M120K361P32j315l512
$$ plain form
59328 866994 861737 855224 847526 838531 828279 817056 805472 794433 784597 775829 767538 759540 752165
59315 752165 745537 739228 732674 725516 717540 708717 699433 690361 682028 674708 668497 663211 658528 654736
59301 654736 653013 654301 658247 664127 672525 684817 700584 716356 727344 729968 722982 707511 686748
59288 686748 664678 643959 625069 607742 592585 580732 572388 566597 562389 559604 558579 559456 561952
59275 561952 565648 570406 576434 583814 592138 600983 610676 622066 635378 649782 664313 678705 692973
59262 692973 706557 718282 726987 731978 733250 731587 728191 723766 718034 710417 701080 691045 681420
59249 681420 672775 665214 658742 653430 649259 645961 643172 640838 639292 638749 638924 639445 640485 642550 645639
59234 645639 649068 652301 655612 659715 664960 670999 676975 681842 684740 685395 684222 681984 679312 676396
$$ packed form
59328H66994n257o513p698q995j0252j1223j1584j1039r836q768q291p998p375
59315G52165o628o309o554p158p976q823r284r072q333p320o211n286m683l792
59301F54736j723J288L946N880Q398J2292J5767J5772J0988K624o986j5471k0763
59288F86748k2070k0719j8890j7327j5157j1853q344n791m208k785j025Q77K496
59275E61952L696M758O028P380Q324Q845R693J1390J3312J4404J4531J4392J4268
59262F92973J3584J1725Q705M991J272j663l396m425n732p617r337j0035r625
59249F81420q645p561o472n312m171l298k789k334j546n43J75N21J040K065L089
59234F45639L429L233L311M103N245O039N976M867K898O55j173k238k672k916
$$ plain form
59220 676396 673006 668787 663625 657675 651145 644315 637803 632269 627593 622745 616962 610704 604983 600073
59206 600073 595541 591320 587940 585649 583994 582407 580675 578696 576345 573861 571954 571195 571562 572701 574379
59191 574379 576496 578921 581510 584214 587178 590793 595500 601359 607965 614961 622365 630145 637750 644462
59177 644462 650000 654407 657728 660324 663210 667316 672398 677240 680958 683665 685932 688153 690428 692580
59163 692580 694289 695529 696781 698448 700208 701351 701501 700597 698452 694854 689833 683307 674931 664916
59149 664916 654504 644744 635211 624920 614158 604241 595667 587772 580211 573415 567354 561158 554475
59136 554475 548127 542763 537826 532540 527239 523018 520463 519264 518742 518477 518636 519765 521942 524378 526498
59121 526498 529105 533558 539927 547093 554690 563636 574395 585998 597452 609039 621426 634309 646762
$$ packed form
59220F76396l390m219n162n950o530o830o512n534m676m848n783o258n721m910
59206F00073m532m221l380k291j655j587j732j979k351k484j907p59L67J139J678
59191E74379K117K425K589K704K964L615M707N859O606O996P404P780P605O712
59177F44462N538M407L321K596K886M106N082M842L718K707K267K221K275K152
59163F92580J709J240J252J667J760J143J50r04k145l598n021o526q376j0015
59149F64916j0412r760r533j0291j0762r917q574p895p561o796o061o196o683
59136E54475o348n364m937n286n301m221k555j199n22k65J59J129K177K436K120
59121E26498K607M453O369P166P597Q946J0759J1603J1454J1587J2387J2883J2453
$$ plain form
59108 646762 658320 668950 678468 686632 693489 699233 704035 708246 712158 715323 716708 715891 713525 710392
59094 710392 706666 702398 697941 693591 689470 686049 683944 682948 682128 681219 680915 681363 681485 680402 678423 675798
59078 675798 671600 664969 656722 648563 641100 633635 625561 617072 608751 601210 594947 589916 585378 580637
59064 580637 575724 571082 567001 563653 561049 558570 555178 550588 545639 541096 536770 532345 528287 525235
59050 525235 523139 521623 520576 519779 518661 517153 516097 516060 516412 516344 516108 516352 516925 517327 517859 519229 521318
59033 521318 523222 524312 524570 524309 524300 525730 529175 533908 538987 544665 551995 561383 572398 584725 598489
59018 598489 613769 630369 647833 665117 680632 693153 702400 708389 710917 710183 707086 702213 695421
59005 695421 687295 679988 675388 673078 671369 669745 668985 669476 670904 673315 676911 680920 684053 686119 687832
$$ packed form
59108F46762J1558J0630R518Q164O857N744M802M211L912L165J385q17k366l133
59094G10392l726m268m457m350m121l421k105r96q20r09l04M48J22j083j979k625
59078F75798m198o631q247q159p463p465q074q489q321p541o263n031m538m741
59064E80637m913m642m081l348k604k479l392m590m949m543m326m425m058l052
59050E25235k096j516j047p97j118j508j056l7L52o8k36K44N73M02N32J370K089
59033E21318J904J090K58k61rJ430L445M733N079N678P330R388J1015J2327J3764
59018E98489J5280J6600J7464J7284J5515J2521R247N989K528p34l097m873o792
59005F95421q126p307m600k310j709j624p60M91J428K411L596M009L133K066J713
$$ plain form
58990 687832 689016 688474 685839 682240 678668 674853 670287 665330 660675 656454 652487 648907 646119 644512
58976 644512 644440 646084 649178 653313 658570 665442 674026 683731 693829 703972 714186 724728 735843
58963 735843 747397 758875 769923 780458 789968 797333 801950 804455 805587 804900 801428 795096 786510
58950 786510 775774 762659 747734 732245 716908 701762 687139 673841 662341 652605 644636 638406
58938 638406 633370 628898 625096 622404 620506 618481 615953 613260 610632 608101 606041 604886 604445 604335 604833
58923 604833 606230 607619 607593 606155 604650 603726 602605 600634 598312 596373 594905 593843 593412 593588 593865 593992
58907 593992 594327 595278 597104 600441 606154 614385 624381 635433 647229 659262 670860 682068 693585
58894 693585 705540 717150 727905 738227 748549 758640 768379 778586 790490 804734 821062 838489
$$ packed form
58990F87832J184n42k635l599l572l815m566m957m655m221l967l580k788j607
58976F44512p2J644L094M135N257O872Q584R705J0098J0143J0214J0542J1115
58963G35843J1554J1478J1048J0535R510P365M617K505J132o87l472o332q586
58950G86510j0736j3115j4925j5489j5337j5146j4623j3298j1500r736p969o230
58938F38406n036m472l802k692j898k025k528k693k628k531k060j155m41j10M98
58923F04833J397J389k6j438j505r24j121j971k322j939j468j062m31J76K77J27
58907E93992L35R51J826L337N713Q231R996J1052J1796J2033J1598J1208J1517
58894F93585J1955J1610J0755J0322J0322J0091R739J0207J1904J4244J6328J7427
$$ plain form
58882 838489 855595 871257 885264 897781 908236 915497 919258 920433 919964 918007 914473 909528 903214
58869 903214 895281 885849 875734 865857 856748 848696 841793 835690 829899 824362 819090 813326 805999 797095
58855 797095 787649 778179 768107 757020 745500 734191 722967 711738 701323 692733 685936 679895
58843 679895 673607 666718 659425 652131 645015 637789 630066 622011 614272 607187 600443 593532 586248 578803
58829 578803 571815 566093 562006 559168 557084 555767 555319 555393 555757 556949 559513 562951 566289 569337 572437
58814 572437 575366 577638 579642 582246 585397 588303 590858 593570 596149 597540 597504 596884 596124 594829 592965
58799 592965 591132 589389 587125 584420 582100 580026 576785 571726 565999 560912 556523 552604 549744 548509
58785 548509 548442 548811 549658 551420 554199 558033 563116 569214 575601 582068 589176 597057 604770 611295 616297
$$ packed form
58882H38489J7106J5662J4007J2517J0455P261L761J175m69j957l534m945o314
58869I03214p933r432j0115r877r109q052o903o103n791n537n272n764p327q904
58855G97095r446r470j0072j1087j1520j1309j1224j1229j0415q590o797o041
58843F79895o288o889p293p294p116p226p723q055p739p085o744o911p284p445
58829E78803o988n722m087k838k084j317m48P4L64J192K564L438L338L048L100
58814E72437K929K272K004K604L151K906K555K712K579J391l6o20p60j295j864
58799E92965j833j743k264k705k320k074l241n059n727n087m389l919k860j235
58785E48509o7L69Q47J762K779L834N083O098O387O467P108P881P713O525N002
$$ plain form
58770 616297 619452 619983 617511 612629 606181 598717 590963 583826 577441 571099 564550 558376 552729 546843
58756 546843 540410 534382 529786 526727 525120 525310 527245 529999 532786 535529 537941 539240 539520 540217 542348
58741 542348 545359 548577 552646 558442 565570 573032 580636 588633 596680 604208 611280 618175 624700 630697
58727 630697 636617 642806 648754 653735 657552 660109 661074 660711 660221 660507 661344 662409 664260 667489 671827
58712 671827 676909 683075 690424 697831 703832 707898 710152 710592 709334 706806 702945 696965 688575 678470
58698 678470 666923 653120 636821 619530 602812 586562 570197 554509 540853 529306 519142
58687 519142 510450 503737 498418 493235 487974 483394 479623 475889 471822 467949 464829 462486 460649 458925
58673 458925 456951 454987 454042 454819 456903 459473 462369 465968 470603 476586 484167 492971 502172 511500 521089
$$ packed form
58770F16297L155N31k472m882o448p464p754p137o385o342o549o174n647n886
58756E46843o433o028m596l059j607J90J935K754K787K743K412J299K80O97K131
58741E42348L011L218M069N796P128P462P604P997Q047P528P072O895O525N997
58727F30697N920O189N948M981L817K557R65l63m90K86Q37J065J851L229M338
58712F71827N082O166P349P407O001M066K254M40j258k528l861n980q390j0105
58698F78470j1547j3803j6299j7291j6718j6250j6365j5688j3656j1547j0164
58687E19142q692o713n319n183n261m580l771l734m067l873l120k343j837j724
58673D58925j974j964r45P77K084K570K896L599M635N983P581Q804R201R328R589
$$ plain form
58658 521089 529899 535638 537101 535447 532363 528241 523130 518039 513874 510168 506210 502395 499127 495495
58644 495495 490633 485465 481463 478470 475350 472035 469262 466932 464551 462848 463200 465682 469203 473261
58630 473261 477959 482564 485773 487489 488932 490825 492635 493597 493433 492083 489771 487289 485412 484176 483380
58615 483380 483333 484350 486118 488396 491580 495649 499429 502122 504716 508559 513314 517722 521615 525585 529299
58600 529299 531851 533471 535284 537562 539500 540426 540036 537966 534551 531537 530583 531373 532509 533793 536296
58585 536296 540721 547147 555784 566415 577587 587976 598139 609297 620858 630880 638695 645312
58573 645312 651512 657241 662720 668444 674204 679710 686023 694787 706187 719230 733873 751168 771419
58560 771419 793850 818166 844794 873449 902766 931376 958106 981283 999180 1011114 1017123 1017173
$$ packed form
58658E21089Q810N739J463j654l084m122n111n091m165l706l958l815l268l632
58644D95495m862n168m002k993l120l315k773k330k381j703L52K482L521M058
58630D73261M698M605L209J716J443J893J810R62j64j350k312k482j877j236p96
58615D83380m7J017J768K278L184M069L780K693K594L843M755M408L893L970L714
58600E29299K552J620J813K278J938R26l90k070l415l014r54P90J136J284K503
58585E36296M425O426Q637J0631J1172J0389J0163J1158J1561J0022P815O617
58573F45312O200N729N479N724N760N506O313Q764J1400J3043J4643J7295K0251
58560G71419K2431K4316K6628K8655K9317K8610K6730K3177J7897J1934O009N0
$$ plain form
58548 1017173 1011942 1003636 994421 984652 974218 964683 957949 953388 948482 941831 933315 921773 905285
58535 905285 883925 859862 834501 807764 780459 754944 732736 713348 696097 681288 669166
58524 669166 659353 651692 646092 641425 636286 630965 626850 623880 620581 616733 613793 612319 611123 609516
58510 609516 608365 608234 608349 608079 607756 607458 606586 605171 604053 603353 602375 601265 601046 601764 602345 602598 603477
58493 603477 605075 606312 607056 608567 611308 614213 616755 619960 624713 630679 637425 645065 653472 662505
58479 662505 673248 687210 704073 722066 740710 761017 782674 803271 820864 835172 845704
58468 845704 850965 850385 845072 835997 823343 808268 793271 780020 768593 759328 753437 751258 751933
58455 751933 755314 762125 771870 782895 795000 809477 825873 841247 853483 862828 869210 870779 866489
$$ packed form
58548A017173n231q306r215r769j0434r535o734m561m906o651q516j1542j6488
58535I05285k1360k4063k5361k6737k7305k5515k2208j9388j7251j4809j2122
58524F69166r813p661n600m667n139n321m115k970l299l848k940j474j196j607
58510F09516j151j31J15k70l23k98q72j415j118p00r78j110k19P18N81K53Q79
58493F03477J598J237P44J511K741K905K542L205M753N966O746P640Q407R033
58479F62505J0743J3962J6863J7993J8644K0307K1657K0597J7593J4308J0532
58468H45704N261n80n313r075j2654j5075j4997j3251j1427r265n891k179O75
58455G51933L381O811R745J1025J2105J4477J6396J5374J2236R345O382J569m290
$$ plain form
58442 866489 857830 846551 832851 817076 801057 786347 772986 761249 752541 747306 743980 741313
58430 741313 739905 740350 741844 743856 747285 752789 759798 768170 778813 791588 804620 816707 828269
58417 828269 838856 846096 848545 847447 844305 838759 830299 820046 809367 798551 788079 779233 772165
58404 772165 765310 758015 751775 747666 744624 741527 739006 737945 738151 739722 743685 750077 757340 764606
58390 764606 772496 780789 787694 792495 796505 800354 802915 804023 805509 808232 810712 812026 813261 814756
58376 814756 814832 812903 811154 811499 813552 816956 822701 830496 837870 843748 850049 858089 866611 875150 885877
58361 885877 899824 914527 927843 941076 955896 971272 985940 1000794 1016098 1029252 1038099 1043797
58349 1043797 1048020 1050196 1050029 1049690 1050757 1051889 1052199 1053878 1058736 1065138 1071235 1078206 1087452 1097740
$$ packed form
58442H66489q659j1279j3700j5775j6019j4710j3361j1737q708n235l326k667
58430G41313j408M45J494K012L429N504P009Q372J0643J2775J3032J2087J1562
58417H28269J0587P240K449j098l142n546q460j0253j0679j0816j0472q846p068
58404G72165o855p295o240m109l042l097k521j061K06J571L963O392P263P266
58390G64606P890Q293O905M801M010L849K561J108J486K723K480J314J235J495
58376H14756P6j929j749L45K053L404N745P795P374N878O301Q040Q522Q539J0727
58361H85877J3947J4703J3316J3233J4820J5376J4668J4854J5304J3154Q847N698
58349A043797M223K176j67l39J067J132L10J679M858O402O097O971R246J0288
$$ plain form
58335 1097740 1108156 1120692 1136742 1154099 1170644 1187834 1207256 1226890 1244343 1260706 1277624
58324 1277624 1293484 1306092 1316213 1324971 1330773 1332550 1333081 1335391 1338703 1341447 1345066 1351073 1357567
58311 1357567 1362658 1368286 1376713 1386476 1395747 1406374 1420345 1435676 1450167 1465833 1484984 1505298
58299 1505298 1523581 1541215 1561038 1581959 1601590 1621079 1642367 1663695 1682832 1701744 1723179
58288 1723179 1745790 1767535 1790434 1816783 1844156 1869555 1895110 1924217 1955556 1986480 2018580
58277 2018580 2054083 2090527 2125047 2160189 2199348 2240405 2280287 2321684 2368371 2417955 2466430
58266 2466430 2515975 2570867 2629564 2688420 2749265 2815445 2884309 2951764 3020420 3094892 3172827
58255 3172827 3248994 3324221 3401555 3477891 3548897 3618333 3692877 3771542 3849896 3930532 4019099
$$ packed form
58335A097740J0416J2536J6050J7357J6545J7190J9422J9634J7453J6363J6918
58324A277624J5860J2608J0121Q758N802J777N31K310L312K744L619O007O494
58311A357567N091N628Q427R763R271J0627J3971J5331J4491J5666J9151K0314
58299A505298J8283J7634J9823K0921J9631J9489K1288K1328J9137J8912K1435
58288A723179K2611K1745K2899K6349K7373K5399K5555K9107L1339L0924L2100
58277B018580L5503L6444L4520L5142L9159M1057L9882M1397M6687M9584M8475
58266B466430M9545N4892N8697N8856O0845O6180O8864O7455O8656P4472P7935
58255C172827P6167P5227P7334P6336P1006O9436P4544P8665P8354Q0636Q8567
$$ plain form
58244 4019099 4114040 4210908 4312845 4425816 4547574 4672634 4803972 4947971 5102122 5260150
58234 5260150 5425047 5604034 5794925 5991101 6195942 6418270 6657602 6908275 7173798
58225 7173798 7461948 7770200 8092020 8433113 8804982 9207421 9634835 10094369 10598837
58216 10598837 11147351 11733371 12366535 13065093 13832781 14666390 15580022 16596942 17724370
58207 17724370 18964213 20342568 21899625 23658621 25638564 27890855 30488559 33491378
58199 33491378 36968490 41055292 45948729 51860561 59029753 67772803 78469126 91524028
58191 91524028 107428654 126835309 150476046 179027002 213090453 252927690 297340694
58184 297340694 342173212 380241862 403890131 408766197 395802590 369898625 336811492
$$ packed form
58244D019099R4941R6868J01937J12971J21758J25060J31338J43999J54151J58028
58234E260150J64897J78987J90891J96176K04841K22328K39332K50673K65523
58225G173798K88150L08252L21820L41093L71869M02439M27414M59534N04468
58216A0598837N48514N86020O33164O98558P67688Q33609R13632J016920J127428
58207A7724370J239843J378355J557057J758996J979943K252291K597704L002819
58199C3491378L477112M086802M893437N911832P169192Q743050J0696323J3054902
58191I1524028J5904626J9406655K3640737K8550956L4063451L9837237M4413004
58184B97340694M4832518L8068650K3648269M876066j2963607k5903965l3087133
$$ plain form
58177 336811492 300882217 264678826 229715170 197069863 167552189 141653165 119503898
58170 119503898 100910662 85475870 72746081 62291683 53712075 46643704 40791172
58163 40791172 35928357 31864888 28435087 25516881 23029071 20900918 19062670 17463027
58155 17463027 16069190 14845389 13751554 12763704 11874143 11069604 10328814 9642526 9015786
58146 9015786 8447723 7926933 7448424 7016819 6629960 6275991 5949583 5655460 5393009
58137 5393009 5151897 4925320 4713615 4512862 4314045 4116391 3928605 3754396 3588761
58128 3588761 3430209 3283953 3150687 3024253 2902917 2791547 2690380 2592836 2496837 2407530
58118 2407530 2326491 2248767 2172837 2103104 2040112 1978398 1916535 1859517 1808657 1758723 1707679
$$ packed form
58177C36811492l5929275l6203391l4963656l2645307k9517674k5899024k2149267
58170A19503898j8593236j5434792j2729789j0454398q579608p068371n852532
58163D0791172m862815m063469l429801k918206k487810k128153j838248j599643
58155A7463027j393837j223801j093835r87850q89561q04539p40790o86288o26740
58146I015786n68063n20790m78509m31605l86859l53969l26408k94123k62451
58137E393009k41112k26577k11705k00753j98817j97654j87786j74209j65635
58128C588761j58552j46256j33266j26434j21336j11370j01167r7544r5999q9307
58118B407530q1039p7724p5930o9733o2992o1714o1863n7018n0860m9934n1044
$$ plain form
58107 1707679 1659910 1617125 1575151 1532499 1493295 1458801 1424532 1388658 1355055 1325196 1295063
58096 1295063 1263018 1232928 1206559 1180444 1153234 1128834 1109299 1091606 1074159 1059485 1047766
58085 1047766 1034721 1018840 1004058 992381 980371 965724 950847 937049 921568 903338 885618
58074 885618 870010 853767 835747 819043 804942 790253 773548 758186 746201 734937 722741
58063 722741 712226 704706 697017 687329 678763 673657 669175 662134 653596 645319 636161 625338 615022
58050 615022 606535 597936 588196 579689 573887 568763 563088 558949 557242 554988 550067 544544 540448 536325
58036 536325 530830 525648 521865 517354 510725 504085 498976 493344 485492 477373 470977 465063 458332 452238
58022 452238 447609 442051 433835 425093 418205 412218 405738 400054 396367 393112 389092 386277 386498 388181
$$ packed form
58107A707679m7769m2785m1974m2652l9204l4494l4269l5874l3603k9859l0133
58096A295063l2045l0090k6369k6115k7210k4400j9535j7693j7447j4674j1719
58085A047766j3045j5881j4782j1677j2010j4647j4877j3798j5481j8230j7720
58074H85618j5608j6243j8020j6704j4101j4689j6705j5362j1985j1264j2196
58063G22741j0515p520p689r688q566n106m482p041q538q277r158j0823j0316
58050F15022q487q599r740q507n802n124n675m139j707k254m921n523m096m123
58036E36325n495n182l783m511o629o640n109n632p852q119o396n914o731o094
58022D52238m629n558q216q742o888n987o480n684l687l255m020k815K21J683
$$ plain form
58008 388181 389156 389809 390781 390595 388437 386411 386198 386329 385428 385042 386436 387700 387092 386202 386586 386250 382937
57991 382937 378202 374702 371931 368157 364274 362095 360765 358387 355574 354128 353739 353035 352361 352574 352592 350916
57975 350916 348230 345935 343709 341028 339337 339984 341558 341947 341574 342074 343317 344345 345692 348131 350454
57960 350454 351098 350798 351252 352400 353196 353671 353979 352839 349263 344518 340276 336213 331612 327736 326202 326350
57944 326350 326582 327074 328982 332219 336108 340955 346900 352628 357306 362446 369796 378813 388207 398287
57930 398287 409465 419976 427505 431839 433706 432539 427768 421013 414408 407793 399832 390781 381828 372807
57916 372807 362947 353057 344769 338419 333448 329883 327600 325418 322890 321675 323105 325751 327441 328277
57902 328277 329390 330200 329445 327772 326831 326683 326491 326804 328824 332181 335669 339396 344172 349614 354847 360105
$$ packed form
58008C88181R75O53R72j86k158k026k13J31r01l86J394J264o08q90L84l36l313
57991C82937m735l500k771l774l883k179j330k378k813j446l89p04o74K13J8j676
57975C50916k686k295k226k681j691O47J574L89l73N00J243J028J347K439K323
57960C50454O44l00M54J148P96M75L08j140l576m745m242m063m601l876j534J48
57944C26350K32M92J908L237L889M847N945N728M678N140P350R017R394J0080
57930C98287J1178J0511P529M334J867j167m771o755o605o615p961r051q953r021
57916C72807r860r890q288o350m971l565k283k182k528j215J430K646J690Q36
57902C28277J113Q10p55j673r41j48j92L13K020L357L488L727M776N442N233N258
$$ plain form
57886 360105 365679 370359 373009 374534 376202 377237 376374 374560 373607 373113 371245 367754 363831 359749 355054
57871 355054 350409 346927 344284 341620 339612 339431 340421 340995 341106 341660 342322 342244 342304 344254 348198 352972 358326
57854 358326 364567 370795 375809 380187 385299 390834 395359 398568 400951 402110 401632 400705 400544 400129 397875
57839 397875 394579 392173 390486 388048 385299 384037 384224 384255 383998 384620 385669 385325 383574 382353 382442 382852
57823 382852 383291 384499 385968 386050 384704 383693 383754 383955 384057 385075 387058 388617 389017 388527 386468 381254
57807 381254 372893 363304 353676 343576 333025 323342 315387 308810 303453 299688 297143 294883 293110 292916
57793 292916 294255 295946 297601 299631 301439 301909 301771 303211 306891 311443 316065 321331 327220 332740 338023
57778 338023 344534 352585 360724 368088 375256 382284 388023 392069 395302 397859 398641 397582 396363 395946 395149
$$ packed form
57886C60105N574M680K650J525J668J035q63j814r53m94j868l491l923m082m695
57871C55054m645l482k643k664k008j81R90N74J11N54O62p8O0J950L944M774N354
57854C58326O241O228N014M378N112N535M525L209K383J159m78r27j61m15k254
57839C97875l296k406j687k438k749j262J87L1k57O22J049l44j751j221Q9M10
57823C82852M39J208J469Q2j346j011O1K01J02J018J983J559M00m90k059n214
57807C81254q361r589r628j0100j0551r683p955o577n357l765k545k260j773j94
57793B92916J339J691J655K030J808M70j38J440L680M552M622N266N889N520N283
57778C38023O511Q051Q139P364P168P028N739M046L233K557P82j059j219m17p97
$$ plain form
57763 395149 392594 388486 383764 378994 374710 371374 368482 365158 361890 360095 359849 359827 359639 360144 361208
57748 361208 361439 360706 360702 362191 363753 364157 364007 364098 364001 363303 362581 362180 361559 360665 360427 361146 361957 362490 363454
57729 363454 364941 365951 366316 367284 369360 371382 372603 373891 375868 377690 378854 380551 383892 388107 391710
57714 391710 394285 396179 397578 398789 400251 401547 401591 400452 399577 399535 399044 397057 394346 392108 390384 388777
57698 388777 387407 386182 384355 381757 379397 378059 377338 376659 376021 375269 373961 372534 372198 373079 373916 374129
57682 374129 374660 376185 378196 380594 384493 390565 398272 407634 420104 436683 456905 480911 510940
57669 510940 549487 597401 655054 723779 803894 890938 974195 1038765 1070556 1062843 1020238 955499
57657 955499 881492 806438 735448 672624 619813 575767 538825 509145 486984 470620 457838
$$ packed form
57763C95149k555m108m722m770m284l336k892l324l268j795k46k2j88N05J064
57748C61208K31p33mJ489J562M04j50R1r7o98p22m01o21q94k38P19Q11N33R64
57729C63454J487J010L65R68K076K022J221J288J977J822J164J697L341M215L603
57714C91710K575J894J399J211J462J296M4j139q75m2m91j987k711k238j724j607
57698C88777j370j225j827k598k360j338p21o79o38p52j308j427l36Q81Q37K13
57682C74129N31J525K011K398L899O072P707R362J2470J6579K0222K4006L0029
57669E10940L8547M7914N7653O8725Q0115Q7044Q3257O4570L1791p713m2605o4739
57657I55499p4007p5054p0990o2824n2811m4046l6942k9680k2161j6364j2782
$$ plain form
57646 457838 448027 441132 435871 430808 426093 422526 419939 417888 416849 417208 418209 419289 421237 424560
57632 424560 427954 429978 431143 432630 434076 434415 433969 433841 433917 433259 431997 431211 431324 431895 432584 433114 432853
57615 432853 431612 430308 429807 429724 429304 428591 427705 425972 423014 419823 417530 415960 414510 413423 413019 412713
57599 412713 412095 411914 412681 413422 413286 413170 414097 415131 414793 413588 413072 413174 412561 411239 410702 411582 412985
57582 412985 414231 415625 417399 419260 421121 423186 425323 427222 428973 430624 431629 431662 431409 431612 431967
57567 431967 432028 432366 433613 435122 435964 436558 437879 439692 441136 442532 444955 448321 451521 454234 457178
57552 457178 460688 464430 468418 473050 478175 483240 488146 492944 497022 499687 501251 502499 503530 504282
57538 504282 505699 509017 514172 520019 525749 530993 535060 537465 538933 540653 542845 545146 547868 551517
$$ packed form
57646D57838r811o895n261n063m715l567k587k051j039L59J001J080J948L323
57632D24560L394K024J165J487J446L39m46j28P6o58j262p86J13N71O89N30k61
57615D32853j241j304n01q3m20p13q86j733k958l191k293j570j450j087m04l06
57599D12713o18j81P67P41j36j16R27J034l38j205n16J02o13j322n37Q80J403
57582D12985J246J394J774J861J861K065K137J899J751J651J005L3k53K03L55
57567D31967O1L38J247J509Q42N94J321J813J444J396K423L366L200K713K944
57552D57178L510L742L988M632N125N065M906M798M078K665J564J248J031P52
57538E04282J417L318N155N847N730N244M067K405J468J720K192K301K722L649
$$ plain form
57524 551517 555542 558948 561870 565224 569151 573109 577120 581523 585764 588932 591329 594163 597801 601608
57510 601608 605336 609395 613829 618257 622713 627393 631709 634717 636351 637281 637962 638807 640727 644128 647817
57495 647817 650235 651513 653011 655327 658161 661628 666055 670712 674369 677109 680170 684107 688444 692928
57481 692928 697670 702283 706379 710736 716454 723077 729088 734128 739154 744462 749212 752965 756133 758847
57467 758847 760937 763101 766470 770896 775182 779147 783862 789608 795299 800308 805348 811053 817066 822958
57453 822958 828756 834179 838670 842621 847314 853230 859551 865630 871772 878277 884917 891713 899088 906962
57439 906962 914785 922655 931266 940522 949423 957527 965316 972968 980096 986968 994631 1003349 1012123 1020154
57425 1020154 1027740 1035435 1043376 1051671 1060356 1068831 1076484 1083920 1092315 1101474 1110053 1117851 1126250 1135991
$$ packed form
57524E51517M025L406K922L354L927L958M011M403M241L168K397K834L638L807
57510F01608L728M059M434M428M456M680M316L008J634R30O81Q45J920L401L689
57495F47817K418J278J498K316K834L467M427M657L657K740L061L937M337M484
57481F92928M742M613M096M357N718O623O011N040N026N308M750L753L168K714
57467G58847K090K164L369M426M286L965M715N746N691N009N040N705O013N892
57453H22958N798N423M491L951M693N916O321O079O142O505O640O796P375P874
57439I06962P823P870Q611R256Q901Q104P789P652P128O872P663Q718Q774Q031
57425A020154P586P695P941Q295Q685Q475P653P436Q395R159Q579P798Q399R741
$$ plain form
57411 1135991 1146065 1155495 1164766 1174772 1185579 1196908 1208669 1220364 1230996 1240285 1249018 1257741
57399 1257741 1266120 1274040 1282234 1291251 1300768 1310424 1320422 1330906 1341655 1352706 1364338 1376205 1387602
57386 1387602 1398827 1411073 1424736 1439140 1454175 1470694 1488656 1506321 1522115 1536143 1549195
57375 1549195 1561532 1573488 1586069 1599831 1613957 1627277 1639597 1651443 1663221 1675158 1687348
57364 1687348 1699454 1711099 1722872 1735979 1750611 1765674 1780526 1795839 1812271 1829339 1846246
57353 1846246 1862854 1879304 1895606 1912094 1929432 1947712 1966380 1985242 2004493 2023594 2041437
57342 2041437 2058026 2074663 2091993 2109198 2125707 2142265 2159641 2177631 2196139 2215888 2237027
57331 2237027 2258206 2278100 2296962 2315799 2334991 2354545 2374750 2395616 2416436 2436754 2457035
$$ packed form
57411A135991J0074R430R271J0006J0807J1329J1761J1695J0632R289Q733Q723
57399A257741Q379P920Q194R017R517R656R998J0484J0749J1051J1632J1867J1397
57386A387602J1225J2246J3663J4404J5035J6519J7962J7665J5794J4028J3052
57375A549195J2337J1956J2581J3762J4126J3320J2320J1846J1778J1937J2190
57364A687348J2106J1645J1773J3107J4632J5063J4852J5313J6432J7068J6907
57353A846246J6608J6450J6302J6488J7338J8280J8668J8862J9251J9101J7843
57342B041437J6589J6637J7330J7205J6509J6558J7376J7990J8508J9749K1139
57331B237027K1179J9894J8862J8837J9192J9554K0205K0866K0820K0318K0281
$$ plain form
57320 2457035 2477724 2498487 2518957 2539359 2559770 2579769 2599421 2619574 2640559 2661750 2683082
57309 2683082 2705707 2730214 2755340 2779515 2802739 2825913 2849270 2872499 2895629 2918794 2941825
57298 2941825 2964894 2988811 3013896 3039330 3064313 3088963 3113524 3137791 3162095 3187539 3214260
57287 3214260 3240711 3265802 3290589 3316509 3343042 3368705 3393491 3418705 3444941 3471701 3498662
57276 3498662 3525876 3552941 3579255 3605095 3631411 3658639 3686514 3714868 3743810 3773280 3803069
57265 3803069 3833102 3863219 3893076 3922693 3952653 3983305 4014279 4045150 4075890 4106337 4136069
57254 4136069 4165269 4194741 4224549 4253714 4281826 4309717 4337749 4364763 4389880 4414145 4439020
57243 4439020 4464166 4488139 4510583 4532379 4554195 4576176 4598593 4621554 4644425 4666582 4688388
$$ packed form
57320B457035K0689K0763K0470K0402K0411J9999J9652K0153K0985K1191K1332
57309B683082K2625K4507K5126K4175K3224K3174K3357K3229K3130K3165K3031
57298B941825K3069K3917K5085K5434K4983K4650K4561K4267K4304K5444K6721
57287C214260K6451K5091K4787K5920K6533K5663K4786K5214K6236K6760K6961
57276C498662K7214K7065K6314K5840K6316K7228K7875K8354K8942K9470K9789
57265C803069L0033L0117K9857K9617K9960L0652L0974L0871L0740L0447K9732
57254D136069K9200K9472K9808K9165K8112K7891K8032K7014K5117K4265K4875
57243D439020K5146K3973K2444K1796K1816K1981K2417K2961K2871K2157K1806
$$ plain form
57232 4688388 4710520 4732896 4755229 4778056 4802136 4827333 4853129 4879734 4907582 4936222 4964775
57221 4964775 4993131 5021666 5050165 5077998 5104974 5131078 5155819 5178804 5200543 5221695 5241841
57210 5241841 5259919 5275533 5288992 5300497 5310235 5319003 5327811 5336991 5346258 5355311 5363959 5372211 5380746
57197 5380746 5390627 5402017 5413986 5426131 5439342 5454239 5469986 5485627 5501450 5517922 5534346
57186 5534346 5549940 5565249 5581111 5597054 5612138 5626546 5640827 5654302 5665924 5676212 5686625
57175 5686625 5697313 5706971 5714710 5720714 5725274 5728542 5731101 5733580 5735872 5737723 5739713 5742574 5746038 5749620
57161 5749620 5754047 5760592 5769399 5779703 5791228 5804032 5817515 5831099 5845462 5861514 5878462 5894463
57149 5894463 5908942 5922603 5935316 5945733 5953036 5957400 5958490 5955139 5946931 5934839 5919872 5902271
$$ packed form
57232D688388K2132K2376K2333K2827K4080K5197K5796K6605K7848K8640K8553
57221D964775K8356K8535K8499K7833K6976K6104K4741K2985K1739K1152K0146
57210E241841J8078J5614J3459J1505R738Q768Q808R180R267R053Q648Q252Q535
57197E380746R881J1390J1969J2145J3211J4897J5747J5641J5823J6472J6424
57186E534346J5594J5309J5862J5943J5084J4408J4281J3475J1622J0288J0413
57175E686625J0688R658P739O004M560L268K559K479K292J851J990K861L464L582
57161E749620M427O545Q807J0304J1525J2804J3483J3584J4363J6052J6948J6001
57149E894463J4479J3661J2713J0417P303M364J090l351q208j2092j4967j7601
$$ plain form
57137 5902271 5882332 5860857 5838422 5815225 5792110 5770956 5753755 5741824 5735801 5735577 5740192 5748469
57125 5748469 5759701 5773211 5787789 5802399 5817066 5832203 5847711 5863875 5882754 5907526 5940887
57114 5940887 5985115 6042923 6116508 6205793 6309068 6425501 6556224 6703613 6871210 7064481
57104 7064481 7290607 7557661 7875111 8254982 8711804 9262439 9928122 10737292 11726204
57095 11726204 12938127 14423758 16241496 18454053 21122275 24300171 28031418 32344180
57087 32344180 37243775 42706444 48676533 55066875 61759315 68597955 75370000 81787511
57079 81787511 87501409 92163782 95509207 97401522 97822862 96831825 94530337 91051169
57071 91051169 86553978 81220548 75250313 68856457 62258516 55669992 49283980 43259861
$$ packed form
57137E902271j9939k1475k2435k3197k3115k1154j7201j1931o023k24M615Q277
57125E748469J1232J3510J4578J4610J4667J5137J5508J6164J8879K4772L3361
57114E940887M4228N7808P3585Q9285J03275J16433J30723J47389J67597J93271
57104G064481K26126K67054L17450L79871M56822N50635O65683Q09170R88912
57095A1726204J211923J485631J817738K212557K668222L177896L731247M312762
57087C2344180M899595N462669N970089O390342O692440O838640O772045O417511
57079H1787511N713898M662373L345425J892315M21340r91037k301488l479168
57071I1051169m497191n333430n970235o393856o597941o588524o386012o024119
$$ plain form
57063 43259861 37713417 32713612 28287231 24427712 21103854 18268006 15864485 13836251
57055 13836251 12128107 10688455 9471757 8440075 7561822 6809772 6161017 5597694 5106051
57046 5106051 4674706 4294231 3957346 3658073 3390825 3151012 2935910 2743883 2572944
57037 2572944 2420647 2284807 2163506 2054954 1958162 1873303 1800645 1739771 1690776 1655491
57027 1655491 1636307 1634555 1651853 1692212 1758653 1844036 1925590 1972242 1961321 1890640 1776175
57016 1776175 1639706 1498497 1363105 1239582 1130763 1036621 955735 886903 828897 779560
57006 779560 736545 698783 666272 638695 615139 594761 576659 559419 541933 524387 507476
56995 507476 491003 474378 458010 442907 429310 417137 407378 401419 399144 399370 402201 409303 421613
$$ packed form
57063D3259861n546444m999805m426381l859519l323858k835848k403521k028234
57055A3836251j708144j439652j216698j031682q78253p52050o48755n63323m91643
57046E106051m31345l80475l36885k99273k67248k39813k15102j92027j70939
57037B572944j52297j35840j21301j08552r6792q4859p2658o0874m8995l5285
57027A655491j9184j752J7298M0359O6441Q5383Q1554M6652j0921p0681j14465
57016A776175j36469j41209j35392j23523j08819r4142q0886o8832n8006m9337
57006G79560m3015l7762l2511k7577k3556k0378j8102j7240j7486j7546j6911
56995E07476j6473j6625j6368j5103j3597j2173r759n959k275K26K831P102J2310
$$ plain form
56982 421613 438088 456575 474145 486523 489418 481519 465215 444064 420742 397420 376060 357376
56970 357376 340738 325777 313102 303162 295779 291188 290149 292554 297279 303923 313431 326655 343733
56957 343733 365185 391654 421434 449462 469804 478540 474406 458508 434290 406354 378127 351234
56945 351234 327012 306988 291416 279165 269804 264260 262733 263830 266853 273266 284652 300672 320437
56932 320437 344622 374754 411013 451376 491511 524591 542944 542126 523498 492426 454797 415477
56920 415477 378056 344206 313831 286845 264075 245824 230874 217966 207152 198658 191628 185169
56908 185169 179634 175661 172872 170625 169076 168388 167810 166726 165719 165511 165711 165751 166195 167993 171210 175603
56892 175603 181696 190255 201372 214964 231414 250948 273216 298173 326045 355190 380967 398135
$$ packed form
56982D21613J6475J8487J7570J2378K895p899j6304k1151k3322k3322k1360j8684
56970C57376j6638j4961j2675r940p383m591j039K405M725O644R508J3224J7078
56957C43733K1452K6469K9780K8028K0342Q736m134j5898k4218k7936k8227k6893
56945C51234k4222k0024j5572j2251r361n544j527J097L023O413J1386J6020J9765
56932C20437K4185L0132L6259M0363M0135L3080J8353q18j8628l1072l7629l9320
56920D15477l7421l3850l0375k6986k2770j8251j4950j2908j0814q494p030o459
56908A85169n535l973k789k247j549o88n78j084j007k08K00M0M44J798L217M393
56892A75603O093Q559J1117J3592J6450J9534K2268K4957K7872K9145K5777J7168
$$ plain form
56880 398135 404046 399089 385407 366288 345584 326085 308732 294011 283085 276699 274190 274752 278772
56867 278772 286935 299195 315812 338334 368324 406126 452019 507396 573043 646482 721400 788532
56855 788532 836828 856707 845292 808462 756525 698382 640152 586692 541372 504828 476244
56844 476244 455859 444844 443410 450695 466235 490254 523197 566319 622086 692577 778077 878002
56832 878002 991015 1111058 1223456 1307929 1347645 1336529 1280197 1192160 1088294 981650
56822 981650 880159 788120 708368 642168 588680 546652 516222 497816 490245 491744 502322 523413
56810 523413 555703 599005 653879 721455 801068 888153 973208 1042007 1079392 1076619 1036138 968602
56798 968602 885925 797822 712211 634719 567188 508899 459747 420792 392089 372082 359267
$$ packed form
56880C98135N911m957j3682j9119k0704j9499j7353j4721j0926o386k509N62M020
56867B78772Q163J2260J6617K2522K9990L7802M5893N5377O5647P3439P4918O7132
56855G88532M8296J9879j1415l6830n1937n8143n8230n3460m5320l6544k8584
56844D76244k0385j1015j434P285J5540K4019L2943M3122N5767P0491Q5500R9925
56832H78002J13013J20043J12398Q4473L9716j1116n6332q8037j03866j06644
56822I81650j01491r2039p9752o6200n3488m2028l0430j8406p571J499J0578K1091
56810E23413L2290M3302N4874O7576P9613Q7085Q5055O8799L7385k773m0481o7536
56798I68602q2677q8103q5611p7492o7531n8289m9152l8955k8703k0007j2815
$$ plain form
56787 359267 352879 352110 356501 367081 385510 412135 446231 487346 533950 580538 618194 638974
56775 638974 639139 619065 582297 534875 483394 432554 384941 342438 306126 275145 247612 222941
56763 222941 201834 184233 169036 155863 145286 137168 130444 124755 120676 118104 115905 113386 110706
56750 110706 107816 104475 101369 99684 99403 99400 99264 99547 100205 100344 99703 98988 98572 98178 97768 97498 96922 95595
56732 95595 94223 93802 93912 93428 92576 92559 93454 94300 94991 96221 97773 98867 100041 102563 105987 108402 109194
56715 109194 109487 109845 109811 109827 111179 113548 114952 114768 114616 115543 116529 116633 116573 117145 117924 118530 119459 120715
56697 120715 121223 120504 119524 119075 118839 118713 119409 120896 121783 121193 119975 119349 119605 120690 122638 124844 126301
56680 126301 127122 128438 130456 132199 133545 135643 138658 140953 141364 140650 139861 138924 137707 136861 136591 136090
$$ packed form
56787C59267o388p69M391J0580J8429K6625L4096M1115M6604M6588L7656K0780
56775F38974J65k0074l6768m7422n1481n0840m7613m2503l6312l0981k7533k4671
56763B22941k1107j7601j5197j3173j0577q118o724n689m079k572k199k519k680
56750A10706k890l341l106j685k81lj36K83O58J39o41p15m16l94m10k70n76j327
56732I5595j372m21J10m84q52j7Q95Q46O91J230J552J094J174K522L424K415P92
56715A09194K93L58l4J6J352K369J404j84j52R27R86J04o0N72P79O06R29J256
56697A20715N08p19r80m49k36j26O96J487Q87n90j218o26K56J085J948K206J457
56680A26301Q21J316K018J743J346K098L015K295M11p14p89r37j217q46k70n01
$$ plain form
56664 136090 135118 134730 135531 136640 137199 137512 137880 137763 136998 136438 136549 136746 136867 137774 139614 140993 140896 140019
56646 140019 139283 138475 137363 136768 137382 138657 139854 141104 142641 144191 145840 148207 150993 152732 152797 152265
56630 152265 152014 151457 150005 148223 146480 143964 140285 136711 134550 133374 131912 129722 127081 124292 121985
56615 121985 120965 120929 120440 118881 117222 116215 115320 114261 114016 115158 116566 116934 116386 115663 114986 114604 115140
56598 115140 116393 117093 116778 116592 117325 118166 118412 118866 120350 122264 123856 125511 127551 129116 129612 130001
56582 130001 131275 132825 133635 134005 134781 135892 136879 137901 139133 140199 141208 143189 146464 149806 152287
56567 152287 154733 158270 162743 167760 173933 181746 190444 199494 210085 223775 240444 258552 276264
56554 276264 291341 301385 305719 306149 304712 301760 297235 292363 288578 285840 283345 280906 278448 275283
$$ packed form
56664A36090r72l88Q01J109N59L13L68j17p65n60J11J97J21R07J840J379r7q77
56646A40019p36q08j112n95O14J275J197J250J537J550J649K367K786J739O5n32
56630A52265k51n57j452j782j743k516l679l574k161j176j462k190k641k789k307
56615A21985j020l6m89j559j659j007q95j059k45J142J408L68n48p23o77l82N36
56598A15140J253P00l15j86P33Q41K46M54J484J914J592J655K040J565M96L89
56582A30001J274J550Q10L70P76J111R87J022J232J066J009J981L275L342K481
56567A52287K446L537M473N017O173P813Q698R050J0591J3690J6669J8108J7712
56554B76264J5077J0044M334M30j437k952m525m872l785k738k495k439k458l165
$$ plain form
56540 275283 271146 266925 263205 259236 254423 249617 245764 242503 239203 236073 233067 229170 224113 219406
56526 219406 216305 214120 211853 209966 208968 207767 205178 201814 198805 195816 192014 187795 183921 180094
56512 180094 175992 172572 170712 169662 168345 167043 166224 165032 162663 160018 158253 156858 154884 152861
56498 152861 151718 150966 149740 148503 147923 147278 145790 144343 143959 143807 142715 141495 141652 142809 143542 143787
56482 143787 144342 144928 144917 145089 146436 147947 147842 146405 145550 146072 147251 148613 150154 151352 151755 152103 153276
56465 153276 154847 156125 157579 159546 160796 160382 159766 160869 163044 164261 164379 164761 165448 165265 164322 163949
56449 163949 164391 164737 164894 165583 166740 167874 169584 172662 176045 177676 177185 175926 174757 173569 172554
56434 172554 172076 171695 171019 170922 172249 174011 174675 174446 174479 174672 174202 173338 172704 171666 169626 167968 168354 169898
$$ packed form
56540B75283m137m221l720l969m813m806l853l261l300l130l006l897n057m707
56526B19406l101k185k267j887r98j201k589l364l009k989l802m219l874l827
56512A80094m102l420j860j050j317j302q19j192k369k645j765j395j974k023
56498A52861j143p52j226j237n80o45j488j447l84j52j092j220J57J157P33K45
56482A43787N55N86j1J72J347J511j05j437q55N22J179J362J541J198M03L48J173
56465A53276J571J278J454J967J250m14o16J103K175J217J18L82O87j83r43l73
56449A63949M42L46J57O89J157J134J710L078L383J631m91j259j169j188j015
56434A72554m78l81o76r7J327J762O64k29L3J93m70q64o34j038k040j658L86J544
$$ plain form
56416 169898 170445 169955 170209 171808 173905 176324 179441 182393 183826 184069 184383 184648 184024 183228 183643 184748
56400 184748 184930 184296 184132 184198 183235 181766 181675 183297 185507 188254 192252 196486 198862 199365 199929 201268 202414
56383 202414 203247 204801 207005 208660 209657 210826 211744 211240 209941 209700 210577 210895 210162 209406 208813 207743 206937
56366 206937 207918 210193 211702 212039 212612 213735 214363 214625 215732 217309 217688 216992 217119 218552 219982 221179
56350 221179 223340 226369 228670 229876 231077 232228 232204 231510 231970 233558 234492 234617 235632 237789 239487 240443
56334 240443 242123 244705 246843 248755 252213 256956 260454 261892 263175 265372 267485 269439 272825 277681
56320 277681 281789 284195 286302 288628 289680 289061 288421 288255 286995 284417 282719 282959 283556 283591 284399 286570
56304 286570 288536 289625 291503 295066 298906 302413 307436 315046 323329 330066 335206 339312 342115 344029
$$ packed form
56416A69898N47m90K54J599K097K419L117K952J433K43L14K65o24p96M15J105
56400A84748J82o34j64O6r63j469r1J622K210K747L998M234K376N03N64J339J146
56383B02414Q33J554K204J655R97J169R18n04j299k41Q77L18p33p56n93j070q06
56366B06937R81K275J509L37N73J123O28K62J107J577L79o96J27J433J430J197
56350B21179K161L029K301J206J201J151k4o94M60J588R34J25J015K157J698R56
56334B40443J680K582K138J912L458M743L498J438J283K197K113J954L386M856
56320B77681M108K406K107K326J052o19o40j66j260k578j698K40N97L5Q08K171
56304B86570J966J089J878L563L840L507N023P610Q283O737N140M106K803J914
$$ plain form
56290 344029 346593 350088 353122 355572 359194 364304 368923 372486 377291 384763 393251 401141 409262 418471
56276 418471 427674 436062 444763 454536 464289 473417 483162 494204 505461 516706 529777 545715 563242
56263 563242 581361 600900 622248 644388 667493 693648 723696 756308 791553 832277 880384
56252 880384 934861 995090 1063009 1140180 1225729 1319013 1421188 1532234 1649319 1770070 1894536
56241 1894536 2021987 2148665 2270719 2386449 2493610 2587437 2663624 2720830 2758374 2774194
56231 2774194 2767154 2738999 2692274 2628811 2551595 2465128 2372209 2273116 2169287 2064579 1961406
56220 1961406 1859128 1757977 1660939 1569802 1483063 1399906 1322531 1252205 1186706 1124243 1066346
56209 1066346 1014239 965955 919819 877280 839440 804226 770033 738831 712559 689622 668002
$$ packed form
56290C44029K564L495L034K450L622N110M619L563M805P472Q488P890Q121R209
56276D18471R203Q388Q701R773R753R128R745J1042J1257J1245J3071J5938J7527
56263E63242J8119J9539K1348K2140K3105K6155L0048L2612L5245M0724M8107
56252H80384N4477O0229O7919P7171Q5549R3284J02175J11046J17085J20751J24466
56241A894536J27451J26678J22054J15730J07161R3827P6187N7206L7544J5820
56231B774194p040k8155m6725o3463p7216q6467r2919r9093j03829j04708j03173
56220A961406j02278j01151r7038r1137q6739q3157p7375p0326o5499o2463n7897
56209A066346n2107m8284m6136m2539l7840l5214l4193l1202k6272k2937k1620
$$ plain form
56198 668002 648662 632773 618638 604556 591800 581719 572764 563370 554879 548674 543380 537798 533500
56185 533500 531636 530289 527920 526196 526408 526455 524509 522325 521790 521671 520985 521902 525720 529609 531176 532793
56169 532793 537419 543557 548398 552725 558539 564956 570703 577616 587413 597911 606686 615623 627663 641855
56155 641855 655889 670678 688091 706941 725645 746284 771751 801464 834095 871894 918136
56144 918136 973071 1036683 1112553 1204354 1310938 1428918 1556929 1692469 1827263 1950965
56134 1950965 2057879 2146594 2216445 2269405 2312769 2354520 2397032 2438313 2476132 2506829 2523876
56123 2523876 2523267 2508428 2485855 2458799 2428880 2399138 2369332 2331285 2274953 2197357 2101484 1990253
56111 1990253 1867340 1740637 1618519 1504368 1399309 1307031 1230503 1167141 1112878 1068091
$$ packed form
56198F68002j9340j5889j4135j4082j2756j0081q955r394q491o205n294n582m298
56185E33500j864j347k369j724K12M7j946k184n35j19o86R17L818L889J567J617
56169E32793M626O138M841M327N814O417N747O913R797J0498Q775Q937J2040J4192
56155F41855J4034J4789J7413J8850J8704K0639K5467K9713L2631L7799M6242
56144I18136N4935O3612P5870R1801J06584J17980J28011J35540J34794J23702
56134A950965J06914Q8715O9851N2960M3364M1751M2512M1281L7819L0697J7047
56123B523876o09j4839k2573k7056k9919k9742k9806l8047n6332p7596r5873j11231
56111A990253j22913j26703j22118j14151j05059r2278p6528o3362n4263m4787
$$ plain form
56101 1068091 1034221 1008061 985362 966752 954133 944744 935164 927631 925681 926786 926205 924920 926678
56088 926678 930221 931790 932606 936493 942535 947275 951783 959404 968983 977367 986003 997868 1010672 1020490
56074 1020490 1029338 1041533 1055390 1066483 1076370 1089883 1106220 1120917 1134308 1149875 1166607 1181289
56062 1181289 1195932 1214615 1235404 1253825 1271683 1293728 1318247 1339987 1359767 1381909 1404754
56051 1404754 1423338 1439113 1457293 1476930 1493476 1508826 1528667 1552070 1573962 1595567 1621846
56040 1621846 1650927 1677056 1702001 1732365 1767584 1801831 1835739 1874513 1916358 1954954 1991878
56029 1991878 2034438 2082570 2130047 2177001 2228630 2283076 2333642 2381723 2434441 2490916 2544458
56018 2544458 2596872 2656375 2722404 2786942 2849983 2918994 2993909 3067766 3141546 3222994 3311256
$$ packed form
56101A068091l3870k6160k2699j8610j2619r389r580p533j950J105n81j285J758
56088I26678L543J569Q16L887O042M740M508P621R579Q384Q636J1865J2804R818
56074A020490Q848J2195J3857J1093R887J3513J6337J4697J3391J5567J6732J4682
56062A181289J4643J8683K0789J8421J7858K2045K4519K1740J9780K2142K2845
56051A404754J8584J5775J8180J9637J6546J5350J9841K3403K1892K1605K6279
56040A621846K9081K6129K4945L0364L5219L4247L3908L8774M1845L8596L6924
56029A991878M2560M8132M7477M6954N1629N4446N0566M8081N2718N6475N3542
56018B544458N2414N9503O6029O4538O3041O9011P4915P3857P3780Q1448Q8262
$$ plain form
56007 3311256 3398347 3485227 3580371 3683158 3785383 3888603 4002703 4127778 4255232 4386221
55997 4386221 4530449 4687127 4846405 5009392 5186793 5378007 5572520 5772011 5989298
55988 5989298 6225353 6470060 6725895 7006784 7313012 7632489 7967792 8335559 8737911
55979 8737911 9162357 9611703 10104850 10645837 11222918 11841142 12523695 13278020 14094619
55970 14094619 14982701 15971213 17071794 18280141 19617988 21132199 22849503 24779500
55962 24779500 26968194 29499860 32444906 35868441 39903416 44758382 50650251 57803475
55954 57803475 66525942 77209759 90261846 106144702 125496193 149083656 177631588
55947 177631588 211797437 252030335 297546636 344611406 385984477 413169913 420433140
$$ packed form
56007C311256Q7091Q6880R5144J02787J02225J03220J14100J25075J27454J30989
55997D386221J44228J56678J59278J62987J77401J91214J94513J99491K17287
55988E989298K36055K44707K55835K80889L06228L19477L35303L67767M02352
55979H737911M24446M49346M93147N40987N77081O18224O82553P54325Q16599
55970A4094619Q88082R88512J100581J208347J337847J514211J717304J929997
55962B4779500K188694K531666K945046L423535M034975M854966N891869P153224
55954E7803475Q722467J0683817J3052087J5882856J9351491K3587463K8547932
55947A77631588L4165849M0232898M5516301M7064770M1373071K7185436P263227
$$ plain form
55940 420433140 407449540 378649486 340394359 298468382 257063538 218766649 184834248
55933 184834248 155584677 130848618 110255648 93300522 79392596 67981553 58624374
55926 58624374 50938138 44570262 39244542 34776402 31014396 27808807 25048134 22672768
55918 22672768 20629083 18847001 17274772 15894335 14685379 13608264 12635133 11764017
55910 11764017 10988635 10284509 9636563 9050930 8527389 8046987 7597570 7185603 6812258
55901 6812258 6462569 6128516 5819394 5539263 5276183 5023148 4788365 4575520 4374291
55892 4374291 4179512 4000135 3840189 3689515 3542132 3405841 3285069 3171485 3060196
55883 3060196 2958754 2871794 2792380 2716216 2648645 2589569 2526785 2452794 2374385 2298102 2220309
$$ packed form
55940D20433140j2983600k8800054l8255127m1925977m1404844l8296889l3932401
55933A84834248k9249571k4736059k0592970j6955126j3907926j1411043r357179
55926E8624374p686236o367876n325720m468140l762006l205589k760673k375366
55918B2672768k043685j782082j572229j380437j208956j077115r73131q71116
55910A1764017p75382p04126o47946n85633n23541m80402m49417m11967l73345
55901F812258l49689l34053l09122k80131k63080k53035k34783k12845k01229
55892D374291j94779j79377j59946j50674j47383j36291j20772j13584j11289
55883C060196j01442q6960p9414p6164o7571n9076o2784p3991p8409p6283p7793
$$ plain form
55872 2220309 2139208 2062530 1994706 1928985 1860319 1794241 1735706 1680832 1626880 1578833 1539011
55861 1539011 1501286 1462389 1427930 1400488 1372819 1339866 1306928 1278968 1252184 1223251 1196827
55850 1196827 1176478 1157440 1135457 1113948 1095660 1075964 1051235 1025609 1002953 980245 955123
55839 955123 931888 913622 896139 875972 856811 841982 828012 811720 796426 785173 774795
55828 774795 762551 751704 744761 737961 728179 718605 711910 704308 692186 678401 666474 654625 640952
55815 640952 628394 619182 610205 599112 589204 583209 578083 571017 564748 561910 559975 556828 555462 558080
55801 558080 561447 563288 567297 576323 586320 592743 597461 603655 609201 610970 610729 610945 609397 603581 596000
55786 596000 589675 582940 574054 566317 562858 560491 554358 544781 534256 521864 506388 491290 480916
$$ packed form
55872B220309q1101p6678o7824o5721o8666o6078n8535n4874n3952m8047l9822
55861A539011l7725l8897l4459k7442k7669l2953l2938k7960k6784k8933k6424
55850A196827k0349j9038k1983k1509j8288j9696k4729k5626k2656k2708k5122
55839I55123k3235j8266j7483k0167j9161j4829j3970j6292j5294j1253j0378
55828G74795j2244j0847o943o800r782r574o695p602j2122j3785j1927j1849j3673
55815F40952j2558r212q977j1093r908n995n126p066o269k838j935l147j366K618
55801E58080L367J841M009R026R997O423M718O194N546J769k41K16j548n816p581
55786E96000o325o735q886p737l459k367o133r577j0525j2392j5476j5098j0374
$$ plain form
55773 480916 474761 470423 469015 472962 481817 494611 512302 532988 548678 552374 545399 533279 518258
55760 518258 500812 484349 472172 462520 452156 442240 435419 429787 421156 409222 396577 383760
55748 383760 370055 357039 346679 337797 328635 320781 316384 313781 310109 306048 303953 303560 303485 304416
55734 304416 306738 307540 304298 299200 295717 293319 289694 285592 283010 280896 277083 272378 268551 264516
55720 264516 258728 253067 250001 248208 245329 242731 242949 244704 245311 246051 250205 257440 264862 272062 280264
55705 280264 287859 291694 291925 291123 289505 285314 278963 272483 265693 257104 247856 240691 235669 230673 225414
55690 225414 221226 217791 213815 210162 208678 208729 208461 208545 211073 215598 219802 223258 227123 231104 234212
55675 234212 237446 242146 246671 248316 247558 246857 246271 243978 240209 236957 234520 232004 230401 231457 234142
$$ packed form
55773D80916o155m338j408L947Q855J2794J7691K0686J5690L696o975j2120j5021
55760E18258j7446j6463j2177r652j0364r916o821n632q631j1934j2645j2817
55748C83760j3705j3016j0360q882r162p854m397k603l672m061k095l93p5R31
55734C04416K322Q02l242n098l483k398l625m102k582k114l813m705l827m035
55720B64516n788n661l066j793k879k598K18J755O07P40M154P235P422P200Q202
55705B80264P595L835K31q02j618m191o351o480o790q589r248p165n022m996n259
55690B25414m188l435l976l653j484N1k68Q4K528M525M204L456L865L981L108
55675B34212L234M700M525J645p58p01n86k293l769l252k437k516j603J056K685
$$ plain form
55660 234142 235874 236531 237747 239123 238992 238266 239501 242442 244295 244284 244336 245356 246302 246881 247826 248536 247571
55643 247571 245413 243786 242554 240218 236900 233756 230022 223977 216376 209616 203955 197763 191089 185575
55629 185575 181263 176849 172715 170324 168973 166643 163790 162714 163354 163334 162200 161989 163398 164826 165461
55614 165461 165992 166066 164375 161497 159448 158165 155726 152182 149716 148640 146762 143360 140418 139114 138289
55599 138289 137229 136871 137289 136883 135060 133104 131578 129486 126846 125441 126058 127287 127926 128360 128874 128787
55583 128787 127929 127010 126107 124796 123878 124750 126922 128489 129098 129969 131007 130742 129453 129503 131901 135121 137907
55566 137907 140707 143662 145699 146418 146677 146693 145739 144181 143516 143821 143395 141411 138768 136012 132731 129423
55550 129423 127568 127309 127235 126837 126942 127496 127348 126553 126453 127139 127343 127197 128439 131385 134307 136342 138377
$$ packed form
55660B34142J732O57J216J376j31p26J235K941J853j1N2J020R46N79R45P10r65
55643B47571k158j627j232k336l318l144l734o045p601o760n661o192o674n514
55629A85575m312m414m134k391j351k330k853j076O40k0j134k11J409J428O35
55614A65461N31P4j691k878k049j283k439l544k466j076j878l402k942j304q25
55599A38289j060l58M18m06j823j956j526k092k640j405O17J229O39M34N14q7
55583A28787q58r19r03j311r18Q72K172J567O09Q71J038k65j289N0K398L220K786
55566A37907K800K955K037P19K59J6r54j558o65L05m26j984k643k756l281l308
55550A29423j855k59p4l98J05N54j48p95j00O86K04j46J242K946K922K035K035
$$ plain form
55533 138377 140488 141314 140805 140893 142438 143962 144281 143914 143056 140778 137278 134450 133093 131811 129664 127497
55517 127497 125678 123008 119124 115637 113588 111933 109770 107895 106928 105972 104424 103134 102559 101692 100009
55502 100009 98505 97677 96438 94235 92295 91628 91634 91775 92685 94505 96074 96916 98065 99793 100570 99581 98293
55485 98293 98129 98489 98442 98467 99024 99204 98406 97766 98378 99563 100282 100858 101943 103161 104049 104972 105945 105972 104738
55466 104738 103499 103169 102934 101888 100537 99529 98449 97072 96299 96569 96777 96037 95155 95131 95586 95848 96186
55449 96186 96768 96798 95903 95065 95029 95145 94874 94925 95612 95668 94128 92079 91149 91411 92052 92835 93665 93938 93659 94054
55429 94054 95830 97980 99437 100608 102097 103240 103279 102804 102684 102653 102212 101793 101863 101974 101891 102445 104090 105749
55411 105749 106307 106086 105724 104924 103542 102547 102497 102294 100949 99377 98915 99170 98921 98178 97772 97732 97602 97625 98195
$$ packed form
55533A38377K111Q26n09Q8J545J524L19l67q58k278l500k828j357j282k147k167
55517A27497j819k670l884l487k049j655k163j875r67r56j548j290n75q67j683
55502A00009j504q28j239k203j940o67OJ41R10J820J569Q42J149J728P77r89j288
55485I8293j64L60m7K5N57J80p98o40O12J185P19N76J085J218Q88R23R73K7j234
55466A04738j239l30k35j046j351j008j080j377p73K70K08p40q82k4M55K62L38
55449I6186N82L0q95q38l6J16k71N1O87N6j540k049r30K62O41P83Q30K73k79L95
55429I4054J776K150J457J171J489J143L9m75j20l1m41m19P0J11q3N54J645J659
55411A05749N58k21l62q00j382r95n0k03j345j572m62K55k49p43m06m0j30K3N70
$$ plain form
55392 98195 98809 98871 98888 99636 100753 101301 101074 100394 99370 98308 97977 98506 98960 98877 99162 100513 102172 103353
55374 103353 104573 106279 107414 106889 105422 104342 103411 101379 97967 93907 89678 85550 82247 80330 79546
55359 79546 79686 81183 83788 85792 85940 85169 85100 85764 86215 86416 86882 87249 86861 86148 85900 85740 84865 83787
55341 83787 83796 85047 86563 87780 88793 89457 89565 89610 90131 90604 90168 89120 88540 88625 88538 87746 86601 85774 85816
55322 85816 86963 88732 90161 90919 91557 92159 91757 89861 87520 85947 85064 84348 84119 84786 85767 86336 86706
55305 86706 87199 87269 86565 85976 86333 86936 86713 85988 85786 86170 86639 87342 88500 89418 89525 89594 90465 91355 91107
55286 91107 90410 90996 93077 95306 96922 98190 98925 98273 96122 93401 90894 88794 87308 86644 86465 86267
55270 86267 86065 86013 85880 85723 86321 87918 89358 89662 89675 90741 92478 93356 92992 92284 91753 91258 91073 91750
$$ packed form
55392I8195O14O2J7P48J117N48k27o80j024j062l31N29M54q3K85J351J659J181
55374A03353J220J706J135n25j467j080r31k032l412m060m229m128l303j917p84
55359G9546J40J497K605K004J48p71o9O64M51K01M66L67l88p13k48j60q75j078
55341H3787RJ251J516J217J013O64J08M5N21M73m36j048n80Q5q7p92j145q27M2
55322H5816J147J769J429P58O38O02m02j896k341j573q83p16k29O67R81N69L70
55305H6706M93P0p04n89L57O03k23p25k02L84M69P03J158R18J07O9Q71Q90k48
55286I1107o97N86K081K229J616J268P35o52k151k721k507k100j486o64j79j98
55270H6267k02n2j33j57N98J597J440L04J3J066J737Q78l64p08n31m95j85O77
$$ plain form
55252 91750 93025 94108 94834 95412 95426 94338 92594 91078 89858 88631 87802 87857 88207 87998 87507 87340 86947
55235 86947 85555 84062 84169 85836 87354 87810 87871 88115 88238 88060 87907 87777 87312 86681 86468 86702 86987 87346
55217 87346 87951 88441 88599 89195 90875 92781 93667 93847 94473 95409 95588 95097 95057 95531 95427 94520 93822 93756 93617
55198 93617 93062 92638 92602 92603 92674 93158 93640 93401 92914 93328 94462 94990 94718 94868 95756 95993 94646 92652 91355
55179 91355 90932 90943 91245 91728 92114 92572 93598 95026 96086 96645 97321 98173 98445 97890 97228 97053 97317 98047
55161 98047 99354 100555 100564 99440 98313 97557 96376 94569 93255 93234 93813 94002 93870 94058 94737 95625 96333 96343
55143 96343 95368 93936 92912 92393 91931 91695 92219 92954 92491 90579 88671 88007 88361 89181 90694 93162 95938
55126 95938 98016 98917 98629 97382 95824 94716 94128 93541 92820 92353 92217 92112 92118 92563 93121 93110 92729 92845 93451
$$ packed form
55252I1750J275J083P26N78J4j088j744j516j220j227q29N5L50k09m91j67l93
55235H6947j392j493J07J667J518M56O1K44J23j78j53j30m65o31k13K34K85L59
55217H7346O05M90J58N96J680J906Q86J80O26R36J79m91m0M74j04r07o98o6j39
55198I3617n55m24l6JP1M84M82k39m87M14J134N28k72J50Q88K37j347j994j297
55179I1355m23J1L02M83L86M58J026J428J060N59O76Q52K72n55o62j75K64P30
55161I8047J307J201Rj124j127p56j181j807j314k1N79J89j32J88O79Q88P08J0
55143I6343r75j432j024n19m62k36N24P35m63j912j908o64L54Q20J513K468K776
55126I5938K078R01k88j247j558j108n88n87p21m67j36j05OM45N58j1l81J16O06
$$ plain form
55107 93451 93612 93151 93102 94043 95223 95854 96180 96726 97523 98613 100348 102609 104548 105593 105990 106084 105856 105436
55089 105436 105202 105126 104851 104590 104970 105844 106324 106195 106217 106758 107271 107399 107477 107549 107065 105984 105086 104759 104490 103986
55069 103986 103725 104005 104506 105203 106524 108173 108989 108558 107809 107435 106859 105481 103813 102596 101690 100662 99658
55052 99658 99063 99029 99848 101909 104755 107054 108080 108364 108419 107884 106564 105313 105035 105578 106263 106749 106820 106140
55034 106140 104884 103872 103516 103386 103275 103729 104937 106105 106672 107248 108523 110003 110682 110318 109304 107914
55018 107914 106422 105400 105152 105236 105102 104778 104579 104662 105203 106350 107631 108147 107771 107418 107707 108104 107831 106964
55000 106964 106118 105722 105989 106934 108062 108668 108711 108714 108762 108522 108339 109076 110580 111565 111477 111230 111540 111792 111340 110734
54980 110734 110752 111195 111502 111707 111960 111937 111520 111280 111587 112007 112191 112497 113101 113476 113425 113683 114671 115623 115737 115333
$$ packed form
55107I3451J61m61m9R41J180O31L26N46P97J090J735K261J939J045L97R4k28m20
55089A05436k34p6k75k61L80Q74M80j29K2N41N13J28P8P2m84j081q98l27k69n04
55069A03986k61K80N01O97J321J649Q16m31p49l74n76j378j668j217r06j028j004
55052I9658n95l4Q19K061K846K299J026K84N5n35j320j251k78N43O85M86P1o80
55034A06140j256j012l56j30j11M54J208J168N67N76J275J480O79l64j014j390
55018A07914j492j022k48Q4j34l24j99Q3N41J147J281N16l76l53K89L97k73q67
55000A06964q46l96K67R45J128O06M3LM8k40j83P37J504R85q8k47L10K52m52o06
54980A10734J8M43L07K05K53k3m17k40L07M20J84L06O04L75n1K58R88R52J14m04
$$ plain form
54960 115333 115045 114777 114369 114387 115264 116343 116714 116437 116143 116045 116026 116124 116276 116205 116047 116291 116695 116262 114865 113720
54940 113720 113574 113610 112946 111978 111272 110338 108734 107322 107149 107908 108712 109553 110842 112270 113369 114507 116220
54923 116220 118243 120321 123227 127799 133603 139729 146216 153556 161428 169108 176537 183782 190048 194406
54909 194406 196900 197790 196347 191740 184631 176598 168391 159994 151973 145392 140553 136892 133916 131379
54895 131379 128920 126524 124939 124670 125029 125028 124659 124404 124232 124166 125019 127277 129956 131909 133635 136360 139893
54878 139893 143018 145585 148638 152724 157568 163277 170351 178496 186659 194201 200860 205787 207891 207018
54864 207018 203629 197680 189174 179495 170701 163512 157317 151884 147530 143798 139696 135413 132185 130238
54850 130238 128368 125903 123578 121976 120564 118842 117246 116260 115576 114725 113727 112733 111818 111366 111769 112564
$$ packed form
54960A15333k88k68m08J8Q77J079L71k77k94r8j9R8J52p1j58K44M04m33j397j145
54940A13720j46L6o64r68p06r34j604j412j73P59Q04Q41J289J428J099J138J713
54923A16220K023K078K906M572N804O126O487P340P872P680P429P245O266M358
54909A94406K494Q90j443m607p109q033q207q397q021o581m839l661k976k537
54895A31379k459k396j585k69L59jl69k55j72o6Q53K258K679J953J726K725L533
54878A39893L125K567L053M086M844N709P074Q145Q163P542O659M927K104q73
54864B07018l389n949q506r679q794p189o195n433m354l732m102m283l228j947
54850A30238j870k465k325j602j412j722j596r86o84q51r98r94r15m52M03P95
$$ plain form
54834 112564 112763 112221 111729 111582 111148 110109 109080 108658 108775 109319 110331 111282 111181 109930 108658 108184 108017
54817 108017 107417 106619 106362 106850 107746 108717 109501 109867 109933 110221 111097 112462 114088 115868 117592 118853 119310
54800 119310 118800 117370 115560 114390 114454 115240 115900 116376 117032 117523 117083 115814 114703 114354 114540 114964 115531
54783 115531 115922 115929 116209 117626 119701 120895 120727 120537 121698 123987 126248 127826 128815 129570 130566 132282 134832
54766 134832 138012 141861 146688 152494 158974 166131 174211 182856 190952 197511 202139 204592 204603 202328 198376
54751 198376 193128 186582 178880 170496 161903 153675 146784 141987 138866 136308 134003 132650 132544 132850 132578
54736 132578 131558 130198 128946 128245 128360 128989 129559 130068 131060 132724 134642 136541 138671 141332 144628 148699
54720 148699 153570 158844 164239 170351 177977 186588 194366 199898 203060 204128 203009 199657 194499 188103
$$ packed form
54834A12564J99n42m92j47m34j039j029m22J17N44J012R51j01j251j272m74j67
54817A08017o00p98k57M88Q96R71P84L66O6K88Q76J365J626J780J724J261M57
54800A19310n10j430j810j170O4P86O60M76O56M91m40j269j111l49J86M24N67
54783A15531L91PK80J417K075J194j68j90J161K289K261J578R89P55R96J716K550
54766A34832L180L849M827N806O480P157Q080Q645Q096O559M628K453J1k275l952
54751A98376n248o546p702q384q593q228o891m797l121k558k305j353j06L06k72
54736A32578j020j360j252p01J15O29N70N09R92J664J918J899K130K661L296M071
54720A48699M871N274N395O112P626Q611P778N532L162J068j119l352n158o396
$$ plain form
54706 188103 180966 173707 166762 159908 152825 146133 141008 137686 135279 133151 131518 130573 130065 129960 130492
54691 130492 131220 131071 129739 128097 126834 125626 124125 122767 121962 121320 120354 119260 118410 117705 116993 116566
54675 116566 116687 117155 117759 118622 119627 120093 119540 118382 117393 116831 116429 115869 114941 113574 111949 110378 109046
54658 109046 108133 107959 108526 109131 109123 108857 109125 109860 110361 110623 111298 112329 112783 112278 111479 110992 110819 111077 112074
54639 112074 113365 114006 114136 115033 117080 118907 119260 118549 117833 117357 116954 116838 117014 116746 115532 113965 112891
54622 112891 112402 112361 113036 114398 115520 115613 115072 114724 114657 114583 114630 114882 114726 113624 112094 111096 110835 110952 111474
54603 111474 112709 114450 116025 116978 117227 116870 116300 116074 116150 115744 114476 113139 112742 113273 114063 114905 116124
54586 116124 117877 120029 122429 124748 126287 126495 125514 123938 122372 121380 121263 121519 121187 120150 119454 119842
$$ packed form
54706A88103p137p259o945o854p083o692n125l322k407k128j633r45n08j05N32
54691A30492P28j49j332j642j263j208j501j358q05o42r66j094q50p05p12m27
54675A16566J21M68O04Q63J005M66n53j158r89n62m02n60r28j367j625j571j332
54658A09046r13j74N67O05qk66K68P35N01K62O75J031M54n05p99m87j73K58R97
54639A12074J291O41J30Q97K047J827L53p11p16m76m03j16J76k68j214j567j074
54622A12891m89m1O75J362J122R3n41l48o7p4M7K52j56j102j530r98k61J17N22
54603A11474J235J741J575R53K49l57n70k26P6m06j268j337l97N31P90Q42J219
54586A16124J753K152K400K319J539K08r81j576j566r92j17K56l32j037o96L88
$$ plain form
54570 119842 120666 120816 120081 118945 117667 116335 115315 114912 114915 115073 115612 116782 118282 119683 120957 122115
54554 122115 122848 123070 123309 123969 124722 125133 125426 126060 127042 128120 129142 129834 129913 129879 130901 133297 135887 137508
54536 137508 138385 139245 139896 139700 138826 138017 137529 137118 136648 135965 134673 132808 131187 130349 129774 128940 128430 128964
54518 128964 130009 130487 130374 130439 130792 130880 130653 130571 130604 130264 129509 128700 127849 126870 126315 126795 127771 127954 126954
54499 126954 125571 124535 123840 123309 122900 122436 121868 121816 123031 125236 127309 128614 129392 129893 130006 129864 130015
54482 130015 130716 131639 132416 132990 133388 133664 134069 134793 135616 136257 136889 137799 138776 139449 139974 140715 141468 141741 141688
54463 141688 142032 143174 144992 147314 149812 151623 151977 151258 150691 150954 151738 152564 153260 153617 153362 152613 151740
54446 151740 150687 148991 146519 143677 140944 138743 137642 137996 139351 140721 141490 141660 141455 141200 141324 141785
$$ packed form
54570A19842Q24J50p35j136j278j332j020m03LJ58N39J170J500J401J274J158
54554A22115P33K22K39O60P53M11K93O34R82J078J022O92P9l4J022K396K590J621
54536A37508Q77Q60O51j96q74q09m88m11m70o83j292j865j621q38n75q34n10N34
54518A28964J045M78j13O5L53Q8k27q2L3l40p55q09q51r79n55M80R76J83j000
54499A26954j383j036o95n31m09m64n68n2J215K205K073J305P78N01J13j42J51
54482A30015P01R23P77N74L98K76M05P24Q23O41O32R10R77O73N25P41P53K73n3
54463A41688L44J142J818K322K498J811L54p19n67K63P84Q26O96L57k55p49q73
54446A51740j053j696k472k842k733k201j101L54J355J370P69J70k05k55J24M61
$$ plain form
54430 141785 141782 140755 139441 139033 139509 139732 139197 138648 138810 139424 139879 140060 140232 140620 141336 142294 143102 143444 143573
54411 143573 143895 144170 143733 142552 141383 140801 140680 140728 140981 141568 142446 143514 144687 145813 146824 147892 149125
54394 149125 150341 151414 152505 153532 153922 153503 153105 153441 153846 153187 151663 150568 150383 150330 149904 149578 149654
54377 149654 149554 148819 147947 147594 147614 147458 147125 147205 148225 150237 152829 155391 157595 159658 161854 163933 165447
54360 165447 166507 167691 169215 170760 172063 173147 173962 174269 173870 172552 170066 166675 163491 161533 160556
54345 160556 159433 157518 154970 152021 148860 146208 145006 145304 146114 146448 145949 144604 142683 141013 140514
54330 140514 141299 142787 144606 146663 148485 149431 149611 149703 149789 149265 148004 146680 145766 145077 144525 144414 144687
54313 144687 144735 144233 143453 142513 141187 139710 138899 139025 139312 139017 138344 137907 137897 138195 138768 139560 140357 140989 141294
$$ packed form
54430A41785lj027j314m08M76K23n35n49J62O14M55J81J72L88P16R58Q08L42J29
54411A43573L22K75m37j181j169n82j21M8K53N87Q78J068J173J126J011J068J233
54394A49125J216J073J091J027L90m19l98L36M05o59j524j095j85n3m26l26P6
54377A49654j00p35q72l53K0j56l33Q0J020K012K592K562K204K063K196K079J514
54360A65447J060J184J524J545J303J084Q15L07l99j318k486l391l184j958r77
54345A60556j123j915k548k949l161k652j202K98Q10L34m99j345j921j670m99
54330A40514P85J488J819K057J822R46J80R2Q6n24j261j324r14o89n52j11K73
54313A44687M8n02p80r40j326j477q11J26K87k95o73m37j0K98N73P92P97O32L05
$$ plain form
54294 141294 140916 139731 138472 138171 138854 139471 139279 138589 138102 138251 139315 141339 143705 145497 146480 147019 147053
54277 147053 146121 144511 143340 143137 143282 143165 142956 142899 142816 142742 143083 143705 143794 143116 142435 142127 141453 139996 138904
54258 138904 139719 142534 146085 149175 151255 152208 152356 152464 153035 153810 154272 154281 153902 153154 152300 151888 152082 152424
54240 152424 152516 152368 151840 150494 148387 146307 144821 143773 143070 143092 143853 144676 145324 146561 148749 150752 151176
54223 151176 150146 148920 148235 147916 147750 147761 147768 147457 146813 146014 145101 144180 143626 143581 143626 143402 143155 143139 142935 142018
54203 142018 140653 139656 139486 140061 141194 142672 144139 145329 146259 146944 147316 147642 148468 149764 150691 150675 150234
54186 150234 150314 151258 152826 154627 156120 156805 156951 157559 159040 160571 161330 161696 162454 163432 163812 163407 162806
54169 162806 162489 162470 162576 162458 161588 159798 157610 155588 153769 152074 150770 149987 149371 148739 148528 148951 149364
$$ packed form
54294A41294l78j185j259l01O83O17j92o90m87J49J064K024K366J792R83N39L4
54277A47053r32j610j171k03J45j17k09n7q3p4L41O22Q9o78o81l08o74j457j092
54258A38904Q15K815L551L090K080R53J48J08N71P75M62Rl79p48q54m12J94L42
54240A52424R2j48n28j346k107k080j486j048p03K2P61Q23O48J237K188K003M24
54223A51176j030j226o85l19j66J1Pl11o44p99r13r21n54m5M5k24k47j6k04r17
54203A42018j365r97j70N75J133J478J467J190R30O85L72L26Q26J296R27j6m41
54186A50234Q0R44J568J801J493O85J46O08J481J531P59L66P58R78L80m05o01
54169A62806l17j9J06j18q70j790k188k022j819j695j304p83o16o32k11M23M13
$$ plain form
54152 149364 149228 149089 149760 150974 151747 151708 151256 150743 150341 150355 150846 151237 151082 150899 151449 152529 153323 153642 153871
54133 153871 153995 153680 153175 153150 153612 153880 153661 153396 153493 153889 154398 154877 155085 154984 155082 155848 156933 157629 157914
54114 157914 158342 159027 159545 159828 160361 161414 162663 163687 164303 164482 164387 164453 164936 165569 166108 166909 168359 170114
54096 170114 171714 173651 176861 181284 185818 189687 192865 195086 195462 193496 189810 185525 181456 178031
54082 178031 175380 173192 171002 168884 167527 167485 168657 170534 172550 174237 175499 176716 178247 179928 181471
54067 181471 183177 185561 188383 190745 192238 193384 194818 196564 198257 199564 200205 199967 198883 197228 195296
54052 195296 193377 191827 190944 190882 191882 194139 197126 199601 200885 201800 203650 206643 210011 213361 217020
54037 217020 221200 225742 230676 236228 242250 248363 254605 261224 267885 273896 279232 284504 289830 294564
$$ packed form
54152A49364j36j39O71J214P73l9m52n13m02J4M91L91j55j83N50J080P94L19K29
54133A53871J24l15n05k5M62K68k19k65R7L96N09M79K08j01R8P66J085O96K85
54114A57914M28O85N18K83N33J053J249J024O16J79r5O6M83O33N39Q01J450J755
54096A70114J600J937L210M423M534L869L178K221L76j966l686m285m069l425
54082A78031k651k188k190k118j357m2J172J877K016J687J262J217J531J681J543
54067A81471J706K384K822K362J493J146J434J746J693J307O41k38j084j655j932
54052A95296j919j550q83o2J000K257K987K475J284R15J850K993L368L350L659
54037B17020M180M542M934N552O022O113O242O619O661O011N336N272N326M734
$$ plain form
54023 294564 298237 301016 303080 304373 305169 306093 307235 307906 307538 306276 304428 301923 298590 294489 289765
54008 289765 284589 279298 274054 268369 261671 254485 248303 244026 241101 238453 235624 232743 230005 227536
53994 227536 225305 222896 219886 216652 214219 212953 211974 210318 208228 206756 206379 206540 206433 205839 205093 204451
53978 204451 203707 202560 201276 200564 200620 200723 200225 199542 199593 200597 202083 203798 205764 207630 208865 209613 210489
53961 210489 211510 212167 212724 214420 217984 222794 228023 233874 241062 249490 257945 264800 268768 269486 267811
53946 267811 265240 262718 260266 257843 256033 255548 256452 258277 260634 263415 266581 269994 273367 276385 278996
53931 278996 281447 283789 285580 286516 287167 288485 290765 293669 297086 301218 305873 310580 315489 321319 328243
53916 328243 335559 342696 349822 357293 365247 373893 383379 393028 401567 408537 414715 420681 425651 428305
$$ packed form
54023B94564L673K779K064J293P96R24J142O71l68j262j848k505l333m101m724
54008B89765n176n291n244n685o698p186o182m277k925k648k829k881k738k469
53994B27536k231k409l010l234k433j266r79j656k090j472l77J61j07n94p46o42
53978B04451p44j147j284p12N6J03m98o83N1J004J486J715J966J866J235P48Q76
53961B10489J021O57N57J696L564M810N229N851P188Q428Q455O855L968P18j675
53946B67811k571k522k452k423j810m85R04J825K357K781L166L413L373L018K611
53931B78996K451K342J791R36O51J318K280K904L417M132M655M707M909N830O924
53916C28243P316P137P126P471P954Q646R486R649Q539O970O178N966M970K654
$$ plain form
53902 428305 428271 426352 423783 421571 420075 418748 416678 413591 409879 405631 400378 394007 387063 379783 371665
53887 371665 362471 352865 343545 334523 325840 318161 311811 305899 299363 292482 286527 282129 278785 275760
53873 275760 272787 269900 267135 264422 261521 258193 254607 251200 247953 244299 240074 235952 232495 229330
53859 229330 225868 222330 219360 216996 214748 212466 210488 209007 207862 206930 206298 206070 206204 206403 206083 204885
53843 204885 203416 202915 203791 204954 205088 204086 202783 201799 201286 201327 201818 202186 201939 201405 201378 202221 203733 205625
53825 205625 207547 208932 209418 209318 209190 209189 209287 209806 211034 212573 213765 214613 215630 216883 217928 218688 219708
53808 219708 221450 223933 227168 231349 236324 241348 245673 249274 252874 257415 263397 270411 277339 283252
53794 283252 288149 292659 297216 301804 306296 310564 314254 316916 318473 319338 319951 320368 320336 319680 318526 317145
$$ packed form
53902D28305l4j919k569k212j496j327k070l087l712m248n253o371o944p280q118
53887C71665r194r606r320r022q683p679o350n912o536o881n955m398l344l025
53873B75760k973k887k765k713k901l328l586l407l247l654m225m122l457l165
53859B29330l462l538k970k364k248k282j978j481j145r32o32k28J34J99l20j198
53843B04885j469n01Q76J163J34j002j303r84n13M1M91L68k47n34k7Q43J512J892
53825B05625J922J385M86j00j28jR8N19J228J539J192Q48J017J253J045P60J020
53808B19708J742K483L235M181M975N024M325L601L600M541N982P014O928N913
53794B83252M897M510M557M588M492M268L690K662J557Q65O13M17l2o56j154j381
$$ plain form
53778 317145 315474 312932 309000 303949 298522 292899 286527 279209 271719 264955 259038 253753 249291 245854
53764 245854 242943 239848 236663 234055 232127 230281 228248 226522 225577 225166 224647 223594 221956 219936 217908
53749 217908 216168 214638 212988 211096 209221 207747 206927 206804 207208 207837 208491 209146 209753 210172 210457 210908 211597
53732 211597 212135 212186 211985 212035 212549 213488 214890 216753 218789 220697 222464 224087 225230 225618 225561 225696 226327
53715 226327 227386 228768 230290 231588 232564 233820 236135 239581 243517 247268 250399 252673 254316 256103
53701 256103 258536 261028 262673 263691 265328 268238 271801 275278 278838 282967 287485 291735 295371 298359
53687 298359 300437 301132 300377 298767 297117 295906 295052 294051 292392 290015 287425 285258 283722 282556 281493
53672 281493 280641 280270 280321 280354 280087 279765 279791 280153 280506 280702 280830 280788 280276 279351 278515 278081 277857 277659 277636 277825
$$ packed form
53778C17145j671k542l932n051n427n623o372p318p490o764n917n285m462l437
53764B45854k911l095l185k608j928j846k033j726r45m11n19j053j638k020k028
53749B17908j740j530j650j892j875j474q20j23M04O29O54O55O07M19K85M51O89
53732B11597N38N1k01N0N14R39J402J863K036J908J767J623J143L88n7J35O31
53715B26327J059J382J522J298R76J256K315L446L936L751L131K274J643J787
53701B56103K433K492J645J018J637K910L563L477L560M129M518M250L636K988
53687B98359K078O95p55j610j650j211q54j001j659k377k590k167j536j166j063
53672B81493q52l71N1L3k67l22K6L62L53J96J28m2n12r25q36m34k24j98k3J89
$$ plain form
53652 277825 277807 277229 276332 275607 275257 275376 276273 278071 280202 281828 282672 283095 283515 284161 285261 287036 289464
53635 289464 292255 295004 297328 299157 300979 303407 306271 308644 310057 311179 312902 315334 318258 321923
53621 321923 326600 331735 336430 340528 344422 348024 350825 352880 354849 357017 359106 361165 363803 367292
53607 367292 371122 374751 378235 381845 385619 389510 393463 397112 399884 401738 403391 405515 408002 410198
53593 410198 411538 411732 410740 408913 406960 405511 404726 404343 403848 402636 400391 397499 394816 392723 390618
53578 390618 387559 383375 378982 375532 373312 371533 369306 366691 364525 363220 362171 360567 358385 356236
53564 356236 354552 353410 352903 353174 354064 355047 355520 355114 354057 353366 354188 356545 359152 360916 362135 363644
53548 363644 365424 366926 368318 370334 373004 375662 378278 381733 386450 391642 396399 400806 405534 410870
$$ packed form
53652B77825j8n78q97p25l50J19Q97J798K131J626Q44M23M20O46J100J775K428
53635B89464K791K749K324J829J822K428K864K373J413J122J723K432K924L665
53621C21923M677N135M695M098L894L602K801K055J969K168K089K059K638L489
53607C67292L830L629L484L610L774L891L953L649K772J854J653K124K487K196
53593D10198J340J94r92j827j953j449p85l83m95j212k245k892k683k093k105
53578C90618l059m184m393l450k220j779k227k615k166j305j049j604k182k149
53564C56236j684j142n07K71Q90R83M73m06j057o91Q22K357K607J764J219J509
53548C63644J780J502J392K016K670K658K616L455M717N192M757M407M728N336
$$ plain form
53534 410870 416646 422760 429287 436314 443939 452290 461421 471339 482116 493677 505582 517425 529467
53521 529467 542401 556509 571476 587001 603041 619396 635719 652172 669612 688885 710241
53510 710241 733504 758342 784245 810725 837717 865411 893541 921264 947911 973499 998369
53499 998369 1022676 1046304 1068962 1090310 1110374 1129839 1149458 1169183 1188331 1206604 1224370
53488 1224370 1241962 1259322 1276453 1293541 1310467 1326896 1343137 1360249 1378884 1398483 1417895
53477 1417895 1436242 1452820 1466822 1477756 1485800 1491301 1494221 1494421 1492123 1487652 1480967 1471839 1460275
53464 1460275 1446435 1430370 1412291 1392982 1373699 1355599 1339197 1324009 1308599 1291344 1271495
53453 1271495 1249410 1225808 1201232 1176305 1151929 1128759 1106760 1085629 1065361 1046069 1027535
$$ packed form
53534D10870N776O114O527P027P625Q351R131R918J0777J1561J1905J1843J2042
53521E29467J2934J4108J4967J5525J6040J6355J6323J6453J7440J9273K1356
53510G10241K3263K4838K5903K6480K6992K7694K8130K7723K6647K5588K4870
53499I98369K4307K3628K2658K1348K0064J9465J9619J9725J9148J8273J7766
53488A224370J7592J7360J7131J7088J6926J6429J6241J7112J8635J9599J9412
53477A417895J8347J6578J4002J0934Q044N501K920K00k298m471o685r128j1564
53464A460275j3840j6065j8079j9309j9283j8100j6402j5188j5410j7255j9849
53453A271495k2085k3602k4576k4927k4376k3170k1999k1131k0268j9292j8534
$$ plain form
53442 1027535 1009435 992000 976171 962986 952868 945419 939775 935280 931878 929902 929555 930701 932977
53429 932977 935975 939552 944239 951047 960396 971427 982860 994386 1006730 1020573 1036162 1053785
53417 1053785 1073693 1095402 1117947 1141194 1166157 1193661 1223334 1254283 1286124 1318840 1352287
53406 1352287 1386491 1422078 1459817 1499904 1542109 1586441 1633276 1682912 1735199 1789505 1845006
53395 1845006 1901254 1958459 2016918 2076226 2135528 2194543 2253718 2313254 2372614 2431125 2488379
53384 2488379 2543769 2596346 2645585 2691785 2735284 2775773 2812696 2845779 2874760 2899090 2918358
53373 2918358 2932617 2941984 2946351 2945685 2939937 2928251 2908897 2880597 2843542 2798848 2747691 2691473
53361 2691473 2632046 2570912 2508588 2445323 2381950 2319336 2257489 2196065 2135503 2076968 2021366
$$ packed form
53442A027535j8100j7435j5829j3185j0118p449n644m495l402j976l47J146K276
53429I32977K998L577M687O808R349J1031J1433J1526J2344J3843J5589J7623
53417A053785J9908K1709K2545K3247K4963K7504K9673L0949L1841L2716L3447
53406A352287L4204L5587L7739M0087M2205M4332M6835M9636N2287N4306N5501
53395A845006N6248N7205N8459N9308N9302N9015N9175N9536N9360N8511N7254
53384B488379N5390N2577M9239M6200M3499M0489L6923L3083K8981K4330J9268
53373B918358J4259R367M367o66n748j1686j9354k8300l7055m4694n1157n6218
53361B691473n9427o1134o2324o3265o3373o2614o1847o1424o0562n8535n5602
$$ plain form
53350 2021366 1969014 1919947 1873738 1829162 1784728 1739668 1694084 1648486 1603682 1560747 1520409
53339 1520409 1482565 1446950 1413965 1384164 1357141 1331773 1307614 1285401 1266103 1249973 1236514
53328 1236514 1224826 1213870 1202871 1191655 1180336 1168807 1156865 1144690 1132763 1121396 1110765
53317 1110765 1101271 1093331 1086788 1081057 1075988 1072252 1070715 1071641 1074532 1078545 1083084 1088159 1094224 1101654
53303 1101654 1110538 1120953 1133058 1146836 1162152 1179207 1198485 1219975 1243033 1267308 1293218
53292 1293218 1321090 1350491 1380928 1412454 1444736 1476178 1505069 1531316 1556026 1579644 1601600
53281 1601600 1621631 1640092 1656629 1669677 1677852 1681145 1680312 1675773 1667661 1656335 1642257 1625676
53269 1625676 1606877 1586380 1564452 1540653 1514408 1485957 1456389 1426686 1396920 1366427 1334663
$$ packed form
53350B021366n2352m9067m6209m4576m4434m5060m5584m5598m4804m2935m0338
53339A520409l7844l5615l2985k9801k7023k5368k4159k2213j9298j6130j3459
53328A236514j1688j0956j0999j1216j1319j1529j1942j2175j1927j1367j0631
53317A110765r494p940o543n731n069l736j537R26K891M013M539N075O065P430
53303A101654Q884J0415J2105J3778J5316J7055J9278K1490K3058K4275K5910
53292A293218K7872K9401L0437L1526L2282L1442K8891K6247K4710K3618K1956
53281A601600K0031J8461J6537J3048Q175L293q33m539q112j1326j4078j6581
53269A625676j8799k0497k1928k3799k6245k8451k9568k9703k9766l0493l1764
$$ plain form
53258 1334663 1301888 1269012 1236772 1205078 1173308 1141204 1109313 1078513 1049163 1020824 992833
53247 992833 965118 938248 912478 886979 860526 832980 805604 779735 755713 733307 712539
53236 712539 693524 675966 659489 644259 630759 619050 608662 599056 589890 581071 572833 565393
53224 565393 558263 550409 541486 532297 523392 513926 502845 490693 479072 468533 458133 447146 436054
53211 436054 425650 416116 407353 399440 392346 385813 379823 374546 369585 363966 357249 350097 343335 336974
53197 336974 330538 323932 317535 311711 306560 301874 297170 292101 286975 282498 278829 275382 271786 268458
53183 268458 265839 263513 260668 257223 253960 251588 250072 248894 247705 246609 245911 245691 245687 245610 245426 245175
53167 245175 244732 244027 243325 242859 242337 241359 240264 239899 240350 240575 239713 238256 237337 237196 236979 235974 234450
$$ packed form
53258A334663l2775l2876l2240l1694l1770l2104l1891l0800k9350k8339k7991
53247I92833k7715k6870k5770k5499k6453k7546k7376k5869k4022k2406k0768
53236G12539j9015j7558j6477j5230j3500j1709j0388r606r166q819q238p440
53224E65393p130p854q923r189q905r466j1081j2152j1621j0539j0400j0987j1092
53211D36054j0404r534q763p913p094o533n990n277m961n619o717p152o762o361
53197C36974o436o606o397n824n151m686m704n069n126m477l669l447l596l328
53183B68458k619k326k845l445l263k372j516j178j189j096o98k20mp7j84k51
53167B45175m43p05p02m66n22r78j095l65M51K25q62j457r19j41k17j005j524
$$ plain form
53150 234450 233065 231913 230515 228637 226671 225136 224061 223140 222366 222118 222626 223676 225007 226622 228470
53135 228470 230145 231232 231818 232342 233092 234091 235282 236579 237884 239254 240826 242386 243389 243696 243913 244604
53119 244604 245560 246284 246795 247356 247762 247663 247370 247567 248291 248894 248945 248516 247601 246009 243913 241846 240069 238489
53101 238489 237200 236395 235684 234331 232412 231034 231024 231980 232977 233666 234253 234803 235003 234463 232985 230712 228097
53084 228097 225556 223167 220986 219494 219248 220112 221344 222446 223438 224389 225275 226313 227694 228903 229059 228131
53068 228131 227059 226382 225520 223823 221625 219677 218151 216843 215954 215926 216653 217411 217618 217322 216984 216960 217195
53051 217195 217357 217328 217470 218183 219307 220363 221296 222498 224083 225615 226586 226694 225718 223716 221406 219701
53035 219701 218770 218155 217790 218115 219057 219846 220143 220531 221368 221973 221566 220334 219015 217972 217278 217161 217679 218404
$$ packed form
53150B34450j385j152j398j878j966j535j075r21p74k48N08J050J331J615J848
53135B28470J675J087N86N24P50R99J191J297J305J370J572J560J003L07K17O91
53119B44604R56P24N11N61M06r9k93J97P24O03N1m29r15j592k096k067j777j580
53101B38489j289q05p11j353j919j378j0R56R97O89N87N50K00n40j478k273k615
53084B28097k541k389k181j492k46Q64J232J102R92R51Q86J038J381J209J56r28
53068B28131j072o77q62j697k198j948j526j308q89k8P27P58K07k96l38k4K35
53051B17195J62k9J42P13J124J056R33J202J585J532R71J08r76k002k310j705
53035B19701r31o15l65L25R42P89K97L88Q37O05m07j232j319j043o94j17N18P25
$$ plain form
53017 218404 219023 219892 221442 223446 225417 227265 228986 230082 230049 229231 228590 228710 229454 230365 230953 230882 230330
53000 230330 229972 230189 230521 230275 229386 228296 227377 226855 226921 227423 227839 228012 228475 229521 230510 230818 231049 232434
52982 232434 235213 238390 240949 242523 243032 242540 241615 241124 241455 242387 243732 245546 247720 249921 251997 253918
52966 253918 255314 255661 255019 254052 253234 252599 252322 252843 254097 255191 255285 254444 253265 252014 250583 249027 247620
52949 247620 246389 244961 243050 240908 239134 238078 237490 236769 235453 233481 231126 228841 227066 225929 225097
52934 225097 224126 222985 222040 221553 221469 221724 222361 223326 224521 226148 228429 230785 231919 231200 229545 228334
52918 228334 227784 227008 225510 223972 223446 224215 225600 226617 226744 226219 225669 225470 225563 225763 225906 225675 224803 223667
52900 223667 223162 223654 224461 224729 224433 224134 224177 224565 225217 225826 225904 225497 225459 226401 227692 228222 227789 226990 226065
$$ packed form
53017B18404O19Q69J550K004J971J848J721J096l3q18o41J20P44R11N88p1n52
53000B30330l58K17L32k46q89j090r19n22O6N02M16J73M63J046R89L08K31J385
52982B32434K779L177K559J574N09m92r25m91L31R32J345J814K174K201K076J921
52966B53918J396L47o42r67q18o35k77N21J254J094R4q41j179j251j431j556j407
52949B47620j231j428j911k142j774j056n88p21j316j972k355k285j775j137q32
52934B25097r71j141r45m87q4K55O37R65J195J627K281K356J134p19j655j211
52918B28334n50p76j498j538n26P69J385J017J27n25n50j99R3K00J43k31q72j136
52900B23667n05M92Q07K68k96k99M3L88O52O09P8m07l8R42J291N30m33p99r25
$$ plain form
52881 226065 224817 223579 223237 224085 225418 226501 227290 228013 228724 229603 231075 233261 235710 237947 239902 241523
52865 241523 242434 242410 241939 241928 242884 244581 246446 248175 249944 252025 254126 255299 254752 252622 249680 246411
52849 246411 242738 238561 234159 229992 226384 223333 220435 217181 213714 211022 209861 209628 208934 207241 205303
52834 205303 204000 203479 203577 204307 205492 206497 206897 207067 207696 209010 210778 212737 214586 215811 215994 215245
52818 215245 214025 212641 211155 209718 208648 208161 208207 208640 209461 210799 212633 214603 216311 217895 219989
52803 219989 222738 225077 225535 223796 220983 218339 216189 214353 212894 211922 211103 210032 208943 208429 208485 208332
52787 208332 207408 206106 205322 205498 206322 207174 207624 207615 207401 207335 207567 207922 208199 208541 209332 210687 212274 213746
52769 213746 215094 216309 216957 216526 215175 213664 212454 211327 210051 208962 208516 208577 208582 208227 207601 206808 205922
$$ packed form
52881B26065j248j238l42Q48J333J083P89P23P11Q79J472K186K449K237J955J621
52865B41523R11k4m71j1R56J697J865J729J769K081K101J173n47k130k942l269
52849B46411l673m177m402m167l608l051k898l254l467k692j161k33o94j693j938
52834B05303j303n21R8P30J185J005M00J70O29J314J768J959J849J225J83p49
52818B15245j220j384j486j437j070m87M6M33Q21J338J834J970J708J584K094
52803B19989K749K339M58j739k813k644k150j836j459r72q19j071j089n14N6j53
52787B08332r24j302p84J76Q24Q52M50rk14o6K32L55K77L42P91J355J587J472
52769B13746J348J215O48m31j351j511j210j127j276j089m46O1Nl55o26p93q86
$$ plain form
52752 205922 205309 205517 206660 208186 209474 210504 211756 213537 215557 217253 218453 219570 221092 223053 225195
52737 225195 227438 229833 232165 234094 235759 237668 239779 241228 241393 240823 240654 241371 242614 243953 245251
52722 245251 246294 246616 245911 244445 242913 241833 240960 239341 236297 232396 229101 227265 226461 225930 225519 225255
52706 225255 224669 223365 221909 221322 221813 222643 223121 223120 222714 222018 221410 221303 221577 221698 221446 221124 221012 221047 221117
52687 221117 221308 221822 222834 224320 225801 226575 226531 226401 226769 227229 227075 226420 225896 225583 225084 224410 223846 223121
52669 223121 221741 220172 219641 220533 221899 222792 223233 223572 223854 224230 225154 226620 227960 228882 230041 232044
52653 232044 234568 237101 239979 243893 248698 253313 256595 257843 256765 253609 249308 245075 241749 239542
52639 239542 238125 236909 235603 234665 234774 235682 236204 235633 234618 234189 234458 234799 234880 234885 235011 235327 235912 236547
$$ packed form
52752B05922o13K08J143J526J288J030J252J781K020J696J200J117J522J961K142
52737B25195K243K395K332J929J665J909K111J449J65n70j69P17J243J339J298
52722B45251J043L22p05j466j532j080q73j619l044l901l295j836q04n31m11k64
52706B25255n86j304j456n87M91Q30M78jm06o96o08j07K74J21k52l22j12L5P0
52687B21117J91N14J012J486J481P74m4j30L68M60j54o55n24l13m99o74n64p25
52669B23121j380j569n31Q92J366Q93M41L39K82L76R24J466J340R22J159K003
52653B32044K524K533K878L914M805M615L282J248j078l156m301m233l326k207
52639B39542j417j216j306r38J09R08N22n71j015m29K69L41Q1NJ26L16N85O35
$$ plain form
52621 236547 236459 235017 232678 230740 230099 230579 231451 232177 232595 232778 232980 233520 234568 235947 237142 237553 236927
52604 236927 235651 234477 233899 233860 234059 234332 234690 235193 235825 236306 236109 235038 233810 233634 234964 236940 238257
52587 238257 238380 237837 237584 238208 239520 240788 241494 241793 242061 242265 242244 242400 243348 244852 245826 245660 244921 244458
52569 244458 244404 244410 244297 244041 243608 243197 243206 243544 243364 241948 239581 237186 235436 234476 234133 233974 233535 232845 232410
52550 232410 232401 232307 231781 231351 231811 233236 235067 236823 238233 239006 239002 238499 237922 237484 237349 237746 238557 239232 239526
52531 239526 239926 240823 241706 241773 241056 240319 240062 240203 240554 241062 241630 242177 242761 243362 243825 244310 245370 247124
52513 247124 248864 250064 251221 252951 254762 255800 256572 258795 263349 269226 274562 277969 278742 276775 272777
52498 272777 268066 263723 260128 257321 255234 253475 251474 249110 246845 245108 243967 243404 243392 243568 243399
$$ packed form
52621B36547q8j442k339j938o41M80Q72P26M18J83K02N40J048J379J195M11o26
52604B36927j276j174n78l9J99K73L58N03O32M81j97j071j228j76J330J976J317
52587B38257J23n43k53O24J312J268P06K99K68K04k1J56R48J504R74j66p39m63
52569B44458n4Oj13k56m33m11RL38j80j416k367k395j750r60l43j59m39o90m35
52550B32410rr4n26m30M60J425J831J756J410P73mn03n77m38j35L97Q11O75K94
52531B39526M00Q97Q83O7p17p37k57J41L51N08N68N47N84O01M63M85J060J754
52513B47124J740J200J157J730J811J038P72K223M554N877N336L407P73j967l998
52498B72777m711m343l595k807k087j759k001k364k265j737j141n63j2J76j69
$$ plain form
52483 243399 242892 242641 242978 243515 243716 243518 243232 243284 244128 245843 247624 248343 247972 247849 249112 251400 253692
52466 253692 255866 258646 262250 265950 269085 271874 274950 278469 281914 284547 285883 285898 284920 283255 280877
52451 280877 277681 273970 270421 267373 264425 261034 257379 254279 252242 250948 249825 248764 247972 247414 246878
52436 246878 246470 246521 246924 247120 246905 246781 247183 247763 247846 247329 246757 246685 247318 248583 250117 251275 251582 251245 250970
52417 250970 251308 252284 253541 254585 255088 255255 255747 256996 258774 260808 263598 268096 274614 282499 290944
52402 290944 299643 308506 317017 324013 328013 327942 324003 317881 311666 306361 301585 296684 291780 287680 285122
52387 285122 284196 284205 283987 282745 280792 279256 278879 279345 279925 280460 281408 283125 285505 288283 291410 295019 299267
52370 299267 304287 310137 316561 322861 328257 332475 335829 338597 340490 340948 339893 337956 335950 334352
$$ packed form
52483B43399n07k51L37N37K01j98k86N2Q44J715J781P19l71j23J263K288K292
52466B53692K174K780L604L700L135K789L076L519L445K633J336J5r78j665k378
52451B80877l196l711l549l048k948l391l655l100k037j294j123j061p92n58n36
52436B46878m08N1M03J96k15j24M02N80Q3n17n72p2O33J265J534J158L07l37k75
52417B50970L38R76J257J044N03J67M92J249J778K034K790M498O518P885Q445
52402B90944Q699Q863Q511O996M000p1l939o122o215n305m776m901m904m100k558
52387B85122r26Rk18j242j953j536l77M66N80N35R48J717K380K778L127L609M248
52370B99267N020N850O424O300N396M218L354K768J893M58j055j937k006j598
$$ plain form
52356 334352 333194 332210 331025 329510 327982 326819 325946 325049 324251 324087 324723 325746 326867 328244 329892 331397
52340 331397 332665 334411 337315 341149 345291 349698 354697 360093 365333 370526 376656 384659 394650 406048
52326 406048 418062 430212 442756 456550 472065 488671 505269 521421 537409 553398 569153
52315 569153 584478 599363 613701 627381 640712 654286 668411 683002 697890 712812 727283
52304 727283 741045 754468 767903 780819 792327 802529 812584 823291 834298 844728 853834 860803
52292 860803 864720 865239 862900 858507 852532 845236 836879 827685 818101 809159 801935 796450 791752 787271
52278 787271 783417 780618 778636 777376 777558 779859 783902 788861 794711 802127 811351 821796 832692 843553
52264 843553 854051 864032 873713 883506 893536 903582 913443 923191 933118 943616 954988 967151 979654
$$ packed form
52356C34352j158r84j185j515j528j163q73q97p98j64O36J023J121J377J648J505
52340C31397J268J746K904L834M142M407M999N396N240N193O130Q003R991J1398
52326D06048J2014J2150J2544J3794J5515J6606J6598J6152J5988J5989J5755
52315E69153J5325J4885J4338J3680J3331J3574J4125J4591J4888J4922J4471
52304G27283J3762J3423J3435J2916J1508J0202J0055J0707J1007J0430R106O969
52292H60803L917N19k339m393n975p296q357r194r584q942p224n485m698m481
52278G87271l854k799j982j260J82K301M043M959N850P416R224J0445J0896J0861
52264H43553J0498R981R681R793J0030J0046R861R748R927J0498J1372J2163J2503
$$ plain form
52251 979654 992090 1004331 1016197 1027172 1036665 1044248 1049381 1051285 1049630 1045141 1039011 1031748 1023010
52238 1023010 1012534 1000719 988199 975286 962083 948899 936261 924630 914221 905025 896905 889710
52226 889710 883380 877861 872925 868183 863397 858740 854604 851125 848002 844910 842038 840069 839574 840504 842313
52211 842313 844473 846891 849921 853962 858897 863927 868247 871941 875860 880437 885043 888820 891820 894878
52197 894878 898597 902956 907721 912721 917702 922413 926911 931459 936156 941004 946209 951914 957636 962458
52183 962458 965875 968011 968926 968168 965176 959805 952342 943321 933426 923202 912823 902445 892779 884836
52169 884836 879009 874786 871437 868600 866177 864178 862881 862727 863929 866510 870661 876465 883125 889167
52155 889167 893705 896955 899290 900446 900177 899058 897935 896900 895444 893455 891526 890361 890304 891404 893497
$$ packed form
52251I79654J2436J2241J1866J0975R493P583N133J904j655m489o130p263q738
52238A023010j0476j1815j2520j2913j3203j3184j2638j1631j0409r196q120p195
52226H89710o330n519m936m742m786m657m136l479l123l092k872j969m95R30J809
52211H42313K160K418L030M041M935N030M320L694L919M577M606L777L000L058
52197H94878L719M359M765N000M981M711M498M548M697M848N205N705N722M822
52183I62458L417K136R15p58k992n371p463r021r895j0224j0379j0378r666p943
52169H84836n827m223l349k837k423j999j297j54J202K581M151N804O660O042
52155H89167M538L250K335J156k69j119j123j035j456j989j929j165n7J100K093
$$ plain form
52140 893497 896098 898491 900040 900460 899963 899218 898996 899663 901130 903303 906372 910650 916415 924066 934106
52125 934106 946787 962008 979619 999554 1021579 1045211 1070078 1096046 1122820 1149696 1175920
52114 1175920 1201128 1225343 1248685 1271051 1291849 1310133 1325419 1338244 1349422 1358797 1365346 1368598
52102 1368598 1369361 1368976 1368507 1368729 1370010 1371840 1373139 1373391 1372833 1371264 1367542 1360789 1351337 1339820 1326139
52087 1326139 1310143 1292652 1274802 1256778 1238218 1219688 1202784 1188772 1177804 1169379 1162887 1157745
52075 1157745 1153691 1151053 1150281 1151301 1153775 1157842 1163986 1172259 1182197 1193396 1205630 1218456 1231322
52062 1231322 1244069 1256787 1269256 1281065 1292232 1303058 1313368 1322533 1330438 1337753 1344991 1351801
52050 1351801 1357463 1361651 1364304 1365046 1363155 1358099 1349933 1339131 1326126 1311009 1293837 1275164 1255964
$$ packed form
52140H93497K601K393J549M20m97p45k22O67J467K173L069M278N765P651J0040
52125I34106J2681J5221J7611J9935K2025K3632K4867K5968K6774K6876K6224
52114A175920K5208K4215K3342K2366K0798J8284J5286J2825J1178R375O549L252
52102A368598P63l85m69K22J281J830J299K52n58j569l722o753r452j1517j3681
52087A326139j5996j7491j7850j8024j8560j8530j6904j4012j0968q425o492n142
52075A157745m054k638p72J020K474M067O144Q273R938J1199J2234J2826J2866
52062A231322J2747J2718J2469J1809J1167J0826J0310R165P905P315P238O810
52050A351801N662M188K653P42j891n056q166j0802j3005j5117j7172j8673j9200
$$ plain form
52037 1255964 1236835 1217609 1198081 1178812 1160775 1144390 1129476 1116017 1104402 1094776 1086609 1079082
52025 1079082 1071676 1064360 1057439 1051185 1045375 1039227 1032094 1024172 1016316 1009184 1002765 996612 990274 983670
52011 983670 977279 971749 966983 961860 955184 946611 936226 923680 908558 891447 873795 856488 839215
51998 839215 821363 802969 784545 766488 749016 732426 717204 704030 693583 685902 679928 674135
51986 674135 667718 660809 653577 645734 637060 627761 617888 606896 594259 580265 565782 551386 537049
51973 537049 522630 508442 495325 484246 475677 469275 464377 460908 459583 461120 465457 471900 479785
51960 479785 488715 498288 507905 516912 524762 530969 535042 536608 535605 532270 526873 519686 511418 503456
51946 503456 497110 492602 489290 487092 487043 490043 495634 502819 511766 523802 539607 558203 577957 598048
$$ packed form
52037A255964j9129j9226j9528j9269j8037j6385j4914j3459j1615r626q167p527
52025A079082p406p316o921o254n810o148p133p922p856p132o419o153o338o604
52011I83670o391n530m766n123o676q573j0385j2546j5122j7111j7652j7307j7273
51998H39215j7852j8394j8424j8057j7472j6590j5222j3174j0447p681n974n793
51986F74135o417o909p232p843q674r299r873j0992j2637j3994j4483j4396j4337
51973E37049j4419j4188j3117j1079q569o402m898l469j325J537M337O443P885
51960D79785Q930R573R617R007P850O207M073J566j003l335n397p187q268p962
51946E03456o346m508l312k198m9L000N591P185Q947J2036J5805J8596J9754K0091
$$ plain form
51932 598048 618598 639741 660959 681188 699380 715028 728116 738378 744620 745035 738230 723863
51920 723863 702589 675946 646290 616160 587263 560161 535017 512305 492621 476064 462108
51909 462108 450048 439501 430611 423842 419514 417515 417527 419344 422790 427448 432816 438738 445405 452799
51895 452799 460277 466658 470621 471181 468059 461633 452481 441207 428863 417123 407436 400087 394524 390514
51881 390514 388471 388628 390440 393080 396236 400260 405708 412830 421284 430310 439248 447816 455765 462505
51867 462505 467376 470103 470664 468977 465253 460436 455606 450871 445399 438792 431990 426642 423863 423668 425273
51852 425273 427760 430688 434167 438295 442613 446272 448490 448582 445947 440618 433641 426288 418970 411438 403887
51837 403887 397156 391829 387772 384630 382161 380087 378301 377306 377719 379192 380547 381195 381711 382710 383800
$$ packed form
51932E98048K0550K1143K1218K0229J8192J5648J3088J0262O242M15o805j4367
51920G23863k1274k6643k9656l0130k8897k7102k5144k2712j9684j6557j3956
51909D62108j2060j0547q890o769m328j999J2J817L446M658N368N922O667P394
51895D52799P478O381L963N60l122o426r152j1274j2344j1740r687p349n563m010
51881C90514k043J57J812K640L156M024N448P122Q454R026Q938Q568P949O740
51867D62505M871K727N61j687l724m817m830m735n472o607o802n348k779j95J605
51852D25273K487K928L479M128M318L659K218R2k635n329o977p353p318p532p551
51837D03887o731n327m057l142k469k074j786r95M13J473J355O48N16R99J090
$$ plain form
51822 383800 384111 383297 381650 379662 377800 376290 374875 373202 371549 370601 370395 370255 370043 370659 372844 376199
51806 376199 379923 383709 387248 389600 390006 388998 387798 386908 386023 385104 384596 384596 384598 384204 383540 382765 381652 379797
51788 379797 377017 373492 369765 366547 364208 362512 361073 359955 359517 359771 360293 360806 361524 362841 364817
51773 364817 367037 368940 370394 371985 374591 378623 383922 390414 398375 407828 418103 428394 438392 447943
51759 447943 456361 462567 465788 465742 462339 455722 446623 436256 425704 415550 405984 396953 388312 380126
51745 380126 372899 367296 363563 361312 359858 358724 357986 358248 360209 364158 370006 377754 387571 399268
51731 399268 411912 424066 434244 441267 444779 445748 446065 447404 450634 456180 463943 472303 477970 477954
51717 477954 471828 461713 450378 439868 431501 426023 423271 422122 421061 418751 414346 407804 400054
$$ packed form
51822C83800L11q14j647j988j862j510j415j673j653r48k06j40k12O16K185L355
51806C76199L724L786L539K352M06j008j200q90q85r19n08%Kl94o64p75j113j855
51788C79797k780l525l727l218k339j696j439j118m38K54N22N13P18J317J976
51773C64817K220J903J454J591K606M032N299O492P961R453J0275J0291R998R551
51759D47943Q418O206L221m6l403o617r099j0367j0552j0154r566r031q641q186
51745C80126p227n603l733k251j454j134p38K62J961L949N848P748R817J1697
51731C99268J2644J2154J0178P023L512R69L17J339L230N546P763Q360N667j6
51717D77954o126j0115j1335j0510q367n478k752j149j061k310m405o542p750
$$ plain form
51704 400054 392528 386389 382330 380813 381892 384708 387627 389245 389243 388291 387295 386667 386144 385280 384195 383635
51688 383635 384079 384957 385055 383604 380729 377013 373016 369204 365967 363538 361934 360968 360392 360207 360881 362964
51672 362964 366401 370667 375676 382003 389855 398603 408019 419418 434515 453178 473087 491536 506712
51659 506712 517234 521587 518789 509299 494889 477901 460667 445115 432425 423184 417920 417032 419928
51646 419928 424627 428640 430216 428712 424243 417394 409097 400319 391709 383574 376104 369520 364134 360340
51632 360340 358426 358261 359293 360966 363095 365726 368692 371374 372993 373195 372394 371361 370390 369035 366828
51617 366828 363973 361039 358163 355030 351549 348062 344796 341590 338320 335183 332352 329723 327302 325511
51603 325511 324742 324826 325297 326048 327408 329590 332478 336005 340502 346568 354688 364947 376769 388754 398937
$$ packed form
51704D00054p526o139m059j517J079K816K919J618kr52r96o28n23q64j085n60
51688C83635M44Q78R8j451k875l716l997l812l237k429j604r66n76j85O74K083
51672C62964L437M266N009O327P852Q748R416J1399J5097J8663J9909J8449J5176
51659E06712J0522M353k798r490j4410j6988j7234j5552j2690r241n264q88K896
51646D19928M699M013J576j504m469o849q297q778q610q135p470o584n386l794
51632C60340j914j65J032J673K129K631K966K682J619K02q01j033r71j355k207
51617C66828k855k934k876l133l481l487l266l206l270l137k831k629k421j791
51603C25511p69Q4M71P51J360K182K888L527M497O066Q120J0259J1822J1985J0183
$$ plain form
51588 398937 405567 407807 405832 400496 393102 385278 378542 373609 370251 368010 366979 367695 370456 375107
51574 375107 381530 389861 400040 411367 422870 434039 445072 456509 468796 482025 495711 508713
51562 508713 519751 528451 536097 545200 558059 575610 597630 623773 653803 686549 719123 747894
51550 747894 770354 785799 794412 796284 791405 780098 763095 741463 716549 689709 661886 633714
51538 633714 606051 580057 556661 536266 519000 504768 492982 482878 474346 467983 464054 461928
51526 461928 460843 460517 460539 459802 457298 453127 448050 442311 435581 427877 419818 411988 404596 397736 391513
51511 391513 385908 380934 376832 373726 371219 368740 366148 363644 361305 359196 357638 356697 355683 353932
51497 353932 352007 351242 351966 353020 353321 353146 353428 354427 355669 356770 357677 358271 358337 357967 357638 357771 358464 359674
$$ packed form
51588C98937O630K240j975n336p394p824o736m933l358k241j031P16K761M651
51574C75107O423Q331J0179J1327J1503J1169J1033J1437J2287J3229J3686J3002
51562E08713J1038Q700P646R103J2859J7551K2020K6143L0030L2746L2574K8771
51550G47894K2460J5445Q613J872m879j1307j7003k1632k4914k6840k7823k8172
51538F33714k7663k5994k3396k0395j7266j4232j1786j0104q532o363l929k126
51526D61928j085l26K2p37k504m171n077n739o730p704q059p830p392o860o223
51511C91513n605m974m102l106k507k479k592k504k339k109j558r41j014j751
51497C53932j925p65P24J054L01j75K82R99J242J101R07N94O6l70l29J33O93J210
$$ plain form
51479 359674 361355 363174 364269 363686 361350 358359 355953 354184 352005 348742 344971 341729 339331 337400
51465 337400 335671 334188 332879 331460 329750 327736 325395 322778 320200 318028 316357 315123 314349 314012 313883
51450 313883 313879 314363 315717 317805 320256 323111 326841 331929 338844 348161 360121 374095 388786 402755
51436 402755 414449 422329 425768 425757 424099 422032 420072 418691 418184 417910 416637 413822 409973 405807 401719
51421 401719 398039 394929 391934 388361 384264 380329 376763 373105 369289 365993 363636 361891 360515 359849
51407 359849 359975 360157 359670 358670 357714 356991 356534 356672 357628 359026 360356 361676 363426 365714 368166 370344
51391 370344 372124 373941 376751 381371 387666 394809 402544 411725 423388 437821 454873 474673 497603
51378 497603 523910 553719 587133 624166 664930 709795 758461 808279 854205 891234 916795
$$ packed form
51479C59674J681J819J095n83k336k991k406j769k179l263l771l242k398j931
51465C37400j729j483j309j419j710k014k341k617k578k172j671j234p74l37j29
51450C13883mM84J354K088K451K855L730N088O915R317J1960J3974J4691J3969
51436D02755J1694P880L439j1j658k067j960j381n07k74j273k815l849m166m088
51421D01719l680l110k995l573m097l935l566l658l816l296k357j745j376o66
51407C59849J26J82m87j000r56p23m57J38R56J398J330J320J750K288K452K178
51391C70344J780J817K810M620O295P143P735R181J1663J4433J7052J9800K2930
51378D97603K6307K9809L3414L7033M0764M4865M8666M9818M5926L7029K5561
$$ plain form
51367 916795 930750 933967 927714 913761 893794 868517 837951 802661 764141 723970 683141 642372
51355 642372 602619 565005 530400 499276 471940 448770 430016 415214 403059 392266 382532 374260
51343 374260 367463 361522 356054 351296 347420 344160 341411 339481 338326 337224 335766 334594 334442 335000 335485
51328 335485 335940 337095 339092 341137 342473 343110 343513 343998 344503 344663 344115 342948 341695 340669 339624 338337
51312 338337 337139 336465 336201 335966 335717 335554 335173 334183 332798 331656 330984 330465 329867 329286 328757 328107 327240 326220
51294 326220 325046 323676 322233 320887 319599 318311 317277 316912 317355 318459 320112 322237 324689 327489 331036
51279 331036 335703 341324 347384 353503 359301 364013 366870 367933 368086 368104 368089 367870 367556 367509 368073 369524 372107
51262 372107 375833 380149 383893 385829 385515 383576 380829 377312 372656 367334 362670 359279 356249 352435
$$ packed form
51367I16795J3955L217o253j3953j9967k5277l0566l5290l8520m0171m0829m0769
51355F42372l9753l7614l4605l1124k7336k3170j8754j4802j2155j0793r734q272
51343C74260o797n941n468m758l876l260k749j930j155j102j458j172j52N58M85
51328C35485M55J155J997K045J336O37M03M85N05J60n48j167j253j026j045j287
51312C38337j198o74k64k35k49j63l81r90j385j142o72n19n98n81n29o50q67j020
51294C26220j174j370j443j346j288j288j034l65M43J104J653K125K452K800L547
51279C31036M667N621O060O119N798M712K857J063J53J8j5k19l14m7N64J451K583
51262C72107L726M316L744J936l14j939k747l517m656n322m664l391l030l814
$$ plain form
51248 352435 347916 343504 339402 335261 331298 328375 326877 326168 325219 323359 320552 317506 315451 315178 316261
51233 316261 317574 318466 318981 319206 319145 319209 320119 322170 325046 328348 331744 334660 336497 337319 337826 338481 339111
51216 339111 339421 339377 338987 338195 337181 336328 335806 335532 335595 336226 337295 338387 339515 341241 343895 347163 350639
51199 350639 354278 358018 361429 364116 366210 368054 369581 370279 369766 368265 366597 365674 365822 366586 367330 367843
51183 367843 368138 367928 366842 365098 363386 361970 360395 358238 355701 353293 351315 349895 349166 349149 349719 350860
51167 350860 352768 355538 358950 362644 366277 369519 372187 374443 376574 378468 379653 379958 379784 379484 378732
51152 378732 376760 373203 368575 363986 360351 357826 355967 354389 353074 352034 351079 350148 349479 349120 348628
51137 348628 347742 346923 346678 346719 346497 346329 347121 349080 351523 353921 356264 358358 359764 360811 362720 366162
$$ packed form
51248C52435m519m412m102m141l963k923j498p09r49j860k807l046k055k73J083
51233C16261J313Q92N15K25o1O4R10K051K876L302L396K916J837Q22N07O55O30
51216C39111L10m4l90p92j014q53n22k74O3O31J069J092J128J726K654L268L476
51199C50639L639L740L411K687K094J844J527O98n13j501j668r23J48P64P44N13
51183C67843K95k10j086j744j712j416j575k157k537k408j978j420p29j7N70J141
51167C50860J908K770L412L694L633L242K668K256K131J894J185L05j74l00p52
51152C78732j972l557m628m589l635k525j859j578j315j040r55r31o69l59m92
51137C48628q86q19k45M1k22j68P92J959K443K398K343K094J406J047J909L442
$$ plain form
51121 366162 370223 373319 374679 374567 373595 372290 371063 370135 369677 370129 371965 374929 377897 379787 380309 379769
51105 379769 378728 378029 378592 380670 383648 386829 390011 393038 395381 396645 397125 397463 397970 398521 398766 398209
51089 398209 396538 394237 392458 391935 392395 393267 394429 395855 397051 397455 397152 396742 396765 397519 399020 400712
51073 400712 401688 401695 401604 402373 403966 405847 408165 411707 416812 423039 429878 437303 445603 455273 467242 482752
51057 482752 502518 525659 549339 569768 584359 593458 599934 607067 616988 630509 647063 664299
51045 664299 678904 688913 694808 697758 697472 692637 682787 668745 651889 634275 619132 609540 605990
51032 605990 605907 605639 602340 594409 581691 565794 549261 533837 519989 508059 498773 492254 487535
51019 487535 483700 480854 479543 479949 482108 486120 491523 497155 502412 508087 515325 524248 534262 545136
$$ packed form
51121C66162M061L096J360j12r72j305j227r28m58M52J836K964K968J890N22n40
51105C79769j041o99N63K078K978L181L182L027K343J264M80L38N07N51K45n57
51089C98209j671k301j779n23M60Q72J162J426J196M04l03m10K3P54J501J692
51073D00712R76Pr1P69J593J881K318L542N105O227O839P425Q300R670J1969J5510
51057D82752J9766K3141K3680K0429J4591R099O476P133R921J3521J6554J7236
51045F64299J4605J0009N895K950k86m835r850j4042j6856j7614j5143r592l550
51032F05990q3k68l299p931j2718j5897j6533j5424j3848j1930r286o519m719
51019D87535l835k846j311M06K159M012N403N632N257N675P238Q923J0014J0874
$$ plain form
51005 545136 556850 568745 579763 589508 598299 606214 612769 617577 620735 622563 623421 623697 623424 622036
50991 622036 619158 615569 612648 610832 609345 607597 606086 605683 606828 609877 615633 624856 637584 653279
50977 653279 671149 689787 707096 721516 733396 744581 756708 770406 786043 804424 826531
50966 826531 853024 884179 919867 959455 1002224 1048101 1097555 1150534 1206025 1262978 1321056
50955 1321056 1379865 1437853 1492731 1542934 1588107 1628202 1662791 1691416 1714078 1731128 1743084
50944 1743084 1750879 1755895 1759384 1762043 1764417 1767355 1771483 1776163 1779442 1779401 1775551 1768823 1760344 1750379
50930 1750379 1738418 1723922 1706733 1686813 1663931 1637691 1607646 1573287 1534255 1490862 1444245
50919 1444245 1395674 1345789 1294829 1243477 1193071 1144918 1099786 1058137 1020436 986926 957296
$$ packed form
51005E45136J1714J1895J1018R745Q791P915O555M808L158J828Q58K76k73j388
50991F22036k878l589k921j816j487j748j511m03J145L049N756R223J2728J5695
50977F53279J7870J8638J7309J4420J1880J1185J2127J3698J5637J8381K2107
50966H26531K6493L1155L5688L9588M2769M5877M9454N2979N5491N6953N8078
50955A321056N8809N7988N4878N0203M5173M0095L4589K8625K2662J7050J1956
50944A743084P795N016L489K659K374K938M128M680L279m1l850o728q479r965
50930A750379j1961j4496j7189j9920k2882k6240l0045l4359l9032m3393m6617
50919A444245m8571m9885n0960n1352n0406m8153m5132m1649l7701l3510k9630
$$ plain form
50908 957296 930823 906864 885068 865277 847333 831020 816158 802722 790668 779523 768362
50897 768362 756603 744789 734210 725679 719023 713760 709849 707487 706508 706342 706459 706662 707029 707705 708671
50882 708671 709703 710660 711790 713530 716049 719312 723495 728920 735466 742564 749946 757987 767029 776881
50868 776881 787341 798855 812150 827389 844140 862035 881101 901562 923691 947810 974190
50857 974190 1002971 1034430 1069230 1108227 1152166 1201714 1257530 1320018 1389261 1465518 1549535
50846 1549535 1641864 1742026 1848782 1961247 2079306 2202918 2331352 2463053 2595763 2726490
50836 2726490 2851583 2967116 3069349 3155201 3222768 3271636 3302640 3317313 3317519 3305293 3282700
50825 3282700 3251964 3215947 3178355 3143052 3113154 3090876 3077806 3074606 3080255 3091942 3105806 3117638
$$ packed form
50908I57296k6473k3959k1796j9791j7944j6313j4862j3436j2054j1145j1161
50897G68362j1759j1814j0579q531o656n263l911k362r79j66J17K03L67O76R66
50882G08671J032R57J130J740K519L263M183N425O546P098P382Q041R042R852
50868G76881J0460J1514J3295J5239J6751J7895J9066K0461K2129K4119K6380
50857I74190K8781L1459L4800L8997M3939M9548N5816O2488O9243P6257Q4017
50846A549535R2329J00162J06756J12465J18059J23612J28434J31701J32710J30727
50836B726490J25093J15533J02233Q5852O7567M8868L1004J4673K06j2226k2593
50825C282700l0736l6017l7592l5303k9898k2278j3070l200N649J1687J3864J1832
$$ plain form
50813 3117638 3123138 3118383 3100651 3068806 3022736 2962585 2888497 2800786 2700197 2588262 2467625
50802 2467625 2341853 2214680 2089350 1968482 1854191 1748131 1651490 1565013 1488969 1423159
50792 1423159 1367153 1320555 1282883 1253239 1230392 1213244 1201035 1193112 1188764 1187341 1188231 1190597
50780 1190597 1193381 1195644 1196719 1196034 1193228 1188574 1182877 1176589 1169265 1160259 1149699 1138343 1126536
50767 1126536 1113796 1099510 1083715 1066962 1049690 1031969 1013801 995493 977670 960926 945456
50756 945456 931053 917543 905209 894688 886449 880492 876547 874403 874028 875652 879889 887555 899053
50743 899053 914051 932045 953119 977738 1005897 1037080 1071272 1109391 1152205 1199173 1248957
50732 1248957 1300898 1355399 1412937 1473350 1536171 1600989 1667131 1733390 1798452 1861454 1922064
$$ packed form
50813C117638N500m755j7732l1845m6070o0151p4088q7711j00589j11935j20637
50802B467625j25772j27173j25330j20868j14291j06060r6641q6477p6044o5810
50792A423159n6006m6598l7672k9644k2847j7148j2209p923m348j423Q90K366
50780A190597K784K263J075o85k806m654n697o288p324r006j0560j1356j1807
50767A126536j2740j4286j5795j6753j7272j7721j8168j8308j7823j6744j5470
50756I45456j4403j3510j2334j0521q239n957l945k144l75J624M237P666J1498
50743H99053J4998J7994K1074K4619K8159L1183L4192L8119M2814M6968M9784
50732A248957N1941N4501N7538O0413O2821O4818O6142O6259O5062O3002O0610
$$ plain form
50721 1922064 1980287 2036166 2089209 2137849 2179777 2212943 2235895 2247255 2245714 2231093 2205026
50710 2205026 2170249 2129724 2086749 2045100 2008026 1977172 1953058 1936309 1927625 1926681 1931844 1941050
50698 1941050 1952404 1963944 1973603 1979536 1979907 1972168 1953362 1921723 1877822 1823965 1762816 1696723
50686 1696723 1627849 1558412 1490751 1427183 1369473 1318356 1273867 1236265 1206303 1184474 1170434
50675 1170434 1163426 1162969 1168875 1180930 1198860 1222363 1250782 1282843 1316878 1351253 1384521 1415560
50663 1415560 1443785 1468993 1490843 1508930 1523679 1536718 1549712 1563031 1576143 1589153 1603109
50652 1603109 1618662 1635183 1651807 1668837 1687543 1708783 1732562 1758978 1788953 1823566 1862921
50641 1862921 1905989 1951512 1998785 2047664 2098072 2149576 2201225 2251781 2300128 2345434 2386847
$$ packed form
50721A922064N8223N5879N3043M8640M1928L3166K2952J1360j541j4621k6067
50710B205026l4777m0525m2975m1649l7074l0854k4114j6749q684r44N163R206
50698A941050J1354J1540R659N933L71p739j8806l1639m3901n3857o1149o6093
50686A696723o8874o9437o7661o3568n7710n1117m4489l7602k9962k1829j4040
50675A170434p008m57N906J2055J7930K3503K8419L2061L4035L4375L3268L1039
50663A415560K8225K5208K1850J8087J4749J3039J2994J3319J3112J3010J3956
50652A603109J5553J6521J6624J7030J8706K1240K3779K6416K9975L4613L9355
50641A862921M3068M5523M7273M8879N0408N1504N1649N0556M8347M5306M1413
$$ plain form
50630 2386847 2423378 2454472 2480727 2503774 2525469 2547308 2569871 2591416 2606511 2607268 2587689 2547697
50618 2547697 2493182 2432601 2373564 2321472 2279427 2248465 2228236 2217939 2216651 2222979 2235019 2250850
50606 2250850 2268631 2285981 2299710 2306515 2303779 2289633 2262766 2222763 2170553 2108178 2038057 1962557
50594 1962557 1884033 1804865 1727257 1652991 1583218 1518342 1458111 1401997 1349601 1300838 1255895
50583 1255895 1215029 1178267 1145239 1115344 1088148 1063646 1042176 1024123 1009566 998151 989437
50572 989437 983518 980995 982029 985623 990335 995680 1002362 1011085 1021662 1033505 1046534 1061218 1078010
50559 1078010 1097146 1118809 1143115 1169923 1198899 1229731 1262129 1295690 1329907 1364318 1398480
50548 1398480 1431892 1464142 1495222 1525571 1555734 1586008 1616466 1647347 1679439 1714023 1752487
$$ packed form
50630B386847L6531L1094K6255K3047K1695K1839K2563K1545J5095P57j9579l9992
50618B547697n4515o0581n9037n2092m2045l0962k0229j0297j288O328J2040J5831
50606B250850J7781J7350J3729O805k736j4146k6867m0003n2210o2375p0121p5500
50594A962557p8524p9168p7608p4266o9773o4876o0231n6114n2396m8763m4943
50583A255895m0866l6762l3028k9895k7196k4502k1470j8053j4557j1415q714
50572I89437n919k523J034L594M712N345O682Q723J0577J1843J3029J4684J6792
50559A078010J9136K1663K4306K6808K8976L0832L2398L3561L4217L4411L4162
50548A398480L3412L2250L1080L0349L0163L0274L0458L0881L2092L4584L8464
$$ plain form
50537 1752487 1795977 1845306 1900988 1963304 2032569 2109445 2194693 2288319 2389064 2495117 2605427
50526 2605427 2720230 2840429 2966597 3098376 3234359 3372389 3510082 3645076 3774813
50517 3774813 3896383 4006898 4103842 4184753 4246820 4287330 4304576 4298101 4268191 4215563 4141491
50506 4141491 4047845 3937124 3812912 3680220 3544696 3411311 3284165 3167417 3065616 2982791
50496 2982791 2921632 2883609 2869211 2877749 2907390 2955617 3019106 3092884 3170217 3243626 3305505
50485 3305505 3347741 3362205 3343209 3289740 3205006 3094261 2963519 2819395 2668445 2516032
50475 2516032 2366139 2222109 2086801 1961977 1848357 1746434 1656633 1578454 1510197 1449943
50465 1449943 1396374 1348324 1304178 1262447 1222854 1186348 1154035 1126296 1102850 1083331 1067728
$$ packed form
50537A752487M3490M9329N5682O2316O9265P6876Q5248R3626J00745J06053J10310
50526B605427J14803J20199J26168J31779J35983J38030J37693J34994J29737
50517C774813J21570J10515R6944Q0911O2067M0510J7246o475k9910n2628p4072
50506D141491r3646j10721j24212j32692j35524j33385j27146j16748j01801q2825
50496B982791o1159l8023j4398Q538K9641M8227O3489P3778P7333P3409O1879
50485C305505M2236J4464j8996n3469q4734j10745j30742j44124j50950j52413
50475B516032j49893j44030j35308j24824j13620j01923q9801p8179o8257o0254
50465A449943n3569m8050m4146m1731l9593l6506l2313k7739k3446j9519j5603
$$ plain form
50454 1067728 1056365 1049423 1046469 1046580 1049051 1053769 1060756 1069640 1080017 1092216 1107187 1125425 1146452
50441 1146452 1169669 1195220 1223279 1252358 1279016 1299786 1313376 1320905 1324372 1325310 1324731 1323623 1323104
50428 1323104 1324154 1327307 1332534 1339439 1347737 1357584 1369347 1383077 1398483 1415435 1434347 1456060
50416 1456060 1481499 1511492 1546654 1587393 1634081 1687089 1746413 1811345 1880787 1953802 2029505
50405 2029505 2106436 2182530 2255793 2324710 2388017 2444631 2493993 2535950 2569944 2594578 2608171
50394 2608171 2609354 2596917 2569627 2526880 2469480 2399478 2319462 2232355 2141738 2051721 1966161
50383 1966161 1887921 1818711 1759472 1710993 1674312 1650456 1639722 1641388 1654106 1676234 1705570
50372 1705570 1739090 1773309 1804779 1830099 1845821 1848918 1837526 1811223 1770858 1718360 1656531
$$ packed form
50454A067728j1363o942k954J11K471M718O987Q884J0377J2199J4971J8238K1027
50441A146452K3217K5551K8059K9079K6658K0770J3590P529L467R38n79j108n19
50428A323104J050L153N227O905Q298R847J1763J3730J5406J6952J8912K1713
50416A456060K5439K9993L5162M0739M6688N3008N9324O4932O9442P3015P5703
50405B029505P6931P6094P3263O8917O3307N6614M9362M1957L3994K4634J3593
50394B608171J183j2437k7290m2747n7400p0002q0016q7107r0617r0017q5560
50383A966161p8240o9210n9239m8479l6681k3856j0734J666J2718K2128K9336
50372A705570L3520L4219L1470K5320J5722L097j1392k6303m0365n2498o1829
$$ plain form
50361 1656531 1588657 1518119 1448125 1381329 1319316 1262574 1211086 1164772 1123349 1086276 1053246
50350 1053246 1024508 1000480 981273 966826 956915 950442 944856 937010 924881 908479 889359 869606
50338 869606 850998 834547 820542 809041 800224 794257 791077 790438 791840 794250 796423 797883 799216
50325 799216 801097 803542 806627 811309 818536 827698 836797 844224 849780 854052 857601 860924 864364 867666
50311 867666 870110 871520 872859 875496 880068 886238 893322 900912 908954 917398 925943 934311 942735 951874
50297 951874 962133 973535 986548 1002442 1022352 1046414 1074424 1106743 1143924 1186302 1235229
50286 1235229 1293591 1361960 1432791 1490232 1518323 1510593 1472412 1415647 1352077 1290229 1235123
50275 1235123 1188831 1151228 1120970 1096372 1076024 1059238 1045998 1036212 1029099 1023557 1018993 1015423
$$ packed form
50361A656531o7874p0538o9994o6796o2013n6742n1488m6314m1423l7073l3030
50350A053246k8738k4028j9207j4447r911o473n586p846j2129j6402j9120j9753
50338H69606j8608j6451j4005j1501q817n967l180o39J402K410K173J460J333
50325G99216J881K445L085M682P227R162R099P427N556M272L549L323L440L302
50311H67666K444J410J339K637M572O170P084P590Q042Q444Q545Q368Q424R139
50297I51874J0259J1402J3013J5894J9910K4062K8010L2319L7181M2378M8927
50286A235229N8362O8369P0831N7441K8091p730l8181n6765o3570o1848n5106
50275A235123m6292l7603l0258k4598k0348j6786j3240r786p113n542m564l570
$$ plain form
50263 1015423 1012900 1011390 1011264 1013477 1019027 1028472 1042105 1060243 1082967 1109525 1138208 1166979 1194389
50250 1194389 1219929 1243598 1265301 1284888 1302674 1319571 1336481 1353688 1370880 1387445 1402420
50239 1402420 1414266 1421029 1420899 1412761 1396464 1372890 1343775 1311333 1277887 1245568 1215964 1189884
50227 1189884 1167551 1149010 1133903 1120563 1105734 1085947 1059593 1027700 992824 957367 922781
50216 922781 889818 859065 831173 806722 785888 768283 753208 740156 729043 719861 712199 705357
50204 705357 698947 693187 688414 684542 681264 678606 676822 675734 674676 673306 671968 670918 669671 667653
50190 667653 665122 662756 660489 657546 653673 649614 646083 642898 639509 635908 632514 629479 626587 623685
50176 623685 620865 618265 616049 614498 613870 614100 614804 615631 616528 617676 619159 620732 622109 623649 626478
$$ packed form
50263A015423k523j510j26K213N550R445J3633J8138K2724K6558K8683K8771K7410
50250A194389K5540K3669K1703J9587J7786J6897J6910J7207J7192J6565J4975
50239A402420J1846O763j30q138j6297k3574k9115l2442l3446l2319k9604k6080
50227A189884k2333j8541j5107j3340j4829j9787k6354l1893l4876l5457l4586
50216I22781l2963l0753k7892k4451k0834j7605j5075j3052j1113r182p662o842
50204G05357o410n760m773l872l278k658j784j088j058j370j338j050j247k018
50190F67653k531k366k267k943l873m059l531l185l389l601l394l035k892k902
50176F23685k820k600k216j551o28K30P04Q27Q97J148J483J573J377J540K829
$$ plain form
50161 626478 631410 637756 643773 648499 652713 657826 664356 671932 680365 690055 701459 714739 729912
50148 729912 746843 765011 783778 803103 823731 846524 871901 900120 931900 968410 1010597
50137 1010597 1058608 1111698 1168374 1226508 1283614 1337598 1387618 1434235 1478612 1521663 1563976
50126 1563976 1606033 1647717 1687350 1721661 1747016 1760639 1760823 1746831 1719294 1680403 1632953 1578979
50114 1578979 1519667 1456564 1392309 1329808 1270867 1215961 1165317 1119921 1081142 1049340 1023065
50103 1023065 999879 977903 956410 935226 914334 894307 876335 861001 847246 833234 818312
50092 818312 803605 790696 780300 772361 766756 763415 762048 762234 763719 766395 770132 774836 780454 786650
50078 786650 792597 797514 801400 804953 808664 812253 815110 817034 818305 819137 819336 818670 817356 815904 814442
$$ packed form
50161F26478M932O346O017M726M214N113O530P576Q433R690J1404J3280J5173
50148G29912J6931J8168J8767J9325K0628K2793K5377K8219L1780L6510M2187
50137A010597M8011N3090N6676N8134N7106N3984N0020M6617M4377M3051M2313
50126A563976M2057M1684L9633L4311K5355J3623J84j3992k7537l8891m7450n3974
50114A578979n9312o3103o4255o2501n8941n4906n0644m5396l8779l1802k6275
50103A023065k3186k1976k1493k1184k0892k0027j7972j5334j3755j4012j4922
50092H18312j4707j2909j0396p939n605l341j367J86J485K676L737M704N618O196
50078G86650N947M917L886L553L711L589K857J924J271Q32J99o66j314j452j462
$$ plain form
50063 814442 812466 809512 805909 802458 799376 796040 792043 788036 785011 782951 780820 777900 774585 771641
50049 771641 769291 767441 766405 766828 768974 772577 777372 783403 790727 799204 808675 819063 830227 841957
50035 841957 854243 867256 880908 894593 907572 919595 931168 943273 956669 971236 986072
50024 986072 1000547 1015159 1030982 1048384 1066978 1086939 1109593 1136147 1166307 1198603 1231450
50013 1231450 1263096 1290991 1312498 1326769 1335515 1341685 1347655 1354532 1362259 1369696 1374744 1374885 1367881
50000 1367881 1352221 1327433 1294345 1254965 1211822 1167274 1123143 1080680 1040633 1003431 969347
49989 969347 938530 911037 886920 866093 847910 831152 814821 798807 783366 768117 752171
49978 752171 735342 718589 702990 688688 675184 662276 650287 639616 630449 622843 616712 611739
$$ packed form
50063H14442j976k954l603l451l082l336l997m007l025k060k131k920l315k944
50049G71641k350j850j036M23K146L603M795O031P324Q477R471J0388J1164J1730
50035H41957J2286J3013J3652J3685J2979J2023J1573J2105J3396J4567J4836
50024I86072J4475J4612J5823J7402J8594J9961K2654K6554L0160L2296L2847
50013A231450L1646K7895K1507J4271Q746O170N970O877P727P437N048J41p004
50000A367881j5660k4788l3088l9380m3143m4548m4131m2463m0047l7202l4084
49989I69347l0817k7493k4117k0827j8183j6758j6331j6014j5441j5249j5946
49978G52171j6829j6753j5599j4302j3504j2908j1989j0671r167p606o131m973
$$ plain form
49966 611739 607480 603602 599925 596317 592680 589023 585440 582053 579024 576564 574865 574068 574305 575723 578444
49951 578444 582503 587720 593618 599703 605999 613080 621263 629904 637809 644258 649322 653338 656600 659517
49937 659517 662513 665551 668044 669320 668758 665508 658655 648077 634861 620634 606717 593960 582846
49924 582846 573398 565280 558330 552699 548287 544460 540799 537910 536940 538310 541215 544377 547017 549116
49910 549116 551059 553112 555209 557163 559066 561390 564722 569435 575490 582375 589410 596480 604434 614271
49896 614271 625779 637403 647591 655936 662853 668638 673164 676131 677231 676268 673396 669057 663454 656338
49882 656338 647544 637498 626955 616443 606082 595708 585071 574290 564244 556060 549965 545060
49870 545060 540478 536233 532663 529704 527310 525995 526226 527590 529306 531357 534390 538653 543754 549424
$$ packed form
49966F11739m259l878l677l608l637l657l583l387l029k460j699p97K37J418K721
49951E78444M059N217N898O085O296P081Q183Q641P905O449N064M016L262K917
49937F59517K996L038K493J276n62l250o853j0578j3216j4227j3917j2757j1114
49924E82846r448q118o950n631m412l827l661k889r70J370K905L162K640K099
49910E49116J943K053K097J954J903K324L332M713O055O885P035P070P954R837
49896F14271J1508J1624J0188Q345O917N785M526K967J100r63k872m339n603p116
49882F56338q794j0046j0543j0512j0361j0374j0637j0781j0046q184o095m905
49870E45060m582m245l570k959k394j315K31J364J716K051L033M263N101N670
$$ plain form
49856 549424 555871 563336 571905 581764 593059 605383 617910 630067 641602 651960 660296 666322 670632
49843 670632 673917 676297 677642 678014 677330 674873 669625 661139 649983 637475 625074 613777 603843 595068
$$ packed form
49856E49424O447P465Q569R859J1295J2324J2527J2157J1535J0358Q336O026M310
49843F70632L285K380J345L72o84k457n248q486j1156j2508j2401j1297r934q775
$$ [...]
##END NTUPLES=NMR SPECTRUM
##END=
