
##TITLE=AC1377_PERAH12189_7518924_tSsVhEgFss
##JCAMPDX= 6.0         $$ Bruker NMR JCAMP-DX V2.0
##DATA TYPE= NMR SPECTRUM
##DATA CLASS= NTUPLES
##ORIGIN= BRUKER
##OWNER= Administrator
$$ 1.72 TOPSPIN		Version 2.1
$$ 2013-02-20 22:59:30.706 -0500  Administrator@X
$$ Compression mode = diff/dup
##.OBSERVE FREQUENCY= 400.02188249412
##.OBSERVE NUCLEUS= ^1H
##.ACQUISITION MODE= SIMULTANEOUS (DQD)
##.ACQUISITION SCHEME= undefined
##.AVERAGES= 64
##.DIGITISER RES= 22
##SPECTROMETER/DATA SYSTEM= spect
##.PULSE SEQUENCE= noesygpps1d.comp
##.SOLVENT NAME= COFFEE_meoh
##.SHIFT REFERENCE= INTERNAL, COFFEE_meoh, 1, 14.9609
##AUDIT TRAIL= $$ (NUMBER, WHEN, WHO, WHERE, PROCESS, VERSION, WHAT)
$$ ##TITLE= Audit trail, TOPSPIN		Version 2.1
$$ ##JCAMPDX= 5.01
$$ ##ORIGIN= Bruker BioSpin GmbH
$$ ##OWNER= Administrator
$$ $$ E:\/data/COFFEE/nmr/AC1377_PERAH12189_7518924_tSsVhEgFss/12/pdata/1/auditp.txt
$$ ##AUDIT TRAIL=  $$ (NUMBER, WHEN, WHO, WHERE, PROCESS, VERSION, WHAT)
(   1,<2013-02-20 22:59:24.784 -0500>,<Administrator>,<X>,<go>,<TOPSPIN 2.1>,
      <created by zg
	started at 2013-02-20 22:47:54.937 -0500,
	POWCHK enabled, PULCHK disabled,
       configuration hash MD5:
       86 BA 57 50 F2 9D 5C 9B 26 00 A9 28 5F 66 2E 89
       data hash MD5: 64K
       0D F4 74 38 23 D1 C3 EA 6E 53 8F 47 F8 16 01 7E>)
(   2,<2013-02-20 22:59:27.831 -0500>,<Administrator>,<X>,<proc1d>,<TOPSPIN 2.1>,
      <Start of raw data processing
       efp LB = 0.3 FT_mod = 6 PKNL = 1 PHC0 = 0 PHC1 = 0 SI = 128K 
       data hash MD5: 128K
       49 A5 93 5D 9D 9E C3 D4 2A 0D 69 12 85 89 B0 FB>)
(   3,<2013-02-20 22:59:28.925 -0500>,<Administrator>,<X>,<proc1d>,<TOPSPIN 2.1>,
      <pk PHC0 = 248.313 PHC1 = 0 
       data hash MD5: 128K
       E6 FB 74 AE FF 67 43 FE 7C 6D DB 91 53 D2 CC 5C>)
(   4,<2013-02-20 22:59:29.628 -0500>,<Administrator>,<X>,<proc1d>,<TOPSPIN 2.1>,
      <abs ABSG = 1 
       data hash MD5: 128K
       8E 15 74 18 29 6B ED 4D D4 28 30 31 01 50 6E F0>)
(   5,<2013-02-20 22:59:29.800 -0500>,<Administrator>,<X>,<proc1d>,<TOPSPIN 2.1>,
      <abs ABSG = 2 
       data hash MD5: 128K
       0D 03 98 66 F1 1C 05 1A A5 D0 1A F2 44 16 BE E6>)
(   6,<2013-02-20 22:59:29.988 -0500>,<Administrator>,<X>,<proc1d>,<TOPSPIN 2.1>,
      <abs ABSG = 3 
       data hash MD5: 128K
       6F A1 5D D3 AF EB 6F 04 78 1E 7E 51 76 9E F0 FF>)
(   7,<2013-02-20 22:59:30.206 -0500>,<Administrator>,<X>,<proc1d>,<TOPSPIN 2.1>,
      <abs ABSG = 4 
       data hash MD5: 128K
       72 36 3A 95 90 93 F7 25 CB C8 E5 EA 08 64 A2 B6>)
(   8,<2013-02-20 22:59:30.378 -0500>,<Administrator>,<X>,<proc1d>,<TOPSPIN 2.1>,
      <abs ABSG = 5 
       data hash MD5: 128K
       56 E5 5E 5D 16 B2 34 0F 19 0D EE F7 8A 76 52 33>)
$$ ##END=
$$ 
$$ $$ hash MD5
$$ $$ 5A 35 C6 91 0F 76 E2 F6 CC 61 D6 FD A1 90 80 A7
##$RELAX= 
##$RELAX= 
##$RELAX= 
##$RELAX= 
##$RELAX= 
##$RELAX= 
##$RELAX= 
##$RELAX= 
$$ Bruker specific parameters
$$ --------------------------
##$DU= <E:\>
##$EXPNO= 12
$$ [...]
150 150 150 150 150 150 150 150
##$TP07= 0
##$TPNAME0= <>
##$TPNAME1= <>
##$TPNAME2= <>
##$TPNAME3= <>
##$TPNAME4= <>
##$TPNAME5= <>
##$TPNAME6= <>
##$TPNAME7= <>
##$TPOAL= (0..7)
0.5 0.5 0.5 0.5 0.5 0.5 0.5 0.5
##$TPOFFS= (0..7)
0 0 0 0 0 0 0 0
##$TUNHIN= 0
##$TUNHOUT= 0
##$TUNXOUT= 0
##$USERA1= <user>
##$USERA2= <user>
##$USERA3= <user>
##$USERA4= <user>
##$USERA5= <user>
##$V9= 5
##$VALIST= <valist>
##$VCLIST= <CCCCCCCCCCCCCCC>
##$VD= 0
##$VDLIST= <DDDDDDDDDDDDDDD>
##$VPLIST= <PPPPPPPPPPPPPPP>
##$VTLIST= <TTTTTTTTTTTTTTT>
##$WBST= 1024
##$WBSW= 4
##$XGAIN= (0..3)
0 0 0 0
##$XL= 0
##$YL= 0
##$YMAX_a= 6143920
##$YMIN_a= -11804054
##$ZGOPTNS= <>
##$ZL1= 120
##$ZL2= 120
##$ZL3= 120
##$ZL4= 120
##$ABSF1= 14.9609
##$ABSF2= -5.597281
##$ABSG= 5
##$ABSL= 3
##$ALPHA= 0
##$AQORDER= 0
##$ASSFAC= 0
##$ASSFACI= 0
##$ASSFACX= 0
##$ASSWID= 0
##$AUNMP= <proc_prof1d_extract.lims>
##$AXLEFT= 0
##$AXNAME= <>
##$AXNUC= <1H>
##$AXRIGHT= 0
##$AXTYPE= 0
##$AXUNIT= <>
##$AZFE= 0.1
##$AZFW= 0.1
##$BCFW= 0
##$BC_mod= 0
##$BYTORDP= 0
##$COROFFS= 0
##$CY= 15
##$DATMOD= 1
##$DC= 0
##$DFILT= <>
##$DTYPP= 0
##$F1P= 0
##$F2P= 0
##$FCOR= 0.5
##$FTSIZE= 131072
##$FT_mod= 6
##$GAMMA= 0
##$GB= 0
##$INTBC= 1
##$INTSCL= 1
##$ISEN= 128
##$LB= 0.3
##$LEV0= 0
##$LPBIN= 0
##$MAXI= 10000
##$MC2= 0
##$MEAN= 0
##$ME_mod= 0
##$MI= 0
##$NCOEF= 0
##$NC_proc= -2
##$NLEV= 6
##$NOISF1= 0
##$NOISF2= 0
##$NSP= 0
##$NTH_PI= 0
##$NZP= 0
##$OFFSET= 14.9609
##$PC= 1
##$PHC0= 248.313
##$PHC1= 0
##$PH_mod= 1
##$PKNL= yes
##$PPARMOD= 0
##$PPDIAG= 0
##$PPIPTYP= 0
##$PPMPNUM= 2147483647
##$PPRESOL= 1
##$PSCAL= 4
##$PSIGN= 0
##$PYNMP= <proc.py>
##$REVERSE= no
##$SF= 400.020009677908
##$SI= 131072
##$SIGF1= 0
##$SIGF2= 0
##$SINO= 400
##$SIOLD= 131072
##$SPECTYP= <>
##$SREGLST= <1H.CDCl3>
##$SSB= 0
##$STSI= 131072
##$STSR= 0
##$SW_p= 8223.68421052631
##$SYMM= 0
##$S_DEV= 0
##$TDeff= 65536
##$TDoff= 0
##$TI= <>
##$TILT= no
##$TM1= 0
##$TM2= 0
##$TOPLEV= 0
##$USERP1= <user>
##$USERP2= <user>
##$USERP3= <user>
##$USERP4= <user>
##$USERP5= <user>
##$WDW= 1
##$XDIM= 131072
##$YMAX_p= 428546839
##$YMIN_p= -11753
##$CURPLOT= <Network HP LaserJet P1505>
##$CURPRIN= <$Network HP LaserJet P1505>
##$DFORMAT= <normdp>
##$LAYOUT= <+/1D_H.xwp>
##$LFORMAT= <normlp>
##$PFORMAT= <normpl>
##$SURQMSG= 1
$$ End of Bruker specific parameters
$$ ---------------------------------
##NTUPLES= NMR SPECTRUM
##VAR_NAME=  FREQUENCY,     SPECTRUM/REAL,   SPECTRUM/IMAG
##SYMBOL=    X,             R,               I
##VAR_TYPE=  INDEPENDENT,   DEPENDENT,       DEPENDENT
##VAR_FORM=  AFFN,          ASDF,            ASDF
##VAR_DIM=   131072,        131072,          131072
##UNITS=     HZ,            ARBITRARY UNITS, ARBITRARY UNITS
##FACTOR=    0.0627417313425164, 1,          1
##FIRST=     8223.62146879497, -1697,        -65656
##LAST=      0,             807,             -66654
##MIN=       0,             -11753,          0
##MAX=       8223.62146879497, 428546839,    0
$$ Real data points
##PAGE= N=1
##DATA TABLE= (X++(R..R)), XYDATA
$$ [...]
61618D50142j286n32N94J289J217J002J207J371O75q20k242l129l848m734n480
$$ 450142 448856 448324 448918 450207 451424 452426 453633 455004 455679 454859 452617 449488 445640 440906 435426
61603D35426n682n470n274n238n314n546n808n486m083k157j051j432k608l521
$$ 435426 429744 424274 419000 413762 408448 402902 397094 391608 387525 385368 384317 382885 380277 376756
61589C76756l920m113m120l704l068k681k474j978j357j462k498l395l182k372
$$ 376756 372836 368723 364603 360899 357831 355150 352676 350698 349341 347879 345381 341986 338804 336432
61575C36432k165k660k884k466k177k517k742j969o09J04k62r79j286j229j131
$$ 336432 334267 331607 328723 326257 324080 321563 318821 316852 316243 316347 316085 315106 313820 312591 311460
61560C11460q94k72N13Q78O70M03N68R43Q95K88k62j37N31J112J239J052P88N09
$$ 311460 310566 310294 310807 311685 312355 312758 313326 314269 315164 315452 315190 315053 315584 316696 317935 318987 319775 320284
61542C20284L02L10M82N51N21Q11J653K572K841K418K044K358L164L658L221J917
$$ 320284 320586 320896 321378 321929 322450 323261 324914 327486 330327 332745 334789 337147 340311 343969 347190 349107
61526C49107L19r82j806k365k912l430l711l630l318l013k851k675k099r07N31
$$ 349107 349426 348444 346638 344273 341361 337931 334220 330590 327272 324259 321408 318733 316634 315727 316258
61511C16258J427J361P41K33q7o03j270j424p22J95M22j06o89r30j121j539j891
$$ 316258 317685 319046 319787 320020 319933 319330 318060 316636 315914 316109 316531 316425 315736 314806 313685 312146 310255
61494C10255j771j321j028j052j072p45j07M34L66n25j718k174j356K2P20L98
$$ 310255 308484 307163 306135 305083 304011 303266 303159 303593 303959 303434 301716 299542 298186 298208 298928 299326
61478B99326j07k0M62P44P89R94J418J727J798J894K175K351J941Q01o14j495
$$ 299326 299219 299199 299661 300405 301194 302188 303606 305333 307131 309025 311200 313551 315492 316293 315679 314184
61462C14184j372p03m89j050j569j174j21O17O93O29Q59J208J372J281Q83J79
$$ 314184 312812 312109 311620 310570 309001 307827 307706 308323 309016 309645 310504 311712 313084 314365 315248 315427
61446C15427l75j97N25Q45L86o0L25J227J775J795J849K321L097L933M541M505
$$ 315427 315052 314855 315380 316225 316611 316551 316876 318103 319878 321673 323522 325843 328940 332873 337414 341919
61430C41919L738K885K654K775K255P59q37j480j019m3R28J773K562L271L700
$$ 341919 345657 348542 351196 353971 356226 356985 356148 354668 353649 353606 354534 356307 358869 362140 365840
61415C65840L564K831J935J412J324J242Q05M5q49j701k270k320j949j556j366
$$ 365840 369404 372235 374170 375582 376906 378148 378953 378998 378149 376448 374178 371858 369909 368353 366987
61400C66987j268j220j448k003k463k448k239k427k999l186k370r48N2Q2l58m02
$$ 366987 365719 364499 363051 361048 358585 356137 353898 351471 348472 345286 342916 341968 342020 342102 341744 341342
61384C41342J68P61Q30N43L95M62L75k7m19m34k5O76J548K297K460J922J274J261
$$ 341342 341510 342271 343101 343644 344039 344501 344876 344849 344430 343996 343971 344647 346195 348492 350952 352874 354148 355409
61366C55409J936K639K910K972L201L415L159K494K092K377L000L420L643M023
$$ 355409 357345 359984 362894 365866 369067 372482 375641 378135 380227 382604 385604 389024 392667 396690
61352C96690M550M903N154N862P248Q802R954J0732J1337J1507J0801R318P611
$$ 396690 401240 406143 411297 417159 424407 433209 443163 453895 465232 476739 487540 496858 504469
61339E04469N999M455L104K308K142K241K285K338K524K667K353J258n71k609
$$ 504469 510468 514923 518027 520335 522477 524718 527003 529341 531865 534532 536885 538143 537572 534963
61325E34963m075m593m599m794n223n304m687l655k559j462m91l8j74k21N82K121
$$ 534963 530888 526295 521696 516902 511679 506375 501688 498033 495474 494012 493521 493483 493309 493088 493670 495791
61309D95791L499M058M010M117M914O352Q016R606J1089J2410J3149J2754J1043
$$ 495791 499290 503348 507358 511475 516389 522741 530757 540363 551452 563862 577011 589765 600808
61296F00808Q305M997J571j459l713n304o640p811q509q583q234p553o428n122
$$ 600808 609113 614110 615681 614222 610509 605205 598565 590754 582245 573662 565428 557875 551447 546325
61282E46325m362m389m443l700k395j396r26m36M27J370K162L114M537O064O882
$$ 546325 541963 537574 533131 529431 527036 525640 524714 524278 524705 526075 528237 531351 535888 541952 548834
61267E48834O578N595M875N035N806O330O059N292M785N088O358Q495J1050J3137
$$ 548834 555412 561007 565882 570917 576723 583053 589112 594404 599189 604277 610635 619130 630180 643317
61253F43317J3903J3194J1568R694P883O164M481K868J523O24j08j344l317n273
$$ 643317 657220 670414 681982 691676 699559 705723 710204 713072 714595 715219 715111 713767 710450 705177
61239G05177o220o151n989o373p031p397p304o886o303n828n776n975n657m265
$$ 705177 698957 692806 686817 680444 673413 666016 658712 651826 645523 639695 633919 627944 622287 618022
61225F18022k180k63J074K116L212M276M908M815M074L080K252J774J673K030
$$ 618022 615842 615579 616653 618769 621981 626257 631165 635980 640054 643134 645386 647160 648833 650863
61211F50863K869L804M196L825L148K677K349J745P27l94j135j100j12J617L587
$$ 650863 653732 657536 661732 665557 668705 671382 673731 675476 676203 675809 674674 673574 673462 675079 678666
61196F78666N499P507R816J2320J4909J7796K1015K3796K5071K4578K2931K0656
$$ 678666 684165 691672 701488 713808 728717 746513 767528 791324 816395 840973 863904 884560
61184H84560J7752J4355J1068Q340O100M344L475L537L719L307K672K499K379
$$ 884560 902312 916667 927735 936075 942175 946519 949994 953531 957250 960557 963229 965728 968107
61171I68107J173j278l842n707p317r279j1215j2350j2694j2844j3074j3339j3861
$$ 968107 969280 968002 964160 958453 951136 941857 930642 918292 905598 892754 879680 866341 852480
61158H52480j4917j6188j6968j7036j6647j5820j4351j2532j1044r877q123n244
$$ 852480 837563 821375 804407 787371 770724 754904 740553 728021 716977 707100 698977 693733
61146F93733j937P06K388L354L375J778j585n856r774j2372j3277j2676j1213
$$ 693733 691796 692502 694890 698244 701619 703397 701812 695956 686182 673810 660533 647857 636644
61133F36644r587q131o770n314l667j860m8J584L020M426N898P407R049J1074
$$ 636644 627057 618926 612156 606842 603175 601315 601267 602851 605871 610297 616195 623602 632651 643725
61119F43725J3444J5678J7491J9236K1329K3509K5270K6774K8610L0627L1841
$$ 643725 657169 672847 690338 709574 730903 754412 779682 806456 835066 865693 897534
61108H97534L1762L1135L0867L0782L0071K8551K6801K5148K3275K0842J7873
$$ 897534 929296 960431 991298 1022080 1052151 1080702 1107503 1132651 1155926 1176768 1194641
61097A194641J4282R626L771k574q383j3238j7285k0527k2692k3944k5078k6709
$$ 1194641 1208923 1218549 1222320 1219746 1211363 1198125 1180840 1160313 1137621 1113677 1088599 1061890
61085A061890k8520k9653k9702k9067k8399k7923k7316k6105k4191k2023k0191
$$ 1061890 1033370 1003717 974015 944948 916549 888626 861310 835205 811014 788991 768800
61074G68800j8797j7432j5803j4052j2338j0511q576p060o392o149n523m415l420
$$ 768800 750003 732571 716768 702716 690378 679867 671291 664231 657839 651690 646167 641752 638332
61061F38332k780k017p98N34J534K228K809L268L700M509N908P531Q907J0067
$$ 638332 635552 633535 632737 633271 634805 637033 639842 643110 646810 651319 657227 664758 673665 683732
61047F83732J1351J2899J4588J6287J7906J9470K1212K3251K5137K6263K6866
$$ 683732 695083 707982 722570 738857 756763 776233 797445 820696 845833 872096 898962
61036H98962K7941K9845L1750L2936L3776L4906L6182L7305L8794M1225M3985
$$ 898962 926903 956748 988498 1021434 1055210 1090116 1126298 1163603 1202397 1243622 1287607
61025A287607M5832M6420M6308M5698M4424M3070M3015M5153M9406N5517O3392
$$ 1287607 1333439 1379859 1426167 1471865 1516289 1559359 1602374 1647527 1696933 1752450 1815842
61014A815842P2490Q1763R0487R8660J06895J16888J31719J54453J86520K28567
$$ 1815842 1888332 1970095 2060582 2159242 2266137 2383025 2514744 2669197 2855717 3084284
61004C084284K82457L50735M34784N36603O62832Q23403J024614J267256J551885
$$ 3084284 3366741 3717476 4152260 4688863 5351695 6175098 7199712 8466968 10018853
60995A0018853J873086K189926K399389K362777J993573J341224N88717m3556
$$ 10018853 11891939 14081865 16481254 18844031 20837604 22178828 22767545 22723989
60987B2723989m06974m65263k67207Q6099M46944O35518N04522K6284o75844j390874
$$ 22723989 22317015 21851752 21584545 21670644 22117588 22753106 23257628 23283912 22608068 21217194
60977B1217194j931653k211516k246839k110312j881686j621465j366264j134570
$$ 21217194 19285541 17074025 14827186 12716874 10835188 9213723 7847459 6712889
60969F712889r33848p65200o25867n11456m17993l42592k82844k36369k00902
$$ 6712889 5779041 5013841 4387974 3876518 3458525 3115933 2833089 2596720 2395818
60960B395818j74094j53286j36152j21551j09191r8514q8573p8798o9130n9471
$$ 2395818 2221724 2068438 1932286 1810735 1701544 1603030 1514457 1435659 1366529 1307058
60950A307058m9808m0949l4250l0325k8586k8205k8757k9815l0653l0753l0102
$$ 1307058 1257250 1216301 1182051 1151726 1123140 1094935 1066178 1036363 1005710 974957 944855
60939I44855k8723k6541k3997k2131k1565k1736k1626k0905k0035j9455j9080
$$ 944855 916132 889591 865594 843463 821898 800162 778536 757631 737596 718141 699061
60928F99061j8477j7356j5872j4481j3375j2241j0836r597r099r028q461p171
$$ 699061 680584 663228 647356 632875 619500 607259 596423 586826 577727 568699 560238 553067
60916E53067n956n415n125m421l339k333j576r97n89k04N45J639K325J980J042
$$ 553067 547111 541696 536571 532150 528811 526478 524902 523905 523316 523112 523657 525296 527621 529601 530643
60901E30643N29Q51J591K193K350J860P34n48j365j601j616j694j891k305l069
$$ 530643 531172 532023 533614 535807 538157 540017 540751 540203 538838 537237 535621 533927 532036 529731 526662
60886E26662m008m794n455o310p328p951p701o706n512m580m070l830l530l009
$$ 526662 522654 517860 512405 506095 498767 490816 483115 476409 470897 466317 462247 458417 454887 451878
60872D51878k375j717q67J84Q97P88L27N86J799L001L396L422L943M955N819O387
$$ 451878 449503 447786 446919 447103 448000 448788 449115 449701 451500 454501 457897 461319 465262 470217 476036 482423
60856D82423P085P897Q097P207N648M181L140K528K431K911L670M191M205L814
$$ 482423 489508 497405 505502 512709 518357 522538 525678 528206 530637 533548 537218 541409 545614 549428
60842E49428L258K657J910P91p13k088k708k683k950m098n437n731m744l487k932
$$ 549428 552686 555343 557253 558044 557331 555243 552535 549852 546902 542804 537367 531636 526892 523405 520473
60827E20473k987k948k492j902j519j346j176r17p29p68q35n05J94N43k3r78j249
$$ 520473 517486 514538 512046 510144 508625 507279 506103 505186 504457 503689 502854 502349 502543 503086 503063 502085 500836
60810E00836o13J07L84O91J490K255K331K227L076M965O665P215P035P140P786
$$ 500836 500223 500330 500714 501405 502895 505150 507481 509708 512784 517749 524414 531629 538664 545804 553590
60795E53590Q402Q522Q353Q404Q880R528J0071J0546J1157J1824J2190J2164J2215
$$ 553590 561992 570514 578867 587271 596151 605679 615750 626296 637453 649277 661467 673631 685846
60782F85846J2824J3853J4700J4943J4580J3841J3049J2525J2307J2075J1623
$$ 685846 698670 712523 727223 742166 756746 770587 783636 796161 808468 820543 832166
60771H32166J1201J1017J0680R704Q343P313O699N921M766L658K707J228j223
$$ 832166 843367 854384 865064 874768 883111 890424 897123 903044 907810 911468 914175 915403 914180
60758I14180m040o309p837q967r800j0338j1045j2457j4299j5652j6044j5769
$$ 914180 910140 903831 895994 887027 877227 866889 855844 843387 829088 813436 797392 781623
60746G81623j5093j3903j2350j1239j1164j1689j1874j1514j1385j2174j3632
$$ 781623 766530 752627 740277 729038 717874 706185 694311 682797 671412 659238 645606
60735F45606j4894j5335j4910j3831j2271j0473q890p964p764p890p818p243o197
$$ 645606 630712 615377 600467 586636 574365 563892 555002 547038 539274 531384 523566 516323 510126
60722E10126m955l906l408l557m034m265l869k961j983j303j000j026j324j769
$$ 510126 505171 501265 497857 494300 490266 486001 482132 479171 477188 475885 474885 473859 472535 470766
60708D70766k168k449k721k967k920k471k092k355l122l644l537l246l323l755
$$ 470766 468598 466149 463428 460461 457541 455070 452978 450623 447501 443857 440320 437074 433751 429996
60694D29996m222m630m928m768l947k944k540k831l155k974k412j834j313p68
$$ 429996 425774 421144 416216 411448 407501 404557 402017 399186 396031 393057 390645 388811 387498 386730
60680C86730l17j52j38K47J406L026M121L884K562J272Q46J113J421J456J319
$$ 386730 386413 386261 386123 386370 387776 390802 394923 398807 401369 402641 403487 404600 406021 407477 408796
60665D08796J170J104J170J122M65q30j987k268j881j536j382r85j37R51K153
$$ 408796 409966 411070 412240 413362 413827 412997 411010 408742 406861 405325 403943 402958 402821 403772 405925
60650D05925L411M322M495M300M528N234N669N405M776M040K974J595M65j21n67
$$ 405925 409336 413658 418153 422453 426981 432215 437884 443289 448065 452105 455079 456674 457139 457018 456451
60635D56451j204j723j859k027k621l244l180k384j506j174j610k564l273k894
$$ 456451 455247 453524 451665 449638 447017 443773 440593 438209 436703 435529 433919 431355 428082 425188
60621D25188j419J37P49K55r00k219l113k980j900q21m98o43n88l05j92l39n81
$$ 425188 423769 423906 424655 424910 424010 421791 418678 415698 413798 412977 412479 411836 411248 410943 410751 410412 409831
60604D09831r46j360j386q44l69o09j240j495j347j343j490j242m57M25J160J770
$$ 409831 408885 407525 406139 405295 404926 404317 403077 401582 400235 398892 397402 396160 395703 396128 397288 399058
60588C99058J931J195o5p40l26N35J039J090R05M96k5k14K09R18J445J764K162
$$ 399058 400989 402184 402119 401379 401053 401588 402627 403717 404622 405118 405093 404879 405088 406006 407451 409215 411377
60571D11377K824L768N013O496Q030R433J0615J1498J2053J2400J2615J2520J1888
$$ 411377 414201 417969 422982 429478 437508 446941 457556 469054 481107 493507 506122 518642 530530
60558E30530J0704Q882N966J776k758o047p349p318o967o616o037n043l540j462
$$ 530530 541234 550116 556082 557858 555100 549053 541704 534386 527419 520803 514766 509723 506183 504721
60544E04721R53L070M411N142N887P214R321J1830J3833J4588J4289J3749J3146
$$ 504721 505674 508744 513155 518297 524184 531398 540719 552549 566382 580970 595259 609008 622154
60531F22154J1638Q470M047m41m059o446p548p575p036o350n491m328l104k272
$$ 622154 633792 642262 646309 645868 641809 635363 627815 620240 613204 606854 601363 597035 593931 591659
60517E91659j979k016k185k355k268j606l33J175K345K717K313J787J994L148
$$ 591659 589680 587664 585479 583124 580856 579250 578917 580092 582437 585154 587467 589254 591248 594396
60503E94396M626N833P052R080J2258J6220K0558K5176K9998L4748L9298M3874
$$ 594396 599022 604855 611907 620987 633245 649465 670023 695199 725197 759945 799243 843117
60491H43117M8600N2892N5573N5567N2395M5992L6412K3884R122o632k1989l5786
$$ 843117 891717 944609 1000182 1055749 1108144 1154136 1190548 1214432 1223554 1216922 1194933 1159147
60479A159147m7137n5359o0033o1120n8978n4374m8530m2856l8221l4375l0393
$$ 1159147 1112010 1056651 996618 935498 876520 822146 773616 730760 692539 658164 627771
60468F27771k5825k1306j7915j6041j4969j3608j1603r665q675q526q111o589
$$ 627771 601946 580640 562725 546684 531715 518107 506504 496839 488164 479638 471527 464938
60456D64938m420k874k644l238l620l212k255j457j342j813k361k686k917l191
$$ 464938 460518 457644 455000 451762 448142 444930 442675 441218 439876 438063 435702 433016 430099 426908
60442D26908l279k965k475k167j924j349m18M13P30M55k80j163j721j722j519
$$ 426908 423629 420664 418189 416022 414098 412749 412331 412744 413474 413929 413649 412486 410765 409043 407524
60427D07524j539j557j072k56J22j25k81J75P21O03k5k86L10J375K139K130J412
$$ 407524 405985 404428 403356 403100 403222 403097 402816 402991 403712 404315 404290 404004 404314 405689 407828 409958 411370
60410D11370N15J19N79J598K403K373J608R10R48J460J566R73M06N61J184J700
$$ 411370 411885 412004 412583 414181 416584 418957 420565 421475 422423 423883 425449 426422 426828 427389 428573 430273
60394D30273K175K861L289K767J662J097J399J867K109K484L004K962K163J455
$$ 430273 432448 435309 438598 441365 443027 444124 445523 447390 449499 451983 454987 457949 460112 461567
60380D61567J395J420J018P98J448K416K699K336K064J996J714J379J634K404
$$ 461567 462962 464382 465400 466198 467646 470062 472761 475097 477161 479157 480871 482250 483884 486288
60366D86288K823K468J815J331Q48Q1p82j361j506j279p39P5J068J996K468K272
$$ 486288 489111 491579 493394 494725 495573 495654 494872 493511 492005 490726 489987 490062 491130 493126 495594 497866
60350D97866J838J974K900L911M395M664N367O463P420Q024Q334Q086O918N028
$$ 497866 499704 501678 504578 508489 512884 517548 522915 529378 536798 544822 553156 561242 568160 573188
60336E73188K951Q16j572m066o252p973r119r150p759n853m901n128n300m516
$$ 573188 576139 576955 575383 571317 565065 557092 547973 538823 531064 525211 520310 515182 509882 505366
60322E05366l334k737k797k893k639k048j208l33K28M47P59J421K086K388K618
$$ 505366 502032 499295 496498 493605 490966 488918 487710 487377 487605 488052 488811 490232 492318 494706 497324
60307D97324L373M773O457Q250J0399J3169J6417J9581K1973K3109K2896K1479
$$ 497324 500697 505470 511927 520177 530576 543745 560162 579743 601716 624825 647721 669200
60295F69200J8905J5032R805L627k592p738j1092j2833j3795j4535j4846j4357
$$ 669200 688105 703137 712942 716569 713977 706239 695147 682314 668519 653984 639138 624781
60283F24781j3305j2258j1347j0342r350q792q675q492p919p117o248n288m452
$$ 624781 611476 599218 587871 577529 568179 559387 550712 542220 534301 527184 520936 515648 511196
60270E11196m250m775n421n585n247m706m084l482l133l093l039k637j941j196
$$ 511196 506946 502171 496750 491165 485918 481212 477128 473646 470513 467420 464381 461744 459803 458607
60256D58607n67j93k34o19j057j375j548j301k92J107J794J271M97Q19K277L604
$$ 458607 458040 457847 457613 456994 455937 454562 453014 451713 451421 452528 454322 455593 456090 456909 459186 462790
60240D62790L745K776J384R8p60r03l34M36P71N87M51R32J909K751L097L210L403
$$ 462790 466535 469311 470695 470793 470033 469130 468796 469232 470003 470590 471041 471973 473882 476633 479730 482940 486343
60223D86343L494L217K879L008L429L342K502J679J656K297L002L610M289M937
$$ 486343 489837 493054 495933 498941 502370 505712 508214 509893 511549 513846 516848 520458 524747 529684
60209E29684N331N710O582P883Q819Q729P811O796O123N594M837L971L598M040
$$ 529684 535015 540725 547307 555190 564009 572738 580549 587345 593468 599062 603899 607870 611468 615508
60195F15508M710M624L537K211J450J272J223J027O48P4n52q60q00r64j932l384
$$ 615508 620218 624842 628379 630590 632040 633312 634535 635562 636210 636284 635732 634872 634072 633108 631176 627792
60179F27792m463m892n204n828o498o732o460n918n276m602l945l267k415j509
$$ 627792 623329 618437 613233 607405 600907 594175 587715 581797 576521 571919 567974 564707 562292 560783
60165E60783j028j351k164k667k324j300q6J002J862K291J991J029N9j82L55R58
$$ 560783 559755 558404 556240 553573 551249 549949 549863 550865 552727 555018 557009 558038 558097 557915 558270 559228
60149E59228R55M73K06N47J157J496J625K145L312M469M770M291M006M541N490
$$ 559228 560183 560656 560862 561409 562566 564062 565687 567832 571144 575613 580383 584674 588680 593221 598711
60134E98711O172O567P003P325P033O105N040M089L072J952R96K04p85j984k749
$$ 598711 604883 611450 618453 625778 632811 638916 643956 648045 651117 653069 654065 654269 653484 651500 648751
60119F48751k496j333K37J742K723K820K235J674J514J471J312J244J286Q93j99
$$ 648751 646255 644922 645159 646901 649624 652444 654679 656353 657867 659338 660650 661894 663180 664073 663874
60104F63874j374k008k407l117l875m057l852l934m274m260l881l696l590k714
$$ 663874 662500 660492 658085 654968 651093 647036 643184 639250 634976 630716 626835 623139 619549 616835
60090F16835r51O40J348J775K689L754M192M080M081M294M305M165M363M836M811
$$ 616835 615884 616524 617872 619647 622336 626090 630282 634362 638443 642737 647042 651207 655570 660406 665217
60075F65217L848K398J074j23j526l210n045o994q934j0406j0975j0783j0370
$$ 665217 669065 671463 672537 672414 670888 667678 662633 655639 646705 636299 625324 614541 604171
60062F04171r951r263q179p097o443o109n746n443n595o109o171n127l324j747
$$ 604171 594220 584957 576778 569681 563238 557129 551383 545940 540345 534236 528065 522938 519614 517867
60048E17867r46o01j27O31J459K256L148M111M821N058N139N564O239O381N552
$$ 517867 516921 516320 516193 516824 518283 520539 523687 527798 532619 537677 542816 548380 554619 561000 566552
60033E66552M437M113M596M662L360J190n57j351j861k932m617o324p621q624
$$ 566552 570989 575102 579698 584360 587720 588910 588353 587002 585141 582209 577592 571268 563647 555023
60019E55023r604j0457j0746j0268r348q429p592o740o054n770n578m797l312
$$ 555023 545419 534962 524216 513948 504600 496171 488579 481839 475785 470015 464437 459640 456328
60006D56328j794q37l15J19M55O64J094J917K555K364J719J667K521L460L644
$$ 456328 454534 453697 453382 453501 453956 454620 455714 457631 460186 462550 464269 465936 468457 471917 475561
59991D75561L159K625K446K685L356M395N465O043N805M949M111L836L973L792
$$ 475561 478720 481345 483791 486476 489832 494227 499692 505735 511540 516489 520600 524436 528409 532201
59977E32201K871J629O89m0j100k536l751m347m487m350l762k651j424n89l09
$$ 532201 535072 536701 537390 537350 536250 533714 529963 525616 521129 516779 513017 510366 508942 508353 508044
59962E08044n63j241j883j729n14J040J981K118J879J431N72n66j365j522j450
$$ 508044 507481 506240 504357 502628 502114 503154 505135 507253 509132 510563 511135 510569 509204 507682 506232
59947E06232j555j507p99K67Q00O03N14J153J882J624M10o95j099j327j963k704
$$ 506232 504677 503170 502371 502638 503438 504041 504555 505708 507590 509214 509624 508929 507830 506503 504540 501836
59931E01836k943k678k346k069j698j315j090q02q8Q75J457J367R31N47K84Q0
$$ 501836 498893 496215 493869 491800 490102 488787 487697 486895 486807 487682 489139 490506 491437 491984 492268 492348
59915D92348l9PK90Q57J552K041K256K550L103L516L462L379L872M696N084M882
$$ 492348 492309 492316 492606 493463 495015 497056 499312 501862 504965 508481 511943 515322 519194 523890 528974 533856
59899E33856M576M294L748L141L078L400L109J852N01p7J2M31J331K631L532L526
$$ 533856 538432 542726 546474 549615 552693 556093 559202 561054 561555 561478 561490 561921 563252 565883 569415 572941
59883E72941L202L265L476L439L645M619N673N732N065M895N470N778N188M033
$$ 572941 576143 579408 582884 586323 589968 594587 600260 605992 611057 615952 621422 627200 632388 636421
59869F36421K515L00k337m249m942n402o585p874p935o608n048m246m192m356
$$ 636421 638936 639236 636899 632650 627708 622306 615721 607847 599912 593304 588256 584010 579818 575462
59855E75462m313l836k841j461K7J420K629L725N012O826R024J0876J1622J0927
$$ 575462 571149 567313 564472 563011 563038 564458 567087 570812 575824 582650 591674 602550 614172 625099
59841F25099Q766N346J448j591k800k331r74P55K520L574L000O96k393n126o851
$$ 625099 633865 639211 640659 639068 636268 633937 632963 633718 636238 639812 642812 643508 641115 635989 629138
59826F29138p409p040o415o217o400o328n775n291n337n615n693n747o141o556
$$ 629138 621729 614689 608274 602057 595657 589329 583554 578263 572926 567311 561618 555871 549730 543174
59812E43174o311n355m266l370k485j646j354j785k332k354j960j687j709j792
$$ 543174 536863 531508 527242 523872 521387 519741 518387 516602 514270 511916 509956 508269 506560 504768
59798E04768j767j572j031j32N67L59p34j890k390k320k236k472k925l247l091
$$ 504768 503001 501429 500398 500266 500833 501192 500458 498568 496178 493858 491622 489150 486225 482978 479887
59783D79887k359j413q85j083j641j857j411o53j89k12k98J3N19O00K40L36J568
$$ 479887 477528 476115 475230 474147 472506 470649 469238 468585 468396 468184 467886 467899 468418 469018 469258 469594 471162
59766D71162L323M286L975L060K273J772J623K091K996L523L195K576K440K758
$$ 471162 474485 478771 482746 485806 488079 489851 491474 493565 496561 500084 503279 505855 508295 511053
59752E11053L066L418M182N147N688N728N802O080O078N554N005M903M935M443
$$ 511053 514119 517537 521719 526866 532554 538282 544084 550164 556242 561796 566801 571704 576639 581082
59738E81082L305K066J337J308J695J967J787J307R25P48N59K98J72K44K43K2
$$ 581082 584387 586453 587790 589098 590793 592760 594547 595854 596779 597527 598086 598384 598556 598800 599043 599065
59722E99065j69o5K50N52P69R03R60J040J188J049K46p19o32Q24K326K455J542
$$ 599065 598896 598831 599081 599633 600402 601305 602265 603305 604493 605542 605788 605069 604437 605261 607587 610042 611584
59705F11584J063J601K374K668K627K441J830P94L1N7N15Q82J288K025K762K892
$$ 611584 612647 614248 616622 619290 621917 624358 626188 626982 627013 627070 627585 628467 629755 631780 634542 637434
59689F37434K380J632P98k03j210j937k364k501k074j047j89k97r89j166o77o03
$$ 637434 639814 641446 642244 642041 640831 638894 636530 634029 631955 630908 630719 630422 629433 628267 627590 626987
59673F26987j615l020l893m386n153o096o495o161n669n462n346m986m457m075
$$ 626987 625372 622352 618459 614073 608920 602824 596329 590168 584499 579037 573691 568705 564248 560173
59659E60173l926l741l171k139r82j40L49R01J837K973L856M276M305M017L370
$$ 560173 556247 552506 549335 547196 546214 546074 546423 547324 549161 552134 555990 560266 564571 568588 571958
59644E71958K351J060l26j574k501l148l769m457m891m537l246j625p73j366k800
$$ 571958 574309 575369 575043 573469 570968 567820 564051 559594 554703 550166 546920 545295 544522 543156 540356
59629E40356l567k838j456q62j251j529j014l04j47l96n19n22o99j020j353j831
$$ 540356 536789 533951 532495 531633 530382 528853 527839 527535 527388 526992 526473 525951 525252 524232 522879 521048
59613E21048k459k849k769k535k279j512j3J446K083K198K448K561J910Q60L71
$$ 521048 518589 515740 512971 510436 508157 506645 506632 508078 510161 512359 514807 517368 519278 520138 520509
59598E20509M64L19k88q22j102j369j264j99J213J497M62l91q3N94N96P6m03r15
$$ 520509 520973 521292 521004 520182 519080 517711 516447 516248 517461 518958 519420 519029 518946 519540 520136 520212 519809 518894
59580E18894j501j626j216j274k342l401l358k797k964l661l607k474j254p34
$$ 518894 517393 515767 514551 513277 510935 507534 504176 501379 498415 494754 491147 488673 487419 486685
59566D86685p31q22q44o44k19L8j20j56N01J478J988K077K283K349J508or43p24
$$ 486685 485954 485132 484288 483644 483425 483463 483343 483187 483688 485166 487154 489231 491514 493863 495371 495365 494422 493698
59548D93698p5L14P44J672K765L402L552L714M368N607P097Q385R737J2376J7057
$$ 493698 493623 493937 494681 496353 499118 502520 506072 509786 514154 519761 526858 535243 544980 557356 574413
59533E74413K2356K5274K3741J7968R596O56o523r914r307o563l636r32J932M632
$$ 574413 596769 622043 645784 663752 673348 674004 667481 657567 648260 641697 638061 637129 639061 643693
59519F43693O288O642O176N270L935K198K20j879l932n683p147q738j0636j2342
$$ 643693 649981 656623 662799 668069 672004 674202 674422 672543 668611 662928 655781 647043 636407 624065
59505F24065j3316j3602j3417j2547j0818q849p515o810n929m537l255k717k738
$$ 624065 610749 597147 583730 571183 560365 551516 544001 537191 531262 526725 523470 520753 518015
59492E18015k662k136j326o40l92m56k01R55K774M257M657M210L729L748M204
$$ 518015 515353 513217 511891 511251 510859 510403 510202 511157 513931 518188 522845 527055 530784 534532 538736
59477E38736M871N705O824Q212R575J0413J0343R420Q147O995N910M396K199j40
$$ 538736 543607 549312 556136 564348 573923 584336 594679 604099 612246 619241 625151 629547 631746 631606
59463F31606j688k014j536q85k20O56J800L103M636O570Q767J0796J2421J3772
$$ 631606 629918 627904 626368 625483 625263 625919 627719 630822 635458 642028 650795 661591 674012 687784
59449F87784J4969J5913J6565J7086J7468J7309J6099J3576R624M165k480r273
$$ 687784 702753 718666 735231 752317 769785 787094 803193 816769 826393 830558 828078 818805
59437H18805j4843j8337j9701j9312j7547j4894j2203j0507j0255j0842j1096
$$ 818805 803962 785625 765924 746612 729065 714171 701968 691461 681206 670364 659268
59426F59268j0373r034p680o262m257j461J801N182Q519J1544J3956J5914J7982
$$ 659268 648895 639861 632181 625919 621662 620201 622002 627184 635703 647247 661203 677117 695099
59413F95099K0323K2447K4078K5796K8177L0395L0130K5070J4584L90j3987k4706
$$ 695099 715422 737869 761947 787743 815920 846315 876445 901515 916099 916489 902502 877796
59401H77796k9421k8343k3617j7462j0764l416M046R361R551L370p220j8218k6226
$$ 877796 848375 820032 796415 778953 768189 764773 768819 778180 787731 791101 783881 765663 739437
59388G39437l0032l0213k8007k4627k0945j7289j3683j0398p978o558n571m395
$$ 739437 709405 679192 651185 626558 605613 588324 574641 564243 556265 549707 544136 539741
59376E39741k963j553l17O47J108R63N69M46Q32J682K835L865M144L542K870L053
$$ 539741 536778 535225 534908 535555 536663 537626 538195 538641 539473 541155 543990 547855 551999 555541 558411 561464
59360E61464M016M872N163N325N867O684P459Q259R373J0781J2205J3478J4699
$$ 561464 565480 570352 575515 580840 586707 593391 600850 609109 618482 629263 641468 654946 669645
59347F69645J6003J7463J9082K0724K2033K2685K2695K2322K1628K0358J8335
$$ 669645 685648 703111 722193 742917 764950 787635 810330 832652 854280 874638 892973
59336H92973J5765J2970R902O181J625l393q069j1565j3483j4260j5006j6480
$$ 892973 908738 921708 931610 937791 939416 936023 927954 916389 902906 888646 873640 857160
59324H57160j8159j8814j8116j7032j6408j5807j4384j2323j0462q962p348n900
$$ 857160 839001 820187 802071 785039 768631 752824 738440 726117 715655 706693 699345 693445
59312F93445n724p027q282p838n903m150l622l600k613j14K978N327O682Q149
$$ 693445 687721 680694 672412 664574 658671 654521 650899 647299 644686 644572 647550 652877 659559 667708
59298F67708J0852J4500J7633J8964J7916J4096P373j196r264j4684j6866j6518
$$ 667708 678560 693060 710693 729657 747573 761669 769042 767846 758582 743898 727032 710514
59286G10514j4646j2164r776p659n491l185j137M43J898L403M514N042N716P274
$$ 710514 695868 683704 673928 666269 660778 657593 656456 656899 658797 662200 666714 671756 677472 684746
59272F84746R339J1059J2451J4190J6201J7491J7459J6518J5268J3701J1539Q843
$$ 684746 694085 705144 717595 731785 747986 765477 782936 799454 814722 828423 839962 848805
59260H48805N849K570j183n380r547j2951j5082j6066j6426j6478j6166j5561
$$ 848805 854654 857224 856041 850661 841114 828163 813081 797015 780589 764111 747945 732384
59248G32384j4931j4196j2824j0703q532o904n550m042k577j360J63K459M734
$$ 732384 717453 703257 690433 679730 671198 664294 658744 654702 652125 650765 650928 653387 658121
59235F58121N684N261M618M457M522M643N071N518N009L148O65j735m123o592
$$ 658121 663805 669066 673684 678141 682663 687306 692377 697895 702904 706052 706717 704982 700859 694267
59221F94267q602r741j0381j0963j1231j0807r974r279q757q192p705p476p195
$$ 694267 685665 675924 665543 654580 643349 632542 622568 613289 604532 596340 588635 581159 573964
59208E73964o443n366m421l611k577j312k20M79R90J485J878K118K425L078M063
$$ 573964 567521 562155 557734 554123 551546 550234 550014 550493 551483 552968 554846 556964 559389 562467 566530
59193E66530N030N555N501N141M831M651M478M285M089L711L043K534K851L865
$$ 566530 571560 577115 582616 587757 592588 597239 601717 606002 610091 613802 616845 619379 622230 626095
59179F26095M591M368L677L420L767M198M368M465M890N841P133Q286Q894R114
$$ 626095 630686 635054 638731 642151 645918 650116 654484 658949 663839 669680 676813 685099 693993 703107
59165G03107R444R989J0331J0290J0268J0497J0440R417P479N186K803K44k453
$$ 703107 712551 722540 732871 743161 753429 763926 774366 783783 791262 796448 799251 799495 797042
59152G97042n080p495r512j0785j1299j1620j2186j2509j1775j0078q425p507
$$ 797042 791962 784467 774955 764170 752871 741251 729065 716556 704781 694703 686278 678771
59140F78771p063o500n672m863m439m531m778m406l068j469o44o46n79N9Q07J230
$$ 678771 671708 665208 659536 654673 650234 645703 640925 636519 633451 631982 631338 630692 630113 630172 630979 632209
59124F32209J701K757M203N388O041O384O709P185P860Q480Q644Q426Q523R285
$$ 632209 633910 636667 640870 646258 652299 658683 665392 672577 680437 688917 697561 705987 714510 723795
59110G23795J0019R777Q662P664P368P431P401P293P194O865O099N011L770K383
$$ 723795 733814 743591 752253 759917 767285 774716 782117 789410 796604 803469 809568 814579 818349 820732
59096H20732J068L07J39k02j392l038m155m441m378m148l282j734n76q98k387
$$ 820732 821800 822107 822246 822044 820652 817614 813459 809018 804640 800492 797210 795476 794900 794002 791615
59081G91615l700m279n032o957r609j1506j1860j1342j1033j1122j1028j0448
$$ 791615 787915 783636 778604 771647 762038 750532 738672 727330 716297 705175 694147 683699
59069F83699r713r107q450p595o825o402o062n411m619m175m122m059l849l656
$$ 683699 673986 664879 656429 648834 642009 635607 629545 624134 619515 615340 611218 607159 603310 599654
59055E99654l340k534j537j323k222l190l100k211j658j714j525n32O45J138R52
$$ 599654 596314 593780 592243 590920 588698 585508 582408 580197 578539 576825 575300 574768 575413 576551 577503
59040E77503P68R27J117R80O18L85L93M18K90K14N34J301K282L391M728O140P183
$$ 577503 578271 579198 580315 581295 581913 582298 582691 583109 583399 583613 584147 585448 587730 591121 595849 601989 609172
59023F09172P827Q762J0556J2770J4409J5126J5430J5713J5596J4466J2208R272
$$ 609172 616999 625761 636317 649087 663496 678622 694052 709765 725361 739827 752035 761307
59011G61307O135L030O3k522m290m972m805m309l634k477p83R53K397L884N679
$$ 761307 767442 770472 770535 768013 763723 758751 753946 749637 746003 743526 742743 743696 746093 749977 755656
58996G55656P162P550P145P001P326P127N683L615K060J311P36l98k328m745o989
$$ 755656 762818 770368 777513 784514 791840 798967 804650 808265 810325 811636 812372 811974 809646 804901 797912
58981G97912q513r306r703r771r270q201o902n466l532r60J757M040N838P443
$$ 797912 789399 780093 770390 760619 751349 743148 736246 730780 727248 726288 728045 732085 737923 745366
58967G45366R006J0485J1779J2735J3306J3793J4549J5296J5242J4081J2364J0544
$$ 745366 754372 764857 776636 789371 802677 816470 831019 846315 861557 875638 888002 898546
58955H98546Q274N070J246k458n855r324j2940j6089j8016j8466j7884j7162j6973
$$ 898546 906820 911890 913136 910678 904823 895499 882559 866470 848454 829988 812104 794942 777969
58942G77969j7079j6500j4583j1759q985o749n010l720k951k570k307k107k117
$$ 777969 760890 744390 729807 718048 709063 702314 697304 693584 690633 688063 685756 683649 681532
58929F81532k336k634l027l618m319m835m952m631l902k946k198k057k414k611
$$ 681532 679196 676562 673535 669917 665598 660763 655811 651180 647278 644332 642134 640077 637663 635052
58915F35052k061q63J99L98q3j58R90K859M103M053L360L097L781N438P937J0787
$$ 635052 632991 632128 632327 632725 632642 632484 633474 636333 640436 644489 647849 650946 654727 660165 668102 678889
58899F78889J3105J4399J5119J5945J6771J6901J6013J4511J3028J2137J2337
$$ 678889 691994 706393 721512 737457 754228 771129 787142 801653 814681 826818 839155
58888H39155J3778J5992J8373K0901K3852K6810K8572K8294K6331K3587K0338
$$ 839155 852933 868925 887298 908199 932051 958861 987433 1015727 1042058 1065645 1085983
58877A085983J6100J0607M499j146n805r828j3784j7756k1405k4409k6430k6943
$$ 1085983 1102083 1112690 1117189 1116043 1110238 1100410 1086626 1068870 1047465 1023056 996626 969683
58865I69683k5597k2852j9761j7044j4813j3118j2143j1644j0924r798r006r208
$$ 969683 944086 921234 901473 884429 869616 856498 844355 832711 821787 811989 802983 793775
58853G93775r995j0499j0515j0431j0354j0024r440q860q286p479o553n973n986
$$ 793775 783780 773281 762766 752335 741981 731957 722517 713657 705371 697892 691339 685366 679380
58840F79380o389o894p234p043o130m980m503n047n968o349n905n094m483m170
$$ 679380 672991 666097 658863 651820 645690 640710 636207 631160 625192 618843 612938 607844 603361 599191
58826E99191l774k977j985j332j239j401j436j213o38M48J903L203M060M770N625
$$ 599191 595417 592440 590455 589123 587884 586483 585047 583834 583196 583644 585547 588750 592810 597580 603205
58811F03205O294O218N326M001K623J534J137J431J717J234M1j168j934k286k371
$$ 603205 609499 615717 621043 625044 627667 629201 630338 631769 633486 634720 634761 633593 631659 629373 627002
58796F27002k323k411k835l402l743l771l645l493l427l496l347k381o17J020
$$ 627002 624679 622268 619433 616031 612288 608517 604872 601379 597952 594456 591109 588728 588111 589131
58782E89131J887K528L765N276O000N683N054M655M331L845L142J896k20k712
$$ 589131 591018 593546 597311 602587 608587 614270 619324 623979 628310 632155 635297 637193 636973 634261
58768F34261m470n077n233n687o429p104p602p860p667o946n824m295k313k87
$$ 634261 629791 624714 619481 613794 607365 600261 592659 584799 577132 570186 564362 560067 557754 557467
58754E57467J107J836K587L718M681M876M535M324M419M482M281M022M080M628
$$ 557467 558574 560410 562997 566715 571396 576272 580807 585131 589550 594032 598313 602335 606415 611043
58740F11043N497O351P041P684Q276Q510Q255P897P765P584P021O502O705P425
$$ 611043 616540 622891 629932 637616 645892 654402 662657 670554 678319 685903 692924 699426 706131 713556
58726G13556P710P116O068N040M130L485L286L227K799K192K087K522K940L456
$$ 713556 721266 728382 734450 739490 743620 747105 750391 753618 756417 758609 760696 763218 766158 769614
58712G69614M867P017Q426Q244P433P146O890N453K865K12k061m462p244j0084
$$ 769614 774481 781498 789924 798168 805601 812747 819637 825090 827955 828167 826106 821644 814400 804316
58698H04316j2899j5940j8878k0730k1018k0323j9415j8459j7331j6101j4734
$$ 804316 791417 775477 756599 735869 714851 694528 675113 656654 639323 623222 608488
58687F08488j2863j0398q079o777o357n808m617l479l332m087m838n062m993m829
$$ 608488 595625 585227 577148 570371 564014 558206 553589 550110 546778 542691 537853 532791 527798 522969
58673E22969m282l202k020j087r6J336K839L796M445N656P688R774J1121J1732
$$ 522969 518687 515485 513465 512378 512282 513618 516457 520253 524698 530354 538042 547816 558937 570669
58659E70669J1997J1923J0961Q456M364k31l565m710m522m550n149n364m541l227
$$ 570669 582666 594589 605550 614006 618370 618139 614574 609864 605342 600792 595643 590279 585738 582511
58645E82511k354k241k686l327l703l464k809k285j948j286o2J288K257K781L009
$$ 582511 580157 577916 575230 571903 568200 564736 561927 559642 557694 556408 556346 557634 559891 562672 565681
58630E65681L108L343L772L769K585N34j060j397r93p67r54j233j210n07J060
$$ 565681 568789 572132 575904 579673 582258 582792 581732 580335 579342 578575 577621 576388 575178 574671 575731
58615E75731L064M781O185P885R940J1499J1960J1645J0888R313O612L414P04
$$ 575731 578795 583576 589761 597646 607586 619085 631045 642690 653578 662891 669503 672917 673621
58602F73621j052j797j634j210j630l146m581m735l962l558m062m874n259m955
$$ 673621 672569 670772 669138 667928 666298 663152 658571 653836 649874 646316 642254 637380 632121 627166
58588F27166l994k525p73J232L670O384Q739J0363J1543J2501J2825J2226J1291
$$ 627166 623172 620647 619874 621106 624776 631160 639899 650262 661805 674306 687131 699357 710648
58575G10648J0749J0396R428P669N788M528M211M906O468Q556J0948J3674J6618
$$ 710648 721397 731793 741221 748890 754678 759206 763417 768323 774791 783347 794295 807969 824587
58562H24587J9357K1692K3995K6534K8897L0432L0822K9786K6790K1750J5673
$$ 824587 843944 865636 889631 916165 945062 975494 1006316 1036102 1062892 1084642 1100315
58551A100315R902M911M22l565o576q382r335r893j0201j0198r986j0010j0908
$$ 1100315 1110217 1115128 1115550 1111985 1105409 1097027 1087692 1077799 1067598 1057400 1047414 1037404 1026496
58538A026496j2951j5657j8282k0614k2755k4285k4448k3292k1745k0229j8106
$$ 1026496 1013545 997888 979606 958992 936237 911952 887504 864212 842467 822238 804132
58527H04132j5006j1780r428p796o055l921j786q5Q99J105J079J701L003L869
$$ 804132 789126 777346 767918 760122 754067 750146 748360 748275 749174 750279 751358 753059 756062 759931
58513G59931L439K176J013K07l51n30l95n44j157j410p64q8n04j749k658k814
$$ 759931 763370 765546 766559 766766 766415 765885 765490 764946 763789 762379 761615 761527 761023 759274 756616 753802
58497G53802k709k696k791l144l730l933l282k271j592j065k14P07J214J682K745
$$ 753802 751093 748397 745606 742462 738732 734799 731517 729246 727654 726589 726375 727082 728296 729978 732723
58482G32723M136N284O654R147J2391J4959J6312J7275J8431J9227J8873J7207
$$ 732723 736859 742143 748797 757944 770335 785294 801606 818881 837312 856539 875412 892619
58470H92619J4343J0265N196j91n080q792j0955j1823j2146j2273j1710j0075
$$ 892619 906962 917227 922423 922232 917152 908360 897405 885582 873436 861163 849453 839378
58458H39378p902n843l675r20K065M597O792R156J1377J2537J2243J0668P839
$$ 839378 831476 825633 821958 821038 823103 827700 834492 843648 855025 867562 879805 890473 898312
58445H98312L861m78m281p433j0053j1620j1701j0964j0292r335p309m747k940
$$ 898312 902173 901695 897414 889981 879928 868308 856607 845643 835351 826016 818707 813960 811020
58432H11020j863k62K211M487N773O421O877P141P570Q948J1290J3568J4943J5387
$$ 811020 809157 808895 811106 815593 821366 827787 834664 841805 849375 858323 869613 883181 898124 913511
58418I13511J4903J3128R982O005J809k096n097o876p927q837r283q731p833p842
$$ 913511 928414 941542 951524 957529 959338 957242 952145 945269 937342 928505 919222 910491 902658 894816
58404H94816q766r338q932q218p722p031n774m376l299k333j055N23K062L190
$$ 894816 886050 876712 867780 859562 851840 844809 839035 834659 831360 829027 827972 828495 830557 833747
58390H33747L708L814L890L685K341j80k378k906k250j735j590j171m21L13J330
$$ 833747 837455 841269 845159 848844 851185 851005 848627 845721 843471 841736 840146 838975 838554 838867 840197
58375H40197L012M705N604O235P564R117R742R693J0166J1133J1546J1426J1782
$$ 840197 843209 847914 853518 859753 867317 876434 886176 895869 906035 917168 928714 940140 951922
58362I51922J2622J2953J2810J3267J4425J5227J5387J5554J5523J4257J1906
$$ 951922 964544 977497 990307 1003574 1017999 1033226 1048613 1064167 1079690 1093947 1105853
58351A105853R773Q083N767K806O80M5p4k90O9J334K798M217O182Q520J0067J0581
$$ 1105853 1115626 1123709 1129476 1132282 1132962 1133007 1132933 1132643 1132712 1134046 1136844 1141061 1147243 1155763 1165830 1176411
58335A176411J1141J2236J3238J4091J5542J7279J7912J7347J7122J7675J7338
$$ 1176411 1187552 1199788 1213026 1227117 1242659 1259938 1277850 1295197 1312319 1329994 1347332
58324A347332J4911J1363Q119N517L618K785K530J660K58q5J263L086M437N753
$$ 1347332 1362243 1373606 1381725 1387242 1390860 1393645 1396175 1397835 1398093 1398008 1399271 1402357 1406794 1412547
58310A412547P278Q325Q797R597J0960J2218J3611J6117J9070K0369J9715J9189
$$ 1412547 1419825 1428150 1436947 1446544 1457504 1469722 1483333 1499450 1518520 1538889 1558604 1577793
58298A577793J9816K0116J9038J7792J7468J7245J6304J5487J5695J6598J7861
$$ 1577793 1597609 1617725 1636763 1654555 1672023 1689268 1705572 1721059 1736754 1753352 1771213
58287A771213J9782K1882K2960K3222K4236K6197K7703K8572L0055L1771L1648
$$ 1771213 1790995 1812877 1835837 1859059 1883295 1909492 1937195 1965767 1995822 2027593 2059241
58276B059241K9815K9124L0773L2736L3792L5444L8350M0535M1088M2112M4927
$$ 2059241 2089056 2118180 2148953 2181689 2215481 2250925 2289275 2329810 2370898 2413010 2457937
58265B457937M7787M9504N1834N5926N9785O1902O4066O7908P1705P3424P3965
$$ 2457937 2505724 2555228 2607062 2662988 2722773 2784675 2848741 2916649 2988354 3061778 3135743
58254C135743P4733P4800P3285P1802P1959P2980P4095P6487Q0771Q5510R0241
$$ 3135743 3210476 3285276 3358561 3430363 3502322 3575302 3649397 3725884 3806655 3892165 3982406
58243C982406R6636J04772J11930J17233J23446J32010J40597J47998J56685J67760
$$ 3982406 4079042 4183814 4295744 4412977 4536423 4668433 4809030 4957028 5113713 5281473
58233E281473J78358J87199J97605K11556K26072K39186K54052K73036K93371
$$ 5281473 5459831 5647030 5844635 6056191 6282263 6521449 6775501 7048537 7341908
58224G341908L12984L35003L61734L90190M18449M50334M88536N29617N71482
$$ 7341908 7654892 7989895 8351629 8741819 9160268 9610602 10099138 10628755 11200237
58215A1200237O19021O76394P40869Q10668Q91132R86272J092667J209609J346315
$$ 11200237 11819258 12495652 13236521 14047189 14938321 15924593 17017260 18226869 19573184
58206A9573184J510906J702290J922516K186127K506610K886202L332963L876496
$$ 19573184 21084090 22786380 24708896 26895023 29401633 32287835 35620798 39497294
58198C9497294M554161N397691O450249P779152R452690J1527540J4083462J7233251
$$ 39497294 44051455 49449146 55899395 63678547 73131237 84658777 98742239 115975490
58190A15975490K1044317K5465121L0355339L5470767M0175546M3064381M2106089
$$ 115975490 137019807 162484928 192840267 228311034 268486580 311550961 353657050
58183C53657050L5625487K3550240P874599q141457k1478005l0523908l5277550
$$ 353657050 389282537 412832777 420707376 412565919 391087914 360564006 325286456
58176C25286456l6724092l6006617l3939549l0996046k7519248k3849929k0292004
$$ 325286456 288562364 252555747 218616198 187620152 160100904 136250975 115958971
58169A15958971j7043292j4195491j1774802r764408q114786o766920n672309
$$ 115958971 98915679 84720188 72945386 63180978 55066192 48299272 42626963
58162D2626963m789177m073290l484998k998365k594764k254763j963638j716960
$$ 42626963 37837786 33764496 30279498 27281133 24686369 22431606 20467968 18751008
58154A8751008j512156j340281j192325j066749r63538q76551p98541p28380o66883
$$ 18751008 17238852 15898571 14706246 13639497 12675959 11799408 11000867 10272487 9605604
58145I605604o10502n55398n03332m57484m16380l77260l41522l11605k86281
$$ 9605604 8995102 8439704 7936372 7478888 7062508 6685248 6343726 6032121 5745840
58136E745840k63892k46473k35680k28030k18908k08248j97960j87152j74381
$$ 5745840 5481948 5235475 4999795 4771765 4552857 4344609 4146649 3959497 3785116
58127C785116j61584j51239j42289j32731j23572j16346j09610j01742r4525r0041
$$ 3785116 3623532 3472293 3330004 3197273 3073701 2957355 2847745 2746003 2651478 2561437
58117B561437q6682q2040p7172p4162p1905o8198o3782o0523n7653n3587m9479
$$ 2561437 2474755 2392715 2315543 2241381 2169476 2101278 2037496 1976973 1919320 1865733 1816254
58106A816254m7335m6303m4417m2293m1698m1888m0861l8894l7784l7643l7288
$$ 1816254 1768919 1722616 1678199 1635906 1594208 1552320 1511459 1472565 1434781 1397138 1359850
58095A359850l6661l6146l4830l1923k8670k6546k4923k2812k1142k0993k1156
$$ 1359850 1323189 1287043 1252213 1220290 1191620 1165074 1140151 1117339 1096197 1075204 1054048
58084A054048j9946j7946j6607j5770j4792j4450j5375j6272j6010j5746j6725
$$ 1054048 1034102 1016156 999549 983779 968987 954537 939162 922890 906880 891134 874409
58073H74409j7837j7709j7238j7556j7495j5818j4027j4021j4712j3952j2197
$$ 874409 856572 838863 821625 804069 786574 770756 756729 742708 727996 714044 701847
58062G01847j1233j0778r443p769p217p293o650n980o914q971j0324j0654j0648
$$ 701847 690614 679836 670393 662624 655407 648114 641464 635484 628570 619599 609275 598621 587973
58049E87973r835p712n809n728o240n169l124k295k601k352j831k786m821n670
$$ 587973 578138 570426 564617 558889 552649 547480 544356 542061 539460 537108 535277 532491 527670 522000
58035E22000m883m171m183l949l502m103n656o640o849p596r014r679r155q521
$$ 522000 517117 512946 508763 504814 501312 497209 491553 484913 478064 470468 461454 451775 442620 434099
58021D34099q155p276n916n148n098m810m172m007m258m058l536l438l267j974
$$ 434099 425944 418668 412752 407604 402506 397696 393524 389517 385259 381201 377665 374227 370960 368986
58007C68986l35k02j336j570k89P10L60q9O65K181L467M318M827N043N400O079
$$ 368986 368651 368449 367113 365543 365254 365964 366324 366235 366900 369081 372548 376866 381693 386736 392136 398215
57991C98215O062M320J787K56m13j800l845m722m046l636m466n218m695l581k842
$$ 398215 404277 408597 410384 410640 410227 408427 404582 399860 395814 392178 387712 382494 377799 374218 371376
57976C71376k265j572j365j913k371k039j283o21r7J20j93l63N42K000K499J945
$$ 371376 369111 367539 366174 364261 361890 359851 358568 357947 357850 357970 357777 357414 357956 359956 362455 364400
57960C64400J845K737L293K576J406P50L64j18k87k6j13r99k053k688l053l106
$$ 364400 366245 368982 372275 374851 376257 377007 377371 377253 376966 376940 376827 375828 373775 371087 368034 364928
57944C64928k359j045k67l69m23K12J069J835K963M503N694O373P384Q925R893
$$ 364928 362569 361524 361257 360888 360465 360677 361746 363581 366544 371047 376741 383114 390498 399423 409316
57929D09316R596Q795Q248P515O030M142K300K85j965l892n394p198r374j0700
$$ 409316 418912 427707 435955 443470 449500 453642 455942 456227 454262 450370 444976 437778 428404 417704
57915D17704j0363r222q503q208p691o865n950m829l442k112r89O0O13j83k084
$$ 417704 407341 398119 389616 381408 373717 366852 360902 356073 352631 350519 349530 349590 350203 350020 347936
57900C47936l580l849l762m253m877m891m543m293l750k538j373j177j746k202
$$ 347936 344356 340507 336745 332492 327615 322724 318181 313888 310138 307600 306227 305050 303304 301102
57886C01102k136j526k73J276K033J358m4j152j891k559k727j852n39j57j256
$$ 301102 298966 297440 297167 298443 300476 301834 301790 300638 298747 296188 293461 291609 291070 290913 289657
57871B89657l039m263m255l321k473k458k876k812k317k336k960k902j347P90
$$ 289657 286618 282355 278100 274779 272306 269848 266972 264160 261843 259507 256547 253645 252298 253088
57857B53088K251L108M071N038N442N507N979O975P944Q554Q752Q296P007N374
$$ 253088 255339 258447 262518 267556 272998 278505 284484 291459 299403 307957 316709 325005 332012 337386
57843C37386M167L531L027K386J732J151M88m11j499k483k989k974k865k922k673
$$ 337386 341553 345084 348111 350497 352229 353380 353868 353457 351958 349475 346486 343512 340647 337725 335052
57828C35052j641l90J24Q2O00J763K243J360K68L30J286J971J987J721J393J004
$$ 335052 333411 333021 333145 333227 333827 335590 337833 339193 339461 339791 341077 343048 345035 346756 348149 349153
57812C49153P53O56J29j412l818o481q849j0306j0309r176q095p721p443o530
$$ 349153 349906 350562 350691 349279 345461 338980 330131 319825 309516 300340 292245 284524 277081 270551
57798B70551n223m083l043j888j002p37o77l09O4q4n17o26l44Q3P72J823K774
$$ 270551 265328 261245 258202 256314 255312 254575 253898 253589 253653 253569 253052 252426 252082 252165 252937 254760 257534
57781B57534L161L302L725M270M477M509M862N460N786N699N440N096M596L964
$$ 257534 260695 263997 267722 271992 276469 280978 285840 291300 297086 302785 308225 313321 317917 321881
57767C21881L070J560m84k264l281m091n350o715p441p619p864q189q108p615
$$ 321881 324951 326511 326027 323763 320482 316391 311041 304326 296885 289266 281402 273213 265105 257490
57753B57490p126o617n654m254k936j926r65N3P61O85l54j962l094k703r49O89
$$ 257490 250364 243747 238093 233839 230903 228977 228012 228065 228826 229511 229157 227195 224101 221398 220449 221138
57737B21138J048N04Q1J9j1J20P21J370J338P83N72R73J413J558J709K033K171
$$ 221138 222186 222690 222771 222790 222779 222899 223620 224990 226328 227111 227683 228656 230069 231627 233336 235369 237540
57720B37540J849J262P28L92L13L31k5j019k103k420j909j366j409j862k220k224
$$ 237540 239389 240651 241379 241771 242084 242415 242390 241371 239268 236848 234939 233573 232164 230302 228082 225858
57704B25858j970j802k085k719l009k423j390q14q94r54m55L43Q32P43K56l04
$$ 225858 223888 222086 220001 217282 214273 211850 210460 209646 208752 207798 207343 207686 208518 209261 209517 209213
57688B09213p54j115j408j385p51K63R34R28P87J181K073L091M335O241Q882J1989
$$ 209213 208459 207344 205936 204551 203800 204063 204997 205925 206712 207893 209966 213057 217392 223633 232515 244504
57672B44504J5552J9882K5112L1114L7969M6052N5319O4439P0533O9856N9457
$$ 244504 260056 279938 305050 336164 374133 420185 475504 539943 610476 680332 739789
57661G39789L9027J1622j7335m2072n8568o5907o6113o2146n5840m7849l9126
$$ 739789 778816 790438 773103 731031 672463 606556 540443 478297 422457 374608 335482
57650C35482l1216k4897j9676j5121j1678r536p736n465l418k731l074k931j591
$$ 335482 304266 279369 259693 244572 232894 223358 215622 210157 206739 204008 200934 198003 196412
57637A96412K38J654K435K714K570K142J598R74M11L66J045J837J901J169K91
$$ 196412 196650 198304 200739 203453 206023 208165 209763 210737 211148 211514 212559 214396 216297 217466 217757
57622B17757l22q21j416j994k252j940j105k83j06n54r06o97j82K66N51L78o80
$$ 217757 217435 216614 215198 213204 210952 209012 207907 207624 207518 206964 206058 205361 205179 205445 205996 206374 205694
57605B05694k178k843k283j728k191k853k415j238p82j414k217k649l045l493
$$ 205694 203516 200673 198390 196662 194471 191618 189203 187965 187183 185769 183552 180903 177858 174365
57591A74365l547l194l027l263l466l358l088k690k034j404j292j622j880j918
$$ 174365 170818 167624 164597 161334 157868 154510 151422 148732 146698 145294 144002 142380 140500 138582
57577A38582j974j981j690j340j380j634j525j094r22j126j243j101r78r19o90
$$ 138582 136608 134627 132937 131597 130217 128583 127058 125964 125042 123916 122673 121572 120594 119675 118985
57562A18985m08m27o50o68n14m89m41n3K93k3o77p41j73K00L04J079K735L928
$$ 118985 118577 118150 117500 116832 116318 115829 115388 115335 115628 115605 114928 114187 114014 114214 114518 115597 118332 122260
57544A22260L388J575Pm56j33K92N25P69J386K292K801K322J099j77j154j813
$$ 122260 125648 127223 127230 126774 126641 126933 127458 128227 129613 131905 134706 137028 138127 137950 136796 134983
57528A34983j977j574j138j227j487j133j74O38J015J320J648J670J425J353J470
$$ 134983 133006 131432 130294 129067 127580 126447 126273 126911 127926 129246 130894 132564 133989 135342 136812
57513A36812J319Q75O23P67J093J548K112K219J383K79P4O53P24k18j278j705
$$ 136812 138131 139006 139629 140396 141489 143037 145149 147368 148751 149030 149104 149757 150481 150263 148985 147280
57497A47280j797j947j997j934k138k522k518k203k309k759k526j448p94j284
$$ 147280 145483 143536 141539 139605 137467 134945 132427 130224 127915 125156 122630 121182 120388 119104
57483A19104j876j472o69o15j115j053j31R44J584J643J015k13j459k148k315
$$ 119104 117228 115756 115087 114472 113357 112304 112173 113117 114701 116344 117359 117146 115687 113539 111224
57468A11224k253j968j448r99q32p17m99l78l45L4Q17J336J219J074J531K191
$$ 111224 108971 107003 105555 104556 103724 103007 102508 102130 101785 101819 102636 103972 105191 106265 107796 109987
57452A09987K213J469N15k39o48o50m16l53n00m64k69n24j263j451m27Q77J134
$$ 109987 112200 113669 114184 113945 113297 112647 112231 111878 111378 110914 110645 110121 108858 107407 106980 107857 108991
57435A08991M73J69P60J520J630J028Q0q13j177o65M68J449J692J232N46Q1j01
$$ 108991 109464 109633 110393 111913 113543 114571 114651 113838 112661 111996 112464 113913 115605 116837 117383 117464 117363
57418A17363l07p35j154j220j023q16m81J89P84O68J11K2N26P70L34j94l91n59
$$ 117363 117056 116321 115167 113947 112924 112108 111627 111816 112600 113268 113379 113401 113927 114697 115031 114837 114446 113887
57400A13887o91j40J001J428M45q37j162r16j054j238n07Q20J476J270J301K220
$$ 113887 113196 113056 114057 115485 115930 115093 113931 113015 111961 110723 110216 111036 112512 113782 115083 117303
57384A17303L412M006L778K980K030J436J290J066M31m3K01M92l08k013l145k883
$$ 117303 120715 124721 128499 131479 133509 134945 136235 137301 137732 137689 137890 138382 138074 136061 132916 130033
57368A30033j961j441j459j509j349j151j077j023o94J2O66P07K96K63R01J417
$$ 130033 128072 126631 125172 123663 122314 121163 120086 119063 118369 118381 119047 119754 120050 120313 121214 122631
57352A22631J165P35J011J722J878J294O84M27K60R3J79M28M65L94P02J239J171
$$ 122631 123796 124531 125542 127264 129142 130436 131120 131547 131807 131900 132079 132507 132972 133366 134068 135307 136478
57335A36478J44j133j741j364k01J325K541K801K078R61m3q06j282j388j261j183
$$ 136478 136622 135489 133748 132384 132183 133508 136049 138850 140928 141889 141846 141040 139758 138370 137109 135926
57319A35926j122q19l00J11L30N75Q78R64P57N93P99J348J937K183J827J087O61
$$ 135926 134804 133985 133685 133796 134126 134701 135579 136543 137300 137893 138692 140040 141977 144160 145987 147074 147735
57302A47735R76J542J476N75n24j135j013k66P25J332J227Q97J116J896K474K414
$$ 147735 148711 150253 151729 152304 151780 150645 149632 149366 150091 151423 152650 153547 154663 156559 159033 161447
57286A61447K101K059K217K134J647R90N35M78P84J288J913K642L290L573L543
$$ 161447 163548 165607 167824 169958 171605 172595 173130 173608 174392 175680 177593 180235 183525 187098 190641
57271A90641L647M086M483M473M289M380M765N188N541N704N276M123K892K370
$$ 190641 194288 198374 202857 207330 211619 215999 220764 225952 231493 237197 242473 246596 249488 251858
57257B51858K460K432K041J762J922K304K680L149L745M143L989L306K474J966
$$ 251858 254318 256750 258791 260553 262475 264779 267459 270608 274353 278496 282485 285791 288265 290231
57243B90231K080K710L433L969M412M862N141N134N104N318N617N708N628N561
$$ 290231 292311 295021 298454 302423 306835 311697 316838 321972 327076 332394 338011 343719 349347 354908
57229C54908N523N549N867O502P015P083O927O870O837O806P215Q290R433R980
$$ 354908 360431 365980 371847 378349 385364 392447 399374 406244 413081 419887 427102 435392 444825 454805
57215D54805J0171J0676J1483J2121J2632J3440J4372J4723J4331J3834J3843
$$ 454805 464976 475652 487135 499256 511888 525328 539700 554423 568754 582588 596431
57204E96431J4444J5528J6951J8362J9451K0323K1128K1528K1142K0320J9805
$$ 596431 610875 626403 643354 661716 681167 701490 722618 744146 765288 785608 805413
57193H05413J9716J9609J9460J9754K0575K1351K1733K2085K2870K4014K5078
$$ 805413 825129 844738 864198 883952 904527 925878 947611 969696 992566 1016580 1041658
57182A041658K5697K5824K5822K6247K7199K8096K8484K8740K9390L0146L0294
$$ 1041658 1067355 1093179 1119001 1145248 1172447 1200543 1229027 1257767 1287157 1317303 1347597
57171A347597K9899K9736L0148L0691L0998L1258L1707L2175L2374L2202L1802
$$ 1347597 1377496 1407232 1437380 1468071 1499069 1530327 1562034 1594209 1626583 1658785 1690587
57160A690587L1601L2174L3599L5141L6086L6619L7401L8544L9641M0552M1427
$$ 1690587 1722188 1754362 1787961 1823102 1859188 1895807 1933208 1971752 2011393 2051945 2093372
57149B093372M2088M2150M1742M1471M1676M2145M2435M2011M0467L8208L6530
$$ 2093372 2135460 2177610 2219352 2260823 2302499 2344644 2387079 2429090 2469557 2507765 2544295
57138B544295L6307L6898L7077L6727L6770L7792L9596M1936M4626M7103M8797
$$ 2544295 2580602 2617500 2654577 2691304 2728074 2765866 2805462 2847398 2892024 2939127 2987924
57127B987924M9921N1051N2058N2334N1979N1855N2512N3925N6267O0057O5383
$$ 2987924 3037845 3088896 3140954 3193288 3245267 3297122 3349634 3403559 3459826 3519883 3585266
57116C585266P1683P8312Q4791R0781R6552J03393J12798J25398J41168J60302
$$ 3585266 3656949 3735261 3820052 3910833 4007385 4110778 4223576 4348974 4490142 4650444
57106D650444J83128K09770K40937K78848L26456L86022M59281N48784O58456
$$ 4650444 4833572 5043342 5284279 5563127 5889583 6275605 6734886 7283670 7942126
57097G942126P93232R58662J160027J400892J682656K005117K365399K755164
$$ 7942126 8735358 9694020 10854047 12254939 13937595 15942712 18308111 21063275
57089B1063275L160269L563694L946508M285640M555244M733379M803881M749272
$$ 21063275 24223544 27787238 31733746 36019386 40574630 45308009 50111890 54861162
57081E4861162M549601M198715L719097L147420K499726J758668R02346n6962
$$ 54861162 59410763 63609478 67328575 70475995 72975721 74734389 75636735 75579773
57073G5579773j064665k046645k934159l675183m238451m615050m813909m852591
$$ 75579773 74515108 72468463 69534304 65859121 61620670 57005620 52191711 47339120
57065D7339120m752245m538583m241610l891161l513418l130795k761428k417080
$$ 47339120 42586875 38048292 33806682 29915521 26402103 23271308 20509880 18092800
57057A8092800k103369j823073j577928j367243j187256j033191r01026p87175
$$ 18092800 15989431 14166358 12588430 11221187 10033931 9000740 8099714 7312539
57049G312539o88276o02137n27693m63609m07906l59179l16981k80744k49450
$$ 7312539 6624263 6022126 5494433 5030824 4622918 4263739 3946758 3666014 3416564
57040C416564k22501j99649j79889j61645j44278j28262j13742j00117q7135p5002
$$ 3416564 3194063 2994414 2814525 2652880 2508602 2380340 2266598 2166481 2079346 2004344
57030B004344o3121n0106l5472j9936l458J5462L7091N7349O8287O2094L5701
$$ 2004344 1941223 1891117 1855645 1835709 1832251 1847713 1884804 1942153 2010440 2072534 2108235
57019B108235o633n4342r5335j21808j32729j31743j23510j11714r8788q6116
$$ 2108235 2101602 2047260 1951925 1830117 1697388 1565645 1442135 1330421 1231633 1145517
57009A145517p4331o3859n5135m8305m2965l8376l3858k9200k4922k1895k0372
$$ 1145517 1071186 1007327 952192 903887 860922 822546 788688 759488 734566 712671 692299
56998F92299j9596j8752j7872j7344j6921j6007j4594j3133j1616r568o930m220
$$ 692299 672703 653951 636079 618735 601814 585807 571213 558080 546464 536896 529966 525746
56986E25746j739Q28L886P385J0671J2547J1763Q004K257m141j0352j5634j8911
$$ 525746 524007 524835 528721 536106 546777 559324 571087 579091 581348 577207 566855 551221 532310
56973E32310j9706j9008j8162j7208j5309j2477r663p270m764j845J026L537O009
$$ 532310 512604 493596 475434 458226 442917 430440 420777 413507 408743 406898 407924 411461 417470
56960D17470Q790J1960J5707K0124K4324K6498K5177K0008J1512R37r619j7961
$$ 417470 426260 438220 453927 474051 498375 524873 550050 570058 581570 582507 572888 554927
56948E54927k3233k6066k7225k6748k4552k1129j7135j2916q687m841j606J317
$$ 554927 531694 505628 478403 451655 427103 405974 388839 375923 367236 362395 360789 362106
56936C62106M546Q495J3033J7644K2010K6428L1154L5027L5386L0081J9327N311
$$ 362106 366652 375147 388180 405824 427834 454262 485416 520443 555829 585910 605237 610548
56924F10548r427k2584l2017l6503l6663l4317l0951k7275k3728k0457j7093j3564
$$ 610548 601121 578537 546520 510017 473354 439037 408086 380811 357083 336626 319533 305969
56912C05969j0803r700r651r237q141p172o523n406l553j826r59p06n00p8P66
$$ 305969 295166 285466 275815 266578 258437 251265 244742 239336 235783 233957 232998 232292 231792 231714 232480
56897B32480K084L312L761L779M458O085P933R696J2002J5147J8486K1470K4236
$$ 232480 234564 237876 241637 245416 249874 255959 263892 273588 285590 300737 319223 340693 364929
56884C64929K6469K6648K3162J5829O038m003j2070j6907j8901j9260j8413j6052
$$ 364929 391398 418046 441208 457037 463075 459072 447002 430095 411194 391934 373521 357469
56872C57469j2587r308o662l619P03N783J0732J5612K0944K6827L3274M0665M8980
$$ 357469 344882 335574 328912 325293 325996 331779 342511 358123 379067 405894 439168 479833 528813
56859E28813N6934O2475O3583N8293M5174K4992J565k0067l6353m6074m9470m7656
$$ 528813 585747 648222 711805 770098 815272 840264 841829 821762 785409 739335 689865 642209
56847F42209m2539l6140k9500k2512j4706o023L061J1869K0245K8981L9193N1107
$$ 642209 599670 563530 534030 511518 496812 490789 493850 505719 525964 554945 594138 645245
56835F45245O3931P6892Q9531J00248J05111R9132P9209M6385O056l3803o5785
$$ 645245 709176 786068 875599 975847 1080958 1180090 1259299 1305684 1311740 1277937 1212152
56824A212152q5989r4702r4535q8222p7962o5762n3380m1855l1379k1653j2215
$$ 1212152 1126163 1031461 936926 848704 770742 704980 651600 609745 578366 556713 544498
56813E44498k743O830J6548K6655L7332M8281N8843O8072P3893P2602O0580L7425
$$ 544498 541755 548585 565133 591788 629120 677401 736244 804316 878209 950811 1011391 1048816
56801A048816P179k3703m9465o6877p5471p6807p3016o5764n6505m7041l8681
$$ 1048816 1055995 1032292 982827 915950 840479 763672 690656 624892 568387 521346 482665
56790D82665l1087k3142j5047q160k705K861R576J6567K2738K8421L4011L8003
$$ 482665 451578 428436 413389 405229 402524 405385 414961 431528 454266 482687 516698 554701
56778E54701L7746L1790K0542N448j1298k6685l8041m4444m6482m5028m1021l5935
$$ 554701 592447 624237 644779 650227 638929 612244 574203 529759 483277 438249 397228 361293
56766C61293l1228k7234k3408j9592j6222j3424j0832q486p047o780o935o567
$$ 361293 330065 302831 279423 259831 243609 230185 219353 210867 203820 197040 190105 183538
56754A83538n611m717m296m070l617l017k692k714k646k242j844j762j586q04
$$ 183538 177927 173210 168914 164844 161227 158210 155518 152804 150158 147916 146072 144310 142724 141920
56740A41920K20O32L41O7J15L4l71n65k01L00M68M00K92P9j09J38P12Q71L58o7
$$ 141920 142140 142772 143113 143180 143295 143329 142958 142393 142192 142492 142960 143360 143652 143731 143622 143760 144472 145343 145701 145634
56720A45634L36J361K359K921K735J640L51J65J248K136J671N46O7L09O26J134
$$ 145634 145970 147331 149690 152611 155346 156986 157337 157502 158750 160886 162557 163103 163170 163479 164105 165239
56704A65239K309L544L564K246Q79M67P10Q28N86K78K04M25P06O59J59n45j213
$$ 165239 167548 171092 174656 176902 177781 178248 178958 179786 180372 180650 180854 181279 181985 182644 182803 182258 181045
56687A81045j829k206j960j203p11q86j136q31k69k9Q9N28Q93M27o69j395j403
$$ 181045 179216 177010 175050 173847 173136 172250 171114 170283 170014 169985 170074 170602 171495 171922 171253 169858 168455
56670A68455j375j784k123j683n36O07J128Q91J75n08o39nJ070J811J602P35K81
$$ 168455 167080 165296 163173 161490 160954 161561 162689 163580 163755 163247 162608 162603 163673 165484 167086 167821 168102
56653A68102Q29J680J863J634J978K814K922J810M61k65p34j362j459l31J395
$$ 168102 168931 170611 172474 174108 176086 178900 181822 183632 184093 183828 183094 181732 180273 179942 181337
56638A81337K503K709K545K251J718J128Q08P91J070J836K852L193K340R86J23
$$ 181337 183840 186549 189094 191345 193063 194191 194999 195790 196860 198696 201548 204741 207081 208067 208190
56623B08190r4m3J35K31k80j302j734r28J26J45o27j078j003j022j198j080p70
$$ 208190 208096 208053 208188 208419 208139 206837 205103 204175 204301 204446 203819 202741 201738 200716 199518 198438 197668
56606A97668p38q55p62q53j687k700k824k203j975k407k559j886r84m64k30j10
$$ 197668 196930 196075 195313 194460 192773 190073 187249 185046 183071 180664 178105 176219 175235 174771 174541 174431
56590A74431k11l86j26O55J372J513J131N72K66O33J605K376K204J288L39k90
$$ 174431 174220 173834 173708 174363 175735 177248 178379 178951 179217 179850 181455 183831 186035 187323 187662 187372
56574A87372m56K10J669K872K809J902J366J593K190L095M425N534N626N259N914
$$ 187372 186916 187126 188795 191667 194476 196378 197744 199337 201527 204622 209047 214581 220207 225466 231380
56559B31380Q065J0809J3294J5206J5888J4497J1359P875M843K045l53j451j133
$$ 231380 239445 250254 263548 278754 294642 309139 320498 328373 333216 335261 334908 333457 332324
56546C32324o29q54j286j160p34o73r77j321j806k678l738m579m985m855m140
$$ 332324 331695 330841 329555 328395 327661 326988 326011 324690 322884 320206 316468 311889 306904 302049 297909
56531B97909l210k743k972l492l971m546n261n670n309m313l316k901l158l578
$$ 297909 294699 291956 288984 285492 281521 276975 271714 266044 260735 256422 253106 250205 247047 243469
56517B43469l522k950k386j990j339m66k59j047j720j308n59p37j499j602j103
$$ 243469 239947 236997 234611 232621 231282 230816 230557 229510 227790 226482 225923 225186 223687 222085 220982
56502B20982j132j746j916j591j898k966l413k539j412j108j287j259j136j135
$$ 220982 219850 218104 216188 214597 212699 209733 206320 203781 202369 201261 199974 198715 197579 196444
56488A96444r43m95l39n48l58M84J100Q71L59K28K56K16N43J321J600Q03j26l
$$ 196444 195501 195006 194667 194119 193761 194245 195345 196216 196575 196803 197059 197275 197818 199139 200739 201542 201416 201413
56470B01413Q47J214Q24N19Q99J695K322K398J860R94K52j96m94n79j77N82J139
$$ 201413 202260 203474 204298 204817 205716 207411 209733 212131 213991 214985 215237 215041 214547 213968 213791 214373 215512
56453B15512J283J331J346Q78k03j262j557q78M95J881K273J266r0l08N74J139
$$ 215512 216795 218126 219472 220350 220147 218885 217328 216450 216945 218826 221099 222365 222275 221967 222541 223680
56437B23680P48K96N12Q61P13L80K58k4p70j413j306o31N5N62Q05O29L23M89J004
$$ 223680 224428 224724 225236 226097 226810 227190 227448 227424 226654 225241 223935 223304 223359 223921 224726 225355 225678 226167 227171
56418B27171J047N09L65J028J523J006R7j67J84M94O20P42P82P30R51J490J730
$$ 227171 228218 228727 229092 230120 231643 232649 232746 232579 232763 233257 233877 234619 235401 236131 237082 238572 240302
56401B40302J345Q11M55j16r98j369p29K09O34Q20J285J700J581J339J537J823
$$ 240302 241647 242458 242913 242797 241799 240430 239701 239910 240544 241364 242649 244349 245930 247269 248806 250629
56385B50629J536Q72M76M08L73M04N49M36o1l15M9L54Ok95M62J944K873K743K125
$$ 250629 252165 253037 253513 253921 254294 254698 255247 255683 255622 255307 255356 255710 255716 255421 255883 257827 260700 263443 265568
56366B65568J563J121Q41P90P53N01K12J64K40K49L53P85J411J957K196J813P15
$$ 265568 267131 268252 269093 269883 270636 271137 271349 271513 271753 272002 272355 273140 274551 276508 278704 280517 281232
56349B81232k83o1J142J691P39n85r01l49J80N80J192J717J671J313J189J290
$$ 281232 280949 280888 282030 283721 284460 283875 282974 282625 282805 283385 284577 286294 287965 289278 290467 291757
56333B91757J461J939K680K900K224J544J725K260K234J912K206L066L617L424
$$ 291757 293218 295157 297837 300737 302961 304505 306230 308490 310724 312636 314842 317908 321525 324949
56319C24949K660J491K28m02j22K32j72r23j174j004r31p28J20J206J651J433
$$ 324949 327609 329100 329328 328926 328804 329036 328864 327941 326767 325763 324832 324104 324224 325430 327081 328514
56303C28514J233J353J716K497L767M860N149N020N131N176M392K972J845J386
$$ 328514 329747 331100 332816 335313 339080 343940 349089 354109 359240 364416 368808 371780 373625 375011
56289C75011J246J223J366J537J640J973K649L144L166L359M299N451N973N933
$$ 375011 376257 377480 378846 380383 382023 383996 386645 389789 392955 396314 400613 406064 412037 417970
56275D17970N880N906O067O887Q413R566R542R113R346R955J0201J0559J1883
$$ 417970 423850 429756 435823 442710 451123 460689 470231 479344 488690 498645 508846 519405 531288
56262E31288J3620J4499J4624J5333J7197J9582K1975K4410K6885K9579L3298
$$ 531288 544908 559407 574031 589364 606561 626143 648118 672528 699413 728992 762290
56251G62290L8500M4306M9713N5166O1551O8320P4296P9784Q5957R2428R7388
$$ 762290 800790 845096 894809 949975 1011526 1079846 1154142 1233926 1319883 1412311 1509699
56240A509699J00182J01865J02846J01797R7426Q9919P9989O7686N2871L6078
$$ 1509699 1609881 1711746 1814592 1916389 2013815 2103734 2183723 2251409 2304280 2340358
56230B340358J8395R65j5340l0295m4269n7269o8374p6712q2494q6315q8097q7640
$$ 2340358 2358753 2359718 2344378 2314083 2269814 2212545 2144171 2067459 1984965 1898650 1810553 1722913
56218A722913q5628q3052q0089p6504p2565o8600o4382n9902n5860n2316m8023
$$ 1722913 1637285 1554233 1474144 1397640 1325075 1256475 1192093 1132191 1076331 1024015 975992
56207I75992m2506l7547l4781l2971k9833k5659k2694k1498k0399j8369j6053
$$ 975992 933486 895939 861158 828187 798354 772695 750001 728503 708104 689735 673682
56196F73682j3855j1377r057q170q666q860p736n956m330k926j975j968k496k448
$$ 673682 659827 648450 639393 631223 622557 613697 605961 600005 595675 592749 590774 588806 586310 583862
56182E83862j674j029p29k14L77K88k15k5Q39J194Q61J008K030K836K865L035
$$ 583862 582188 581159 580430 580216 580593 580881 580666 580641 581480 582674 583535 584543 586573 589409 592274 595309
56166E95309M018N112N503N404N330N359N563O148O864P222P417Q041Q980R709
$$ 595309 599327 604439 609942 615346 620676 626035 631598 637746 644610 651832 659249 667290 676270 685979
56152F85979J0501J2057J4189J6147J8041K0491K3224K5583K8187L2425L8497
$$ 685979 696480 708537 722726 738873 756914 777405 800629 826212 854399 886824 925321
56141I25321M5532N3346O2507P2983Q4508R7750J13005J27996J38873J43225J40416
$$ 925321 970853 1024199 1086706 1159689 1244197 1341947 1454952 1582948 1721821 1865046 2005462
56130B005462J30027J12619R1922P3390O0233N2559M9624M9856M9019M2054K7981
$$ 2005462 2135489 2248108 2340030 2413420 2473653 2526212 2575836 2625692 2674711 2716765 2744746
56119B744746J0714n377j8334k7164l1101l1798l3724m0851n4236p2842r4275
$$ 2744746 2755460 2750083 2731749 2704585 2673484 2641686 2607962 2567111 2512875 2440033 2345758
56108B345758j14245j28034j33776j32713j26198j14799j00385q6041p3052o0487
$$ 2345758 2231513 2103479 1969703 1836990 1710792 1595993 1495608 1409567 1336515 1276028
56098A276028m8278l8012l0134k3233j6963j2686j0361p792m151j313m49r7R93
$$ 1276028 1227750 1189738 1159604 1136371 1119408 1106722 1096361 1088569 1084418 1083105 1082656 1082559 1083552
56085A083552J885J830J981L141M263M540M747N229N078M448N101P301Q839Q514
$$ 1083552 1085437 1087267 1089248 1092389 1096652 1101192 1105939 1111168 1116246 1120694 1125795 1133096 1141935 1150449
56071A150449Q028Q943J0348J1099J1841J3191J4261J4513J4930J6037J6943J7349
$$ 1150449 1158477 1167420 1177768 1188867 1200708 1213899 1228160 1242673 1257603 1273640 1290583 1307932
56059A307932J8195J9436J9764J9255J9422K0063J9273J7309J6763J7955J8115
$$ 1307932 1326127 1345563 1365327 1384582 1404004 1424067 1443340 1460649 1477412 1495367 1513482
56048A513482J6478J5965J8025K0022J9939J9632K0987K2599K2951K3291K4763
$$ 1513482 1529960 1545925 1563950 1583972 1603911 1623543 1644530 1667129 1690080 1713371 1738134
56037A738134K6047K6376K7504L0201L2372L2970L4155L7104L9518L9917M0438
$$ 1738134 1764181 1790557 1818061 1848262 1880634 1913604 1947759 1984863 2024381 2064298 2104736
56026B104736M2570M4199M3901M4178M7046N0349N1741N2596N4643N6638N7669
$$ 2104736 2147306 2191505 2235406 2279584 2326630 2376979 2428720 2481316 2535959 2592597 2650266
56015B650266N9847O4289O8447P0747P3600P8520Q2776Q4650Q7184R2716R8507
$$ 2650266 2710113 2774402 2842849 2913596 2987196 3065716 3148492 3233142 3320326 3413042 3511549
56004C511549J02034J05720J11815J17674J21032J25023J32779J41857J49236
$$ 3511549 3613583 3719303 3831118 3948792 4069824 4194847 4327626 4469483 4618719
55995D618719J56938J67328J77884J86274J95500K08329K21940K33897K47771
$$ 4618719 4775657 4942985 5120869 5307143 5502643 5710972 5932912 6166809 6414580
55986F414580K66726K87411L06771L28595L56355L86101M13969M43990M80625
$$ 6414580 6681306 6968717 7275488 7604083 7960438 8346539 8760508 9204498 9685123
55977I685123N20778N61626O08704O66881P31420P98051Q73578R65517J070174
$$ 9685123 10205901 10767527 11376231 12043112 12774532 13572583 14446161 15411678 16481852
55968A6481852J183283J313298J470946J655536J866496K118406K428671K801849
$$ 16481852 17665135 18978433 20449379 22104915 23971411 26089817 28518488 31320337
55960C1320337L245223L789064M472380N323067O376299P697355R359584J1420931
$$ 31320337 34565560 38354624 42827004 48150071 54526370 62223725 71583309 83004240
55952H3004240J3957629J7089716K0906642K5372377L0346518L5606391M0598161
$$ 83004240 96961869 114051585 134958227 160330604 190677122 226283513 266881674
55945B66881674M4013011M3792656L7999035K6114685R745778p892883k3357773
$$ 266881674 310894685 354687341 392686376 418801061 428546839 420653956 397296183
55938C97296183l4301612m0042366m1286855l9400082l5730168l1286327k6730862
$$ 397296183 362994571 322952205 281665350 242265268 206535100 175248773 148517911
55931A48517911k2468927j8705624j5493968j2807855j0599399q807630p355892
$$ 148517911 126048984 107343360 91849392 79041537 68442138 59634508 52278616
55924E2278616o173024n211561m435207l802775l277669k840686k479564k175116
$$ 52278616 46105592 40894031 36458824 32656049 29378380 26537694 24058130 21883014
55916B1883014j909337j677747j481378j313656j165568j036335r28076q35804
$$ 21883014 19973677 18295930 16814552 15500896 14335328 13298993 12370917 11535113
55908A1535113p52557o78853o17823n66025n17867m74362m38874m08475l77849
$$ 11535113 10782556 10103703 9485880 8919855 8401988 7927626 7488752 7080277 6702428
55899F702428l47993l23153l02370k81544k60850k43155k27707k11891j96717
$$ 6702428 6354435 6031282 5728912 5447368 5186518 4943363 4715656 4503765 4307048
55890D307048j84483j73531j60984j48196j37989j29096j18654j07660r8639r0688
$$ 4307048 4122565 3949034 3788050 3639854 3501865 3372769 3254115 3146455 3047816 2957128
55880B957128q2118p5509p4489p7573q0396q2053q4069q5185q2604p7177p2402
$$ 2957128 2875010 2799501 2725012 2647439 2567043 2484990 2400921 2315736 2233132 2155955 2083553
55869B083553o9291o6432o3775o2082o0043n6138n1983m9854m8389m4817l9991
$$ 2083553 2014262 1947830 1884055 1821973 1761930 1705792 1653809 1603955 1555566 1510749 1470758
55858A470758l6931l5723l4069l1725l0310k9685k8457k7227k7468k8146k7202
$$ 1470758 1433827 1398104 1364035 1332310 1302000 1272315 1243858 1216631 1189163 1161017 1133815
55847A133815k5446k5223k6076k5541k3611k2540k2738k2520k1554k0992k0455
$$ 1133815 1108369 1083146 1057070 1031529 1007918 985378 962640 940120 918566 897574 877119
55836H77119j8434j5584j4238j4662j4832j3954j3219j3028j2416j1301j0626
$$ 877119 858685 843101 828863 814201 799369 785415 772196 759168 746752 735451 724825
55825G24825j0149q701o715o057p213q820r989j0985j1720j1668j1191j1113j1163
$$ 724825 714676 705975 699260 693203 685990 677170 667181 656196 644476 632808 621617 610504 599341
55812E99341j0590r698r113q284o632n227n192n350l792q91J540L156M747N982
$$ 599341 588751 579053 569940 561656 555024 549797 544605 539255 535463 534572 536112 539268 544015 549997
55798E49997O200O520Q262R949Q991N886L576K837J538j312m026n388o369p787
$$ 549997 556197 562717 570979 580928 589919 595805 599381 602218 603756 602444 598418 593030 586661 578874
55784E78874q714q243o968n832n253n829q128j1314j3600j4389j4405j3703j1453
$$ 578874 570160 561917 554949 549117 543864 538035 529907 518593 504993 490604 476199 462496 451043
55771D51043p902m526j792J363N271Q383R004O841K576k731p477j0223j0847j0140
$$ 451043 443141 438615 436823 438186 443457 451840 460844 467685 470261 467530 460053 449830 438983 428843
55757D28843q304n235j954j00P4l22q60k291m916p889j0295j1763j2024j1136
$$ 428843 420539 415304 413350 413250 413324 413002 412142 409851 404935 397046 386751 374988 362964 351828
55743C51828j0003r419q908p723o422n898n497l970j897j053j638k227k309k783
$$ 351828 341825 332406 323498 315775 309353 303455 297958 293988 292091 291038 289400 287173 284864 282081
55729B82081l738m010l288k666k754k991l195l909m852m883l964l352l451l206
$$ 282081 278343 274333 271045 268379 265625 262634 259439 255530 250678 245795 241831 238479 235028 231822
55715B31822k139j125o07J85J560K629K990L514M698N651N558M779L836K548Q79
$$ 231822 229683 228558 227951 228136 229696 232325 235315 238829 243527 249178 254736 259515 263351 265899 266778
55700B66778o15j802l277n061o273o551o589o773o546n662m779m214l395k102
$$ 266778 266163 264361 261084 256023 249750 243199 236610 229837 223291 217629 212850 208636 205241 203139
55686B03139j034n64j39M99P87O19R41K338M101N329N891N846M977L482K070R63
$$ 203139 202105 201541 201402 201901 202688 203307 204248 206586 210687 216016 221907 227753 232730 236212 238282 239245
55670B39245k15j300j594j296j477k260k445j550o36m33j54Q87J923K034J622
$$ 239245 239030 237730 236136 234840 233363 231103 228658 227108 226472 226039 225885 226772 228695 230729 232351
55655B32351J524J692J816K170K872L199K644J838J513J392R12K13m53j410k809
$$ 232351 233875 235567 237383 239553 242425 245624 248268 250106 251619 253011 253923 254136 253683 252273 249464
55640B49464l973m381m525n052n742o190o637p354p852p595o800n868m690l219
$$ 249464 245491 241110 236585 231533 225791 219601 212964 205610 197758 190163 183363 177495 172805 169586
55626A69586k013j480j240q96o82p58o53j53R1l78j028j300j520k015k171j489
$$ 169586 167573 166093 164853 163957 163275 162517 161864 161711 161802 161424 160396 159096 157576 155561 153390 151901
55610A51901o92p84j526j951j850j706j587j203p15n66p36q77r58j086j096r17
$$ 151901 151209 150425 148899 146948 145098 143392 141805 140602 139887 139321 138585 137708 136750 135664 134568 133651
55594A33651r10j141r86k05K74m03j521j696q45j09j5N9N56R97Q83N03L87N39
$$ 133651 132741 131600 130614 130409 130683 130280 128759 127063 126218 126109 126094 126153 126709 127706 128589 129092 129479 130018
55576A30018N83L38K1P1P68J903K803K916K308J557J279J791K861L691L544K498
$$ 130018 130601 130939 130960 131031 131799 133702 136505 139421 141729 143286 144565 146356 149217 152908 156452 158950
55560A58950J286L13o60j792k780l406l800l896l323k204j388j396j714j575r49
$$ 158950 160236 160549 159889 158097 155317 151911 148111 144215 140892 138688 137300 135904 134190 132615 131666
55545A31666k64K78N75M35m0l10j24J02O4J01N09R48J100J278J738K023J638R04
$$ 131666 131402 131680 132255 132690 132650 132340 132216 132318 132382 132483 132992 133940 135040 136318 138056 140079 141717 142621
55527A42621M16J19l77j028j569k019k360k133j195m04p23j847k597k526k283
$$ 142621 143037 143156 142779 141751 140182 138163 135803 133670 132475 132071 131348 129501 126904 124378 122095
55512A22095k451k822k920k645k188j733j414j304j367j475j440j026k09N51O52
$$ 122095 119644 116822 113902 111257 109069 107336 105922 104618 103251 101776 100336 99310 99101 99652 100304
55497A00304J05m42n02j11N46J316J730J290K77l96m25m40p95r46m71J97N70Q06
$$ 100304 100409 99967 99465 99354 99900 101216 102946 104236 104513 104117 103692 103252 102457 101511 101040 101237 101807 102613
55479A02613J034Q78L04N6M81P62K54l04R6J081J512J104L99l54j147j503j031
$$ 102613 103647 104525 104829 104885 105366 106128 106382 106078 106174 107255 108767 109871 110270 109916 108769 107266 106235
55462A06235l83m69r95q83lO39M50q8l55l44k88l18n09p43o11k6L55K9m51k21
$$ 106235 105852 105383 104388 103505 103502 104141 104591 104503 104148 103804 103516 103198 102689 101946 101335 101309 101664 101693 101242 101021
55442A01021M86O84J18n20p11n55j94K85N11K51L2M42J047R91N22O44J332J364
$$ 101021 101507 102191 102309 101789 101078 100523 100329 100614 101125 101376 101408 101850 102897 103888 104410 105054 106386 107750
55424A07750K38r64j126m69J50M20M96M34L18M17Q05J169J278J238J136Q86N51
$$ 107750 107988 107024 105898 105429 105579 105999 106495 106929 107247 107664 108469 109638 110916 112154 113290 114176 114727
55407A14727K96o6q43j734j936j207k79k5o74j844k836k881j796m60Jm23p79n64
$$ 114727 115023 114957 114114 112380 110444 109237 108958 108933 108259 106415 103579 100698 98902 98442 98443 98020 97241 96677
55389I6677j13M18J362K518K877K014Q16K53R7l29q29o23L71J312J447Q60K89
$$ 96677 96564 96982 98344 100862 103739 105753 106569 106822 106919 106590 105761 105138 105509 106821 108268 109128 109417
55372A09417M85J568K801L194K512J384L70n27j342j775j784j938k575l080k626
$$ 109417 109902 111470 114271 117465 119977 121361 121731 121204 119862 118087 116303 114365 111790 108710 106084
55357A06084j404m71m78j052j418j246q34o86r39j135p30J35O81M32k25o41o64
$$ 106084 104680 104209 103731 102679 101261 100015 99181 98495 97556 96421 95691 95826 96507 96939 96714 96073 95409
55340I5409m90j29M92J107J271R33M51J03j52l88n22m93l98l83m89o24o32m07
$$ 95409 94919 94790 95282 96389 97660 98593 99044 99147 98995 98607 98085 97592 97194 96811 96322 95698 95066 94659
55322I4659k4K68K56Kj66Q0P41J368J387P16mj9O72J248R73J4p86q34l93k12o12
$$ 94659 94635 94903 95159 95161 94995 95075 95816 97184 98571 99287 99283 99264 99936 101184 102157 102171 101385 100551 100158 99946 99334
55301I9334j144j217q97p30q35o85QO83O30l9o28p53m79J75J157J892J663O25
$$ 99334 98190 96973 96076 95346 94511 93826 93834 94517 95147 95108 94480 93727 93248 93423 94580 96472 98135 98760
55283I8760j85j68J12j68q37r79j77R23J336P65j76n87q9R05J609J519O98l55
$$ 98760 98575 98407 98519 98351 97514 96535 96358 97281 98617 99382 99206 98619 98530 99435 101044 102563 103261 102906
55265A02906j012r25k71M26Q29R64R10O52L75M73Q99R52J98p49q89r8Q42J298
$$ 102906 101894 100969 100698 101124 101953 102917 103827 104479 104854 105327 106226 107178 107376 106627 105738 105640 106482 107780
55247A07780J231O96l25j459j913j303j77N29L78l01q20p14j14M26N36L77K21
$$ 107780 109011 109707 109382 107923 106010 104707 104530 105059 105437 105136 104316 103602 103488 103914 104450 104827 105048
55230A05048P3o8N9N38Q53N15j64m81l20j31n7J26L01M2n34p06j58N51P43M05
$$ 105048 105121 105053 105112 105650 106503 107018 106854 106373 106053 105922 105865 105991 106292 106334 105800 105094 104936 105487 106230 106635
55210A06635k2j53J07M19J34r29j882j636l36Q08J165J332J843K197J679M66o65
$$ 106635 106613 106460 106567 106986 107120 106191 104309 102673 102337 103145 104310 105642 107485 109682 111361 111827 111162
55193A11162j278j403j140p02n02p55j146j212q23j02Q10J628J857J234N0j035
$$ 111162 109884 108481 107341 106639 106137 105382 104236 103024 102201 102099 102909 104537 106394 107628 107678 106643
55177A06643j417q57K38Q94N13k74k86N49J019L44o82p92J14J061J310R86N89
$$ 106643 105226 104369 104607 105501 106014 105740 105454 106003 107022 107366 106684 105892 106006 107067 108377 109363 109952
55160A09952M18M85O16O37N35L78J57m3M5M15M79j55q01m45O58J171N72k12m09
$$ 109952 110370 110855 111471 112108 112643 113021 113178 113135 113180 113595 114074 113919 113118 112673 113331 114502 115074 114862 114453
55141A14453m40p91j031q43r56j892k616j789J61J547J684J365J157O33m04j172
$$ 114453 114013 113222 112191 111348 110392 108500 105884 104095 104256 105803 107487 108852 110009 110642 110238 109066
55125A09066r70j96L46N05O13O82M07j35l50J57R86J259O04m11r22p68n40o97
$$ 109066 108096 107900 108246 108751 109364 110046 110453 110318 109968 110125 111111 112370 112974 112563 111641 110873 110333 109636
55107A09636r99r73n29J28Q18J361J510J245Q55N27J54k13j62M86J271J660J709
$$ 109636 108637 107664 107135 107263 108081 109442 110952 112197 113052 113579 113733 113520 113358 113844 115115 116775 118484
55090A18484J695J510R32K22j04OJ41M6j50k50k05j19j85n02p54m42L54Q90O97
$$ 118484 120179 121689 122621 122843 122739 122745 122886 122932 122782 122532 122327 122208 122023 121521 120767 120325 120679 121569 122266
55071A22266J56k51n82q86o84K00Q60L23r94j777j507p76n0P64J473J407M01q03
$$ 122266 122422 122171 121589 120703 120019 120219 121079 121402 120408 118631 117124 116348 116298 117062 118535 119942 120343 119540
55053A19540j464j520j185n65L6J92N3L71J360K212K135J352N68j4n02o39j43
$$ 119540 118076 116556 115371 114806 114842 115034 115087 115458 116818 119030 121165 122517 123085 123071 122569 121930 121787
55036A21787M78L15o63j402j125l30j9l57o41m39r7k9l7K64P08P56K56m32r79
$$ 121787 122265 122580 121917 120515 119390 119060 119041 118684 118043 117604 117507 117478 117441 117705 118413 119169 119425 118993 118014
55017A18014j296j252o89Q4M00Lo65j114j279j235r50o34p15j122j170n47J43
$$ 118014 116718 115466 114777 114861 115261 115264 114599 113485 112206 110971 110021 109387 108672 107550 106380 105833 105976
55000A05976L59N08J169K001K247J948J742J694J268M94J38O39J541K178K295
$$ 105976 106335 106843 108012 110013 112260 114208 115950 117644 118912 119406 119544 120183 121724 123902 126197
54985A26197J869R75kn26n90o88j032j215r05l36J13M42Q34J225J374J191Q94
$$ 126197 128066 129041 129039 128513 127923 127235 126203 124988 124083 123747 123860 124302 125136 126361 127735 128926 129820
54968A29820Q29J094J329J087N36L69P97J081O04j22j84L75P34O26N08N44L59
$$ 129820 130649 131743 133072 134159 134695 135064 135861 136942 137546 137424 137240 137615 138349 138975 139483 140027 140386
54951A40386n3j39K31L95o0o74q59o58l94j46P1Q2j29k94l38m70o38m13K21N97
$$ 140386 140333 140194 140425 140820 140760 140086 139227 138569 138175 138029 138100 138182 138053 137759 137421 136951 136313 135900 136121 136718
54931A36718K20n10q33m33M66J389J718J107J29m2J051K650L918M867N765O327
$$ 136718 136938 136428 135595 135162 135628 137017 138735 139842 139971 139929 140980 143630 147548 152415 158180 164507
54915A64507O253O000O186O529O128M690K766R30p34k345l977n620p003p580p081
$$ 164507 170760 176760 182946 189475 195603 200293 203059 203989 203255 200910 196933 191313 184310 176730 169649
54900A69649n900m660l616k874k751l252l508k555o67Q00J012M37k8p1J55N46
$$ 169649 163749 159089 155473 152599 149848 146596 143088 140533 139866 140666 141678 142115 142087 142016 142171 142717
54884A42717R66J105Q37N23O23J140J710K157K650L330M055M621N021N402N783
$$ 142717 143683 144788 145625 146148 146771 147911 149621 151778 154428 157758 161813 166434 171455 176857 182640
54869A82640N974N787N188M151K549L71k004m011n392o260o744o811o523o065
$$ 182640 188614 194401 199589 203740 206289 206660 204656 200645 195253 188993 182249 175438 168915 162850
54855A62850n502m776m019l496l130k540j731j287j496j786j513r26p62j125j411
$$ 162850 157348 152572 148553 145057 141927 139387 137656 136369 134873 133087 131574 130648 129886 128761 127350
54840A27350j199o83j82J41J14l33q20p58r7O11J002J226J394J298R89R92J488
$$ 127350 126151 125468 125286 125427 125541 125208 124388 123630 123533 124144 125146 126372 127766 129064 130053 131045 132533
54823A32533J735R89l01r41n70p0k80r10j114o82j77q3k93l99j40M51J053J166
$$ 132533 134268 135257 134956 134015 133445 133375 133095 132185 131071 130389 130212 130129 129836 129437 129297 129748 130801 131967
54805A31967N18n13j119q76j17N71R68J110R18L71j07K0O52J037P43J98L7K39
$$ 131967 132485 131972 130853 129977 129860 130431 131399 132509 133427 133798 133691 133711 134363 135400 136143 136341 136378 136617
54787A36617L13J29P9L82P00O07J60k46l99l77k34J52P37J203J299J223J400J925
$$ 136617 136930 137059 137138 137520 138220 138827 138987 138741 138342 137965 137731 137883 138620 139823 141122 142345 143745 145670
54769A45670K485K810K959L095L251L510M139N297O686P704P930P403O477N528
$$ 145670 148155 150965 153924 157019 160270 163780 167919 173216 179902 187606 195536 202939 209416 214944
54755B14944M572L174Q90k072m858o810p956q479q162o843n109l876l388l109
$$ 214944 219516 222690 223580 221508 216650 209840 201884 193405 185243 178400 173291 169415 166027 162918
54741A62918k589j908j280q15p02j041j398j087j40N75M82ok19j90l33n52k46
$$ 162918 160329 158421 157141 156326 155624 154583 153185 152098 151958 152533 153015 153009 152790 152600 152267 151715 151469
54724A51469Q88K402L490L681L279L257M384O260P545P414O450N691N192M080
$$ 151469 152357 154759 158249 161930 165209 168466 172850 179110 186655 194069 200519 206210 211402 215482
54710B15482J937o27k809m509o023p192p382o345m806l912m083m563m316l195
$$ 215482 217419 216792 213983 209474 203451 196259 188877 182532 177726 173814 169731 165168 160852 157657
54696A57657k048j634j799j883j626j384j495j749j592q05J06L89r6o21m33L05
$$ 157657 155609 153975 152176 150293 148667 147283 145788 144039 142447 141642 141748 142137 142041 141420 140987 141292
54680A41292P55M77j61o55r76j253j286p92K2N03K69l36n95k14L55M07j61p98
$$ 141292 142047 142524 142363 141708 140732 139479 138193 137401 137423 137926 138195 137859 137264 137050 137405 137812 137651 136853
54662A36853j034r71p74k31P16J406J200N19K71M20J21o92r99l52K92Q3m21k95
$$ 136853 135819 134848 134074 133843 134559 135965 137165 137684 137955 138375 138496 137804 136805 136453 136745 136828 136407 136112
54644A36112K32L99M02J004J948K051R41l58q66p13m21l5N65J022R13L77j10m08
$$ 136112 136344 136743 137145 138149 140097 142148 143089 142731 141865 141152 140731 140696 141261 142283 143196 143573 143463 143055
54626A43055p01r59r16n90m05o00q42o75k54j74n76q48m66K06M46K18R8K80L34
$$ 143055 142354 141395 140479 139889 139484 138884 138042 137367 137113 136939 136363 135515 135049 135255 135701 135919 136017 136297 136631
54607A36631N0j71k7K33M03P59J418J832J502P77K89ro34j551k094j802q69J93
$$ 136631 136681 136510 136483 136716 137119 137878 139296 141128 142630 143407 143696 143687 143053 141502 139408 137606 136737 136930
54589A36930R29J072P77O10R21J298J042P1r74j392r27J32J020R71M0p95p82l11
$$ 136930 137859 138931 139708 140318 141239 142537 143579 143650 142676 141284 140357 140489 141509 142480 142520 141725 140943 140632
54571A40632j99n14p32p12p27o97k17P27J643K162K191J603M08q40j457j361q74
$$ 140632 140433 139919 139187 138475 137748 137051 136834 137561 139204 141366 143557 145160 145568 144728 143271 141910 141036
54554A41036o9R34J395P12l46l46P88J613J235M35K51N97Q52R32J034J046Q84
$$ 141036 140967 141901 143296 144008 143662 143316 144104 145717 146952 147387 147638 148235 149087 150019 151053 152099 152983
54537A52983Q51J030R69N07K68O94J259J335J212J433J679J347P37O41R54P79
$$ 152983 153834 154864 155833 156340 156608 157302 158561 159896 161108 162541 164220 165567 166304 166945 167899 168678
54521A68678j40j094j576j841k013j618m54O96Q58L1r04j227r89p10p07p76m35
$$ 168678 168538 167444 165868 164027 162014 160396 159942 160638 161496 161527 160623 159396 158407 157697 156990 156214 155779
54504A55779L97J069Q27k62j318j663j456j196r74n88j16J37K48O77J502K026
$$ 155779 156176 157245 158072 157810 156492 154829 153373 152177 151203 150615 150499 150636 150884 151561 153063 155089
54488A55089J536K75o90o17K27J013J175P00l9m93k51N26J142J088O01K64K54
$$ 155089 156625 156900 156210 155593 155820 156833 158008 158708 158669 158176 157925 158451 159593 160681 161282 161546 161800
54471A61800L39M25O48R79J164J095Q85N64O9m86q63j034j101r71n66j93j74k17
$$ 161800 162139 162564 163212 164191 165355 166450 167335 167899 167968 167482 166619 165585 164484 163513 162947 162754 162580 162363
54453A62363J70O72M66l10m23O09J573J210L2n02r4K59nl38k67j68m79r06r41
$$ 162363 162533 163205 163671 163361 162938 163547 165120 166330 166362 165860 165766 166025 166020 165682 165415 165247 164768 163862 162921
54434A62921p16q15j408k005j942j003L60J303J336Q03N09P70J134J092P16M29
$$ 162921 162205 161390 159982 157977 156035 155032 155392 156695 158031 158834 159343 160113 161247 162339 163055 163484
54418A63484M07N48P87J113J353J181M84m83j317j709j533r09k65n4k77m02J5
$$ 163484 163891 164439 165226 166339 167692 168873 169357 168874 167557 165848 164315 163406 163141 163087 162810 162408 162423
54401A62423P66J276J388J463J769K086K142J944J550Q61P6q8P93K053K506J813
$$ 162423 163189 164465 165853 167316 169085 171171 173313 175257 176807 177668 177744 177656 178449 180502 183008 184821
54385A84821P08m5l87n44n84n98q42j281j448j066m85k43m21p67j096j287j127
$$ 184821 185529 185484 185097 184553 183969 183371 182529 181248 179800 178734 178249 178006 177585 176818 175722 174435 173308
54368A73308n43K40R37J435J578J108R4q65j214j056q57q09p74o04k43L26R14
$$ 173308 172765 173005 173942 175377 176955 178063 178157 177292 176078 175022 174165 173356 172582 171978 171735 172061 172975
54351A72975J143R05O05N78N62J45n25r22q70o05l13l1Q5q6k47K7N96P80K12o94
$$ 172975 174118 175023 175628 176206 176768 176913 176388 175466 174596 173991 173678 173647 173732 173646 173399 173426 174022 174802 175014 174320
54331A74320j231r90l8J201K156K527K548K587K581K200J564J305J756K452K594
$$ 174320 173089 172099 172061 173262 175418 177945 180493 183080 185661 187861 189425 190730 192486 194938 197532
54316A97532J811L82r69j548j210o15o09j306k075k458k678l052l361l117k277
$$ 197532 199343 199725 198756 197208 195998 195383 194774 193468 191393 188935 186257 183205 179844 176727 174450
54301A74450j286n64k62l19n66p25o33m24l20k75kN32R01O60j8m12j3Q18J223
$$ 174450 173164 172600 172338 172019 171453 170728 170095 169671 169351 169076 169074 169606 170507 171167 171149 170737 170724 171542 172765
54282A72765P93km29k91J1R1k2m5J18K24r1q04j299q89L14J356J469Q83L25J6
$$ 172765 173558 173556 173127 172836 172847 172938 172916 172871 172989 173213 173122 172318 171019 170130 170444 171800 173269 174152 174477 174493
54262A74493k80m97k37M40Q54O69M06O15R83Q48K71QM47J178J657J755J478O58
$$ 174493 174213 173716 173479 173919 174773 175442 175848 176463 177446 178294 178565 178573 179020 180198 181855 183610 185088 185746
54244A85746o28j684j791j101m70l67m45l04j91n17j015r65j79P39J130R15L72
$$ 185746 185118 183434 181643 180542 180072 179705 179260 178956 178765 178248 177233 176268 176089 176828 177958 178873 179245
54227A79245k71q14r96p21k56L4J3k51o61j031j096p72k81O7J17k00q49j525j742
$$ 179245 178974 178160 177164 176443 176187 176221 176234 175983 175322 174291 173195 172423 172142 172209 172326 172126 171277 169752 168010
54208A68010j369q32m80q8O80J580K018J854J510J300J079O30K3m82o80n13j50
$$ 168010 166641 165809 165329 165241 165921 167501 169519 171373 172883 174183 175262 175892 175915 175433 174753 174240 174090
54191A74090L1j72m61l22K81Q15Q12L63p8j76P0M51P59R95J305J634J604R91J64
$$ 174090 174121 173949 173488 173166 173447 174262 175074 175437 175359 175183 175253 175704 176463 177458 178763 180397 182001 182992 183156
54172A83156l16m66q05j473j933j735j188r46j151j416j388j016l46N02J145J111
$$ 183156 182840 182374 181569 180096 178163 176428 175240 174294 173143 171727 170339 169323 168977 169479 170624 171735
54156A71735L72n16j010j049q89o99n84p36j108j147l68P88J249O76l8rN56R55
$$ 171735 172107 171591 170581 169532 168643 167944 167360 166624 165516 164369 164001 164789 166038 166714 166676 166667 167223 168178
54138A68178J155J540J884J549O53P2J72M30M39M69P24Q69P64Q16J144J175N90
$$ 168178 169333 170873 172757 174306 174959 175031 175203 175633 176072 176541 177265 178134 178898 179714 180858 182033 182623
54121A82623n3k63l69o60n91K26R93P53oq4N46P88K74j50R6M88L86q4m47m78j51
$$ 182623 182570 182307 181938 181278 180687 180913 181906 182659 182653 182569 183115 183903 184177 184027 184123 184611 184997 184913 184466 183988 183837
54100A83837L48M51k56j212j355n07M43P77N83P5o79j174p29L07O78L5m39J58
$$ 183837 184185 184636 184380 183168 181813 181306 181749 182526 183109 183184 182505 181331 180602 180909 181587 181622 181183 181341
54082A81341J025R96L91L74J066J485J166O49M25K90Mk20r4K96P17J042J211J181
$$ 181341 182366 183362 183753 184127 185193 186678 187844 188493 188918 189208 189212 188992 188898 189194 189911 190953 192164 193345
54064A93345J082J157J432J581J222L09o92j145q61l44j94k68J57J346K624L147
$$ 193345 194427 195584 197016 198597 199819 200128 199436 198291 197430 197086 196892 196624 196781 198127 200751 203898
54048B03898K783K074J624J725K339L142L789M180M340M192L849L969N172P015
$$ 203898 206681 208755 210379 212104 214443 217585 221374 225554 229894 234086 237935 241904 247076 254091
54034B54091Q252Q331P949P964Q380Q708Q608P821O209M303L135K997L034K587
$$ 254091 262343 270674 278623 286587 294967 303675 312283 320104 326313 330616 333751 336748 339782 342369
54020C42369K125K235K474K134J428R74N92k65j291j634j207o78k57N40J933L669
$$ 342369 344494 346729 349203 351337 352765 353739 354331 354066 352775 351141 349934 349256 348999 349539 351472 355141
54004C55141N718Q229J0645J1651J0306O590R55n841j2331j6775j8393j7739j5790
$$ 355141 360859 369088 379733 391384 401690 408280 409235 403394 391063 374288 355895 338156 322366
53991C22366j3351j1215j0005r462q668p249n772m683l756k791k109j830j468
$$ 322366 309015 297800 287795 278333 269665 262416 256644 251961 248205 245414 243305 241475 240007
53978B40007q37o29j402k511k850k284j625j423j506j622j805k057k054j435j53
$$ 240007 239170 238541 237139 234628 231778 229494 227869 226446 224940 223318 221513 219456 217402 215967 215814
53963B15814J345K290K134J238O12P32R32M42l68m38M87J538K017K219K671L172
$$ 215814 217159 219449 221583 222821 223433 224165 225097 225539 225171 224733 225220 226758 228775 230994 233665 236837
53947B36837L147K618K180K142K260K392K856L817M780N143N089N345O090O668
$$ 236837 239984 242602 244782 246924 249184 251576 254432 258249 263029 268172 273261 278606 284696 291364
53933B91364O546O053N758N580N026M157L692M079M875N241M839M108L763M086
$$ 291364 297910 303963 309721 315301 320327 324484 328176 332255 337130 342371 347210 351318 355081 359167
53919C59167M673M951M884M973N469O062O570P395Q771R983J0083R173Q119P155
$$ 359167 363840 368791 373675 378648 384117 390179 396749 404144 412915 422898 432981 442154 450273 457428
53905D57428N664L506J569N58K4q03j880k701l263l971m848n593o258p135p994
$$ 457428 463092 466598 468167 468725 468749 467946 466066 463365 460102 456131 451283 445690 439432 432297 424303
53890D24303q099p257o327o340p405q684r338r221q738q241p706o951n982m992
$$ 424303 416204 408947 402620 396280 388875 380191 370853 361632 352894 344653 336947 329996 324014 319022
53876C19022m136l560l474l888m252l838k664j682j700k444l022l030k759k501
$$ 319022 314886 311326 307852 303964 299712 295874 293210 291528 289828 287384 284362 281332 278573 276072
53862B76072k255k086k259k792l221l063k335j431o84j13M70J287K336L197L286
$$ 276072 273817 271731 269472 266680 263459 260396 258061 256630 255946 255833 256303 257590 259926 263123 266409
53847B66409K609K128L098N838R426J2641J5134J7480K0315K3507K5927K5739
$$ 266409 269018 271146 274244 280082 289508 302149 317283 334763 355078 378585 404512 430251
53835D30251K1269J2275O92j0281j8121k2069k2532k0200j6074j1645q129n572
$$ 430251 451520 463795 464487 454206 436085 414016 391484 371284 355210 343565 335436 329864
53823C29864l298j210k1j87j222k313l171l982m887n699o051n693m781l850l264
$$ 329864 326566 325356 325335 325148 323926 321613 318442 314460 309573 303874 297823 292130 287349 283499 280235
53808B80235k789k003r48M3J065K458L923M618M384M184M913O290P347P508O720
$$ 280235 277446 275443 274495 274538 275603 278061 281984 286602 290986 295170 300083 306373 313720 321228 327948
53793C27948N133L225J847J469J633J653J566J780K054J633L42j119j967k052
$$ 327948 333081 336306 338153 339622 341255 342908 344474 346254 348308 349941 350283 349164 347197 345145
53779C45145j739j628k277l670n060n766o022o398o678o140m925m100m129m305
$$ 345145 343406 341778 339501 335831 330771 325005 318983 312585 305907 299767 294842 290742 286613 282308
53765B82308m093m046m639n102m424k998k149k261k500k323k148k230j976r58
$$ 282308 278215 274169 269530 264428 260004 257006 254857 252596 250096 247773 245625 243395 241419 240461
53751B40461K11O92O34P45J041Q58Pq79j272j394j618j811j615j066n14r7L02
$$ 240461 240672 241364 241998 242743 243784 244642 244649 243770 242498 241104 239486 237675 236060 234994 234480 234383 234685
53734B34685P19J015J058Q29L94J2Q0P10J404J506R68M00L68Q66J542K085K278
$$ 234685 235404 236419 237477 238306 238700 238712 238792 239502 240906 242412 243380 243780 244148 245014 246556 248641 250919
53717B50919J970J228M15m1M6O05J426K308L121L766M031L589K425J226R13J660
$$ 250919 252889 254117 254532 254491 254537 255142 256568 258876 261997 265763 269794 273383 275808 277034 277947 279607
53701B79607K581K679J923J202J297K087K783K830K505K583L336M071L888K799
$$ 279607 282188 284867 286790 287992 289289 291376 294159 296989 299494 302077 305413 309484 313372 316171
53687C16171J718J301J231Q06j51j229j953k062j493m62N16R56P58J00q37j771
$$ 316171 317889 319190 320421 321227 321076 319847 317894 315832 314339 313877 314393 315349 316107 316207 315370 313599
53671C13599k223j862r36q2K85J72k80r51j601j828j369l77O17J054P85K20n1
$$ 313599 311376 309514 308578 308496 308781 308953 308673 307722 306121 304293 302924 302547 303164 304218 305003 305223 305172
53654C05172N5L9m38j021j106p00l94n03o64m06J34M14K31K0K55P33Q24M29K95
$$ 305172 305227 305266 304828 303807 302701 302001 301607 301104 300440 300034 300168 300582 300813 300833 301088 301821 302645 303074 303369
53635C03369R83J845J719O23n7O14J856K258J616R37R96J649K500L357M011M126
$$ 303369 304352 306197 307916 308539 308482 309096 310952 313210 314826 315763 316759 318408 320908 324265 328276 332402
53619C32402L641K852K058J517J625K579L842M569M625M565M548M121L328L129
$$ 332402 336043 338895 340953 342470 344095 346674 350516 355085 359710 364275 368823 372944 376272 379401
53605C79401M077N244N314M255L201K861K892K699K128J321M96L2J91O08N83j8
$$ 379401 383478 388722 394036 398291 401492 404353 407245 409944 412072 413393 413889 413921 414112 414720 415303 415285
53589D15285n93p43p81j071j334j115o46n92j121j706j893j792j723j752j792
$$ 415285 414692 413949 413168 412097 410763 409648 409002 408410 407289 405583 403690 401898 400175 398423 396631
53574C96631j827j855j751j469j211j225j457j661j688j479q07N39K196L210K941
$$ 396631 394804 392949 391198 389729 388518 387293 385836 384175 382487 381008 380201 380740 382936 386146 389087
53559C89087J862J112J326K140K907L482M115M797N154N012M725M762N105N261
$$ 389087 390949 392061 393387 395527 398434 401916 406031 410828 415982 420994 425719 430481 435586 440847
53545D40847M798L690K195O03q00j712j910j370k80R93J950K271K229K538L574
$$ 440847 445645 449335 451530 452133 451333 449621 447711 446341 446061 447054 449004 451275 453504 456042 459616
53530D59616M874N712O145P024Q851J1019J2414J2614J2258J2294J3048J4092
$$ 459616 464490 470202 476347 483371 492222 503241 515655 528269 540527 552821 565869 579961
53518E79961J4897J5514J6464J7938J9361K0036K0022K0116K0974K2606K4582
$$ 579961 594858 610372 626836 644774 664135 684171 704193 724309 745283 767889 792471
53507G92471K6325K7207K7018K6449K6553K7490K8340K8369K7833K7167K6145
$$ 792471 818796 846003 873021 899470 926023 953513 981853 1010222 1038055 1065222 1091367
53496A091367K4512K2850K1900K1473K0865K0071J9677J9676J9463J9016J9022
$$ 1091367 1115879 1138729 1160629 1182102 1202967 1223038 1242715 1262391 1281854 1300870 1319892
53485A319892J9554J9677J8860J7952J8039J8966J9680J9586J8915J7983J6794
$$ 1319892 1339446 1359123 1377983 1395935 1413974 1432940 1452620 1472206 1491121 1509104 1525898
53474A525898J5234J3205J0645P812N336L585K066r3l166o673j0047j3054j5580
$$ 1525898 1541132 1554337 1564982 1572794 1578130 1581715 1583781 1583688 1580522 1573849 1563802 1550748 1535168
53461A535168j7416j8424j8653j8289j7620j7076j7050j7676j8827k0322k1961
$$ 1535168 1517752 1499328 1480675 1462386 1444766 1427690 1410640 1392964 1374137 1353815 1331854
53450A331854k3495k4616k5048k4607k3385k1949k1015k0741k0529j9716j8194
$$ 1331854 1308359 1283743 1258695 1234088 1210703 1188754 1167739 1146998 1126469 1106753 1088559
53439A088559j6162j3626j0697q068o610o295o086n026l211j453k26P45J946L431
$$ 1088559 1072397 1058771 1048074 1040006 1033396 1027101 1021015 1015989 1012778 1011325 1011099 1011844 1013790 1017221
53425A017221M853O025P210Q643J0084J1180J2213J3872J6246J8569K0281K1742
$$ 1017221 1022074 1028099 1035309 1043952 1054036 1065216 1077429 1091301 1107547 1126116 1146397 1168139
53413A168139K3459K5200K6502K7608K9097L0871L2407L3788L5623L7931M0060
$$ 1168139 1191598 1216798 1243300 1270908 1300005 1330876 1363283 1397071 1432694 1470625 1510685
53402A510685M1839M3796M6025M7847M9068N0604N3112N5830N7622N8551N9459
$$ 1510685 1552524 1596320 1642345 1690192 1739260 1789864 1842976 1898806 1956428 2014979 2074438
53391B074438O0507O1146O1290O1399O1449O0791N9196N7190N5184N3008N0566
$$ 2074438 2134945 2196091 2257381 2318780 2380229 2441020 2500216 2557406 2612590 2665598 2716164
53380B716164M8121M5665M2604L8624L4262L0149K6180K1960J7639J3662R909
$$ 2716164 2764285 2809950 2852554 2891178 2925440 2955589 2981769 3003729 3021368 3035030 3044939
53369C044939N636K07o501j4306k2815l1398l9422m6578n2710n7466o0522o2043
$$ 3044939 3050575 3050782 3044281 3029975 3007160 2975762 2936340 2889762 2837052 2779586 2719064 2657021
53357B657021o2593o2546o1902o0720n9293n7758n5818n3157n0022m7227m5529
$$ 2657021 2594428 2531882 2469980 2409260 2349967 2292209 2236391 2183234 2133212 2085985 2040456
53346B040456m5042m5261m5682m6258m7078m7651m7090m5206m2937m1216l9709
$$ 2040456 1995414 1950153 1904471 1858213 1811135 1763484 1716394 1671188 1628251 1587035 1547326
53335A547326l7335l3843l0132k6996k4315k1695j9237j7273j5799j4726j4282
$$ 1547326 1509991 1476148 1446016 1419020 1394705 1373010 1353773 1336500 1320701 1305975 1291693
53324A291693j4734j5806j6806j7200j6798j5594j3800j1878j0282r093q132p262
$$ 1291693 1276959 1261153 1244347 1227147 1210349 1194755 1180955 1169077 1158795 1149702 1141570 1134308
53312A134308o407n420m162k632q42J202L277M951O110P201Q686J0470J2250J4103
$$ 1134308 1127901 1122481 1118319 1115687 1114845 1116047 1119324 1124275 1130385 1137586 1146272 1156742 1168992 1183095
53298A183095J6305J8750K1032K2957K4530K5631K6258K7026K8648L0848L2376
$$ 1183095 1199400 1218150 1239182 1262139 1286669 1312300 1338558 1365584 1394232 1425080 1457456
53287A457456L2375L1226K9766K8240K6447K4483K2721K1134J9134J6267J2756
$$ 1457456 1489831 1521057 1550823 1579063 1605510 1629993 1652714 1673848 1692982 1709249 1722005
53276A722005R236O032K845p06m393p478r624j1383j3474j5898j8209k0404k2820
$$ 1722005 1731241 1737273 1740118 1739412 1735019 1727541 1717917 1706534 1693060 1677162 1658953 1638549 1615729
53263A615729k5286k7070k7903k8383k9026k9615k9812k9875l0218l0684l0849
$$ 1615729 1590443 1563373 1535470 1507087 1478061 1448446 1418634 1388759 1358541 1327857 1297008
53252A297008l0732l0605l0376k9757k8871k8102k7471k6743k6122k6167k6917
$$ 1297008 1266276 1235671 1205295 1175538 1146667 1118565 1091094 1064351 1038229 1012062 985145
53241I85145k7703k7928k7603k6909k5822k4414k3048k1879k0543j8711j6622
$$ 985145 957442 929514 901911 875002 849180 824766 801718 779839 759296 740585 723963
53230G23963j4640j2637j0367q254p148p218p677p845p960q675j0125j1863j3444
$$ 723963 709323 696686 686319 678065 670917 663699 656022 648177 640217 631542 621417 609554 596110
53217E96110j4599j5053j4737j4121j3809j3686j3093j1909j0912j0612j0359
$$ 596110 581511 566458 551721 537600 523791 510105 497012 485103 474191 463579 453220
53206D53220r205p341n982n831o378o750o688o437o185n952n744n530n270n057
$$ 453220 444015 436674 430692 424861 418483 411733 405045 398608 392423 386471 380727 375197 369927 364870
53192C64870n064n251n344n196m884m432l818l323l372l798l793k965k009j854
$$ 364870 359806 354555 349211 344015 339131 334699 330881 327558 324186 320388 316595 313630 311621 309767
53178C09767k445k930k783k226j635j132p62o09n92m77j87J71O00J230J921K172
$$ 309767 307322 304392 301609 299383 297748 296616 295854 295245 294653 294176 293989 294160 294760 295990 297911 300083
53162C00083J590L37r63j653j451o33J38L08j47q09j215j134o71k10j24l50m44
$$ 300083 301673 302010 301047 299394 297943 297310 297448 297756 297609 296800 295585 294451 293780 293570 293446 293096 292652
53145B92652k48k92j125k432l226k912j802n80L41Q64R79P84N21M05M55N58O10
$$ 292652 292404 292112 290987 288555 285329 282417 280615 280035 280376 281240 282219 283003 283524 283929 284384 284942 285552
53128B85552N53L90J86Lj58l02l58k30N2L40L70j09r19j255l70J309K314J794
$$ 285552 286105 286495 286681 286684 286526 286224 285866 285636 285688 286028 286398 286289 285370 284115 283745 285054 287368 289162
53110B89162N48j31j12k44q55j464j854k394l100l295k678j913j681j722j410
$$ 289162 289710 289579 289467 289223 288368 286904 285050 282656 279556 276261 273583 271670 269989 268267 266857
53095B66857p76k33J81P41J273J207L76o53j124p10K82J094J017M3j037j436j141
$$ 266857 266081 265848 266029 266770 268043 269250 269626 268973 267849 267139 267421 268515 269532 269575 268538 267102 265961
53078B65961o94m02j39J46J93j99q11j184j045n30j9K22L09M85P29P85O39O45
$$ 265961 265267 264865 264726 264872 265065 264866 264055 262871 261826 261296 261277 261499 261808 262293 263022 263807 264446 265091
53060B65091J012J453J578J384J170J114J168J183R66M29j06j04M97J084J150
$$ 265091 266103 267556 269134 270518 271688 272802 273970 275153 276119 276548 276442 276338 276835 277919 279069
53045B79069Q89P00M76q6q40j431j958k684l283l093k122j119n30j11L46O33O91
$$ 279069 279958 280658 281134 281048 280208 278777 276819 274135 270852 267759 265637 264518 263988 263877 264223 264856 265547
53028B65547Q19J011P10k09r20p05p0l0o63j105q48k64J76M24N29L57op8M20J140
$$ 265547 266366 267377 268087 267878 266958 266253 266183 266153 265490 264385 263537 263273 263449 263873 264402 264759 264753 264675 265095 266235
53008B66235J549J536J301Q85K06n39q46m07N15J250J226M23n91j166j168r77
$$ 266235 267784 269320 270621 271506 271712 271173 270327 269920 270435 271685 272911 273334 272743 271577 270409 269432
52992B69432r06q23n17j24J04L05P90J450J795J716J675J928J983J315K88j54
$$ 269432 268526 267703 267186 267062 267166 267471 268261 269711 271506 273222 274897 276825 278808 280123 280411 280257
52976B80257L47J220J737J731J459J204J219J634K148K187J634J128J297J945
$$ 280257 280604 281824 283561 285292 286751 287955 289174 290808 292956 295143 296777 297905 299202 301147
52962C01147K425K538K592K651K313J342R7q94j437j649j766k090k727l251l032
$$ 301147 303572 306110 308702 311353 313666 315008 315105 314211 312774 311125 309359 307269 304542 301291 298259
52947B98259k178j642j948k254j364M88J665J070o14j925k263k096j905j593r62
$$ 298259 296081 294439 292491 290237 288873 289361 291026 292096 291482 289557 287294 285198 283293 281700 280738
52932B80738j97K29np92j604j796j187l75k00p99j399j170j59Q10J101Q46O02
$$ 280738 280541 280770 280765 279973 278369 276573 275386 275011 274811 274012 272613 271443 271284 272094 273195 274041 274643
52915B74643N94N42K17q5J18P21J027O58J16QQ6l41j094j112PJ220J344O21J63
$$ 274643 275237 275779 275996 275911 276029 276750 277777 278435 278551 278559 278645 278304 277210 276098 276105 277325 278669 279290 279453
52896B79453K21k5r46j766j760j324j258j493j357p46k59j74n1M20P55K83r17
$$ 279453 279674 279649 278703 276937 275177 273853 272595 271102 269745 268999 268740 268566 268515 268935 269690 269973 269056
52879B69056k037k340j681m15Q33J396R67k8p03n53J25O73P74N51K33Q5M83J641
$$ 269056 267019 264679 262998 262583 263416 264812 265779 265751 265048 264495 264620 265293 266067 266618 266851 266936 267419 269060
52861B69060L127M048L942L230K579K023J140j57j411k167k376k141j448m04N01
$$ 269060 272187 276235 280177 283407 285986 288009 289149 288992 287581 285414 283038 280897 279449 279045 279546
52846B79546O10l76k087l662m307l940l274l082l390l577l193k330j280k56M29
$$ 279546 280156 279780 277693 274031 269724 265784 262510 259428 256038 252461 249268 246938 245658 245402 245831
52831B45831M42p3m13j03N74J105J406J560J273K40j085j735j349n86k82n98j027
$$ 245831 246273 246200 245787 245684 246258 247363 248769 250329 251602 251842 250757 249022 247673 247087 246805 246207 245180
52814B45180j014m22L58P25N42L99Q84J761K335K564L093M030M443L502J624p1
$$ 245180 244166 243744 244102 244827 245369 245768 246652 248413 250748 253312 256405 260435 264878 268380 270004 269933
52798B69933j044j535j798j835j828k158k817l284l158k596j924j214m77lj05
$$ 269933 268889 267354 265556 263721 261893 259735 256918 253634 250476 247880 245956 244742 244265 244262 244157
52783B44157n76q05m95o1j18n96o89K51J842K921K728J654P41N76Q91J103J003
$$ 244157 243581 242776 242281 242220 242102 241506 240817 241068 242910 245831 248559 250213 250954 251530 252421 253524 254527
52766B54527P77N31P4p54j639j905j286l27J71R2J5K95O23O61O16P50Q18N02K08
$$ 254527 255304 255835 255909 255155 253516 251611 250325 249998 250169 250261 250276 250571 251194 251855 252471 253221 254039 254541 254749
52747B54749O46J654K163J579N64J30M28Q26Q46N54K78L09P37J236J252O90J31
$$ 254749 255395 257049 259212 260791 261355 261485 261913 262739 263585 264139 264417 264726 265463 266699 267951 268641 268772
52730B68772P3K30O7k86k63J67M82N55Q13J315J360N54m51p65m46k24l57m64l42
$$ 268772 268845 269075 269142 268856 268593 268760 269242 269797 270610 271925 273285 273839 273388 272623 272177 271953 271596 271132 270790
52711B70790k75m26n01k46J30L01K60J38j13n87j042r96k58P71J362J056O4q72
$$ 270790 270515 270089 269588 269342 269472 269773 270033 270171 270058 269471 268429 267433 267175 267946 269308 270364 270428 269556
52693B69556j113p02k44j71j93L04J395K397K595K088J595J570J788J891J914
$$ 269556 268443 267741 267497 267326 267133 267437 268832 271229 273824 275912 277507 279077 280865 282756 284670
52678B84670K023J944J265J90n21n71n89j181j963j984r86K81R23P07J3n89o45
$$ 284670 286693 288637 289902 290092 289571 289000 288411 287230 285267 283283 282297 282578 283501 284208 284221 283632 282987
52661B82987j19M58L94l75j129j095k17Q97J630J826J727J652J706J733J491Q68
$$ 282987 282868 283326 283720 283345 282216 281121 280904 281801 283431 285257 286984 288636 290342 292075 293566 294434
52645B94434q6j136j871k030j916k225l057l529k770j162J14O06R64J688K373
$$ 294434 294348 293212 291341 289311 287395 285170 282113 278584 275814 274652 274766 275372 276336 278024 280397
52630B80397K528K419K495K571K234J695J526J741J780J342O37k25j428k884l900
$$ 280397 282925 285344 287839 290410 292644 294339 295865 297606 299386 300728 301365 301140 299712 296828 292928
52615B92928l841k824j582p27l31j28Q7L00L74K03k98j105j872j961j082K40J200
$$ 292928 289087 286263 284681 283954 283623 283495 283582 283882 284256 284459 284161 283056 281184 279223 278141 278381 279581
52598B79581J665K095K532K461J813J279J177Q45j15q10l12P19R15L65M27J415
$$ 279581 281246 283341 285873 288334 290147 291426 292603 293448 293333 292523 292211 292930 293845 294210 294637 296052
52582B96052J958J188J60K32J112J509J088O54P13Q81P26L34l4l28n07m74l11
$$ 296052 298010 299198 299358 299590 300702 302211 303299 303953 304666 305547 306273 306607 306573 306245 305738 305264 304953
52565C04953l20o62j116j337j192q43n56m02k13P6J51k96r68j190q55o12r28j395
$$ 304953 304633 303971 302855 301518 300326 299483 298927 298525 298312 298388 298539 298243 297275 296085 295230 294618 293690 292295
52547B92295j359p87n1P25J523J958J593O37j88m91m98n38o87q64r18n91J74R67
$$ 292295 290936 290149 290098 290823 292346 294304 295897 296534 296346 295855 295357 294819 294132 293268 292350 291759 291933 292900
52529B92900J273J028N23r3p44j062o83Q0N12M12K44K58J41k52m67j06N98J182
$$ 292900 294173 295201 295724 295631 294887 293825 293142 293222 293734 294146 294390 294648 294789 294537 294070 293964 294562 295744
52511B95744J562J888K209K574L118L671L704L084K416K197J963R17q65k486l331
$$ 295744 297306 299194 301403 303977 307095 310766 314470 317554 319970 322167 324130 325047 324182 321696 318365
52496C18365l502l220k575j909j745j980j858j055l15m82j297j762j453q47m33
$$ 318365 314863 311643 309068 307159 305414 303434 301576 300521 300206 299724 298427 296665 295212 294365 293932
52481B93932j40J77L27K81N40J502K598K674J363l93j341j120k30P80J686K302
$$ 293932 293792 293969 294296 294577 295117 296619 299217 301891 303254 302861 301520 300400 300170 300950 302636 304938
52465C04938K418K137J962K300L037L767M204M247L809K822J414j22j519k670
$$ 304938 307356 309493 311455 313755 316792 320559 324763 329010 332819 335641 337055 336933 335414 332744
52451C32744l552m085m114l564k693k109k249k801k967k427j794j816k405k805
$$ 332744 329192 325107 320993 317429 314736 312627 310378 307577 304610 302183 300389 298573 296168 293363
52437B93363k576j912j050R0J430K389K418J731J076P88M72l01j263j706j373
$$ 293363 290787 288875 287825 287915 289345 291734 294152 295883 296959 297747 298219 297918 296655 294949 293576
52422B93576p71m88m43j36M81Q05M81J07N77J814K762K740K339K602L675M803
$$ 293576 292805 292317 291874 291738 292219 293024 293505 293612 294189 296003 298765 301505 303844 306446 310121 314924
52406C14924N521O328P975J0506J3219J5307J6229J5544J2820P959J653m639r341
$$ 314924 320445 326773 334748 345254 358473 373780 390009 405553 418373 426332 427985 423346 414005
52393D14005j1637j1833j0861r478p963o476n302m556l895k857j498m13m2k35
$$ 414005 402368 390535 379674 370196 362233 355757 350455 345899 342004 339147 337649 337236 337194 336959
52379C36959n02m96j00P31J850K786L044K706K446K879L975N224O189O675O543
$$ 336959 336457 335961 335861 336592 338442 341228 344272 346978 349424 352303 356278 361502 367691 374366 380909
52364C80909N656M105K284O43m87q71m51L29O27n8j267k056k056j707j408q87
$$ 380909 386565 390670 392954 393597 393110 392239 391788 392117 392744 392686 391419 389363 387307 385600 384192 383305
52348C83305K39J598K331K195J929K326L295M117M460M705N237N735N537M620
$$ 383305 383544 385142 387473 389668 391597 393923 397218 401335 405795 410500 415737 421472 427009 431629
52334D31629L972M704O816R135J0558J1187J1971J3423J5097J6329J7089J7851
$$ 431629 435601 440305 447121 456256 466814 478001 489972 503395 518492 534821 551910 569761
52322E69761J8900K0104K1169K1878K2116K1934K1529K1042K0435J9686J8966
$$ 569761 588661 608765 629934 651812 673928 695862 717391 738433 758868 778554 797520
52311G97520J8434J8035J7784J7983J8755J9493J9374J8411J7433J6857J6111
$$ 797520 815954 833989 851773 869756 888511 908004 927378 945789 963222 980079 996190
52300I96190J4633J2834J1521J0770J0012Q997P969O876N163K528o16l658o328
$$ 996190 1010823 1023657 1035178 1045948 1055960 1064957 1072926 1079802 1084965 1087493 1086877 1083219 1076891
52287A076891q526j0026j0732j0915j0871j0540r731q507p042n380l622k098q98
$$ 1076891 1068365 1058339 1047607 1036692 1025821 1015281 1005550 997043 990001 984621 980999 978901 978003
52274I78003N15K737N479P776R185J0197J1342J2527J3535J4637J6076J7343J7640
$$ 978003 978518 981255 986734 994510 1003695 1013892 1025234 1037761 1051296 1065933 1082009 1099352 1116992
52261A116992J6972J6160J5757J5513J5051J4498J4129J3850J3380J2723J2070
$$ 1116992 1133964 1150124 1165881 1181394 1196445 1210943 1225072 1238922 1252302 1265025 1277095
52250A277095J1464J0890J0404R841Q532N890K282j121l462m898o110p461q795
$$ 1277095 1288559 1299449 1309853 1319694 1328226 1334116 1336398 1335277 1331815 1326917 1320807 1313346 1304551
52237A304551r757j0114r912r452q951q285p255o126n418n175m897m351l896l692
$$ 1304551 1294794 1284680 1274768 1265316 1256365 1248080 1240825 1234699 1229281 1224106 1219209 1214858 1210962 1207270
52223A207270l227k147j033o23o29j12J087K193K732L065L561M065M494N214O383
$$ 1207270 1204043 1201896 1200863 1200240 1199611 1199499 1200586 1202779 1205511 1208576 1212137 1216202 1220696 1225910 1232293
52208A232293P498Q090Q398Q844R278R230Q612P704O774O100O060O676P326P444
$$ 1232293 1239791 1247881 1256279 1265123 1274401 1283631 1292243 1299947 1306721 1312821 1318881 1325557 1332883 1340327
52194A340327P242P227P340P188O860O810O932O563N429M016K847J905R22l33
$$ 1340327 1347569 1354796 1362136 1369324 1376184 1382994 1389926 1396489 1401918 1405934 1408781 1410686 1411608 1411275
52180A411275k171m781p657r757j0611j0883j1465j2321j2604j1742j0069q420
$$ 1411275 1409104 1404323 1396666 1386909 1376298 1365415 1353950 1341629 1329025 1317283 1307214 1298794
52168A298794p292o508n583m388l230k262j161L04J769K850L847N210O485O597
$$ 1298794 1291502 1284994 1279411 1275023 1271793 1269531 1268370 1268674 1270443 1273293 1277140 1282350 1288835 1295432
52154A295432N254L268J472M2r77j421j542j908k360j997o82L93L58n7J53N12
$$ 1295432 1300686 1303954 1305426 1305468 1304491 1303070 1301528 1299620 1297260 1295263 1294581 1294974 1295332 1295275 1295428 1295940
52138A295940j16j530k367k076j530j478j580j150%J724L817N864P603R617J2861
$$ 1295940 1295824 1294294 1291927 1289851 1288321 1286843 1285263 1284113 1284113 1285837 1289654 1295518 1303121 1312738 1325599
52123A325599J7183K1081K3446K4923K6908K9650L1997L2876L2413L1540L0846
$$ 1325599 1342782 1363863 1387309 1412232 1439140 1468790 1500787 1533663 1566076 1597616 1628462
52112A628462L0061K8618K6504K4314K2405K0409J7857J4953J2260R852P452N249
$$ 1628462 1658523 1687141 1713645 1737959 1760364 1780773 1798630 1813583 1825843 1835695 1843147 1848396
52100A848396L883L515L505L275K870K496J964R68m99k223m103o184q601j1424
$$ 1848396 1852279 1855794 1859299 1862574 1865444 1867940 1869904 1870872 1870373 1868150 1864047 1857863 1849262 1837838
52086A837838j4443j7077j8909k0072k0702k0233j7957j4176j0029o164k391J250
$$ 1837838 1823395 1806318 1787409 1767337 1746635 1726402 1708445 1694269 1684240 1678076 1675685 1676935
52074A676935M074N771O938Q130R186J0040J1346J3579J6119J7983J9023J9645
$$ 1676935 1681009 1686780 1693718 1701848 1711034 1721074 1732420 1745999 1762118 1780101 1799124 1818769
52062A818769J9891J9506J8606J7499J6090J4154J1924R808P753N541L426J812
$$ 1818769 1838660 1858166 1876772 1894271 1910361 1924515 1936439 1946247 1954000 1959541 1962967 1964779
52050A964779N06j093l146n391p762j0399j3129j5630j7953k0303k2468k4044
$$ 1964779 1965285 1964192 1961046 1955655 1947893 1937494 1924365 1908735 1890782 1870479 1848011 1823967
52038A823967k5101k5904k6139k5243k3411k1465j9689j7665j5350j3428j2281
$$ 1823967 1798866 1772962 1746823 1721580 1698169 1676704 1657015 1639350 1624000 1610572 1598291
52027A598291j1417j0323r224q549q182p816p619q017q994j0028j0638j0734j0537
$$ 1598291 1586874 1576551 1567327 1558778 1550596 1542780 1535161 1527144 1518150 1508122 1497484 1486750 1476213
52014A476213j0315j0126r850r502r393r749j0362j0962j1771j3148j4982j6956
$$ 1476213 1465898 1455772 1445922 1436420 1427027 1417278 1406916 1395954 1384183 1371035 1356053 1339097
52002A339097j9238k2061k4690k5921k5875k6247k8102l0241l0577k8581k5502
$$ 1339097 1319859 1297798 1273108 1247187 1221312 1195065 1166963 1136722 1106145 1077564 1052062
51991A052062k2613k0172j8002j6134j4687j3666j3129j3163j3545j3763j3538
$$ 1052062 1029449 1009277 991275 975141 960454 946788 933659 920496 906951 893188 879650
51980H79650j3101j2854j2918j3159j3433j3737j4199j4943j5880j6540j6267
$$ 879650 866549 853695 840777 827618 814185 800448 786249 771306 755426 738886 722619
51969G22619j4707j2261r876q188o826m795j743J484L864N507P324R539J1096
$$ 722619 707912 695651 685775 677587 670761 665966 664223 665707 669571 675078 682402 691941 703037
51956G03037J0866Q916O286L886J888r0k501n391q149r871j0160r365p988o156
$$ 703037 713903 722819 729105 732991 734879 734789 732288 726897 718748 708877 698717 689352 681364 675208
51942F75208l865j381R40L043N145P424R895J2280J3952J4261J3235J1617R997
$$ 675208 671343 669962 670902 673945 679090 686514 696409 708689 722641 736902 750137 761754 771751
51929G71751Q157N563K156j658n554r384j2920j5909j8277k0010k0857k0529j9174
$$ 771751 779908 785471 787627 785969 780415 771031 758111 742202 723925 703915 683058 662529 643355
51916F43355j7395j5828j4837j4412j4098j3214j1473r300p340n686l989k105
$$ 643355 625960 610132 595295 580883 566785 553571 542098 532798 525458 519772 515783 513678
51904E13678l02J279K938M985P208Q993J0020J0627J1361J2182J2306J0976Q141
$$ 513678 513376 514655 517593 522578 529786 538779 548799 559426 570787 582969 595275 606251 614392
51891F14392M216m94n678j0517j3966j5608j5722j4489j1863q320m899k089N89
$$ 614392 618608 618114 612436 601919 587953 572345 556623 542134 530271 521951 517052 514963 515552
51878E15552L447N937P731R688J2794J6630J9946K2293K4013K4823K3713K0308
$$ 515552 518999 524936 532667 542355 555149 571779 591725 614018 638031 662854 686567 706875
51866G06875J5360R565K978m096j0532j5287j8239j9758k0088j9543j8646j7417
$$ 706875 722235 731800 734778 730682 720150 704863 686624 666866 646778 627235 608589 591172
51854E91172j5075j1135o439k551k58P36R91P42J76m86j283k549m323o034o943
$$ 591172 576097 564962 558523 555972 555714 556450 557441 558183 558359 557873 556590 554041 549718 543684 536741
51839E36741o924o544o377o380o098n383m546l734k592r15P57J773K360L293M542
$$ 536741 529817 523273 516896 510516 504418 499035 494489 490755 488163 487248 488005 489778 492138 495431 499973
51824D99973N060M148K344N75r84k621m148m978m976m579m102l386k262r16L68
$$ 499973 505033 509181 511525 512100 511116 508495 504347 499369 494393 489814 485712 482326 480064 479148 479516
51809D79516J597K961M434N584N835M951L281J431k64j848l349m522n104n075
$$ 479516 481113 484074 488508 494092 499927 504878 508159 509590 509326 507478 504129 499607 494503 489428
51795D89428m545l613k461j473r90j045j429j954k490k912l054k737j847n78N06
$$ 489428 484883 481270 478809 477336 476346 475301 473872 471918 469428 466516 463462 460725 458878 458300 458806
51780D58806R01O94L97K58J02j74m12o14j027j585j775j262k10J269L354N837
$$ 458806 459707 460401 460798 461056 461158 460984 460572 459958 458931 457346 455571 454309 454099 455368 458722 464559
51764D64559P860Q943R728J0935J2113J2268J1365J0075Q259M937j0n166r047
$$ 464559 472419 481362 491090 502025 514138 526406 537771 547846 556105 561042 561032 555866 546819
51751E46819j1388j2593j2778j2035j0927r988r077p838o435n287m361l276j819
$$ 546819 535431 522838 510060 498025 487098 477110 468033 460195 453760 448473 444112 440836 439017
51738D39017J03K636N552Q030R513J0586J2172J4037J4868J3843J1332Q012M261
$$ 439017 439120 441756 447308 455338 464851 475437 487609 501646 516514 530357 541689 549701 553962
51725E53962P37j375j387P9J821L179L818L093N10l211o315p512o878n242l300
$$ 553962 554699 553324 551937 552016 553837 557016 560834 563927 564437 561226 554911 547399 540521 535279 531979
51710E31979j509l79l54j417k968m111m106k829q20J243L200N245P112P786O361
$$ 531979 530470 530091 529737 528320 525352 521241 517135 514306 513486 514729 517929 523174 530286 538072 544433
51695E44433L078o87l435m421l785k122j4K090L697M140K847p9l709o872q972
$$ 544433 547511 546824 543389 538968 535183 533061 533047 535137 538834 542974 545821 545742 542033 535161 526189
51680E26189j0203j1024j1463j0995r118o067k811j50J948L915N631O442O220
$$ 526189 515986 504962 493499 482504 473386 467319 464508 464358 466306 470221 475852 482294 488514
51667D88514N813O115P033P857Q353Q911R674J0012R000O155J702l491q178j1337
$$ 488514 494327 500442 507475 515332 523685 532596 542270 552282 561282 567437 569139 565648 557470 546133
51653E46133j2703j2561j1063q095l884P43M933Q317J0543J0784Q251L307k487
$$ 546133 533430 520869 509806 501711 497827 498570 503503 511820 522363 533147 541398 544705 542218
51640E42218p547j1183j3343j3969j3100j1398r910r143q668p823o529n120l707
$$ 542218 534671 523488 510145 496176 483076 471678 461768 452625 443957 436134 429605 424485 420778
51627D20778k202q98l90o91q77q9J329K178J819Q16J38J00L21M59O68J226J896
$$ 420778 418576 417678 417288 416597 415720 415631 416960 419138 420957 421773 421911 422011 422332 422791 423459 424685 426581
51610D26581J933R15n46j275q11M8K42l49r53r18j59J213L114N201O847P643P797
$$ 426581 428514 429429 428883 427608 426797 426845 427087 426738 425785 424867 424708 425921 429035 434236 441083 448726 456523
51593D56523P884Q440R723J1440J2592J1953R071M724L26l034m961n621n417m666
$$ 456523 464407 472847 482570 494010 506602 518555 527626 532350 532676 529642 524681 519060 513643 508977
51579E08977l353j381R98L333N554Q127J1393J5157J9041K2811K6092K8215K8926
$$ 508977 505624 504243 505241 508574 514128 522255 533648 548805 567846 590657 616749 644964 673890
51566F73890K9047K9780L1284L2392L1884K9797K7377K6010K6476K9008L3618
$$ 673890 702937 732717 764001 796393 828277 858074 885451 911461 937937 966945 1000563
51555A000563L9959M6869N2429N4766N2794M6155L4911J9879L084j2959k6800
$$ 1000563 1040522 1087391 1139820 1194586 1247380 1293535 1328446 1348325 1351409 1338450 1311650
51544A311650l8462m8232n5664o0200o2100o2190o0882n8101n3866m8421m1982
$$ 1311650 1273188 1224956 1169292 1109092 1046992 984802 923920 865819 811953 763532 721550
51533G21550l5008k8558k3704k0459j7839j5097j2476j0649r831r612r335q538
$$ 721550 686542 657984 634280 613821 595982 580885 568409 557760 547929 538317 528982 520444
51521E20444p286o129n452n008m402l866l955m503m573l685k495j878j865j893
$$ 520444 513158 507029 501577 496569 492167 488301 484346 479843 475270 471585 469090 467212 465347 463454
51507D63454j718j581j713k036k291k202j724j258j298j645j478n91J6n66j613
$$ 463454 461736 460155 458442 456406 454115 451913 450189 448931 447633 445988 444510 443919 443935 443369 441756
51492D41756j462L34K384L215K858K270J913J492P49j32q42j214j229j082j143
$$ 441756 440294 440628 443012 446227 449085 451355 453268 454760 455509 455377 454535 453321 452092 451010 449867
51477D49867j520j810j681j485j791k420k573k011j407j242j056k85P24J216J173
$$ 449867 448347 446537 444856 443371 441580 439160 436587 434576 433169 431927 430871 430586 431310 432526 433699
51462D33699J149J201Q06j60j178j944k740l691m368m457m154l514k160k01J269
$$ 433699 434848 436049 436855 436695 435517 433573 430833 427142 422774 418317 414163 410649 408489 408288 409557
51447D09557J456J143J740L481N459P322R772J3328J7479K1270K3811K3920K0445
$$ 409557 411013 412156 413896 417377 422836 430158 439930 453258 470737 492007 515818 539738 560183
51434E60183J3731O161M12k532l243k469q11N70J38k741p120j1338j4171j5172
$$ 560183 573914 580075 580487 577955 574712 572243 571432 572002 572140 569399 562279 550941 536770 521598
51420E21598j4442j2503j0134q021o466n393m524l536k273q93K46R39J303J621
$$ 521598 507156 494653 484519 476498 470032 464639 460115 456579 454306 453413 453659 454598 455901 457522
51406D57522K059K494K602K166J356N81J7m38o97k98R25K302K929K793K816L703
$$ 457522 459581 462075 464677 466843 468199 468780 468797 468359 467662 467364 468289 470591 473520 476313 479129 482832
51390D82832N177O545P594Q613R854J1422J3610J6887K1374K6632L2125L7793
$$ 482832 488009 494554 502148 510761 520615 532037 545647 562534 583908 610540 642665 680458
51378F80458M3990N0898N8166O5204P1625P7225Q1463Q3119Q0591P2707N9499
$$ 680458 724448 775346 833512 898716 970341 1047566 1129029 1212148 1292739 1365446 1424945
51367A424945M2408K3710N416j1545k7113m1188n3230o2761o9865p4790p7382
$$ 1424945 1467353 1491063 1496479 1484934 1457821 1416633 1363403 1300642 1230777 1155987 1078605
51356A078605p7252p4457o9586o3282n6107m8858m2367l6768l1443k5985k0856
$$ 1078605 1001353 926896 857310 794028 737921 689063 646696 609928 578485 552500 531644
51345E31644j6720j3612j1138r259q195p780p429o792n933m931l848l090l059
$$ 531644 514924 501312 490174 480915 472720 464940 457511 450719 444786 439855 436007 432917 429858
51332D29858l303k755j198J49J08q93j446r95k41Q5k5m11j154k145k807k779k382
$$ 429858 426555 423800 422602 422751 422859 421966 420520 419525 419284 419369 419344 418933 417779 415634 412827 410048 407666
51315D07666k123j995j657r42P8J253K263K652K346J836J482J024J62o94q69m72
$$ 407666 405543 403548 401891 400949 401027 402280 404543 407195 409541 411377 412859 413883 414045 413351 412482 412010
51299D12010k53m54n02m1L22k22j601k911l523l630l740l879l564k500j056J81
$$ 412010 411757 411303 410801 410760 411082 410860 409259 406348 402825 399195 395455 391576 388012 385512 384456 384637
51283C84637J080J911K669L024L083L582M872O218O693O420O194O165N763M822
$$ 384637 385717 387628 390297 393321 396404 399986 404858 411076 417769 424189 430383 436548 442311 447133
51269D47133L832L029K059Q53L0j3L05N06P05R64O50p29k501l469l424l286l772
$$ 447133 450965 453994 456053 456906 456936 456923 457228 457734 458439 459403 460053 459324 456823 453354 449930 446644 442872
51252D42872m566m938m641m054l707l886m399m688m283l211j882p02J17N07M74
$$ 442872 438306 433368 428727 424673 420966 417080 412681 407993 403710 400499 398617 397915 398032 398539 399013
51237C99013L9p51j611j944j393m79j40m92o43L9J080J750J994J984J462L48n17
$$ 399013 399052 398301 396690 394746 393353 392874 392734 392242 391599 391638 392718 394468 396462 398446 399908 400256 399739
51220C99739l09N07P96N23P07J686K516K430J858J583J692J920K365L188M031
$$ 399739 399430 399937 400733 401256 401963 403649 406165 408595 410453 412036 413728 415648 418013 421201 425232
51205D25232M292L829L043K424K190K144J882J364J161J668K269J941O28p24j542
$$ 425232 429524 433353 436396 438820 441010 443154 445036 446400 447561 449229 451498 453439 454067 453343 451801
51190D51801k065k355j944r58n31j293k290k262j324m92m8N23J333J808J607J043
$$ 451801 449736 447381 445437 444479 443948 442655 440365 438103 436779 436287 436239 436762 438095 439903 441510 442553
51174D42553N77M11N42P01L97m62j296j633j821k301k634k096r73k40p6K79J143
$$ 442553 443130 443541 444083 444784 445181 444719 443423 441790 439969 437668 435034 432938 431965 431725 431649 431928 433071
51157D33071J827J711J035L33j74l80k24j34p76j999k712k239j244p48q59r45
$$ 433071 434898 436609 437644 437977 437803 437423 437199 437065 436289 434290 431578 429339 428095 427347 426488 425543
51141D25543o42r2M90R33J028P35L77L27O60J282K042K554K257J008o54k052k883
$$ 425543 424901 424809 425299 426232 427260 427995 428372 428699 429359 430641 432683 435237 437494 438502 437848 435796 432913
51124D32913l027k393j249k26M63J295K557L662L968L799L985M662N233N311M977
$$ 432913 429886 427493 426244 426018 426481 427776 430333 433995 437963 441762 445747 450409 455642 460953 465930
51109D65930M244L033J683Q18N43L35j84q19j231j252p86J62J156J535J178O95
$$ 465930 470174 473207 474890 475708 476251 476586 476402 475583 474352 473100 472314 472476 473632 475167 476345 477040
51093D77040O78J064J362J145K87r30j805j674o03O48J494K019K573L161L463
$$ 477040 477718 478782 480144 481289 481576 480646 478841 477167 476564 477212 478706 480725 483298 486459 489922
51078D89922L197K324J140J90j37KJ96M45J041J844K232J943J416J075Q41P35
$$ 489922 493119 495443 496583 496773 496636 496638 496834 497279 498320 500164 502396 504339 505755 506830 507671 508406
51062E08406J300K903N033P031R098J1879J5085J7251J6954J3904Q980L842N18
$$ 508406 509706 512609 517642 524673 533771 545650 560735 577986 594940 608844 617824 621666 622184
51049F22184M83L585Q027J1769J3859J4459J4121J3367J2670J2205J1468R537
$$ 622184 622667 626252 634279 646048 659907 674366 688487 701854 714524 726729 738197 747734
51037G47734O007J788j330k132j174m28j619m993r624j4479j8876k2207k3881
$$ 747734 753741 755529 754199 752067 750893 750465 748846 743853 734229 719750 700874 678667 654786
51024F54786k3746k2153j9520j6097j2282q751o019m002k269n33J218K842M096
$$ 654786 631040 608887 589367 573270 560988 552237 546218 542216 539947 539414 540632 543474 547570
51011E47570M820N250N910O963P920Q294Q305Q479Q743Q502P657O955P075P772
$$ 547570 552390 557640 563550 570513 578433 586727 595032 603511 612254 620756 628413 635368 642443 650215
50997F50215Q282Q284Q141Q319R024J0269J1936J3645J4864J5347J5341J5352
$$ 650215 658497 666781 674922 683241 692265 702534 714470 728115 742979 758326 773667 789019
50985G89019J5699J6354J7074J7610J7915J8197J8675J9267J9574J9157J7791
$$ 789019 804718 821072 838146 855756 873671 891868 910543 929810 949384 968541 986332
50974I86332J5445J2249Q654N537L923M428O948J0869J5611K0959K6934L3420
$$ 986332 1001777 1014026 1022680 1028217 1032140 1036568 1043516 1054385 1069996 1090955 1117889 1151309
50962A151309M0063M6551N2795N8728O4027O8187P0839P1839P1219O9221O6304
$$ 1151309 1191372 1237923 1290718 1349446 1413473 1481660 1552499 1624338 1695557 1764778 1831082
50951A831082O2817N8698N3692M7903M1814L5874L0450K6045K3057K1185J9767
$$ 1831082 1893899 1952597 2006289 2054192 2096006 2131880 2162330 2188375 2211432 2232617 2252384
50940B252384J8944J9755K2460K5294K5704K2660J7174J0850M775l32m012o591
$$ 2252384 2271328 2291083 2313543 2338837 2364541 2387201 2404375 2415225 2420000 2419668 2415656 2409065
50928B409065r266j3153j8517k4976l2052l9319m6517n3692o0882o7511p2654
$$ 2409065 2399799 2386646 2368129 2343153 2311101 2271782 2225265 2171573 2110691 2043180 1970526
50917A970526p6081p8362p9658p9144p6269p1891o7354o2814n7443n1105m4859
$$ 1970526 1894445 1816083 1736425 1657281 1581012 1509121 1441767 1378953 1321510 1270405 1225546
50906A225546l9687l5501l1729k8230k5171k2481j9918j7515j5623j4461j3850
$$ 1225546 1185859 1150358 1118629 1090399 1065228 1042747 1022829 1005314 989691 975230 961380
50895I61380j3323j2511j1402j0258r167p928o461n125m297l758k950j722m50
$$ 961380 948057 935546 924144 913886 904719 896791 890330 885205 880908 877150 874200 872478 872028
50882H72028O30J648K590L098L139L385M471O075P238P506P365P537Q230R206
$$ 872028 872658 874306 876896 879994 883133 886518 890989 897064 904302 911808 919173 926710 934940 944146
50868I44146J0353J1861J3864J6038J7681J8345J8378J8786K0447K3404K6886
$$ 944146 954499 966360 980224 996262 1013943 1032288 1050666 1069452 1089899 1113303 1140189
50857A140189L0056L2708L5391L8905M3686M9620N6357O3667P1513P9974Q9108
$$ 1140189 1170245 1202953 1238344 1277249 1320935 1370555 1426912 1490579 1562092 1642066 1731174
50846A731174R8791J08554J17769J26150J33952J41403J48216J53875J58161J60862
$$ 1731174 1829965 1938519 2056288 2182438 2316390 2457793 2606009 2759884 2918045 3078907
50836C078907J61123J57649J49805J38043J23134J05580Q6132O6257M7436L0305
$$ 3078907 3240030 3397679 3547484 3685527 3808661 3914241 4000373 4066630 4114066 4144371
50826D144371J5094K720n509r289r555o960r23R065K1671L4108M4119N0827N3592
$$ 4144371 4159465 4162185 4156676 4147387 4137832 4130872 4129949 4139014 4160685 4194793 4238912 4289739 4343331
50813D343331N1093M2085K6640O113j7734m3203o8760r3402j16882j38955j58486
$$ 4343331 4394424 4436509 4463149 4469262 4451528 4408325 4339565 4246163 4129281 3990326 3831840
50802C831840j73835j84131j89566j90419j86585j78408j67237j54556j40856
$$ 3831840 3658005 3473874 3284308 3093889 2907304 2728896 2561659 2407103 2266247
50793B266247j25945j10133r4583q0497o8187n7023m6143l5380k5527j7555j1576
$$ 2266247 2140302 2030169 1935586 1855089 1786902 1729879 1683736 1648356 1622829 1605274 1593698
50782A593698o978l566j864j992k976l761m409n577p288q999j0510j1989j3355
$$ 1593698 1586720 1583154 1581290 1579298 1576322 1572561 1568152 1562575 1555287 1546288 1535778 1523789 1510434
50769A510434j4458j5783j7990k0771k3045k4408k5564k7058k8434k8994k8640
$$ 1510434 1495976 1480193 1462203 1441432 1418387 1393979 1368415 1341357 1312923 1283929 1255289
50758A255289k7629k6113k4354k2719k1101j8896j6001j3201j1144r416p188m266
$$ 1255289 1227660 1201547 1177193 1154474 1133373 1114477 1098476 1085275 1074131 1064715 1057527 1053261
50746A053261r54K615O351R757J2342J4347J6513J9206K2278K5639K9507L4026
$$ 1053261 1052307 1054922 1061273 1071030 1083372 1097719 1114232 1133438 1155716 1181355 1210862 1244888
50734A244888L9051M4299M9512N4547N9505O4563O9532P3896P7457Q0618Q3698
$$ 1244888 1283939 1328238 1377750 1432297 1491802 1556365 1625897 1699793 1777250 1857868 1941566
50723A941566Q6327Q7877Q8185Q7373Q5313Q1702P6423O9324N9902M7762L3309
$$ 1941566 2027893 2115770 2203955 2291328 2376641 2458343 2534766 2604090 2663992 2711754 2745063
50712B745063J7624J861j2738k4627l2452l5853l5288l1195k3899j4237l580O924
$$ 2745063 2762687 2764548 2751810 2727183 2694731 2658878 2623590 2592395 2568496 2554259 2550679 2557603
50700B557603J6752K5522L2440L6427L6580L2562K4701J3582n49j7635l6836n6192
$$ 2557603 2574355 2599877 2632317 2668744 2705324 2737886 2762587 2776169 2775620 2757985 2721149 2664957
50688B664957p3717q8398r9625j06333j07819j05008r9771r2946q4198p3819o3317
$$ 2664957 2591240 2502842 2403217 2296884 2189065 2084057 1984286 1891340 1807142 1733323 1670006
50677A670006n3628m3968l3299k2063j1564k235O507J5024K2999L0014L5808L9933
$$ 1670006 1616378 1572410 1539111 1517048 1505484 1503249 1509756 1524780 1547779 1577793 1613601 1653534
50665A653534M1874M1635L9755L6694L2578K7612K2450J7968J4716J2643J1232
$$ 1653534 1695408 1737043 1776798 1813492 1846070 1873682 1896132 1914100 1928816 1941459 1952691
50654A952691J0073R287R155R339Q916P525O011N443N858O597P622R758J3524
$$ 1952691 1962764 1972051 1981206 1990545 1999461 2006986 2012997 2018440 2024298 2030895 2038517 2048275 2061799
50641B061799J8371K3359K8076L2621L7131M1697M6394N0937N4448N6077N5871
$$ 2061799 2080170 2103529 2131605 2164226 2201357 2243054 2289448 2340385 2394833 2450910 2506781
50630B506781N4740N3487N2216N0796M9585M9168M9108M7016L9175K2720j925
$$ 2506781 2561521 2615008 2667224 2718020 2767605 2816773 2865881 2912897 2952072 2974792 2972867
50619B972867l0393n6364p4879q4269q5475q0274p0453n8006m4892l2248k0310
$$ 2972867 2942474 2886110 2811231 2726962 2641487 2561213 2490760 2432754 2387862 2355614 2335304
50608B335304r387l12O291J0587J2856J2700R530L504m675j4642k6276l8826n0835
$$ 2335304 2325917 2325605 2331896 2342483 2355339 2368039 2377569 2381073 2376398 2361756 2335480 2296654 2245819
50595B245819o1099o9198p4990p8233p8974p7790p5365p2096o8210o3913n9202
$$ 2245819 2184720 2115522 2040532 1962299 1883325 1805535 1730170 1658074 1589864 1525951 1466749
50584A466749n3934m8231m2533l7142l2018k7177k2832j9006j5391j1835q574
$$ 1466749 1412815 1364584 1322051 1284909 1252891 1225714 1202882 1183876 1168485 1156650 1148076
50573A148076n771l160m63K128M211N593O306O443O243O108O289O721P385Q539
$$ 1148076 1142305 1139145 1138682 1140810 1145021 1150614 1156920 1163363 1169606 1175714 1182003 1188724 1196109 1204648
50559A204648J0457J3193J6692K0759K4806K8138L0793L3632L7208M0980M3973
$$ 1204648 1215105 1228298 1244990 1265749 1290555 1318693 1349486 1383118 1420326 1461306 1505279
50548A505279M5783M6458M5861M3831M0714L7147L3458K9863K7022K5800K6505
$$ 1505279 1551062 1597520 1643381 1687212 1727926 1765073 1798531 1828394 1855416 1881216 1907721
50537A907721K8870L2643L7600M3056M8163N2905N8159O4529P1583P8531Q5218
$$ 1907721 1936591 1969234 2006834 2049890 2098053 2150958 2209117 2273646 2345229 2423760 2508978
50526B508978R2102R9590J07679J16012J23935J30650J35645J38794J39917J38356
$$ 2508978 2601080 2700670 2808349 2924361 3048296 3178946 3314591 3453385 3593302 3731658
50516C731658J33339J24659J12813R8399Q1621O2398M0833J7490o649l0461n3037
$$ 3731658 3864997 3989656 4102469 4200868 4282489 4344887 4385720 4403210 4396561 4366100 4313063
50505D313063p3930r3030j09959j23577j32340j35324j32765j25487j14055r8826
$$ 4313063 4239133 4146103 4036144 3912567 3780227 3644903 3512138 3386651 3272596 3173770
50495C173770q0529o0221l8648j6292N867K6170M3189N6288O4886O7683O3120
$$ 3173770 3093241 3033020 2994372 2978080 2983947 3010117 3053306 3109594 3174480 3242163 3305283
50484C305283N0487L0307M135k5460n5136q1833j03823j20504j31602j37195j38271
$$ 3305283 3355770 3386077 3390212 3364752 3309616 3227783 3123960 3003456 2871854 2734659 2596388
50473B596388j36352j32362j26437j18841j10376j01679r2828q3962p5707o8508
$$ 2596388 2460036 2327674 2201237 2082396 1972020 1870341 1777513 1693551 1617844 1549336
50463A549336o1993n5592m9449m4199l9994l6212l2101k7365k2179j7100j2860
$$ 1549336 1487343 1431751 1382302 1338103 1298109 1261897 1229796 1202431 1180252 1163152 1150292
50452A150292r865p713n550l029o68R31J870K750L858M994O039P248Q746J0042
$$ 1150292 1140427 1132714 1127164 1124135 1123467 1124398 1126268 1129018 1132876 1137870 1143909 1151157 1159903 1169945
50438A169945J0474J0000R178Q389P503O453N693N775O688P958R244J0604J2228
$$ 1169945 1180419 1190419 1199597 1207986 1215489 1221942 1227635 1233410 1240098 1248056 1257300 1267904 1280132
50425A280132J4187J6390J8584K0515K2235K4133K6411K8649L0177L0831L1129
$$ 1280132 1294319 1310709 1329293 1349808 1372043 1396176 1422587 1451236 1481413 1512244 1543373
50414A543373L1860L3680L7053M2034M8102N4443O0539O6312P1723P6412P9789
$$ 1543373 1575233 1608913 1645966 1688000 1736102 1790545 1851084 1917396 1989119 2065531 2145320
50403B145320Q1285Q0590P7821P3468O8005O1558N4028M5383L5549K4245J1266
$$ 2145320 2226605 2307195 2385016 2458484 2526489 2588047 2642075 2687458 2723007 2747252 2758518
50392B758518l104j8205l3408m8141o1714p3475q3030q9914r3303r2616q8341
$$ 2758518 2755414 2737209 2703801 2655660 2593946 2520471 2437441 2347527 2254224 2161608 2073267
50381B073267q1666p3183o2654n0127l6657k3525j1224L44J1049K0191K6844L0208
$$ 2073267 1991601 1918418 1855764 1805637 1768980 1745455 1734231 1734575 1745624 1765815 1792659 1822867
50369A822867K9874K5930J8787Q886l139j6115k8668l9958m9644n7100o1450o2675
$$ 1822867 1852741 1878671 1897458 1906344 1903205 1887090 1858422 1818464 1768820 1711720 1650270 1587595
50357A587595o1998o0607n8570n5463n1584m7815m4615m1821l9201l6622l3840
$$ 1587595 1525597 1464990 1406420 1350957 1299373 1251558 1206943 1165122 1125921 1089299 1055459
50346A055459l0714k7514k4495k1441j8171j5184j3030j1312r147o567m531l412
$$ 1055459 1024745 997231 972736 951295 933124 917940 904910 893598 884451 877884 873353 869941
50334H69941k505j302k71J84O34J695K887L348L239L479M264M846M830M796N334
$$ 869941 867436 866134 865863 866047 866681 868376 871263 874611 877850 881329 885593 890439 895269 900065 905399
50319I05399O191O794P137P635Q435R276R846R951R470Q489P478P104P805R576
$$ 905399 911590 918384 925521 933156 941591 950867 960713 970664 980134 988623 996101 1003205 1011010 1020586
50305A020586J2008J4491J6584J8431K0570K3078K5012K5145K3114J9511J4907
$$ 1020586 1032594 1047085 1063669 1082100 1102670 1125748 1150760 1175905 1199019 1218530 1233437
50294A233437R392L354j953n168o085n741n221m688l663j832O27L363O264R574
$$ 1233437 1242829 1246183 1244230 1239062 1232977 1227236 1222015 1217327 1213664 1211832 1212459 1215822 1222086 1231660
50280A231660J3745J9041K4990K9925L1249K6728J6153J938j2008k2334k7596
$$ 1231660 1245405 1264446 1289436 1319361 1350610 1377338 1393491 1395429 1383421 1361087 1333491
50269A333491k8314k6151k2929j9737j6678j3605j0998r767j0129j1209j1943
$$ 1333491 1305177 1279026 1256097 1236360 1219682 1206077 1195079 1185312 1175183 1163974 1152031
50258A152031j1884j0865q600n292k160m80j86j20M37J237K020K969M005M482
$$ 1152031 1140147 1129282 1120682 1115390 1113230 1112750 1112564 1112444 1112881 1114118 1116138 1119107 1123112 1127594
50244A127594M116L553L448L624L638L712M311N168N521N123M345L402K299J390
$$ 1127594 1131710 1135263 1138711 1142335 1145973 1149685 1153996 1159164 1164685 1169808 1174153 1177555 1179854 1181244
50230A181244J123J057N1k145m242m956m580m333m578m580l830k611j127J073
$$ 1181244 1182367 1183424 1183475 1181330 1177088 1172132 1167552 1163219 1158641 1154061 1150231 1147620 1146493 1147566
50216A147566M254P814J1106J4531J8948K4122K8491L0754L1089L0556K9818K8850
$$ 1147566 1151820 1159634 1170740 1185271 1204219 1228341 1256832 1287586 1318675 1349231 1379049 1407899
50204A407899K7603K6371K5594K5624K6638K8361K9875K9946K7617K2453J4394
$$ 1407899 1435502 1461873 1487467 1513091 1539729 1568090 1597965 1627911 1655528 1677981 1692375
50193A692375L756q499k0908l2121m1435m8764n4132n7223n7435n4566m9412m3381
$$ 1692375 1696131 1687632 1666724 1634603 1593168 1544404 1490272 1433049 1375614 1321048 1271636 1228255
50181A228255l7273l0852k3893j7264j2435j0182j0403j2891j7418k2935k7605
$$ 1228255 1190982 1160130 1136237 1118973 1106538 1096356 1085953 1073062 1055644 1032709 1005104
50170A005104l0087l0289k8680k5617k1714j8102j5550j3649j1525r028o662m660
$$ 1005104 975017 944728 916048 890431 868717 850615 835065 821416 809891 800863 794201 789541
50158G89541k834j190N4J060K332L957N486O684P863R195J0213J0334R521Q117
$$ 789541 786707 785517 785571 786631 788963 792920 798406 805090 812953 822148 832361 842695 852216 860333
50144H60333O252L899J380o76k050l314n143p292q567q019n983l610j464R09L880
$$ 860333 866585 870484 871864 871188 869138 865824 860681 853389 844822 836803 830820 827210 825746 826655 830535
50129H30535O721Q195P918O685N496M808M700N183O040O754P026P191P801Q864
$$ 830535 837256 845451 853369 860054 865550 870358 875058 880241 886281 893035 900061 907252 915053 923917
50115I23917R821J0335J0751J1610J2891J4019J4646J5086J5834J6944J8170J9560
$$ 923917 933738 944073 954824 966434 979325 993344 1007990 1023076 1038910 1055854 1074024 1093584
50103A093584K1475K3942K6530K9057L2119L6506M2253M8601N4748O0324O5162
$$ 1093584 1115059 1139001 1165531 1194588 1226707 1263213 1305466 1354067 1408815 1469139 1534301
50092A534301O8959P1329P2043P1231O9508O7867O7295O8339P0987P4722P8499
$$ 1534301 1603260 1674589 1746632 1817863 1887371 1955238 2022533 2090872 2161859 2236581 2315080
50081B315080Q0776P9892P4678O4771N0525L2708J2310r367l0535m9124o3715
$$ 2315080 2395856 2475748 2550426 2615197 2665722 2698430 2710740 2701373 2670838 2621714 2557999
50070B557999p4342q2095q7768r1236r2208r0979q8085q3749p8195p2158o6270
$$ 2557999 2483657 2401562 2313794 2222558 2130350 2039371 1951286 1867537 1789342 1717184 1650914
50059A650914o0250n3408m6052l9616l5281l2938l1665l0590k9106k6828k3776
$$ 1650914 1590664 1537256 1491204 1451588 1416307 1383369 1351704 1321114 1292008 1265180 1241404
50048A241404k0348j6875j3472j0351p755n439k755M40L421N557P120Q654R917
$$ 1241404 1221056 1204181 1190709 1180358 1172603 1167164 1164409 1164849 1168270 1173827 1180947 1189601 1199518
50035A199518J0127R130P707O759O585O920P219O929N919M633L518K339M99k003
$$ 1199518 1209645 1218775 1226482 1233241 1239826 1246746 1253965 1260894 1266813 1271446 1274964 1277303 1277802 1275799
50021A275799m419o147p289q193q977r725j0680j1787j2546j2797j3375j5262
$$ 1275799 1271380 1265233 1257944 1249751 1240774 1231049 1220369 1208582 1196036 1183239 1169864 1154602
50009A154602j8131k0353k0570j8930j6665j4909j4089j3940j3737j2645j0261
$$ 1154602 1136471 1116118 1095548 1076618 1059953 1045044 1030955 1017015 1003278 990633 980372
49998I80372o720k282K910Q426J3380J7113J9740K1532K2004K0422J7150J3738
$$ 980372 973652 971370 974280 982706 996086 1013199 1032939 1054471 1076475 1096897 1114047 1127785
49986A127785J1416J0209R743J0086J1183J2068J1763J0702J0424J1771J4154
$$ 1127785 1139201 1149410 1159153 1169239 1180422 1192490 1204253 1214955 1225379 1237150 1251304
49975A251304J6742J9556K2963K6641K9682L1463L1992L1596L0644K9500K8402
$$ 1251304 1268046 1287602 1310565 1337206 1366888 1398351 1430343 1461939 1492583 1522083 1550485
49964A550485K7449K6931K7445K9203L1177L1360K8148K1265J1364q37j4640k8850
$$ 1550485 1577934 1604865 1632310 1661513 1692690 1724050 1752198 1773463 1784827 1783990 1769350 1740500
49952A740500m1693n1464n7157n8635n6489n1855m6026l9945l4136k9095k5473
$$ 1740500 1698807 1647343 1590186 1531551 1475062 1423207 1377181 1337236 1303100 1274005 1248532
49941A248532k3559k2738k1834k0139j7952j6150j5395j5761j6948j8709k1132
$$ 1248532 1224973 1202235 1180401 1160262 1142310 1126160 1110765 1095004 1078056 1059347 1038215
49930A038215k4428k8340l1808l3593l3203l1113k8127k4796k1411j8157j5087
$$ 1038215 1013787 985447 953639 920046 886843 855730 827603 802807 781396 763239 748152
49919G48152j2203r678p714o139m464k454m01J246K211K304J561O82P48K172M303
$$ 748152 735949 726271 718557 712418 707954 705500 705099 706345 708556 710860 712421 713103 713851 716023 720326
$$ [...]
##END NTUPLES=NMR SPECTRUM
##END=
