
##TITLE=AC1379_CRIAH12191_7519232_adBeyOnagm
##JCAMPDX= 6.0         $$ Bruker NMR JCAMP-DX V2.0
##DATA TYPE= NMR SPECTRUM
##DATA CLASS= NTUPLES
##ORIGIN= BRUKER
##OWNER= Administrator
$$ 1.72 TOPSPIN		Version 2.1
$$ 2013-02-20 23:23:02.274 -0500  Administrator@X
$$ Compression mode = diff/dup
##.OBSERVE FREQUENCY= 400.02188249412
##.OBSERVE NUCLEUS= ^1H
##.ACQUISITION MODE= SIMULTANEOUS (DQD)
##.ACQUISITION SCHEME= undefined
##.AVERAGES= 8
##.DIGITISER RES= 22
##SPECTROMETER/DATA SYSTEM= spect
##.PULSE SEQUENCE= zg30
##.SOLVENT NAME= COFFEE_meoh
##.SHIFT REFERENCE= INTERNAL, COFFEE_meoh, 1, 14.98509
##AUDIT TRAIL= $$ (NUMBER, WHEN, WHO, WHERE, PROCESS, VERSION, WHAT)
$$ ##TITLE= Audit trail, TOPSPIN		Version 2.1
$$ ##JCAMPDX= 5.01
$$ ##ORIGIN= Bruker BioSpin GmbH
$$ ##OWNER= Administrator
$$ $$ E:\/data/COFFEE/nmr/AC1379_CRIAH12191_7519232_adBeyOnagm/10/pdata/1/auditp.txt
$$ ##AUDIT TRAIL=  $$ (NUMBER, WHEN, WHO, WHERE, PROCESS, VERSION, WHAT)
(   1,<2013-02-20 23:22:54.355 -0500>,<Administrator>,<X>,<go>,<TOPSPIN 2.1>,
      <created by zg
	started at 2013-02-20 23:21:47.401 -0500,
	POWCHK enabled, PULCHK disabled,
       configuration hash MD5:
       86 BA 57 50 F2 9D 5C 9B 26 00 A9 28 5F 66 2E 89
       data hash MD5: 64K
       79 24 A5 69 0F C8 A1 E3 14 6C 53 66 E0 F0 31 64>)
(   2,<2013-02-20 23:22:57.251 -0500>,<Administrator>,<X>,<proc1d>,<TOPSPIN 2.1>,
      <Start of raw data processing
       efp LB = 0 FT_mod = 6 PKNL = 1 PHC0 = 0 PHC1 = 0 SI = 32K 
       data hash MD5: 32K
       00 84 88 3C 4D 8F 59 2B 13 72 C0 85 7A 6F 81 CB>)
(   3,<2013-02-20 23:22:57.683 -0500>,<Administrator>,<X>,<proc1d>,<TOPSPIN 2.1>,
      <pk PHC0 = 71.04309 PHC1 = 0 
       data hash MD5: 32K
       70 CB 30 36 11 AB 77 8B 60 84 BE 14 F9 2A 56 B2>)
(   4,<2013-02-20 23:22:57.892 -0500>,<Administrator>,<X>,<proc1d>,<TOPSPIN 2.1>,
      <abs ABSG = 1 
       data hash MD5: 32K
       3F E5 B8 6A E2 88 39 A8 03 46 FC EE F6 E9 07 3D>)
(   5,<2013-02-20 23:22:58.045 -0500>,<Administrator>,<X>,<proc1d>,<TOPSPIN 2.1>,
      <abs ABSG = 2 
       data hash MD5: 32K
       08 C5 1B C7 7D A1 D7 7A 93 A5 43 00 A9 33 54 90>)
(   6,<2013-02-20 23:22:58.184 -0500>,<Administrator>,<X>,<proc1d>,<TOPSPIN 2.1>,
      <abs ABSG = 3 
       data hash MD5: 32K
       5A 2D A5 B6 C9 60 E9 EC F1 F4 95 A9 6E A1 01 77>)
(   7,<2013-02-20 23:22:58.309 -0500>,<Administrator>,<X>,<proc1d>,<TOPSPIN 2.1>,
      <abs ABSG = 4 
       data hash MD5: 32K
       13 5C 42 EA 5B 70 38 77 81 61 56 6C 46 28 DB 1F>)
(   8,<2013-02-20 23:22:58.435 -0500>,<Administrator>,<X>,<proc1d>,<TOPSPIN 2.1>,
      <abs ABSG = 5 
       data hash MD5: 32K
       A1 D9 52 F0 66 5A CE 7B 7E C2 F9 81 63 50 03 AD>)
$$ ##END=
$$ 
$$ $$ hash MD5
$$ $$ A7 01 2F ED AD 9C FB AE 3A 10 6F 68 06 11 13 C8
##$RELAX= 
##$RELAX= 
##$RELAX= 
##$RELAX= 
##$RELAX= 
##$RELAX= 
##$RELAX= 
$$ Bruker specific parameters
$$ --------------------------
##$DU= <E:\>
##$EXPNO= 10
##$NAME= <AC1379_CRIAH12191_7519232_adBeyOnagm>
$$ [...]
150 150 150 150 150 150 150 150
##$TP07= 0
##$TPNAME0= <>
##$TPNAME1= <>
##$TPNAME2= <>
##$TPNAME3= <>
##$TPNAME4= <>
##$TPNAME5= <>
##$TPNAME6= <>
##$TPNAME7= <>
##$TPOAL= (0..7)
0.5 0.5 0.5 0.5 0.5 0.5 0.5 0.5
##$TPOFFS= (0..7)
0 0 0 0 0 0 0 0
##$TUNHIN= 0
##$TUNHOUT= 0
##$TUNXOUT= 0
##$USERA1= <user>
##$USERA2= <user>
##$USERA3= <user>
##$USERA4= <user>
##$USERA5= <user>
##$V9= 5
##$VALIST= <valist>
##$VCLIST= <CCCCCCCCCCCCCCC>
##$VD= 0
##$VDLIST= <DDDDDDDDDDDDDDD>
##$VPLIST= <PPPPPPPPPPPPPPP>
##$VTLIST= <TTTTTTTTTTTTTTT>
##$WBST= 1024
##$WBSW= 4
##$XGAIN= (0..3)
0 0 0 0
##$XL= 0
##$YL= 0
##$YMAX_a= 562486
##$YMIN_a= -561279
##$ZGOPTNS= <>
##$ZL1= 120
##$ZL2= 120
##$ZL3= 120
##$ZL4= 120
##$ABSF1= 14.98509
##$ABSF2= -5.573092
##$ABSG= 5
##$ABSL= 3
##$ALPHA= 0
##$AQORDER= 0
##$ASSFAC= 0
##$ASSFACI= 0
##$ASSFACX= 0
##$ASSWID= 0
##$AUNMP= <proc_prof1d_extract_pilot.lims>
##$AXLEFT= 0
##$AXNAME= <>
##$AXNUC= <1H>
##$AXRIGHT= 0
##$AXTYPE= 0
##$AXUNIT= <>
##$AZFE= 0.1
##$AZFW= 0.1
##$BCFW= 0
##$BC_mod= 0
##$BYTORDP= 0
##$COROFFS= 0
##$CY= 15
##$DATMOD= 1
##$DC= 0
##$DFILT= <>
##$DTYPP= 0
##$F1P= 0
##$F2P= 0
##$FCOR= 0.5
##$FTSIZE= 32768
##$FT_mod= 6
##$GAMMA= 0
##$GB= 0
##$INTBC= 1
##$INTSCL= 1
##$ISEN= 128
##$LB= 0
##$LEV0= 0
##$LPBIN= 0
##$MAXI= 10000
##$MC2= 0
##$MEAN= 0
##$ME_mod= 0
##$MI= 0
##$NCOEF= 0
##$NC_proc= -8
##$NLEV= 6
##$NOISF1= 0
##$NOISF2= 0
##$NSP= 0
##$NTH_PI= 0
##$NZP= 0
##$OFFSET= 14.98509
##$PC= 1
##$PHC0= 71.04309
##$PHC1= 0
##$PH_mod= 1
##$PKNL= yes
##$PPARMOD= 0
##$PPDIAG= 0
##$PPIPTYP= 0
##$PPMPNUM= 2147483647
##$PPRESOL= 1
##$PSCAL= 4
##$PSIGN= 0
##$PYNMP= <proc.py>
##$REVERSE= no
##$SF= 400.02
##$SI= 32768
##$SIGF1= 0
##$SIGF2= 0
##$SINO= 400
##$SIOLD= 32768
##$SPECTYP= <>
##$SREGLST= <1H.CDCl3>
##$SSB= 0
##$STSI= 32768
##$STSR= 0
##$SW_p= 8223.68421052631
##$SYMM= 0
##$S_DEV= 0
##$TDeff= 65536
##$TDoff= 0
##$TI= <>
##$TILT= no
##$TM1= 0
##$TM2= 0
##$TOPLEV= 0
##$USERP1= <user>
##$USERP2= <user>
##$USERP3= <user>
##$USERP4= <user>
##$USERP5= <user>
##$WDW= 1
##$XDIM= 32768
##$YMAX_p= 460516956
##$YMIN_p= -767370
##$CURPLOT= <Network HP LaserJet P1505>
##$CURPRIN= <$Network HP LaserJet P1505>
##$DFORMAT= <normdp>
##$LAYOUT= <+/1D_H.xwp>
##$LFORMAT= <normlp>
##$PFORMAT= <normpl>
##$SURQMSG= 1
$$ End of Bruker specific parameters
$$ ---------------------------------
##NTUPLES= NMR SPECTRUM
##VAR_NAME=  FREQUENCY,     SPECTRUM/REAL,   SPECTRUM/IMAG
##SYMBOL=    X,             R,               I
##VAR_TYPE=  INDEPENDENT,   DEPENDENT,       DEPENDENT
##VAR_FORM=  AFFN,          ASDF,            ASDF
##VAR_DIM=   32768,         32768,           32768
##UNITS=     HZ,            ARBITRARY UNITS, ARBITRARY UNITS
##FACTOR=    0.250966925370066, 1,           1
##FIRST=     8223.43324360094, -85377,       -146913
##LAST=      0,             112536,          -221000
##MIN=       0,             -767370,         0
##MAX=       8223.43324360094, 460516956,    0
$$ Real data points
##PAGE= N=1
##DATA TABLE= (X++(R..R)), XYDATA
$$ [...]
23823 -46925 -48279 -175519 -212954 446511 -95560 295685 -126405 -23578 -36734 -110485 3193
23811 5570 -109247 -116117 359016 -196049 -77962 70929 -143207 8257 12455 -65507 -72926 29680
23798 -59626 55455 -167098 20474 -19473 86207 -53414 -18897 67300 72637 -92875 -100385 288298
23785 -226934 -258107 27368 -30864 -267622 284373 -151702 155606 -171981 39185 63774
23775 63774 101276 -270357 -150925 49173 -11317 16729 296381 46701 199135 -71445 -216065
23764 -216065 -270303 72024 10315 -188839 -116104 -318900 -236117 194919 -254357 3626 186950
23753 186950 126896 367085 -187322 -58112 82198 171954 68528 134833 408456 -45847 -148416
23742 -148416 23828 -125461 -152999 -310802 -145294 49565 -97529 -235348 -136462 -240028
23732 -240028 212535 82834 95425 -198835 69326 -255897 4017 -416834 114908 207133 -204874
23720 -51885 101243 -140020 -38061 279979 -11803 -123680 168768 173355 133 20303 87091
23709 87091 -261074 308788 102108 295044 144426 85889 -69824 -38030 -13582 -223328
23699 -223328 -172855 295540 57555 204251 -157605 -262116 127945 -149914 261405 160220
23689 160220 -329576 18270 18280 95295 484727 265186 -230354 -74636 -209199 -454535 77217
23677 -306282 440431 79848 -69581 26538 128682 -211978 -94909 8228 -119510 -102266 -94715
23666 -94715 -438271 -476682 -42666 -27961 9313 -277540 220283 122038 -218294 -54975 -19109
23654 -313429 25458 -486396 112774 246607 37725 -202654 -204087 73791 84742 34506 -270824
23642 185985 254642 -264736 -227807 14259 -109268 -169506 375267 36021 123096 30238 -51844
23630 -138259 235445 -25687 -18476 -360312 -5702 -63425 115633 -330332 -16326 31939 81495
23619 81495 70834 98752 -177671 76109 -241773 382040 -167153 -27149 176828 -70468 -148615
23608 -148615 -83778 83307 6171 -80809 -189366 333204 90087 -5439 70113 -90474 33085
23596 127950 -255787 -152601 25660 200168 3711 147814 -26682 -328069 -22732 96371 327678
23585 327678 -42017 62328 -122901 -40425 -394287 136403 -124177 -32305 -149189 -401527
23575 -401527 241587 268144 31711 102912 82063 -18701 -69545 -78011 -129127 119250 -57090
23563 240384 96287 -137661 215123 329549 -163623 -139847 258943 -307559 -39787 -136727
23553 -136727 -48385 165711 24319 24912 176908 48192 89294 55430 -316745 34788 -203592
23541 175455 8314 -219776 197481 -124903 47636 124025 12182 -195630 -197267 67277 -20263
23529 16761 -205597 141063 -6439 -103036 -182688 103570 29787 61386 -100413 50850 307756
23518 307756 97565 119096 219271 -2258 -109126 13131 -91931 51663 -600099 57758 71483
23507 71483 -32326 -306807 -182569 -14521 -31909 -175557 -182389 74739 -78395 -11455 -105421
23496 -105421 -384664 -41479 -97303 35032 -97331 -195796 -61740 -8079 88299 65498 230926
23485 230926 31615 64208 -152815 -110123 -332298 -4404 159159 -147218 -130334 -39228 -158027
23474 -158027 -37036 -670 13272 5726 -15057 -47136 -99189 -175004 122740 -197891 -112379 -117800
23462 -117800 199302 -260637 -198339 102577 -224196 24454 -184136 -105143 144730 60319
23451 -64259 58179 -144414 -132858 102051 77558 8022 -100291 -187139 91720 -47113 138239
23439 270284 136686 -62458 -94123 4142 -119094 -211610 11856 -315222 204666 48942 -51611
23427 -18789 -242928 5097 -31532 -16764 -38033 -92015 -65761 -268103 -2282 -185943 386316
23415 -113035 38348 -177514 -229631 -21394 11702 45064 156567 -30513 368693 -164200 -178487
23404 -178487 46 154928 -165067 -129882 90520 -177472 80924 -329809 -37744 -159426 -30996
23392 -79779 36387 353557 80620 26054 46602 126484 -227206 88871 -80373 -81100 76834 185819
23380 185819 194827 181299 149268 -28865 -147673 339974 -21685 215105 327057 138089 107895
23369 107895 -55864 -544326 240495 -35502 409876 -100007 -157141 14227 82554 -75305 -65570
23358 -65570 -189891 93429 -91347 -338213 45318 24985 9420 201282 66442 -261791 -155124
23347 -155124 38112 -43871 143443 -100067 54962 27940 43024 251834 -120047 -372065
23337 -372065 130967 229553 8376 -50099 -115535 -180112 -179993 117043 -164744 -99567 -90179 -17440
23324 -30659 72372 41629 -59619 39701 -178088 82549 -257912 -262616 -32022 -64959 216487
23312 -40513 -385750 -120260 178076 135690 89931 187497 -36630 184724 -182377 -318 75144
23300 11141 -152639 -131307 -82505 -20289 95909 -443 63544 -24986 -154409 -158444 34379 106427
23288 106427 200514 -192989 -79631 -53925 -163427 75397 375013 45452 -100399 196624
23277 21189 -180300 236574 52024 -370686 3193 -199059 -78154 -159574 -143286 -22690 -326301
23266 -326301 -236087 -238714 47751 -295441 149195 -18414 29990 46379 -30145 -6570 215628
23254 -19007 115332 -215382 158678 131450 -260242 68476 -27778 452123 -142119 58247
23243 186609 -193336 118411 80419 19195 180767 198391 25119 -233515 124798 -30047
23232 -75349 155342 19816 50389 -176635 -136079 272910 57400 -54061 60432 209980 -19511
23220 -201713 149830 166727 -281064 -112889 -115187 -11272 -107456 -408786 -55545 -212415 -17500
23208 89881 -393430 -33129 -123106 14012 -75919 -44196 -205465 74696 -381166 -309942 45341
23196 31653 -331028 -241256 167686 -345206 -235386 -5052 291915 37867 88270 -280394 383437
23184 -237261 266456 213963 169233 -99025 -331152 4300 -260471 -125465 -260464 97489 -95666
23172 -37869 21125 -253490 -302281 34509 71912 -194478 -26676 345035 207511 -31972 73570
23160 -148351 48862 -237506 180946 70875 269896 25871 131696 111550 16977 -82178 -108637
23149 -108637 -348184 59198 -262802 -389397 173123 -38375 -150763 108440 830 258921
23139 258921 -122650 98201 -32696 -264491 -102785 -56859 -40214 268207 48988 -183819
23128 -114624 46891 78490 98425 188570 392401 136932 165337 186517 -25198 117065 212839
23117 212839 131871 -18378 72212 -307503 656 -37137 129980 -22271 -118170 -121682 -177990 352834
23104 -12174 408372 -196386 1886 -81 53264 66898 43976 56524 153840 -38157 -122043 -33983
23091 2207 218927 -177925 101967 188393 59222 -101271 -111733 -6432 67718 -57483 -61669
23080 -61669 359365 -183367 -228225 45857 53163 253562 63250 -184269 -119816 42450 315095
23069 315095 -107720 -41059 -49118 208482 -315370 70326 91201 -134436 286300 17996 163636
23058 163636 -100425 -48854 -195613 -245521 258919 -9912 25910 203729 -281438 124932
23047 -183402 -61387 173600 177746 -5895 73372 -12317 -49759 38476 92838 -140008 -307374
23036 -307374 47632 -616877 142864 185576 -98839 -25737 336500 208640 116372 13879 15380
23025 15380 157562 4445 -200528 28652 -102091 -3744 -225087 161370 -89502 -122377 111745
23013 246266 -116150 -92680 215277 -188583 -209848 -256527 -165530 17644 -196725 -204992 -84061
23001 63604 -131465 -307998 58645 187848 -55637 101411 24637 92605 72110 -20990 -423326
22990 -423326 52356 178267 -190991 67317 108051 29220 62897 -13905 344190 -131741 30723
22978 -43778 20605 -88490 -279820 172616 232257 -83439 -195044 -59413 197324 144042 -244876
22966 48440 -67582 -96944 151151 -65011 -53064 -65640 -143025 -141391 83948 -42277 -108767 -152224
22954 -152224 -118989 -380993 53371 5668 65621 -208494 -92089 38977 -24303 179899 -419375
22942 266260 14822 96515 -82508 -57361 -208004 -36313 -73919 -231197 26817 308611 -82284
22930 -179052 4910 -242456 -16410 -143040 -190761 -280177 153878 -49577 130214 192096 -114500
22918 85298 67889 -101011 -246538 136027 -241479 59286 68230 -70827 -248067 -83489 -110484
22907 -110484 226336 -303827 63266 44471 -263168 -85156 -38846 -206668 -167179 -119951 -283077
22896 -283077 -97259 227024 -367846 326294 -188631 33075 190197 -299109 281864 135658
22885 134939 201077 134847 145423 -155171 -127222 -5194 83370 49666 131104 -23708 -139019
22874 -139019 -20930 34391 -126464 -281297 24327 188875 -336902 75334 15613 20647 -67875
22862 100691 -222589 137108 48607 145030 -164598 52856 -60740 -51703 -44076 176241 -171927
22850 248360 -49669 298487 3119 98647 35342 234240 185349 -224619 -87262 -239094 -189937
22839 -189937 64679 53518 125419 -210698 73217 -262576 -217715 -20684 -74334 -365730 -416839
22828 -416839 -537818 -75189 -129253 296774 349347 -380989 -160624 -254401 -297191 -60503 15704
22816 -25802 -77308 33162 136397 -58131 -134600 -154055 154745 -163672 -290004 -44162 222398
22804 74004 -207932 130250 277900 -255896 -120187 -38960 150907 469667 43055 -36172
22793 -461941 82107 112345 -415569 24765 -7444 270020 -160343 -4492 -274336 -48896 54308
22781 -221448 -551565 -15755 -112039 -38141 -385118 -128114 -298798 -182644 -90451 88817
22770 -214664 -38096 -117301 -75289 -196764 72084 99834 -36363 20047 83496 -239719 224910
22758 -259685 384354 156266 130402 158391 -121654 -330472 -2257 53877 182467 20919 -63953
22746 35876 166979 -96029 -162817 42337 456405 -117008 -187235 -84226 -139317 -148004 -229899
22735 -229899 186089 225655 212786 38134 -24849 -457532 -185303 94336 322002 -99697 -104845
22724 -104845 -66416 -71550 195063 -39505 -30346 -13079 -112190 -83278 -193074 -324406 -168513
22713 -168513 -144802 56820 224016 -167414 163058 -97336 211964 -173871 350707 33919
22702 -261903 -278402 70100 -101981 -66436 -30664 -542362 19544 -131565 245039 89949 -134550
22690 -223245 -94657 122273 -176394 -118318 1348 67193 54128 -364686 -230 -28976 -62726
22679 -62726 -101622 103215 195797 52438 333831 -127608 -12692 -130688 110900 69549 53002
22668 53002 264918 70168 23453 101987 175770 54228 5524 -14136 -21926 -176217 -249784 274842
22655 -259631 35351 -95837 -38036 -103812 -40978 -54291 134950 -157626 -29213 48796 -245691
22643 -289145 -158825 83120 -12964 -68008 -11555 -163608 250367 137408 -310842 -187471
22633 -187471 -78330 -41169 14384 -79170 -189448 27366 -121208 111359 223552 10073 -384394
22621 347246 99584 -81264 -130031 -44567 -311239 13879 -278424 82910 56329 -6330 61451
22609 44021 -81563 -300731 215512 113832 55542 273439 -196798 164897 -292879 -300625
22599 -300625 -373622 -348502 -227797 -10838 -265427 -203068 131766 -102780 -105496 -125261 -155912
22588 -155912 298128 -58226 -330281 -8357 33909 -66612 -62795 151465 -205005 43780 -198380
22576 -104135 -148146 -117019 81190 72308 25783 221038 -14924 8195 178068 -7317 -245241
22565 -245241 -238171 -68886 88545 109172 -177033 14762 -174607 346949 -204801 -37384 -124330
22554 -124330 -83951 -193583 137823 -390027 -277096 203298 -101642 -24020 -321871 -306298
22544 -306298 -140617 -28357 -173678 -300304 28142 -81874 -27135 97384 52288 -276241 156956
22532 -37458 9261 -168802 -196897 -41018 -110122 35556 249534 -18858 -148342 24605 -254630
22520 142908 -12937 -179368 -197227 74206 -73034 142119 36970 275097 160001 -183125
22509 -40702 93898 -303743 23668 -236355 -39275 -33650 -30900 134375 -109369 55521 116482
22498 116482 -321636 -319868 288849 175825 134934 171758 -45625 -8225 -244392 22415 30974
22487 30974 167940 139133 10176 -24265 -68416 -211800 58555 146668 152519 -191910 -150114
22476 -150114 13384 103338 104938 -136946 153467 169649 117352 -143646 20969 -94543 280439
22464 25001 -240591 -181143 -358667 171134 -132293 -121445 119238 115019 12152 -186715 -83113
22452 186595 26365 -184941 -66748 160979 -356857 -29738 65354 120628 -69002 258716 -15895
22440 -10784 -88428 -11734 175049 -30629 -113250 -255112 -91475 -257500 -49279 99860 123341
22429 123341 -211383 -286470 -243441 -182421 146378 -131499 282180 146693 -95053 -304359
22419 -304359 180881 56337 14566 -142731 51874 -130018 53158 -42543 -427780 -2395 -217716
22408 -217716 44645 -81359 -20413 -196062 -414277 -99133 -361379 -48334 164763 -86120 372068
22396 -454612 -141945 444234 28784 -175408 -218112 353151 56855 -263005 153665 -167858
22385 -122100 -221602 45761 -11971 56117 25130 -49181 -35322 -313087 17228 56637 84984
22374 84984 -190878 367762 -6659 -31703 -138843 -47106 -131274 -105781 -246616 22407 88236
22363 88236 -43097 -147263 114588 -139770 186085 42875 -143975 35197 -100047 -432022
22353 -432022 -135642 -85622 -9671 -520001 8790 -456072 225224 -24790 202428 99439 141353
22342 141353 -106614 50772 179298 -261057 -142980 -195199 66172 -111759 -94489 188830
22331 -31975 -38426 84122 223302 -79825 -73644 -102561 -175854 10885 119870 -341849 227874
22319 96677 -237046 443247 -378347 238392 -336418 -60516 -131048 -29354 62533 -50263 -48613
22308 -48613 -89877 -111412 28160 -125943 59277 114621 244492 -54924 46714 62763 53620
22297 53620 -24054 -38572 -5867 -148191 150838 -200229 23464 -216165 211195 -35565 -103259
22286 -103259 193716 9367 110694 163095 148949 -268659 -243921 232868 44752 92446 -97013
22274 -282042 3937 356326 -247796 178828 15115 -448292 -125952 83985 94087 -30338 -166833
22263 -166833 -288494 9551 21006 64489 98037 -220964 -418716 67144 124440 41488 -295676
22251 316311 -214010 122654 -86305 127973 -168971 30778 -297980 87458 87365 209730 43560
22239 -78197 -14162 -12898 263513 69127 -193654 -103699 -494398 -239767 122666 -207152 -138352
22228 -138352 10196 -341034 317212 165044 78433 319825 154754 -381988 197060 -57805
22217 294757 167818 150967 -71756 -179160 -198256 74583 102087 85852 -4582 -80373 -49926
22206 -49926 -83616 -9974 -120869 115877 105463 -46950 -173783 -60656 -60660 -67810 35443 9909
22193 135441 -217271 -175528 -397226 45538 -313761 148720 65448 -98888 59477 15590 -451807
22181 27109 -209321 -396115 42531 -177273 -308835 -195203 -151357 -72171 49170 -78120 -163644
22170 -163644 158760 347419 -238063 -44327 -430308 -353780 352739 336520 152229 -244151
22159 -309367 110042 -209106 -16174 -120942 -208026 23366 148208 -53524 168809 -12405
22148 384253 -183188 -125008 61373 -219207 -24399 -216723 -15332 105333 439384 12408
22137 -159829 117734 -188910 116600 78835 -309589 9590 -19832 71845 -449353 41953 -28592
22125 -157142 -189952 74393 -20814 -276433 -70837 -159086 -239522 -350292 29188 155120 314889
22114 314889 -86618 -9555 86315 3292 -100932 -55649 -266988 24747 132514 23493 -9564
22102 -6324 113016 -114823 62065 -111471 111469 -99869 -132457 203485 -15250 -128891 -11268
22090 11857 -11446 219719 66871 -61522 -287677 -201804 73272 -322278 -195015 73991 -128979
22078 -164371 -258782 -110007 -392556 -44456 224146 -97081 3272 -14188 -299380 -151393 -60498
22066 5729 -167752 33872 -157603 19517 -67496 45148 -133798 73272 -36116 164481 273354
22055 273354 -98422 -40283 33908 143034 -376199 134969 -242832 11691 10443 -197570 -8056
22043 -43681 -10040 336284 -240163 93271 96218 -141858 137267 58320 -104483 -83051 -10106
22031 -235050 77768 72825 -219944 -27867 -213477 -32919 142781 92244 -96461 117153 -357068
22019 -16832 -79026 -371075 -170478 -163995 131463 -40094 -33178 -22512 -258811 -93990 30360
22007 329896 -19648 49777 139907 122699 -324454 49435 -182103 95807 -138250 -215167 -153097
21996 -153097 -9912 -145505 -160805 -175513 -210975 283480 229939 -122759 200196 101523 -37890
21984 -580419 72131 -321784 -424565 -108958 283627 -345952 222864 -125865 357040 325735
21974 325735 -329262 -75052 -233321 -87015 62886 -237213 4217 -207450 -141920 -414713 -71478
21962 -182053 -260114 128391 90871 -425871 79479 -17460 -73556 31692 -187896 -137797 536572
21950 -61233 -23038 181646 280974 -126390 48506 -39074 -70837 218568 116415 -238326 -202935
21939 -202935 -126402 -26515 -119587 23785 -82913 -260457 -113225 -27834 13033 57487 -190107
21927 71549 -10697 -14992 -375595 235122 -166317 174975 -20195 -95317 -238723 -243218 111447
21915 107136 -87230 -113074 7546 -221541 5994 -175527 -114864 -150945 -32151 -135972 155218
21903 1788 -121449 147086 -71298 68309 -3636 -97142 -334889 38753 75973 35893 -16952
21891 -356446 57478 -103512 -56019 -192636 155229 -24619 96577 -346787 -227849 70990
21880 -120982 222089 -79794 633 76674 -45584 -335069 -210274 96288 -247988 -112279 -27052
21868 -66840 -4194 51646 -154957 -246012 -145660 106224 -28829 6293 60035 61986 -20720 -228968
21856 -228968 -51293 102690 357444 294768 -328933 -99811 52245 -183402 149597 -62477
21845 -378147 57823 208369 -82639 119088 43609 -4894 -168241 34382 55134 -268824 -91707
21833 -19944 -10630 88344 -22570 222022 -17940 207770 161377 -155503 97241 -92310 -69659
21822 -69659 39543 -14620 -44377 172377 42324 -8390 53399 35113 -34324 -17090 -391446
21811 -391446 -139726 13774 -272452 25526 -211909 -45394 -71762 -156389 21091 -123373 123435
21799 97595 39383 -150778 124640 -63586 -344342 -135353 -168608 -88757 103679 -222578
21788 110430 114909 75905 -125419 -215509 110759 265697 -352294 56285 -113865 -225904
21778 -225904 -219152 -187479 24614 52077 107943 -71662 -35561 61573 65959 -356094 39220 -267128
21765 136290 119096 -226201 179212 120162 -98803 60973 234459 -119432 74031 247847
21755 247847 98692 -159467 -62019 312684 124073 -55890 -253734 212892 7191 -41317 55612
21743 -152151 181215 -200019 -210720 91191 54498 -13557 175124 -251773 -237465 -144329 5609
21731 -215498 -124230 175674 -29997 89530 -178577 78026 -27981 -150084 -233629 -47875 -42803
21720 -42803 -239237 -5718 266935 171885 117463 -24954 -396701 100621 -223213 -135934 -121735
21709 -121735 -40770 83267 -185819 -166992 -300444 -234495 -281812 19695 -169974 -142313 -14178
21697 -127799 182638 132566 55683 -306275 -251633 23170 -15468 -117105 218077 -241249
21686 162493 67798 -28533 46712 51182 281931 -88810 -136538 -19072 -376014 -273626 110629
21674 248416 -8970 -93480 -112444 120316 -82678 -104217 -58353 -290304 -181171 -17062 -74 325833
21661 147096 -32644 -137199 162851 -442530 -443718 -290115 18562 -156156 -25820 174890
21650 154928 -22782 167567 277650 36207 206291 -81077 -17979 -66715 -184072 143542
21639 -179154 73345 -196983 -139630 -140537 -115457 -94911 31124 111870 -118470 -72035 16728
21627 -55735 -184731 154617 -186753 -144035 -220974 -142879 -22700 -347150 101078 35213 -203332
21615 -190096 103331 -83267 -134755 -318909 -54745 -176260 -84489 -477092 -28394 -40619 -1664
21603 -70973 63353 -218461 -105467 26533 35829 198942 110762 -173546 -98650 2440 167510
21592 167510 -137468 -59419 23732 -249042 -6643 -178857 -128688 -14443 -225318 -244170 -60134
21580 -26123 7221 65863 -38073 -169729 -121021 -145714 69038 -203408 -322600 254484 59074
21568 -196536 -15584 37585 -72048 2263 -47211 -372207 28507 353652 329833 271343 -237815
21556 -271224 72538 -50616 165144 -139629 -46857 -249693 172301 -319004 -54448 36472
21545 -236846 -134279 193125 115348 63363 -120674 -26208 -87321 -402836 44440 -96763 61205
21533 146624 66926 119103 73852 6229 -53419 -11874 -126863 -113847 125379 -31481 -208125
21522 -208125 101364 -17843 240642 -435396 43336 -79789 137113 174752 266082 -115386
21511 -137393 -64171 225906 -126276 67291 322233 -80555 -159084 6565 -164712 361375 -5315
21499 -487901 -112500 -59908 -103055 -32967 -480575 -57357 -87627 105183 -103963 206966
21488 191045 -250698 140446 -169079 -192886 46527 170864 -26947 83128 -73944 -107091 19904
21476 291337 -9196 126441 -23291 -241307 -53010 207928 -54176 -150957 -220371 38262 -273704
21464 -198430 -180494 -580 92428 -164643 82380 -138949 -331286 -194975 -298302 -287544 -242728
21453 -242728 -12914 -307020 -18221 -127063 96466 -85638 231512 -173280 2833 6422 -96563
21441 -47275 117801 243661 241487 463641 -78009 350444 176140 170989 -125464 294279 277052
21430 277052 -144880 9154 48829 -200028 -251524 -168980 -28149 132945 -130098 158429 95774
21419 95774 75992 -219490 -171317 -131988 23621 82700 86200 75786 -324587 -219452 -4092
21407 95644 -91431 35834 -18086 60379 -189327 227577 -178024 49464 -389552 -127911 -155230
21396 -155230 -180825 -109219 115237 -259529 -149645 52131 -25592 -151051 -181650 -52858 46561
21384 -141035 37780 -243956 227994 22341 -146928 -43446 173627 -47117 24462 57850 -117618
21372 -23170 105114 -44116 -198272 226951 25763 54454 94245 -381365 -130078 -172450 149175
21360 -123732 -70549 -3930 -219757 -71446 -174883 -46970 109542 -178393 18916 7605 122087
21349 122087 -8180 -14118 -95471 177162 -19367 -9542 -32367 -324759 126293 -146346 -85741
21338 -85741 160887 -152751 25080 -144166 -103741 147698 -111646 -122165 -39103 194448
21327 -33953 -24463 -96456 -16645 -220954 -204531 -159511 -187712 -21008 -46860 388808 296062
21316 296062 30788 -196672 -420965 -55997 478991 -61574 188380 72739 86667 -114930
21305 -160063 130680 -43428 -338611 -46220 -43933 -92091 175490 -260988 133951 42581 137974
21294 137974 263766 68177 111013 -17752 103837 176874 -102475 340122 -53412 -257100
21284 -257100 -114979 -225124 -39823 -27952 69183 -282983 297636 -11874 -25157 -158438
21274 -158438 -21188 -243230 -44140 38929 -246211 -172773 97792 -6377 117032 -372801 19520
21262 83412 -35377 -46801 83993 103266 -62111 -126532 133665 29316 -486319 27896 -169073
21250 -120023 52205 33813 -289978 -199864 -166195 50379 -293884 -92403 -201711 3983 3071
21239 3071 -26836 -88962 -115551 181909 100793 -183845 6504 -119346 30179 -35296 -146054
21228 -146054 135773 -246879 -37175 15892 -240795 -94852 -175997 97150 199081 -184552
21217 120426 128599 -88012 427334 -116402 59818 -29882 51455 -415221 96033 118297 -23189
21205 -264367 113997 -71301 -50345 69959 138324 -11288 -39715 -104673 59626 -40896 -89881
21194 -89881 9936 9587 -322219 -328545 -317390 18080 -205761 140285 945 -227859 -125910 117621
21181 -125568 68644 45409 -187639 -245479 95341 -26091 -18901 -78723 -266685 -136063 -61269
21169 -29860 -170909 -188953 -240518 72314 193523 -157759 31678 -299095 155726 -193555
21158 370066 46771 -67621 -270386 -251036 -230291 -7603 -265824 -104712 107655 424680 25365
21146 -51827 9444 -133052 -266636 83479 -148462 48814 -150546 -224412 -62635 -359089 117534
21134 -84617 354244 -51922 -101799 172509 -109699 -403316 -41073 82250 19418 -150722 204108
21122 57507 -1353 -124714 -281457 169957 -131151 59178 -57914 148280 -102229 -167901 -64313
21110 -162431 -150112 -98099 111206 357785 -131158 -179103 315056 147335 -119867 -155618
21100 -155618 -78561 -118454 293425 -254089 -223592 291924 135178 369966 -311002 -72030
21089 -46883 -206942 37750 -54488 101591 -134162 -171432 144822 65492 174733 -60153 -112247
21078 -112247 124631 -18576 -148437 -34920 96306 73311 323418 -153580 -166981 91706 109317
21067 109317 -85600 -74754 187255 136696 -372143 -355692 7769 -218979 240877 152774 -102172
21055 -133762 -51985 114265 158114 111246 -216493 38804 393836 -24682 -101590 85122 -197225
21043 218201 22219 -67333 199264 -245093 -228954 -78392 -387641 -41747 493250 -131730
21032 1464 -429812 103092 -101378 -89884 235446 -120765 -375933 213345 -8765 -19350 -305695
21021 -305695 -107553 45171 -47398 -152843 -411946 -35086 -29526 15438 -49340 -73785 50934
21009 -126720 51339 -158725 133555 209236 141834 -182956 239654 -71000 221125 214657 -16790
20997 199057 -233155 33426 -161859 275191 -284357 -67970 -27623 -319115 5315 -341238
20986 -211399 79227 -514996 -235729 -169685 -18293 -401971 66934 186391 -309657 -206849
20976 -206849 170049 132795 24250 -9221 30834 -281822 -200318 -81521 -217606 -48777 -431079
20965 -431079 -93270 -352735 338498 81051 -97946 2110 199915 275275 68535 308645 -130891
20953 -117421 209497 -34305 -197643 -182341 -339897 28708 -133113 60444 -175740 173633
20942 -272566 -238392 -380618 -135307 -175434 -22879 10268 294735 384995 117522 -131479
20931 53199 -110747 220037 -20758 -131373 -194921 235043 242257 -207939 -135303 174233 -52251
20919 -62184 94676 -178456 -5305 221229 32350 -116135 -97478 -56255 -88112 -159142 240008
20907 185657 31003 -68088 311081 -91522 -158042 -154078 10893 242521 46604 -176287 -120283
20896 -120283 -175509 -166628 -261390 20877 -71820 -23213 -214357 -7053 -249452 -101251 381800
20884 21764 -269906 53695 104967 41941 -291630 -141056 -87207 -34334 -99410 238857 63009
20872 -201319 -162707 61769 -111556 329128 -228506 122057 -97616 443226 -256994 73700
20861 93359 -71674 -125729 -268076 -51139 -24067 -97562 -388857 36929 373535 -276690 -25852
20849 -44632 -184458 19537 -36944 -88399 -114786 -148202 -84568 -255161 55485 -92304 -113444
20838 -113444 -252891 14000 222723 -74651 -7042 -217954 -204263 21277 -130987 94097 -98504
20826 -193298 82232 -152195 17115 -268165 -143507 56542 -100923 -87368 -453034 132524
20815 -219492 -289335 55452 55079 -40509 33913 11543 -136541 -55927 39159 -158573 99431
20803 -28203 -62760 -126614 111360 9560 171836 -210031 207997 -22028 103433 189405 82726
20791 -203159 125193 -178382 58921 339723 9619 -479086 -115620 141320 -124965 16842
20780 86577 -186243 156582 60525 108110 93027 -38573 144116 -69604 83250 -129286 -29036
20768 -139051 124214 130913 -115815 -314719 -86019 4314 23270 -176948 -96065 -187082 -132986
20757 -132986 -278599 273898 -126206 -11927 -26178 -54946 -250346 -230083 54298 -106288
20746 -41021 -220968 -193734 -102278 -199915 197540 100522 -394355 -58194 -54980 -92966 171300
20734 -322185 -88589 78411 219287 137686 8125 -37563 49501 16690 183016 -21722 83504
20722 -180913 7542 -76714 -173018 -80689 -262771 189464 -213643 221095 -43163 -113798 -300383
20711 -300383 10124 124781 -252954 13796 -138300 577620 -115672 107427 22610 90515
20701 90515 -157368 -233769 -225523 -251975 -11519 -141478 94588 -27708 -49718 -232831 -117738
20690 -117738 13059 -302104 147800 344334 16374 -264428 115225 -216490 -113453 -83115
20680 -83115 238646 143903 -127856 258174 -76252 -302139 191704 32595 -54291 202940
20669 3563 -209010 -85916 -98294 -206216 -133581 -192372 -243915 28727 45528 56296 -149221
20657 -351672 -105624 -16331 -15745 -227287 219019 174482 -27294 140004 28120 88166 -85377
20645 -288477 -33409 103097 199429 -103576 -83338 -204065 -81603 41467 41995 -327374 23206
20633 177801 -195380 -72717 -2125 62476 -31454 -221168 175013 -53765 28320 92356 -243921
20621 107206 -254779 -20075 69825 -231166 126416 -448937 -80402 -110637 45501 31534 174736
20610 174736 -342041 -162771 -4805 46229 -55552 -169290 -262138 52217 -102053 423029 317113
20599 317113 -206320 -223221 -248280 -14154 251080 -131770 -122004 3770 -193616 39278 -258370
20587 -276354 -20442 -371842 190758 -128065 176751 -236791 -101174 81324 -141368 380215
20576 -213879 -180673 183434 -302024 -35677 -115101 18436 -389288 -14333 329068 -79218 -225333
20565 -225333 -165782 -202166 11787 -135170 -304965 -234271 -229699 -170752 -34559 77382 78543
20554 78543 -272754 -200050 -216543 206613 -90971 -78080 91857 -185969 243988 -192130 -297136
20543 -297136 140561 -151453 -65323 -67253 -287236 -245128 58291 -22392 245227 -168019 175168
20531 212359 -260311 -315743 121428 -346907 224757 -281598 4684 -163340 -43342 -331156
20521 -331156 91603 -230822 -148067 -15854 -93627 275144 -41173 -161038 12715 133834 -30778
20509 51083 -62847 -37618 9066 4475 74501 -139428 -52118 -202410 266384 21682 -197728
20497 -84632 5153 -132176 -256140 240326 47412 -71959 174784 27040 -132192 130965 -166570
20485 -301124 -1977 -556685 -347007 37491 -66243 -175186 -22912 -123432 -237604 50328 -152618
20473 -149496 -259985 184061 33302 -103422 -10870 -8053 -184051 112110 -23156 153317
20462 83333 -329044 23671 -231016 -103553 124545 487741 171512 -14531 225492 148542
20452 148542 -168296 97489 -108857 19842 -73198 104637 211188 -171301 396088 -80035
20441 -1433 28494 -83883 -167805 461941 -2564 -56103 15634 107826 244727 157217 -531924
20429 79056 -112448 -55179 -189104 19283 261069 -146194 39228 -224307 -92832 87579 -206566
20417 -380768 -290288 -238975 -618 10123 -265720 -123929 -71829 -5792 -28703 -79711 106532
20405 276022 -160504 -54100 26659 21220 -195236 249163 -479562 -57735 144621 -106376
20394 50450 -1275 107047 -21767 -133669 -9293 -348915 -31029 -7329 -46145 -179578 167230
20382 -239437 113928 -265005 174863 34286 -261494 -221871 -151208 -44875 -13417 79090 -80920
20370 -222229 -243424 -93379 -67039 73336 169014 -335813 -231979 -190326 165604 66352 -240845
20358 -55402 234601 82180 78018 -39282 222330 -186939 -59045 -252116 61435 -171073 -205909
20347 -205909 157746 -158282 9958 -389535 -157234 130990 -58105 -192869 -225253 54814
20336 -188844 -48620 -269212 49656 211497 -12875 60667 -32345 -161422 -137436 100250 187500
20325 187500 -138807 -164814 -264129 119469 36470 -21160 272215 -117552 -202885 -293875 -214176
20314 -214176 194244 -180589 -115895 -69721 -144323 -51252 -245471 -153013 -72137 223403 -112692
20302 -222349 -68140 -120237 -136875 -43930 24190 23362 131549 -39084 241077 -46567 -142997
20291 -142997 170998 94949 -311824 -105028 21273 -94295 23802 -121134 -254765 56648
20280 -104764 74971 33334 136700 -93154 -90269 -206620 -62437 -104467 -1584 -155212 -225558
20269 -225558 161273 -208043 -73069 -24376 -150228 11996 119197 -234120 -218613 -157891
20259 -157891 -328552 -284389 -60390 79751 201408 137945 -135698 -163952 -143297 -25968 -75316
20248 -75316 -138282 133816 113916 -17806 -330973 56712 -87811 51405 45175 -38912 -165127
20237 -165127 -101851 39199 244292 -214316 -103228 2397 166141 95305 165106 69472 51749
20226 51749 -40669 42259 -47878 -53099 -599258 182944 -77240 173865 -271535 -239567 -204138
20215 -204138 -95227 79430 -23789 -189688 57666 566031 338211 -362681 -153601 36635
20204 -159822 184552 -138835 -83531 194002 -346219 -12922 -103890 280826 -228526 -315776
20194 -315776 -151651 -15124 -94383 -77147 -131139 -338848 109949 -66552 -120316 -49607 94829
20182 -117610 -185146 109846 70767 -182082 65348 116625 103823 -100405 -259028 -151813
20172 -151813 110244 334668 523647 136349 59096 180355 417945 65130 -309077 -32432
20161 34608 -179998 -314870 -76512 -114530 78262 -349473 -22111 164471 -97289 181514 49976
20149 240136 -115935 -197991 -82932 -208986 -132355 114479 26254 323716 -118055 -103081
20139 -103081 40985 -35611 -294682 61068 -257715 265968 -107565 -45100 -138454 -131025 -331415
20128 -331415 176893 -193793 267963 -167382 10758 230842 8546 227214 -68342 -414657
20118 -414657 -60465 -35467 -91124 106138 -66820 -320700 -61955 99709 -98267 38320 -395900
20106 -197927 -15726 194632 -83781 86029 -100066 -115940 -21606 8353 -52396 -6739 -187835
20095 -187835 148237 -375505 196692 268706 -91546 -218060 -137138 -26835 159894 -14646
20084 226979 187449 16095 39012 37364 -202254 85138 -112917 15828 27884 121352 -399231
20072 70613 -117814 -28393 183105 -87271 -201618 -10662 30934 -298019 -346067 96762 -204905
20060 25222 -264951 -8026 194857 133912 -19869 133232 -149576 -57211 -388095 9977 -159669
20048 -25701 -38415 154003 32484 235292 -272365 -111266 218892 -178241 67600 -291423
20037 -132276 93398 -318170 -52245 -102182 47846 -4445 170789 -217407 -34077 98256 -265530
20025 115613 -131487 -232465 170414 -242467 6104 -60856 -23423 58295 23624 132747 37444
20013 -32313 -111402 -112259 18009 3394 -15635 -37030 -5313 262203 60996 53353 -40095 -204887
20001 -204887 29251 -347505 -131360 -45152 -117758 -161384 89076 184419 3744 -211510 -116431
19990 -116431 -38914 -149979 -174087 30876 78192 262195 -129771 43419 -43117 172101 -57580
19978 -90097 112810 -213677 -125183 -32140 -121762 -319165 -98312 244396 -209407 -7970 -116117
19967 -116117 -280424 -377869 240541 -197352 -197604 112292 -75349 -95452 96877 138360 -392612
19955 369804 76020 -228598 -37406 90540 -497888 -287879 -219143 132009 -30824 -118620 -271978
19944 -271978 154743 267316 84270 164468 -176762 -11770 -112069 -56739 -101081 -101539 -168178
19933 -168178 -109431 -185424 16600 25548 149414 -305991 438997 -105420 181771 -167827
19922 -2551 175827 46330 -140558 -280325 59713 -218111 -92246 -25623 11735 17528 51697
19911 51697 13844 46633 -150391 2396 -187615 -118881 -265638 -156449 -136387 -337777 -40555
19899 -236353 -59396 -83323 210047 68288 -126658 -160156 61062 -31035 -17932 -48818 -147089
19888 -147089 196656 -57789 50847 -102667 -63174 -194311 -163914 -297469 -208883 152556
19877 -279533 -221782 -77914 -29536 12283 102189 51966 209185 -98120 2487 -103722 215884
19865 145359 -173516 232540 -307277 -211608 -13834 -111760 -176475 -156964 -89349 -189819 -125800
19854 -125800 -100781 -26911 -167012 252296 -205439 -228316 133619 -140444 120909 -223229
19843 -215588 81238 -82574 -318135 -372655 -73585 85047 -111075 -291155 113452 270924
19833 270924 -194946 69172 233550 18832 -100075 -410885 51540 60158 118571 -307006 113611
19821 123658 -3910 -87024 -70609 66729 200528 -143415 -180828 -152267 -277324 -26461 3612
19809 -180923 -162964 34195 204203 -103172 75310 7039 -157637 45390 -135622 -232590 12300
19797 -238439 -174100 234597 78405 -179191 -167666 64798 -131019 123844 56401 -94286 -347886
19786 -347886 -340420 174704 -98277 -86839 -48680 30419 -127557 -66458 222298 -183912 -196954
19775 -196954 40375 -21412 277829 -145536 28566 -229010 -127115 -177735 -85646 -232084
19765 -232084 -2173 -191065 149808 -146423 -114227 -46429 -175657 -188083 -446221 -72554 -468480
19754 -468480 -107573 356043 203976 -6136 170321 107191 -96044 -148422 79911 -359203 168909
19742 39462 138730 -89041 -29361 -130337 -356441 -164245 145956 -143659 168430 33212
19731 154057 -127338 109882 -245735 -169860 -105973 -345686 62991 -87838 30144 -200260
19720 -49195 -158989 -154754 -175504 -19823 113526 -73105 -36642 -153849 225914 39929 30732
19709 30732 37169 -149678 86570 -149333 146718 -204108 133153 144560 -181980 -372068
19699 -372068 85863 144552 -220606 -68590 250127 55348 110244 113407 115172 -253649 -268056
19688 -268056 -109297 -320984 100245 97548 -207204 369709 -263318 71304 -116726 -209852
19678 -209852 -415065 -84707 -94200 119295 123435 -10346 -69908 185630 48256 -226482 -48557
19666 -85186 6449 -332655 -61315 -236237 159313 -307669 -63180 -37491 -47802 -26139 -231681
19655 -231681 -614396 -123921 -138693 -226964 -215467 -101087 -92738 155925 -480921 -80726 -21634
19643 56411 -148613 46903 -367328 135908 -96723 -85073 49717 -118093 -78178 -117831 111343
19631 17124 -73242 -120746 -355769 -56952 -106837 -263179 -69559 27203 -1048 244011 -163477
19619 -319110 -208550 -83840 -122850 -368444 -136635 -152560 77221 260700 -4982 111971 -289992
19607 55682 157560 -67732 -338907 -282389 -97258 73407 20488 -279851 -30267 61372 5881
19595 59562 83002 -370001 21558 -68877 320354 -32039 102064 93405 -467795 157106 10159
19583 174321 -54779 68066 -53608 31252 -45118 -177034 -254505 -323718 74064 27592 351936
19572 351936 -159887 -184221 47106 -246754 -67089 74678 45763 -182711 -238503 -337167 -209647
19561 -209647 21277 -7287 150222 37061 -414576 144854 -155985 12801 -77983 85937 84151
19550 84151 -403962 -264480 -91192 -133937 -33859 -122566 -20272 -272814 43879 -168963 285736
19538 -91275 -103211 281482 35618 -187189 125200 -338365 -135230 246776 -130989 172945
19527 49998 -285157 -266671 -340266 20010 163949 -303553 76122 -23665 7102 -156445 113668
19515 -170050 -28072 176912 -71605 -249029 -1661 -115360 -232777 24622 -212819 259727
19504 301851 -372006 116179 213534 196600 -102107 -233862 286889 -27230 88469 -157434
19493 -339432 -42801 -242077 -604099 -75116 10998 -452094 294570 -220406 -21065 162983
19482 54102 -222099 -168870 -52243 46337 -15752 -166087 63436 -49557 -522903 -125792 -32652
19470 -136231 107675 -87222 268924 -224374 -169469 -81602 35107 -71373 -76151 -110486 -113390
19459 -113390 -65883 149960 -217164 248651 44552 -164499 -229940 -227580 252601 -258363
19448 -327851 -175751 -92004 -268892 156654 96764 -91489 74156 129977 107921 -84616 235190
19436 161996 83615 -61535 -437093 163560 74962 -346118 -353413 -121571 2079 19676 -197825
19424 -100255 114291 9930 -235204 -30256 58089 -233437 -34372 -117581 -133855 -13204 -44393
19413 -44393 -437324 186238 -74487 21334 52974 21844 -137081 76970 -206006 134371 129706
19402 129706 -1117 -167277 -317740 -164053 115862 -77831 -205303 74873 -266077 -170474
19392 -170474 242723 81847 107126 104108 -160808 -157233 -114216 -230726 -204148 -225076 120457
19380 -138207 -133730 342189 351604 255229 -192439 -161974 194 -133856 -71469 -246058 -154677
19369 -154677 -14910 -15717 -294876 -19814 11806 -229609 -143378 -243139 -132497 197808 10715
19357 201270 55312 85546 -161828 -23468 -398142 -77499 201517 48715 -186950 48589 -121000
19345 -152471 -237666 -317057 -359230 -278450 -74979 -99604 -41991 -8495 -105299 -338198 296561
19333 200574 45870 -125978 -293471 46066 -90271 -244542 -25133 -267159 -116872 -101580
19323 -101580 -451744 -111334 981 274801 -83969 169137 310583 86656 -461751 202408
19312 303801 -48210 302204 89315 -515696 -77335 8157 109191 -193643 -45911 239762 349700
19301 349700 -352750 173509 228551 -146880 -275859 130316 -362997 -286935 21160 -169696
19290 68539 -197580 -49322 -150518 -148135 237336 138625 8667 331759 103266 -24945 214679
19278 15011 -163576 72669 128525 -79698 -148682 -157883 184184 92096 -128251 -119920 -103518
19267 -103518 -69732 -19641 -70496 -102751 -210233 -292759 302119 48910 -76437 -62080 -64549
19256 -64549 -129283 -16805 -287919 -63013 -76377 62433 -94181 56744 -230055 80657 3669
19244 22608 127034 -19048 -103188 -265593 142865 62117 -177657 -98342 92767 -106201 178677
19232 -57644 -357091 -94612 -43815 -161 -142836 1068 -231629 -124671 153617 26991 -91732
19220 -169730 -233316 -102312 -25383 -119627 278370 -49514 -239313 175953 -369428 -163772
19209 129017 -380928 20483 66484 -268068 127591 -285967 37759 -11122 -246685 232095
19198 -153274 62944 -114351 -9751 93261 -260819 186478 -111589 -26746 -44190 88599 190354
19187 190354 87013 -11840 -20016 -19481 214216 -159861 128432 -354267 42957 -74005 15030
19175 128122 -145658 -23724 -65495 77650 -1051 -406949 -261908 -130270 229962 -388910
19164 -104282 -86089 -255501 -156461 -150833 -124869 -420039 -78955 -216930 274717 -19619 24643
19152 -196690 76602 -30536 208345 155870 -99281 -91640 -29882 22791 306442 -4300 134219
19140 -36289 -150283 -111048 438268 -107148 -33944 -81926 246102 -8494 -192046 -7980 -6579
19129 -6579 50098 353123 -288673 111075 -23351 19081 -7308 -44818 -19750 -22591 -21983 -66628
19117 -66628 -173665 -132051 -185490 -107715 186457 -42793 -113746 -8693 -153658 81870 327843
19106 327843 -174446 -196105 -176523 -2612 279557 -48370 -226141 -170992 -150552 91722 131983
19095 131983 -194441 -70177 -202776 -33510 -114723 68941 -164834 -292282 -98326 349961
19084 208167 -182170 -36200 -2241 41439 127333 -107421 -86990 -40983 -39693 -229707 31534
19072 91676 -163217 -324774 285797 -5746 -206182 -177282 93095 -145218 -15286 -44742 -187962
19061 -187962 -193017 88944 156733 148310 148469 -138950 -277182 -4959 -230675 -14183 52563 -78990
19048 -37952 -90554 237432 -285864 95221 123304 -2093 -84102 -228301 -125294 4188 -230788
19036 -378480 -495387 305427 51421 -250416 492867 -184760 178053 -57388 -131762 -48241
19025 47235 -206471 -312830 177948 -7294 -52814 39481 -311121 -7261 137816 -17333 -275450
19014 -275450 -213390 43583 166992 58086 112448 194898 -66220 -125999 -239596 -95071 80875
19002 -227901 98082 -108637 -325507 -156313 -229879 -191558 -176158 -69423 82265 -141816 51575
18990 -174727 14498 147024 86025 -158868 300601 135863 129182 78542 -276610 23985 -18126
18978 -199739 -253125 -22662 202587 335972 -201337 -59924 221958 190480 132771 -11121 -35592
18967 -35592 -105745 51128 -37072 207056 -11535 -112361 -46200 -36615 55684 -52258 34118
18955 -32363 272630 95064 239018 84828 16568 394608 107703 -248523 -269788 104006
18944 145851 103417 114810 -11627 -68025 -80193 335668 134848 51039 -266251 -56217 219672
18932 28395 99677 -4863 418912 -95687 -78035 61972 48358 -198367 88085 -74245 125624
18920 237336 -120296 -497888 -107929 114458 -66703 90289 -83705 40828 -65461 11374 93106
18909 93106 -78564 -101706 -125721 -55123 -257628 25099 -15727 -69453 -215769 42961 -25547
18897 -239913 -259907 134461 -239250 -552728 77461 -397989 73287 -303468 -82952 -86116 53311
18885 8290 -54758 -53818 -73812 -37611 -225119 -17 -216302 64161 -101841 -119904 174603 13619
18872 -212858 31018 -297734 -88216 -61424 -336267 -260918 -38022 17213 -56345 -205506 309
18860 -386671 -4830 60305 84066 136500 -152746 17718 12697 232400 70687 -97138 -20443
18848 26689 200102 -143657 188241 -281059 -6418 108646 123874 -219625 11797 79389 -291315
18836 -93584 10487 24607 -206833 -284007 -12646 -215668 -288982 -41190 -246387 -9918 76082
18824 48429 -35971 -220263 459896 7598 -135088 106790 -179814 -84425 -159982 -4101 -190627
18813 -190627 172428 354460 -139863 -89799 155758 368511 205395 172038 135633 -204927
18802 77593 -101298 -175284 -93423 -110205 -93471 -13831 -78612 51911 -416007 -64003 -152216
18791 -152216 -106361 -80434 2633 104986 81240 119230 -293994 -407525 196269 -166225 238135
18779 398643 83072 107023 -251784 -174916 43894 481 -319660 -100071 -117519 -49572 -25537
18768 -25537 44036 103876 -156879 -419413 -38017 -462437 37062 -106293 54418 -124819 -246614
18757 -246614 -319946 94858 -326873 -217648 58352 188992 -100216 149224 83281 23664
18746 153442 -103118 8285 12107 -139249 -379585 -121025 114498 -300045 171628 -93307
18735 65033 -170267 119509 -341351 -13467 -364280 250285 -37267 -239235 58497 -116339
18724 41940 -43587 94074 -169524 -116350 119287 -86509 -173471 136558 -11837 246469 -45446
18712 -159 -53498 -267434 -102205 -98609 -254399 58253 370973 -146564 -323730 144718 78981
18701 78981 18894 -306440 -186898 8281 -45392 378911 -172391 -107012 -199704 -58548 229488
18689 260160 -24110 114079 -301325 82492 15234 -310255 -126385 -139124 -232581 298593
18678 -168821 -265995 -15794 -151726 -176779 8005 -60767 42915 88744 -330061 -49525 -26498
18667 -26498 130968 108563 261932 -122091 51326 10096 105908 300268 -8538 98992 19201
18655 -154179 -55856 34482 238804 -72336 -186783 -175609 90703 -233174 -28949 66055 -73068
18643 87420 349409 -191639 72581 -8671 -199657 -259511 -233424 24550 -78058 147709 -82707
18631 33290 53122 276935 -206684 219302 29185 -191934 169161 -472065 -333753 9357
18620 16035 115795 -116703 -247176 -11548 -55562 107316 178226 -117987 11110 368958 -159718
18608 -41920 247040 -58002 -200514 -47112 -47480 -41833 -87371 -371296 -81763 -81799 -10158 -307307
18596 -307307 427031 -140603 -119995 -161957 109613 101309 16258 28878 13712 -235818 -299835
18585 -299835 310840 60539 193164 -297600 -528316 54804 -248550 180466 -310619 -291082
18575 -291082 -65122 153109 34657 -65722 88503 28725 -7859 -249695 -56815 -152595 -135106
18564 -135106 -4442 -418796 -72697 137250 14665 220612 -56529 -274312 -209217 -179984 -10192
18552 -205156 -161346 64398 -348380 -312612 -48436 -54450 -236124 -258192 -361781 -53576 -16477
18540 -80788 148823 -56552 -26619 -75618 -203443 -112259 14818 133577 -72 -287945 167046
18528 -95133 -246276 480377 -145741 110971 -32330 200839 -279394 521282 46601 -202184
18517 -5274 -139055 52971 290238 -76030 -239776 158437 229274 -35274 -55508 -61240 45759
18505 -110907 -44488 64496 -350532 319362 -5050 204846 131213 76653 -54421 127647 -293216
18493 -300255 -13382 -314348 -247556 177622 -156090 -216287 -45790 -85143 99238 -117403 -69897
18482 -69897 -90798 -192436 -342475 231141 -409863 -25731 -2983 -264739 -9578 199293 -247747
18470 -264992 29169 69003 212032 -58672 -247544 -94758 209097 -117601 -44754 177182
18459 -27791 -120602 6229 -64977 -381254 -190133 71990 84859 11927 89300 -224143 -135956
18448 -135956 143164 -299835 -71784 280411 -94327 179083 -28399 231589 -114079 56006
18437 -508733 11195 404733 -102000 -28457 -18437 -91140 -136636 -20134 17481 116011 -15148
18425 -266116 -105578 285131 -137233 244612 15878 95232 -31492 231529 -368320 285449
18414 182648 98309 69280 126874 61114 -89197 -97418 -164887 -45240 -43738 98057 -56771 -160567
18402 -160567 -51241 218206 33703 310175 190697 230198 -176032 -63708 95756 27479 -113578
18390 89717 -16479 -583886 -321082 -271185 226290 -251159 -68515 -63207 -121758 -84520 -88710
18379 -88710 -251595 36964 134198 -234609 -19425 149182 -190447 352231 -91236 -217130
18369 -217130 126748 111713 -230096 -41344 94095 -156409 73899 -64046 -178927 -230275 -30140
18357 141010 -236337 94791 47948 16279 -127910 -199411 -326143 -447673 213405 -338670
18346 -312460 -234632 -140385 -86732 -132928 140571 -81128 28303 60571 -6023 -169301 -157512
18335 -157512 -81073 262870 60421 -99117 -303422 14114 -211436 -377628 -116374 -195507
18325 -195507 31631 234298 -95220 -308323 79475 -118515 -326428 -33360 -225497 12164
18314 88316 37297 122165 52031 57193 -221831 77219 161631 16748 143576 -116814 170022
18302 -4177 -73952 -26497 144325 65650 47832 252810 39988 194798 173355 10783 134096
18291 134096 166853 -64493 46018 65837 161087 40481 -131457 -130925 -132867 107258 12237 -100545
18278 -104123 8614 82484 -51693 3052 -170483 271338 44554 27890 -235403 -183038 -69668
18266 -129417 -189559 -67672 -6852 -265727 -43790 -180600 81154 235632 -154867 -108046 -43306
18254 -15533 231438 -44294 96654 -440737 -312172 -61352 130589 179800 96730 251510 -68959
18242 -39836 44 161413 -175982 164558 -231811 -58638 40669 -202528 -61569 -33121 -152455
18231 -152455 -916 200670 -144834 -32328 -101527 -26592 -64957 -11872 -162953 -58506 -223067
18220 -223067 54481 256629 -107390 -41276 -152261 -227834 48128 89499 88202 -183476 235554
18208 55282 325668 -556518 -135136 -116229 240225 -104717 -326771 -61764 -89889 -304168
18198 -304168 105193 -401002 -47428 -63114 54366 -114952 -132342 167463 -11557 175445
18187 26635 -154524 147091 -160072 207441 272861 69237 -234230 -16576 -113968 111043
18176 284505 9789 17391 -74549 -337372 18164 113849 -369119 14949 185275 121948 191097
18165 191097 -87565 -159805 91645 -410001 -138787 -191259 -78997 104533 -284219 -136502
18154 208021 -266828 81422 -230147 -245597 -139234 -162064 -192393 4087 213699 67946 -103748
18142 -65847 64005 -111851 271775 -83762 122466 -313602 -18612 242850 37231 -153405
18131 -383479 -1288 139740 49654 -211891 -24693 -309771 187863 124203 -187611 39494 226376
18120 226376 -1343 -184672 53879 -173633 -4560 -159273 -20437 31454 -16042 44003 -49410
18108 -39944 9772 -116974 231264 247675 -78826 -99654 -309451 33841 -157305 44599 16885
18096 -33838 -85590 67663 -225635 -32787 61152 -56660 22416 111182 -17205 -118517 26831
18084 -29993 5849 140201 -175012 -258581 -161298 -266646 -180407 -68192 24303 -136448 7313
18072 -244134 -285665 -102666 4599 -177136 -135939 189478 168465 -27746 -83985 -222522 -297392
18061 -297392 258455 246600 -304566 70547 12416 98471 206546 -23742 -137370 -218402 -359274
18050 -359274 -189768 -112713 -169659 111737 -345991 9101 71595 -118458 -374905 -160249
18039 -189404 20861 142812 -106368 -466582 75251 28534 144616 -30281 2691 -122181 224193
18027 129439 44535 -16326 251680 -99585 -24430 -177657 105857 -81491 228924 -146434
18016 88474 -136434 32708 -38486 -77557 -175132 -398143 -168144 162944 -74473 68212 44690
18005 44690 -137765 -364864 -463408 69055 213872 -157245 66769 -130955 -185612 -139812 262720
17993 428685 -203413 14493 75380 50090 -127609 18600 83215 -159855 -2032 74738 -253731
17981 -135419 -32407 74076 129564 200649 -138942 282931 307160 63411 202456 72694 65817
17970 65817 -217910 -199578 -17938 -286386 98549 85975 -70948 -28758 121769 -9110 -31345
17959 -31345 27755 -47273 111680 -20952 -3449 -44517 224098 106905 -3207 -36075 -57809
17948 -57809 216414 28056 429296 130816 199975 19847 -52029 -34772 37480 -110750 -250066
17937 -250066 -15229 -99877 18984 248360 -207414 3838 -243476 36798 158678 233139 -97188
17925 -588668 -310228 74443 46791 103079 116189 246249 57207 -61138 170110 -118538 180541
17913 244036 -252320 -10210 52078 -69698 293707 -88934 -33968 -78011 69813 -29243 279400
17901 -156628 -39273 -48084 77795 200107 209422 308519 -140217 35314 -85031 179945 -204361
17889 -34720 77995 197845 -75912 104266 -46306 135387 -34547 -28957 -156251 -71391 22988
17877 275706 288305 149039 58378 -60596 -126032 -10401 349020 -648815 -141175 -481031
17867 -481031 -256252 -156732 -232222 -125962 129091 -160658 -148314 -119023 157727 -37913
17856 -244931 -258514 -43969 131145 252263 -8573 -69109 -94726 259060 343714 155941 -20749
17844 -122121 -206332 122671 200650 -302059 449094 -25730 -112945 -113609 -80603 118734 21088
17832 162012 234606 72309 -281057 139822 188515 -2136 -81181 44212 -30668 -274388 50297
17820 -116090 209454 -131002 -86805 68521 -20366 73111 147042 -84561 233563 4467 -282933
17808 56341 60772 78814 -187689 122292 -13064 -192079 -269359 41770 97893 -130186 52083
17796 140760 31272 -49261 30704 48020 -147462 35391 -292739 10709 57628 61827 132698
17785 132698 -87165 20323 41819 69105 76566 -228456 23494 77828 161228 167872 -9992 -24718
17773 -24718 396884 178838 159316 49826 -32896 145598 70248 108899 -127109 -382868 181895
17761 241419 17897 -18073 386715 -125558 -185626 -1100 125318 64895 190102 -11341 185660
17749 147871 -5490 275968 -49774 -6534 277536 -176996 -117630 -254258 61497 7680 -212686
17737 249981 174143 328253 138479 -462895 -306157 -276427 3045 -62359 113993 194387 97229
17726 97229 157655 -194908 86121 271729 100162 52558 -9803 -103765 133328 -51467 467448
17714 -82755 -96068 79936 48561 126148 -266259 401791 133285 226465 -126037 158404 166565
17703 166565 -61705 91222 -12752 204391 205564 134843 130706 75231 189666 162188 -325314
17691 -34941 -91878 10113 366245 14147 202501 -148613 210462 -5387 27947 -44537 -253510
17680 -253510 -27428 195756 -141616 362615 7628 -60 -159600 84766 85683 -19918 20559 -119692
17667 14341 212906 -195284 -318104 230853 -3128 -185394 -41589 -174276 -60719 4345 167374
17656 167374 161293 -256001 -188666 64661 7655 -97464 192387 -162759 289922 137915 -60339
17644 46306 23092 305475 68475 -62460 109775 -13112 211454 9529 43515 1582 -232029
17632 -87170 -75057 -71304 43891 61499 -150237 -62756 -330671 73635 44946 -123861 282135
17620 161719 -114082 98672 181329 65823 369864 92687 -255440 -228302 106133 -92034 50142
17608 84653 303046 43601 372885 -63390 144361 40140 344308 169811 145734 104612 -106812
17596 12069 245102 485446 -54244 -197384 -71601 88544 5012 -130118 -259004 -12435 -23632
17585 -23632 79050 -80588 -164046 -171325 -193273 58302 110755 -50937 -64753 356098 -193161
17573 -249220 -264670 -208348 -222376 124176 -228052 -224935 208082 -221085 210895 281718 -151207
17561 -255606 -90719 225948 103903 -101883 -437727 96549 243820 55147 -119837 -113843
17551 -113843 -138540 -19709 -78636 -55308 92727 -90890 -202318 -22893 -66334 10689 68250
17540 68250 171322 -179886 53118 -76582 210715 -28630 179425 113412 32568 106620 75417
17529 75417 132318 432316 70237 55710 20637 -68516 202694 -25984 313913 32029 120149
17518 120149 455247 -86493 246126 233786 305762 50035 371479 -53762 84312 -260096 -159090
17507 -159090 -95588 30868 163984 256594 128896 188880 93085 107907 163813 320571 305357
17496 305357 307081 -88451 -182187 168562 497223 227710 -139649 69935 96113 133931 -108448
17484 29289 434261 246965 15057 170580 -22808 287042 124737 568201 433934 301039
17474 301039 -9101 60455 88967 344363 159303 401535 149344 308862 -183085 -173438 167712
17462 -18056 245805 -53426 245774 379001 445738 207989 318606 227290 216839 299470 422552
17451 422552 166373 251864 487279 246703 416858 477810 326484 -56534 257533 752245
17441 752245 -100659 142676 117164 251901 -22851 -40438 150526 101640 126290 23976 397270
17430 397270 161630 566754 130161 359826 466422 26942 -3425 570791 365708 592475
17420 592475 416591 575443 176977 32767 -56741 165761 358155 167430 -15686 390333
17409 -52319 101270 324677 454476 257948 -202571 222489 128118 156102 265935 513738
17399 513738 -27800 45194 59313 223778 158278 96060 203947 274143 -6622 228108 197664
17388 197664 45253 454443 62303 129120 360123 69436 164696 327229 -16364 196802 21375
17376 -76367 296323 -58510 135974 159946 361990 -50265 -98957 284858 157546 405855
17366 405855 215114 -46887 247857 233726 202423 362733 -124271 245692 34612 109935
17356 109935 108219 158803 288632 85046 445124 8415 224949 248934 291524 141207 55548
17344 64003 492110 206600 -40011 -118541 80286 -250879 -47207 95319 67898 112457 -107960
17332 21260 37652 193719 9202 -51656 331160 -43133 291965 -133740 184241 66281 -287224
17320 140307 47050 238228 143611 -67365 243637 25262 308534 241213 143965 514030 -99304
17308 196574 -112492 47053 269502 163403 42565 -39478 208210 227940 101946 159031
17298 159031 167234 93269 503828 287495 -10519 74566 267815 325313 225591 468815 194677
17286 195627 24069 164475 229424 -22364 39991 158506 226756 -47994 45967 296738 -70756
17274 101310 348756 210740 211729 210296 175613 250977 216052 147452 120468 209202 113931 534719
17262 534719 252524 354987 112431 6064 283811 374552 173099 141776 273447 -26025
17251 289107 388295 216675 224953 179867 20971 107016 477802 7928 116076 148403 241666
17240 241666 431255 51903 335986 221084 141308 309715 162766 -213173 264103 358942
17230 358942 -55146 173863 333101 297770 -246343 -37606 320581 75800 52263 81951 -14644
17218 82616 326011 138356 188297 151688 204710 239771 469687 312434 108381 407117
17208 407117 419459 15788 115877 145786 183594 299404 102120 34935 184758 165385 324507
17197 324507 1052 47031 170265 342986 403754 375599 55936 232365 435829 201921 256849
17186 256849 222005 -80154 242465 37505 277692 296301 193844 137874 377333 431630 400776
17175 400776 463462 -137008 635625 452169 410706 418017 486318 352773 461697 264529
17165 264529 271327 490264 702916 372161 -217700 58466 97706 309038 78481 185702
17155 185702 57412 522026 342076 476428 340656 227191 196204 54859 354317 404482
17145 404482 335386 26485 255597 262735 322405 422642 561453 516940 276831 269426 391523
17134 391523 228326 156829 113739 348794 243097 422848 338541 588981 375479 207036
17124 207036 190609 560938 487599 205427 186580 297563 664395 295051 932881 133971
17113 624609 84917 581088 306952 483381 429692 265578 512273 307578 247151 263598
17103 263598 251912 331478 432380 225246 779706 93862 475018 521035 615206 598201 432251
17092 432251 458483 239025 145570 531121 525081 507492 484482 625900 252958 482285 295865
17081 295865 362345 263114 471661 621865 475751 504324 553850 427349 540726 521767
17071 521767 909161 487086 460465 341008 179872 910768 478617 574976 242668 597472
17061 597472 708742 176547 722544 442041 485457 294852 485232 1016189 550919 550013
17051 550013 480282 709942 371870 416300 344381 385663 653945 318399 549171 633706
17041 633706 717952 658147 558895 635170 472708 657568 592696 558516 796668 713994 587351
17030 587351 345039 237414 370098 719510 807695 642613 875918 580551 312751 607485
17020 607485 562100 1097466 537307 617673 636677 615561 402165 459785 687298 487929
17010 487929 814704 680706 594729 787666 699786 617320 841617 788041 502209 862967
17000 862967 1056958 687281 540235 811987 1022431 916323 859669 688473 1176113 453152
16989 1109952 954521 687436 767876 828200 1000483 963050 616801 986994 1145866 652467
16979 652467 670701 599735 974765 927022 675421 837005 826532 1154487 1033310 785160
16969 785160 1176102 1096052 988230 1164292 1101367 965562 931563 950685 784666 914956
16959 914956 713057 627301 906022 1092328 1487642 1528349 1252502 1295820 1307355 1306910 879341
16948 879341 1384580 1182551 1324781 1219054 983653 1181726 1362874 1093281 1335215 1554827
16938 1554827 1210189 1556487 1208024 1401603 1170386 1400183 1120714 1054001 1479189 1409092
16928 1409092 1318127 1533332 1462335 1249320 1475283 1366280 977200 1738249 1493166 1304087
16918 1304087 1603720 1335279 1599254 1409556 1559407 1488646 1703203 1445004 1970508 1449762
16908 1449762 1511994 1642211 1895856 1627782 1627605 1959740 1673411 1751549 1895829 1832431
16898 1832431 2062207 1919298 1983960 2191628 1922391 1942486 2004863 2199345 2106302 2207166
16888 2207166 2320575 2183848 2199509 2325033 2122937 2148936 2487156 2319703 2436560 2238233
16878 2238233 2349180 2309162 2691454 2646786 2370525 2677945 2232218 2419362 2614923 2809199
16868 2809199 2686826 2571295 3037682 2717245 2708870 3141816 2816571 2814804 3233766 3218562
16858 3218562 3040988 3524802 2957756 2868694 2987236 3550390 3458354 3401175 3402394 3484548
16848 3484548 3642309 4061635 3797435 3262453 3812577 3939790 3494610 4227545 4026959
16839 4026959 4265754 3999242 3935878 4412790 4405215 4767354 4683508 4286524 5028115 4947548
16829 4947548 4937727 4993907 4930488 4768516 5227067 5308439 5535368 5364324 5860521 5562007
16819 5562007 6125152 6192114 6531398 6362493 6493189 6458804 6503862 6804995 6869450 7028462
16809 7028462 7111757 7329570 7430909 7497431 7737498 7861432 8027105 8520610 8725424 8612940
16799 8612940 9141567 9116603 9325295 9523646 9773917 9992051 10457127 10447650 11147387 11375570
16789 11375570 11743053 11529851 12252539 12255229 12588121 12825758 13620516 14034077 14139835 14704438
16779 14704438 15478416 15625977 16527836 16867536 16920775 17716798 18177174 18884769 19707692
16770 19707692 20683926 21026008 22027777 22753173 23502780 24427893 25503363 26449933 27598059
16761 27598059 28523527 29657512 31168729 32258013 33987288 35219891 36996246 38421489
16753 38421489 40519954 42305005 44557496 46536733 48852209 51506488 54257307 57404776
16745 57404776 60316290 63281934 66767707 70721228 74644641 79042594 83496900 88252009
16737 88252009 93875982 99136532 104996373 111157613 117740593 124135015 131223827 138318493
16729 138318493 145924322 153095737 160306251 167334045 174010589 179560296 185061457 189207538
16721 189207538 192330072 194590235 195643375 195312973 193854740 191555174 187432852 182437067
16713 182437067 177101417 171083330 164023123 157161702 149917987 142260386 134861538 127825731
16705 127825731 120922504 113751851 107448813 101377207 95606616 90157714 84672770 80052922
16697 80052922 75489516 71541431 67275941 63679073 60413855 57472437 54217649 51629415
16689 51629415 48931684 46193175 43815990 41963290 40070746 38103896 36280259 34782811
16681 34782811 33158560 31773423 30178954 29053690 27941307 26316616 25743889 24677072
16673 24677072 23447510 22479178 21990512 21236697 20264006 19422529 18616163 18241966 17572668
16664 17572668 17036946 16277510 16043889 15269162 14809141 14568968 13955955 13551834 12997084
16655 12997084 12729216 12269308 12170091 11648421 11309736 11024294 10717268 10096148 10411712
16646 10411712 9751616 9390367 9069927 9186388 9033362 8797125 8265329 8009372 8002387 7673434
16636 7673434 7755911 7308015 7318657 7307786 7310379 6763423 6560458 6675114 6329836 6178585
16626 6178585 6004176 6332761 5659975 5466897 5678218 5349852 5371920 5224317 5036267 4800204
16616 4800204 4729619 4642243 4632058 4483478 4691543 4763919 4643277 4552979 4008154 4150520
16606 4150520 3858780 4136926 3812537 3665493 3510273 3685280 3664141 3727529 3511142 3333391
16596 3333391 3306569 3348684 3207473 3116952 2867153 3051434 3165381 2934433 2764026 2850400
16586 2850400 3003491 2841371 2500217 2633888 2830728 2676785 2518718 2333639 2320768 2569491
16576 2569491 2752097 2328914 2361827 2205925 2405511 2199021 2090874 2483417 1980157 2099315
16566 2099315 2070724 2004831 2071590 2168328 1942476 1852942 1708893 1847197 1948601 1820967
16556 1820967 1894641 1614024 1608195 1573482 1992639 1633159 1462006 1876276 1411187 1827009
16546 1827009 1743885 1730741 1773827 1568033 1342125 1540333 1711246 1705078 1243582 1443461
16536 1443461 1756984 1659772 1632266 1441828 1030269 1548470 1395328 1163676 1353376 1139623
16526 1139623 1024864 1279268 1189059 1146523 1091169 1100858 1282819 1431165 1054757 1732363
16516 1732363 1220324 1108260 1232974 874092 1103464 1200622 1089192 895295 1052231 1245425
16506 1245425 1166839 969688 991118 1177649 1280645 859555 916569 724420 956143 1002444
16496 1002444 1116198 1104626 826810 943632 847497 929528 832622 724666 898088 713624
16486 713624 867424 986862 961957 825192 999871 999868 809790 421348 862415 971695 865698
16475 865698 841420 847798 466856 652315 902812 584473 823193 620943 804880 634756
16465 634756 800040 559129 625053 677316 794623 918809 454858 551245 1086659 753389
16455 753389 553528 615326 859754 725235 603583 721307 676633 546414 587358 504234
16445 504234 790413 557106 357987 557114 524985 562144 773562 604982 503218 686115
16435 686115 847065 412598 753564 128718 569858 784060 -18407 653122 497083 524717
16425 524717 273680 554330 363897 583811 452188 527751 571213 81778 257354 554900
16415 554900 274160 516636 600867 227369 318958 740691 540089 506357 246575 580829
16405 580829 442032 703319 276065 467199 304369 300932 757157 294586 500666 275812
16395 275812 480331 351807 324684 398226 298874 387382 570518 401944 543986 90294
16384 322097 244398 352360 413238 186042 584307 142154 311903 472371 196182 70639
16373 315514 428636 246624 538166 332834 289885 435169 368191 243029 223648 52337
16362 282761 412242 275744 383106 559686 358823 589651 72226 58280 695198 498764
16352 498764 494824 111794 125360 190331 304016 71187 192352 336747 277117 39891 378644
16341 378644 288025 362541 330348 156788 620381 383173 -22793 278020 135801 32495
16330 -50546 196608 304183 364010 -43969 530203 542081 -155032 157529 292291 337091
16320 337091 159746 301000 322316 62259 269794 253885 159408 224159 -9159 502084 125298
16308 91707 -111851 327010 69944 252702 518533 37208 156046 23873 73378 68686 53934
16297 53934 149790 186788 -16238 -237902 232460 87379 18317 124517 374022 75226 97681
16286 97681 448571 352147 263801 235234 236802 130204 28931 353974 344413 320694 303707
16275 303707 -56580 283857 254703 277743 73231 273209 50407 109344 283601 110098 -174553
16263 58100 247469 221197 45568 3169 106797 64265 65477 36249 221430 182635 198589
16252 198589 263949 -102195 59973 -122042 91391 190199 410900 -60903 230871 424027
16242 424027 131922 82814 58609 324232 -67824 -157970 519210 108276 150691 49986 229942
16231 229942 74386 -29465 180005 101884 181485 51733 199897 -14885 -30488 269848 167087
16220 167087 -188116 144988 -48158 -53076 105577 38801 109307 -32470 108517 300911 7629
16208 120500 -70089 -106011 139833 -160530 320794 48039 117722 -6572 51802 135230 -632
16196 -27935 -87375 -126804 -327671 25559 -185309 269641 84946 297900 11467 266937 -200146
16184 63523 330444 59331 174424 113843 68558 77476 136532 225098 -121775 52314 -71194
16172 -142441 444454 -23462 110590 29596 -104633 97964 -2964 195683 139150 112040 -118285
16160 333076 -190670 -29170 45393 -156362 254638 106109 77966 62265 34637 -162791
16149 -133818 74163 466236 -54002 -7481 32234 -127329 69851 -359755 8275 131225 36898
16137 126489 60510 179551 -53764 -106416 -189835 -81705 69804 121317 -17319 -87419 342600
16125 115364 -30299 -171443 82293 123288 -6079 60161 -11193 311393 69561 34914 152117
16114 152117 -116267 159724 -65907 -71998 10831 -1055 -196535 197596 99201 -124074 34345
16102 63861 40051 80019 110217 202030 -10846 -33093 -136308 238911 283616 -215845 -192247
16091 -192247 25016 12734 -66813 -116499 -92720 243957 40148 -114958 -275283 7167 -231732
16079 -6131 -7618 13222 -99781 -393262 466192 -15950 126256 -77078 -433744 233424 -62114
16067 82074 129554 -62990 83008 72626 -99910 -178014 149259 20548 -19937 -101195 34959
16055 291266 -10504 -238116 -139372 -64952 79073 -203858 -217940 -331994 -441697 -53718 -142638
16044 -142638 78156 168084 -152273 -26729 140171 341540 77582 -102553 -333205 -236853
16034 -236853 51467 273413 246054 19060 113717 -28434 114407 -143394 95360 267515 -82110
16022 -287859 35437 49520 46788 -239030 7265 -141541 269139 -130730 -22116 -129424 686
16010 151309 -96336 -36 121164 -90466 164767 220933 -179621 -208243 -46180 -148853 -253428
15999 -253428 -19061 263982 -338439 234662 165909 266609 -124172 -93365 -92471 -185876 46833
15987 10570 -349222 123902 47452 121451 146802 467408 366735 103358 -40585 173585
15976 198738 34383 -2562 2634 184124 -37378 111960 355863 -280461 -189508 249836 -37694
15964 -131215 -41874 -52972 122609 -336664 277358 217285 -50710 17947 -307643 -177722
15954 -177722 -244063 -5778 -156760 -291583 -265375 -21355 133317 -987 -55740 13232 -135291
15942 -111833 -255696 -127903 132577 238894 -18847 -52765 -104895 78741 -100576 26693
15931 5005 -229106 -313929 -47459 116558 56440 -119291 141114 162919 42551 -292583 -234324
15920 -234324 11491 -84712 130457 243787 148311 -56698 -65491 21556 11992 -446837 -230392
15909 -230392 189076 131360 26063 -221828 49374 28898 -93516 -152067 87925 -2938 -130082
15898 -130082 -218022 -64436 102380 90492 -137351 -123357 -109176 -143079 -27525 -28707 -234517
15887 -234517 145311 242495 -332290 -12310 -42713 -119801 346809 71541 -340349 17764 -11638
15875 356200 315175 76464 -253266 297967 -60441 -73282 28642 -23934 -144148 -63701 27405
15863 -5017 104692 -151548 18467 96174 -231027 86871 -8361 5273 -199564 -61500 -68085 411300
15850 21458 -53890 -244489 -31117 -59875 60378 -56676 -84569 -411829 -350385 -47092 -51506
15839 -51506 -218262 -47784 71535 159233 -3397 77613 179609 297886 24130 91411 -49391
15827 -216800 -36293 -74589 14441 -228641 7732 74515 -159187 183832 -64280 -193727 129721
15815 46094 -157073 -240060 -353024 -243877 -197671 -84548 -301166 -85404 -243119 71328 -87760
15803 -16 58640 -636 -134051 -270172 -24104 178371 193071 41656 -413703 -40019 157058 74659
15790 49818 32285 128677 -351021 120941 -13969 -85487 127263 214850 109011 110504 -130158
15778 -51384 26090 269911 -378950 -44955 11987 -104308 -7511 -173594 100624 -203140 -170910
15767 -170910 77412 198841 108539 23937 -49206 6912 -370397 1841 -27138 -121590 -218331
15756 -218331 -166172 146993 169044 -68617 -277525 -25629 65515 30642 130595 -179341 -319038
15745 -319038 154782 -17558 65331 -72502 141654 -66735 -318264 13153 -96173 -287779 -122359
15733 31060 -53364 128326 26287 -46902 -177161 -216078 1379 81824 -156226 329635 157060
15721 221635 -187739 -180975 -276972 347640 -200147 74483 109355 38256 343870 -320172 -257548
15710 -257548 108944 -131351 -118700 89046 151552 -266900 -112159 -232691 -249065 -187891
15700 -187891 -236955 162193 -165997 56399 188120 -401591 60938 61356 10853 -100675 109769
15688 -2270 13323 179399 -316277 7079 -70740 -136193 -429593 369089 32596 -60935 223951
15676 223237 -179948 -87069 -134908 -71803 -104120 248129 -9838 43764 160424 -75613 -329492
15665 -329492 -289605 -160704 -47621 -36267 -345199 -223309 -22161 -59915 131623 62333 -53163
15653 139128 -181949 267166 -14648 173664 100916 -100510 -316312 -107741 -99462 144572
15642 -103112 -375605 109374 -175781 1103 273139 -210975 111331 165355 55138 -61279
15631 -277185 -403805 -97591 94780 -148041 116414 185634 72813 75960 -165897 178991 -281
15619 -129939 113267 71762 12281 62362 250329 -94036 388186 -147518 -104547 123227
15608 -60370 -265653 -79473 -76623 -194906 -202464 -167894 -304766 13233 -44576 -373406 -209503
15597 -209503 157647 -63150 342075 -113547 55055 -45629 8113 -146267 -288546 -190261 -159008
15586 -159008 64960 257303 78128 -354555 -244658 88776 176347 25673 102475 -49871 72875
15574 28025 99018 -292387 105585 47494 29361 164010 122014 104193 -326469 11324 -19566
15562 -339018 157757 347801 -9386 154266 243535 303445 -92039 219072 55171 96695 -20256
15550 -175449 -63299 -93500 -56779 -169601 146091 -217618 46079 3093 -245408 33141 116265
15539 116265 -289558 8620 -71321 66544 -343384 151131 400 135177 39065 -73640 153371
15527 170372 -64045 138000 -125966 -283573 19975 -428128 -92493 314165 147745 -162174
15516 -280286 23818 236193 27160 79115 125843 189187 150121 106871 104831 263932 -441860
15504 -7154 -360140 -33897 -282389 173666 150942 -80760 -30155 -189058 15848 -47407 -148645
15493 -148645 -121874 -337344 -48044 -409014 26252 84323 -13400 -460143 117162 84399 118763
15482 118763 274787 -77454 91469 -149842 -337772 162056 182309 10459 -224 -148991 67098
15470 415822 -299703 -54870 -147943 -87615 -106896 31138 -65766 18288 1200 -31112 -61777
15459 -61777 -111477 173729 -147374 -176884 143429 -4277 -233039 -173097 186239 -92681 261089
15447 -296008 -77059 -58794 218409 -21790 182821 -113112 96291 55796 -27073 150820 115732
15436 115732 307576 61165 -197343 70798 40422 -258459 -237601 -270691 -62031 -93877 141532
15424 83375 -54858 35082 48250 -99182 -265504 292226 -79985 230519 -353024 117285 -72358
15412 106572 -289432 41421 -34723 -269433 390225 53821 -57808 298517 -135329 401002
15401 -140636 -87165 -18045 -79538 -84565 -97508 -6959 -298900 -77478 359220 -27200 86838
15389 -150644 -28237 95250 132645 -262919 3908 327853 128751 -65928 185646 80875 144267
15378 144267 -101267 199192 -206732 48220 128546 66547 -295310 148627 297123 -108066
15367 23444 -110670 287265 -271502 237583 -86732 89276 97374 131087 -310432 -30984 -85669
15356 -85669 117068 -133727 -51061 28506 -152967 70839 138544 17339 -21127 81961 261172
15345 261172 -109060 40769 -217795 29321 -31772 68904 250314 106582 108353 -257739 -575057
15334 -575057 -102111 88376 219997 -295310 -288877 20181 -236361 86609 95068 375123 167417
15322 215751 153160 -164473 173773 -59437 -294864 223254 193001 339865 -8476 160842
15311 -176248 163570 88460 -256610 222190 -86191 381870 117674 -10948 -243945 42995
15300 70147 6210 -43352 -42252 83827 -290490 -51087 -7069 265620 115921 121586 78366 -319482
15287 -96431 23667 138909 144711 390027 -123646 71521 -246961 -163776 48184 118885 108807
15276 108807 210403 148830 -50632 160832 169142 253721 -114565 -157454 -29306 92061 204050
15265 204050 -82336 54964 -159264 449207 -82419 -69913 64704 251281 42053 340460 42529
15253 -60680 330172 161304 133020 420338 570101 890382 1557630 1439002 1642578 1358670
15243 1358670 372339 -127217 87691 -126028 191257 66543 -105632 27115 304621 -127600
15232 193919 297102 207774 102494 180958 -245588 349908 -98073 181241 -81103 -288284
15222 -288284 208568 -86726 -94192 90190 133836 361485 -349039 -411165 -49554 87537 -168897
15210 62123 -157863 -88403 228121 40234 170117 194858 -2523 8028 78500 336418 56122
15198 -63647 411131 143625 -192447 -180459 -216710 234578 205787 258694 205004 -28778 83721
15186 12171 107012 -138883 -85590 103993 -72251 133122 147923 -65815 -104742 89734 155573
15175 155573 344112 151834 13411 -40377 112931 -182800 248413 -12983 87147 196438
15165 196438 -55250 91730 154180 -118410 -85310 264547 -76133 -24643 -13847 87407 289417
15154 289417 106663 28856 413585 68831 266710 158375 3083 -27262 -181738 316226
15143 269009 290155 117574 -294954 -105766 138655 531 -444751 -47724 160149 -46398 -7427
15131 14448 -28167 293125 69970 238103 63477 356604 -164532 290609 151369 299609
15121 299609 249670 118812 63663 320324 177902 51388 317476 243525 231899 131350
15111 131350 362050 421951 222893 192724 70488 3736 -55032 -30552 78248 -2991 46421
15099 -33936 277947 -18055 -64131 61258 298605 -58663 148970 302088 239252 366052 94238
15087 76758 40222 93168 241650 8312 149965 29212 207947 -116520 -77566 -79592 303103
15075 260634 101302 428890 217737 162998 180361 313421 66239 -55563 215241 275250
15065 275250 325995 -171175 83936 504397 402181 327879 262296 -11998 258019 63122 539092
15054 539092 86272 -72733 205235 191672 455198 286604 157156 -81897 250317 110769
15043 51501 119236 137209 175984 69719 188324 200221 159311 123451 -203239 42213 98900
15032 98900 357701 -109489 406580 386167 312962 40163 45135 411658 563768 33907 121543
15021 121543 78866 241127 161777 136721 50269 -3793 25046 395660 210876 176554 216050
15010 216050 537412 119751 481993 255065 -77775 276748 288527 569093 218324 -42204
14999 219577 158082 277097 73985 307479 356787 420521 414464 166523 22161 165527 517213
14988 517213 161763 282929 122309 356439 285015 486346 251213 274584 37217 236027
14978 236027 425562 220359 98855 356675 430013 482663 387051 119117 465150 289423
14968 289423 243419 170348 334135 280983 316316 545412 242495 339814 473015 193395
14957 163543 238533 207708 293750 -24721 367916 117701 254463 -4604 82740 145766 632698
14946 632698 308414 495054 639467 454447 328230 368422 325290 4914 -384024 357940
14935 110948 71253 515385 368836 249340 402917 365227 445376 478739 566359 583381 234748
14923 414649 625191 614896 268901 288437 105366 450504 85412 212010 425340 373080
14913 373080 462813 388490 222562 199390 283117 525149 149246 143309 519901 329279 564965
14902 564965 216376 485710 370604 289578 363209 320572 297823 174673 26082 163326
14892 163326 442069 791942 520353 412875 275980 450808 130334 222628 656967 490171
14882 490171 374171 165966 733436 635203 369282 383064 494762 506305 277194 284999
14872 284999 248468 321024 488349 374087 271533 344894 491491 546358 527966 381586
14862 381586 496903 510566 489026 357321 543075 717901 204260 504513 535165 679477
14852 679477 346917 207365 444227 401789 172559 279521 378276 454072 166982 598871
14842 598871 353919 388262 626764 537418 601600 551718 655190 441528 375177 654517
14832 654517 514145 264968 547697 416612 436405 457457 522699 504356 361898 601804
14822 601804 285058 622945 850764 302534 336925 830209 352017 479919 448080 157090
14811 568548 304596 742672 647941 540682 766769 528286 596059 714503 724139 245312
14800 696660 589848 823724 449367 401679 676439 415592 650801 712182 1064629 431818
14789 669506 677711 486748 664740 428712 648282 394075 501938 558838 301286 380843
14779 380843 240301 532700 724771 887500 419593 552039 794027 450779 544253 681480
14769 681480 482149 528326 522717 713135 200976 634962 507306 907267 729182 409922
14759 409922 538808 1246956 1092140 619656 799796 667561 685515 616594 949554 394619
14748 545818 1015665 789266 769999 468282 680702 658377 891440 1034674 897738 592656
14738 592656 907005 505848 634908 426728 1099880 705624 527293 694524 1009031 995056
14728 995056 801697 721487 784829 704153 459270 756966 1039280 789974 794180 1078525
14718 1078525 1194822 949042 1011344 845092 1042390 763040 963777 956538 951634 918025
14708 918025 744166 1106703 858480 1065695 1018154 840040 1017531 627499 878670 820718
14698 820718 780623 878676 1070303 851445 722950 911091 907936 1121222 1265532 676264
14688 676264 871982 1289639 1145559 1047927 1226240 667812 1068605 696009 854247 1341848
14678 1341848 1001439 997670 978366 1289524 1146753 944130 874786 1242123 1093386 1339250
14668 1339250 936723 1038032 1146945 937590 1135458 1033996 1298560 1195067 1224334 1359660
14658 1359660 1308783 1185426 1228969 1072974 935643 1272354 793802 1271668 1152950 1145663
14648 1145663 1318063 1268580 1074674 1435684 1180253 1020681 1003398 1185629 1403390 1145026
14638 1145026 1450329 1328345 1191119 1251442 1172545 1257305 1465744 1356717 1367627 1500731
14628 1500731 874327 1363088 1206790 1307944 1504659 1505592 1555138 1647235 1479284 1424418
14618 1424418 1546192 1315723 1263747 1489336 1571109 1424321 1344045 1873098 1632801 1819163
14608 1819163 1867028 2045112 1433444 1614352 1951551 1662093 1736194 1960134 1841722 2059984
14598 2059984 1844009 1719153 1830977 2148126 1684903 1736729 1861559 1728114 1521424 2020898
14588 2020898 1864329 1937806 2075530 1993488 1905531 2336867 2158660 2109533 1847535 2339418
14578 2339418 1956973 2373886 2395792 2285572 2625426 2242067 2198649 2066833 2352437 2295326
14568 2295326 2197645 2677612 2466886 2595469 2524266 2784099 2879166 2516864 3052666 2791002
14558 2791002 2898642 3056993 3304996 3662926 3439345 3869099 4373718 4765906 6225897
14549 6225897 8248816 13168332 22293175 39547273 43669282 24037408 11586608 5562877
14540 3525011 2875565 2045083 2541152 2213938 1880731 2133676 1956544 2094951 1879040
14531 1879040 2291833 2302886 2268217 2389340 2399322 2845475 2621948 2526161 2623680 1988556
14521 1988556 2570629 2456746 2946724 2406737 2867314 2530223 2856540 3025328 2841096
14512 2841096 2902664 2854971 2873349 3024203 3028283 3188010 2798039 3253551 3309744 3255058 3291180
14501 3291180 3514720 3439228 3245413 3534345 3445513 3797282 3241978 3630147 3393453 3742780
14491 3742780 3769072 3876885 3851076 3888039 3992496 3993901 3614446 3916903 4148377 3961838
14481 3961838 4228607 3704915 4010001 4397037 4174534 4223269 4154499 4470128 4376365 4477815
14471 4477815 4652913 4517271 4733524 4703719 4600841 4965384 4882719 4668846 5235221 5408716
14461 5408716 5548766 5275138 4828311 5224694 5345330 5331349 5093559 5686254 5575943 5573468
14451 5573468 5521821 5733342 5727181 5895821 5789558 5990449 6122792 6302868 6317193 6465683
14441 6465683 6415285 7049037 6775522 6681595 6528624 6842308 6825369 6812598 7131721 7393778
14431 7393778 7398925 7448424 7660886 7691262 7787192 7586525 8142191 8206939 7938180 8253286
14421 8253286 8356877 8364160 8662370 8732435 8922209 8900409 9274688 9116051 9195095 9486538
14411 9486538 9612153 10005781 9608201 10141846 10104614 10600685 10526654 10743201 11061802 10902584
14401 10902584 10941576 11469223 11164996 11539539 11943285 11943626 12324886 12699410 12546025 12699323
14391 12699323 12801797 13230020 13504010 14079919 13895342 14363876 14248845 14602189 14915319
14382 14915319 15086779 15066822 15846322 15992285 16293078 16544007 16907563 16932489 17538246 17683173
14372 17683173 18345488 18413211 18740999 19318885 19397628 19741606 19862315 20766006 21146620 21483764
14362 21483764 22041975 22785965 23241755 23607183 23996700 24738960 25219554 25640733 26441239
14353 26441239 27055997 27342568 28310747 28833512 29423676 30585717 30903865 32300800 32841641
14344 32841641 33407467 34646812 35526540 36243795 37292112 38145964 39378977 40278958 41312620
14335 41312620 43244240 43967928 45225192 46593322 48024419 49265712 51002389 52502259
14327 52502259 54182690 55704518 57921415 59949365 61546350 64003850 66041734 68416261
14319 68416261 70653514 73558602 76069933 78906031 82118086 85113106 88211573 91486419
14311 91486419 95513880 99028016 103311454 107875743 112587703 117013761 121977968 127098586
14303 127098586 133015431 139419957 145436744 152073956 159277505 167138999 174751827 183181368
14295 183181368 192310968 201674221 211441115 221896280 232853673 244367460 256525171
14288 256525171 269060099 282274274 295961658 309831788 324365289 339219417 353908196
14281 353908196 368701015 383128539 397420990 411119714 423817138 435694002 445999733
14274 445999733 453885198 458232145 459401856 459241977 458575632 460516956 457757575 455029338
14266 455029338 450056539 442193775 432476199 421640246 409573445 396984494 383434922
14259 383434922 368603710 353554737 338299141 323260264 308507457 294766101 281279609
14252 281279609 267848026 255125269 242852445 231063297 220200300 209606123 199436827
14245 199436827 190255783 181545041 173192186 164819678 157796696 150659038 143782960 137523272
14237 137523272 131850167 126169727 120490969 115614767 110809521 106754074 102775349 98581632
14229 98581632 95031358 91257607 87421970 84462119 80877364 78538090 75068493 72834886
14221 72834886 70337977 68282669 65582259 63930368 61679912 59331878 57345521 56012715
14213 56012715 54754392 52786278 50899461 49197673 48093973 47365606 45716267 44978157
14205 44978157 42918333 41759497 40834868 39570300 38712695 37874305 36842988 35640576
14197 35640576 34668992 33946182 32838698 32386766 31439312 31016026 29774369 28971843 28432987
14188 28432987 27906996 27395164 26462574 26017872 25508088 24640587 24391496 23845180 23331121
14179 23331121 23076249 22587503 21792618 21178256 21135283 20616488 20037757 19676694 19112536
14170 19112536 18940321 18692586 18296193 17634058 17394987 17360241 16927375 16533288 16285185
14161 16285185 16005145 15735909 15318744 15117538 15061222 14781565 14457279 14008048 13884830
14152 13884830 13891209 13460724 13062753 13175464 12726422 12494858 12253746 12305162 11857034 11925459
14142 11925459 12031420 11969505 11389525 10980467 11295160 10821438 10624401 10363519 10323635 10033653
14132 10033653 9869076 9844605 9751201 9405385 9585082 9136662 8930841 9022524 8949049 8703583
14122 8703583 8805682 8774669 8273032 8009018 8347815 7936741 7760152 8007342 7960540 7812489
14112 7812489 7301153 7746090 7293286 7034188 7201766 7073232 7002656 7041368 6712935 6723095
14102 6723095 6724041 6593633 6493464 6362720 6359817 6152296 6458086 5984800 6246140 6052602
14092 6052602 6029984 5977924 5809637 5961451 5408017 5626395 5563265 5943822 5701089 5155244
14082 5155244 5235775 5319185 5012563 5149454 5072800 5047139 4977013 5103230 4872368 4699844
14072 4699844 4784141 4776561 4901507 4854552 4710774 4482936 4443011 4411484 4326395 4143864 4531855
14061 4531855 4806449 4390535 4067108 4152930 4348843 3841602 4043196 4268735 4076533 3627152
14051 3627152 3702111 4005059 3803011 3975984 3569606 3508669 3994397 3914961 3806131 3821056
14041 3821056 3563883 3416329 3375173 3370962 3559597 3458806 3276575 3293737 3424248 3490191
14031 3490191 3328121 3393847 3390274 3330142 3305566 3275402 3062224 3352419 2704314 2904692
14021 2904692 2900620 2894583 3049779 2736376 2813449 2616392 2774836 2759060 2806326 2277485 2532563
14010 2532563 2330412 2631725 2603701 1994119 2457489 2536545 2314605 2470462 2242520 2326125
14000 2326125 2167481 2073088 2244329 2307215 1995360 2098026 2468004 2199026 2381359 2332153
13990 2332153 2691546 4360373 7072543 15530905 32845266 45035455 29576145 14873556
13982 14873556 8901084 6347664 4956201 4330103 3954290 3518156 3592524 3285043 2993423
13973 2993423 3162377 3274367 2761716 2926888 2469444 2869831 2450118 2198379 2438070
13964 2438070 2600126 2572655 2164797 2424599 2538295 2122917 2126150 2259042 2007419 2207676
13954 2207676 2099516 1951568 2013149 2144500 2135632 1855775 2135556 2120748 2237399 2263330
13944 2263330 2058725 2058614 1978310 1973617 2112664 2025876 1668443 1760104 2042108 2109273 1869216
13933 1869216 1895309 2073557 1622262 1660228 1691284 1349147 1875178 1794622 1559168 1582968
13923 1582968 1908182 1750786 1765325 1726800 1515632 1750626 1584554 1468956 1477392 1639005
13913 1639005 1480113 1703323 1664832 1544764 1730306 1436424 1272044 1464356 1857223 1567119
13903 1567119 1546931 1426438 1517779 1564757 1664453 1521812 1561247 1237746 1499421 1620855
13893 1620855 1644773 1356531 1222504 1335358 1438493 1157883 1538096 1600981 1353569 1325446
13883 1325446 1603666 1470145 1516604 1376818 1056760 1257151 1238744 1594623 1161402 1066781
13873 1066781 1340427 1372163 1185812 1255711 1173693 1356031 1078421 1090751 1289464 1292004
13863 1292004 1685938 1063230 1347365 1174711 1225634 1072589 1008190 992133 1305659 1247891
13853 1247891 1049559 1363803 1141188 1099118 1308557 1026454 1247721 1078776 1112979 920232
13843 920232 958990 1258784 1096831 1021367 1001312 985981 1073744 1077305 911071 1271736 1109125
13832 1109125 1271303 1056288 897148 1118183 974127 898042 1095306 1071997 1214031 1118074
13822 1118074 1114042 640439 1128795 1089561 926893 769056 1087882 882560 1029433 632000
13812 632000 796630 957503 842656 951647 841656 927229 683053 1106545 698163 1028290
13802 1028290 849706 950197 585906 766525 978634 719623 755891 963512 1006229 867575
13792 867575 1062713 835365 789418 812925 795815 819621 419057 886593 799355 727813 517161
13781 517161 811500 1071275 890330 852140 684305 646991 931206 985394 864218 460020
13771 460020 828913 837729 559614 1069688 394123 412150 858573 666149 883779 526617
13761 526617 931333 918806 549514 415092 806285 888501 1047071 889532 882251 583560
13751 583560 527017 478124 993626 541579 676053 562946 843714 256298 545358 368778
13741 368778 584201 521210 463683 950167 781408 721000 982699 582654 470825 421774
13731 421774 558406 538843 578437 582169 774143 398603 452282 398185 513919 484425 548734
13720 548734 574372 356978 518332 527063 501705 1083582 431729 609369 700090 468088
13710 468088 165274 734900 694980 465327 490865 392936 660331 764166 568056 255523
13699 1021963 919071 579402 894020 783933 810278 537235 436363 399719 446519 446522 727375
13688 727375 470108 394241 649543 653187 497981 550942 149331 158065 680040 573800 588297
13677 588297 611882 771767 596823 504423 697714 313350 451698 444006 318835 689004
13667 689004 766696 545207 625859 311648 377741 455646 178323 569714 401178 273297
13657 273297 224040 485623 394082 426194 367887 302036 432031 395682 386809 613977 42386
13645 474052 247360 425942 478682 592653 548014 501474 546066 730291 541296 652200
13635 652200 577218 387930 680667 457943 877003 430483 411551 628756 435641 569851
13625 569851 355468 696552 451206 546598 591121 545353 500468 425535 642390 426035
13615 426035 559638 477058 567834 518717 242139 69813 355621 675642 397460 489131
13605 489131 566010 302650 128506 299138 358160 463432 417605 225785 414454 410959
13595 410959 371944 527631 306374 553062 642882 324206 344800 462949 632823 76168
13584 407561 437180 177339 377516 351922 218124 325518 353559 464228 -51025 404340
13573 531999 267544 303801 156233 402601 189362 364233 525477 414743 633940 -40803
13562 -156899 294752 -21820 572033 159960 375015 170371 177175 282918 275888 270389 447562
13551 447562 41836 186902 246006 450068 294838 557238 232584 363993 343797 394736
13541 394736 333514 284209 316153 398111 259463 271271 417969 472366 254398 315416 233910
13530 233910 490667 324811 342695 423111 52184 475501 341440 -122833 308961 285230
13520 285230 463267 281490 123574 248688 219176 319013 281256 292915 251710 297535 105236
13508 437207 121365 329559 355999 84069 171194 397787 405239 276946 119268 487570
13498 487570 56213 373623 -141613 224611 193699 171252 459271 221734 193684 -8078 276139
13486 374916 165241 57664 331104 218448 489121 568511 540765 409821 314164 -20559
13475 290258 -57025 201066 250136 274528 45408 372225 337209 111180 57012 146450 258982
13464 258982 230084 292972 -96387 -84038 157780 335342 235587 156727 220324 356064 442678
13453 442678 237002 130254 218325 141432 91549 234620 499410 138543 250761 183973
13443 183973 295802 178852 331535 310246 403146 269714 132274 -98120 228223 220752
13433 220752 518796 23932 354424 -121699 266535 520038 152942 209293 174662 135470
13423 135470 -188651 301508 276944 177570 -164642 343322 34185 279462 401524 379396
13413 379396 460811 345986 314955 305307 161194 51619 26632 273908 248261 -199281 93256
13401 -59350 343321 145367 353103 255231 94666 265831 -8590 285196 433093 196219
13390 320147 204590 -143687 427993 9372 128246 110608 -64565 125014 89204 27138 154285
13379 154285 265885 -68428 285497 480361 325817 190435 279784 163409 596205 295527
13368 131116 341509 584340 305129 321390 341365 607164 707701 309097 105105 112078
13358 112078 -211713 304268 122164 143273 365737 206406 -99059 271612 -72300 542673
13347 363168 343824 263795 399079 239232 348741 289287 323048 106439 489076 244513
13336 360143 -109665 709020 275549 -77113 341004 311603 546551 442770 417839 364605
13326 364605 259350 471738 440405 403930 207198 174753 448321 136932 279501 223538
13316 223538 387156 -184779 164060 401775 202997 223233 329278 313372 112073 339082
13306 339082 117210 -34661 167613 365435 106275 190135 274248 -111598 17760 112447
13296 112447 192695 -21148 -297006 -23769 160811 390496 110941 270969 63428 -271113
13285 -36835 297381 -20885 68224 373667 114446 95150 435821 -172111 178915 -111390
13274 97940 96501 174487 209072 165229 -141089 -84807 136858 232091 -281620 -23317 43561
13262 604866 -125113 -142422 206554 167398 419615 207246 161668 314775 -18707 185351
13251 202646 31798 112363 44638 172474 -1574 457048 506897 196648 19506 340995 207377
13240 207377 93021 209819 330399 151 322451 132816 -8556 261685 49992 96228 -89335
13228 57103 -205519 131662 -54000 -235902 60556 265064 144777 -130747 5171 145457
13218 145457 192244 284417 329519 85045 127268 280124 186709 147687 124307 -18208 -58689
13207 -58689 7196 44838 370087 139474 2525 528493 277321 270059 181447 51562 -183201
13195 194962 381678 68830 141216 187589 171304 -128967 315327 142188 182127 -40939 18873
13183 -12490 69879 155712 210207 278712 192982 111060 72806 313359 103978 -21710 75168
13171 88192 180293 290043 -120919 131924 -55650 417907 226397 265723 323685 364793 274814
13160 274814 161321 -264587 215967 393071 -60160 341628 -216520 173346 -40725 58812
13149 343768 91356 92282 381163 201174 -30970 57894 178934 134793 -21570 -29975 101080
13137 117585 -2264 171399 65520 59007 -68238 -40673 30390 -42052 208389 112784 -57785
13125 70331 26804 163294 -48660 100403 256372 292131 309857 311063 183356 254092 27980
13113 244384 98531 225927 7812 197565 129179 69409 118081 3470 157317 180557 -129764
13101 128197 189852 397162 152446 -9364 232736 126342 45357 67362 -19948 4991 342034
13090 342034 116481 -127360 95748 -299464 228304 -344610 93023 149941 215979 -26605
13079 -154345 39931 402169 212605 323793 -219166 199292 -206158 -34152 279719 -88808
13068 11394 88376 34987 111918 23746 -203725 293322 -620846 150882 387756 -16408 118639
13056 212105 -219241 231059 188434 117544 25156 215920 271776 334602 100559 -19407 -1901
13044 -114569 227228 184801 -119092 -82387 69108 309055 364223 -118102 48032 454453
13034 454453 -58158 86461 46602 131949 279872 373380 -113205 -73652 176256 -125009 43039
13022 203743 510128 -25419 -59476 25257 265353 49180 219006 310241 8984 75714 67139
13011 67139 149444 151636 293135 296121 -68541 179082 3914 160279 424832 -150768 382121
12999 10440 168391 48565 2087 69580 215356 -20070 116753 -117416 23563 -208144 -122135
12988 -122135 85975 79804 69529 431377 -6810 -191699 373232 -157422 28596 -198384 179755
12976 148492 -75595 563395 79771 -75805 42580 7346 -216710 -29710 -58592 24108 -125547
12964 132232 36289 44396 132664 374464 54335 186506 60332 50526 141549 29842 -223684
12952 -175329 20515 362274 -193247 126477 9990 -6979 92419 255720 526 -34774 -98180
12941 -98180 53753 149168 -59264 186103 -293828 129159 116122 43874 245821 71106 -69297
12929 39380 103489 25225 -21534 -36774 -141705 10197 -106006 51155 -113770 169265 -38719
12917 -16691 -29757 315551 61853 58028 -159573 125411 -186027 -192679 -206691 -311683 171952
12905 87278 144180 96841 16378 126876 49658 -269982 243801 -59394 214063 -77755 -103897
12894 -103897 -76447 67693 253315 277141 -6967 -12734 74481 177760 -225267 28736 44997
12883 44997 331135 -178999 60930 -148517 89182 58897 24345 100734 3941 222172 33628
12871 -71474 51857 -456117 -41991 79086 -105454 -15073 294126 224182 155317 -18121 306537
12859 26310 49977 80637 -9261 105092 90059 68481 -75093 171670 -57889 -153591 61121
12847 -247623 2996 215140 172338 185826 39402 183032 -101056 303190 167001 27009 -34864
12835 88079 -272969 -145797 139873 -267930 -50503 -279255 -46784 6143 54216 -178638 75379
12823 62804 -233644 -186046 -6878 -174769 -113237 385003 192537 -59839 -34531 -195237 94443
12811 -50953 -69896 -57930 -156221 69972 -162384 42330 -5170 25819 66786 -112452 215348
12799 -46076 -145888 244057 85443 -12781 -91536 -43813 -1186 54548 -68676 3579 -54556 14537
12786 127378 -142037 186818 -252180 -69224 333065 -257848 105682 -210565 59763 -243296
12775 20474 -69944 -41316 174810 84282 326265 17343 151203 -457472 35965 194319 2221
12763 231748 -72861 -255927 87394 -107510 -30979 306423 8608 258212 92887 360896 -73530
12751 -150196 -50066 13026 105066 -152254 -97147 -172212 -225066 288557 -43627 -182122 179129
12739 97434 -144632 -80976 -17028 171097 -3354 -90931 91584 433546 51734 150265 96762
12728 96762 98224 -86390 336925 225145 -312853 -37595 -92004 -431853 -219666 -77883 -129161
12717 -129161 187543 -13885 36164 36388 317327 -219917 57512 53571 98296 226669 267098
12706 267098 -127294 166881 6753 46320 335472 84944 237595 223185 20625 -84428 123893
12694 295198 -102392 301886 -68389 -104767 297427 -41837 -86869 186125 140622 20795 28967
12683 28967 94359 -19326 182798 113393 425184 39449 406219 154006 398561 228864
12673 228864 213054 531558 150059 97553 82063 339569 387601 348217 -167170 -9933 98129
12661 87360 -180179 113160 106279 380189 217634 351757 122815 443616 182442 113004
12651 113004 -48999 -8588 259847 344168 -228 23768 279034 -244250 -144490 -1191 63882 123466
12639 123466 118482 170756 56414 147550 -223249 342145 67432 101703 249083 578877 117684
12627 20393 378619 55529 209996 283577 -145411 142485 26611 500237 138214 128511 62549
12615 -29736 167589 -67495 34894 182348 -201979 71047 -147908 335493 88384 420007
12605 420007 161389 -61150 43460 244820 143023 24634 -301192 175643 56855 255931
12595 255931 240217 -111208 14361 174475 -10433 12652 -134052 162004 301212 176388
12585 176388 23751 59089 -141630 -35388 -131537 -22479 -257733 -126024 -169611 86687 -93861
12573 -179505 -14466 99640 102356 -103494 288771 252513 71932 -152434 337442 -365620 151408
12561 2148 -65636 377787 49438 152238 171589 284527 -83598 -251214 69908 46000 227369
12550 227369 -14242 -150169 286785 -70355 -111633 50893 -311063 -9891 185438 -108743 -99454
12539 -99454 -121959 -12454 -32992 -7467 157274 -6906 -336091 -68150 -82199 -43838 -263934
12528 -263934 21003 188316 77030 -107717 385058 170542 207488 -201738 -193704 2196 -15803
12516 -34172 44783 -8351 -114416 99051 70501 62053 -72681 244111 188011 -66275 -49994 -3335
12503 132936 -326241 -89532 64770 226733 -5657 98824 51203 137140 241572 153336 -265678
12491 -465685 -35141 -151434 98695 -328199 101183 -358276 167474 18205 47553 128334
12481 128334 156390 82588 -25957 -85766 -209672 115506 -51886 176852 -140470 -267657
12471 -267657 -111939 -119709 70670 123651 -363013 -53824 27353 21520 175209 28498 -118266
12459 46683 -18504 45861 -15262 -98193 91986 49203 -65665 -115981 -120966 142665 4137 239552
12447 239552 336761 283036 -69684 -5850 -43922 -172148 -111630 76561 225699 -59803 -80788
12436 -80788 191587 -45673 168381 54309 -58829 154328 234939 -233781 -398948 162747
12425 440031 -26290 -149601 117573 -207848 -227371 215686 -187585 -62879 -148491 -179112
12415 -179112 236309 152287 214935 312168 -59244 192790 -1733 191364 -73871 -122404 148999
12403 -250872 98724 161255 191028 -118669 215399 -84680 486487 -51041 19379 -74299 -405220
12392 -405220 -241016 -121989 -112139 -506264 -86087 -156340 -377229 -89223 -55729 331965 43639
12380 93175 265650 78501 102554 168654 -16332 -65437 -310822 173959 -121922 -9897 97311
12368 146961 105020 131664 4068 -136864 -199097 -208115 -48325 -158910 -113900 494015 -32724
12356 -46223 -280712 -239257 328821 15571 -28725 69869 -123496 -67935 -10924 -32977 21776
12344 -193823 -139444 200704 148025 -64044 -245071 -126344 204927 13998 -130805 106570
12333 -234920 -286810 309578 50124 -88790 -61642 47334 104585 301204 234562 -84778 -186395
12322 -186395 148848 -301912 -173092 -95687 -315498 6726 296227 167244 440381 337125
12312 337125 -10581 -85744 5444 -174432 108261 233046 -374382 149681 -96544 -239897
12302 -239897 -191200 -347586 4374 207305 713 500314 30379 -13611 -118295 29285 -204972
12290 291129 -60742 52174 215977 218324 -233508 -13134 -17411 80162 25714 -102249 98161
12278 472806 105858 98406 156635 1779 264947 418258 79998 271886 220423 211227 -130050
12266 265932 -206106 -2727 5267 205649 288161 -43602 68626 10924 -55913 331371 77760
12254 135947 5080 178253 413647 481320 -20447 96104 -16194 107117 -164860 68135 113189
12243 113189 -90873 209418 9326 -91690 106119 -27530 180162 -252020 -67037 15120 -53849
12231 173096 192221 12434 292340 271540 483620 247614 154784 161471 395906 165096 76998
12219 664027 538153 92277 39821 456979 439323 335590 -100212 238742 414245 138062
12208 22588 111679 240135 -39484 138586 505414 346968 71925 157538 90209 -109053 339020
12196 -28187 418552 71222 261195 107350 390999 465405 358691 237943 -1921 16160 248860
12185 248860 -132125 -253683 -7024 110149 70290 331784 -89665 274763 216224 -6056 -13704
12174 -13704 -102307 280961 42589 -149538 -5773 -116458 161605 218109 136936 -88010 137800
12162 353327 44520 87959 -276856 78649 325700 96322 -127595 62022 51903 115339 89620
12151 89620 290096 11875 -44857 313806 176355 384664 -9970 214887 164236 -87573 -163263
12140 -163263 119354 113752 -187365 223425 290658 194427 172072 236753 -92579 -189052 -80498
12128 -112090 -51964 -216446 22750 120351 114728 -74466 52960 356930 75086 192601 122399
12117 122399 -137034 207426 4763 224695 111780 -126467 18662 2143 -95586 -281165 29391
12105 -121768 -214885 131957 -56387 -208384 116501 32705 208702 -78467 -225530 -67824
12094 80782 57523 -195269 68440 -76410 93939 -8163 -259273 130029 81459 -30233 -209177
12083 -209177 62562 -138459 109748 -16880 -11058 106255 -295308 -276010 -166479 -27390 213089
12071 42645 956828 1813129 1074566 546324 118620 -76255 246389 18626 -43560 -236229
12061 -236229 -152014 59409 -22051 111414 -188294 -186127 400128 -110941 -146586 -32862 219063
12049 131764 -37208 -116807 -133557 232472 -171519 39965 -58353 -58164 48115 -83021 -51457
12038 -51457 -313805 65320 -493204 326991 317361 -60152 -162145 -121872 3315 124750 174155
12027 174155 109882 -95579 -4345 -100087 -80072 -57479 42221 -212630 20474 -133486 -29539
12015 35007 -45893 67109 9862 -25051 -107604 270318 -283174 163557 -99493 37597 -245848
12003 -21961 106797 -68168 -82221 -229087 -26085 -62105 -47598 -151492 161117 -116360 -90177
11992 -90177 -16687 90297 -188082 75120 -322505 -150367 137608 -60831 -252729 -82939 -85037
11981 -85037 -60297 18314 114909 -420549 -313926 -54875 98407 -160621 -305849 595750 -87022
11969 -271069 52697 -105429 78966 -131479 70840 -270780 9364 -126333 -204313 132784 9542
11957 56274 45117 87607 -338838 65581 -183148 133572 20908 -157408 -135932 27160 -151763
11945 144714 299271 -24066 33672 19718 -9325 -131938 -17873 -255658 -32226 -212997 313864
11933 179244 -58627 -63318 33667 147611 87427 25612 -79077 -234099 146019 -310435 183380
11921 -133323 -162337 -46455 21356 295022 91114 -422573 249224 19894 7187 106068 187671
11910 187671 -262561 357845 99074 -150947 126590 50490 -349196 63488 161042 -3183 -53161
11899 -53161 -54291 -248470 -242430 -161983 66642 16773 71595 -212287 -255530 -118327 73196
11887 -193447 -257173 484813 62698 -305228 389498 12464 175546 -173059 -152925 -88028
11877 -88028 557152 -6469 -77411 45835 49332 -114638 -221120 103128 5920 -110155 -170728
11866 -170728 261355 43401 -234204 -266553 -139528 17399 137374 -277991 187364 -111252
11855 78398 -248705 64291 -65892 -144437 -477379 10947 32211 -144236 -62129 149049 -1653
11843 -71009 21508 186945 25126 -288061 157352 -101324 39145 214708 79141 -79736 -128034
11832 -128034 97596 490 83816 -69870 -306723 -262462 76075 28568 -95193 -183065 140810
11820 -53857 -23594 131179 280681 -49002 -512243 19433 -81789 -37960 128313 -282628 -131682
11808 181469 13951 175155 -149646 105374 304975 -309876 116254 -40302 54405 8827
11797 28619 151096 -182478 -229050 -140681 -309522 -5051 158952 -21796 -16835 -285235 143499
11785 -42885 459312 -177323 -266640 -49144 -87198 -95280 20524 12195 3038 285657 67730 -258667
11772 135168 196775 -79082 206286 65561 340575 189775 135166 -179865 -35125 187396
11761 91786 323659 -32385 68894 50628 58736 158506 -176202 70433 129672 -2032 287646
11749 351631 64008 99497 -57783 4484 -25467 332759 13429 -327258 -275644 6971 -42463
11737 363362 130064 -45509 154552 83817 -154106 -63801 65267 45536 43563 -243512 179087
11725 -77863 -86214 -75221 -374284 70622 311043 191496 238792 -98249 55764 77348 -83778
11713 39167 -163369 37755 20953 81206 -51088 -84415 49275 -237369 -36479 -44741 199905
11701 242922 295592 92296 10645 354313 341112 183430 -168225 -74919 25406 -180998 222783
11689 132197 -133808 -139860 -176783 185455 13787 215179 330438 68375 194404 44371 -12082
11677 -27722 182963 -285405 -161505 133951 -27451 -246721 122820 54585 235856 325644
11667 325644 234079 -137684 260427 -169259 -10665 -323062 41250 181350 75920 101147
11657 101147 -64825 222706 41189 136388 -252826 -436548 135924 122470 150211 -258118
11646 -221156 149533 92929 226360 -223861 -30153 -73832 73983 419000 -27291 -63624 57998
11634 58470 -61246 -180703 -24220 -310188 -230976 95521 -22883 -364769 126555 312791 -92615
11622 -93540 -173334 357751 13511 125004 -211213 -81144 62406 5678 195680 156945 -99350
11610 92224 -74967 -12657 -49248 -251205 -50374 124307 -1852 80703 254484 3679 23728
11599 23728 -3349 281120 -210786 -22568 202911 118205 68987 5800 -19131 -134261 -337467
11588 -337467 279011 -121077 99080 136924 127871 317724 37275 252683 42755 252628 222683
11577 222683 197012 -144489 152523 121154 153481 319409 -37272 228683 429069 -70085
11566 119201 91783 175979 78203 -78854 43062 50099 75210 251225 231982 -184502 -115119
11555 -115119 248841 341940 238535 22469 203000 -56498 -10152 25535 87249 -88335 96867
11543 -10975 238066 2066 162403 -120233 -81911 116402 199584 -81495 -124498 173944 170579
11532 170579 60310 142839 71400 28154 471776 -237042 -165211 -68537 246403 60165 -70156
11520 300923 469313 297269 178210 100088 134992 224285 -220447 -29522 423328 -60567
11509 110556 172245 160228 -250225 98079 108251 81159 75665 353614 274490 18483 198410
11498 198410 -389316 -133770 456676 -46052 109671 179183 98715 221956 190412 242896
11488 242896 308595 184651 100873 -52037 86001 374600 31199 417438 24338 169511 58378
11476 12156 380526 105037 143789 49081 90221 230102 158100 -52553 288079 220394 86608
11464 165599 15716 63914 257458 -183288 170682 370471 -50964 -404469 -179465 -23742
11453 345206 151822 145291 206994 117771 8898 -40084 -73570 97698 290560 152618 298683
11442 298683 109036 13659 -232255 -4366 271340 180880 -47804 -127716 148947 -118461 336718
11430 482853 40734 -344610 -142413 30173 110380 -19825 -28588 248075 -184885 -179704 39723
11418 -2259 153569 123754 -101508 -72663 26878 195238 108953 67584 71984 74231 127556 -3592
11405 -59950 89603 56576 -26857 326970 -104110 146050 273181 -219208 35195 7870 -84322
11393 -224377 257171 181438 -176628 -115913 109331 -207862 170388 220262 -303349 134862
11382 -177257 241074 -14644 -143366 -353072 -268084 -177466 227601 240294 381992 -12019
11371 -76349 172661 13790 -360471 235870 377601 192220 -38358 89606 -20007 -54499 246118
11359 372288 -70612 83534 -239463 35724 64397 -303998 159585 39241 -6481 72259 8649
11347 30755 300845 52358 69097 295464 172865 -153030 36386 -130732 -23548 97014 25015
11335 -78342 -186820 234949 -299969 -25763 -87545 -49389 361119 -49555 -187452 -30131 -83531
11324 -83531 90511 -237260 -6821 -67413 -30549 -94659 -126925 158858 243704 -26302 169781
11312 -230091 28507 -363640 -230570 126313 122658 -243534 -167755 -10622 -16047 -129234 -461440
11301 -461440 -1624 352795 147463 221757 -90631 -154215 121112 30047 239306 187258 144962
11290 144962 28019 -214371 138880 -413630 -119431 -178901 2470 -75195 -167529 42212 210133
11279 210133 100396 106758 135004 -51009 69381 18690 -416845 -258359 -50895 -169134 -130787
11268 -130787 160976 -68691 -339471 89807 -256789 -198597 -352696 -59129 -178888 226005
11257 195815 109904 220389 195151 31725 -66352 51072 137497 -139696 -229560 -260156 -173215
11246 -173215 -330533 -147617 -64796 -267376 -79310 120945 -288553 -218683 -4387 18117 370930
11235 370930 143220 10968 -145378 177870 40528 -148042 11053 -257544 153678 -64655
11224 35481 -56766 -8237 159278 -19593 -112821 -52579 -35641 66436 -255432 -36774 -42832 -193995
11212 -193995 289701 -184166 -108314 341 -144757 -188988 -212802 -47183 -209053 -185024 -238073
11201 -238073 -4804 -13976 -99616 -101657 -139409 -294026 -95403 148560 -181362 -119508 233604
11189 37658 -12411 60420 262117 -11872 -25945 -220616 -223729 21484 27938 -372751 104509
11177 -383755 -12767 317700 -246147 20948 -217003 -64106 236 -83428 34234 -44334 -109348
11166 -109348 84975 -123970 -101151 38562 -122745 -10068 -118054 81393 -248541 274074
11155 49141 -148563 -22981 81143 -180645 -169929 -52327 -114287 -46730 -77371 16552 -70659
11143 257162 -58128 100350 -96438 96332 28461 191319 -77846 34464 -213234 293307 -84817
11131 451920 -176475 18854 154248 41488 -96953 -66581 -127050 328310 -27718 473780 -125969
11119 -72632 131568 80236 232409 28534 41699 187538 -99163 -213857 172603 -75377 109474
11107 -128188 184663 249764 36500 242396 130750 180640 278054 308077 87442 81451 138889
11096 138889 183058 107296 334947 66822 297055 80362 162489 276600 414433 -27796 155377
11084 265064 333929 131860 268709 187256 417256 291258 148217 329887 108209 136043
11074 136043 266836 368982 136967 287993 379241 432464 689866 459147 565632 345401
11064 345401 353830 469371 637337 612518 366792 370328 505708 491006 317497 357933 610508
11053 610508 557175 576904 623539 759625 605089 313772 899617 811078 735436 1084132
11043 1084132 654000 716455 858221 825552 559881 801605 852355 711901 887034 707052
11033 707052 748145 489311 408893 561675 862673 578473 782901 550009 795102 954195
11023 954195 823190 552042 497667 945133 585226 439737 505690 746074 548014 765204
11013 765204 759885 490221 439926 243333 579417 395233 637004 747587 768413 659630
11003 659630 722524 742509 243545 655315 493081 523583 507219 678672 407016 727826
10993 727826 845230 794242 544133 453400 733077 803564 757702 1015849 1192106 1156794
10983 1156794 1340196 1165782 1369663 1508595 1343386 1782012 1539711 1956576 1954953 2235707
10973 2235707 2415133 2791494 3151327 2879526 2748870 2826019 2531261 2077801 2211883 2028554
10963 2028554 2010987 1745142 1674510 1777789 1963412 1825105 1896137 2271952 1811044 1362407
10953 1362407 1703618 1229673 1251512 1277524 719246 455172 745766 410800 472283 472375 449518
10942 449518 91012 477486 205918 378610 -232365 100350 110117 161921 266150 -88264
10931 280555 267712 -200477 187409 -143092 151722 105572 99529 246971 211350 -93305 -10920
10919 98415 11457 -126683 83005 -61341 -233413 -52164 -390877 -107648 -166393 -18798 490934
10907 108671 51542 -32216 34944 107371 14232 88317 294245 -268012 -9237 43951 55399
10896 55399 -145684 4600 192921 -51717 -211170 -140972 -423125 -51127 91552 343939 158079
10884 -370816 -13188 -64382 -196215 -132456 263258 89847 -216837 -129699 156858 212920 -250124
10872 199970 -232333 21590 -4883 -59642 193195 -410922 -27314 -106398 -49442 -212614 -31223
10860 -186603 -137305 -324457 36480 -264812 105470 -25985 -6175 -46105 -30853 216662 269965
10849 269965 -1151 5277 -231796 65476 -67464 49054 -73016 -70094 -96888 172930 -130520
10837 48679 -257924 -13309 -185040 -70907 236577 -161111 -218953 141840 -18394 125545
10826 -102252 18901 -78547 95162 73440 169341 16610 -85155 -295067 -149085 -29154 25745
10814 95905 -94482 325716 -140492 -209094 125869 73218 -139664 53434 -235142 149867
10803 -146252 -214011 190424 -16070 82337 338147 187166 101050 -256270 -138262 225256
10792 -45598 -38755 42016 45020 -71636 166178 114116 -174173 -150257 -8349 -187531 -110849 -192607
10780 -192607 -54694 -508174 5360 -8625 -42912 -412899 -111017 344203 13396 -219846 26380
10768 209609 95948 -146318 -284706 133185 -125730 -27947 -274685 -153327 -323439 148832
10757 39686 70235 129954 37247 205171 -88707 -383228 -243037 194317 -77231 144047 28845
10745 -174069 227521 -114717 -80456 -142189 -245978 -87108 -104222 98408 475414 -42271 -324908
10734 -324908 216717 176136 -169258 -277904 3608 41125 -186158 -210768 -58482 -113460 88011
10722 -29748 -103697 -279572 -51858 91046 96368 -127187 -189450 56163 -388715 30813 -184482
10710 19159 -58141 -5441 -168468 -197082 91903 -265334 -27214 85787 -120838 -376917 -251291
10699 -251291 -1384 -193371 -68663 25356 290734 -319281 -112149 -159104 -33765 -3006 185266
10687 -185706 -84625 -44789 254182 -1600 -31478 -108122 -28856 -227444 200951 -72211 -353633
10676 -353633 -132792 -247582 206894 154907 204489 -147620 -310908 -149689 -42283 -38382
10666 -38382 159338 34785 -194322 47328 -90237 -78578 -50149 -181200 -210559 -241642 78941
10654 70534 -114640 92099 -187566 -65643 135093 3846 297077 -135134 57193 -180019 -29883
10642 -16124 -258175 -6376 -197785 -238623 -44161 -74433 -101697 -146986 -2674 85704 97959 -147809
10629 -81089 -65430 82460 -219972 136855 115330 -12719 22841 -106615 -200475 58546 -22967
10617 -39820 47757 29962 584218 34619 -44093 22670 -341097 -60531 20858 202885 79657
10605 -192474 -29459 122699 -23167 -197578 47047 -23848 -235700 -94089 -65941 -208022 59228
10593 -30099 -320470 -12667 -73919 -21387 -451090 -34565 224924 164945 35134 -220307 41764
10581 -12285 61605 -80552 -198219 4226 -44414 -136624 125616 -88569 -78975 -229613 176188
10569 -3729 35024 -208789 -448454 -141838 -278072 30468 79057 107213 112446 30810 -291874
10557 196371 -116463 106438 -145524 -106166 164548 -269709 85326 -261618 -355429 -92562
10546 28901 384574 320564 -230245 -39362 74050 -25256 -546 -120325 -151379 -138461 -224659
10535 -224659 -88876 164557 -59958 -67744 -16108 14704 81039 67681 -94730 -48386 -161402
10524 -161402 56430 20135 73350 -84289 -25404 -38587 -300247 30973 -291204 16349 -518468
10512 41628 194013 -130931 -217896 -85994 14277 -147700 -221685 -75536 -3352 166033 100128
10501 100128 -41653 -42724 -189006 -68039 -58449 -41843 42314 -73989 151778 -100002 193998
10489 -150760 -365178 -149382 -193118 -117376 165475 -20472 106858 393159 355158 220683
10479 220683 511561 51144 280309 376155 -201308 114270 243513 -104843 -74497 -147843
10469 -147843 -148811 -253312 114189 178371 -176491 -95388 171225 -4845 -125329 -339217 38624
10457 -298906 -171798 -4335 291533 -96870 72417 324169 193521 46477 -39236 -222862 -6953
10445 -105815 230680 -153167 239474 41186 234314 -105309 -15963 -206144 138604 -95766
10434 -241962 -51684 -17528 305928 -123081 -149691 288665 6019 -63433 131281 104228 -141105
10422 -149923 -171398 -141666 117328 86112 112201 -79668 -255323 -509467 -144386 -252430
10412 -252430 271748 147512 127572 -102140 -117987 59929 -127691 190946 100089 39427
10401 -239981 -88996 -70153 152781 184507 14505 -46728 100736 -224795 -165489 115357 83037
10390 83037 31457 286084 -20774 38750 -197434 69622 85061 59851 -90331 247892 90630
10378 32433 222418 118288 26066 -26302 177788 221605 71316 238092 273667 559831 211339
10366 484836 392372 420509 294868 378895 103665 -76625 420650 504707 382830 384136 263155
10355 263155 180211 110002 361427 622667 394604 594688 621784 660920 303322 247570
10345 247570 647507 340598 546497 601608 37619 326921 178659 430970 -133433 142632
10334 100220 -6872 177448 266707 197680 -41836 6255 374672 59629 68508 110711 -9635 74343
10321 534104 52907 -472459 378693 15098 -50339 53882 -345239 154515 20796 -65362 193894
10309 -38890 -14826 78459 -67540 127987 -163240 69516 -152912 -59048 -84067 274259 138659
10298 138659 -194169 206258 16617 65118 93970 -7265 53276 81145 -31901 -121628 105871
10286 -35738 60530 137483 15383 -122440 -24102 -310740 -221927 -256619 -136081 -236917 59258
10274 226781 -318899 56678 -121510 42398 169815 208591 56319 -127050 -60539 -273158
10264 -273158 15333 -180607 200454 228453 182302 635055 176013 493202 578908 300638
10254 300638 69387 257474 -34996 16442 -83907 171966 -178584 -9322 -170440 -8893 -22551
10243 -22551 55729 -36388 52229 -125860 87193 216741 231765 159896 288272 -23249 130830
10231 171732 -204347 -83772 344670 -136610 -17294 -64057 -122332 70957 5297 29656 -162479
10219 35844 -218497 -463993 -128436 25233 42277 -198736 -99434 -164354 -278711 129951
10208 205063 -26448 -186058 -82661 148098 66701 168919 143046 13312 11028 -415276 51575
10196 -266377 307063 157659 -112187 -93848 -78321 -377419 -16901 -423947 -71770 -148548
10186 -148548 -64214 -46415 -271602 -311032 -149497 -68686 247477 13989 -105582 -165910 -306629
10175 -306629 -152291 -90280 63230 67298 -255407 -93093 283489 -346076 83782 -263447 22909
10163 -40457 321178 -130696 -107871 367284 246809 59073 -157205 118269 -226959 -170430
10153 -170430 -238172 214663 184630 122153 -113608 -143385 -279063 58394 21051 47129 261736
10142 261736 85040 -19473 -208006 244009 310499 -158688 -59005 -119722 -366120 -152788
10131 274230 223346 -195127 -28678 94744 -200139 -88817 32760 -201884 236043 -197072
10120 -69055 199346 -395478 22934 -287006 72100 -16083 -221238 96634 78930 -50610 68917
10108 -90645 261973 -59688 169612 -38510 -226798 -23371 -263837 78067 -106313 -154773 -182325
10097 -182325 114349 259487 215109 -87889 -488246 73498 113586 -182310 -132299 110885
10086 222101 -323365 -26276 85509 -176287 -228469 -33259 101453 110973 -103674 -340819 -232169
10075 -232169 -92157 -60445 108025 -171294 -27309 -133093 -15403 -225333 -215848 -192622 -161286
10064 -161286 -39186 -17206 -118344 -133635 -141692 -135830 135854 -253175 36512 -62513 90394
10052 6237 57687 38793 5300 247955 126521 -196824 -227857 -202200 -78924 -294001 -179421
10041 -179421 55414 -41704 -278318 40619 90443 -291953 47142 16281 -22513 218324 -95477
10029 -38610 -282779 4968 -187561 -133111 83180 77600 -197650 -75560 -109522 -205705 -149456
10018 -149456 26596 -108818 88364 3272 -135044 -109709 -471429 20227 -204481 -197237 -334035
10007 -334035 -191994 28459 227633 344686 -181611 86241 -94851 -93214 102458 49262 162750
9996 162750 -6968 -472865 6432 14685 -113609 -111464 73274 1501 44744 19636 -156061 -286072
9984 -286072 60632 -238300 276446 -161843 187504 -257086 -39584 -254427 -250082 -7777 34427
9972 -116335 232775 73180 452789 161601 68497 -126487 -314944 9851 -248618 -35690 -355785
9961 -355785 137524 -276218 -167774 -114182 -126226 130090 -57332 -55738 -97720 -139843 16388
9949 -38219 -409727 -82358 -299879 412811 -424839 6219 -359737 -98492 -85098 147487 244824
9938 244824 56427 -153565 24905 -227569 89477 60060 -23025 77090 -78523 31261 49748
9927 49748 -139597 -134556 -165496 70115 -106260 31250 -203498 -316530 -80638 -104386 -210381
9916 -210381 91910 -162670 -369277 -231264 -362242 65027 120527 175916 -139273 176388
9905 -81299 -179031 -135829 -44389 -130846 85598 63148 -6905 207847 -85370 38945 -35816 31908
9892 -122294 -99053 -2740 14871 132702 77215 -11985 -222003 -80920 -42682 -163923 -117788
9881 -117788 -229657 -117862 179151 -453860 -251166 -296759 -179993 5609 -361976 -71460
9870 -65825 -159609 70206 -138167 -97127 -183559 -42373 -219024 18549 -125488 -67113 -414881
9859 -414881 178425 -106496 -1890 -31312 -95493 -30132 -108623 -359379 -158919 -193493 -160118
9848 -160118 -100108 -95514 362906 -99197 120091 4019 -95049 -238382 -340835 28053 110834
9837 110834 -71032 -43930 -145110 -74332 -281163 165682 -293479 -80410 40688 -165050 5979
9825 -11451 49460 16589 -347531 -177698 -123958 30038 80982 -202792 203852 -10846 213422
9813 -138142 97529 -261404 -53742 20899 -129356 248295 136606 63305 -29401 96027 -136055
9801 -450836 -214283 6309 -163365 -6765 168471 -61116 9299 -28274 -121575 -206027 33667 6963
9788 -72422 -78050 -54468 288289 -273247 -1163 -146596 -79273 141660 214505 -73453 11160
9776 -169105 96398 -299202 246409 -52233 -89344 -147016 -239371 177169 -199817 -284680 27030
9764 182889 -287540 -36106 37005 -142432 -213803 -310041 8400 -54712 -54504 -133581 -267507 -198661
9752 -198661 -143871 179968 -186312 -62724 -6304 -108242 -244750 -140280 363836 -34792 -101112
9741 -101112 -467846 57050 173468 -165916 248041 -205862 -160725 -121897 -92618 -100911 -62231
9730 -62231 155277 79663 -104634 101503 -320000 -103935 -436542 -56360 -296887 167246
9719 453473 -213615 235358 11495 24184 -430621 -176500 -266411 17908 89211 -145764 53554
9707 250968 8655 -186784 -218418 -246567 -286581 -276037 -422549 182340 138248 -142522 -131470
9696 -131470 -176833 -14979 -98243 40486 44327 -103933 -396470 -372348 -168850 13667 -251110
9684 -71576 211697 -7611 -106767 -84321 -167766 -98727 -157702 168015 35513 112786 132796 112980
9672 112980 -25300 239911 -98733 228350 -273896 -37219 -66879 14707 -98095 20243 16514
9661 16514 126678 195695 299964 37188 -42496 -48396 -290570 -149166 518 110763 203296
9650 203296 -165017 -192376 -101228 -566203 -146743 116571 199296 -230428 57744 45082 115328
9639 115328 -165221 121767 -126789 45764 -82019 36265 15022 122454 -238816 -31994 -166793
9628 -166793 22613 76303 -91024 -300387 -345669 183755 32585 -54503 -131097 -121412 -123649 -460972
9616 -460972 -139064 -495314 73499 -64979 -104873 83748 238529 41952 55706 -52545 44305
9604 -249586 -93679 215638 -132967 382025 113479 -60103 -7946 48852 137464 39381 119597
9593 119597 -213271 38872 -168332 -117609 -5352 -520187 -264523 -103179 -35883 -334556 211256
9581 174336 59897 11925 -248648 -170767 -78790 -95399 -300085 57202 57239 168538 144926 -50763
9568 -140750 -36544 -246557 -291915 -54210 -63379 -23833 1502 -161619 -398921 374390 -158704
9556 -383363 16860 82379 232300 3744 -35076 133767 11769 -54030 119630 -44802 92738
9544 195531 47013 -218108 -524383 156889 -323850 11535 269970 45982 -522474 53439
9533 82792 12256 -41905 190870 55155 -285199 -49744 -296769 -472820 -147148 -76942 -176196
9522 -176196 -2877 -291939 -114478 -149970 -126895 65404 -43414 79047 -246483 -276613 -92945
9510 -391619 -67207 188599 -49524 -10500 -46360 47491 -172679 9921 231261 46296 -233296
9498 -220237 356530 -84456 -137829 11500 -386307 -348908 158647 -186038 -174906 -357649 -192829
9487 -192829 70568 -124698 -10333 -246628 -4385 -142141 64613 -57051 -101215 129545 119259
9476 119259 -351559 58907 -56424 -81727 -24682 -36277 181029 -61166 -190618 -248255 169030
9464 -51380 -312505 12216 -124232 -198994 39472 286672 -234781 -79649 -117026 81038 -167462
9452 96278 9749 -92065 -51888 254293 99571 -146600 141689 -139543 -318804 -156688 114273
9440 -46150 -24012 -10509 -278190 168553 -152379 48573 -274164 -252204 -77918 -16034 -326610
9429 -326610 -46938 102294 -213715 158536 -495374 -19716 -72900 -131236 -197674 -101288 -109627
9418 -109627 208078 -272095 -55856 102745 -195003 271979 64182 -170762 -114217 -115743 -285955
9407 -285955 -102908 30993 -313267 -48639 -84953 -287050 -139482 -71661 -273833 169675
9396 -272584 7398 -252287 -105200 135961 -58596 -200369 -127624 -429247 -82392 -354566 -98303
9384 -87367 8570 104594 -86530 -346270 44687 -86879 -252773 -79903 -67244 -119000 132723
9372 121257 67118 -315654 198293 448265 -180741 -95282 31754 153603 48473 190818
9362 190818 223827 32375 219958 -69691 -240534 -118403 98900 61151 42195 37720 59151
9351 59151 -65593 162614 -59004 445912 57626 186736 -103331 -59004 -20462 -30090 -92693
9340 -92693 -217705 -214123 -319468 257722 80588 -151710 255668 -111632 80494 -57953 -46641
9329 -46641 432296 94233 84979 -107618 1641 267184 63995 120915 181325 350323 74532
9317 12764 175113 -38734 -86243 7793 -134406 -44757 85687 -155539 -128872 -151811 -60744
9305 -14856 230977 29422 -220970 -263204 -81743 210500 -145600 218875 -69483 -107822 -158802
9294 -158802 -408564 -132460 -31607 -335151 -146608 -63991 -420477 54472 142444 -56013 66246
9282 89626 119670 -155530 206114 -83154 273756 238528 -21717 -102593 -491837 -403137 19629
9270 71153 -137643 117298 250688 42032 -40493 166620 -18721 -131735 -89911 107911 143726
9259 143726 -68848 198872 73859 247774 57020 282967 23141 -175918 -298483 -183980
9249 -183980 -7058 -279935 -40518 108410 110942 -74166 88454 18921 -84863 -61861 -16483 170175
9236 34981 253073 -103685 -166117 71558 -75360 -181112 -347146 179704 -37817 -635 -125343
9225 -125343 35497 -287919 -303495 -319105 -89138 -238763 -151678 -374157 231893 141192 -293215
9213 -230649 -389243 -128876 -14229 -100934 -105208 -340437 21647 -335452 -220096 -155745 -186886
9202 -186886 -103498 -9369 37053 89282 -244960 139027 40777 -101578 -116077 -140486 -170187
9191 -170187 -380173 -356512 110874 -166463 -313105 -3047 -175707 24264 228864 -45593 211745
9179 41340 103897 71311 34813 -16227 141986 91416 -64860 291235 -54130 -141212 -208153
9168 -208153 129473 -60739 31369 -2023 -150993 -157361 97013 83760 144160 -139937 196104
9156 -19459 59712 -112534 305789 285116 115392 -235576 -109350 -496684 58277 -132738
9145 -63782 -20864 -12094 -196701 -262937 -209423 -316983 -76569 -178422 -100493 -173562 87501
9133 -41258 -118991 -114567 48709 -160515 -18097 -268010 122886 43553 -23860 -119299 -159083
9122 -159083 -210822 -11314 -281722 -304544 -19844 -7134 -193998 -214657 157960 -226173 -68395
9110 -90097 44389 43408 -344297 -303206 -123980 169210 30560 115023 -86182 -170888 -188117 -142680
9098 -142680 -25624 1178 -140232 52678 -100251 -284640 -22763 4988 -353692 107643 107855
9087 107855 -75721 -120974 408584 -35182 -132830 166344 -235842 -42568 -225546 -9820 -45112
9076 -45112 31901 249022 72905 -210675 -363956 -142330 -233605 257758 -104968 88435 43200
9064 -148028 -119556 -48870 293695 -169824 219353 128604 208619 -52450 61670 -110857 -22679
9052 -58152 227821 138258 16389 -79298 38983 301391 -194174 -52648 -266037 -74615 -30514
9040 221882 -61348 -164764 -61171 153824 -22871 -126212 101390 -31824 27580 -159675 108226
9028 210550 201578 -19304 -29263 -281432 50136 151301 -279731 31261 -316033 157699 294634
9017 294634 330634 81774 -237686 105505 -264483 -242928 -89509 -215239 -30558 -71240 -81373
9006 -81373 -168837 -142540 291670 200304 85876 -275359 24756 -255280 76414 198702 -364410
8994 57567 -77625 -93887 69696 -71214 -240833 -11811 -258023 139197 140635 242552 -333295
8982 -199205 166485 -31951 -106095 -83910 -337673 -149084 173945 -46394 -46056 92114 29582
8970 -255327 -441391 -9452 -188510 52642 151848 85759 -267506 -112016 469 131811 -544310
8958 -346913 -58826 156218 -95898 -35930 138409 26547 106658 -168891 27371 -145011 -69673
8946 -315745 120427 -145748 -59303 66456 136074 56051 -117082 -66866 -168341 81828 12803
8934 -394292 -14528 -260799 -174272 140835 148536 160281 -100782 -50097 132616 780833 1101169
8923 1101169 2554205 7985088 11383084 4046976 1051041 192197 539909 248265 -62534
8913 322856 540217 37773 -104966 -178462 203017 464415 153977 -219239 -141123 -323179
8903 -323179 -47352 -358021 199895 -103188 -44941 -169638 -25804 -197207 -286588 -229633 228764
8891 -27166 -165866 202473 -35801 -355521 117515 -134661 73320 73708 -211987 99465 -137637
8879 108868 -147530 -26732 -14851 -332343 98187 -373728 -234380 -110533 -61601 8701 250494
8868 250494 338814 113404 231081 115663 97032 19333 11025 -1845 37257 -95055 -62781
8857 -62781 -150971 -83052 -14571 95760 34816 -17741 82619 -20054 113773 130424 24158 -23634
8844 -5450 181982 -277198 242047 -55664 101236 100082 -348773 92973 72765 -222781 -307362
8833 -307362 -155628 -207882 144259 -100503 -162763 100119 306952 105076 -81014 -178921
8823 -178921 192001 -119607 240167 97183 -354508 96630 60773 129806 299598 -265015
8812 -121829 142150 -81082 -223788 66232 -204091 85692 -251088 -219779 -155334 -11763 27759
8800 -143281 -260245 90479 -59319 411587 -378823 87234 -33446 -105865 78893 -336611 -270986
8789 -270986 -236966 55373 143520 -114881 6285 -80747 290550 333563 23312 -16761 176877
8777 29734 -155248 144701 -216663 -134905 -30443 16857 102945 54879 -374832 -71510 34610
8765 23018 231600 -53109 -223785 -277682 48788 29868 175078 -332623 215559 188345 -218153
8753 113542 -364001 -84532 -106791 -59320 -112783 -521778 -339340 -345103 104474 -23175 -210478
8742 -210478 -60090 -119088 168876 194251 232290 -182942 -95200 -99078 -403886 -287787 80418
8730 -116077 441793 151874 35125 111830 -196110 -188309 -165295 173656 -305149 -181165 241776
8718 -342278 -369574 -81560 -124953 -58665 -104619 87374 -83416 -119351 -309358 -198051 -290020
8707 -290020 -11765 184735 10315 45056 95283 445409 -105900 -217259 148719 125847 157849
8696 157849 180986 -88239 214228 246430 284707 -40324 115429 41227 -125718 42766 146606
8685 146606 -154452 -179831 -64085 -114346 156730 -204413 -33692 178457 37045 -337487 -198157
8674 -198157 71055 22756 27506 -166690 -91335 -283948 35538 -277298 73528 225820 -49282
8662 30282 -166135 4090 -84772 -153067 -138890 -80081 -344508 -294987 -99547 -111869 -95305 -128631
8650 -128631 -6125 -96593 -147599 50766 185090 21479 -70656 40940 -44652 43831 -134468
8638 -29875 65761 150497 -120290 -23185 -149664 -297236 27238 6747 83712 -253224 114404
8626 -132532 4227 120137 126317 -74853 224450 -69886 -326193 -58419 3143 3823 -163097 -236866
8614 -236866 100289 -203727 -195439 14335 -21683 -210153 48444 -91155 9976 92579 -166447
8602 48695 -40666 87722 -359693 150486 -243725 -188860 -290205 13934 49621 -50404 -27654
8591 -27654 -56131 -43023 -181183 17263 202151 -9705 104885 -225044 -327675 134349 -158745
8579 51323 -16626 -31131 -3038 -141852 -16733 231408 -285958 -3070 -106928 -109701 -185123 -54606
8566 -10742 -309857 -70987 -13126 -253977 112124 -252562 -40714 189947 65504 101321 122489
8555 122489 -237486 123129 -80288 345760 -175349 -164999 136441 -129155 -111235 20697
8544 -195316 -173061 -139754 47430 -171330 -111703 -118053 342696 -58220 -206402 205401 171227
8533 171227 -105996 -99662 215790 -49703 -137893 48648 152547 -18497 54455 -257643 74797
8521 -43450 -105914 -20332 -79975 87613 49476 -107439 -106524 -32849 -284094 -41170 -368013 -79687
8508 -169942 123961 -191134 -167030 275471 -420227 -180616 21224 -110466 11309 129809
8498 129809 33024 -114063 227551 -88889 90405 -171108 55041 218912 57119 -247161 -234351
8487 -234351 -15063 110547 -199114 89500 -84890 -91997 38747 163113 66244 -65919 173297
8475 139663 -134980 -1236 236725 -147706 -274617 -72296 -135377 -178933 -105923 -158847 51963
8463 160965 322634 -51451 -125363 -40040 -107300 22702 213983 -231368 -219726 1991 -279033
8451 -255955 31202 -36483 -157975 -231680 -267323 53996 12746 -140544 31154 -45747 -232409
8440 -232409 169492 -78389 21257 -136173 83566 -6871 170217 -119380 42875 136571 -35052
8428 197410 218794 -188406 -203337 -141010 341888 15273 -267983 -25060 -281719 68383 -12440
8416 -496817 -98360 -99056 -151870 1605 -99502 -226122 -67932 116676 22657 112823 -237406 -371818
8404 -371818 -105462 -119590 -83345 104464 181707 -244217 221312 -82983 -80599 -157303 12600
8392 -218303 -285448 -203830 -71124 -339642 -52571 195562 98126 -258593 147710 181280 188276
8381 188276 31338 157953 -14597 286381 151800 207380 321611 -61669 -82804 -5066 -376448
8370 -376448 -53428 -338407 140409 -41273 -5425 -328625 162351 -107982 -359312 119174
8359 -21994 95157 31807 -335050 -27407 -55660 -238041 -45622 -294714 -224131 -295965 -245217
8348 -245217 -96887 -32304 -191091 -65402 78041 -147751 -338791 -338728 -170888 -239641 173027
8336 -158146 -17879 87853 80368 61537 -60222 -275902 135218 -81061 -436946 -11160 157800
8324 -126880 167542 -182548 -135391 260117 -220964 27931 -46866 -19745 -210074 251561
8313 -14891 -85310 -152929 48035 65459 -80073 118089 -103726 -275520 33941 -153029 -80492
8302 -80492 79279 100139 -132464 -99951 7043 -274557 -219789 -360421 -35555 348044 -80772
8290 -111146 148359 -76425 -339681 -366843 52315 91247 56303 -180966 -282998 -79457 224325
8278 188170 64134 -132089 -23513 -194622 -128976 -113956 -158292 148767 220749 -73136 -104928
8267 -104928 -293249 -91912 81832 50617 -15544 -97650 -1577 129210 -32586 -150360 88194
8255 -47783 -328483 83177 -9660 360578 -65019 -349740 66469 -189339 14941 58356 -406453
8243 123364 60565 -331221 213005 32574 146628 -193276 28895 56298 68489 -1856 -2014
8232 -2014 -155489 -99913 49001 -303417 -416253 -162871 -110409 20162 -241279 -38833 319305
8220 -7063 -393757 34534 -55232 217000 132269 153705 -165476 240010 -20963 -141542 -186663
8209 -186663 133096 219101 -97086 -150987 -274481 -319019 -2670 258994 -13344 -56104 -232816
8198 -232816 -32078 98853 277362 -252635 42206 58669 -180844 -123037 -198116 -121637 -136013
8187 -136013 142587 -68884 -72132 126340 39177 4008 -25082 -374785 -154241 17200 14079
8176 14079 46674 242713 -34914 -139500 -200512 89186 141608 184756 50375 -206196 -42200
8164 -201465 -48986 204088 106053 46317 278060 -254027 -52377 -99235 -26935 152924 -195557
8152 120201 142970 -202272 -253948 239963 215127 152858 -61303 2168 -272577 -238270 35687
8140 -197234 -61800 205391 -37380 -68113 -271007 200556 -39082 -117156 47162 92774 249723
8129 249723 227868 -204322 130570 95272 -282849 -139152 -29868 -26724 85563 -85994 74760
8117 5871 84291 -321658 -261667 12669 -203143 189284 122059 -174597 -44137 -156529 37226
8105 117220 192784 -184876 172905 -176396 306061 -420117 -39798 47706 -78510 97400 197257
8094 197257 49972 9474 -213377 -110159 -214785 -32527 -68215 -298611 132851 13779 -244017
8082 38740 -49448 -190124 -85627 -238430 86887 -112565 -347130 -31622 128566 179563 163296
8071 163296 450456 -173634 -9991 78495 -148881 -94969 36473 -77544 9215 -178316 -34586
8059 -393147 136820 -42169 252904 -611855 -82693 -292198 245136 -97466 -203920 -218348
8049 -218348 94842 -62706 -408858 203043 -338703 -21539 -18923 -238436 10460 175817 -522220
8037 -114392 -280130 -62754 303018 -332968 317769 -317665 89437 -189890 51206 27021
8027 27021 -82386 486143 -600 -22455 -222347 -296313 190559 -148191 -189717 156515 222710
8016 222710 -122701 -194655 -219953 69405 -72093 -155032 58577 -70084 -151504 5872 166568
8005 166568 151941 163054 160529 -4443 -174579 215920 74570 -338478 -23832 239058 115172
7993 -184785 -178727 -319843 -158618 -83867 141713 -21616 -86013 -54614 -45845 44357 -202129
7981 272713 284441 -341092 -80317 -125016 -191468 -12872 -165771 112125 29971 -255251 -78980
7969 38257 -288008 -84017 251103 -153911 -10308 150715 128160 -308034 25157 -199623 70835
7957 -100085 -80184 -58301 103909 -104879 -384550 -80871 117412 -275012 -138922 105305
7946 91241 -69324 159136 -110485 203266 126081 -121261 -37577 -158928 248762 -43064 -8254
7934 -210366 144600 -254281 239743 53803 25445 124788 -241880 -151923 102149 34393 141442
7923 141442 109768 153443 284707 172370 25587 -121988 -386572 64883 52302 -366500 -25254
7911 33076 63140 -435019 -33082 -246865 -36408 -24101 8818 -113166 8608 -170759 -11764
7899 -109433 111734 -33778 -286238 -135740 8996 -137823 -60949 -94185 -44551 -278592 -402644
7888 -402644 164746 -91358 24800 200207 158750 147743 -47581 -82231 -52008 -89765 -13328
7876 -185479 -322406 127519 -436592 -95551 -10144 189754 252448 -323243 360646 -1048 -397298
7865 -397298 -70849 19163 25919 44517 136125 -81704 264187 -104480 -272919 -269617 -29220
7853 65052 197226 155936 317320 -14439 -149923 -55003 150925 -57248 35620 207111 58947
7841 -149043 -48487 -89891 246148 125060 161756 -162095 -252070 67339 -164790 21366 -39694
7829 -142174 -280879 -201604 -79245 16517 -147691 -445 -210021 -58337 -21833 -42933 214267
7817 -75559 64772 -157654 61151 -51250 13038 291589 192650 -99159 -123726 -181182 48785
7805 -3043 -117716 -103318 -234337 -291359 -305637 83207 106078 -177448 62475 238272 -127678
7793 -43367 -320126 -422266 27403 -87802 -321546 -81175 -4023 -322915 -187402 -147939 33529
7781 -254654 49568 63932 346549 -159019 134357 -234489 171638 -319897 -273819 147919
7770 250374 23679 -20920 202839 -19085 176238 -168842 -255947 124057 -23184 23708 77406
7759 77406 4684 -447854 -139343 42638 -97551 -151723 126721 -442503 -67416 -357281 90338
7747 243428 -301355 -40957 1904 34703 297142 61932 -10202 197360 -159926 299040 31910
7735 118588 -190715 -290732 70909 -394672 346260 27072 91959 -73888 -28458 251493 -81526
7723 -161172 36106 50966 2304 185754 24083 59027 -510298 58694 300345 84223 -211332
7711 181146 96398 382906 199075 122453 -211109 319762 -100291 113567 -340466 184471
7700 -11172 -65575 259180 -326083 93011 -99398 -6950 253479 -224823 -256697 -79825 -110342
7689 -110342 -93297 -555502 157887 35646 60837 -20686 -143637 -36328 -63878 -108277 -228018
7678 -228018 -163442 139336 -4728 -252315 -35258 -153053 -160207 136345 13054 -166404 -27507
7666 -10490 -73062 -27457 165747 -220489 -138680 -102956 75250 -83640 -21657 160974 -458029
7654 196349 -419818 -120909 116840 -216694 -177123 -241411 -460949 -251745 -18938 -50370
7644 -50370 -171958 -36918 -237203 -92206 119975 89672 262797 -266711 -300186 117280 -126900
7632 -183620 -130804 -262829 12564 173571 101568 -34055 9044 1217 -282378 202746 147373
7621 147373 -120283 -371442 246235 219104 90237 -34916 -465882 195812 329017 46174
7610 77731 39151 -245661 -94454 -22326 -79918 -48812 -58361 -201788 -271954 56713 -109626
7598 -261181 -91094 84557 169098 -48887 -172053 244156 -375798 72941 -190532 -96142 -251524
7587 -251524 31119 -286193 -197589 197421 -9391 -91788 101250 -281316 -174969 124367 185065
7576 185065 12491 209527 -24914 -165333 353784 77477 245391 82163 -239803 -146831 266338
7564 -22818 -50298 -364705 -132307 -1221 -44568 224151 215124 -42006 135960 -166662 -214352
7553 -214352 6497 -190195 -141126 -328673 168168 -190664 -156148 -45997 160441 244177 186698
7542 186698 -46758 119659 -71407 -52649 -16563 -46380 -281292 -164683 101981 -271064 -223830
7531 -223830 12966 -72057 47517 -114553 -236002 3653 -103833 -147387 -178193 -42911 -299890
7520 -299890 292126 71808 195929 -468243 227621 338702 245224 -235006 55535 -107722
7509 -381849 183611 -161027 -55400 177211 -3788 -37539 -281572 -29845 -37101 56412 -149958
7497 109236 5240 94816 271343 -53437 -130652 -222052 -189513 79829 -170994 19924 -100421
7485 -495866 -31940 129271 29139 -84437 268157 -204719 228854 465787 -9549 165653 -116441
7473 54764 -128446 218505 -40448 36837 -119989 -15156 52273 -263856 14916 293726 -122708
7461 16840 -22875 -83046 -504343 233418 25675 -84546 38421 -128101 205346 -53863 319846
7449 -120305 -231831 -24626 -141515 -107258 -190595 -116489 10296 -283526 -37197 -102351 369542
7437 186889 318138 334667 -170360 25107 -14417 -188864 -45329 257377 -347097 195508
7426 -48379 46299 295832 -212063 73532 -61434 902 -253171 -25989 195106 168433 -269278
7414 -170854 185410 42173 -80832 -88243 -286355 53124 -29425 -115259 14323 79517 -173254
7402 80056 -204810 -195268 76184 18503 43741 -261760 25058 -103214 -261566 -69569 316094
7390 79729 68738 200912 -160104 28694 -180719 236164 -161570 -27288 -104869 -85686 160257
7378 15093 70069 -74945 33180 -29700 59620 124187 -112258 -54210 -201913 -98180 -170260
7367 -170260 156473 -97305 29073 -100594 185904 -61737 46558 -177767 86640 -91489 142485
7355 190098 -188265 46478 -25695 -83199 -256403 199341 268839 -22408 211157 -166047 -37405
7343 -197453 6153 -269486 114761 -89371 191618 357738 -90623 -231878 -178583 169125 131005
7332 131005 -70874 -191682 -169897 -169181 71094 187470 97578 253945 -241059 121125 -257696
7320 -27978 -91282 120698 -266606 205629 -106867 11878 -117919 -59469 -257841 112965
7309 6890 -138233 -134328 -71456 -102582 343600 249572 52728 -149444 354699 -134411 -57473
7297 -137890 -8216 -118666 -96978 49230 166232 70350 -182043 -128324 -69345 -7694 -108084
7286 -108084 -26557 -339851 25540 -14847 64762 -237242 -31970 -71410 15376 -147882 -52497
7274 277570 -68272 247809 -205836 -126895 -166345 -101249 -286818 -42070 34413 -20653 -164945
7263 -164945 -264093 35806 48298 -30075 5200 222749 -323901 285991 134607 88402 53868
7252 53868 -238798 135456 258994 209732 -156502 -29266 228936 -166808 -119487 276347
7241 43375 -105745 -26361 182269 -271413 -210402 -44194 -131966 627 10314 -54091 -26179 -395264
7229 -395264 -26822 100415 -161651 -235272 192114 -87014 345820 5357 -289922 87157 -50318
7217 64219 -370857 -145858 -86127 -152504 2869 243659 36411 110511 -30232 -61872 54302
7205 19162 61205 -55426 -61806 335962 -302376 -227008 -61357 -132882 -31486 -182201 -65242
7193 114914 -25407 84590 -289471 -392187 91173 -57888 -242034 -476225 38159 -346216 -61549
7181 -56001 -174715 51566 8250 -338757 -331365 110732 -48339 -162325 95588 235600 -5904
7169 -110492 339194 134442 -98548 -118049 410581 303603 -123886 24088 -37641 -272026
7159 -272026 -243307 -38128 -129597 240149 -220084 10830 -66649 -198342 -133916 -414111 -62677
7147 113599 -210206 138095 189088 131164 -49838 48913 -218287 -230196 -246206 27826 -11645
7135 -285079 -86109 -247061 393568 187928 50246 -184957 -12880 148381 139317 2727 185808
7124 185808 -21693 -127822 -128558 41973 10233 -228545 20911 31904 162925 67079 215609
7113 215609 196038 -195779 145416 103103 131915 133989 155498 37918 99150 -150574 -161339
7102 -161339 25363 160718 -30656 -219983 -71142 -269999 -47119 -108846 -103271 -193607 105222
7090 240741 -43540 -82944 147499 -34996 42360 -28388 -123020 -83130 72749 -114997 -384312
7079 -384312 84477 -302372 70855 -315781 -24194 -8063 86685 -226742 292735 -69303 85792
7067 370012 62199 -50677 -233872 82602 -153897 -204213 48066 -218840 -206948 47494 -93766
7055 63353 220559 -415721 -82843 -150749 -384564 -29241 -209793 -22226 -41347 26233 -152096
7043 188456 50671 48896 241771 -204680 -78572 -394588 141008 -4942 129071 -55118 33482
7031 75559 224115 -262669 78982 64725 -133658 -72814 -155450 -2716 -256031 -151020 32150
7019 -94750 -57248 193622 179229 167638 79718 -3370 108595 -152393 57543 -477342 -113553
7007 -310147 -57429 191822 17042 -362314 -92919 35320 -79144 -371103 -17684 -302554 80386
6995 -182906 104112 90868 313488 -288975 24300 -203514 -83149 -159905 -41854 116703 -153351
6983 -31690 -225461 -80088 -23440 228295 16278 -3338 -32493 -277268 32596 129186 -82661
6971 58080 216601 19056 111501 53722 -74699 -3519 -172825 -219342 -35614 -1864 177785 240001
6959 240001 -354540 10249 177530 -21827 57493 30297 122509 -133707 -22280 -158204 -29678
6947 -208572 -93663 156025 -198909 -286816 40541 284822 12024 -152557 112161 2284 -276945
6935 130086 96022 123063 -80939 -117437 170575 70536 -137331 365849 60323 88430 77174
6924 77174 -8676 167159 -4934 -127062 -87298 142667 -135443 -82265 -22863 -17886 137857
6912 31183 267970 17799 -236187 -168244 -49505 -100420 -55726 -268148 63403 111893 -119094
6900 -36970 -293777 9787 458499 -17679 -208994 100770 104851 48131 -225250 -2627 100386
6888 -192918 -5613 -172678 -74470 121587 74650 -169974 -124982 53388 -94788 -261294 -213647
6877 -213647 -95261 -88378 287511 -69395 56909 72113 127473 225991 -718 179261 -67160 347180
6864 140205 276435 182573 -200113 -218374 104357 -308057 27737 123214 44557 -213731 -221761
6853 -221761 -257475 -340571 -39190 -162864 174940 28083 -95386 186337 33753 128327 179692
6842 179692 -131520 81744 -21507 -19108 143400 124378 62408 111099 -300200 -181637 -243660
6831 -243660 -386122 -51279 119230 -254403 98883 91713 -426494 -224506 225034 47004 -233977
6819 -126389 188119 -245197 49634 153315 -3702 -224948 14759 -62838 -7961 -64913 120118
6807 120824 227993 57693 -89979 -47845 31904 -158402 -113050 95272 -7139 -22038 -201062
6796 -201062 8999 -120332 86224 291395 1111 -370328 -59664 -69146 -2015 -349571 131694
6784 202626 108067 87384 71784 -41639 -187577 346545 42056 -152274 -91129 -132781 -50055
6772 -68751 -42867 50702 -68620 -210700 -88929 -264848 224377 -8617 88035 98391 -71993
6760 -277715 156586 -48630 13455 322768 179778 127786 232342 -232309 47427 -100517
6749 414161 14580 155567 -288495 251846 -166386 -162930 -195014 -158428 -573966 17323 182795
6738 182795 -92703 -306094 12532 -83961 38640 177929 -385298 177630 2133 19893 -252508
6726 447274 -101762 -140474 151881 140649 266123 -137417 29909 -83002 83941 44299 -1027
6714 -44798 125310 48668 -2343 5983 76273 127039 -177925 -78071 -147009 63403 91817 66303
6702 66303 28397 293273 -83953 306330 145540 -201558 -31342 -37630 -614054 -36109 85497
6690 56760 -196858 -20441 154945 3820 -76308 -158431 298052 -350154 182615 -29082 -168217
6679 -168217 224421 -220096 251778 241443 130998 -66218 114031 -452984 -118990 3840
6668 148104 -17475 255136 141157 -145945 112264 79560 -235291 -269339 328127 -123851
6657 -41114 -55953 -7294 165408 106511 -69057 -38480 -163066 298027 -9001 -47029 -116485 27162
6644 -111106 93583 -201812 19156 -140783 -358429 -317882 54588 -295561 -117345 -156393 -160166
6633 -160166 20798 -67106 22132 127078 -224513 34776 149065 -380504 15942 -117095 38039
6621 43250 200141 -354224 193238 -14566 164685 305172 120182 -36939 -194797 178269
6610 -313446 -174965 -303467 -273429 -129400 8983 233660 -81217 222088 -74073 113404 109050
6599 109050 -233066 -107628 44620 196275 -184181 -320033 34672 176159 -176455 107778
6588 -173115 213989 -238570 -122717 -296887 68737 -39233 -74329 -144093 180828 -94126 -182957
6577 -182957 37012 182022 255963 -206711 -188350 146268 -231146 -101648 -221307 -22476
6566 92579 -44690 -378464 -87880 285918 -7990 -105718 10979 253459 -50943 83605 366647
6555 366647 4450 -24097 59939 91044 174998 -50377 -426305 -184147 -47306 -167636 -104298
6544 -104298 70319 -60870 97237 76043 -373899 -68352 264060 142406 -248274 98852 -29394
6532 393620 -314181 135301 180641 82174 -313488 311028 252494 129775 157075 -390358
6521 20715 -246519 69125 -163131 65093 186448 -129983 16814 -279939 147887 53870 -151376
6509 -250964 -31593 340095 -229095 117420 124644 -224692 147094 -188784 -3465 -68143 208808
6497 272904 -260619 -310118 116634 28439 -242636 -19924 222501 282665 126330 42092 -285635
6485 12725 -90279 67707 -196788 -242484 -59207 -100392 80781 -110380 -241632 197813 18823
6473 -40912 380394 193327 58841 -45552 -367128 -255262 105295 139144 93073 -185316 100704
6461 -40129 -289087 383577 -223676 172499 -103100 189286 289415 -52661 -154224 -25776
6450 -75903 -47533 69303 160518 -208896 -55607 197182 52619 -60770 -41592 -16710 -286600
6439 -286600 36380 -78135 -89131 -372307 -178745 127415 21082 128304 -260343 -133874
6429 -133874 9468 -12653 187183 -18813 181785 -101115 -219191 -144457 30220 12011 -192004
6417 168170 -106022 58107 -303848 158993 -27018 74740 59171 -104053 -10236 42370 -19719
6405 -38367 206924 -60495 -107118 -281109 93260 154660 -8950 -377689 384077 47967 226759
6394 226759 -150498 -46261 -506 37871 -123502 49038 -296576 306098 -217332 -86250 49148
6382 103282 58135 -26339 -2571 200881 116027 -135250 -57873 30886 -118908 34716 -168370
6370 -22949 33808 64742 253991 -2676 -60868 -49184 242281 -3509 156151 33886 -256918
6358 -54153 149640 -133324 -153440 27522 182580 324944 204838 -267674 12996 34850 20297
6347 20297 109338 -238357 7135 130756 262267 -594 -61814 5420 -101611 -177238 -209443 -183504
6335 -183504 -68999 -82282 -75575 159696 39954 -361700 283741 26753 -70700 -12499 -268233
6324 -268233 -95298 -87598 -313034 576880 -9238 -129637 192254 -112480 -133057 -135232 257059
6312 -23702 -6964 177718 -114900 -13594 -255867 -101734 -99555 -2878 -107078 -147306 -8770 44361
6299 -242926 -281840 -206773 -106077 46875 -77081 140910 88753 -8755 -136181 -243510 110345
6287 -433930 -165207 240833 -209579 -272142 -21541 26645 -67456 83833 -215354 -97749 -101154
6276 -101154 -97628 202945 138975 -163986 119565 40619 -170100 259321 -217494 -93222 -186558
6265 -186558 139885 86677 187977 -81179 47874 126465 -128899 -317995 -23152 217720 -277148
6253 179683 -109086 -146066 -17814 -55011 -97461 -98527 -75247 -221041 84285 155666 311830
6242 311830 -144414 -219306 279001 -208485 -103287 164917 -2292 -90209 121989 -196811
6231 -134123 180857 -255438 11879 -70130 107434 55493 -489181 96699 -65141 -103688 -86705
6220 -86705 122599 -72780 -104299 365803 -61905 80559 106017 120681 14674 23518 2765 33664
6208 33664 -304881 -68856 55435 -4438 -98932 85996 -236834 -164104 -149133 -14474 -164026
6197 -164026 65280 77534 24422 142163 -125361 96034 -87565 -16054 -269019 -30405 69862
6185 -97133 71910 -2106 -234827 -91510 47092 -154930 53503 31165 -83783 198593 171936
6174 171936 7872 155025 31213 99437 -331874 -217216 136138 113030 -400131 77452 -27322
6162 89666 -198726 -290627 -55716 -240962 -37793 -36535 -120902 195046 252399 -16070 -6337 -135008
6150 -135008 -300635 -9710 -20727 -146858 276201 -76155 93616 -102777 70922 153439 69939
6138 56337 -465397 101794 -23018 42559 -344913 -12686 83683 143793 -73369 108565 -311974
6126 -203920 5583 -32419 -1467 -163258 -30502 -156083 226976 -222171 11496 -57055 -147229
6115 -147229 -97494 89335 -74743 325080 60435 291510 -378595 -80644 -238674 -102420 -69866
6104 -69866 -65771 -566274 46352 200413 131319 9004 -232423 161272 -323110 89735 -451878
6092 -176201 368667 300662 -83151 -146144 174630 -192032 -145276 168114 -156347 2526 221770
6081 221770 -101640 -201816 -150639 223139 -125052 -53986 -113031 -315620 5317 -27704 113881
6069 -202325 11292 111326 -29239 11608 -123315 201014 54092 90952 -139078 223777 -106062
6057 88410 43015 -23806 195479 -221111 -314154 -137230 -115176 -199604 117066 -120571 47814
6045 -104599 -209514 -184144 -79000 370313 43255 15552 236131 -30483 -177009 -221528 -21939
6033 -195404 -261159 224050 122323 -258350 236265 4000 444134 -403916 -290291 24593
6022 -223355 183779 -250850 83622 -152529 261706 -101645 130596 -346763 30519 177413
6012 177413 236139 25326 4194 -6577 -122106 10769 283593 -349651 -194331 340315 49078
6000 -137437 206912 189399 -184828 70177 -334446 17282 48728 197411 47125 139463 -154843
5988 102385 -114367 -132728 -111492 173198 55806 47014 26098 196037 117711 300784 110486
5976 213973 2827 27485 -99437 113807 -242462 -268059 6122 208902 -346752 137953 231354
5965 231354 -10733 -96404 -72723 118102 -259035 27751 -79659 172485 45120 -229824 -86926
5953 129592 35616 52065 62831 19412 64204 -182449 -161385 20973 230452 -147347 -64731
5941 133750 278929 -62766 32096 221432 229047 -57024 146108 -178443 -150276 116946 159507
5930 159507 -45974 -175996 61602 321159 41510 -35454 -220525 -215020 -17312 -104314 -118072
5919 -118072 357928 -34974 -197969 48877 -98460 -104706 -140083 -198555 -265451 107771 -342832
5907 -3183 -52216 -98350 22267 -91722 -88416 -165415 29732 228605 402108 41905 195718 -240222
5894 -341931 134684 62657 -277565 19082 384731 129842 61679 70760 -119870 95768 -220453
5882 -258227 -125529 -322881 35792 -4321 206450 37522 32357 -36045 -247095 -95533 26517
5870 -167738 -211898 -138377 19801 -153820 28977 -29076 -44442 -166923 -263080 261401 -230165
5858 -277539 77032 98034 107097 315934 -43939 24101 224183 -374594 -239529 84020 17628
5846 -5838 260885 41203 12958 -188321 -74641 214973 -13617 -88056 16458 206976 -13147
5834 131004 134813 -5264 -119845 9498 -184602 75652 162619 64908 -22024 269462 236302 69110
5821 393635 115988 288444 -29134 241730 17647 -155072 124711 -14993 23630 13099 -240181
5809 -227173 67815 -198552 -139841 24510 18068 -123748 -34560 -161837 -213513 94904 -55826
5797 -222186 46758 179001 -195247 -170780 -74289 19423 -221729 152952 139428 -145969 -237085
5786 -237085 -44420 -76407 130011 16885 -105849 -94184 115953 44344 245610 -236521 -39648
5774 66776 -132513 -97005 -180353 442441 -118454 193736 59763 -24708 -89729 -194553 -155445
5763 -155445 59675 356228 86441 183195 128323 -143850 100636 -533782 -70188 41614 -193496
5751 -138355 -183569 -445815 -116857 -285833 -32255 -347995 246641 139257 -180181 117398
5740 -274562 -187804 28002 -132446 158092 -17985 -17181 -42235 153907 28028 40089 517522
5729 517522 43088 -125787 -81665 -109985 -57993 39845 -185408 -171181 150085 100642 -220130
5717 52125 44783 -90137 143704 -153971 151064 -30296 -328538 -168581 -25210 49644 123367
5706 123367 172692 156497 -114367 -119486 -222282 -168529 -75326 337745 52884 246576 -41351
5694 156647 110625 -124787 168908 248145 69891 -6909 176451 -8915 -115604 131433 -172991
5682 20126 257827 -41221 102958 -68509 29428 173827 -86409 -388946 -53496 -124572 -118678
5671 -118678 -123964 -175587 178473 81824 227578 -10941 -233624 -57194 -299001 334254 -49419
5659 -39001 3410 -203905 81295 93861 -41990 22794 -76273 -201739 -219449 84325 189492
5648 189492 -136393 -143661 -182130 -80854 86069 -99955 2882 141401 -107395 28196 75710
5637 75710 184370 46831 80304 181278 31902 -131336 -81382 -137288 276683 140241 78816
5626 78816 95369 -136788 -28887 133055 -186825 -98475 152108 -167457 -54560 234321 156195
5615 156195 69406 -307810 -91387 -88388 -50260 -4953 109373 321541 199476 -425538 117367
5603 222284 -14118 -20912 129315 10176 -123925 62754 35606 220375 -16238 -108470 52068
5591 63019 10937 218703 -128620 111710 -254473 227330 -46870 -49706 -176201 -1602 -331427
5580 -331427 -339479 26030 -26311 -231263 84435 104146 25663 16856 86218 -95642 39780 5071
5567 254349 59777 -216993 100657 -144800 -81315 -159231 -258027 317101 12012 -2514 241824
5555 93028 153994 -95095 151752 117420 237749 -386186 -65256 -338486 2818 35740 125778
5544 125778 -273731 277968 -196024 9399 -767370 -42405 152328 -72806 -53737 -24201 -161584
5533 -161584 155220 -277253 102971 -237620 17339 -304858 125070 -67209 236845 108217
5522 -232413 138104 -58800 249097 187298 -74467 -262686 -305902 286760 205721 -161866 81720
5510 -3484 -392265 -200709 227740 -3817 142944 -50697 55307 157206 -117103 33673 285360
5499 285360 -182263 -204704 219134 -198189 173643 82034 -171963 61167 163036 -359926
5488 -17384 151310 -237390 -218314 23129 8696 -170671 378813 246366 -180720 -18957 -162442
5477 -162442 -222505 -50019 -387010 -235138 -83370 114564 -133629 168349 45379 68293 152651
5466 152651 127546 -126615 -104288 -77698 325279 213587 -81895 217763 15644 -85978 -191218
5455 -191218 225488 272590 212199 121893 28190 -420493 51585 -102844 -5297 144332 188848
5444 188848 328011 -288581 352692 252929 -74287 36795 260847 -403644 96495 57374 6688
5432 132202 -160452 -38155 244627 349237 -308040 -256848 -116791 -6982 -17197 -89763 -193717
5421 -193717 203276 -44473 -16735 122293 -92754 -61086 94936 -331704 -145750 91759 -305209
5409 -329533 37712 -89970 -49518 106101 236372 9219 -125689 -43835 121883 412145 -38252
5397 108551 136587 -41934 -122281 47733 -9597 -321467 146679 94224 -48645 -94468 210527
5385 -78959 126730 -43092 336291 404681 120470 154583 49172 210340 -75569 64073 -32871
5373 114185 -215760 78256 60097 310315 233001 282335 173612 189291 205121 -70798 -126376
5362 -126376 -53832 63092 794 -149666 222805 10508 95876 -27547 41443 238103 -191920
5350 -126967 98539 -39092 -49621 34727 -155183 127002 53689 63334 107358 130737 -15825
5338 180509 202501 -289004 182871 43594 17132 -274998 -11646 -172953 18148 -7615 125116
5326 -128215 136065 -159753 86093 -244348 -299038 12103 118095 -164932 -179693 271783
5315 107775 -309388 309846 229070 -200879 -149150 162916 3855 244918 -135483 174620
5304 -268363 63869 -4982 -69392 -294390 167709 49884 -69847 63554 111201 70310 221547
5293 221547 -127969 197347 -18728 -65987 -148934 -84731 87606 -148571 -44283 29637 55807
5282 55807 -61910 106371 138037 188737 -39960 -256106 313973 -80235 83335 -248423 121951
5270 -74486 -69803 129526 234641 -49056 -88436 414327 -222036 191421 83887 -388623 120709
5258 -176418 42051 -105189 -124194 329952 -379018 -174335 60071 20357 -26025 -23666 -89499
5247 -89499 -18320 113098 -241009 -207540 -20048 -145226 77436 392089 -15490 -5693 -2626
5235 330466 261386 -70364 408319 213248 -129470 269466 32670 -309092 100676 -28211
5224 -203857 -25584 108196 -190356 139094 129331 -330818 85428 107033 -101063 174457 246178
5213 246178 121234 -41279 65720 -19123 -135130 146934 215319 67858 -2576 -77277 -122037
5202 -122037 -28792 -56787 134257 211891 -150362 54377 -40232 -10939 365931 12744 72900
5191 72900 -138159 -165472 -37236 -66741 49656 12577 -146203 -295967 -224393 7256 -84210
5179 66844 -121010 88503 386715 40979 -218258 1296 -8377 -311393 166662 -119029 118981
5167 -59064 -160232 102959 -131441 14710 -56538 -266864 87122 232292 409320 -85751 16487
5155 153673 -115703 42812 77135 -165829 -19226 411027 -164093 74551 -21862 -14412 35467
5143 -1347 -53357 240930 152229 411717 -122983 7527 -288111 49823 -67495 220580 204486
5132 204486 -76109 218147 164863 -15766 -1908 -34099 143706 291531 -83007 36042 132920
5121 132920 15546 -126969 -56736 -219438 107056 -65266 -48029 225268 -4125 -185967 -2756
5109 178599 106436 206222 53481 354538 -73895 143068 -360915 -128224 444965 255785
5099 255785 172331 -193389 89980 -182852 47185 87584 1232 -202932 -174469 -114695 106597
5087 -160141 108561 -221393 -219456 186140 66542 -360163 304725 179552 -17269 -115350 269498
5075 141380 221788 211036 -32959 -228723 333851 -292046 145212 -207705 -123496 -99781 -255175
5064 -255175 -225770 -156626 150377 67469 -189818 -192477 -58232 -160030 121005 196665 112262
5053 112262 49300 24597 30949 42442 32842 -189077 7493 265986 -211772 -270668 -313349 -186608
5041 -186608 -38017 312053 -97491 192579 10022 177542 34541 217753 -34520 -80305 -120851
5030 -120851 -58924 249509 193860 295496 96481 -213525 -127216 75593 -370352 -23218 238303
5018 1279 -35104 -237765 -81254 238703 89578 -41726 -308435 -126709 73131 -391383 314543
5006 189927 37030 -258904 -27331 -111734 198394 -34554 69615 203105 -43915 -23308 -112548
4995 -112548 -58239 134668 79565 13710 -75949 35525 81845 -267628 85296 -36743 455801
4983 45660 -60081 -179861 140005 94822 364467 334159 -101357 18163 147278 103130 -129338
4971 -51495 1738 83828 -175234 -174254 383630 -131461 -121990 229822 -328654 305729 -206937
4959 -147171 115473 175440 -137042 63059 -285999 -12690 -21480 74352 40149 93639 40771
4947 -143230 210392 2507 234570 9395 -201553 -15986 -55868 363348 26987 73033 32166
4935 188570 435216 412387 204531 84647 -198298 122063 -307646 65357 -8505 -163080 -139614
4924 -139614 214025 50444 -176840 235008 -366522 244487 92999 -109619 162366 52345
4913 -112297 232314 270659 -34187 35204 31904 204443 -73573 -133137 112363 -100925 -38094
4901 -52228 -178843 -50825 -28101 -24440 193106 -95135 -142411 127290 85577 200481 -224748
4889 -150017 -32993 36489 212047 258608 -110153 -44557 196348 278294 -50566 -198941 210391
4877 48817 -87477 332527 114261 227684 -9907 31338 91885 137188 -131841 -268519 24052
4865 -75175 209433 82093 -33289 -32022 -82217 30123 -194738 49396 314468 -210532 -134607
4854 -134607 -48046 295609 351029 34600 -65018 50803 -107895 136049 -136445 -93102 13418
4842 40632 -275136 -46884 -159354 94161 -35672 -184627 75489 -97653 255907 -135111 -67178
4830 -123134 141016 149806 -92191 -124017 -117762 46187 -280287 224159 152233 -169513 47823
4818 105988 136903 -189201 58480 190214 -27250 225135 174273 4359 161657 203314 -169017
4806 228751 -71121 -15591 59270 274716 -47053 -213486 46737 -118220 18983 -42138 -55889
4795 -55889 -2341 -65078 48933 2653 -183878 444733 -34071 217456 287530 208054 -200732
4783 -471017 152126 -73968 128815 -223677 153316 -81296 -160795 -158473 26797 -115039 493373
4771 147815 -21256 -175248 106206 -35608 29105 38160 -68840 55884 259411 152730 -148905
4759 -167681 -48592 -70197 56978 -347522 320108 -22240 327855 -141860 51188 -113350 -167163
4748 -167163 329900 174715 -26345 66997 33496 47648 123577 -189834 -44189 -64729 284028
4736 -93092 -123038 15426 85899 574532 -327479 -198859 -518 -176173 -74733 -221667 -157481
4725 -157481 -106388 138770 170145 -91763 -139179 -23516 83744 -8848 -196562 36885 -134823
4713 -47975 2953 162304 336378 -152793 -75557 -58841 134240 184689 33085 -164410 35010
4701 34241 -206400 -199672 -19167 215559 117794 -7727 284444 -270739 411650 91715 -80499
4689 415803 244421 -229734 53477 -48505 118471 -95434 -94090 -66658 152072 11373 -199420
4677 -94195 62661 -206953 -272431 102012 68244 -4657 149642 216197 2954 -79248 -72067 -193229
4665 -193229 -120628 283917 172763 7901 205120 -84551 304596 -86500 13737 9575 -16101
4653 96871 -191070 -57582 97610 -186139 48253 174227 -16920 -204466 -31958 19590 -39086
4641 39941 -21696 -194118 -6742 174263 -17847 -100226 442961 27666 46628 -143249 -184346
4630 -184346 -137929 214250 -357321 381420 -92816 309365 152590 -142878 185139 -31845
4619 -28125 47110 204750 -163472 -231039 -126166 282092 13027 -171138 -53663 87059 204503
4608 204503 -100486 103392 68083 131539 167781 260486 91686 -195039 209032 46822 91695
4597 91695 28504 3822 136834 -251576 -118476 -366015 122650 -69764 -194301 -132975 -30213
4585 -156424 -30704 -176020 162962 -21832 60051 -157135 -120038 155509 26480 321744 97674
4573 -74244 -26662 -349766 35338 252332 102708 -288562 -38021 -76516 115279 -199416 -209415
4562 -209415 83126 56780 89901 -124295 135047 -193518 24694 -230360 109567 20971 27121
4551 27121 16875 396538 -94475 -312902 130741 -94657 263093 -160289 132975 82019 34790
4539 31710 -88414 -272134 113731 -74661 207022 -99666 -75324 184529 -143549 -41286 99833
4527 52753 108743 -101615 -164620 229940 -58663 -149075 72666 -70189 146844 158813 -281737
4515 303600 78594 58217 -131826 -85244 -195415 -174737 -251841 -230075 -240234 -220523 134791
$$ [...]
##END NTUPLES=NMR SPECTRUM
##END=
