
##TITLE=AC1379_CRIAH12191_7519232_adBeyOnagm
##JCAMPDX= 6.0         $$ Bruker NMR JCAMP-DX V2.0
##DATA TYPE= NMR SPECTRUM
##DATA CLASS= NTUPLES
##ORIGIN= BRUKER
##OWNER= Administrator
$$ 1.72 TOPSPIN		Version 2.1
$$ 2013-02-20 23:36:06.121 -0500  Administrator@X
$$ Compression mode = diff/dup
##.OBSERVE FREQUENCY= 400.02188249412
##.OBSERVE NUCLEUS= ^1H
##.ACQUISITION MODE= SIMULTANEOUS (DQD)
##.ACQUISITION SCHEME= undefined
##.AVERAGES= 64
##.DIGITISER RES= 22
##SPECTROMETER/DATA SYSTEM= spect
##.PULSE SEQUENCE= noesygpps1d.comp
##.SOLVENT NAME= COFFEE_meoh
##.SHIFT REFERENCE= INTERNAL, COFFEE_meoh, 1, 14.96106
##AUDIT TRAIL= $$ (NUMBER, WHEN, WHO, WHERE, PROCESS, VERSION, WHAT)
$$ ##TITLE= Audit trail, TOPSPIN		Version 2.1
$$ ##JCAMPDX= 5.01
$$ ##ORIGIN= Bruker BioSpin GmbH
$$ ##OWNER= Administrator
$$ $$ E:\/data/COFFEE/nmr/AC1379_CRIAH12191_7519232_adBeyOnagm/12/pdata/1/auditp.txt
$$ ##AUDIT TRAIL=  $$ (NUMBER, WHEN, WHO, WHERE, PROCESS, VERSION, WHAT)
(   1,<2013-02-20 23:36:00.293 -0500>,<Administrator>,<X>,<go>,<TOPSPIN 2.1>,
      <created by zg
	started at 2013-02-20 23:24:29.778 -0500,
	POWCHK enabled, PULCHK disabled,
       configuration hash MD5:
       86 BA 57 50 F2 9D 5C 9B 26 00 A9 28 5F 66 2E 89
       data hash MD5: 64K
       85 2C C5 43 9D D6 3A 32 47 0B 10 9B CA D4 C9 B4>)
(   2,<2013-02-20 23:36:03.387 -0500>,<Administrator>,<X>,<proc1d>,<TOPSPIN 2.1>,
      <Start of raw data processing
       efp LB = 0.3 FT_mod = 6 PKNL = 1 PHC0 = 0 PHC1 = 0 SI = 128K 
       data hash MD5: 128K
       80 CB 07 4E D4 43 60 41 E5 6D 85 F4 B5 12 9D 30>)
(   3,<2013-02-20 23:36:04.449 -0500>,<Administrator>,<X>,<proc1d>,<TOPSPIN 2.1>,
      <pk PHC0 = 253.2953 PHC1 = 0 
       data hash MD5: 128K
       DE 1D FE A0 4F B6 D2 CF 79 DC 52 DE 57 97 72 BE>)
(   4,<2013-02-20 23:36:05.184 -0500>,<Administrator>,<X>,<proc1d>,<TOPSPIN 2.1>,
      <abs ABSG = 1 
       data hash MD5: 128K
       62 E7 D3 34 4A 1E 20 9C 3D 29 27 FD 03 F7 AA E2>)
(   5,<2013-02-20 23:36:05.371 -0500>,<Administrator>,<X>,<proc1d>,<TOPSPIN 2.1>,
      <abs ABSG = 2 
       data hash MD5: 128K
       87 CF 31 3E E2 E1 84 34 F2 EA D5 AE 02 3D EE CD>)
(   6,<2013-02-20 23:36:05.543 -0500>,<Administrator>,<X>,<proc1d>,<TOPSPIN 2.1>,
      <abs ABSG = 3 
       data hash MD5: 128K
       67 24 47 07 33 34 A4 92 D4 EA 09 2B FE 4C 1E 29>)
(   7,<2013-02-20 23:36:05.715 -0500>,<Administrator>,<X>,<proc1d>,<TOPSPIN 2.1>,
      <abs ABSG = 4 
       data hash MD5: 128K
       E9 57 CF 79 2F A5 4A 7B 82 55 E5 DE AD 26 96 22>)
(   8,<2013-02-20 23:36:05.856 -0500>,<Administrator>,<X>,<proc1d>,<TOPSPIN 2.1>,
      <abs ABSG = 5 
       data hash MD5: 128K
       5D CE 68 5E FB 23 72 60 0F D9 27 ED E5 67 79 A1>)
$$ ##END=
$$ 
$$ $$ hash MD5
$$ $$ E3 E5 16 0A B5 06 A8 58 C9 51 95 04 C9 36 C4 77
##$RELAX= 
##$RELAX= 
##$RELAX= 
##$RELAX= 
##$RELAX= 
##$RELAX= 
##$RELAX= 
##$RELAX= 
$$ Bruker specific parameters
$$ --------------------------
##$DU= <E:\>
##$EXPNO= 12
$$ [...]
150 150 150 150 150 150 150 150
##$TP07= 0
##$TPNAME0= <>
##$TPNAME1= <>
##$TPNAME2= <>
##$TPNAME3= <>
##$TPNAME4= <>
##$TPNAME5= <>
##$TPNAME6= <>
##$TPNAME7= <>
##$TPOAL= (0..7)
0.5 0.5 0.5 0.5 0.5 0.5 0.5 0.5
##$TPOFFS= (0..7)
0 0 0 0 0 0 0 0
##$TUNHIN= 0
##$TUNHOUT= 0
##$TUNXOUT= 0
##$USERA1= <user>
##$USERA2= <user>
##$USERA3= <user>
##$USERA4= <user>
##$USERA5= <user>
##$V9= 5
##$VALIST= <valist>
##$VCLIST= <CCCCCCCCCCCCCCC>
##$VD= 0
##$VDLIST= <DDDDDDDDDDDDDDD>
##$VPLIST= <PPPPPPPPPPPPPPP>
##$VTLIST= <TTTTTTTTTTTTTTT>
##$WBST= 1024
##$WBSW= 4
##$XGAIN= (0..3)
0 0 0 0
##$XL= 0
##$YL= 0
##$YMAX_a= 6187766
##$YMIN_a= -10716621
##$ZGOPTNS= <>
##$ZL1= 120
##$ZL2= 120
##$ZL3= 120
##$ZL4= 120
##$ABSF1= 14.96106
##$ABSF2= -5.597122
##$ABSG= 5
##$ABSL= 3
##$ALPHA= 0
##$AQORDER= 0
##$ASSFAC= 0
##$ASSFACI= 0
##$ASSFACX= 0
##$ASSWID= 0
##$AUNMP= <proc_prof1d_extract.lims>
##$AXLEFT= 0
##$AXNAME= <>
##$AXNUC= <1H>
##$AXRIGHT= 0
##$AXTYPE= 0
##$AXUNIT= <>
##$AZFE= 0.1
##$AZFW= 0.1
##$BCFW= 0
##$BC_mod= 0
##$BYTORDP= 0
##$COROFFS= 0
##$CY= 15
##$DATMOD= 1
##$DC= 0
##$DFILT= <>
##$DTYPP= 0
##$F1P= 0
##$F2P= 0
##$FCOR= 0.5
##$FTSIZE= 131072
##$FT_mod= 6
##$GAMMA= 0
##$GB= 0
##$INTBC= 1
##$INTSCL= 1
##$ISEN= 128
##$LB= 0.3
##$LEV0= 0
##$LPBIN= 0
##$MAXI= 10000
##$MC2= 0
##$MEAN= 0
##$ME_mod= 0
##$MI= 0
##$NCOEF= 0
##$NC_proc= -2
##$NLEV= 6
##$NOISF1= 0
##$NOISF2= 0
##$NSP= 0
##$NTH_PI= 0
##$NZP= 0
##$OFFSET= 14.96106
##$PC= 1
##$PHC0= 253.2953
##$PHC1= 0
##$PH_mod= 1
##$PKNL= yes
##$PPARMOD= 0
##$PPDIAG= 0
##$PPIPTYP= 0
##$PPMPNUM= 2147483647
##$PPRESOL= 1
##$PSCAL= 4
##$PSIGN= 0
##$PYNMP= <proc.py>
##$REVERSE= no
##$SF= 400.020009611735
##$SI= 131072
##$SIGF1= 0
##$SIGF2= 0
##$SINO= 400
##$SIOLD= 131072
##$SPECTYP= <>
##$SREGLST= <1H.CDCl3>
##$SSB= 0
##$STSI= 131072
##$STSR= 0
##$SW_p= 8223.68421052631
##$SYMM= 0
##$S_DEV= 0
##$TDeff= 65536
##$TDoff= 0
##$TI= <>
##$TILT= no
##$TM1= 0
##$TM2= 0
##$TOPLEV= 0
##$USERP1= <user>
##$USERP2= <user>
##$USERP3= <user>
##$USERP4= <user>
##$USERP5= <user>
##$WDW= 1
##$XDIM= 131072
##$YMAX_p= 416007816
##$YMIN_p= -11875
##$CURPLOT= <Network HP LaserJet P1505>
##$CURPRIN= <$Network HP LaserJet P1505>
##$DFORMAT= <normdp>
##$LAYOUT= <+/1D_H.xwp>
##$LFORMAT= <normlp>
##$PFORMAT= <normpl>
##$SURQMSG= 1
$$ End of Bruker specific parameters
$$ ---------------------------------
##NTUPLES= NMR SPECTRUM
##VAR_NAME=  FREQUENCY,     SPECTRUM/REAL,   SPECTRUM/IMAG
##SYMBOL=    X,             R,               I
##VAR_TYPE=  INDEPENDENT,   DEPENDENT,       DEPENDENT
##VAR_FORM=  AFFN,          ASDF,            ASDF
##VAR_DIM=   131072,        131072,          131072
##UNITS=     HZ,            ARBITRARY UNITS, ARBITRARY UNITS
##FACTOR=    0.0627417313425164, 1,          1
##FIRST=     8223.62146879497, 136,          -63696
##LAST=      0,             2225,            -64398
##MIN=       0,             -11875,          0
##MAX=       8223.62146879497, 416007816,    0
$$ Real data points
##PAGE= N=1
##DATA TABLE= (X++(R..R)), XYDATA
$$ [...]
$$ plain form
61668 422676 420617 419397 418638 417998 417311 416642 416114 415705 415273 414805 414505 414577 414965 415298 415178 414635 414283 414870
61650 414870 416621 419120 421748 424061 425826 427084 428302 430127 432782 435828 438597 440689 442132 443316
61636 443316 444784 446667 448359 449176 449311 449475 449538 448304 445107 440890 437112 434213 431782 429616 427708
61621 427708 425526 422416 418671 415375 413086 411422 409968 408720 407457 405536 402787 399910 397485 395084
61607 395084 391906 387949 383974 380516 377363 373922 369774 365009 360281 356370 353397 350619 347314 343685
61593 343685 340567 338356 336589 334531 331849 328706 325561 322956 321142 319784 318299 316596 315244 314731
61579 314731 314815 314816 314292 313234 311799 310284 309175 308787 308739 308194 306777 305001 303621 302834 302338 301964 301977 302819
61561 302819 304687 307246 309638 311023 311321 311272 311581 312225 312846 313456 314261 315068 315479 315692 316433 317942 319613
$$ packed form
61668D22676k059j220p59o40o87o69n28m09m32m68l00P2L88L33j20n43l52N87
61650D14870J751K499K628K313J765J258J218J825K655L046K769K092J443J184
61636D43316J468J883J692Q17J35J64O3j234l197m217l778k899k431k166j908
61621D27708k182l110l745l296k289j664j454j248j263j921k749k877k425k401
61607C95084l178l957l975l458l153l441m148m765m728l911k973k778l305l629
61593C43685l118k211j767k058k682l143l145k605j814j358j485j703j352n13
61579C14731Q4Jn24j058j435j515j109l88m8n45j417j776j380p87m96l74J3Q42
61561C02819J868K559K392J385K98m9L09O44O21O10Q05Q07M11K13P41J509J671
$$ plain form
61544 319613 320861 321803 322759 323520 323644 323199 322713 322523 322619 323055 324090 325815 327972 330248 332555 334824 336701
61527 336701 337667 337575 336919 336346 335842 334707 332539 329975 328038 326928 326004 324952 324288 324473 325111 325508 325610
61510 325610 325891 326547 327276 327712 327649 326980 325821 324641 323918 323680 323678 323889 324451 325184 325580 325391 324911 324624 324743
61491 324743 325167 325602 325707 325340 324769 324478 324677 325163 325676 326262 327192 328655 330541 332438 333828 334446 334496 334454
61473 334454 334599 334811 334846 334787 335138 336317 338034 339382 339778 339752 340393 341993 343612 344160 343525 342332 340959
61456 340959 339319 337492 336082 335713 336415 337604 338592 339065 339180 339311 339784 340822 342538 344700 346578 347441
61440 347441 347344 347102 347396 348202 349218 350397 351778 353213 354717 356803 360006 364154 368481 372318 375403
61425 375403 377694 379274 380303 380771 380505 379739 379372 380169 381836 383443 384642 385943 387787 389912 391771
$$ packed form
61544C19613J248R42R56P61J24m45m86j90R6M36J035J725K157K276K307K269J877
61527C36701R66r2o56n73n04j135k168k564j937j110r24j052o64J85O38L97J02
61510C25610K81O56P29M36o3o69j159j180p23k38kK11N62P33L96j89m80k87J19
61491C24743M24M35J05l67n71k91J99M86N13N86R30J463J886J897J390O18N0m2
61473C34454J45K12L5n9L51J179J717J348L96k6O41J600J619N48o35j193j373
61456C40959j640j827j410l69P02J189R88M73J15J31M73J038J716K162J878Q63
61440C47441r7k42K94Q06J016J179J381J435J504K086L203M148M327L837L085
61425C75403K291J580J029M68k66p66l67P97J667J607J199J301J844K125J859
$$ plain form
61410 391771 393086 393861 394234 394538 395129 395894 396152 395246 393187 390658 388496 387103 386146 384881 382982 381027
61394 381027 379903 379766 379867 379422 378407 377448 377144 377487 377816 377352 376009 374578 373973 374417 375558 377130 379077
61377 379077 381197 383123 384707 386099 387449 388772 390033 391123 391901 392608 393918 396107 398382 399643 399804
61362 399804 399768 400184 400957 401979 403517 405646 408020 410521 413509 417088 420772 424371 428630 434365 441334
61347 441334 448501 455151 461241 466912 472241 477390 482538 487613 492383 496786 500917 504759 508170 511089
61333 511089 513604 515848 517943 519892 521440 522250 522325 521994 521334 519921 517436 514265 511202 508754 507043
61318 507043 506179 506346 507608 509930 513374 518032 523807 530477 537854 545690 553641 561746 570818 581868
61304 581868 594967 609007 622753 635850 648560 660793 671740 680490 686674 690338 691455 689875
$$ packed form
61410C91771J315P75L73L04N91P65K58r06k059k529k162j393r57j265j899j955
61394C81027j124j37J01m45j015r59l04L43L29m64j343j431o05M44J141J572J947
61377C79077K120J926J584J392J350J323J261J090P78P07J310K189K275J261J61
61362C99804l6M16P73J022J538K129K374K501K988L579L684L599M259N735O969
61347D41334P167O650O090N671N329N149N148N075M770M403M131L842L411K919
61333E11089K515K244K095J949J548Q10P5l31o60j413k485l171l063k448j711
61318E07043q64J67J262K322L444M658N775O670P377P836P951Q105R072J1050
61304E81868J3099J4040J3746J3097J2710J2233J0947Q750O184L664J117j580
$$ plain form
61292 689875 685784 679859 672853 665141 656810 647941 638604 628775 618514 608101 597751 587425 577242
61279 577242 567891 560162 554161 549452 545872 543622 542569 542139 542113 542926 544810 547132 549015 550178 550857
61264 550857 551363 552240 554439 558636 564476 570997 577731 584954 592970 601692 610870 620164 628761 635489 639704
61249 639704 641972 643554 645255 646942 648146 648843 649403 649844 649532 647938 645519 643372 642009 640920 639482
61234 639482 637791 636248 634724 632784 630634 629317 629751 631869 634864 638105 641622 645730 650421 655342
61220 655342 660420 666228 673372 681571 689729 697056 703798 710701 718057 725505 732495 738608 743606 747536
61206 747536 750789 753850 756958 760089 763189 766361 769911 774246 779663 786191 793822 802770 813254 825078
61192 825078 837848 851546 866281 881331 895066 906242 914874 921481 926090 928592 929580 929933 929713
$$ packed form
61292F89875m091n925p006p712q331q869r337r829j0261j0413j0350j0326j0183
61279E77242r351p729o001m709l580k250j053m30k6Q13J884K322J883J163O79
61264E50857N06Q77K199M197N840O521O734P223Q016Q722R178R294Q597O728M215
61249F39704K268J582J701J687J204O97N60M41l12j594k419k147j363j089j438
61234F39482j691j543j524j940k150j317M34K118K995L241L517M108M691M921
61220F55342N078N808P144Q199Q158P327O742O903P356P448O990O113M998L930
61206G47536L253L061L108L131L100L172L550M335N417O528P631Q948J0484J1824
61192H25078J2770J3698J4735J5050J3735J1176Q632O607M609K502R88L53k20
$$ plain form
61179 929713 928161 924814 919997 914212 907683 900579 893099 885128 876248 866341 855842 845212 834478
61166 834478 823447 812065 800314 787999 774920 761137 746962 732725 718687 705123 692443
61155 692443 681116 671346 662820 655074 648273 643297 640747 640151 640548 641534 643086 644467 644133 641030 635520
61140 635520 628776 621709 614762 608284 602555 597625 593547 590698 589502 589867 591230 593257 596238 600647
61126 600647 606491 613321 620869 629455 639664 651783 665760 681594 699454 719347 740917 763757
61114 763757 787672 812532 838090 864154 890695 917521 944089 969918 994965 1019251 1042335
61103 1042335 1063543 1082503 1098947 1112147 1121165 1125690 1126084 1122543 1114862 1103190 1088387 1071238
61091 1071238 1051804 1029977 1006239 981403 955925 930008 904125 878831 854136 829633 805345
$$ packed form
61179I29713j552l347m817n785o529p104p480p971q880r907j0499j0630j0734
61166H34478j1031j1382j1751j2315j3079j3783j4175j4237j4038j3564j2680
61155F92443j1327r770q526p746o801m976k550n96L97R86J552J381l34l103n510
61140F35520o744p067o947o478n729m930m078k849j196L65J363K027K981M409
61126F00647N844O830P548Q586J0209J2119J3977J5834J7860J9893K1570K2840
61114G63757K3915K4860K5558K6064K6541K6826K6568K5829K5047K4286K3084
61103A042335K1208J8960J6444J3200R018M525L94l541p681j1672j4803j7149
61091A071238j9434k1827k3738k4836k5478k5917k5883k5294k4695k4503k4288
$$ plain form
61080 805345 781927 759964 739576 720908 704443 690390 678086 666524 655386 645112 636051 628087
61068 628087 621246 616104 613172 612136 612105 612523 613457 615068 617232 619813 622964 626943 631799 637417 643776
61053 643776 650998 659211 668396 678428 689286 701316 715059 730609 747328 764567 782558 802119
61041 802119 823525 846283 870116 895453 922494 950475 978561 1007093 1037180 1069180 1102377
61030 1102377 1136207 1171095 1207739 1246168 1286022 1327462 1371157 1417185 1464373 1511155 1557162
61019 1557162 1603749 1652939 1706247 1764837 1830377 1904949 1990023 2086143 2193977 2315311 2453088
61008 2453088 2611349 2795745 3013657 3273385 3583752 3955229 4401468 4939915 5592134
60999 5592134 6384655 7349323 8521699 9936722 11618723 13561337 15701019 17902296
$$ packed form
61080H05345k3418k1963k0388j8668j6465j4053j2304j1562j1138j0274r061p964
61068F28087o841n142k932j036l1M18R34J611K164K581L151L979M856N618O359
61053F43776P222Q213R185J0032J0858J2030J3743J5550J6719J7239J7991J9561
61041H02119K1406K2758K3833K5337K7041K7981K8086K8532L0087L2000L3197
61030A102377L3830L4888L6644L8429L9854M1440M3695M6028M7188M6782M6007
61019A557162M6587M9190N3308N8590O5540P4572Q5074R6120J07834J21334J37777
61008B453088J58261J84396K17912K59728L10367L71477M46239N38447O52219
60999E592134P92521R64668J172376J415023J682001J942614K139682K201277
$$ plain form
60991 17902296 19974972 21723424 23004036 23764260 24054078 24013605 23837436 23714475 23757303
60982 23757303 23954527 24175444 24224900 23916278 23128761 21835477 20105517 18083456 15948689
60973 15948689 13866374 11951774 10262611 8813304 7593202 6578468 5739517 5047414
60965 5047414 4477462 4008544 3621539 3299945 3030908 2804073 2609892 2440198 2289842
60956 2289842 2156342 2037935 1932820 1839858 1758510 1687766 1626033 1572188 1525736 1485564 1449483
60945 1449483 1415564 1383223 1352430 1322553 1292851 1263740 1236632 1212396 1190614 1170522 1152124
60934 1152124 1135974 1122215 1110311 1099664 1090142 1081951 1075256 1070017 1066000 1062888 1060624 1059696 1060724
60921 1060724 1063547 1067047 1070222 1073152 1076464 1080118 1083365 1085880 1088155 1090472 1092066 1091812 1089420 1085502
$$ packed form
60991A7902296K072676J748452J280612P60224K89818m0473j76169j22961M2828
60982B3757303J97224K20917M9456l08622p87517j293284j729960k022061k134767
60973A5948689k082315j914600j689163j449307j220102j014734q38951o92103
60965E047414n69952m68918l87005l21594k69037k26835j94181j69694j50356
60956B289842j33500j18407j05115r2962q1348p0744o1733n3845m6452m0172l6081
60945A449483l3919l2341l0793k9877k9702k9111k7108k4236k1782k0092j8398
60934A152124j6150j3759j1904j0647r522q191o695n239m017l112k264r28J028
60921A060724K823L500L175K930L312L654L247K515K275K317J594k54k392l918
$$ plain form
60907 1085502 1080699 1075179 1068941 1062109 1054767 1046733 1037713 1027672 1016931 1005765 993941 980901 966600
60894 966600 951900 937774 924215 910418 896013 881567 867811 854889 842639 831042 820030
60883 820030 809266 798542 788022 777641 766680 754578 741921 729902 718795 707705 696037
60872 696037 684604 674747 666611 658841 650053 640295 630910 623175 617366 613048 609749 607057 604387 601290
60858 601290 598042 595476 593995 593022 591589 589143 585647 581231 576058 570434 564870 560086 556848 555348
60844 555348 554650 553144 549907 545354 540428 535528 530416 524743 518271 510974 503363 496383 490537 485342
60830 485342 480108 474998 470823 468005 466315 465427 465050 464571 463359 461700 460883 461927 464500 467330 469443
60815 469443 470757 471614 472070 471808 470719 469417 468861 469333 470070 470164 469603 469032 468722 468336 467683 467150 467194 467774
$$ packed form
60907A085502m803n520o238o832p342q034r020j0041j0741j1166j1824j3040j4301
60894I66600j4700j4126j3559j3797j4405j4446j3756j2922j2250j1597j1012
60883H20030j0764j0724j0520j0381j0961j2102j2657j2019j1107j1090j1668
60872F96037j1433r857q136p770q788r758r385p735n809m318l299k692k670l097
60858F01290l248k566j481r73j433k446l496m416n173n624n564m784l238j500
60844E55348o98j506l237m553m926m900n112n673o472p297p611o980n846n195
60830D85342n234n110m175k818j690q88l77m79j212j659q17J044K573K830K113
60815D69443J314Q57M56k62j089j302n56M72P37R4n61n71l10l86o53n33M4N80
$$ plain form
60797 467774 468454 468734 468134 466372 463717 460953 458699 456891 455035 452800 450169 447248 444170 441131 438253
60782 438253 435398 432235 428520 424248 419589 414808 410202 406059 402532 399550 396792 393893 390780 387856
60768 387856 385766 384937 385324 386577 388376 390551 392938 395241 397182 398873 400843 403494 406568 409437 411952
60753 411952 414731 418389 422668 426504 428957 429966 430353 431151 432869 435279 437946 440758 443665 446021 446728
60738 446728 445234 442015 437847 433092 427979 423055 418693 414459 409652 404354 399339 394941 390663 386073
60724 386073 381492 377438 373835 370213 366494 363182 360814 359445 358706 358172 357562 356704 355504 354065 352715
60709 352715 351677 350668 349136 347043 345193 344508 345111 346306 347365 348104 348813 349814 351044 351981 352149 351806
60693 351806 351852 352904 354748 356881 359139 361439 363418 364959 366713 369352 372494 375180 377373 380153 384260
$$ packed form
60797D67774O80K80o00j762k655k764k254j808j856k235k631k921l078l039k878
60782D38253k855l163l715m272m659m781m606m143l527k982k758k899l113k924
60768C87856k090q29L87J253J799K175K387K303J941J691J970K651L074K869K515
60753D11952K779L658M279L836K453J009L87P98J718K410K667K812K907K356P07
60738D46728j494l219m168m755n113m924m362m234m807n298n015m398m278m590
60724C86073m581m054l603l622l719l312k368j369p39n34o10q58j200j439j350
60709C52715j038j009j532k093j850o85O03J195J059P39P09J001J230R37J68l43
60693C51806M6J052J844K133K258K300J979J541J754K639L142K686K193K780M107
$$ plain form
60678 384260 389216 394133 398730 403207 407756 412627 418142 424129 429771 434463 438491 442348 445742 447876
60664 447876 448536 448309 447739 446734 444873 441963 438232 434277 430814 428178 426055 423913 421707 419883 418737
60649 418737 418108 417775 417775 418162 418685 418957 418771 417993 416311 413459 409717 405821 402216 398599 394457 389931 385883
60632 385883 383093 381613 380885 380257 379338 378082 376692 375408 374386 373867 374266 375738 377675 379128 379851 380483
60616 380483 381458 382255 382147 381211 380065 378956 377823 377005 377045 377801 378542 379156 380486 383066 386102 388234 388980
60599 388980 388972 389033 389480 390195 390895 391321 391496 391905 393160 395425 398233 400910 403011 404358 404866 404598 403976 403693
60581 403693 404111 404847 405221 405111 404985 405019 404735 403922 403503 404799 408121 412631 417550 422854 428756 435222 442306
60564 442306 450393 459715 469950 480606 491431 502144 512050 520276 526198 529426 529674 527035 522254
$$ packed form
60678C84260M956M917M597M477M549M871N515N987N642M692M028L857L394K134
60664D47876O60k27n70j005j861k910l731l955l463k636k123k142k206j824j146
60649D18737o29l33%L87N23K72j86p78j682k852l742l896l605l617m142m526m048
60632C85883k790j480p28o28r19j256j390j284j022n19L99J472J937J453P23O32
60616C80483R75P97j08r36j146j109j133q18M0P56P41O14J330K580L036K132P46
60599C88980qO1M47P15P00M26J75M09J255K265K808K677K101J347N08k68o22k83
60581D03693M18P36L74j10j26L4k84q13m19J296L322M510M919N304N902O466P084
60564D42306Q087R322J0235J0656J0825J0713R906Q226N922L228K48k639m781
$$ plain form
60551 522254 516407 510337 504545 499432 495405 492818 491908 492651 494591 497076 499927 503680 509021 516209 525209
60536 525209 536079 548797 562910 577800 593275 609451 625940 641428 654257 663366 668653 670607
60524 670607 669704 666121 659945 651585 641928 632075 622923 614959 608317 602943 598701 595316 592262 589006
60510 589006 585560 582673 581146 580999 581628 582748 584846 588640 594502 602547 612890 625540 640348 657494
60496 657494 677896 702810 732889 767704 806095 846909 889432 933128 976939 1019000 1057305
60485 1057305 1090574 1118119 1138998 1151887 1155980 1151467 1138789 1117900 1088823 1052620 1011232 966456
60473 966456 919641 872343 826591 784051 745172 709502 676801 647591 622532 601495 583446
60462 583446 567200 552064 537776 524275 511841 501123 492483 485368 478772 472344 466624 462202 459101
$$ packed form
60551E22254n847o070n792n113m027k587r10P43J940K485K851L753N341P188R000
60536E25209J0870J2718J4113J4890J5475J6176J6489J5488J2829R109N287J954
60524F70607r03l583o176q360r657r853r152p964o642n374m242l385l054l256
60510E89006l446k887j527j47O29J120K098L794N862Q045J0343J2650J4808J7146
60496F57494K0402K4914L0079L4815L8391M0814M2523M3696M3811M2061L8305
60485A057305L3269K7545K0879J2889M093m513j2678k0889k9077l6203m1388m4776
60473I66456m6815m7298m5752m2540l8879l5670l2701k9210k5059k1037j8049
60462E83446j6246j5136j4288j3501j2434j0718q640p115o596o428n720m422l101
$$ plain form
60449 459101 456961 455231 453083 449826 445738 441939 439102 436842 434664 432789 431422 429900 427488 424707
60435 424707 422912 422610 422999 423260 423495 424151 425146 425977 426373 426518 426755 427180 427462 427119 426143 425176 424769 424667
60417 424667 424251 423470 422813 422509 422442 422904 424544 427278 429943 431604 432636 433869 435172 435657 435181 434721 435093
60400 435093 435997 436705 437181 437985 439338 440840 442103 443251 444687 446692 449332 452446 455605 458436 461146
60385 461146 464403 468362 472213 475171 477658 480790 484708 488173 490054 490614 490929 491579 492470 493561 495080
60370 495080 497044 499122 501062 502897 504667 506286 507790 509488 511604 513855 515554 516234 516174 516214 516938 518120
60354 518120 519209 520299 522234 525713 530645 536596 543435 551233 559798 568730 577738 586525 594466 600748
60340 600748 604800 606406 605499 602151 596788 590193 583249 576592 570320 564013 557342 550631 544436 538569
$$ packed form
60449D59101k140j730k148l257m088l799k837k260k178j875j367j522k412k781
60435D24707j795l02L89K61K35O56R95Q31L96J45K37M25K82l43r76r67m07j02
60417D24667m16p81o57l04o7M62J640K734K665J661J032J233J303M85m76m60L72
60400D35093R04P08M76Q04J353J502J263J148J436K005K640L114L159K831K710
60385D61146L257L959L851K958K487L132L918L465J881N60L15O50Q91J091J519
60370D95080J964K078J940J835J770J619J504J698K116K251J699O80o0M0P24J182
60354E18120J089J090J935L479M932N951O839P798Q565Q932R008Q787P941O282
60340F00748M052J606r07l348n363o595o944o657o272o307o671o711o195n867
$$ plain form
60326 538569 532258 525540 519694 515680 512765 509536 505780 502405 499810 497451 495030 493060 491954 491497
60312 491497 491550 492531 494716 497750 501394 506294 513427 523085 534899 548601 564320 582194 601991 623003
60298 623003 644112 664092 681937 696737 707232 711932 709989 701703 688103 670482 650577 630534
60286 630534 612021 595518 580926 568601 559149 552320 546891 541854 537203 533221 529501 525212 520173
60273 520173 515101 510691 506872 503134 499246 495327 491383 487330 483457 480376 478232 476333 473984 471447
60259 471447 469583 468662 468046 467131 466084 465421 465212 465064 464746 464519 464883 466099 467912 469681 470883 471566 472188
60242 472188 472990 473692 473888 473566 473095 472774 472549 472189 471635 471165 471180 471838 472983 474467 476384 478858 481738
60225 481738 484761 487932 491502 495581 499974 504387 508559 512294 515695 519367 523986 529547 535347 540846
$$ packed form
60326E38569o311o718n846m014k915l229l756l375k595k359k421j970j106m57
60312D91497N3R81K185L034L644M900P133R658J1814J3702J5719J7874J9797K1012
60298F23003K1109J9980J7845J4800J0495M700j943q286j3600j7621j9905k0043
60286F30534j8513j6503j4592j2325r452o829n429n037m651l982l720m289n039
60273E20173n072m410l819l738l888l919l944m053l873l081k144j899k349k537
60259D71447j864r21o16r15j047o63k09j48l18k27L64J216J813J769J202O83O22
60242D72188Q02P02J96l22m71l21k25l60n54m70J5O58J145J484J917K474K880
60225D81738L023L171L570M079M393M413M172L735L401L672M619N561N800N499
$$ plain form
60211 540846 546217 551888 557982 564576 572149 581185 591306 601275 610034 617497 624271 630884 637474 643906
60197 643906 649829 654741 658482 661698 665373 669551 672901 674002 672915 671024 669368 667709 665297 661908
60183 661908 657814 653216 648204 642973 637677 632235 626697 621518 617094 613164 609043 604329 599123 593782
60169 593782 588851 584915 582087 579855 577836 576305 575396 574219 571671 568041 564898 563286 562819 562679 562669
60154 562669 562958 563563 564504 565884 567433 568506 568927 569320 570192 571235 571983 572640 573732 575355 577348 579838
60138 579838 583071 586964 591409 596801 603602 611418 619014 625353 630303 634407 638288 642277 646289 649947
60124 649947 653008 655575 657834 659756 661305 662750 664537 666958 670111 674001 678377 682623 686045 688269
60110 688269 689328 689580 689653 690096 690843 691230 690694 689105 686317 682025 676486 670845 666040 661739 657088 652193
$$ packed form
60211E40846N371N671O094O594P573R036J0121R969Q759P463O774O613O590O432
60197F43906N923M912L741L216L675M178L350J101j087j891j656j659k412l389
60183F61908m094m598n012n231n296n442n538n179m424l930m121m714n206n341
60169E93782m931l936k828k232k019j531r09j177k548l630l143j612m67j40j0
60154E62669K89O05R41J380J549J073M21L93Q72J043P48O57J092J623J993K490
60138E79838L233L893M445N392O801P816P596O339M950M104L881L989M012L658
60124F49947L061K567K259J922J549J445J787K421L153L890M376M246L422K224
60110F88269J059K52P3M43P47L87n36j589k788m292n539n641m805m301m651m895
$$ plain form
60094 652193 648037 645002 642432 639876 637887 637144 637359 637610 637388 636873 636451 636460 637200 638698 640459 641791 642430
60077 642430 642515 641967 640275 637075 632602 627279 621081 613738 605536 597445 590152 583341 576259 568814 561683
60062 561683 555421 549926 544871 540196 535967 532074 528359 524878 521826 519341 517492 516325 515748 515583 515850
60047 515850 516875 518977 522188 526303 531026 535982 540874 545772 551032 556835 562942 568973 574660 579761
60033 579761 584031 587403 589871 591157 590879 589109 586323 582664 577821 571817 565311 558713 551664 543925
60019 543925 536189 529300 523128 517001 510965 505797 501898 498928 496464 494246 491765 488351 483908 479049
60005 479049 474392 470219 466868 464798 464035 464019 464251 464654 465159 465380 465019 464266 463649 463709 464895 467356 470668
59988 470668 474104 477359 480764 484682 489002 493325 497318 500717 503258 504785 505239 504523 502682 500185 497647
$$ packed form
60094F52193m156l035k570k556j989p43K15K51k22n15m22RP40J498J761J332O39
60077F42430Q5n48j692l200m473n323o198p343q202q091p293o811p082p445p131
60062E61683o262n495n055m675m229l893l715l481l052k485j849j167n77j65K67
60047E15850J025K102L211M115M723M956M892M898N260N803O107O031N687N101
60033E79761M270L372K468J286k78j770k786l659m843o004o506o598p049p739
60019E43925p736o889o172o127o036n168l899k970k464k218k481l414m443m859
60005D79049m657m173l351k070p63j6K32M03N05K21l61p53o17O0J186K461L312
59988D70668L436L255L405L918M320M323L993L399K541J527M54p16j841k497k538
$$ plain form
59973 497647 495191 492480 489360 486026 482503 478606 474637 471498 469720 468829 468103 467535 467539 468056 468612 469169
59957 469169 470346 472668 475917 479274 481944 483660 484809 486014 487452 488674 489228 489337 489772 491157 493550
59942 493550 496479 499206 501130 502253 503208 504614 506496 508460 510207 511576 512323 512327 511958 511863 512321 513126 514169
59925 514169 515725 517988 520651 523250 525746 528469 531545 534718 537847 541337 545811 551363 557379 563214
59911 563214 568807 574374 579597 583517 585405 585416 584199 582114 579235 575946 573031 570987 569507 567879 565740
59896 565740 563322 561158 559780 559662 561129 564155 568322 573080 578043 582973 587599 591670 595258 598873
59882 598873 603123 608279 614249 620862 627940 635100 641720 647335 651944 655784 658838 660732 661080 659781
59868 659781 657003 653081 648483 643640 638612 633044 626661 619749 612907 606422 600203 594376 589494 585909
$$ packed form
59973D97647k456k711l120l334l523l897l969l139j778q91p26n68MN17N56N57
59957D69169J177K322L249L357K670J716J149J205J438J222N54J09M35J385K393
59942D93550K929K727J924J123R55J406J882J964J747J369P47Ml69r5M58Q05J043
59925E14169J556K263K663K599K496K723L076L173L129L490M474N552O016N835
59911E63214N593N567N223L920J888J1j217k085k879l289k915k044j480j628k139
59896E65740k418k164j378j18J467L026M167M758M963M930M626M071L588L615
59882E98873M250N156N970O613P078P160O620N615M609L840L054J894L48j299
59868F59781k778l922m598m843n028n568o383o912o842o485o219n827m882l585
$$ plain form
59854 585909 583270 581059 579401 578853 579510 581023 583619 588404 596168 606275 617255 628104 638430 647595
59840 647595 654612 659058 661484 662618 662738 662247 662314 664164 667699 671431 673900 674791 674419 672622 668755 662715
59824 662715 655413 647942 640526 632686 624320 616206 609328 603975 599724 596027 592517 588932 585210 581802
59810 581802 579489 578534 578091 576776 573852 569690 565113 560607 556358 552682 549923 547933 546125 544190 542377
59795 542377 540857 539298 537456 535796 534879 534347 533283 531648 530631 531221 532971 534553 535105 534619 533420
59780 533420 531895 530593 530031 530177 530384 529945 528723 527319 526618 526983 527854 528357 528329 528422 529171 530422 531850
59763 531850 533489 535380 537199 538711 540201 541960 543753 545358 547265 550186 554125 558643 563806 570062
59749 570062 577239 584496 591325 597817 603762 608391 611444 613868 616848 620480 623862 626266 627820 629122
$$ packed form
59854E85909k639k211j658n48O57J513K596M785P764J0107J0980J0849J0326R165
59840F47595P017M446K426J134J20m91O7J850L535L732K469Q91l72j797l867o040
59824F62715p302p471p416p840q366q114o878n353m251l697l510l585l722l408
59810E81802k313r55m43j315k924m162m577m506m249l676k759j990j808j935j813
59795E42377j520j559j842j660r17n32j064j635j017N90J750J582N52m86j199
59780E33420j525j302n62J46K07m39j222j404p01L65Q71N03k8R3P49J251J428
59763E31850J639J891J819J512J490J759J793J605J907K921L939M518N163O256
59749E70062P177P257O829O492N945M629L053K424K980L632L382K404J554J302
$$ plain form
59735 629122 630510 631762 632454 632602 632767 633405 634334 635183 636112 637560 639436 641194 642675 644163 645495 645912
59719 645912 645187 644235 644078 644606 644841 644135 642686 641146 640101 639761 639864 639987 640095 640536 641386 642246 642927 643890
59701 643890 645619 647913 650257 652633 655517 659205 663540 668172 672767 677089 681155 685121 688772 691352
59687 691352 692287 691885 690977 690067 689182 688296 687335 685901 683540 680366 676957 673582 669912 665611 660771 655566
59671 655566 649853 643440 636540 629637 622985 616546 610421 605061 600893 597824 595372 593280 591839 591456
59657 591456 592097 593341 594893 596816 599299 602471 606413 611035 615891 620337 623952 626606 628136 628272 626974
59642 626974 624530 621241 617258 612777 607986 602763 596866 590630 585004 580575 576959 573479 570061 567057
59628 567057 564561 562461 560852 559769 558585 556346 552854 548952 545572 542801 540099 537147 534187 531566
$$ packed form
59735F29122J388J252O92J48J65O38R29Q49R29J448J876J758J481J488J332M17
59719F45912p25r52j57N28K35p06j449j540j045l40J03J23J08M41Q50Q60O81R63
59701F43890J729K294K344K376K884L688M335M632M595M322M066L966L651K580
59687F91352R35m02r08r10q85q86r61j434k361l174l409l375l670m301m840n205
59671F55566n713o413o900o903o652o439o125n360m168l069k452k092j441l83
59657E91456O41J244J552J923K483L172L942M622M856M446L615K654J530J36j298
59642F26974k444l289l983m481m791n223n897o236n626m429l616l480l418l004
59628E67057k496k100j609j083j184k239l492l902l380k771k702k952k960k621
$$ plain form
59614 531566 529210 526720 523984 521429 519492 518057 516828 516104 516583 518311 520452 522376 524312 526517 528430
59599 528430 529355 529484 529453 529214 528185 526395 524588 523246 522285 521811 522274 523603 524963 525768 526235 526491 525848
59582 525848 523722 520807 518500 517265 516238 514499 512098 509664 507468 505231 502678 499971 497567 495790
59568 495790 494618 493907 493719 494248 495382 496509 496975 496637 495795 494705 493404 492081 491303 491633 493037 494819
59552 494819 496208 496963 497477 498387 500156 502935 506648 511041 515690 520126 524196 528304 533139 539134 546406
59537 546406 555412 567338 583305 602957 624081 643748 659664 670455 675354 674316 668403 659618
59525 659618 650199 642105 636715 634350 634146 634951 636468 639037 642249 644485 644259 641540 637302 632099 625656
59510 625656 617685 608538 598914 589267 579692 570246 561218 553047 545965 539823 534332 529386 524985 521046
$$ packed form
59614E31566k356k490k736k555j937j435j229p24M79J728K141J924J936K205J913
59599E28430R25J29l1k39j029j790j807j342r61m74M63J329J360Q05M67K56o43
59582E25848k126k915k307j235j027j739k401k434k196k237k553k707k404j777
59568D95790j172p11j88N29J134J127M66l38q42j090j301j323p78L30J404J782
59552D94819J389P55N14R10J769K779L713M393M649M436M070M108M835N995P272
59537E46406R006J1926J5967J9652K1124J9667J5916J0791M899j038n913q785
59525F59618r419q094n390k365k04Q05J517K569L212K236k26k719m238n203o443
59510F25656p971r147r624r647r575r446r028q171p082o142n491m946m401l939
$$ plain form
59496 521046 517573 514867 513182 512230 511523 511111 511420 512347 513298 514304 516252 519509 523100 525940 528286 531117
59480 531117 534527 537735 540547 543871 548594 554714 561786 569566 577827 585934 593028 598579 602661 605749
59466 605749 608269 610231 611341 611500 610984 610037 608735 607564 607737 610340 615309 621732 628980 637070 646084
59451 646084 655834 666080 676499 686419 695153 702716 709775 716760 723316 728583 731561 731282 727228 719794
59437 719794 709978 698608 686315 674157 663509 655003 648127 642156 636988 632836 629611 627065 625203
59424 625203 624202 624207 625576 629001 634976 643266 653209 664444 677151 691719 708449 727429 748511
59411 748511 771441 796013 821708 846888 868625 883728 890081 887138 875729 857926 836978 816705
59399 816705 800488 790547 787724 791335 799015 807055 811487 809417 799808 783419 762164 738385 714284
$$ packed form
59496E21046l473k706j685r52p07m12L09R27R51J006J948L257L591K840K346K831
59480E31117L410L208K812L324M723O120P072P780Q261Q107P094N551M082L088
59466F05749K520J962J110J59n16r47j302j171J73K603M969O423P248Q090R014
59451F46084R750J0246J0419R920Q734P563P059O985O556N267K978k79m054p434
59437G19794r816j1370j2293j2158j0648q506o876n971n168m152l225k546j862
59424F25203j001NJ369L425N975Q290R943J1235J2707J4568J6730J8980K1082
59411G48511K2930K4572K5695K5180K1737J5103O353k943j1409j7803k0948k0273
59399H16705j6217r941k823L611P680Q040M432k070r609j6389k1255k3779k4101
$$ plain form
59386 714284 691549 671212 653842 639900 629777 623393 619931 618235 617503 617551 618498 620330 622706 625069
59372 625069 627095 629204 632405 637354 643602 649970 655560 660271 664622 669439 675492 682892 690801 698156
59358 698156 704734 711208 718263 726042 734435 743362 752637 762068 771859 782510 794121 806203 818449
59345 818449 831335 845555 861057 876935 892134 905994 918178 928402 936361 941878 944981 945719
59333 945719 943860 939007 931162 920949 909051 895641 880770 865071 849550 834702 820387 806632
59321 806632 794045 783235 774198 766420 759304 752479 746097 740770 736739 733100 728540 722997 717916 714531
59307 714531 712576 711137 710097 709991 710857 712056 713230 714835 717709 722553 729833 739666 751558 764331
59293 764331 776327 785656 790531 789755 783011 770790 754314 735650 717320 701180 687642 676204
$$ packed form
59386G14284k2735k0337j7370j3942j0123o384l462j696p32M8R47J832K376K363
59372F25069K026K109L201M949O248O368N590M711M351M817O053P400P909P355
59358F98156O578O474P055P779Q393Q927R275R431R791J0651J1611J2082J2246
59345H18449J2886J4220J5502J5878J5199J3860J2184J0224P959N517L103P38
59333I45719j859m853p845j0213j1898j3410j4871j5699j5521j4848j4315j3755
59321H06632j2587j0810r037p778p116o825o382n327m031l639m560n543n081l385
59307G14531j955j439j040j06Q66J199J174J605K874M844P280R833J1892J2773
59293G64331J1996R329M875p76o744j2221j6476j8664j8330j6140j3538j1438
$$ plain form
59281 676204 666578 658993 653652 650472 649424 650627 653925 658739 664626 671787 680730 691459 703258 715293
59267 715293 727255 739230 751080 762205 771909 779713 785201 787911 787725 785139 780739 774534 766314
59254 766314 756609 746687 737397 728466 719219 709677 700622 692822 686517 681478 677364 674088 672007 671588
59240 671588 672837 675233 678300 681967 686269 691048 696152 701575 707123 712170 716127 719026 721365 723366
59226 723366 724604 724334 722115 718251 713633 709027 704462 699494 694048 688684 683995 680056 676649 673764
59212 673764 671630 670399 669908 669648 669022 667912 666890 666505 666425 665825 664593 663443 662685 661672 659919 658021
59196 658021 656780 655931 654544 652416 650301 648809 647783 646909 646334 646427 647198 648237 649123 649897 651120 653399
59180 653399 656706 660324 663534 666233 668811 671664 674971 678689 682585 686484 690644 695634 701717 708640
$$ packed form
59281F76204r626p585n341l180j048J203L298M814N887P161Q943J0729J1799J2035
59267G15293J1962J1975J1850J1125R704P804N488K710j86k586m400o205q220
59254G66314r705r922r290q931r247r542r055p800o305n039m114l276k081m19
59240F71588J249K396L067L667M302M779N104N423N548N047L957K899K339K001
59226G23366J238k70k219l864m618m606m565m968n446n364m689l939l407k885
59212F73764k134j231m91k60o26j110j022l85q0o00j232j150p58j013j753j898
59196F58021j241q49j387k128k115j492j026q74n75R3P71J039Q86P74J223K279
59180F53399L307L618L210K699K578K853L307L718L896L899M160M990O083O923
$$ plain form
59166 708640 716216 724695 734255 744455 754562 764184 773283 781781 789415 795780 800257 802195 801384 798136
59152 798136 792701 785080 775681 765636 755904 746326 736055 724705 712670 700606 689095 678578
59140 678578 669151 660496 652285 644463 636918 629370 622006 615665 610816 606722 602374 597905 594325 592064
59126 592064 590611 589528 589018 589461 591078 594137 598830 604780 611284 618191 626111 635603 646575 658442
59112 658442 670390 681537 691439 700560 709699 718905 727470 735010 741881 748409 754421 759820 764944 769891
59098 769891 773955 776248 776632 775654 773816 771267 768045 764352 760652 757599 755673 754743 754140 753232 751742
59083 751742 749519 746326 741994 736534 729969 722295 713727 704775 695884 687174 678651 670511 663070 656352
59069 656352 649857 642908 635419 628225 622312 617658 613336 608907 605077 602511 600587 598079 594686 591127
$$ packed form
59166G08640P576Q479R560J0200J0107R622R099Q498P634O365M477J938q11l248
59152G98136n435p621r399j0045r732r578j0271j1350j2035j2064j1511j0517
59140F78578r427q655q211p822p545p548p364o341m849m094m348m469l580k261
59126E92064j453j083n10M43J617L059M693N950O504O907P920R492J0972J1867
59112F58442J1948J1147R902R121R139R206Q565P540O871O528O012N399N124M947
59098G69891M064K293L84r78j838k549l222l693l700l053j926r30o03r08j490
59083G51742k223l193m332n460o565p674q568q952q891q710q523q140p441o718
59069F56352o495o949p489p194n913m654m322m429l830k566j924k508l393l559
$$ plain form
59055 591127 587997 585433 583741 583300 583745 584121 584078 584118 584504 584785 584716 584764 585296 585970 586390 586608 586512 585539 583678
59036 583678 581995 581378 581299 580773 580082 580508 582529 585278 587926 590754 594605 599936 606749 614972 624512 635159
59020 635159 646631 658611 670673 682415 693667 704383 714275 722747 729220 733377 735197 734980 733308
59007 733308 730705 727378 723565 720076 718057 718070 719707 722307 725730 730169 735473 741068 746522 751868 757231
58992 757231 762393 766880 770384 772879 774393 774813 774021 772157 769652 766938 764099 760833 756856 752456 748617
58977 748617 746473 746582 748704 752240 756875 762847 770685 780593 792016 803989 816081 828801 842817
58964 842817 857949 873356 888528 903426 917563 929731 939071 945867 950734 953419 953004 948999 941594
58951 941594 931019 917367 901162 883518 865525 847770 830519 813963 798127 782828 767993
$$ packed form
59055E91127l130k564j692m41M45L76m3M0L86K81o9M8N32O74M20K18r6r73j861
59036E83678j683o17p9n26o91M26K021K749K648K828L851N331O813Q223R540J0647
59020F35159J1472J1980J2062J1742J1252J0716R892Q472O473M157J820k17j672
59007G33308k603l327l813l489k019J3J637K600L423M439N304N595N454N346N363
58992G57231N162M487L504K495J514M20p92j864k505k714k839l266l977m400l839
58977G48617k144J09K122L536M635N972P838R908J1423J1973J2092J2720J4016
58964H42817J5132J5407J5172J4898J4137J2168R340O796M867K685m15m005p405
58951I41594j0575j3652j6205j7644j7993j7755j7251j6556j5836j5299j4835
$$ plain form
58940 767993 753911 741150 730249 721440 714521 709042 704626 701033 697926 694972 692339 690651 690145 690233
58926 690233 690223 690023 689710 688905 687269 685279 683688 682425 680837 678973 677728 677579 678036 678582 679442 680957
58910 680957 682824 684518 686168 688539 692174 696847 701864 706890 712516 719922 729867 742185 756365 772160
58896 772160 789181 806351 822555 837728 852649 867778 883028 898566 915009 932666 951333
58885 951333 970944 991653 1013027 1033870 1053099 1070212 1084668 1095545 1102142 1104408 1102563 1096945
58873 1096945 1088363 1077797 1065344 1050223 1032269 1012742 993182 974284 956435 940611 927734
58862 927734 917480 908520 899774 890937 881975 872751 863097 852946 842539 832522 823367 814456 804463
58849 804463 793130 782016 772808 765377 758273 750664 742845 735052 726848 717881 708540 699539 691254 683588
$$ packed form
58940G67993j4082j2761j0901q809o919n479m416l593l107k954k633j688n06Q8
58926F90233j0k00l13q05j636j990j591j263j588j864j245j49M57N46Q60J515
58910F80957J867J694J650K371L635M673N017N026N626P406R945J2318J4180J5795
58896G72160J7021J7170J6204J5173J4921J5129J5250J5538J6443J7657J8667
58885I51333J9611K0709K1374K0843J9229J7113J4456J0877O597K266j845n618
58873A096945q582j0566j2453j5121j7954j9527j9560j8898j7849j5824j2877
58862I27734j0254q960q746q837q962r224r654j0151j0407j0017r155q911r993
58849H04463j1333j1114r208p431p104p609p819p793q204q967r341r001q285p666
$$ plain form
58835 683588 676129 668440 660535 653130 647096 642620 639135 636055 633304 631113 629621 628778 628520 628974 630413
58820 630413 632895 636079 639728 644325 650604 658320 666078 672746 678530 684212 689838 694797 698773 701892
58806 701892 704087 705029 704713 703537 701777 699392 696350 692708 688399 683379 677996 672749 667612 662009 655605
58791 655605 648824 642432 636861 632139 628244 625262 623223 621965 621318 621454 622876 625888 630074 634548 638788
58776 638788 642964 647367 651725 655257 657289 657645 656510 653973 649741 643488 635577 627199 619374 612018
58762 612018 604406 596446 588889 582398 577059 572974 570594 570132 571110 572816 574849 577024 579180 581317 583572
58747 583572 585937 588400 591302 594984 599096 603037 607113 612352 618909 625656 631718 637463 643481 649604
58733 649604 655625 662013 669036 675994 682217 688044 693868 699039 702904 706228 710168 714287 717062 718229
$$ packed form
58835F83588p459p689p905p405o034m476l485l080k751k191j492q43k58M54J439
58820F30413K482L184L649M597O279P716P758O668N784N682N626M959L976L119
58806G01892K195R42l16j176j760k385l042l642m309n020n383n247n137n603o404
58791F55605o781o392n571m722l895k982k039j258o47J36J422L012M186M474M240
58776F38788M176M403M358L532K032L56j135k537m232o253p911q378p825p356
58762F12018p612p960p557o491n339m085k380m62R78J706K033K175K156K137K255
58747E83572K365K463K902L682M112L941M076N239O557O747O062N745O018O123
58733F49604O021O388P023O958O223N827N824N171L865L324L940M119K775J167
$$ plain form
58719 718229 719154 720796 722657 724216 726156 729544 734514 740368 746412 752184 757254 761273 764105 765752
58705 765752 766228 765494 763289 759120 752599 743684 732371 718553 702534 685329 667958 650752 633863
58692 633863 618033 604187 592478 582375 573468 565588 558448 551913 546362 541998 538022 533361 528109
58679 528109 523368 519731 516841 514477 513024 512618 512696 512865 513555 515415 518512 522440 526856 531754 537569
58664 537569 545076 554699 565885 577465 588589 598793 607307 613054 615521 615084 612365 607783 601786
58651 601786 594930 587555 579891 572456 565737 559438 552795 545826 539569 534769 530999 527482 524241 521925
58637 521925 520862 520763 521132 521563 521778 521742 521817 522583 524368 526900 529401 531188 532195 532776 533075 532979 532718 532898
58619 532898 533730 534892 536591 540047 546191 554484 563768 573687 584262 594641 603575 610985 617785 624108
$$ packed form
58719G18229R25J642J861J559J940L388M970N854O044N772N070M019K832J647
58705G65752M76p34k205m169o521q915j1313j3818j6019j7205j7371j7206j6889
58692F33863j5830j3846j1709j0103q907p880p140o535n551m364l976m661n252
58679E28109m741l637k890k364j453m06P8J69O90J860L097L928M416M898N815
58664E37569P507R623J1186J1580J1124J0204Q514N747K467m37k719m582n997
58651F01786o856p375p664p435o719o299o643o969o257m800l770l517l241k316
58637E21925j063r9L69M31K15l6P5P66J785K532K501J787J007N81K99r6k61J80
58619E32898Q32J162J699L456O144Q293R284R919J0575J0379Q934P410O800O323
$$ plain form
58605 624108 628915 631562 632641 632915 632428 631131 629437 627566 625061 621526 617351 613247 609533 606303 603888
58590 603888 602721 602945 604368 606599 609319 612785 618011 625867 636005 647225 658826 670907 683318
58577 683318 695165 705614 714556 722278 729081 735411 741768 748266 754824 761912 770520 781244 794090
58564 794090 809281 827454 848780 872572 898087 925074 953159 981260 1008011 1032278 1052953
58553 1052953 1068827 1079112 1083872 1083795 1079887 1073442 1065760 1057708 1049816 1042589 1036116 1029538 1021703 1012293
58539 1012293 1001533 988910 973333 954657 933933 911803 887897 862450 837419 815060 796064
58528 796064 779846 766043 754883 746496 740652 737005 735057 734065 733420 732955 732673 732480 732342 732231 731715
58513 731715 730091 727209 723767 720532 717740 715372 713419 711608 709438 706780 704020 701428 698952 696760
$$ packed form
58605F24108M807K647J079K74m87j297j694j871k505l535m175m104l714l230k415
58590F03888j167K24J423K231K720L466N226P856J0138J1220J1601J2081J2411
58577F83318J1847J0449Q942P722O803O330O357O498O558P088Q608J0724J2846
58564G94090J5191J8173K1326K3792K5515K6987K8085K8101K6751K4267K0675
58553A052953J5874J0285M760p7l908o445p682q052p892p227o473o578p835r410
58539A012293j0760j2623j5577j8676k0724k2130k3906k5447k5031k2359j8996
58528G96064j6218j3803j1160q387n844l647j948r92o45m65k82j93j38j11n16
58513G31715j624k882l442l235k792k368j953j811k170k658k760k592k476k192
$$ plain form
58499 696760 695301 694553 693837 692625 691059 689529 688406 688211 689260 690987 692524 694135 697082 701780 707231
58484 707231 712779 719277 727719 737780 748701 760825 775137 791707 809549 827745 845869 863417
58472 863417 879415 892509 901211 904522 902749 897323 889463 879490 867744 855485 844291 835030 827922
58459 827922 823128 820783 820848 823413 828760 836832 847112 859306 873416 888578 902511 912833 918665
58446 918665 920527 919104 914610 906934 896008 882368 867631 853837 841948 831464 821836 813656 808034
58433 808034 805379 805260 807005 809991 813820 818590 824609 831680 839216 847188 856197 866344 876800 886745
58419 886745 895922 903869 909528 912167 912021 909578 904948 898361 890493 881785 872137 861701 851267 841449
58405 841449 832225 823624 816049 809564 803727 798487 794335 791240 788467 785875 784334 784425 785827 788376 792373
$$ packed form
58499F96760j459p48p16j212j566j530j123j95J049J727J537J611K947M698N451
58484G07231N548O498Q442J0061J0921J2124J4312J6570J7842J8196J8124J7548
58472H63417J5998J3094Q702L311j773n426p860r973j1746j2259j1194r261p108
58459H27922m794k345O5K565N347Q072J0280J2194J4110J5162J3933J0322N832
58446I18665J862j423m494p676j0926j3640j4737j3794j1889j0484r628q180n622
58433H08034k655j19J745K986L829M770O019P071P536P972R009J0147J0456R945
58419H86745R177P947N659K639j46k443m630o587p868q708r648j0436j0434r818
58405H41449r224q601p575o485n837n240m152l095k773k592j541R1J402K549L997
$$ plain form
58390 792373 797209 801105 803140 804385 806080 807886 808917 809407 810229 811673 813693 816510 820064 823681 827128
58375 827128 831154 836311 842316 849237 857956 868495 879235 888965 898526 909213 920768 932235 943675
58362 943675 955678 968237 981444 996198 1012710 1029256 1043881 1056509 1067995 1078085 1085895 1091554
58350 1091554 1095689 1097996 1097948 1096426 1095116 1094731 1095057 1096130 1098072 1100471 1103280 1107707 1114897 1124340 1134814
58335 1134814 1146131 1158678 1172070 1185764 1200324 1216626 1234382 1252633 1270918 1288704 1304572
58324 1304572 1317412 1327631 1335907 1341699 1344472 1345358 1346024 1346752 1347170 1347839 1349524 1351883 1354596 1358829 1365806
58309 1365806 1374878 1384716 1395400 1407565 1420606 1433711 1447638 1463342 1479820 1495440 1510510 1526349
58297 1526349 1542689 1558314 1573547 1589820 1607343 1625302 1643708 1662998 1682547 1701664 1721311
$$ packed form
58390G92373M836L896K035J245J695J806J031M90Q22J444K020K817L554L617L447
58375H27128M026N157O005O921Q719J0539J0740R730R561J0687J1555J1467J1440
58362I43675J2003J2559J3207J4754J6512J6546J4625J2628J1486J0090P810N659
58350A091554M135K307m8j522j310l85L26J073J942K399K809M427P190R443J0474
58335A134814J1317J2547J3392J3694J4560J6302J7756J8251J8285J7786J5868
58324A304572J2840J0219Q276N792K773Q86O66P28M18O69J685K359K713M233O977
58309A365806R072R838J0684J2165J3041J3105J3927J5704J6478J5620J5070J5839
58297A526349J6340J5625J5233J6273J7523J7959J8406J9290J9549J9117J9647
$$ plain form
58286 1721311 1742761 1765405 1788048 1811369 1836796 1863927 1891430 1919566 1949330 1980117 2010793
58275 2010793 2042139 2075623 2110806 2146636 2184200 2225250 2268990 2313351 2358512 2406106 2455981
58264 2455981 2507034 2560264 2617518 2677980 2739423 2802159 2868113 2936599 3004787 3071914 3139410
58253 3139410 3207381 3274681 3342014 3411255 3482182 3553699 3627675 3707547 3793662 3884104 3979471
58242 3979471 4082440 4193142 4309590 4432320 4563902 4704174 4850785 5004338 5168075
58233 5168075 5342689 5526538 5720848 5929361 6152815 6389193 6639547 6908077 7196489
58224 7196489 7504066 7833412 8190006 8575906 8990285 9436573 9922612 10453446 11030809
58215 11030809 11660258 12351860 13113565 13951622 14878405 15912377 17070322 18368555 19833030
$$ packed form
58286A721311K1450K2644K2643K3321K5427K7131K7503K8136K9764L0787L0676
58275B010793L1346L3484L5183L5830L7564M1050M3740M4361M5161M7594M9875
58264B455981N1053N3230N7254O0462O1443O2736O5954O8486O8188O7127O7496
58253C139410O7971O7300O7333O9241P0927P1517P3976P9872Q6115R0442R5367
58242C979471J02969J10702J16448J22730J31582J40272J46611J53553J63737
58233E168075J74614J83849J94310K08513K23454K36378K50354K68530K88412
58224G196489L07577L29346L56594L85900M14379M46288M86039N30834N77363
58215A1030809O29449O91602P61705Q38057R26783J033972J157945J298233J464475
$$ plain form
58206 19833030 21500183 23408506 25600843 28137779 31099950 34577227 38667584 43488427
58198 43488427 49178401 55891398 63812076 73192818 84374996 97783074 113918510 133352121
58190 133352121 156666982 184321194 216431073 252458807 290833229 328724353 362308357
58183 362308357 387610667 401561169 402739911 391582799 370145477 341560893 309268460
58176 309268460 276216754 244379186 214758875 187711490 163281967 141412403 122042648
58169 122042648 105129475 90593867 78261853 67875436 59157075 51850491 45719121
58162 45719121 40547209 36157924 32416219 29209878 26440651 24033344 21935450 20100859
58154 20100859 18483316 17046289 15765782 14619125 13580818 12632074 11764412 10970406
$$ packed form
58206A9833030J667153J908323K192337K536936K962171L477277M090357M820843
58198D3488427N689974O712997P920678R380742J1182178J3408078J6135436J9433611
58190A33352121K3314861K7654212L2109879L6027734L8374422L7891124L3584004
58183C62308357K5302310J3950502J178742j1157112k1437322k8584584l2292433
58176C09268460l3051706l1837568k9620311k7047385k4429523k1869564j9369755
58169A22042648j6913173j4535608j2332014j0386417q718361p306584o131370
58162D5719121n171912m389285l741705l206341k769227k407307k097894j834591
58154B0100859j617543j437027j280507j146657j038307r48744q67662p94006
$$ plain form
58146 10970406 10239179 9563456 8942525 8375010 7855597 7380953 6951583 6565248 6214846
58137 6214846 5894834 5603560 5337527 5089747 4855905 4636333 4430001 4232358 4041285
58128 4041285 3859722 3690080 3530899 3380942 3241587 3112961 2992204 2877759 2771249
58119 2771249 2673258 2581246 2493371 2410518 2332966 2258949 2188055 2122228 2061838 2004436 1948829
58108 1948829 1896672 1848584 1802428 1756990 1713691 1673004 1632787 1591926 1552255 1515098 1479124
58097 1479124 1443342 1409057 1377070 1346045 1315369 1286729 1261080 1236891 1213095 1190980 1171353
58086 1171353 1152556 1133138 1113935 1095729 1077394 1058180 1039403 1021964 1004406 985287 965439
58075 965439 946184 927286 908332 890192 873428 857021 840134 823448 807527 791823 776576
$$ packed form
58146A0970406p31227o75723o20931n67515n19413m74644m29370l86335l50402
58137F214846l20012k91274k66033k47780k33842k19572k06332j97643j91073
58128D041285j81563j69642j59181j49957j39355j28626j20757j14445j06510
58119B771249r7991r2012q7875q2853p7552p4017p0894o5827o0390n7402n5607
58108A948829n2157m8088m6156m5438m3299m0687m0217m0861l9671l7157l5974
58097A479124l5782l4285l1987l1025l0676k8640k5649k4189k3796k2115j9627
58086A171353j8797j9418j9203j8206j8335j9214j8777j7439j7558j9119j9848
58075I65439j9255j8898j8954j8140j6764j6407j6887j6686j5921j5704j5247
$$ plain form
58064 776576 763546 753404 744379 734961 725963 718414 711452 703994 696571 689724 682335 673372 663675 654270
58050 654270 644487 633603 622945 614439 608112 602718 597835 593795 590440 587351 584492 581506 577356 571728
58036 571728 565761 560406 555209 549637 544230 539318 533944 527304 520059 512997 505590 497057 487765 478420
58022 478420 469066 460013 452475 446989 442291 437049 431637 427006 422939 418810 415013 412228 409991 407312
58008 407312 404009 400435 396706 393245 391174 391066 391995 392754 393235 393811 394402 395041 396307 398216 399679 400077
57992 400077 400326 401376 402776 403726 404426 405197 405406 404494 403051 401655 399715 396678 393270 390197 386771 382355
57976 382355 378101 375532 374195 372434 369821 367152 364643 361940 359567 358632 359071 359624 359566 359269 359141 359140 359273
57959 359273 359556 359537 358726 357353 355934 354418 352514 350422 348410 346169 343464 340916 339282 338506 338382 339464
$$ packed form
58064G76576j3030j0142r025r418q998p549o962p458p423o847p389q963r697r405
58050F54270r783j0884j0658q506o327n394m883m040l355l089k859k986m150n628
58036E71728n967n355n197n572n407m912n374o640p245p062p407q533r292r345
58022D78420r354r053p538n486m698n242n412m631m067m129l797k785k237k679
58008D07312l303l574l729l461k071j08R29P59M81N76N91O39J266J909J463L98
57992D00077K49J050J400R50P00P71K09r12j443j396j940l037l408l073l426m416
57976C82355m254k569j337j761k613k669k509k703k373r35M39N53n8k97j28jJ33
57959C59273K83j9q11j373j419j516j904k092k012k241k705k548j634p76j24J082
$$ plain form
57943 339464 342169 345595 348488 351019 354453 359427 365707 373216 382077 391848 401894 412306 423363
57930 423363 434311 443848 451663 458378 464085 468137 470388 471517 471913 471140 468689 464575 459099 452652
57916 452652 445735 438646 431251 423579 416315 410136 404892 400101 395806 392222 388988 385674 382658 380554
57902 380554 379053 377158 374331 370595 365911 360400 354946 350589 347450 345004 343141 342120 341822 341970 342783
57887 342783 344500 346595 348471 350628 353979 358211 361950 364489 366289 367815 368949 369583 369774 369262 367782
57872 367782 365914 364667 364196 363809 363203 362691 362244 361401 360264 359489 359068 358195 356663 355423 355301 356006 356850
57855 356850 357654 358514 359381 360340 361736 363558 365186 366079 366279 366019 365304 364201 363071 362197 361380 360072 357710
57838 357710 354016 349427 345093 341908 339541 336915 333656 330457 328032 326383 325237 324507 324110 323846 323783
$$ packed form
57943C39464K705L426K893K531L434M974O280P509Q861R771J0046J0412J1057
57930D23363J0948R537P815O715N707M052K251J129L96p73k451m114n476o447
57916D52652o917p089p395p672p264o179n244m791m295l584l234l314l016k104
57902C80554j501j895k827l736m684n511n454m357l139k446j863j021k98J48Q13
57887C42783J717K095J876K157L351M232L739K539J800J526J134O34J91n12j480
57872C67782j868j247m71l87o06n12m47q43j137p75m21q73j532j240j22P05Q44
57855C56850Q04Q60Q67R59J396J822J628Q93K00k60p15j103j130q74q17j308k362
57838C57710l694m589m334l185k367k626l259l199k425j649j146p30l97k64o3
$$ plain form
57823 323783 324336 325743 327783 330114 332602 335196 337851 340621 343524 346314 348737 350941 353256 355553
57809 355553 357192 357585 356450 353635 349142 343394 337100 330825 324923 319772 315775 313167 311979 311996 312640
57794 312640 313338 314231 316026 318783 321498 323400 324932 326721 328305 328960 329209 330300 332365 334331 335608
57779 335608 336771 338466 340670 343213 346096 349102 351889 354607 357575 360315 361724 361407 360009 358113
57765 358113 355705 352908 350300 348106 345841 343092 340020 336878 333712 330804 328676 327411 326597 326141 326367
57750 326367 327104 327578 327620 328188 330171 333312 336806 340335 343966 347557 350819 353612 355757 356902 356933 356150
57734 356150 354704 352240 348443 343658 338697 334248 330557 327328 323920 320054 316391 313890 312532 311313
57720 311313 309583 307711 306164 304666 302710 300398 298259 296549 295088 293498 291414 288776 286067 283870
$$ packed form
57823C23783N53J407K040K331K488K594K655K770K903K790K423K204K315K297
57809C55553J639L93j135k815m493n748o294o275n902n151l997k608j188J7O44
57794C12640O98Q93J795K757K715J902J532J789J584O55K49J091K065J966J277
57779C35608J163J695K204K543K883L006K787K718K968K740J409l17j398j896
57765C58113k408k797k608k194k265k749l072l142l166k908k128j265q14m56K26
57750C26367P37M74M2N68J983L141L494L529L631L591L262K793K145J145L1p83
57734C56150j446k464l797m785m961m449l691l229l408l866l663k501j358j219
57720C11313j730j872j547j498j956k312k139j710j461j590k084k638k709k197
$$ plain form
57706 283870 282070 279907 276931 273494 270194 267335 265017 263234 261710 260134 258662 257718 257310 257118 257226
57691 257226 257946 258832 258836 257785 256828 256943 257706 258094 257879 257647 257988 259254 261800 265930 271853 279866 290257
57674 290257 302958 317924 336075 359110 388034 422597 462680 509466 564376 626838 693188
57663 693188 757036 810385 845546 857585 845748 812941 764377 706552 646052 587878 534665
57652 534665 487561 447287 413968 386730 364333 345969 331062 318818 308612 300350 293829 288168
57640 288168 282553 277233 273059 270335 268739 268043 268129 268440 268169 267076 265632 264368 263542 263271 263531 264026
57624 264026 264422 264629 264610 264147 263120 261805 260560 259438 258403 257598 257056 256472 255677 254964 254555 254074 253062
57607 253062 251652 250216 248691 246830 244896 243407 242361 241283 239948 238520 237089 235585 234047 232502
$$ packed form
57706B83870j800k163k976l437l300k859k318j783j524j576j472r44m08j92J08
57691B57226P20Q86Mj051r57J15P63L88k15k32L41J266K546M130N923Q013J0391
57674B90257J2701J4966J8151K3035K8924L4563M0083M6786N4910O2462O6350
57663F93188O3848N3349L5161J2039j1837l2807m8564n7825o0500n8174n3213
57652E34665m7104m0274l3319k7238k2397j8364j4907j2244j0206q262o521n661
57640B88168n615n320m174k724j596o96Q6L11k71j093j444j264q26k71K60M95
57624B64026L96K07j9m63j027j315j245j122j035q05n42n84p95p13m09m81j012
57607B53062j410j436j525j861j934j489j046j078j335j428j431j504j538j545
$$ plain form
57593 232502 230689 228380 225874 223667 221715 219501 216814 213991 211444 209365 207888 207088 206763 206507 206070
57578 206070 205431 204624 203730 202930 202291 201576 200476 198884 196817 194303 191531 188871 186466 184177 182100 180718
57562 180718 180215 180051 179601 178815 177897 176838 175779 175362 176112 177780 179858 182334 185358 188572 191488 194220
57546 194220 197131 200040 202457 204242 205293 204922 202542 198852 195439 193194 191921 191399 191821 193022 194193
57531 194193 194676 194416 193416 191524 188998 186674 185224 184601 184328 183847 182660 180827 179364 179432 180975 182851
57515 182851 184440 186287 188921 191991 195121 198806 203727 209575 215204 219675 222751 224746 226371 228391
57501 228391 230921 233208 234508 234936 235165 235513 235724 235470 234699 233659 232842 232678 233018 233123 232492 231475 230734
57484 230734 230318 229756 228955 228460 228703 229353 229669 229307 228562 227895 227410 226878 226042 224743 222808 220119 216938
$$ packed form
57593B32502j813k309k506k207j952k214k687k823k547k079j477q00l25k56m37
57578B06070o39q07q94q00o39p15j100j592k067k514k772k660k405k289k077j382
57562A80718n03j64m50p86r18j059j059m17P50J668K078K476L024L214K916K732
57546A94220K911K909K417J785J051l71k380l690l413k245j273n22M22J201J171
57531A94193M83k60j000j892k526k324j450o23k73m81j187j833j463O8J543J876
57515A82851J589J847K634L070L130L685M921N848N629M471L076J995J625K020
57501B28391K530K287J300M28K29L48K11k54p71j040q17j64L40J05o31j017p41
57484B30734m16n62q01m95K43O50L16l62p45o67m85n32q36j299j935k689l181
$$ plain form
57467 216938 213920 211572 209804 208263 206920 205997 205404 204659 203459 201990 200602 199421 198390 197445 196563
57452 196563 195780 195286 195332 195984 197044 198210 199227 200031 200874 202141 203773 205088 205545 205508 205810 206674 207556
57435 207556 208092 208652 209784 211545 213568 215421 216699 217118 216807 216287 215955 215774 215579 215448 215553 215870 216206
57418 216206 216421 216520 216612 216815 217072 217113 216837 216673 217288 218888 221041 223142 224762 225590 225516 224972 224812 225556 226850
57399 226850 227796 227760 226878 226010 226167 227684 229851 231552 232294 232431 232525 232916 233860 235588 238035 240850 243869
57382 243869 247295 251260 255528 259751 263759 267402 270415 272657 274264 275390 275941 275719 274705 273167 271568
57367 271568 270328 269471 268543 267100 265195 263207 261387 259960 259422 260116 261601 263036 264189 265471 266947
57352 266947 268149 269092 270639 273361 276630 279363 281219 282537 283556 284250 284620 284613 284035 283046 282455 282988 284403
$$ packed form
57467B16938l018k348j768j541j343r23n93p45j200j469j388j181j031r45q82
57452A96563p83m94M6O52J060J166J017Q04Q43J267J632J315M57l7L02Q64Q82
57435B07556N36N60J132J761K023J853J278M19l11n20l32j81j95j31J05L17L36
57418B16206K15R9R2K03K57M1k76j64O15J600K153K101J620Q28p4n44j60P44J294
57399B26850R46l6q82q68J57J517K167J701P42J37R4L91R44J728K447K815L019
57382B43869L426L965M268M223M008L643L013K242J607J126N51k22j014j538j599
57367B71568j240q57r28j443j905j988j820j427n38O94J485J435J153J282J476
57352B66947J202R43J547K722L269K733J856J318J019O94L70pn78r89n91N33J415
$$ plain form
57335 284403 285854 286957 288011 289232 290354 291040 291305 291424 291714 292381 293341 294219 294771 295251 296061 297058 297536
57318 297536 296971 295641 294415 294032 294512 295257 295782 296359 297671 299794 301913 303316 304278 305549 307237 308772
57302 308772 309842 310876 312494 314884 317807 320890 323822 326482 328978 331361 333298 334321 334485 334504 335056
57287 335056 336145 337303 338248 339153 340373 342112 344353 346905 349458 351734 353718 355753 358309 361668 365776
57272 365776 370339 374973 379394 383648 388108 393024 398062 402586 406405 409925 413417 416599 419231 421749
57258 421749 424843 428667 432979 437799 443287 449049 454196 458228 461372 464039 466476 469052 472208 475879
57244 475879 479462 482675 486022 490111 494865 499722 504264 508402 512277 516340 521261 527445 534662 542249
57230 542249 549523 556077 562040 568080 574751 581750 588321 594447 601081 609025 618172 628095 638713 649958
$$ packed form
57335B84403J451J103J054J221J122O86K65J19K90O67R60Q78N52M80Q10R97M78
57318B97536n65j330j226l83M80P45N25N77J312K123K119J403R62J271J688J535
57302C08772J070J034J618K390K923L083K932K660K496K383J937J023J64J9N52
57287C35056J089J158R45R05J220J739K241K552K553K276J984K035K556L359M108
57272C65776M563M634M421M254M460M916N038M524L819L520L492L182K632K518
57258D21749L094L824M312M820N488N762N147M032L144K667K437K576L156L671
57244D75879L583L213L347M089M754M857M542M138L875M063M921O184P217P587
57230E42249P274O554N963O040O671O999O571O126O634P944R147R923J0618J1245
$$ plain form
57216 649958 661407 672772 684329 696306 708296 719847 731258 743193 755663 767925 779257
57205 779257 789504 799129 809102 820434 833345 847064 860783 874598 889209 905150 922733 942264
57193 942264 963657 986009 1008174 1029634 1050435 1070505 1089591 1107667 1124948 1141604 1157770
57182 1157770 1173565 1188773 1202972 1216483 1230659 1246570 1263782 1281248 1299020 1318180 1339175
57171 1339175 1361183 1383193 1404890 1426330 1447459 1468198 1488405 1507629 1525373 1541774 1557513
57160 1557513 1573012 1588129 1602734 1617120 1631788 1647292 1664340 1683647 1705594 1730206 1757305
57149 1757305 1786332 1816334 1846654 1877478 1909215 1941618 1974149 2006909 2040454 2074895 2110018
57138 2110018 2146204 2184357 2224858 2267330 2311415 2357031 2403831 2451320 2499669 2549709 2602036
$$ packed form
57216F49958J1449J1365J1557J1977J1990J1551J1411J1935J2470J2262J1332
57205G79257J0247R625R973J1332J2911J3719J3719J3815J4611J5941J7583J9531
57193I42264K1393K2352K2165K1460K0801K0070J9086J8076J7281J6656J6166
57182A157770J5795J5208J4199J3511J4176J5911J7212J7466J7772J9160K0995
57171A339175K2008K2010K1697K1440K1129K0739K0207J9224J7744J6401J5739
57160A557513J5499J5117J4605J4386J4668J5504J7048J9307K1947K4612K7099
57149A757305K9027L0002L0320L0824L1737L2403L2531L2760L3545L4441L5123
57138B110018L6186L8153M0501M2472M4085M5616M6800M7489M8349N0040N2327
$$ plain form
57127 2602036 2656788 2714248 2774821 2838373 2904438 2973154 3045292 3121412 3201909 3287785 3380272
57116 3380272 3479768 3586434 3702079 3830237 3974151 4135996 4318373 4525083 4759812 5025466
57106 5025466 5325793 5666894 6056922 6505895 7026969 7637338 8357934 9213752 10234923
57097 10234923 11455673 12911288 14637028 16669240 19043733 21790395 24929654 28472467
57089 28472467 32418116 36748673 41426852 46395278 51562722 56778657 61829645 66484557
57081 66484557 70560965 73952472 76599228 78449108 79457249 79611536 78939294 77484730
57073 77484730 75288858 72394931 68866277 64794463 60295858 55505974 50572688 45644071
57065 45644071 40853780 36311220 32097706 28265065 24836372 21810682 19170013 16884788
$$ packed form
57127B602036N4752N7460O0573O3552O6065O8716P2138P6120Q0497Q5876R2487
57116C380272R9496J06666J15645J28158J43914J61845J82377K06710K34729K65654
57106E025466L00327L41101L90028M48973N21074O10369P20596Q55818J021171
57097A0234923J220750J455615J725740K032212K374493K746662L139259L542813
57089B8472467L945649M330557M678179M968426N167444N215935N050988M654912
57081F6484557M076408L391507K646756J849880J008141J54287o72242j454564
57073G7484730k195872k893927l528654m071814m498605m789884m933286m928617
57065D5644071m790291m542560m213514l832641l428693l025690k640669k285225
$$ plain form
57057 16884788 14917507 13226934 11772622 10517688 9429887 8482471 7654559 6929883
57049 6929883 6294898 5737949 5248952 4818375 4436496 4094377 3785129 3503332 3243732
57040 3243732 3001786 2775328 2564310 2368683 2187588 2020749 1869285 1734378 1615953
57031 1615953 1513242 1426000 1354529 1299114 1260077 1238080 1234038 1249211 1285467 1343887 1420956
57020 1420956 1505290 1578743 1621956 1620827 1570726 1477428 1354749 1219536 1086240 963860 856092
57009 856092 763140 683497 615261 556995 507818 466878 432915 404363 379724 357851 338151
56998 338151 320593 305319 292108 280268 269060 258147 247797 238864 232448 229190 228857 230863 235184
56985 235184 242398 252784 265717 279985 294098 306005 313101 313363 306572 294065 277410 257829
$$ packed form
57057A6884788j967281j690573j454312j254934j087801r47416q27912p24676
57049F929883o34985n56949m88997m30577l81879l42119l09248k81797k59600
57040C243732k41946k26458k11018j95627j81095j66839j51464j34907j18425
57031A615953j02711q7242p1471n5415l9037k1997m042J5173L6256N8420P7069
57020A420956Q4334P3453M3213j129n0101r3298j22679j35213j33296j22380j07768
57009H56092r2952p9643o8236n8266m9177m0940l3963k8552k4639k1873j9700
56998C38151j7558j5274j3211j1840j1208j0913j0350q933o416l258l33K006M321
56985B35184P214J0386J2933J4268J4113J1907P096K62o791j2507j6655j9581
$$ plain form
56973 257829 236810 216433 198506 183608 171437 161885 155349 152074 151734 153829 158159 164768 173818
56960 173818 185818 201655 221917 246074 272449 298816 322762 341632 352724 353955 344621 325854
56948 325854 300634 273022 246609 223207 202986 185720 171638 161196 154638 151928 152849 157094
56936 157094 164680 176351 193156 215425 242522 273493 307143 341065 371317 393691 405170 404159
56924 404159 390404 365674 333905 299492 265232 232307 201643 174237 150423 129982 113081
56913 113081 100128 90526 82566 74976 67801 61456 55819 50733 46572 43540 41005 38280 35691 34158
56899 34158 33931 34398 35082 36330 38989 43714 50601 59304 69636 82141 97794 116972 139064 163232
56885 163232 188938 215258 240074 260638 274838 281675 281019 273658 261478 246852 231655 217138
$$ packed form
56973B57829k1019k0377j7927j4898j2171r552o536l275l40K095M330O609R050
56960A73818J2000J5837K0262K4157K6375K6367K3946J8870J1092J231r334j8767
56948C25854k5220k7612k6413k3402k0221j7266j4082j0442o558k710R21M245
56936A57094P586J1671J6805K2269K7097L0971L3650L3922L0252K2374J1479j011
56924D04159j3755k4730l1769l4413l4260l2925l0664k7406k3814k0441j6901
56913A13081j2953r602p960p590p175o345n637n086m161l032k535k725k589j533
56899C4158k27M67O84J248K659M725O887Q703J0332J2505J5653J9178K2092K4168
56885A63232K5706K6320K4816K0564J4200O837o56p361j2180j4626j5197j4517
$$ plain form
56873 217138 204537 195076 189307 187073 188347 193667 203530 217902 236719 260512 290094 325865 367819
56860 367819 415956 469799 526969 582402 629502 662468 677948 675238 655785 622894 581357 536481
56848 536481 492920 454120 422330 398619 382911 374587 373427 379888 394599 418014 450672 493469
56836 493469 547453 613464 691640 780318 874729 966942 1047512 1107478 1139633 1139674 1107742 1049060
56824 1049060 972379 887142 801385 720986 649572 588793 539080 500348 472134 453720 444778
56813 444778 445776 457299 479227 511100 552982 605091 666297 733196 800317 860550 905825 929057
56801 929057 926733 899854 852523 790238 719412 647086 579393 519801 468980 426219 390764 362240
56789 362240 340572 325795 317770 316165 320890 332423 351296 377162 408439 442643 476691 506936
$$ packed form
56873B17138j2601r461n769k234J274N320R863J4372J8817K3793K9582L5771M1954
56860C67819M8137N3843N7170N5433M7100L2966J5480k710j9453l2891m1537m4876
56848E36481m3561l8800l1790k3711j5708q324j160O461J4711K3415L2658M2797
56836D93469N3984O6011P8176Q8678R4411R2213Q0570N9966L2155M1l1932n8682
56824A049060p6681q5237q5757q0399p1414o0779m9713l8732k8214j8414q942
56813D44778R98J1523K1928L1873M1882N2109O1206O6899O7121O0233M5275K3232
56801I29057k324k6879m7331o2285p0826p2326o7693n9592n0821m2761l5455k8524
56789C62240k1668j4777q025j605M725J1533J8873K5866L1277L4204L4048L0245
$$ plain form
56777 506936 529523 541220 540122 525792 499255 463118 421305 377974 336215 297667 263060 232696
56765 232696 206322 183111 162346 144113 129003 117157 107929 100474 94225 88733 83582 78834 75181
56752 75181 73119 72134 71125 69581 67875 66441 65171 63837 62680 62206 62536 63260 63875 64192 64288 64248 64025
56735 64025 63476 62497 61122 59586 58270 57525 57402 57592 57761 57967 58639 60096 62224 64667 67179 69703
56719 69703 72247 74792 77236 79373 81042 82313 83383 84295 84978 85659 86877 88920 91498 94115 96501
56704 96501 98509 99963 100933 101868 103056 104160 104660 104525 104071 103418 102565 101891 101930 102620 103208 103033 102071 100763
56686 100763 99696 99401 99922 100525 100346 99529 99197 100041 101419 102208 102177 102028 102334 102950 103512 104053 104856 105902
56668 105902 106743 107016 106966 107321 108663 111067 114275 117887 121300 123958 126079 128771 132917 138070 142986
$$ packed form
56777E06936K2587J1697j098j4330k6537l6137m1813m3331m1759l8548l4607l0364
56765B32696k6374k3211k0765j8233j5110j1846r228p455o249n492n151m748l653
56752G5181k062r85j009j544j706j434j270j334j157m74L30P24O15L17R6m0k23
56735F4025n49r79j375j536j316p45j23J90J69K06O72J457K128K443K512K524
56719F9703K544K545K444K137J669J271J070R12O83O81J218K043K578K617K386
56704I6501K008J454R70R35J188J104N00j35m54o53q53o74L9O90N88j75r62j308
56686A00763j067k95N21O03j79q17l32Q44J378P89l1j49L06O16N62N41Q03J046
56668A05902Q41K73n0L55J342K404L208L612L413K658K121K692M146N153M916
$$ plain form
56653 142986 147077 150700 154079 156760 158364 159182 159582 159405 158461 157203 156307 155811 155123 153837 152099 150302
56637 150302 148808 147931 147775 148010 148087 147739 147068 146180 144967 143368 141642 140207 139189 138126 136246 133230
56621 133230 129778 127201 126224 126329 126349 125577 124074 122160 120079 118159 116888 116530 116794 117131 117309 117584 118262
56604 118262 119202 119837 119652 118597 117056 115574 114666 114695 115593 116696 117206 116960 116548 116486 116580 116437 116346 117111 118994
56585 118994 121325 123402 125282 127300 129159 130095 129930 129377 129178 129385 129746 130370 131603 133476 135662 137904
56569 137904 140182 142587 145327 148704 152690 156738 160517 164786 170929 179535 189960 201422 213830
56556 213830 227164 240507 252212 260780 265382 266062 263998 261198 259212 258068 256781 254752 252287 249888
56542 249888 247552 244899 241711 238267 235174 232758 230536 227586 223633 219425 215829 212852 209852 206318
$$ packed form
56653A42986M091L623L379K681J604Q18M00j77r44j258q96m96o88j286j738j797
56637A50302j494q77j56K35P7l48o71q88j213j599j726j435j018j063j880l016
56621A33230l452k577r77J05K0p72j503j914k081j920j271l58K64L37J78K75O78
56604A18262R40O35j85j055j541j482r08K9Q98J103N10k46m12o2R4j43r1P65J883
56585A18994K331K077J880K018J859R36j65n53j99K07L61O24J233J873K186K242
56569A37904K278K405K740L377L986M048L779M269O143Q606J0425J1462J2408
56556B13830J3334J3343J1705Q568M602O80k064k800j986j144j287k029k465k399
56542B49888k336k653l188l444l093k416k222k950l953m208l596k977l000l534
$$ plain form
56528 206318 202122 197466 193096 190136 188994 188628 187465 184907 181480 177850 174394 171496 169461 168088
56514 168088 166887 165644 164271 162440 160162 158432 158285 159175 159264 157506 154623 151882 149897 148919 149296 150916
56498 150916 152818 153937 153914 152935 151350 149759 148895 149004 149778 151086 153112 155510 157249 157879 158265 159399
56482 159399 161042 162253 162810 163331 164208 165193 165959 166526 167101 167867 168895 169989 170782 171243 171877 173108 174657
56465 174657 175786 176005 175329 174107 172844 171991 171619 171462 171371 171462 171766 172152 172697 173645 174784 175417 175278 175008
56447 175008 175335 176270 177448 178826 180530 182429 184320 186210 187974 189098 189229 188735 188279 188149 188337 188904
56431 188904 189752 190384 190406 190117 190170 190810 191780 192668 193039 192544 191335 190113 189448 189329 189669 190765 192775 195090
56413 195090 196724 197145 196445 195065 193637 192585 191505 189509 186638 184353 183993 185290 187020 188538 189877
$$ packed form
56528B06318m196m656m370k960j142l66j163k558l427l630l456k898k035j373
56514A68088j201j243j373j831k278j730j47Q90Q9j758k883k741j985r78L77J620
56498A50916J902J119k3r79j585j591q64J09P74J308K026K398J739O30L86J134
56482A59399J643J211N57N21Q77R85P66N67N75P66J028J094P93M61O34J231J549
56465A74657J129K19o76j222j263q53l72j57r1R1L04L86N45R48J139O33j39k70
56447A75008L27R35J178J378J704J899J891J890J764J124J31m94m56j30J88N67
56431A88904Q48O32K2k89N3O40R70Q88L71m95j209j222o65j19L40J096K010K315
56413A95090J634M21p00j380j428j052j080j996k871k285l60J297J730J518J339
$$ plain form
56398 189877 190855 191115 190879 190786 191091 191601 192204 192776 192837 192096 191105 190713 191079 191931 193407 195735 198373 200473
56380 200473 202092 203928 205884 207014 207044 206919 207479 208510 209511 210644 212365 214669 217206 219741 222139
56365 222139 224249 226096 227947 229967 231985 233723 235040 235999 236915 238271 240224 242319 244044 245472 246967
56350 246967 248473 249664 250639 251820 253174 254127 254255 253612 252480 251382 251166 252343 254354 256220 257964
56335 257964 260615 264571 268741 271713 273259 274325 275887 278176 280771 283233 285717 288901 293180 298086
56321 298086 302784 306864 310285 312869 314447 315338 316012 316409 316168 315398 314591 313897 313167 312692 313204 315076 318091
56304 318091 321882 325996 329718 332701 335776 340295 346523 353357 359684 365235 370099 374238 377793 381151
56290 381151 384451 387601 390858 394761 399389 404392 409854 416350 423958 431923 439598 447082 454750 462836
$$ packed form
56398A89877R78K60k36r3L05N10O03N72O1p41r91l92L66Q52J476K328K638K100
56380B00473J619J836J956J130L0j25N60J031J001J133J721K304K537K535K398
56365B22139K110J847J851K020K018J738J317R59R16J356J953K095J725J428J495
56350B46967J506J191R75J181J354R53J28o43j132j098k16J177K011J866J744
56335B57964K651L956M170K972J546J066J562K289K595K462K484L184M279M906
56321B98086M698M080L421K584J578Q91O74L97k41p70q07o94p30m75N12J872L015
56304C18091L791M114L722K983L075M519O228O834O327N551M864M139L555L358
56290C81151L300L150L257L903M628N003N462O496P608P965P675P484P668Q086
$$ plain form
56276 462836 471726 481968 493684 506409 519657 533207 546876 560705 575345 591528 609125 627572
56264 627572 647254 669543 695234 723831 754685 788025 824618 865272 910984 962779 1021050
56253 1021050 1085800 1157839 1238935 1330447 1432571 1545214 1668696 1803098 1947689 2101430
56243 2101430 2263272 2431440 2603093 2775183 2945077 3109878 3265638 3407579 3530742
56234 3530742 3630551 3703681 3748698 3765346 3753303 3712654 3645458 3555622 3446904 3322221 3184968
56223 3184968 3039349 2888723 2735054 2580816 2429921 2285563 2148300 2017512 1893760
56214 1893760 1778309 1671229 1571533 1478913 1394017 1317063 1247192 1183211 1124303 1070091 1020514
56203 1020514 975466 934282 896018 860485 828328 799749 773977 750461 729600 711604 695560
$$ packed form
56276D62836Q890J0242J1716J2725J3248J3550J3669J3829J4640J6183J7597J8447
56264F27572J9682K2289K5691K8597L0854L3340L6593M0654M5712N1795N8271
56253A021050O4750P2039Q1096R1512J02124J12643J23482J34402J44591J53741
56243B101430J61842J68168J71653J72090J69894J64801J55760J41941J23163
56234C530742R9809P3130M5017J6648j2043m0649o7196q9836j08718j24683j37253
56223C184968j45619j50626j53669j54238j50895j44358j37263j30788j23752
56214A893760j15451j07080r9696r2620q4896p6954o9871o3981n8908n4212m9577
56203A020514m5048m1184l8264l5533l2157k8579k5772k3516k0861j7996j6044
$$ plain form
56192 695560 680493 666598 654547 644298 635427 627914 621709 616208 611081 606954 604338 602482 600201
56179 600201 597252 594002 590498 586932 584301 583335 583184 582414 580946 579887 579795 580352 581598 584227 588524 593875
56163 593875 599477 604877 609937 614923 620551 627320 634936 642846 651112 660262 670682 682643 696528
56150 696528 712425 729884 748639 769248 792685 819841 851756 889581 933905 984987 1044093
56139 1044093 1113460 1194048 1284242 1381508 1484086 1589901 1694922 1794227 1884298 1963401 2030808
56128 2030808 2087198 2135241 2178087 2217175 2252096 2281826 2304900 2319220 2323303 2317685 2304298 2284972
56116 2284972 2261140 2233666 2201348 2160355 2106856 2039974 1961251 1872443 1775702 1675212 1576489
56105 1576489 1483891 1399936 1326322 1263760 1211134 1166564 1129294 1099254 1075289 1055590 1039596
$$ packed form
56192F95560j5067j3895j2051j0249q871p513o205n501n127m127k616j856k281
56179F00201k949l250l504l566k631r66j51p70j468j059r2N57J246K629M297N351
56163E93875N602N400N060M986N628O769P616P910Q266R150J0420J1961J3885
56150F96528J5897J7459J8755K0609K3437K7156L1915L7825M4324N1082N9106
56139A044093O9367Q0588R0194R7266J02578J05815J05021R9305R0071P9103O7407
56128B030808N6390M8043M2846L9088L4921K9730K3074J4320M083n618j3387j9326
56116B284972k3832k7474l2318m0993n3499o6882p8723q8808r6741j00490r8723
56105A576489r2598q3955p3614o2562n2626m4570l7270l0040k3965j9699j5994
$$ plain form
56094 1039596 1027805 1019885 1014562 1011144 1009550 1009134 1009165 1010202 1013205 1017528 1021564 1025206 1029748 1035513
56080 1035513 1041604 1047984 1055700 1064770 1073879 1082562 1091829 1102187 1112879 1123584 1135124 1147888 1161156
56067 1161156 1174545 1188673 1203831 1219382 1235046 1251452 1268897 1286781 1304676 1322842 1341331
56056 1341331 1359629 1377405 1394663 1411188 1426855 1442294 1458142 1474008 1489411 1505146 1522261
56045 1522261 1540348 1558680 1578254 1600539 1624748 1648790 1672630 1698122 1725655 1753726 1782108
56034 1782108 1812635 1846248 1881750 1918270 1956557 1997057 2038907 2081746 2126486 2173531 2222061
56023 2222061 2271654 2322716 2374879 2427037 2479478 2533974 2591409 2651335 2714017 2780436 2850000
56012 2850000 2920837 2992916 3068396 3148426 3232128 3319177 3410591 3506401 3605435 3708164 3816930
$$ packed form
56094A039596j1791p920n323l418j594m16L1J037L003M323M036L642M542N765
56080A035513O091O380P716R070R109Q683R267J0358J0692J0705J1540J2764J3268
56067A161156J3389J4128J5158J5551J5664J6406J7445J7884J7895J8166J8489
56056A341331J8298J7776J7258J6525J5667J5439J5848J5866J5403J5735J7115
56045A522261J8087J8332J9574K2285K4209K4042K3840K5492K7533K8071K8382
56034A782108L0527L3613L5502L6520L8287M0500M1850M2839M4740M7045M8530
56023B222061M9593N1062N2163N2158N2441N4496N7435N9926O2682O6419O9564
56012B850000P0837P2079P5480Q0030Q3702Q7049R1414R5810R9034J02729J08766
$$ plain form
56001 3816930 3932560 4053599 4179675 4312749 4454162 4603443 4760849 4928110 5105816
55992 5105816 5293261 5491676 5704289 5932216 6173699 6428428 6699183 6988361 7296781
55983 7296781 7627024 7983924 8370387 8786697 9235312 9722268 10252732 10829759 11458891
55974 11458891 12149274 12908898 13744113 14665940 15691771 16839357 18125533 19573816 21217929
55965 21217929 23096571 25253064 27745370 30651655 34064315 38086803 42840823 48470386
55957 48470386 55138545 63036151 72409969 83586611 96975058 113060222 132393618
55950 132393618 155554465 183049447 215126658 251468508 290779343 330464701 366738351
55943 366738351 395322646 412496125 416007816 405543088 382719754 350686729 313376574
$$ packed form
56001C816930J15630J21039J26076J33074J41413J49281J57406J67261J77706
55992E105816J87445J98415K12613K27927K41483K54729K70755K89178L08420
55983G296781L30243L56900L86463M16310M48615M86956N30464N77027O29132
55974A1458891O90383P59624Q35215R21827J025831J147586J286176J448283J644113
55965B1217929J878642K156493K492306K906285L412660M022488M754020N629563
55957D8470386O668159P897606R373818J1176642J3388447J6085164J9333396
55950A32393618K3160847K7494982L2077211L6341850L9310835L9685358L6273650
55943C66738351K8584295J7173479L511691j0464728k2823334l2033025l7310155
$$ plain form
55936 313376574 274585762 237240398 203134436 173094722 147293705 125506022 107291767
55929 107291767 92140157 79559846 69107504 60392901 53090169 46940676 41735506
55922 41735506 37299094 33489682 30200258 27346469 24855594 22668263 20740659 19036967
55914 19036967 17523086 16170351 14958660 13870827 12888072 11994351 11180223 10438550 9760195
55905 9760195 9136958 8564566 8039387 7555600 7108384 6696469 6318718 5971248 5650327
55896 5650327 5354924 5083923 4833751 4601242 4386135 4188320 4005131 3833609 3673232
55887 3673232 3524288 3385679 3256214 3136050 3025144 2922275 2827121 2741106 2664448 2594249
55877 2594249 2526950 2460820 2394749 2326865 2256202 2184056 2112150 2040926 1970714 1902747 1837715
$$ packed form
55936C13376574l8790812l7345364l4105962l0039714k5801017k1787683j8214255
55929A07291767j5151610j2580311j0452342q714603p302732o149493n205170
55922D1735506m436412l809412l289424k853789k490875k187331j927604j703692
55914A9036967j513881j352735j211691j087833r82755q93721q14128p41673o78355
55905I760195o23237n72392n25179m83787m47216m11915l77751l47470l20921
55896E650327k95403k71001k50172k32509k15107j97815j83189j71522j60377
55887C673232j48944j38609j29465j20164j10906j02869r5154q6015p6658p0199
55877B594249o7299o6130o6071o7884p0663p2146p1906p1224p0212o7967o5032
$$ plain form
55866 1837715 1775031 1714760 1658487 1607129 1559658 1515115 1474003 1436436 1400899 1366305 1333530
55855 1333530 1303417 1274973 1247088 1220383 1195696 1172132 1148255 1123935 1099500 1074281 1047619
55844 1047619 1020306 993587 967606 942078 917487 894337 872159 850473 829865 810957 793201
55833 793201 775838 759229 744147 730499 717767 705917 695006 684653 674787 666074 658734 651761
55821 651761 644110 635735 626731 616542 605008 593190 582141 571709 561518 552166 544407 537970 532298
55808 532298 527708 524765 523162 522281 522249 523487 525813 528915 533160 538894 545352 551105 555323 557920 558885
55793 558885 558117 555589 551192 544850 537114 529034 521089 512955 504658 497040 490559 484574 478401 472193
55779 472193 466063 459212 450781 440956 430620 420605 411864 405596 402491 402493 405693 412510 422361 433045
$$ packed form
55866A837715o2684o0271n6273n1358m7471m4543m1112l7567l5537l4594l2775
55855A333530l0113k8444k7885k6705k4687k3564k3877k4320k4435k5219k6662
55844A047619k7313k6719k5981k5528k4591k3150k2178k1686k0608j8908j7756
55833G93201j7363j6609j5082j3648j2732j1850j0911j0353r866q713p340o973
55821F51761p651q375r004j0189j1534j1818j1049j0432j0191r352p759o437n672
55808E32298m590k943j603q81l2J238K326L102M245N734O458N753M218K597R65
55793E58885p68k528m397o342p736q080p945q134q297p618o481n985o173o208
55779D72193o130o851q431r825j0336j0015q741o268l105KL200O817R851J0684
$$ plain form
55765 433045 442106 448012 449599 445721 436567 424337 411542 399242 387639 377288 368557 360759 353056
55752 353056 345618 338881 332351 325328 318207 311830 305993 299706 292680 285567 279053 273584 269539 266787
55738 266787 264401 261774 259601 258892 259372 259819 259593 258873 257628 255452 252331 248718 244805 240441 235706
55723 235706 230972 226442 222085 217927 214020 210426 207531 205950 205716 206081 206546 207518 209454 212060 214930
55708 214930 218301 222449 226909 230940 234167 236161 236141 233960 230691 227373 223778 219230 213978 208782 203837
55693 203837 199073 194879 191440 187986 183944 180344 178856 179702 181634 183602 185309 186524 187226 188339 191020
55678 191020 195141 199501 203524 207723 212406 216909 220263 221928 221900 220791 219577 218580 217010 214251 211133
55663 211133 208987 207982 207510 207664 208917 210649 211620 211961 213167 215852 218860 220959 222153 222904 223214 223029
$$ packed form
55765D33045R061N906J587l878r154j2230j2795j2300j1603j0351q731p798p703
55752C53056p438o737o530p023p121o377n837o287p026p113o514n469m045k752
55738B66787k386k627k173p09M80M47k26p20j245k176l121l613l913m364m735
55723B35706m734m530m357m158l907l594k895j581k34L65M65R72J936K606K870
55708B14930L371M148M460M031L227J994k0k181l269l318l595m548n252n196m945
55693B03837m764m194l439l454m042l600j488Q46J932J968J707J215P02J113K681
55678A91020M121M360M023M199M683M503L354J665k8j109j214r97j570k759l118
55663B11133k146j005m72J54J253J732R71L41J206K685L008K099J194P51L10j85
$$ plain form
55647 223029 222562 221749 220177 217915 215543 213030 209510 204573 198959 193527 188285 182826 177011 170867 164459
55632 164459 158214 152757 148205 144230 140878 138546 137005 135399 133417 131567 130006 128199 126138 124807
55618 124807 124710 124887 124123 122411 120429 118267 115614 112747 110410 108912 107997 107463 107336 107607 108262 109405
55602 109405 110907 112092 112216 111250 109928 109071 108884 108776 107851 105865 103658 102254 101618 100851 99631 98706
55586 98706 98765 99601 100729 102080 103517 104293 103757 102346 101295 101527 103205 106037 109477 112754 115236 116881
55570 116881 118179 119751 122035 125048 128235 130774 132341 133402 134683 136531 138824 141062 142396 141982
55556 141982 139681 136237 132648 129595 127430 126126 125025 123240 120716 118468 117355 117089 116914 116757 117064
55541 117064 117797 118390 118666 119108 120083 121404 122886 124826 127510 130514 132956 134445 135447 136569 137708
$$ packed form
55647B23029m67q13j572k262k372k513l520m937n614n432n242n459n815o144o408
55632A64459o245n457m552l975l352k332j541j606j982j850j561j807k061j331
55618A24807r7J77p64j712j982k162k653k867k337j498r15n34j27K71O55J143
55602A09405J502J185J24r66j322q57j87j08r25j986k207j404o36p67j220r25
55586I8706N9Q36J128J351J437P76n36j411j051K32J678K832L440L277K482J645
55570A16881J298J572K284L013L187K539J567J061J281J848K293K238J334m14
55556A41982k301l444l589l053k165j304j101j785k524k248j113k66j75j57L07
55541A17064P33N93K76M42R75J321J482J940K684L004K442J489J002J122J139
$$ plain form
55526 137708 138118 137171 134820 131414 127457 123617 120593 118636 117389 116398 115561 114847 113933 112524 110865 109539
55510 109539 108835 108638 108745 108940 108927 108595 108212 107947 107422 106205 104504 102861 101340 99625 97747 96047 94527
55493 94527 92903 91283 90083 89249 88231 86767 85065 83240 81320 79764 79126 79009 78240 76371 74254
55478 74254 72843 72173 71823 71616 71497 71404 71665 72799 74530 75729 75796 75346 75043 74569 73376 71732 70228
55461 70228 68822 67234 65769 64908 64432 63850 63456 64112 66004 68321 70210 71471 72252 72545 72183 71149
55445 71149 69820 68889 68821 69345 69807 70067 70533 71235 71623 71647 72163 73645 75119 75285 74299 73541 73868 74866 75721
55426 75721 76137 76340 76738 77551 78418 78572 77800 76933 76863 77352 77449 76842 76153 76002 76402 77026 77508 77537 77159 76914
55406 76914 77193 77577 77336 76447 75576 75160 75092 75192 75412 75594 75607 75681 76133 76791 77191 77206 76993 76535 75886 75658
$$ packed form
55526A37708M10r47k351l406l957l840l024j957j247r91q37p14r14j409j659j326
55510A09539p04j97J07J95j3l32l83k65n25j217j701j643j521j715j878j700j520
55493I4527j624j620j200q34j018j464j702j825j920j556o38j17p69j869k117
55478G4254j411o70l50k07j19r3K61J134J731J199O7m50l03m74j193j644j504
55461G0228j406j588j465q61m76n82l94O56J892K317J889J261P81K93l62j034
55445G1149j329r31o8N24M62K60M66P02L88K4N16J482J474J66r86p58L27R98Q55
55426G5721M16K03L98Q13Q67J54p72q67p0M89R7o07o89j51M00O24M82K9l78k45
55406G6914K79L84k41q89q71m16o8J00K20J82J3P4M52O58M00J5k13m58o49k28
$$ plain form
55386 75658 76427 77684 78240 77801 77341 77740 78838 80091 81357 82637 83712 84538 85492 86740 87781 88070
55370 88070 87753 87364 87096 86778 86302 85641 84577 82771 80118 76884 73631 71043 69573 69043 68761 68214 67520
55353 67520 67151 67420 68269 69284 69816 69387 68136 66751 65905 65907 66733 68001 68970 69080 68633 68493 68983 69555
55335 69555 69711 69709 70039 70715 71468 72236 72961 73255 72804 71969 71487 71658 72188 72734 73136 73226 72916 72553 72774 73818
55315 73818 75224 76303 76677 76289 75215 73745 72413 71612 71158 70520 69561 68882 69256 70824 73008 75168
55299 75168 77091 78736 79836 80049 79434 78503 77762 77424 77542 78170 79270 80643 82044 83297 84214 84530 84048
55282 84048 82802 81058 79197 77566 76343 75544 75221 75523 76421 77437 77968 77922 77803 78084 78670 79099 79060 78571
55264 78571 77837 77126 76708 76704 76981 77272 77421 77474 77576 77815 78133 78388 78508 78604 78918 79671 80899 82305 83257 83217
$$ packed form
55386G5658P69J257N56m39m60L99J098J253J266J280J075Q26R54J248J041K89
55370H8070l17l89k68l18m76o61j064j806k653l234l253k588j470n30k82n47o94
55353F7520l69K69Q49J015N32m29j251j385q46KQ26J268R69J10m47j40M90N72
55335F9555J56kL30O76P53P68P25K94m51q35m82J71N30N46M02R0l10l63K21J044
55315G3818J406J079L74l88j074j470j332q01m54o38r59o79L74J568K184K160
55299G5168J923J645J100K13o15r31p41l38J18O28J100J373J401J253R17L16m82
55282H4048j246j744j861j631j223p99l23L02Q98J016N31m6j19K81N86M29l9m89
55264G8571p34p11m18mK77K91J49N3J02K39L18K55J20R6L14P53J228J406R52m0
$$ plain form
55244 83217 82354 81554 81580 82307 83014 83247 83029 82375 81152 79619 78608 78790 79905 80938 81009 79987 78489
55227 78489 77443 77438 78213 78864 78747 78144 77897 78544 79884 81227 81814 81225 79802 78643 78747 79993 81261
55210 81261 81718 81703 82120 83236 84468 85233 85509 85571 85605 85779 86313 87118 87661 87557 87191 87335 88222 89353 90207
55191 90207 90738 91107 91317 91273 90946 90316 89385 88338 87454 86738 85966 85138 84541 84237 83892 83308 82748 82460 82299
55172 82299 82158 82342 83090 84071 84811 85343 85958 86653 87349 88321 89693 90702 90285 88426 86235 84624 83584
55155 83584 82889 82722 83209 83927 84369 84592 84966 85530 85925 85795 85015 83724 82346 81475 81460 82122 82937 83456 83564
55136 83564 83538 83843 84658 85579 85976 85663 85033 84642 84853 85764 87078 88095 88189 87372 86085 84588 82977 81657
55118 81657 81187 81618 82542 83827 85620 87542 88645 88479 87601 86664 85752 85003 85105 86422 88154 89187 89494
$$ packed form
55244H3217q63q00K6P27P07K33k18o54j223j533j011J82J115J033P1j022j498
55227G8489j046nP75O51j17o03k47O47J340J343N87n89j423j159J04J246J268
55210H1261M57j5M17J116J232P65K76O2L4J74N34Q05N43j04l66J44Q87J131Q54
55191I0207N31L69K10m4l27o30r31j047q84p16p72q28n97l04l45n84n60k88j61
55172H2299j41J84P48R81P40N32O15O95O96R72J372J009m17j859k191j611j040
55155H3584o95j67M87P18M42K23L74N64L95j30p80j291j378q71j5O62Q15N19J08
55136H3564k6L05Q15R21L97l13o30l91K11R11J314J017R4q17j287j497j611j320
55118H1657m70M31R24J285J793J922J103j66q78r37r12p49J02J317J732J033L07
$$ plain form
55101 89494 89942 90884 91699 91753 91242 90983 91702 93431 95330 96276 96053 95701 96252 97394 97983 97639 97057 96805
55083 96805 96690 96496 96547 97051 97493 97291 96750 96756 97656 98890 99719 99885 99485 98624 97527 96813 97222 98903 101196
55064 101196 103300 105002 106468 107537 107708 106931 105898 105294 105118 105043 105041 105193 105190 104605 103567 102639 102072 101668
55046 101668 101339 101219 101100 100326 98543 96230 94222 93008 92671 93122 94011 94718 94886 94884 95326 96195 96818 96740
55028 96740 96226 95733 95229 94404 93360 92693 92755 93175 93336 93128 92952 93100 93477 93934 94498 95086 95356 95086 94579
55009 94579 94400 94788 95510 96200 96636 96747 96596 96414 96532 97248 98702 100696 102555 103514 103513 103442 104249 105904 107556
54990 107556 108576 109077 109442 109809 110110 110260 110112 109538 108705 108000 107504 106779 105478 103962 103012 102966 103450 103986
54972 103986 104612 105693 107264 108806 109754 110078 110127 110047 109608 108706 107687 106940 106421 105886 105413 105275 105331 104999
$$ packed form
55101H9494M48R42Q15N4n11k59P19J729J899R46k23l52N51J142N89l44n82k52
55083I6805j15j94N1N04M42k02n41OR00J234Q29J66m00q61j097p14M09J681K293
55064A01196K104J702J466J069J71p77j033o04j76p5kJ52ln85j038r28n67m04
55046A01668l29j20j19p74j783k313k008j214l37M51Q89P07J68kM42Q69O23p8
55028I6740n14m93n04q25j044o67O2M20J61k08j76J48L77M57N64N88K70k70n07
55009I4579j79L88P22O90M36J11j51j82J18P16J454J994J859R59jp1Q07J655J652
54990A07556J020N01L65L67L01J50j48n74q33p05m96p25j301j516r50m6M84N36
54972A03986O26J081J571J542R48L24M9q0m39r02j019p47n19n35m73j38N6l32
$$ plain form
54954 104999 103973 102619 101462 100587 99858 99507 100094 101751 103757 105119 105571 105826 106719 108205 109454 109942
54938 109942 110059 110457 111123 111567 111735 112137 113004 113844 114117 113983 114065 114708 115778 117014 118288 119713 121753
54921 121753 125084 129970 135875 142037 148314 155098 162350 169217 174814 178963 181847 183253 182683 180108
54907 180108 176159 171447 166132 160290 154311 148592 143089 137567 132205 127513 123721 120650 118245 116751
54893 116751 116162 115925 115573 115355 115833 117030 118413 119622 120768 121999 123240 124507 126155 128568 131800
54878 131800 135626 139777 144004 148195 152526 157321 162588 167898 172863 177432 181447 184127 184450 182098
54864 182098 177774 172548 167074 161470 155698 149914 144530 139990 136423 133518 130849 128337 126261 124764
54850 124764 123515 121985 119931 117510 115036 112818 111137 110098 109408 108500 107075 105444 104199 103612 103504
$$ packed form
54954A04999j026j354j157q75p29l51N87J657K006J362M52K55Q93J486J249M88
54938A09942J17L98O66M44J68M02Q67Q40K73j34Q2O43J070J236J274J425K040
54921A21753L331M886N905O162O277O784P252O867N597M149K884J406n70k575
54907A80108l949m712n315n842n979n719n503n522n362m692l792l071k405j494
54893A16751n89k37l52k18M78J197J383J209J146J231J241J267J648K413L232
54878A31800L826M151M227M191M331M795N267N310M965M569M015K680L23k352
54864A82098m324n226n474n604n772n784n384m540l567k905k669k512k076j497
54850A24764j249j530k054k421k474k218j681j039o90r08j425j631j245n87j08
$$ plain form
54835 103504 103612 103877 104320 104824 105182 105273 105060 104528 103748 102954 102417 102218 102264 102507 103028 103855 104797 105573 106121
54816 106121 106670 107459 108401 109066 109026 108207 106930 105715 105033 105157 106031 107227 108176 108567 108598 108837 109767 111369
54798 111369 113033 114010 114074 113732 113660 114001 114393 114580 114676 114768 114606 113943 113014 112393 112402 112817 113173 113246 113238 113525 114222
54777 114222 115061 115804 116696 118293 120825 123971 127310 130730 134278 137933 141764 146048 150980 156419 162167
54762 162167 168284 174846 181547 187814 193167 197206 199477 199733 198219 195297 190887 184722 177127 169107
54748 169107 161576 154883 149124 144460 140920 138233 136087 134335 132822 131290 129649 128113 126833 125562
54734 125562 123957 122133 120742 120487 121562 123523 125686 127762 130089 133127 136896 141137 145922 151660
54720 151660 158373 165355 171756 177269 182056 186242 189678 192004 192757 191542 188362 183701 178207 172381
$$ packed form
54835A03504J08K65M43N04L58R1k13n32p80p94n37j99M6K43N21Q27R42P76N48
54816A06121N49P89R42O65m0q19j277j215o82J24Q74J196R49L91L1K39R30J602
54798A11369J664R77O4l42p2L41L92J87R6R2j62o63r29o21RM15L56P3qK87O97
54777A14222Q39P43Q92J597K532L146L339L420L548L655L831M284M932N439N748
54762A62167O117O562O701O267N353M039K271K56j514k922m410o165p595q020
54748A69107p531o693n759m664l540k687k146j752j513j532j641j536j280j271
54734A25562j605j824j391k55J075J961K163K076K327L038L769M241M785N738
54720A51660O713O982O401N513M787M186L436K326P53j215l180m661n494n826
$$ plain form
54706 172381 166636 161372 156742 152506 148350 144306 140740 137995 136165 135063 134258 133345 132357 131735 131673 131616
54690 131616 130746 128914 126832 125262 124312 123622 123019 122703 122787 122894 122470 121484 120578 120321 120443 120062 118709 116836
54672 116836 115247 114304 113829 113541 113334 113270 113533 114288 115380 116218 116177 115226 114028 113386 113573 114153 114407 113988
54654 113988 113228 112836 113276 114484 116050 117504 118424 118559 118026 117287 116827 116880 117445 118317 119094 119367 119104 118706
54636 118706 118538 118559 118523 118364 118221 118166 118061 117671 116860 115828 115111 115121 115623 115941 115780 115551 115687 116022 116142 116114
54616 116114 116423 117310 118517 119615 120301 120392 119854 118860 117674 116562 115902 116171 117423 118904 119573 119068 117925
54599 117925 116867 116185 115845 115884 116542 118055 120307 122574 123849 123748 123055 122986 123874 124891 125057 124151 122519
54582 122519 120497 118421 116913 116621 117592 119126 120430 121328 122236 123445 124580 124904 124148 122885 121950 121662
$$ packed form
54706A72381n745n264m630m236m156m044l566k745j830j102q05r13r88o22o2n7
54690A31616q70j832k082j570r50o90o03l16Q4J07m24r86r06k57J22l81j353j873
54672A16836j589r43m75k88k07o4K63P55J092Q38m1r51j198o42J87N80K54m19
54654A13988p60l92M40J208J566J454R20J35n33p39m60N3N65Q72P77K73k63l98
54636A18706j68K1l6j59j43n5j05l90q11j032p17J0N02L18j61k29J36L35J20k8
54616A16114L09Q87J207J098O86R1n38r94j186j112o60K69J252J481O69n05j143
54599A17925j058o82l40L9O58J513K252K267J275j01o93o9Q88J017J66r06j632
54582A22519k022k076j508k92R71J534J304Q98R08J209J135L24p56j263r35k88
$$ plain form
54566 121662 121716 121691 121423 120975 120480 120040 119625 119102 118401 117590 116691 115707 114976 115160 116460 118107 119176 119781
54548 119781 120831 122622 124343 125219 125494 125891 126609 127320 127834 128293 128884 129759 131040 132565 133805 134382 134527
54531 134527 134669 134777 134517 133896 133246 132676 132061 131540 131419 131467 130894 129359 127566 126492 126428 127153 128602 130698
54513 130698 132727 133622 133104 132022 131296 130933 130391 129590 129037 129042 129287 129262 128837 128257 127788 127552 127576 127847 128356
54494 128356 129126 130093 130926 131144 130531 129345 128034 126886 126062 125687 125692 125674 125259 124597 124224 124415 124938 125486 126109
54475 126109 127077 128548 130467 132627 134645 136054 136640 136687 136736 137081 137597 138036 138380 138831 139457 139977 140074 139955
54457 139955 140325 141559 143078 143942 143981 143879 144071 144063 143195 141636 140134 139075 138324 137857 137894 138268 138243 137277 135722
54438 135722 134416 133792 133629 133535 133376 133263 133317 133508 133635 133529 133325 133415 133960 134604 134890 134882 135142 136032 137306 138437
$$ packed form
54566A21662N4k5k68m48m95m40m15n23p01q11q99r84p31J84J300J647J069O05
54548A19781J050J791J721Q76K75L97P18P11N14M59N91Q75J281J525J240N77J45
54531A34527J42J08k60o21o50n70o15n21j21M8n73j535j793j074o4P25J449K096
54513A30698K029Q95n18j082p26l63n42q01n53NK45k5m25n80m69k36K4K71N09
54494A28356P70R67Q33K18o13j186j311j148q24l75Nj8m15o62l73J91N23N48O23
54475A26109R68J471J919K160K018J409N86M7M9L45N16M39L44M51O26N20R7j19
54457A39955L70J234J519Q64L9j02J92qq68j559j502j059p51m67L7L74k5r66j555
54438A35722j306o24j63r4j59j13N4J91J27j06k04R0N45O44K86qK60Q90J274J131
$$ plain form
54418 138437 139206 139825 140585 141471 142124 142194 141786 141485 141756 142349 142477 141650 140141 138634 137701 137730 138928 141047
54400 141047 143221 144570 145027 145379 146392 148050 149636 150399 150173 149534 149376 150158 151519 152671 153150 153070 152839
54383 152839 152861 153381 154308 155179 155570 155501 155161 154372 152825 150821 149252 148661 148781 149199 149919 150946 151867 152351
54365 152351 152711 153453 154558 155709 156968 158649 160655 162543 164183 165788 167333 168492 169296 170317 172034
54350 172034 174385 177113 180218 183873 188113 192638 196720 199365 199968 198897 197066 194915 192169 188600
54336 188600 184568 180697 177386 174727 172481 170079 167124 163971 161306 159155 156981 154925 154028 154732 155957
54321 155957 156458 156421 156781 157425 157244 155875 154276 153364 153003 152680 152329 151909 150854 148759 146291 144713 144516
54304 144516 145040 145480 145751 146207 146887 147365 147247 146569 145673 144806 143932 142939 141980 141435 141438 141575 141314 140720 140466
$$ packed form
54418A38437P69O19P60Q86O53P0m08l01K71N93J28q27j509j507r33K9J198K119
54400A41047K174J349M57L52J013J658J586P63k26o39j58P82J361J152M79q0k31
54383A52839K2N20R27Q71L91o9l40p89j547k004j569n91J20M18P20J027R21M84
54365A52351L60P42J105J151J259J681K006J888J640J605J545J159Q04J021J717
54350A72034K351K728L105L655M240M525M082K645O03j071j831k151k746l569
54336A88600m032l871l311k659k246k402k955l153k665k151k174k056q97P04J225
54321A55957N01l7L60O44j81j369j599r12l61l23l51m20j055k095k468j578j97
54304A44516N24M40K71M56O80M78j18o78q96q67q74r93r59n45LJ37k61n94k54
$$ plain form
54285 140466 140965 141823 142493 143189 144589 146710 148740 150214 151583 153151 154061 153221 150932 148697 147441 146773
54269 146773 146065 145381 145019 144960 145261 146338 148322 150653 152756 154564 155905 156137 155207 154493 155543 158174
54253 158174 160797 162490 163775 165302 166791 167623 167621 166792 164992 162394 159857 158201 157339 156475 155057 153299
54237 153299 151886 151341 151546 151782 151435 150646 150023 149756 149504 149179 149269 150120 151329 152228 152587 152575 152365 152198 152507
54218 152507 153546 155015 156370 157354 157982 158216 158006 157517 157020 156671 156612 157025 157760 158136 157537 156110 154560
54201 154560 153357 152472 151759 151193 150736 150338 150030 149745 149118 147859 146326 145313 145200 145649 146222 146937 148043
54184 148043 149529 151072 152305 152983 153096 152916 152804 152841 152792 152543 152302 152217 152027 151391 150505 150078 150625 151938
54166 151938 153329 154234 154489 154171 153402 152364 151315 150470 149899 149629 149713 150050 150258 150044 149657 149659 150111 150382 149979
$$ packed form
54285A40466M99Q58O70O96J400K121K030J474J369J568R10q40k289k235j256o68
54269A46773p08o84l62n9L01J077J984K331K103J808J341K32r30p14J050K631
54253A58174K623J693J285J527J489Q32kq29j800k598k537j656q62q64j418j758
54237A53299j413n45K05K36l47p89o23k67k52l25R0Q51J209Q99L59j2k10j67L09
54218A52507J039J469J355R84O28K34k10m89m97l49n9M13P35L76n99j427j550
54201A54560j203q85p13n66m57l98l08k85o27j259j533j013j13M49N73P15J106
54184A48043J486J543J233O78J13j80j12L7m9k49k41q5j90o36q86m27N47J313
54166A51938J391R05K55l18p69j038j049q45n71k70Q4L37K08k14l87KM52K71m03
$$ plain form
54147 149979 149297 149188 149942 151015 151634 151390 150330 148884 147697 147267 147626 148468 149432 150114 150108 149515 149184 149888
54129 149888 151248 152073 151855 151317 151313 151839 152486 153205 154074 154790 155077 155306 156028 157084 157842 158290 159158 160840
54111 160840 162789 164240 165054 165583 166114 166746 167506 168271 168767 168875 168735 168401 167650 166406 165102 164326 164239 164636
54093 164636 165354 166292 167190 167770 168152 168748 169710 170750 171530 171977 172154 172105 171968 171968 172212 172669 173513 175204 177995
54074 177995 181436 184635 187036 188896 191089 194479 199326 205115 211047 216816 222822 229444 236237 242051
54060 242051 245919 247605 247296 245121 241189 235874 229735 223176 216430 210003 204847 201791 200737 200667 200552
54045 200552 200208 200128 200657 201580 202542 203638 205462 208641 213377 219322 225810 232300 238625 244781 250621 255979
54029 255979 261079 266343 271647 276144 279216 281376 283771 286911 290292 293188 295320 296682 297237 297100 296670
$$ packed form
54147A49979o82j09P54J073O19k44j060j446j187m30L59Q42R64O82on93l31P04
54129A49888J360Q25k18n38mN26O47P19Q69P16K87K29P22J056P58M48Q68J682
54111A60840J949J451Q14N29N31O32P60P65M96J08j40l34p51j244j304p76q7L97
54093A64636P18R38Q98N80L82N96R62J040P80M47J77m9j37%K44M57Q44J691K791
54074A77995L441L199K401J860K193L390M847N789N932N769O006O622O793N814
54060B42051L868J686l09k175l932n315o139o559o746o427n156l056j054p0j15
54045B00552l44q0N29R23R62J096J824L179M736N945O488O490O325O156N840N358
54029B55979N100N264N304M497L072K160K395L140L381K896K132J362N55j37m30
$$ plain form
54014 296670 296251 295669 294507 292640 290287 287646 284703 281399 277859 274381 271193 268181 264857 260735 255762
53999 255762 250341 245023 240334 236751 234437 232927 231453 229737 228213 227316 226956 226877 227135 227816 228676 229538
53983 229538 230807 232958 235595 237622 238425 238339 237829 236739 234652 231579 227942 224177 220630 217574 214952
53968 214952 212317 209444 206871 205437 205262 205621 205852 206020 206465 207069 207370 207277 207262 207741 208538 209139 209346 209510
53950 209510 210220 211978 215045 219282 223989 228164 231264 233746 236655 240613 245289 249921 254250 258790
53936 258790 264167 270307 276476 282092 287265 292377 297365 301749 305288 308248 310967 313614 316541 320482
53922 320482 325992 332898 340666 349192 358955 370509 384115 399711 416785 434218 450550 464461
53910 464461 474885 480990 482571 480528 476450 471495 465864 459407 452363 445292 438560 432172 426015 420114
$$ packed form
54014B96670m19n82j162j867k353k641k943l304l540l478l188l012l324m122m973
53999B55762n421n318m689l583k314j510j474j716j524q97l60p9K58O81Q60Q62
53983B29538J269K151K637K027Q03q6n10j090k087l073l637l765l547l056k622
53968B14952k635k873k573j434j75L59K31J68M45O04L01r3j5M79P97O01K07J64
53950B09510P10J758L067M237M707M175L100K482K909L958M676M632M329M540
53936B58790N377O140O169N616N173N112M988M384L539K960K719K647K927L941
53922C20482N510O906P768Q526R763J1554J3606J5596J7074J7433J6332J3911
53910D64461J0424O105J581k043m078m955n631o457p044p071o732o388o157n901
$$ plain form
53896 420114 414622 409571 404617 399224 393276 387266 381574 375784 369218 361984 354835 347963 340667 332454
53882 332454 323819 315551 307835 300500 293713 287867 283036 278935 275176 271303 266988 262584 258973 256372
53868 256372 253795 250375 246751 244214 242729 240854 237710 234058 231120 229190 227873 226949 226313 225494 223942
53853 223942 221765 219687 218280 217499 216880 215890 214152 211654 208884 206600 205321 204973 205040 205072 205047 205205 205589
53836 205589 205951 206190 206594 207398 208349 208986 209237 209378 209535 209638 209744 209986 210231 210279 210363 210941 211897 212494 212306
53817 212306 211691 211151 210709 210275 210121 210577 211531 212688 214104 216138 219005 222649 226890 231447 236035 240682
53801 240682 245701 251135 256556 261728 267100 273146 279467 285052 289345 292567 295070 296952 298412 300028
53787 300028 302327 305258 308203 310450 311658 311990 311814 311181 309673 306896 303043 298820 294823 291106 287293
$$ packed form
53896D20114n492n051m954n393n948o010n692n790o566p234p149o872p296q213
53882C32454q635q268p716p335o787n846m831m101l759l873m315m404l611k601
53868B56372k577l420l624k537j485j875l144l652k938j930j317r24o36q19j552
53853B23942k177k078j407p81o19r90j738k498k770k284j279l48O7L2k5J58L84
53836B05589L62K39M04Q04R51O37K51J41J57J03J06K42K45M8Q4N78R56N97j88
53817B12306o15n40m42m34j54M56R54J157J416K034K867L644M241M557M588M647
53801B40682N019N434N421N172N372O046O321N585M293L222K503J882J460J616
53787C00028K299K931K945K247J208L32j76o33j508k777l853m223l997l717l813
$$ plain form
53772 287293 282996 278196 273264 268526 263863 258998 254109 249729 245937 242223 238462 235415 233735 232928
53758 232928 231988 230718 229648 228817 227545 225540 223429 221902 220826 219556 217723 215508 213429 211979 211213
53743 211213 210672 210041 209714 210257 211384 212142 212133 211841 211638 211338 211032 211437 212809 214238 214778 214710 214920 215539 216105
53724 216105 216724 217992 219764 221049 221361 221390 221961 223037 224138 225174 226344 227621 228892 230401 232525
53709 232525 235176 237790 239980 241920 244080 246773 249936 253181 256042 258358 260446 262746 265331 267946
53695 267946 270620 273947 278520 284169 290001 295189 299452 302736 304816 305538 305277 304719 304161 303369 302208
53680 302208 301040 300261 299706 298818 297264 295137 292683 290251 288474 288066 289090 290603 291338 290825 289665 288622
53664 288622 287675 286227 284183 282340 281440 281194 280750 280023 279877 280823 282141 282754 282575 282366 282461 282332 281525 280423
$$ packed form
53772B87293m297m800m932m738m663m865m889m380l792l714l761l047j680q07
53758B32928r40j270j070q31j272k005k111j527j076j270j833k215k079j450p66
53743B11213n41o31l27N43J127P58rk92k03l00l06M05J372J429N40o8K10O19N66
53724B16105O19J268J772J285L12K9N71J076J101J036J170J277J271J509K124
53709B32525K651K614K190J940K160K693L163L245K861K316K088K300K585K615
53695B67946K674L327M573N649N832N188M263L284K080P22k61n58n58p92j161
53680C02208j168p79n55q88j554k127k454k432j777m08J024J513P35n13j160j043
53664B88622r47j448k044j843r00k46m44p27j46R46J318O13j79k09R5j29q07j102
$$ plain form
53646 280423 279728 279570 279600 279768 280550 282272 284571 286729 288395 289747 291033 292251 293378 294601 296009 297167
53630 297167 297382 296518 295330 294904 295862 298084 300928 303628 305785 307742 310347 314140 318822 323575 327761
53615 327761 331198 334017 336550 339182 342139 345443 349188 353595 358609 363706 368479 373247 378664 384828
53601 384828 391199 397420 403746 410528 417598 424341 430098 434323 436613 436900 435558 433170 430245 427158
53587 427158 424180 421383 418628 415814 413142 410965 409350 407909 406109 403736 400959 397987 394857 391694
53573 391694 388931 386906 385268 383270 380776 378571 377387 377055 376975 377023 377436 378061 378431 378523 378804 379414 379879
53556 379879 379804 379346 378850 378455 378352 378956 380455 382468 384437 386173 387839 389672 391878 394527 397347 399948
53540 399948 402455 405552 409620 414167 418472 422498 426798 431751 437337 443485 450245 457654 465730 474474
$$ packed form
53646B80423o95j58L0J68P82J722K299K158J666J352J286J218J127J223J408J158
53630B97167K15q64j188m26R58K222K844K700K157J957K605L793M682M753M186
53615C27761L437K819K533K632K957L304L745M407N014N097M773M768N417O164
53601C84828O371O221O326O782P070O743N757M225K290K87j342k388k925l087
53587D27158k978k797k755k814k672k177j615j441j800k373k777k972l130l163
53573C91694k763k025j638j998k494k205j184l32q0M8M13O25L70R2K81O10M65
53556C79879p5m58m96l95j03O04J499K013J969J736J666J833K206K649K820K601
53540C99948K507L097M068M547M305M026M300M953N586O148O760P409Q076Q744
$$ plain form
53526 474474 483613 492639 501468 510863 521694 533883 546614 559501 572970 587422 602625 618184
53514 618184 634145 650829 668426 687071 707089 728752 751908 776125 801196 827304 854639
53503 854639 882968 911582 939711 967026 993698 1019807 1044853 1068109 1089488 1109673 1129289
53492 1129289 1148310 1166560 1184449 1202749 1221706 1240797 1259396 1277445 1295414 1313901 1333346
53481 1333346 1353856 1375029 1396036 1416129 1435080 1453018 1469843 1485006 1497985 1508831 1518007
53470 1518007 1525604 1530913 1532965 1531480 1527092 1520665 1512604 1502914 1491644 1478936 1464777 1449123 1432415
53457 1432415 1415630 1399479 1383642 1367110 1349196 1329912 1309396 1287548 1264608 1241713 1220151
53446 1220151 1199973 1179881 1158787 1137165 1116490 1097650 1080426 1064437 1050013 1037871 1028257
$$ packed form
53526D74474R139R026Q829R395J0831J2189J2731J2887J3469J4452J5203J5559
53514F18184J5961J6684J7597J8645K0018K1663K3156K4217K5071K6108K7335
53503H54639K8329K8614K8129K7315K6672K6109K5046K3256K1379K0185J9616
53492A129289J9021J8250J7889J8300J8957J9091J8599J8049J7969J8487J9445
53481A333346K0510K1173K1007K0093J8951J7938J6825J5163J2979J0846R176
53470A518007P597N309K052j485m388o427q061r690j1270j2708j4159j5654j6708
53457A432415j6785j6151j5837j6532j7914j9284k0516k1848k2940k2895k1562
53446A220151k0178k0092k1094k1622k0675j8840j7224j5989j4424j2142r614
$$ plain form
53435 1028257 1020830 1015170 1011017 1008025 1005717 1003914 1003027 1003593 1005600 1008527 1012092 1016641 1022636 1030001
53421 1030001 1038287 1047363 1057560 1069112 1081826 1095564 1110760 1128155 1148096 1170307 1194302 1219781
53409 1219781 1246693 1275148 1305310 1337207 1370692 1405779 1442928 1482615 1524586 1567936 1612216
53398 1612216 1658102 1706579 1757615 1810139 1863351 1917606 1973705 2031605 2090192 2148338 2205910
53387 2205910 2263648 2322152 2381118 2439478 2496172 2550698 2602963 2652799 2699837 2743788 2784576
53376 2784576 2822063 2855798 2885243 2910147 2930502 2946181 2956883 2962404 2962702 2957579 2946540 2929082
53364 2929082 2904974 2874157 2836665 2792916 2744013 2691497 2636735 2580582 2523570 2466273 2409486
53353 2409486 2354061 2300498 2248735 2198566 2150226 2104226 2060491 2018070 1975985 1933987 1892062
$$ packed form
53435A028257p427n660m153k992k308j803q87N66K007K927L565M549N995P365
53421A030001Q286R076J0197J1552J2714J3738J5196J7395J9941K2211K3995K5479
53409A219781K6912K8455L0162L1897L3485L5087L7149L9687M1971M3350M4280
53398A612216M5886M8477N1036N2524N3212N4255N6099N7900N8587N8146N7572
53387B205910N7738N8504N8966N8360N6694N4526N2265M9836M7038M3951M0788
53376B784576L7487L3735K9445K4904K0355J5679J0702N521K98n123j1039j7458
53364B929082k4108l0817l7492m3749m8903n2516n4762n6153n7012n7297n6787
53353B409486n5425n3563n1763n0169m8340m6000m3735m2421m2085m1998m1925
$$ plain form
53342 1892062 1849667 1806184 1762017 1718531 1676817 1637101 1599454 1564347 1532178 1502785 1475768
53331 1475768 1450887 1427873 1406351 1386345 1368372 1352563 1338020 1323525 1308566 1293164 1277103
53320 1277103 1260128 1242822 1226506 1212055 1199233 1187348 1176114 1165805 1156954 1150092 1145446 1142695
53308 1142695 1141228 1140772 1141632 1144226 1148582 1154351 1161133 1168737 1177306 1187244 1198955 1212625 1228301 1246068
53294 1246068 1265991 1287994 1311966 1337807 1365228 1393732 1423099 1453567 1485101 1516670 1546756
53283 1546756 1574507 1599968 1623384 1644879 1664667 1682715 1698087 1709431 1716437 1720135 1721375 1719735
53271 1719735 1714450 1705744 1694540 1681286 1665918 1648708 1630284 1610663 1588965 1564390 1537173 1508496
53259 1508496 1479716 1451670 1424336 1396995 1368878 1339778 1310036 1280102 1250326 1220987 1192230
$$ packed form
53342A892062m2395m3483m4167m3486m1714l9716l7647l5107l2169k9393k7017
53331A475768k4881k3014k1522k0006j7973j5809j4543j4495j4959j5402j6061
53320A277103j6975j7306j6316j4451j2822j1885j1234j0309q851o862m646k751
53308A142695j467m56Q60K594M356N769O782P604Q569R938J1711J3670J5676J7767
53294A246068J9923K2003K3972K5841K7421K8504K9367L0468L1534L1569L0086
53283A546756K7751K5461K3416K1495J9788J8048J5372J1344P006L698J240j640
53271A719735n285q706j1204j3254j5368j7210j8424j9621k1698k4575k7217k8677
53259A508496k8780k8046k7334k7341k8117k9100k9742k9934k9776k9339k8757
$$ plain form
53248 1192230 1164047 1136548 1110058 1084550 1059222 1033235 1006866 981339 957318 934080 910491
53237 910491 886371 862470 839495 817683 797207 778428 761536 746298 732310 719319 707213
53226 707213 695907 685386 675686 666614 657586 647933 637346 625876 613582 600459 586756 572966
53214 572966 559289 545323 530646 515559 500926 487330 474718 462875 451864 441878 433020 425398
53202 425398 419131 413979 409197 403950 397787 390584 382381 373602 365227 358216 352671 347771 342594 336873
53188 336873 330985 325469 320574 316186 312123 308473 305504 303207 301123 298826 296353 293972 291702 289397
53174 289397 287149 285231 283679 282254 280849 279607 278615 277726 276803 275856 274902 273893 272852 271881 271006 270197
53158 270197 269564 269252 269102 268685 267851 266986 266525 266375 266029 265190 264084 263172 262620 262104 261183 259847 258594 257826
$$ packed form
53248A192230k8183k7499k6490k5508k5328k5987k6369k5527k4021k3238k3589
53237I10491k4120k3901k2975k1812k0476j8779j6892j5238j3988j2991j2106
53226G07213j1306j0521r700r072r028r653j0587j1470j2294j3123j3703j3790
53214E72966j3677j3966j4677j5087j4633j3596j2612j1843j1011r986q858p622
53202D25398o267n152m782n247o163p203q203q779q375p011n545m900n177n721
53188C36873n888n516m895m388m063l650k969k297k084k297k473k381k270k305
53174B89397k248j918j552j425j405j242r92q89r23r47r54j009j041r71q75q09
53158B70197o33l12j50m17q34q65m61j50l46q39j106r12n52n16r21j336j253p68
$$ plain form
53140 257826 257374 256863 256387 256395 256922 257425 257551 257628 258108 258856 259390 259613 259837 260146 260155 259573 258731 258392 259100 260788
53120 260788 262920 264957 266692 268222 269681 271106 272527 274015 275492 276647 277172 277061 276594 276016 275264
53105 275264 274012 271990 269363 266772 264848 263684 262857 261964 260945 259901 258951 258321 258225 258371 257978 256693
53089 256693 255317 255132 256485 258361 259396 259011 257577 255940 254919 254872 255407 255708 255394 254922 254957 255569 256325
53072 256325 256957 257506 257898 257886 257535 257338 257521 257554 256742 255153 253574 252587 252065 251578 250837 249615 247720 245419
53054 245419 243602 243050 243638 244602 245506 246471 247532 248364 248898 249736 251496 253926 256050 257121 257182 256760 256296
53037 256296 255880 255357 254599 253791 253406 253782 254707 255542 255735 255203 254261 253295 252492 251835 251356 251334 252022 253162 254043
53018 254043 254309 254514 255529 257457 259427 260486 260428 259720 258901 258192 257542 256900 256437 256453 256990 257672 258160 258655
$$ packed form
53140B57826m52n11m76QN27N03J26P7M80P48N34K23K24L09Rn82q42l39P08J688
53120B60788K132K037J735J530J459J425J421J488J477J155N25j11m67n78p52
53105B75264j252k022k627k591j924j164q27q93j019j044r50o30r6J46l93j285
53089B56693j376j85J353J876J035l85j434j637j021m7N35L01l14m72L5O12P56
53072B56325O32N49L92j2l51j97J83L3q12j589j579r87n22m87p41j222j895k301
53054B45419j817n52N88R64R04R65J061Q32N34Q38J760K430K124J071O1m22m64
53037B56296m16n23p58q08l85L76R25Q35J93n32r42r66q03o57m79k2O88J140Q81
53018B54043K66K05J015J928J970J059n8p08q19p09o50o42m63J6N37O82M88M95
$$ plain form
53000 258655 259639 261120 262475 263116 263008 262440 261722 261307 261811 263403 265341 266502 266422 265623 264961 264900 265356 265969
52982 265969 266482 267020 267959 269366 270659 271123 270836 270756 271775 273836 276137 278076 279886 282329 285831 289889
52966 289889 293407 295619 296645 297030 297047 296712 296316 296407 297135 297966 298201 297529 295949 293510 290368 286883 283433
52949 283433 280269 277619 275589 273837 271789 269471 267681 266902 266524 265721 264694 264197 264107 263518 262293 261483
52933 261483 261727 262198 261747 260396 258980 257888 256956 256201 255779 255425 254786 254261 254666 256007 257344 258025 258345
52916 258345 258747 259088 259072 258802 258495 258120 257773 257909 258641 259144 258388 256385 254242 253109 253395 254797 256521
52899 256521 257507 257003 255200 253078 251608 251237 251967 253409 254765 255251 254816 254184 254022 254314 254695 255036 255360
52882 255360 255413 254770 253446 252136 251670 252259 253322 254005 253882 253185 252504 252363 253086 254842 257587 260969 264450
$$ packed form
53000B58655R84J481J355O41j08n68p18m15N04J592J938J161q0p99o62o1M56O13
52982B65969N13N38R39J407J293M64k87q0J019K061K301J939J810K443L502M058
52966B89889L518K212J026L85J7l35l96R1P28Q31K35o72j580k439l142l485l450
52949B83433l164k650k030j752k048k318j790p79l78q03j027m97r0n89j225q10
52933B61483K44M71m51j351j416j092r32p55m22l54o39n25M05J341J337O81L20
52916B58345M02L41j6k70l07l75l47J36P32N03p56k003k143j133K86J402J724
52899B56521R86n04j803k122j470l71P30J442J356M86m35o32j62K92L81L41L24
52882B55360N3o43j324j310m66N89J063O83j23o97o81j41P23J756K745L382L481
$$ plain form
52865 264450 267591 270168 272124 273563 274774 276032 277348 278550 279532 280230 280373 279640 278200 276723 275624
52850 275624 274509 272693 270063 267116 264216 261247 258047 254832 251947 249380 246748 243739 240500 237579
52836 237579 235522 234424 233853 233290 232699 232556 233262 234675 236270 237611 238528 238973 239001 238894 238990 239268 239338 239018
52818 239018 238669 238714 239001 239027 238720 238558 238836 239305 239752 240502 241862 243404 244385 244774 245269 246176 246864 246636 245646
52799 245646 244562 243552 242101 239754 236722 233727 231497 230355 230071 230091 230058 230059 230306 230766 231343 232208 233528
52782 233528 234968 235934 236343 236715 237352 237939 238235 238731 240133 242385 244629 246087 246637 246591 246290 245955 245595
52765 245595 244961 243810 242326 241034 240167 239389 238326 237161 236440 236365 236526 236402 235958 235639 235828 236391 236785
52748 236785 236642 236189 236069 236795 238457 240824 243514 246059 248093 249680 251324 253450 255923 258194 259863
$$ packed form
52865B64450L141K577J956J439J211J258J316J202R82O98J43p33j440j477j099
52850B75624j115j816k630k947k900k969l200l215k885k567k632l009l239k921
52836B37579k057j098n71n63n91j43P06J413J595J341R17M45K8j07R6K78P0l20
52818B39018l49M5K87K6l07j62K78M69M47P50J360J542R81L89M95R07O88k28r90
52799B45646j084j010j451k347l032k995k230j142k84K0l3JK47M60N77Q65J320
52782B33528J440R66M09L72O37N87K96M96J402K252K244J458N50m6l01l35l60
52765B45595o34j151j484j292q67p78j063j165p21p5J61j24m44l19J89N63L94
52748B36785j43m53j20P26J662K367K690K545K034J587J644K126K473K271J669
$$ plain form
52733 259863 260985 261908 263001 264455 266178 267839 269178 270300 271595 273328 275359 277260 278554 278899 278204
52718 278204 276666 274608 272291 269920 267788 266164 264979 263788 262198 260301 258543 257251 256405 255845 255552
52703 255552 255630 256038 256506 256814 257133 257886 259210 260672 261668 262018 262012 261934 261779 261503 261365 261841 263206 265162 266920
52684 266920 267722 267437 266571 265681 264930 264352 264183 264521 264749 263915 261790 259192 257093 255815 255262 255410 256123
52667 256123 256812 256800 256001 254932 254129 253808 253957 254437 255021 255553 256063 256658 257471 258830 261102 264102 267025
52650 267025 269357 271563 274338 277432 279810 280817 280556 279243 276972 274279 272133 270963 270171 268989 267401
52635 267401 265952 265077 264985 265835 267549 269656 271637 273275 274477 275119 275384 275911 277134 278569 279146 278191
52619 278191 275907 273080 270560 268815 267648 266469 265063 263868 263316 263258 263351 263664 264346 264993 264956 264227 263431
$$ packed form
52733B59863J122R23J093J454J723J661J339J122J295J733K031J901J294L45o95
52718B78204j538k058k317k371k132j624j185j191j590j897j758j292q46n60k93
52703B55552P8M08M68L08L19P53J324J462R96L50op8j55k76j38M76J365J956J758
52684B66920Q02k85q66q90p51n78j69L38K28q34k125k598k099j278n53J48P13
52667B56123O89j2p99j069q03l21J49M80N84N32N10N95Q13J359K272L000K923
52650B67025K332K206K775L094K378J007k61j313k271k693k146j170p92j182j588
52635B67401j449q75r2Q50J714K107J981J638J202O42K65N27J223J435N77r55
52619B78191k284k827k520j745j167j179j406j195n52n8R3L13O82O47l7p29p96
$$ plain form
52602 263431 262998 262910 263289 264596 266965 269818 272411 274402 275694 276125 275717 275001 274731 275248 276316 277509
52586 277509 278574 279418 279882 279719 278931 278092 278018 278892 279968 280440 280442 280794 281892 283263 284159 284158 283190 281509 279750
52567 279750 278558 277950 277363 276456 275464 274675 274063 273620 273523 273656 273446 272619 271721 271417 271586 271601 271218 270639 269853
52548 269853 268534 266600 264433 262517 261219 260881 261627 262978 264070 264468 264540 264875 265598 266370 266893 267225 267707
52531 267707 268635 269949 271211 272042 272518 273011 273637 274066 273927 273305 272772 272964 274085 275749 277283 278271 278748
52514 278748 278954 279166 279821 281379 283822 286569 289305 292526 296815 301771 306275 309709 312231 313821 313848
52499 313848 311966 308834 305423 301981 298123 293646 288791 283943 279548 276202 274336 273777 273852 273938 273751 273323
52483 273323 273068 273636 275230 277121 278317 278736 279180 280053 280779 280804 280644 281256 282696 284153 285267 286668 288876
$$ packed form
52602B63431m33q8L79J307K369K853K593J991J292M31m08p16k70N17J068J193
52586B77509J065Q44M64j63p88q39p4Q74J076M72KL52J098J371Q96jr68j681j759
52567B79750j192o08n87r07r92p89o12m43r7J33k10q27q98l04J69J5l83n79p86
52548B69853j319j934k167j916j298l38P46J351J092L98P2L35P23P72N23L32M82
52531B67707R28J314J262Q31M76M93O26M29j39o22n33J92J121J664J534R88M77
52514B78748K06K12O55J558K443K747K736L221M289M956M504L434K522J590K7
52499C13848j882l132l411l442l858m477m855m848m395l346j866n59P5Q6j87m28
52483B73323k55N68J594J891J196M19M44Q73P26K5j60O12J440J457J114J401K208
$$ plain form
52466 288876 291318 293048 294151 295759 298634 302270 305594 308120 310120 311969 313699 315095 315819 315416 313481
52451 313481 309970 305271 300007 294906 290709 287777 285678 283465 280631 277690 275663 275039 275335 275601 275226
52436 275226 274321 273394 272720 272119 271407 270893 271086 271895 272530 272377 271699 271196 271108 271149 271204 271623 272748 274457 276358
52417 276358 278179 279822 281206 282316 283352 284640 286346 288388 290611 293053 296107 300486 306872 315367
52403 315367 325266 335632 346149 357095 368241 378010 384221 385736 383095 377523 369825 360515 350522
52390 350522 341063 332815 325689 319545 314718 311652 310207 309622 309120 308549 308418 309285 311046 313033 314965
52375 314965 317425 320999 325238 329169 332720 336844 342085 347821 353302 358620 363959 368528 371183 371899
52361 371899 371825 371863 371879 371300 369910 367940 365915 364539 364282 364878 365593 366022 366332 366745 367237 367789 368492 369368
$$ packed form
52466B88876K442J730J103J608K875L636L324K526K000J849J730J396P24m03j935
52451C13481l511m699n264n101m197k932k099k213k834k941k027o24K96K66l75
52436B75226r05r27o74o01p12n14J93Q09O35j53o78n03q8M1N5M19J125J709J901
52417B76358J821J643J384J110J036J288J706K042K223K442L054M379O386Q495
52403C15367R899J0366J0517J0946J1146R769O211J515k641n572p698r310r993
52390C50522r459q248p126o144m827l066j445n85n02n71j31Q67J761J987J932
52375C14965K460L574M239L931L551M124N241N736N481N318N339M569K655P16
52361C71899p4L8J6n79j390j970k025j376k57N96P15M29L10M13M92N52P03Q76
$$ plain form
52343 369368 370514 372403 375416 378999 381993 384115 386475 390182 395050 400202 405464 411451 418580 426776
52329 426776 436105 446947 459404 473032 487350 502294 518051 534730 552336 570829 590094 609957
52317 609957 630254 650658 670507 689122 706464 723339 740770 759197 778278 797375 816211
52306 816211 835127 854699 875085 895806 916133 935573 953960 971376 988157 1004685 1020817
52295 1020817 1035616 1047981 1057443 1064103 1067996 1068985 1067234 1063302 1057612 1050261 1041489 1032024 1022701 1014018
52281 1014018 1006239 999599 994121 989449 985250 981699 979222 977823 977038 976737 977747 981349 988063 997060
52267 997060 1006919 1016937 1027551 1039393 1052252 1065235 1077856 1090532 1103928 1118187 1132998 1148146
52255 1148146 1163632 1179398 1195240 1211105 1227230 1243801 1260429 1276013 1289240 1299392 1306657
$$ packed form
52343C69368J146J889L013L583K994K122K360L707M868N152N262N987P129Q196
52329D26776R329J0842J2457J3628J4318J4944J5757J6679J7606J8493J9265J9863
52317F09957K0297K0404J9849J8615J7342J6875J7431J8427J9081J9097J8836
52306H16211J8916J9572K0386K0721K0327J9440J8387J7416J6781J6528J6132
52295A020817J4799J2365R462O660L893R89j751l932n690p351q772r465r323q683
52281A014018p779o640n478m672m199l551k477j399p85l01J010L602O714Q997
52267I97060R859J0018J0614J1842J2859J2983J2621J2676J3396J4259J4811J5148
52255A148146J5486J5766J5842J5865J6125J6571J6628J5584J3227J0152P265
$$ plain form
52244 1306657 1311613 1314479 1315039 1313165 1309150 1303467 1296572 1288968 1281151 1273252 1265022 1256401 1247863 1239928
52230 1239928 1232526 1225144 1217534 1210002 1203063 1197027 1191820 1187052 1182404 1178129 1174993 1173410 1172809 1172212
52216 1172212 1171301 1170590 1170683 1171822 1174112 1177586 1181919 1186528 1191232 1196539 1203072 1210914 1219560 1228259 1236274
52201 1236274 1243176 1249128 1254723 1260461 1266559 1273255 1280795 1288986 1297176 1304978 1312683 1320669 1328751 1336392
52187 1336392 1343237 1349062 1353549 1356517 1358135 1358439 1356897 1352938 1346723 1338917 1329838 1319388 1307704 1295340
52173 1295340 1282868 1270799 1259826 1250495 1242536 1235158 1228101 1221896 1217055 1213693 1212079 1212703 1215362
52160 1215362 1218846 1222057 1224926 1227730 1230171 1231848 1233125 1234597 1235911 1236017 1234592 1232417 1230298 1228358
52146 1228358 1226554 1225180 1224464 1224229 1224316 1224878 1225868 1226628 1226442 1225248 1223426 1221149 1218408 1215525 1213126 1211618
$$ packed form
52244A306657M956K866N60j874m015n683o895p604p817p899q230q621q538p935
52230A239928p402p382p610p532o939o036n207m768m648m275l136j583o01n97
52216A172212r11p11R3J139K290L474M333M609M704N307O533P842Q646Q699Q015
52201A236274O902N952N595N738O098O696P540Q191Q190P802P705P986Q082P641
52187A336392O845N825M487K968J618L04j542l959o215p806r079j0450j1684j2364
52173A295340j2472j2069j0973r331p959p378p057o205m841l362j614O24K659
52160A215362L484L211K869K804K441J677J277J472J314J06j425k175k119j940
52146A228358j804j374p16k35Q7N62R90P60j86j194j822k277k741k883k399j508
$$ plain form
52130 1211618 1211137 1212142 1215620 1222366 1232256 1244569 1258925 1275539 1294560 1315608 1338267 1362663
52118 1362663 1389035 1416795 1444583 1471554 1498176 1525367 1553084 1580211 1605660 1629173 1650989
52107 1650989 1671176 1689460 1705587 1719784 1732935 1746098 1759613 1772850 1785088 1796409 1807244
52096 1807244 1817244 1825264 1830520 1833139 1833372 1830895 1825240 1816379 1804408 1789138 1770584 1749724 1728217
52083 1728217 1707420 1687981 1670221 1654428 1640793 1629423 1620433 1613746 1608896 1605365 1603107 1602444 1603469
52070 1603469 1605965 1609986 1616210 1625473 1637986 1652966 1668928 1684493 1699265 1713952 1729362 1745335
52058 1745335 1760931 1775586 1789652 1803638 1817401 1830355 1842089 1852299 1860333 1865363 1867160 1866312
52046 1866312 1863465 1858527 1850787 1839684 1825263 1808003 1788557 1767716 1746280 1724705 1702940 1680894
$$ packed form
52130A211618m81J005L478O746R890J2313J4356J6614J9021K1048K2659K4396
52118A362663K6372K7760K7788K6971K6622K7191K7717K7127K5449K3513K1816
52107A650989K0187J8284J6127J4197J3151J3163J3515J3237J2238J1321J0835
52096A807244J0000Q020N256K619K33k477n655q861j1971j5270j8554k0860k1507
52083A728217k0797j9439j7760j5793j3635j1370q990o687m850l531k258o63J025
52070A603469K496M021O224R263J2513J4980J5962J5565J4772J4687J5410J5973
52058A745335J5596J4655J4066J3986J3763J2954J1734J0210Q034N030J797q48
52046A866312k847m938p740j1103j4421j7260j9446k0841k1436k1575k1765k2046
$$ plain form
52034 1680894 1658988 1637989 1618307 1599829 1582479 1566556 1552266 1539234 1526836 1514828 1503295
52023 1503295 1492170 1481189 1470318 1459744 1449389 1438791 1427591 1415856 1403822 1391643 1379595
52012 1379595 1368217 1357899 1348459 1339251 1329604 1318975 1306930 1293251 1277957 1260934 1241676 1219783
52000 1219783 1195774 1171022 1146643 1122588 1098137 1073130 1048416 1025070 1003498 983494 964922
51989 964922 947881 932172 916940 901155 884382 866944 849393 832025 814882 798024 781581
51978 781581 765570 749748 733789 717653 701706 686368 671686 657475 643966 632129 623095 617315
51966 617315 614391 613659 614720 617433 621653 627122 633554 640692 648200 655502 661722 665928 667563 666643 663568
51951 663568 658802 652707 645524 637472 629059 621351 615666 612743 612331 613804 617012 622326 630097 640402
$$ packed form
52034A680894k1906k0999j9682j8478j7350j5923j4290j3032j2398j2008j1533
52023A503295j1125j0981j0871j0574j0355j0598j1200j1735j2034j2179j2048
52012A379595j1378j0318r440r208r647j0629j2045j3679j5294j7023j9258k1893
52000A219783k4009k4752k4379k4055k4451k5007k4714k3346k1572k0004j8572
51989I64922j7041j5709j5232j5785j6773j7438j7551j7368j7143j6858j6443
51978G81581j6011j5822j5959j6136j5947j5338j4682j4211j3509j1837r034n780
51966F17315k924p32J061K713M220N469O432P138P508P302O220M206J635r20l075
51951F63568m766o095p183q052q413p708n685k923m12J473L208N314P771J0305
$$ plain form
51937 640402 653157 667923 683539 698452 711756 723645 734613 744344 751717 755838 756753 754969 750475
51924 750475 742558 730700 715454 698133 679789 660882 641991 624219 608518 594959 583201 573458
51912 573458 566481 562686 561820 563521 567704 574406 583675 595676 610362 626853 643534 658900 671872
51899 671872 681292 685817 684914 679542 671272 660848 647939 632157 613903 594261 574376 555038 536680
51886 536680 519628 504298 491056 480038 471350 465378 462443 462151 463558 466174 470376 476607 484592
51873 484592 493677 503456 513642 523627 532676 540362 546423 550379 551729 550430 546854 541465 534830 527708
51859 527708 520694 513978 507845 503151 500793 500846 502666 505666 509421 513249 516447 518932 520900 521743 520098
51844 520098 515360 508568 501389 494645 488221 481923 475909 470434 465589 461289 457317 453572 450408 448503
$$ packed form
51937F40402J2755J4766J5616J4913J3304J1889J0968R731P373M121R15j784m494
51924G50475p917j1858j5246j7321j8344j8907j8891j7772j5701j3559j1758r743
51912E73458o977l795q66J701M183O702R269J2001J4686J6491J6681J5366J2972
51899F71872R420M525r03n372q270j0424j2909j5782j8254j9642j9885j9338j8358
51886E36680j7052j5330j3242j1018q688n972k935k92J407K616M202O231P985
51873D84592R085R779J0186R985R049P686O061L956J350j299l576n389o635p122
51859E27708p014o716o133m694k358N3J820L000L755L828L198K485J968Q43j645
51844E20098m738o792p179o744o424o298o014n475m845m300l972l745l164j905
$$ plain form
51830 448503 448195 449162 450913 453243 455939 458407 460056 460849 461049 460542 458886 456005 452425 448745 445275
51815 445275 442315 440404 439974 440867 442465 444236 445979 447580 448761 449242 449098 448792 448724 448806 448561 447673 446274
51798 446274 444681 443000 441233 439653 438738 438595 438645 438153 436962 435462 433847 431800 429075 426091 423584
51783 423584 421843 420643 419818 419452 419391 419065 418065 416649 415423 414792 414965 416232 418827 422657 427532 433567
51767 433567 441026 449814 459464 469614 480119 490628 500377 508525 514495 517940 518687 516927 513301 508592
51753 508592 503246 497156 489893 481292 471970 463129 455687 449690 444717 440600 437419 435016 433028 431349
51739 431349 430193 429739 430184 432142 436410 443118 451478 460528 469608 477991 484686 489165 492004 494329 496744
51724 496744 499146 501379 503591 505928 508130 509558 509485 507486 503659 498512 492611 486517 480998 476912 474562
$$ packed form
51830D48503l08R67J751K330K696K468J649P93K00n07j656k881l580l680l470
51815D45275k960j911m30Q93J598J771J743J601J181M81j44l06o8Q2k45q88j399
51798D46274j593j681j767j580r15j43N0m92j191j500j615k047k725k984k507
51783D23584j741j200q25l66o1l26j000j416j226o31J73J267K595L830M875O035
51767D33567P459Q788R650J0150J0505J0509R749Q148N970L445P47j760l626m709
51753E08592n346o090p263q601r322q841p442n997m973m117l181k403j988j679
51739D31349j156m54M45J958M268O708Q360R050R080Q383O695M479K839K325K415
51724D96744K402K233K212K337K202J428p3j999l827n147n901o094n519m086k350
$$ plain form
51709 474562 473300 472018 470023 467384 464657 462454 461130 460704 461082 462357 464641 467605 470429 472342 472920
51694 472920 471892 469173 465425 462097 460364 460189 460725 461317 461670 461341 459720 456547 451992 446299 439849
51679 439849 433578 428746 426022 425051 425031 425493 426500 428410 431551 435813 440467 444708 448514 452743 458262
51664 458262 465249 473438 482627 492542 502378 510849 516760 519385 518417 513923 506574 497786 489377 482866
51650 482866 479002 477890 479428 483436 489373 496161 502492 507275 509705 509073 504818 496970 486549 475310
51636 475310 464866 455780 447499 439323 431361 424335 418589 413766 409583 406356 404444 403615 403454 404019 405515
51621 405515 407527 409186 410028 410098 409355 407726 405795 404608 404430 404392 403815 403302 403941 405800 407887 409305 409845
51604 409845 409579 408619 407456 406949 407609 409151 410997 413059 415848 420017 426002 433963 443713 454580 465455
$$ packed form
51709D74562j262j282j995k639k727k203j324m26L78J275K284K964K824J913N78
51694D72920j028k719l748l328j733j75N36N92L53l29j621l173m555n693o450
51679D39849o271m832k724r71k0M62J007J910L141M262M654M241L806M229N519
51664D58262O987Q189R189R915R836Q471N911K625r68m494p349q788q409o511
51650D82866l864j112J538M008N937O788O331M783K430o32m255p848j0421j1239
51636D75310j0444r086q281q176p962p026n746m823m183l227j912q29j61N65J496
51621D05515K012J659Q42P0p43j629j931j187j78l8n77n13O39J859K087J418N40
51604D09845k66r60j163n07O60J542J846K062K789M169N985P961R750J0867J0875
$$ plain form
51589 465455 475159 482859 488108 490552 489737 485478 478448 470222 462487 456174 451434 448357 447399 449049 453306
51574 453306 459831 468545 479806 493803 509974 527245 544868 562878 581724 601634 622310 643086
51562 643086 663372 683155 703224 724834 749096 776778 808480 844441 883796 924273 963005
51551 963005 997570 1026151 1047058 1058710 1060129 1051211 1032611 1005721 972573 935211 894982 852812
51539 852812 810117 768838 730368 694906 662256 632807 607250 585578 566880 550189 535205
51528 535205 522207 511491 502915 495778 489123 482330 475500 469238 464092 460208 457357 455137 453162 451188
51514 451188 449142 447141 445517 444713 444938 446014 447717 450050 452817 455118 455968 455519 454964 454945 454714 453348
51498 453348 451119 448871 446551 443359 439236 435186 431999 429561 427706 426857 427245 428047 428046 426878 425130 423420
$$ packed form
51589D65455R704P700N249K444q15m259p030q226p735o313m740l077r58J650M257
51574D53306O525Q714J1261J3997J6171J7271J7623J8010J8846J9910K0676K0776
51562F43086K0286J9783K0069K1610K4262K7682L1702L5961L9355M0477L8732
51551I63005L4565K8581K0907J1652J419q918j8600k6890l3148l7362m0229m2170
51539H52812m2695m1279l8470l5462l2650k9449k5557k1672j8698j6691j4984
51528E35205j2998j0716q576p137o655o793o830o262n146l884k851k220j975j974
51514D51188k046k001j624q04K25J076J703K333K767K301Q50m49n55j9k31j366
51498D53348k229k248k320l192m123m050l187k438j855q49L88Q02jj168j748j710
$$ plain form
51482 423420 421860 420234 418187 415336 411632 407615 403927 400631 397377 394146 391330 389037 386774 384016
51468 384016 380691 376926 372815 368740 365464 363414 362055 360475 358491 356751 355820 355660 356006 356746 357736
51453 357736 358749 359863 361511 363869 366555 369282 372474 376809 382403 388953 396476 405340 415633 427078
51439 427078 439587 453231 467387 480457 490790 497628 500992 501193 498937 495468 491876 488184 483497
51426 483497 477044 468839 459429 449432 439354 429555 420265 411837 404952 400279 397826 396829 396385 396135 396322
51411 396322 397380 399491 402370 405434 408345 411351 414953 419247 423767 427985 431725 435052 438021 440695
51397 440695 443232 445730 448088 450144 451851 453285 454616 456302 459219 464319 471999 481876 493352 506458
51383 506458 522050 541119 564062 590840 621724 657435 698376 744097 793866 847377 904308
$$ packed form
51482D23420j560j626k047k851l704m017l688l296l254l231k816k293k263k758
51468C84016l325l765m111m075l276k050j359j580j984j740r31j60L46P40R90
51453C57736J013J114J648K358K686K727L192M335N594O550P523Q864J0293J1445
51439D27078J2509J3644J4156J3070J0333O838L364K01k256l469l592l692m687
51426D83497o453q205r410r997j0078r799r290q428o885m673k453r97m44k50J87
51411C96322J058K111K879L064K911L006L602M294M520M218L740L327K969K674
51397D40695K537K498K358K056J707J434J331J686K917N100P680R877J1476J3106
51383E06458J5592J9069K2943K6778L0884L5711M0941M5721M9769N3511N6931
$$ plain form
51372 904308 963117 1020793 1073891 1119489 1155188 1178970 1189666 1187373 1173027 1147672 1112449 1069082
51360 1069082 1019843 966913 912019 856661 802399 750737 702813 659234 620167 585653 555908
51349 555908 531186 511173 494703 480382 467551 456390 447130 439496 432968 427198 421963 416980 412036
51336 412036 407208 402686 398473 394399 390425 386709 383462 380794 378644 376679 374417 371687 368946 366823
51322 366823 365366 363986 362253 360502 359421 359256 359698 360444 361519 362990 364640 366159 367548 369081 370867
51307 370867 372655 374204 375709 377658 380246 383101 385644 387618 389122 390292 391121 391535 391377 390282 387839
51292 387839 384070 379606 375211 371175 367353 363734 360727 358850 358258 358690 359857 361828 365007 369662 375447
51277 375447 381503 387087 391993 396258 399661 401807 402649 402627 402234 401679 401073 400670 400772 401531 402935 404810
$$ packed form
51372I04308N8809N7676N3098M5598L5699K3782J0696k293j4346k5355l5223m3367
51360A069082m9239n2930n4894n5358n4262n1662m7924m3579l9067l4514k9745
51349E55908k4722k0013j6470j4321j2831j1161r260p634o528n770n235m983m944
51336D12036m828m522m213m074l974l716l247k668k150j965k262k730k741k123
51322C66823j457j380j733j751j081j65M42P46J075J471J650J519J389J533J786
51307C70867J788J549J505J949K588K855K543J974J504J170Q29M14j58j095k443
51292C87839l769m464m395m036l822l619l007j877n92M32J167J971L179M655N785
51277C75447O056N584M906M265L403K146Q42k2l93n55o06m03J02P59J404J875
$$ plain form
51261 404810 406716 408105 408805 409210 409756 410310 410310 409431 407817 405715 403168 400153 396761 393147 389480 386075
51245 386075 383370 381581 380378 379136 377526 375814 374556 374039 374101 374392 374711 374994 375115 374851 374107 373040
51229 373040 371857 370571 369076 367467 366185 365700 366037 366640 366800 366279 365414 364621 364020 363732 364240 365997 368678
51212 368678 371323 373365 375088 376912 378748 380440 382346 384887 387850 390803 393992 398024 402729 407160
51198 407160 410900 414513 418292 421359 422729 422735 422512 422302 421164 418474 414928 411707 409189 406883 404359
51183 404359 401782 399613 398154 397440 397336 397604 397938 398030 397694 396945 396002 395198 394839 395005 395392 395477 395055 394624
51165 394624 394982 396338 398114 399770 401533 403985 407101 410128 412341 413582 414090 414219 414374 414777 415117 414763
51149 414763 413514 411881 410445 409253 408132 407284 407143 407756 408617 409101 408771 407412 405113 402352 399648 397103
$$ packed form
51261D04810J906J389P00M05N46N54%q79j614k102k547l015l392l614l667l405
51245C86075k705j789j203j242j610j712j258n17O2K91L19K83J21k64p44j067
51229C73040j183j286j495j609j282m85L37O03J60n21q65p93o01k88N08J757K681
51212C68678K645K042J723J824J836J692J906K541K963K953L189M032M705M431
51198D07160L740L613L779L067J370Ok23k10j138k690l546l221k518k306k524
51183D04359k577k169j459p14j04K68L34R2l36p49r43q04l59J66L87Q5m22m31
51165C94624L58J356J776J656J763K452L116L027K213J241N08J29J55M03L40l54
51149D14763j249j633j436j192j121q48j41O13Q61M84l30j359k299k761k704k545
$$ plain form
51133 397103 394533 392004 389923 388554 387769 387427 387619 388369 389382 390347 391286 392406 393779 395409 397402 399799
51117 399799 402351 404746 406957 409120 411207 413179 415370 418337 422218 426533 430733 434711 438610 442397
51103 442397 445857 448901 451712 454552 457485 460229 462334 463549 463989 463917 463449 462570 461210 459114 455917
51088 455917 451812 447940 445535 444657 444343 444092 444453 445800 447320 447875 447407 446786 446585 446763 447326 448459 449971
51071 449971 451345 452503 453850 455460 456920 458252 460315 463816 468485 473725 479710 487240 496792 508266
51057 508266 521460 536190 551822 567142 580924 592505 601957 610020 617936 627047 638252 651671
51045 651671 666585 681682 695659 707818 717949 725524 729355 728474 723138 714652 704439 693637 683268
51032 683268 673929 665145 655560 644062 630490 615274 598974 582409 566733 552919 541337 532057
$$ packed form
51133C97103k570k529k081j369p85l42J92P50J013R65R39J120J373J630J993K397
51117C99799K552K395K211K163K087J972K191K967L881M315M200L978L899L787
51103D42397L460L044K811K840K933K744K105J215M40p2m68q79j360k096l197
51088D55917m105l872k405q78l14k51L61J347J520N55m68o21k01J78N63J133J512
51071D49971J374J158J347J610J460J332K063L501M669N240N985P530R552J1474
51057E08266J3194J4730J5632J5320J3782J1581R452Q063P916R111J1205J3419
51045F51671J4914J5097J3977J2159J0131P575L831q81n336q486j0213j0802j0369
51032F83268r339q784r585j1498j3572j5216j6300j6565j5676j3814j1582r280
$$ plain form
51020 532057 525271 521173 519670 520462 523202 527401 532558 538624 545954 554391 562826 570278 577175 584872
51006 584872 593990 603857 613622 623161 632664 642008 651054 660112 669630 679659 690014 700695 711655
50993 711655 722377 732216 741125 749591 757802 765348 771906 777794 783539 789145 794168 798477 802660 807678
50979 807678 814264 822709 833047 845242 859084 873996 889143 903989 918806 934627 952659 973802
50967 973802 998644 1027748 1061715 1100940 1145330 1194349 1247398 1304198 1364767 1428984 1496179
50956 1496179 1565198 1634796 1703903 1771529 1836591 1897946 1954658 2006209 2052439 2093255 2128513
50945 2128513 2158373 2183766 2206230 2227103 2246975 2266038 2284666 2303261 2321616 2338784 2353647
50934 2353647 2365367 2373356 2377213 2376848 2372405 2363817 2350601 2332183 2308213 2278431 2242426 2199727
$$ packed form
51020E32057o786m098j503P92K740M199N157O066P330Q437Q435P452O897P697
51006E84872R118R867R765R539R503R344R046R058R518J0029J0355J0681J0960
50993G11655J0722R839Q909Q466Q211P546O558N888N745N606N023M309M183N018
50979H07678O586Q445J0338J2195J3842J4912J5147J4846J4817J5821J8032K1143
50967I73802K4842K9104L3967L9225M4390M9019N3049N6800O0569O4217O7195
50956A496179O9019O9598O9107O7626O5062O1355N6712N1551M6230M0816L5258
50945B128513K9860K5393K2464K0873J9872J9063J8628J8595J8355J7168J4863
50934B353647J1720P989L857l65m443q588j3216j8418k3970k9782l6005m2699
$$ plain form
50922 2199727 2150034 2093349 2030118 1961431 1888874 1814014 1738151 1662617 1588933 1518385 1451660
50911 1451660 1389154 1331412 1278937 1231755 1189526 1151967 1118774 1089273 1062581 1038182 1016031
50900 1016031 996065 977946 961319 946000 931853 918743 906695 895852 886191 877527 869823 863283
50888 863283 858043 854024 851126 849366 848717 849035 850129 851728 853435 855090 857163 860410 865007 870465 876514
50873 876514 883654 892477 902842 914122 926051 938895 952877 967857 983644 1000361 1018468 1038558
50861 1038558 1061135 1086428 1114476 1145462 1179955 1218712 1262374 1311363 1365970 1426393 1492834
50850 1492834 1565741 1645897 1734172 1831317 1937935 2054293 2179883 2313384 2453429 2599267
50840 2599267 2750383 2905522 3062407 3218290 3370415 3515918 3651754 3775080 3883649
$$ packed form
50922B199727m9693n6685o3231o8687p2557p4860p5863p5534p3684p0548o6725
50911A451660o2506n7742n2475m7182m2229l7559l3193k9501k6692k4399k2151
50900A016031j9966j8119j6627j5319j4147j3110j2048j0843r661q664p704o540
50888H63283n240m019k898j760o49L18J094J599J707J655K073L247M597N458O049
50873H76514P140Q823J0365J1280J1929J2844J3982J4980J5787J6717J8107K0090
50861A038558K2577K5293K8048L0986L4493L8757M3662M8989N4607O0423O6441
50850A492834P2907Q0156Q8275R7145J06618J16358J25590J33501J40045J45838
50840B599267J51116J55139J56885J55883J52125J45503J35836J23326J08569
$$ plain form
50831 3883649 3975790 4050262 4106566 4145546 4169615 4182101 4186176 4184378 4179250 4174219 4173323 4179773 4194885
50818 4194885 4218407 4249333 4285872 4324866 4361874 4391971 4410275 4412110 4393584 4352485 4288238
50807 4288238 4200855 4090466 3958295 3807541 3642555 3467299 3285173 3100194 2917296 2740903
50797 2740903 2573575 2416511 2271025 2138917 2021464 1918584 1829161 1751847 1685452 1628983
50787 1628983 1581644 1542725 1511335 1486348 1466692 1451426 1439462 1429525 1420642 1412390 1404410 1396044
50775 1396044 1386875 1377272 1367753 1357924 1346695 1333575 1319118 1303967 1288069 1271115 1253191 1234629
50763 1234629 1215597 1196147 1176364 1156249 1135908 1116139 1098344 1083421 1071076 1060552 1051631
50752 1051631 1044520 1039217 1035620 1033936 1034422 1036999 1041691 1049154 1060081 1074327 1091307 1111107 1134422
$$ packed form
50831C883649R2141P4472N6304L8980K4069J2486M075j798n128n031q96O450J5112
50818D194885K3522L0926L6539L8994L7008L0097J8304J835j8526m1099o4247
50807D288238q7383j10389j32171j50754j64986j75256j82126j84979j82898j76393
50797B740903j67328j57064j45486j32108j17453j02880q9423p7314o6395n6469
50787A628983m7339l8919l1390k4987j9656j5266j1964r937q883q252p980q366
50775A396044r169r603r519r829j1229j3120j4457j5151j5898j6954j7924j8562
50763A234629j9032j9450j9783k0115k0341j9769j7795j4923j2345j0524q921
50752A051631p111n303l597j684M86K577M692P463J0927J4246J6980J9800K3315
$$ plain form
50739 1134422 1161635 1192876 1229014 1271503 1320817 1375852 1435348 1499175 1567638 1640142 1715332
50728 1715332 1792337 1871186 1951995 2034123 2116105 2196196 2273107 2346508 2416730 2483778 2546688
50717 2546688 2603785 2653216 2693127 2721831 2738319 2742616 2735545 2718526 2693873 2664978 2635613 2608930
50705 2608930 2587190 2572126 2565015 2566369 2575833 2592452 2614787 2640649 2666977 2690174 2706774 2713926
50693 2713926 2709331 2690756 2655887 2603219 2533348 2449223 2354918 2254207 2150222 2045951 1944415
50682 1944415 1848308 1759625 1679602 1608842 1547485 1495440 1452498 1418396 1392947 1376125 1367683
50671 1367683 1366642 1371479 1380999 1394716 1412199 1432430 1454155 1476536 1498974 1520534 1540112 1557256
50659 1557256 1572443 1586412 1599470 1611461 1622213 1631965 1641523 1651980 1664071 1677780 1692730 1708886
$$ packed form
50739A134422K7213L1241L6138M2489M9314N5035N9496O3827O8463P2504P5190
50728A715332P7005P8849Q0809Q2128Q1982Q0091P6911P3401P0222O7048O2910
50717B546688N7097M9431L9911K8704J6488M297p071j7019k4653k8895k9365k6683
50705B608930k1740j5064p111J354R464J6619K2335K5862K6328K3197J6600P152
50693B713926m595j8575l4869n2668o9871q4125r4305j00711j03985j04271j01536
50682A944415r6107q8683q0023p0760o1357n2045m2942l4102k5449j6822q442
50671A367683j041M837R520J3717J7483K0231K1725K2381K2438K1560J9578J7144
50659A557256J5187J3969J3058J1991J0752R752R558J0457J2091J3709J4950J6156
$$ plain form
50647 1708886 1726714 1746725 1769103 1793855 1821236 1852042 1887485 1928559 1975320 2026872 2082133
50636 2082133 2140397 2200966 2262573 2323608 2382769 2439177 2492045 2540833 2585841 2628183 2668937
50625 2668937 2708443 2746208 2780731 2809002 2826708 2829835 2816545 2787749 2746297 2696178 2642319
50614 2642319 2590187 2544479 2507634 2479665 2459480 2446195 2439226 2437664 2440131 2445127 2450903 2454837
50602 2454837 2453497 2443815 2424117 2393912 2353104 2301830 2240921 2172105 2097692 2020098 1941420 1863187
50590 1863187 1786617 1713175 1644435 1581129 1522702 1468382 1418451 1373922 1335086 1301028 1270601
50579 1270601 1243304 1218997 1197242 1177310 1158764 1141838 1127307 1115912 1107744 1102277 1099123 1098485
50567 1098485 1100634 1105300 1112101 1121297 1133325 1147641 1162854 1178309 1194857 1213688 1234951 1257979
$$ packed form
50647A708886J7828K0011K2378K4752K7381L0806L5443M1074M6761N1552N5261
50636B082133N8264O0569O1607O1035N9161N6408N2868M8788M5008M2342M0754
50625B668937L9506L7765L4523K8271J7706L127j3290k8796m1452n0119n3859
50614B642319n2132m5708l6845k7969k0185j3285o969j562K467M996N776L934
50602B454837j340r682j9698l0205m0808n1274o0909o8816p4413p7594p8678p8233
50590A863187p6570p3442o8740o3306n8427n4320m9931m4529l8836l4058l0427
50579A270601k7297k4307k1755j9932j8546j6926j4531j1395q168n467l154o38
50567A098485K149M666O801R196J2028J4316J5213J5455J6548J8831K1263K3028
$$ plain form
50555 1257979 1282477 1308925 1337955 1369684 1403478 1438019 1471742 1503538 1533090 1560564 1586218
50544 1586218 1610439 1633824 1656939 1680250 1704459 1730673 1759965 1792959 1830066 1871864 1918995
50533 1918995 1971916 2031118 2097475 2171936 2254862 2345816 2444070 2549250 2661609 2781692 2909479
50522 2909479 3043637 3181794 3321682 3461751 3600453 3735282 3862905 3980110 4084225
50513 4084225 4172781 4243263 4293375 4321404 4326426 4308488 4268592 4208287 4129341 4034088 3926002
50502 3926002 3809487 3688909 3568151 3451181 3342604 3247068 3168028 3107191 3065067 3041723
50492 3041723 3036880 3049535 3077749 3118782 3169135 3224332 3278796 3326130 3359729 3373590 3363357
50481 3363357 3327206 3265795 3181277 3076519 2955298 2822581 2683808 2543718 2405993 2273509
$$ packed form
50555A257979K4498K6448K9030L1729L3794L4541L3723L1796K9552K7474K5654
50544A586218K4221K3385K3115K3311K4209K6214K9292L2994L7107M1798M7131
50533A918995N2921N9202O6357P4461Q2926R0954R8254J05180J12359J20083J27787
50522B909479J34158J38157J39888J40069J38702J34829J27623J17205J04115
50513D084225Q8556P0482N0112K8029N022j7938l9896o0305p8946r5253j08086
50502C926002j16515j20578j20758j16970j08577r5536p9040o0837m2124k3344
50492C041723m843J2655K8214M1033N0353N5197N4464M7334L3599J3861j0233
50481C363357l6151o1411q4518j04758j21221j32717j38773j40090j37725j32484
$$ plain form
50471 2273509 2148185 2030626 1920748 1819007 1726496 1643749 1570164 1504894 1447668 1398374
50461 1398374 1356410 1320836 1290725 1265052 1242905 1224270 1210037 1200760 1195903 1194787 1197521 1204177
50449 1204177 1213637 1224177 1234842 1245447 1255700 1265409 1275288 1286403 1298812 1311755 1325105 1339467
50437 1339467 1354593 1368832 1380666 1389990 1397491 1403594 1408480 1412400 1415434 1417556 1419435 1422550 1428059
50424 1428059 1436006 1445965 1457753 1471102 1485479 1501046 1519159 1541084 1566601 1594689 1625263 1659406
50412 1659406 1698139 1741726 1790115 1843277 1901029 1963000 2028681 2097065 2166452 2235158 2302208
50401 2302208 2366767 2427245 2481787 2529480 2570166 2603118 2626836 2640218 2642866 2633925 2611686 2575090
50389 2575090 2524975 2463264 2391716 2312354 2228596 2144736 2064119 1988438 1918827 1856934 1804680
$$ packed form
50471B273509j25324j17559j09878j01741r2511q2747p3585o5270n7226m9294
50461A398374m1964l5574l0111k5673k2147j8635j4233r277m857j116K734O656
50449A204177R460J0540J0665J0605J0253R709R879J1115J2409J2943J3350J4362
50437A339467J5126J4239J1834R324P501O103M886L920L034K122J879L115N509
50424A428059P947R959J1788J3349J4377J5567J8113K1925K5517K8088L0574L4143
50412A659406L8733M3587M8389N3162N7752O1971O5681O8384O9387O8706O7050
50401B302208O4559O0478N4542M7693M0686L2952K3718J3382K648q941k2239l6596
50389B575090n0115o1711p1548p9362q3758q3860q0617p5681o9611o1893n2254
$$ plain form
50378 1804680 1763493 1734064 1716498 1710334 1714538 1727675 1748019 1773368 1800869 1827262 1849401 1864619
50366 1864619 1870776 1866259 1850110 1822264 1783614 1735815 1680950 1621259 1558949 1496000 1434069 1374584
50354 1374584 1318753 1267253 1219904 1175918 1134606 1095691 1059057 1024680 993079 965411 942574
50343 942574 924275 909402 897329 888460 883434 882241 884356 889409 897430 908561 922800 939869 959050
50330 959050 979200 999072 1017584 1033644 1045979 1053545 1056119 1054278 1048936 1041324 1033380 1027424 1024915
50317 1024915 1025655 1028456 1032380 1037071 1042169 1046931 1050513 1052409 1052735 1052346 1052526 1054105 1056766 1059501 1061703
50302 1061703 1063569 1065557 1067990 1071270 1075866 1081854 1088864 1096786 1106055 1116887 1128681 1140745 1153416
50289 1153416 1167866 1184918 1204585 1226891 1252584 1282579 1316544 1351915 1384164 1408314 1420714
$$ packed form
50378A804680m1187k9429j7566o164M204J3137K0344K5349K7501K6393K2139J5218
50366A864619O157m517j6149k7846l8650m7799n4865n9691o2310o2949o1931n9485
50354A374584n5831n1500m7349m3986m1312l8915l6634l4377l1601k7668k2837
50343I42574j8299j4873j2073q869n026j193K115N053Q021J1131J4239J7069J9181
50330I59050K0150J9872J8512J6060J2335P566K574j841n342p612p944n956k509
50317A024915P40K801L924M691N098M762L582J896L26l89J80J579K661K735K202
50302A061703J866J988K433L280M596N988P010P922R269J0832J1794J2064J2671
50289A153416J4450J7052J9667K2306K5693K9995L3965L5371L2249K4150J2400
$$ plain form
50278 1420714 1419879 1406217 1381716 1350156 1316692 1285971 1260238 1239485 1223189 1211260 1203391 1198497
50266 1198497 1195268 1192824 1190504 1187554 1183457 1178218 1171962 1164660 1156662 1149060 1142880 1138065 1133788 1129591
50252 1129591 1125666 1122142 1118798 1115707 1113640 1113534 1115865 1120758 1128376 1138851 1151942 1167134 1184170
50239 1184170 1203344 1225120 1249426 1275354 1301728 1327980 1354254 1380506 1405817 1429005 1449793
50228 1449793 1468885 1486766 1502835 1515850 1524703 1528391 1525629 1515264 1497213 1472623 1442908 1409003
50216 1409003 1371800 1333002 1295068 1260178 1229474 1203227 1181310 1163173 1147573 1132811 1117400
50205 1117400 1100398 1081187 1059346 1034994 1009072 982958 957799 934269 912809 893781 877347
50194 877347 863399 851699 841994 833909 826820 819959 812796 805332 798016 791235 784901 778595 772064 765369
$$ packed form
50278A420714q35j3662k4501l1560l3464l0721k5733k0753j6296j1929p869m894
50266A198497l229k444k320k950m097n239o256p302p998p602o180m815m277m197
50252A129591l925l524l344l091k067j06K331M893P618J0475J3091J5192J7036
50239A184170J9174K1776K4306K5928K6374K6252K6274K6252K5311K3188K0788
50228A449793J9092J7881J6069J3015Q853L688k762j0365j8051k4590k9715l3905
50216A409003l7203l8798l7934l4890l0704k6247k1917j8137j5600j4762j5411
50205A117400j7002j9211k1841k4352k5922k6114k5159k3530k1460j9028j6434
50194H77347j3948j1700r705q085p089o861p163p464p316o781o334o306o531o695
$$ plain form
50180 765369 758604 751793 745173 739229 734116 729308 724168 718673 713218 707867 702327 696655 691533 687625
50166 687625 685000 683288 682133 681411 681274 682071 683927 686330 688543 690544 693152 697006 701854 707169 713034
50151 713034 719945 728031 736987 746538 756394 765799 773653 779242 782521 783709 783049 781071 778631 776457
50137 776457 774930 774481 775863 779727 786123 794677 805218 818048 833707 852633 874964 900520 928959
50124 928959 960062 993896 1030672 1070452 1112955 1157523 1203267 1249315 1295000 1339851 1383583
50113 1383583 1426317 1468680 1511317 1554123 1596006 1635315 1670131 1698112 1716704 1724057 1719783 1704577
50101 1704577 1679357 1645155 1603707 1557516 1508923 1459275 1409154 1359250 1310814 1265322 1223937
50090 1223937 1187297 1155619 1128907 1107031 1089644 1075982 1064850 1055088 1046294 1039047 1034211 1031975
$$ packed form
50180G65369o765o811o620n944n113m808n140n495n455n351n540n672n122l908
50166F87625k625j712j155p22j37P97J856K403K213K001K608L854M848N315N865
50151G13034O911Q086Q956R551R856R405P854N589L279J188o60j978k440k174
50137G76457j527m49J382L864O396Q554J0541J2830J5659J8926K2331K5556K8439
50124I28959L1103L3834L6776L9780M2503M4568M5744M6048M5685M4851M3732
50113A383583M2734M2363M2637M2806M1883L9309L4816K7981J8592P353m274j5206
50101A704577k5220l4202m1448m6191m8593m9648n0121m9904m8436m5492m1385
50090A223937l6640l1678k6712k1876j7387j3662j1132r762q794p247m836k236
$$ plain form
50078 1031975 1031700 1032694 1034836 1038305 1042979 1048470 1054593 1061353 1068387 1074857 1080099 1084134 1087273 1089442
50064 1089442 1090163 1089125 1086496 1082641 1077732 1071661 1064255 1055595 1046197 1036797 1027870 1019362 1011026 1002939
50050 1002939 995543 989160 983646 978639 974249 971391 971207 973917 978424 983427 988873 995848 1004947 1015411
50036 1015411 1026263 1037680 1050528 1064856 1079736 1094532 1109430 1124430 1138602 1150863 1161031
50025 1161031 1169560 1176601 1181929 1185561 1187782 1188480 1187022 1183101 1177393 1171079 1164783 1158174 1150586 1141880
50011 1141880 1132608 1123412 1114509 1106003 1098620 1093713 1092308 1094357 1099227 1106778 1117647 1132444 1151014
49998 1151014 1172572 1196323 1221755 1248485 1276046 1303900 1331546 1358578 1384531 1408592 1429429
49987 1429429 1445382 1454910 1456914 1450637 1435378 1410536 1376164 1333582 1285286 1234069 1182149 1131144
$$ packed form
50078A031975k75R94K142L469M674N491O123O760P034O470N242M035L139K169
50064A089442P21j038k629l855m909o071p406q660r398r400q927q508q336q087
50050A002939p396o383n514n007m390k858j84K710M507N003N446O975R099J0464
50036A015411J0852J1417J2848J4328J4880J4796J4898J5000J4172J2261J0168
50025A161031Q529P041N328L632K221O98j458l921n708o314o296o609p588q706
50011A141880r272r196q903q506p383m907j405K049M870P551J0869J4797J8570
49998A151014K1558K3751K5432K6730K7561K7854K7646K7032K5953K4061K0837
49987A429429J5953R528K004o277j5259k4842l4372m2582m8296n1217n1920n1005
$$ plain form
49975 1131144 1082557 1037818 997718 962154 930770 903655 881114 862839 847647 834135 821469
49964 821469 809540 798578 788721 779851 771768 764510 758438 753856 750648 748541 747734 748969 752803 758976
49950 758976 766708 775494 785325 796090 807028 817023 825391 832214 837862 842405 845679 847741 848896 849134
49936 849134 847873 844526 839134 832150 823649 813053 799707 783554 765293 746095 727211 709569
49924 709569 693612 679537 667631 658117 650674 644521 639190 635024 632611 631905 632238 633163 634862 637574
49910 637574 640873 643877 646187 648450 651891 657406 665169 674852 685900 697662 709725 722409 736593
49897 736593 752541 768995 783923 796184 806097 814243 820280 823289 822972 820013 815313 809243 801592
49884 801592 791990 780297 766822 752239 737195 721982 706680 691560 677215 664262 652969 643099
$$ packed form
49975A131144m8587m4739m0100l5564l1384k7115k2541j8275j5192j3512j2666
49964H21469j1929j0962r857q870q083p258o072m582l208k107q07J235L834O173
49950G58976P732Q786R831J0765J0938R995Q368O823N648M543L274K062J155K38
49936H49134j261l347n392o984q501j0596j3346j6153j8261j9198j8884j7642
49924G09569j5957j4075j1906r514p443o153n331m166k413p06L33R25J699K712
49910F37574L299L004K310K263L441N515P763R683J1048J1762J2063J2684J4184
49897G36593J5948J6454J4928J2261R913Q146O037L009l17k959m700o070p651
49884H01592r602j1693j3475j4583j5044j5213j5302j5120j4345j2953j1293r870
$$ [...]
##END NTUPLES=NMR SPECTRUM
##END=
