
##TITLE=AC1380_BRAAH12192_7519276_5d18nrLGuU
##JCAMPDX= 6.0         $$ Bruker NMR JCAMP-DX V2.0
##DATA TYPE= NMR SPECTRUM
##DATA CLASS= NTUPLES
##ORIGIN= BRUKER
##OWNER= Administrator
$$ 1.72 TOPSPIN		Version 2.1
$$ 2013-02-20 19:58:27.411 -0500  Administrator@X
$$ Compression mode = diff/dup
##.OBSERVE FREQUENCY= 400.02188249412
##.OBSERVE NUCLEUS= ^1H
##.ACQUISITION MODE= SIMULTANEOUS (DQD)
##.ACQUISITION SCHEME= undefined
##.AVERAGES= 64
##.DIGITISER RES= 22
##SPECTROMETER/DATA SYSTEM= spect
##.PULSE SEQUENCE= noesygpps1d.comp
##.SOLVENT NAME= COFFEE_meoh
##.SHIFT REFERENCE= INTERNAL, COFFEE_meoh, 1, 14.96077
##AUDIT TRAIL= $$ (NUMBER, WHEN, WHO, WHERE, PROCESS, VERSION, WHAT)
$$ ##TITLE= Audit trail, TOPSPIN		Version 2.1
$$ ##JCAMPDX= 5.01
$$ ##ORIGIN= Bruker BioSpin GmbH
$$ ##OWNER= Administrator
$$ $$ E:\/data/COFFEE/nmr/AC1380_BRAAH12192_7519276_5d18nrLGuU/12/pdata/1/auditp.txt
$$ ##AUDIT TRAIL=  $$ (NUMBER, WHEN, WHO, WHERE, PROCESS, VERSION, WHAT)
(   1,<2013-02-20 19:58:21.411 -0500>,<Administrator>,<X>,<go>,<TOPSPIN 2.1>,
      <created by zg
	started at 2013-02-20 19:46:51.017 -0500,
	POWCHK enabled, PULCHK disabled,
       configuration hash MD5:
       86 BA 57 50 F2 9D 5C 9B 26 00 A9 28 5F 66 2E 89
       data hash MD5: 64K
       D8 FC 40 04 1A 7B 9E 13 EA 81 12 56 B3 CA FB DE>)
(   2,<2013-02-20 19:58:24.520 -0500>,<Administrator>,<X>,<proc1d>,<TOPSPIN 2.1>,
      <Start of raw data processing
       efp LB = 0.3 FT_mod = 6 PKNL = 1 PHC0 = 0 PHC1 = 0 SI = 128K 
       data hash MD5: 128K
       2A 28 43 FC FB 98 E8 8A 12 7E D9 89 B6 32 BD 54>)
(   3,<2013-02-20 19:58:25.614 -0500>,<Administrator>,<X>,<proc1d>,<TOPSPIN 2.1>,
      <pk PHC0 = 253.0811 PHC1 = 0 
       data hash MD5: 128K
       4D 4B A6 A4 AA 4A 88 5C A9 04 D7 25 06 AB D0 A3>)
(   4,<2013-02-20 19:58:26.317 -0500>,<Administrator>,<X>,<proc1d>,<TOPSPIN 2.1>,
      <abs ABSG = 1 
       data hash MD5: 128K
       9A F6 89 EA F4 B0 98 6B 0E 3D E6 57 8F 79 44 81>)
(   5,<2013-02-20 19:58:26.489 -0500>,<Administrator>,<X>,<proc1d>,<TOPSPIN 2.1>,
      <abs ABSG = 2 
       data hash MD5: 128K
       7E F6 EA EC C3 8E A0 97 0D 55 A1 7E 12 4D 28 B9>)
(   6,<2013-02-20 19:58:26.677 -0500>,<Administrator>,<X>,<proc1d>,<TOPSPIN 2.1>,
      <abs ABSG = 3 
       data hash MD5: 128K
       06 25 C0 AB 9E 41 21 8D B8 5A 00 6D DA 1F CF DB>)
(   7,<2013-02-20 19:58:26.864 -0500>,<Administrator>,<X>,<proc1d>,<TOPSPIN 2.1>,
      <abs ABSG = 4 
       data hash MD5: 128K
       62 7A E9 0E 21 41 A2 FE D3 21 9C 62 21 4C 86 ED>)
(   8,<2013-02-20 19:58:27.067 -0500>,<Administrator>,<X>,<proc1d>,<TOPSPIN 2.1>,
      <abs ABSG = 5 
       data hash MD5: 128K
       B4 7F 80 95 40 03 14 B7 0D 7B EC F6 59 7B 16 1B>)
$$ ##END=
$$ 
$$ $$ hash MD5
$$ $$ 95 82 E6 14 8C 22 41 82 FF 7F 06 75 C3 44 B7 DE
##$RELAX= 
##$RELAX= 
##$RELAX= 
##$RELAX= 
##$RELAX= 
##$RELAX= 
##$RELAX= 
##$RELAX= 
$$ Bruker specific parameters
$$ --------------------------
##$DU= <E:\>
##$EXPNO= 12
$$ [...]
150 150 150 150 150 150 150 150
##$TP07= 0
##$TPNAME0= <>
##$TPNAME1= <>
##$TPNAME2= <>
##$TPNAME3= <>
##$TPNAME4= <>
##$TPNAME5= <>
##$TPNAME6= <>
##$TPNAME7= <>
##$TPOAL= (0..7)
0.5 0.5 0.5 0.5 0.5 0.5 0.5 0.5
##$TPOFFS= (0..7)
0 0 0 0 0 0 0 0
##$TUNHIN= 0
##$TUNHOUT= 0
##$TUNXOUT= 0
##$USERA1= <user>
##$USERA2= <user>
##$USERA3= <user>
##$USERA4= <user>
##$USERA5= <user>
##$V9= 5
##$VALIST= <valist>
##$VCLIST= <CCCCCCCCCCCCCCC>
##$VD= 0
##$VDLIST= <DDDDDDDDDDDDDDD>
##$VPLIST= <PPPPPPPPPPPPPPP>
##$VTLIST= <TTTTTTTTTTTTTTT>
##$WBST= 1024
##$WBSW= 4
##$XGAIN= (0..3)
0 0 0 0
##$XL= 0
##$YL= 0
##$YMAX_a= 6328585
##$YMIN_a= -11032492
##$ZGOPTNS= <>
##$ZL1= 120
##$ZL2= 120
##$ZL3= 120
##$ZL4= 120
##$ABSF1= 14.96077
##$ABSF2= -5.597412
##$ABSG= 5
##$ABSL= 3
##$ALPHA= 0
##$AQORDER= 0
##$ASSFAC= 0
##$ASSFACI= 0
##$ASSFACX= 0
##$ASSWID= 0
##$AUNMP= <proc_prof1d_extract.lims>
##$AXLEFT= 0
##$AXNAME= <>
##$AXNUC= <1H>
##$AXRIGHT= 0
##$AXTYPE= 0
##$AXUNIT= <>
##$AZFE= 0.1
##$AZFW= 0.1
##$BCFW= 0
##$BC_mod= 0
##$BYTORDP= 0
##$COROFFS= 0
##$CY= 15
##$DATMOD= 1
##$DC= 0
##$DFILT= <>
##$DTYPP= 0
##$F1P= 0
##$F2P= 0
##$FCOR= 0.5
##$FTSIZE= 131072
##$FT_mod= 6
##$GAMMA= 0
##$GB= 0
##$INTBC= 1
##$INTSCL= 1
##$ISEN= 128
##$LB= 0.3
##$LEV0= 0
##$LPBIN= 0
##$MAXI= 10000
##$MC2= 0
##$MEAN= 0
##$ME_mod= 0
##$MI= 0
##$NCOEF= 0
##$NC_proc= -2
##$NLEV= 6
##$NOISF1= 0
##$NOISF2= 0
##$NSP= 0
##$NTH_PI= 0
##$NZP= 0
##$OFFSET= 14.96077
##$PC= 1
##$PHC0= 253.0811
##$PHC1= 0
##$PH_mod= 1
##$PKNL= yes
##$PPARMOD= 0
##$PPDIAG= 0
##$PPIPTYP= 0
##$PPMPNUM= 2147483647
##$PPRESOL= 1
##$PSCAL= 4
##$PSIGN= 0
##$PYNMP= <proc.py>
##$REVERSE= no
##$SF= 400.020009727415
##$SI= 131072
##$SIGF1= 0
##$SIGF2= 0
##$SINO= 400
##$SIOLD= 131072
##$SPECTYP= <>
##$SREGLST= <1H.CDCl3>
##$SSB= 0
##$STSI= 131072
##$STSR= 0
##$SW_p= 8223.68421052631
##$SYMM= 0
##$S_DEV= 0
##$TDeff= 65536
##$TDoff= 0
##$TI= <>
##$TILT= no
##$TM1= 0
##$TM2= 0
##$TOPLEV= 0
##$USERP1= <user>
##$USERP2= <user>
##$USERP3= <user>
##$USERP4= <user>
##$USERP5= <user>
##$WDW= 1
##$XDIM= 131072
##$YMAX_p= 410318715
##$YMIN_p= -10950
##$CURPLOT= <Network HP LaserJet P1505>
##$CURPRIN= <$Network HP LaserJet P1505>
##$DFORMAT= <normdp>
##$LAYOUT= <+/1D_H.xwp>
##$LFORMAT= <normlp>
##$PFORMAT= <normpl>
##$SURQMSG= 1
$$ End of Bruker specific parameters
$$ ---------------------------------
##NTUPLES= NMR SPECTRUM
##VAR_NAME=  FREQUENCY,     SPECTRUM/REAL,   SPECTRUM/IMAG
##SYMBOL=    X,             R,               I
##VAR_TYPE=  INDEPENDENT,   DEPENDENT,       DEPENDENT
##VAR_FORM=  AFFN,          ASDF,            ASDF
##VAR_DIM=   131072,        131072,          131072
##UNITS=     HZ,            ARBITRARY UNITS, ARBITRARY UNITS
##FACTOR=    0.0627417313425164, 1,          1
##FIRST=     8223.62146879497, 3199,         -62963
##LAST=      0,             4061,            -62842
##MIN=       0,             -10950,          0
##MAX=       8223.62146879497, 410318715,    0
$$ Real data points
##PAGE= N=1
##DATA TABLE= (X++(R..R)), XYDATA
$$ [...]
$$ plain form
61651 398785 400301 401768 403124 404604 406439 408553 410610 412455 414424 417074 420604 424679 428802 432670
61637 432670 436090 438743 440190 440153 438817 436914 435358 434521 433853 432510 430372 428179 426522 425111 423225
61622 423225 420589 417490 414335 411487 409379 408389 408626 410014 412263 414498 415384 414356 412422 410894 409349
61607 409349 405847 399411 391367 383725 377119 371101 365668 361294 357718 353886 349309 344584 340289 336167
61593 336167 331855 327746 324464 321866 319243 316371 313702 311466 309217 306614 304236 303076 303240 303554 302730
61578 302730 300697 298521 297068 296097 294799 292917 290974 289512 288533 287824 287432 287452 287570 287296 286741 286649 287385
61561 287385 288171 287856 286364 284939 284774 285788 286992 287752 288330 289288 290756 292311 293371 293685 293602 293773 294453
61544 294453 295232 295687 296074 297032 298714 300697 302690 304798 307055 309258 311461 314050 317015 319675 321529
$$ packed form
61651C98785J516J467J356J480J835K114K057J845J969K650L530M075M123L868
61637D32670L420K653J447l7j336j903j556q37o68j343k138k193j657j411j886
61622D23225k636l099l155k848k108r90K37J388K249K235Q86j028j934j528j545
61607D09349l502o436q044p642o606o018n433m374l576l832m577m725m295m122
61593C36167m312m109l282k598k623k872k669k236k249k603k378j160J64L14q24
61578C02730k033k176j453r71j298j882j943j462r79p09l92K0J18k74n55r2P36
61561B87385P86l15j492j425j65J014J204P60N78R58J468J555J060L14q3J71O80
61544B94453P79M55L87R58J682J983J993K108K257K203K203K589K965K660J854
$$ plain form
61529 321529 322915 324355 325607 325917 324930 322858 319972 316563 313251 310705 308961 307496 305995 304631 303632
61514 303632 303073 303105 303806 304693 304976 304572 304346 304965 305886 305980 304921 303481 302537 302186 301925 301346 300439 299347
61496 299347 298123 296817 295682 295068 295133 295876 297443 299986 303014 305321 306050 305612 305095 304994 305055 305208 305832
61479 305832 307011 308265 309302 310427 311888 313387 314697 316186 318191 320291 321812 322781 323768 324908 325709
61464 325709 325791 325325 324648 323837 322780 321383 319661 317837 316318 315411 315055 315050 315357 315991 316785 317643 318847 320743
61446 320743 323158 325470 327228 328337 328783 328677 328587 329262 330844 332714 334350 336017 338426 341954 346417
61431 346417 351248 355710 359197 361665 363626 365523 367237 368405 369078 369761 370856 372284 373736 375165 376913
61416 376913 379311 382165 384803 386761 388270 389847 391532 392855 393471 393407 392646 390983 388490 385659 382831
$$ packed form
61529C21529J386J440J252L10r87k072k886l409l312k546j744j465j501j364r99
61514C03632n59L2P01Q87K83m04k26O19R21R4j059j440r44l51k61n79r07j092
61496B99347j224j306j135o14O5P43J567K543L028K307P29m38n17j01O1J53O24
61479C05832J179J254J037J125J461J499J310J489K005K100J521R69R87J140Q01
61464C25709Q2m66o77q11j057j397j722j824j519r07l56nL07O34P94Q58J204J896
61446C20743K415K312J758J109M46j06r0O75J582J870J636J667K409L528M463
61431C46417M831M462L487K468J961J897J714J168O73O83J095J428J452J429J748
61416C76913K398K854K638J958J509J577J685J323O16o4p61j663k493k831k828
$$ plain form
61401 382831 379885 376818 374110 372018 369944 367187 364170 362091 361359 361059 360211 358944 358053 357866 357967 357762
61385 357762 356952 355671 354476 354039 354545 355507 356403 357261 358290 359279 359904 360520 361995 364549 367292 369231
61369 369231 370396 371606 373324 375184 376606 377580 378746 380852 384120 387960 391346 393600 394901 396017
61355 396017 397652 400138 403578 407998 413410 419987 428153 438124 449215 459891 468817 475762 481345 486124
61341 486124 490261 493943 497609 501500 505302 508586 511522 514771 518530 521980 524030 524523 524394 524519 524687
61326 524687 523992 522008 519194 516136 512843 509047 504938 501272 498801 497818 498198 499636 501785 504378 507382
61311 507382 511035 515688 521603 528817 537075 545947 555123 564635 574681 585269 596059 606427 615435
61298 615435 621866 624691 623762 619866 613976 606653 598276 589495 580956 572725 564472 556272 548721 542038
$$ packed form
61401C82831k946l067k708k092k074k757l017k079p32l00q48j267q91j87J01k05
61385C57762q10j281j195m37N06R62Q96Q58J029R89O25O16J475K554K743J939
61369C69231J165J210J718J860J422R74J166K106L268L840L386K254J301J116
61355C96017J635K486L440M420N412O577Q166R971J1091J0676Q926O945N583M779
61341D86124M137L682L666L891L802L284K936L249L759L450K050M93j29J25J68
61326E24687o95j984k814l058l293l796m109l666k471r83L80J438K149K593L004
61311E07382L653M653N915P214Q258Q872R176R512J0046J0588J0790J0368R008
61298F15435O431K825r29l896n890p323q377q781q539q231q253q200p551o683
$$ plain form
61284 542038 535550 528551 521364 515043 510115 506241 503188 501492 501712 503444 505641 507877 510822 515358
61270 515358 521512 528302 534431 539108 542496 545485 548916 552985 557514 562684 569154 577348 586987 597464
61256 597464 608366 619357 629783 638824 646008 651438 655550 658812 661458 663308 663974 663481 662489 661597
61242 661597 660580 658733 655879 652569 649272 645904 642352 638920 635859 632790 629120 624921 620958 617860
61228 617860 615634 614042 613102 612985 613652 614854 616444 618427 620686 622861 624660 626237 628059 630424 633304
61213 633304 636710 640855 645663 650269 653479 654817 654815 654197 653186 651806 650478 649857 650230 651548 653992 658089
61197 658089 664116 671801 680834 691442 704137 718996 735398 752349 768746 783278 794541 801772
61185 801772 805593 807754 809877 812433 814930 816813 817849 817788 816230 813179 809382 805716 802247 798160 792579
$$ packed form
61284E42038o488o999p187o321m928l874l053j696K20J732K197K236K945M536
61270E15358O154O790O129M677L388K989L431M069M529N170O470Q194R639J0477
61256E97464J0902J0991J0426R041P184N430M112L262K646J850O66m93r92q92
61242F61597j017j847k854l310l297l368l552l432l061l069l670m199l963l098
61228F17860k226j592r40j17O67J202J590J983K259K175J799J577J822K365K880
61213F33304L406M145M808M606L210J338ko18j011j380j328o21L73J318K444M097
61197F58089O027P685R033J0608J2695J4859J6402J6951J6397J4532J1263P231
61185H01772L821K161K123K556K497J883J036o1j558l051l797l666l469m087n581
$$ plain form
61170 792579 785265 776663 767618 759023 751247 743743 735551 726406 717083 708415 700239 691648 682054 671624
61156 671624 660876 650394 641028 633747 628933 626073 624534 624447 626431 630410 635061 638516 639452 637502
61142 637502 632946 626293 618132 609139 600074 591658 584294 577890 572094 566846 562558 559683 558237 557894
61128 557894 558423 559744 561713 564228 567655 572783 580096 589320 599881 611628 624834 639629 655794
61115 655794 673082 691404 710612 730402 750589 771289 792666 814604 836692 858458 879562
61104 879562 899943 919811 939162 957059 971635 981245 985731 986310 984192 979561 971978 961434 948642
61091 948642 934353 918743 901627 883029 863365 843151 822779 802599 782979 764156 746107
61080 746107 728660 711665 695088 679160 664558 652120 642083 633726 626077 618870 612526 607361
$$ packed form
61170G92579p314q602r045q595p776p504q192r145r323q668q176q591r594j0430
61156F71624j0748j0482r366p281m814k860j539q7J984L979M651L455R36j950
61142F37502m556o653q161q993r065q416p364o404n796n248m288k875j446l43
61128E57894N29J321J969K515L427N128P313R224J0561J1747J3206J4795J6165
61115F55794J7288J8322J9208J9790K0187K0700K1377K1938K2088K1766K1104
61104H79562K0381J9868J9351J7897J4576R610M486N79k118m631p583j0544j2792
61091I48642j4289j5610j7116j8598j9664k0214k0372k0180j9620j8823j8049
61080G46107j7447j6995j6577j5928j4602j2438j0037q357p649p207o344n165
$$ plain form
61068 607361 603288 600231 598266 597192 596524 596168 596673 598462 601254 604639 608775 613943 619784 625634 631531
61053 631531 638344 646881 657346 669517 682913 696830 710873 725514 741647 759510 778590 798605
61041 798605 819920 842837 867178 892872 920301 949619 980221 1011442 1043458 1077050 1112743
61030 1112743 1150546 1190314 1232043 1275939 1322251 1370723 1420147 1469076 1517265 1566000 1616922
61019 1616922 1671301 1730680 1797127 1872025 1955212 2046023 2144582 2251646 2368449 2498094 2646517
61008 2646517 2821150 3029532 3280684 3587019 3963597 4427054 4997899 5703461 6577350
60999 6577350 7659587 9000848 10655289 12639338 14868891 17133670 19156440 20708822
60991 20708822 21697808 22169902 22262665 22162788 22078886 22189965 22561387 23088016 23529461 23625605
$$ packed form
61068F07361m073l057j965j074o68l56N05J789K792L385M136N168N841N850N897
61053F31531O813Q537J0465J2171J3396J3917J4043J4641J6133J7863J9080K0015
61041G98605K1315K2917K4341K5694K7429K9318L0602L1221L2016L3592L5693
61030A112743L7803L9768M1729M3896M6312M8472M9424M8929M8189M8735N0922
61019A616922N4379N9379O6447P4898Q3187R0811R8559J07064J16803J29645J48423
61008B646517J74633K08382K51152L06335L76578M63457N70845P05562Q73889
60999F577350J082237J341261J654441J984049K229553K264779K022770J552382
60991B0708822R88986M72094R2763r9877q3902J11079L71422N26629M41445R6144
$$ plain form
60981 23625605 23209534 22248743 20817744 19049911 17100200 15117346 13219430 11480370
60973 11480370 9934270 8589536 7439602 6467878 5652492 4971790 4406465 3938136 3548901
60964 3548901 3223342 2949601 2717968 2519708 2347883 2198047 2067178 1952400 1851159
60955 1851159 1761845 1683556 1615708 1558087 1510458 1471385 1437986 1407450 1378469 1350803 1324168
60944 1324168 1298381 1274106 1252430 1233665 1217202 1202550 1189767 1178707 1168493 1158225 1147908
60933 1147908 1138299 1129915 1122429 1115099 1107584 1100196 1093290 1086552 1079105 1070396 1060750 1050899 1041119 1031021
60919 1031021 1020098 1008203 995487 982132 968343 954477 940914 927718 914502 900775 886383
60908 886383 871566 856712 842252 828760 816751 806136 796114 785889 775400 765178 755651 746913
$$ packed form
60981B3625605m16071r60791j430999j767833j949711j982854j897916j739060
60973A1480370j546100j344734j149934r71724q15386o80702n65325m68329l89235
60964C548901l25559k73741k31633j98260j71825j49836j30869j14778j01241
60955A851159q9314p8289o7848n7621m7629l9073l3399l0536k8981k7666k6635
60944A324168k5787k4275k1676j8765j6463j4652j2783j1060j0214j0268j0317
60933A147908r609q384p486p330p515p388o906o738p447q709r646r851r780j0098
60919A031021j0923j1895j2716j3355j3789j3866j3563j3196j3216j3727j4392
60908H86383j4817j4854j4460j3492j2009j0615j0022j0225j0489j0222r527q738
$$ plain form
60896 746913 738931 731550 724272 716499 708158 699918 692645 686775 682083 677799 672946 666901 659707 651730
60882 651730 643087 633747 624009 614372 604929 595429 586077 577710 570825 564943 559314 553887 549139 545175
60868 545175 541464 537390 532738 527701 522745 518451 515253 513257 512309 512077 511966 511233 509498 507061 504544
60853 504544 502344 500545 499119 497923 496682 495239 493751 492408 491078 489470 487539 485395 482867 479463
60839 479463 474860 469291 463328 457356 451322 445022 438671 433062 428899 426013 423503 420771 418069 415897
60825 415897 414281 413017 412262 412428 413587 415323 417086 418415 419029 419097 419282 420077 421167 421877 422203 422885 424307
60808 424307 425811 426383 425720 424340 422851 421403 419792 417854 415670 413450 411269 409039 406792 404816 403315
60793 403315 401980 400182 397634 394710 392082 390172 388905 387780 386190 383905 381294 378840 376461 373624
$$ packed form
60896G46913p982p381p278p773q341q240p273n870m692m284m853o045p194p977
60882F51730q643r340r738r637r443r500r352q367o885n882n629n427m748l964
60868E45175l711m074m652n037m956m294l198j996r48k32j11p33j735k437k517
60853E04544k200j799j426j196j241j443j488j343j330j608j931k144k528l404
60839D79463m603n569n963n972o034o300o351n609m163k886k510k732k702k172
60825D15897j616j264p55J66J159J736J763J329O14O8J85P95J090P10L26O82J422
60808D24307J504N72o63j380j489j448j611j938k184k220k181k230k247j976j501
60793D03315j335j798k548k924k628j910j267j125j590k285k611k454k379k837
$$ plain form
60779 373624 370190 366798 364213 362569 361463 360561 359770 359002 358098 356952 355486 353571 351363 349664 349478
60764 349478 351006 353375 355589 357467 359323 361144 362656 364108 366225 369152 371986 373802 374729 375595 376822
60749 376822 378233 379711 381396 383240 385035 386951 389485 392600 395423 397078 397433 396722 394890 391757 387563
60734 387563 382844 377898 372742 367551 362756 358672 355225 352070 348908 345752 342929 340617 338388 335545
60720 335545 332080 328960 327151 326616 326558 326341 325840 325135 324302 323458 322702 322023 321433 320984 320503 319626 318371 317353
60702 317353 317110 317481 318032 318703 319614 320614 321597 322937 324880 326738 327498 327150 326669 326726 327258 328375 330707
60685 330707 334463 338856 342920 346403 349541 352544 355645 359088 362637 365613 367913 370477 374199 378768
60671 378768 383112 386633 389357 391273 392303 392800 393329 393840 393705 392664 391161 389548 387520 384679 381220
$$ packed form
60779C73624l434l392k585j644j106r02p91p68r04j146j466j915k208j699j86
60764C49478J528K369K214J878J856J821J512J452K117K927K834J816R27Q66J227
60749C76822J411J478J685J844J795J916K534L115K823J655L55p11j832l133m194
60734C87563m719m946n156n191m795m084l447l155l162l156k823k312k229k843
60720C35545l465l120j809n35n8k17n01p05q33q44p56o79n90m49m81q77j255j018
60702C17353k43L71N51O71R11J000R83J340J943J858P60l48m81N7N32J117K332
60685C30707L756M393M064L483L138L003L101L443L549K976K300K564L722M569
60671C78768M344L521K724J916J030M97N29N11j35j041j503j613k028k841l459
$$ plain form
60656 381220 377687 374368 371362 368988 367618 367133 367044 367207 367949 369297 370626 371505 372521 374538 377259 379201
60640 379201 379229 377513 374770 371303 367252 363151 359493 356102 352610 349292 346713 344818 343174 341942 341616
60625 341616 341800 341302 339797 338458 338420 339431 340632 341951 343825 345994 347473 347731 347246 346811 346694 346548
60609 346548 345942 345013 344627 345553 347336 348411 347702 345781 344106 343556 344171 345788 348143 350510 352079 352895
60593 352895 353891 355852 358681 361678 364104 365462 365688 365306 365082 365364 365961 366599 367224 367758 367960 367728 367382
60576 367382 367481 368421 370254 372847 376257 380940 387401 395494 404344 413237 422400 432584 444035 456231
60562 456231 468523 480535 491861 501746 509260 513642 514587 512476 508313 503095 497194 490574 483538 476915
60548 476915 471537 467909 466397 467215 469995 473857 478280 483744 491192 500991 512661 525568 539628 555215
$$ packed form
60656C81220l533l319l006k374j370m85q9J63P42J348J329Q79J016K017K721J942
60640C79201K8j716k743l467m051m101l658l391l492l318k579j895j644j232l26
60625C41616J84m98j505j339l8J011J201J319J874K169J479K58m85m35j17j46
60609C46548o06r29l86R26J783J075p09j921j675n50O15J617K355K367J569Q16
60593C52895R96J961K829K997K426J358K26l82k24K82N97O38O25N34K02k32l46
60576C67382R9R40J833K593L410M683O461Q093Q850Q893R163J0184J1451J2196
60562D56231J2292J2012J1326R885P514M382R45k111m163n218n901o620p036o623
60548D76915n378l628j512Q18K780L862M423N464P448R799J1670J2907J4060J5587
$$ plain form
60534 555215 572463 590691 608533 624612 638033 648255 654850 657612 656790 652854 646144 637107 626834
60521 626834 616822 607930 599889 592072 584495 577805 572476 568405 565271 562917 561230 559874 558487 557198
60507 557198 556755 557975 561180 566364 573794 584065 597521 614031 633554 656580 683730 715241 751200
60494 751200 791863 837127 885772 935872 985922 1035004 1081832 1124342 1160520 1189122 1209230
60483 1209230 1219552 1218664 1205828 1181354 1146443 1103044 1053651 1000874 947066 894260 844006 797007
60471 797007 753194 712572 675785 643544 615719 591443 570063 551538 535831 522355 510258
60460 510258 499034 488614 478975 469939 461410 453596 446839 441160 436121 431255 426608 422690 419835 417718
60446 417718 415592 413000 410181 407755 406003 404560 402937 401278 400300 400307 400599 400208 399033 397798 396977 396319
$$ packed form
60534E55215J7248J8228J7842J6079J3421J0222O595K762q22l936o710r037j0273
60521F26834j0012q892q041p817p577o690n329m071l134k354j687j356j387j289
60507E57198m43J220L205N184P430J0271J3456J6510J9523K3026K7150L1511L5959
60494G51200M0663M5264M8645N0100N0050M9082M6828M2510L6178K8602K0108
60483A209230J0322q88j2836k4474l4911m3399m9393n2777n3808n2806n0254m6999
60471G97007m3813m0622l6787l2241k7825k4276k1380j8525j5707j3476j2097
60460E10258j1224j0420r639r036q529p814o757n679n039m866m647l918k855k117
60446D17718k126k592k819k426j752j443j623j659r78PK92l91j175j235q21o58
$$ plain form
60430 396319 395490 394659 394134 393856 393546 393080 392428 391522 390527 389957 390149 390732 390960 390451 389348 387971 386754 386389
60412 386389 387504 390099 393578 397364 401148 404525 406871 407842 407809 407557 407650 408140 408757 409263 409720 410447 411575
60395 411575 412720 413383 413766 414860 417442 421178 425000 428322 431556 435345 439579 443388 446043 447696 449152
60380 449152 451060 453479 456186 459184 462624 466299 469535 471788 473245 474579 476172 477811 479243 480703
60366 480703 482595 484766 486516 487443 487903 488388 488746 488526 488024 488373 490355 493534 496955 500390 504403 509348
60350 509348 514895 520732 527185 534751 543199 551513 558680 564305 568519 571575 573572 574345 573473 570559 565605
60335 565605 559120 551886 544698 538215 532706 527801 522764 517268 511778 506968 502967 499446 496233 493402
60321 493402 490841 488276 485879 484305 483836 483894 483741 483359 483273 483825 485149 487671 492027 498447 506652 516461
$$ packed form
60430C96319q29q31n25k78l10m66o52r06r95n70J92N83K28n09j103j377j217l65
60412C86389J115K595L479L786L784L377K346R71l3k52R3M90O17N06M57P27J128
60395D11575J145O63L83J094K582L736L822L322L234L789M234L809K655J653J456
60380D49152J908K419K707K998L440L675L236K253J457J334J593J639J432J460
60366D80703J892K171J750R27M60M85L58k20n02L49J982L179L421L435M013M945
60350E09348N547N837O453P566Q448Q314P167N625M214L056J997P73q72k914m954
60335E65605o485p234p188o483n509m905n037n496n490m810m001l521l213k831
60321D93402k561k565k397j574m69N8j53l82q6N52J324K522M356O420Q205R809
$$ plain form
60305 516461 528152 542217 559104 579074 601757 625721 648969 669992 687884 701320 708224 707097
60293 707097 698400 684136 666320 646336 625413 604946 586100 569488 555301 543417 533414 524877
60281 524877 517814 512471 508652 505528 502261 498570 494591 490414 485905 480859 475257 469538 464556 460972
60267 460972 458532 456219 453254 449769 446419 443672 441669 440435 439795 439247 438366 437320 436673 436565 436441 435714
60251 435714 434468 433310 432727 432785 433382 434434 435769 437044 437979 438564 438888 438813 438070 436791 435753 435816 437079
60234 437079 438744 439896 440387 440940 442500 445509 449690 454395 459113 463662 467912 471508 474110 475900 477594
60219 477594 479761 482292 484769 487171 489924 493297 497132 501317 506224 512370 519770 527865 536084 544284
60205 544284 552562 560782 568422 574976 580526 585848 591733 598156 604231 609135 612899 616138 619168 621711
$$ packed form
60305E16461J1691J4065J6887J9970K2683K3964K3248K1023J7892J3436O904j127
60293G07097q697j4264j7816j9984k0923k0467j8846j6612j4187j1884j0003q537
60281E24877p063n343l819l124l267l691l979m177m509n046n602n719m982l584
60267D60972k440k313k965l485l350k747k003j234o40n48q81j046o47j08j24p27
60251D35714j246j158n83N8N97J052J335J275R35N85L24p5p43j279j038O3J263
60234D37079J665J152M91N53J560L009M181M705M718M549M250L596K602J790J694
60219D77594K167K531K477K402K753L373L835M185M907O146P400Q095Q219Q200
60205E44284Q278Q220P640O554N550N322N885O423O075M904L764L239L030K543
$$ plain form
60191 621711 623458 624575 625433 626034 625939 624717 622290 618858 614701 610122 605450 600861 596146 590823 584717
60176 584717 578342 572488 567356 562375 557078 551880 547660 544732 542554 540421 538007 535259 532221 529234
60162 529234 526886 525456 524569 523704 522880 522575 523036 523971 524905 525577 525994 526271 526583 527164 528195 529588 530934
60145 530934 531848 532482 533528 535513 538251 541273 544556 548337 552347 556003 559480 563821 569550 575835 581568
60130 581568 586674 591633 596242 599812 602411 604894 607563 609713 610833 611542 612822 614784 616773 618462
60116 618462 620310 622872 625953 628728 630736 632574 635196 638465 640918 641387 640459 639690 639588 639092 636993
60101 636993 633172 628354 623335 618668 614497 610380 605768 600889 596687 593663 591316 589020 586902 585452
60087 585452 584744 584491 584505 584671 584751 584647 584631 584963 585493 585901 586047 585811 584949 583426 581543 579361 576308 571824
$$ packed form
60191F21711J747J117Q58O01r5j222k427l432m157m579m672m589m715n323o106
60176E84717o375n854n132m981n297n198m220k928k178k133k414k748l038k987
60162E29234k348j430q87q65q24l05M61R35R34O72M17K77L12N81J031J393J346
60145E30934R14O34J046J985K738L022L283L781M010L656L477M341N729O285N733
60130E81568N106M959M609L570K599K483K669K150J120P09J280J962J989J689
60116F18462J848K562L081K775K008J838K622L269K453M69r28p69j02m96k099
60101F36993l821m818n019m667m171m117m612m879m202l024k347k296k118j450
60087E85452p08k53J4J66Q0j04j6L32N30M08J46k36q62j523j883k182l053m484
$$ plain form
60069 571824 566191 560274 554621 549137 543514 537648 531754 526271 521475 517032 512286 507177 502477 498842
60055 498842 496131 493932 492219 491007 489962 489013 488877 490216 492588 495013 497278 499891 503011 506368 510198
60040 510198 515264 521705 528615 535058 540882 546334 551435 555957 559634 562202 563571 563909 563148 560563 555540
60025 555540 548706 541570 534971 528580 522043 515739 510120 505042 500210 495615 491080 486028 480268 474508
60011 474508 469550 465370 461454 457571 453697 449583 445049 440471 436422 433063 430343 428503 427758 427663 427434
59996 427434 426901 426631 427107 428221 429650 431352 433502 436192 439271 442430 445552 449052 453563 459037 464421
59981 464421 468576 471338 473298 474790 475618 475666 475248 474710 474053 473073 471566 469331 466259 462487 458335 454182
59965 454182 450595 448332 447724 448149 448626 448963 449794 451429 453323 454942 456534 458503 460447 461486 461388 460771
$$ packed form
60069E71824n633n917n653n484n623n866n894n483m796m443m746n109m700l635
60055D98842k711k199j713j212j045r49j36J339K372K425K265K613L120L357L830
60040E10198N066O441O910O443N824N452N101M522L677K568J369L38p61k585n023
60025E55540o834p136o599o391o537o304n619n078m832m595m535n052n760n760
60011D74508m958m180l916l883l874m114m534m578m049l359k720j840p45r5k29
59996D27434n33k70M76J114J429J702K150K690L079L159L122L500M511N474N384
59981D64421M155K762J960J492Q28M8m18n38o57r80j507k235l072l772m152m153
59965D54182l587k263o08M25M77L37Q31J635J894J619J592J969J944J039r8o17
$$ plain form
59949 460771 460194 459631 458976 458537 458667 459194 459605 459674 459610 459664 459882 460227 460642 460877 460558 459628 458608 458176 458522
59930 458522 459243 459787 459879 459595 459325 459725 461456 464745 469234 474339 479766 485673 492412 500132 508559 517073
59914 517073 525043 532125 538231 543318 547276 549962 551227 551005 549570 547666 546060 544848 543390 541003
59900 541003 537585 533519 529287 525377 522366 520730 520507 521206 522100 522665 522960 523686 525650 529002 533104 537294
59884 537294 541590 546404 551730 556985 561702 566075 570661 575740 581163 586711 592300 597754 602539 605980
59870 605980 607792 608227 607591 605858 602935 599123 594933 590515 585662 580433 575362 570858 566807 563027 559803
59855 559803 557522 556071 555047 554502 555025 557073 560635 565578 571921 579562 587994 596433 604065 610117 613999
59840 613999 615629 615512 614437 613223 612708 613518 615497 617568 618481 617691 615342 611671 606807 601104 595198
$$ packed form
59949D60771n77n63o55m39J30N27M11O9o4N4K18L45M15K35l19r30j020m32L46
59930D58522P21N44R2k84k70M00J731L289M489N105N427N907O739P720Q427Q514
59914E17073P970P082O106N087L958K686J265k22j435j904j606j212j458k387
59900E41003l418m066m232l910l011j636k23O99Q94N65K95P26J964L352M102M190
59884E37294M296M814N326N255M717M373M586N079N423N548N589N454M785L441
59870F05980J812M35o36j733k923l812m190m418m853n229n071m504m051l780l224
59855E59803k281j451j024n45N23K048L562M943O343P641Q432Q439P632O052L882
59840F13999J630j17j075j214n15Q10J979K071R13p90k349l671m864n703n906
$$ plain form
59825 595198 589574 584290 579260 574571 570410 566901 564163 562302 561106 559917 558140 555830 553600 551952
59811 551952 550933 550339 549852 548909 546799 543245 538815 534571 531298 529049 527247 525107 522198 518768 515442
59796 515442 512495 509640 506695 504139 502553 501682 500586 498854 497196 496553 496919 497369 497135 496369 495861 496215
59780 496215 497340 498598 499373 499530 499350 499115 498906 498845 499328 500730 502905 505241 507313 509283 511527 514063
59764 514063 516630 519195 521959 524814 527209 528804 529912 531007 532137 533301 535046 537978 541733 545210
59750 545210 547985 550795 554393 558580 562818 567108 571633 576002 579521 582001 583747 585066 586270 587775
59736 587775 589501 590525 590109 588813 587807 587286 586522 585377 584600 584457 584169 583183 582048 581425 580994 580052 578629
59719 578629 577329 576482 576155 576669 578395 581079 583881 586046 587299 587790 588046 588854 590782 593804 597477 601361
$$ packed form
59825E95198n624n284n030m689m161l509k738j861j196j189j777k310k230j648
59811E51952j019n94m87r43k110l554m430m244l273k249j802k140k909l430l326
59796E15442k947k855k945k556j586q71j096j732j658o43L66M50k34p66n08L54
59780D96215J125J258P75J57j80k35k09o1M83J402K175K336K072J970K244K536
59764E14063K567K565K764K855K395J595J108J095J130J164J745K932L755L477
59750E45210K775K810L598M187M238M290M525M369L519K480J746J319J204J505
59736E87775J726J024m16j296j006n21p64j145p77j43k88r86j135o23m31r42j423
59719E78629j300q47l27N14J726K684K802K165J253M91K56Q08J928L022L673L884
$$ plain form
59703 601361 605187 608894 612645 616572 620434 623891 627150 630831 635017 638996 642241 645046 647834 650380
59689 650380 652193 653149 653173 651841 648953 645139 641251 637493 633794 630595 628422 626901 625037 622455 619626
59674 619626 616800 613494 609188 604036 598702 593883 589982 586785 583481 579476 575179 571543 568886 566720
59660 566720 564698 563138 562494 562837 564005 565804 567928 570141 572651 575886 579812 583830 587431 590509 592936
59645 592936 594289 594230 592878 590691 588193 585709 582966 579023 573133 565792 558451 552149 546862 542190 538045
59630 538045 534517 531620 529443 528026 526861 525057 522305 519214 516388 513641 510570 507420 504812 502801
59616 502801 500670 497637 493494 488706 484140 480567 478188 476671 475702 475313 475615 476550 478075 480275 483035
59601 483035 485855 488219 489957 491062 491421 491015 490205 489579 489627 490632 492602 495108 497477 499369 501008 502697
$$ packed form
59703F01361L826L707L751L927L862L457L259L681M186L979L245K805K788K546
59689F50380J813R56K4j332k888l814l888l758l699l199k173j521j864k582k829
59674F19626k826l306m306n152n334m819l901l197l304m005m297l636k657k166
59660E66720k022j560o44L43J168J799K124K213K510L235L926M018L601L078K427
59645E92936J353n9j352k187k498k484k743l943n890p341p341o302n287m672m145
59630E38045l528k897k177j417j165j804k752l091k826k747l071l150k608k011
59616E02801k131l033m143m788m566l573k379j517r69l89L02R35J525K200K760
59601D83035K820K364J738J105L59m06q10o26M8J005J970K506K369J892J639J689
$$ plain form
59585 502697 504402 505971 507351 508313 508270 506815 504209 501015 497531 493947 490765 488467 486783 484824 482002
59570 482002 478460 474586 470587 466702 463397 460996 459325 457990 456889 456191 455895 455734 455526 455383 455439 455550
59554 455550 455475 455270 455235 455460 455697 455828 456254 457635 460335 464230 468887 473827 478857 484392 491258 499923
59538 499923 510284 522553 537934 557520 580295 602811 621131 632929 637912 637115 632247 625217
59526 625217 617590 610446 604828 601862 602037 604594 608131 611728 615182 618320 620571 621344 620467 618044 614039
59511 614039 608255 600713 591932 582678 573416 564114 554630 545163 536163 527997 520876 514960 510182 505989
59497 505989 501659 496952 492269 488177 484998 482827 481572 480931 480601 480560 480935 481649 482516 483604 485076 486714
59481 486714 488106 489402 491385 494584 498741 503353 508332 513841 519756 525547 530552 534347 537098 539482
$$ packed form
59585E02697J705J569J380R62m3j455k606l194l484l584l182k298j684j959k822
59570D82002l542l874l999l885l305k401j671j335j101o98k96j61k08j43N6J11
59554D55550p5k05l5K25K37J31M26J381K700L895M657M940N030N535O866Q665
59538D99923J0361J2269J5381J9586K2775K2516J8320J1798M983p97m868p030
59526F25217p627p144n618k966J75K557L537L597L454L138K251P73q77k423m005
59511F14039n784p542q781r254r262r302r484r467r000q166p121n916m778m193
59497E05989m330m707m683m092l179k171j255o41l30m1L75P14Q67J088J472J638
59481D86714J392J296J983L199M157M612M979N509N915N791N005L795K751K384
$$ plain form
59467 539482 541865 543616 543786 542488 540971 540141 539719 539159 538771 539429 541601 545024 549072 553209 557565 563188
59451 563188 571121 580903 590665 599069 606433 613508 620013 625198 629072 632024 633567 632474 628096 620867
59437 620867 611757 602016 593141 586106 580538 575312 569956 564875 560385 556407 553120 551080 550484 551007 552566
59422 552566 555598 560338 566355 573136 580793 590069 601897 616902 634937 655254 677589 702789 731389
59409 731389 761307 787776 806059 814034 812226 802400 786805 768234 749802 734417 724521 721849
59397 721849 726592 736418 746674 752241 749948 739741 723786 704558 683775 662759 642862 624994
59385 624994 609186 595289 583828 575511 570073 566388 563686 562007 561472 561908 563344 566033 569712 573451
59371 573451 576632 579511 582538 585769 589307 593603 598721 603816 608071 611849 616270 621879 628354 635363
$$ packed form
59467E39482K383J751J70j298j517q30m22n60l88O58K172L423M048M137M356N623
59451E63188P933R782R762Q404P364P075O505N185L874K952J543j093m378p229
59437F20867r110r741q875p035n568n226n356n081m490l978l287k040n96N23J559
59422E52566L032M740O017O781P657R276J1828J5005J8035K0317K2335K5200K8600
59409G31389K9918K6469J8283P975j808r826j5595j8571j8432j5385r896k672
59397G21849M743R826J0256N567k293j0207j5955j9228k0783k1016j9897j7868
59385F24994j5808j3897j1461q317n438l685k702j679n35M36J436K689L679L739
59371E73451L181K879L027L231L538M296N118N095M255L778M421N609O475P009
$$ plain form
59357 635363 642991 651229 659606 667663 675523 683770 692924 703164 714454 726743 739922 753649 767447
59344 767447 781127 794939 809015 822796 835416 846680 857135 866997 875416 881179 883836 883775 881396
59331 881396 876613 869171 859162 847225 834337 821372 808680 796149 783738 771793 760717 750442
59319 750442 740513 730720 721539 713854 708148 703926 700028 695705 691331 687915 685971 685119 684737 684672 685261
59304 685261 686985 690188 694902 700865 708033 717162 729383 744731 761179 775450 784813 788115 785427
59291 785427 777205 763994 746781 727321 707794 689909 674321 660956 649724 640720 633875 628800
59279 628800 625028 622213 620139 618873 618851 620461 623529 627617 632819 639738 648513 658365 668410 678435
59265 678435 688521 698298 707113 714688 721053 725902 728500 728366 725717 721096 714803 706900 697717 688105
$$ packed form
59357F35363P628Q238Q377Q057P860Q247R154J0240J1290J2289J3179J3727J3798
59344G67447J3680J3812J4076J3781J2620J1264J0455R862Q419N763K657o1k379
59331H81396m783p442j0009j1937j2888j2965j2692j2531j2411j1945j1076j0275
59319G50442r929r793r181p685n706m222l898m323m374l416j944q52l82o5N89
59304F85261J724L203M714N963P168R129J2221J5348J6448J4271R363L302k688
59291G85427q222j3211j7213j9460j9527j7885j5588j3365j1232r004o845n075
59279F28800l772k815k074j266k2J610L068M088N202O919Q775R852J0045J0025
59265F78435J0086R777Q815P575O365M849K598j34k649m621o293p903r183r612
$$ plain form
59251 688105 679007 670718 662751 654620 646629 639659 634260 630281 627370 625364 624066 623069 622177 621816 622715
59236 622715 625236 629116 633692 638196 642018 644934 647105 648793 650178 651464 652909 654575 656104 656866
59222 656866 656338 654410 651459 648022 644243 639788 634621 629651 626090 624174 623048 621952 620937 620212 619506
59207 619506 618538 617647 617401 617891 618850 620131 621555 622521 622496 621848 621683 622682 624476 626214 627411 628085 628423
59190 628423 628564 628670 628959 629590 630518 631556 632703 634282 636553 639194 641472 643005 644124 645357 646810
59175 646810 648232 649460 650593 651860 653494 655643 658318 661568 665674 670919 677156 683890 690866 698228
59161 698228 705990 713801 721384 728734 735555 740958 744164 745279 744979 743643 741166 737392 732265 725712
59147 725712 717841 709267 700874 693120 685775 678363 670721 663097 655815 648842 641755 634252 626645 619604
$$ packed form
59251F88105r098q289p967q131p991o970n399l979k911k006j298r97q92l61Q99
59236F22715K521L880M576M504L822K916K171J688J385J286J445J666J529P62
59222F56866n28j928k951l437l779m455n167m970l561j916j126j096j015p25p06
59207F19506r68q91k46M90R59J281J424R66k5o48j65R99J794J738J197O74L38
59190F28423J41J06K89O31R28J038J147J579K271K641K278J533J119J233J453
59175F46810J422J228J133J267J634K149K675L250M106N245O237O734O976P362
59161F98228P762P811P583P350O821N403L206J115l00j336k477l774n127o553
59147G25712p871q574q393p754p345p412p642p624p282o973p087p503p607p041
$$ plain form
59133 619604 613406 607744 602283 597044 592170 587702 583713 580296 577351 574837 573307 573637 576037 579915
59119 579915 584860 591057 598433 606273 614238 622943 632864 643410 653950 664968 677080 689435 700413
59106 700413 709707 718424 727177 735331 742358 748666 754602 759642 763232 765663 767479 768572 768469 767098
59092 767098 764766 761775 758530 755703 753773 752592 751739 751042 750412 749419 747475 744395 740413 735680 729974
59077 729974 722913 714350 704642 694606 685121 676619 669008 661990 655310 648689 641824 634568 627069 619693
59063 619693 612877 606940 601825 597119 592578 588488 585230 582590 579936 576991 574033 571302 568707 566207
59049 566207 563978 562017 559987 557745 555693 554266 553348 552439 551289 550130 549409 549418 550028 550708 551003 551094 551650
59032 551650 553011 554810 556600 558624 561635 566056 571617 577869 584865 593214 603471 615555 628870
$$ packed form
59133F19604o198n662n461n239m874m468l989l417k945k514j530L30K400L878
59119E79915M945O197P376P840P965Q705R921J0546J0540J1018J2112J2355J0978
59106G00413R294Q717Q753Q154P027O308N936N040L590K431J816J093j03j371
59092G67098k332k991l245k827j930j181q53o97o30r93j944l080l982m733n706
59077G29974p061q563r708j0036r485q502p611p018o680o621o865p256p499p376
59063F19693o816n937n115m706m541m090l258k640k654k945k958k731k595k500
59049E66207k229j961k030k242k052j427r18r09j150j159p21RO10O80K95R1N56
59032E51650J361J799J790K024L011M421N561O252O996Q349J0257J2084J3315
$$ plain form
59019 628870 642940 657751 673344 689270 704610 718333 729548 737678 742775 745467 746254 745102 742185
59006 742185 738751 736517 736111 736709 737363 738082 739386 741456 744215 747752 752060 756452 759785 761368 761444 760773
58990 760773 759866 758589 756371 752768 747780 741649 734566 726854 719230 712418 706517 701186 696521 693217
58976 693217 691732 691797 693032 695550 699516 704486 709745 715135 721114 728043 735822 744269 753441 763453
58962 763453 774149 785083 795714 805526 813986 820540 824791 826715 826530 824209 819360 811847 802346 791800
58948 791800 780398 767590 753243 738279 723928 710781 698896 688427 679630 672469 666636 661917
58936 661917 658208 655274 652839 650868 649446 648345 646971 644799 641774 638288 634926 632118 629779 627273
58922 627273 623977 619999 616172 613245 611238 609648 608150 606826 605782 604859 603892 603040 602624 602726 603304 604660
$$ packed form
59019F28870J4070J4811J5593J5926J5340J3723J1215Q130N097K692P87j152k917
59006G42185l434k234m06N98O54P19J304K070K759L537M308M392L333J583P6o71
58990G60773r07j277k218l603m988o131p083p712p624o812n901n331m665l304
58976F93217j485O5J235K518L966M970N259N390N979O929P779Q447R172J0012
58962G63453J0696J0934J0631R812Q460O554M251J924j85k321m849p513r501j0546
58948G91800j1402j2808j4347j4964j4351j3147j1885j0469q797p161n833m719
58936F61917l709k934k435j971j422j101j374k172l025l486l362k808k339k506
58922F27273l296l978l827k927k007j590j498j324j044r23r67q52m16J02N78J356
$$ plain form
58906 604660 607397 611736 617222 623388 630470 639129 649677 661773 674648 687358 699119 709902 720492
58893 720492 731529 742649 753117 763130 773794 785865 799217 813691 829655 847311 865913
58882 865913 884135 900878 915454 927406 936490 942579 945351 944388 939913 933030 924845 915599 904925
58869 904925 892713 879328 865365 851618 839060 828258 818841 809939 801126 792537 784158 775553 766474
58856 766474 757334 748732 740691 732659 724242 715728 707726 700381 693140 685393 677220 669324 662263 656005
58842 656005 650252 644922 640074 635532 630826 625554 619687 613537 607534 602095 597646 594477 592396 590618
58828 590618 588375 585778 583734 582893 583018 583588 584490 585647 586455 586427 586249 587388 590515 594887 599344 603256
58812 603256 606320 608211 608914 608970 608955 608912 608543 607644 606226 604523 603000 601955 600912 598928 595719 592071
$$ packed form
58906F04660K737M339N486O166P082Q659J0548J2096J2875J2710J1761J0783J0590
58893G20492J1037J1120J0468J0013J0664J2071J3352J4474J5964J7656J8602
58882H65913J8222J6743J4576J1952R084O089K772r63m475o883q185r246j0674
58869I04925j2212j3385j3963j3747j2558j0802r417q902q813q589q379q605r079
58856G66474r140q602q041q032q417q514q002p345p241p747q173p896p061o258
58842F56005n753n330m848m542m706n272n867o150o003n439m449l169k081j778
58828E90618k243k597k044q41J25N70R02J157Q08k8j78J139L127M372M457L912
58812F03256L064J891P03N6j5m3l69q99j418j703j523j045j043j984l209l648
$$ plain form
58796 592071 588806 585768 582230 577959 573434 569241 565602 562427 559577 557160 555599 555241 555922 557303 559569
58781 559569 563207 568016 572986 577490 581940 586857 591927 596514 600554 604155 606703 607163 605236 601534
58767 601534 596682 590817 584060 576899 569901 563339 557237 551547 546168 541011 536241 532389 530132 529813
58753 529813 531078 533076 535163 537355 539903 542616 545033 547150 549439 552098 554851 557688 561183 565790
58739 565790 571308 577356 583910 590989 598234 605253 612130 619264 626925 635152 643707 651942 659149 665262
58725 665262 670746 675580 678975 680490 680776 680684 680203 678955 677292 676175 676214 677434 679753 683055 686906 690715
58709 690715 694091 696741 698260 698415 697379 695318 692072 687568 682087 675645 667598 657484 645883 633774
58695 633774 621361 608192 594237 580176 566768 554549 543981 535249 527962 521541 515831 510936
$$ packed form
58796E92071l265l038l538m271m525m193l639l175k850k417j561l58O81J381K266
58781E59569L638M809M970M504M450M917N070M587M040L601K548M60j927l702
58767F01534m852n865o757p161o998o562o102n690n379n157m770l852k257l19
58753E29813J265J998K087K192K548K713K417K117K289K659K753K837L495M607
58739E65790N518O048O554P079P245P019O877P134P661Q227Q555Q235P207O113
58725F65262N484M834L395J515K86r2m81j248j663j117L9J220K319L302L851L809
58709F90715L376K650J519J55j036k061l246m504n481o442q047j0114j1601j2109
58695F33774j2413j3169j3955j4061j3408j2219j0568q732p287o421n710m895
$$ plain form
58683 510936 506705 502909 499683 497211 495091 492604 489519 486157 482885 480021 478049 477367 477902 479413 481945
58668 481945 485554 489890 494623 500077 506882 515174 524592 534706 544922 554271 561973 567997 572445 574726
58654 574726 574012 570334 564616 557900 551141 545324 540845 536973 532669 527813 522957 518263 513579 509285
58640 509285 506050 503834 502060 500661 500011 499937 499811 499570 499618 499734 499226 498297 498088 498996 499993 500022 499182 498141
58622 498141 497239 496661 496729 497524 498761 500478 503299 507687 513488 520454 528619 537840 547512 556968 565666
58607 565666 572923 578177 581799 584873 587830 589897 590275 589278 587865 586594 585397 583973 582016 579431 576575
58592 576575 573991 571771 569649 567784 566898 567460 569346 572491 577234 583725 591539 600231 609771 620059
58578 620059 630497 640473 649939 659151 668036 676102 682911 688570 693884 699942 707363 716126 726362 738912
$$ packed form
58683E10936m231l796l226k472k120k487l085l362l272k864j972o82N35J511K532
58668D81945L609M336M733N454O805Q292R418J0114J0216R349P702O024M448K281
58654E74726p14l678n718o716o759n817m479l872m304m856m856m694m684m294
58640E09285l235k216j774j399o50p4j26k41M8J16n08r29k09R08R97K9q40j041
58622D98141r02n78O8P95J237J717K821M388N801O966Q165R221R672R456Q698
58607E65666P257N254L622L074K957K067L78r97j413j271j197j424j957k585k856
58592E76575k584k220k122j865q86N62J886L145M743O491P814Q692R540J0288
58578F20059J0438R976R466R212Q885Q066O809N659N314O058P421Q763J0236J2550
$$ plain form
58564 738912 754615 773341 794345 817300 842308 869242 897743 927531 957728 986148 1010356
58553 1010356 1029526 1044392 1055578 1063004 1066805 1067583 1065685 1061388 1055873 1050604 1045455 1038707 1029342
58540 1029342 1018006 1005198 989882 970842 948420 923999 898615 872925 847776 823834 801092
58529 801092 779507 759792 743059 729922 720223 713130 707349 701943 697207 694104 692645 691650 690285
58516 690285 688865 687841 687013 686163 685461 684714 683235 680996 678969 677729 676707 675399 674261 673667 673036 671816
58500 671816 670406 669208 667743 665667 663881 663538 664579 666174 667924 669747 671263 672376 673976 677042
58486 677042 681401 686232 691448 697770 705823 715924 728433 743576 761108 780547 801379 822700
58474 822700 843277 862368 879750 894591 905267 910898 912182 910041 904444 895378 883972 871617
$$ packed form
58564G38912J5703J8726K1004K2955K5008K6934K8501K9788L0197K8420K4208
58553A010356J9170J4866J1186P426L801P78j898m297n515n269n149o748r365
58540A029342j1336j2808j5316j9040k2422k4421k5384k5690k5149k3942k2742
58529H01092k1585j9715j6733j3137r699p093n781n406m736l103j459r95j365
58516F90285j420j024q28q50p02p47j479k239k027j240j022j308j138n94o31j220
58500F71816j410j198j465k076j786l43J041J595J750J823J516J113J600L066
58486F77042M359M831N216O322Q053J0101J2509J5143J7532J9439K0832K1321
58474H22700K0577J9091J7382J4841J0676N631J284k141n597r066j1406j2355
$$ plain form
58462 871617 858881 846306 835403 827560 822639 819831 819323 821967 827782 835991 846157 858134 871163
58449 871163 884006 895741 905536 912061 914021 911106 903772 892665 879024 864943 852124 840715
58437 840715 830155 820621 812720 806457 801609 798625 798015 799270 801493 804766 809892 817161 826325 837370
58423 837370 850225 864045 877762 890989 903461 914121 921890 926919 929884 930406 927445 921177 913302
58410 913302 905439 898012 890628 882755 874136 865175 856713 849005 841536 834335 828627 825345 823874 823256
58396 823256 823728 825941 829548 833914 839409 846477 854053 860457 865399 869640 873203 875536 877032 878688
58382 878688 880332 880731 879453 877305 875012 872798 871182 870800 871491 872744 874902 878746 884045 889778 895689
58367 895689 902413 910259 919042 928883 939951 951686 963556 976323 991225 1008068 1025379 1042154
$$ packed form
58462H71617j2736j2575j0903p843m921k808n08K644N815Q209J0166J1977J3029
58449H71163J2843J1735R795O525J960k915p334j1107j3641j4081j2819j1409
58437H40715j0560r534p901o263m848k984o10J255K223L273N126P269R164J1045
58423H37370J2855J3820J3717J3227J2472J0660P769N029K965N22k961o268p875
58410I13302p863p427p384p873q619q961q462p708p469p201n708l282j471o18
58396H23256M72K213L607M366N495P068P576O404M942M241L563K333J496J656
58382H78688J644L99j278k148k293k214j616l82O91J253K158L844N299N733N911
58367H95689O724P846Q783R841J1068J1735J1870J2767J4902J6843J7311J6775
$$ plain form
58355 1042154 1058102 1072517 1084385 1093603 1100833 1106367 1110344 1113666 1117193 1120407 1122377 1123783 1126330
58342 1126330 1130414 1135114 1140397 1147503 1156999 1168123 1180350 1194124 1209693 1226488 1243954 1261917
58330 1261917 1280073 1298124 1316363 1334996 1353058 1369040 1382404 1393459 1402260 1408825 1413928 1418395
58318 1418395 1422067 1424730 1427305 1430746 1434607 1438262 1442668 1449134 1457255 1466057 1476337 1489633 1505544
58305 1505544 1522307 1539473 1557731 1576723 1595478 1614605 1635526 1657838 1679856 1701396 1723494
58294 1723494 1745744 1766594 1786145 1806004 1826486 1846591 1866545 1887672 1909905 1932281 1955774
58283 1955774 1982599 2012606 2043311 2073745 2105378 2138988 2173613 2208947 2245906 2284424 2323381
58272 2323381 2362995 2404585 2447975 2491982 2537445 2586672 2639968 2695957 2755192 2819829 2889593
$$ packed form
58355A042154J5948J4415J1868R218P230N534L977L322L527L214J970J406K547
58342A126330M084M700N283P106R496J1124J2227J3774J5569J6795J7466J7963
58330A261917J8156J8051J8239J8633J8062J5982J3364J1055Q801O565N103M467
58318A418395L672K663K575L441L861L655M406O466Q121Q802J0280J3296J5911
58305A505544J6763J7166J8258J8992J8755J9127K0921K2312K2018K1540K2098
58294A723494K2250K0850J9551J9859K0482K0105J9954K1127K2233K2376K3493
58283A955774K6825L0007L0705L0434L1633L3610L4625L5334L6959L8518L8957
58272B323381L9614M1590M3390M4007M5463M9227N3296N5989N9235O4637O9764
$$ plain form
58261 2889593 2961727 3035206 3111315 3189934 3269261 3349535 3432794 3518232 3602052 3682841 3763163
58250 3763163 3845055 3928147 4013150 4102872 4198486 4298706 4403596 4515261 4634071 4758509
58240 4758509 4889428 5029979 5180721 5339545 5506989 5686396 5878208 6079750 6291559
58231 6291559 6518001 6760504 7016386 7285813 7573508 7881987 8209728 8557888 8932136
58222 8932136 9335874 9768631 10233095 10736479 11282891 11872088 12507968 13200261 13955856
58213 13955856 14777538 15673872 16660912 17751753 18955050 20287354 21776437 23449901
58205 23449901 25333356 27464078 29894166 32677991 35873903 39566360 43875174 48945400
58197 48945400 54955496 62149480 70847737 81428493 94330479 110083241 129308483
$$ packed form
58261B889593P2134P3479P6109P8619P9327Q0274Q3259Q5438Q3820Q0789Q0322
58250C763163Q1892Q3092Q5003Q9722R5614J00220J04890J11665J18810J24438
58240D758509J30919J40551J50742J58824J67444J79407J91812K01542K11809
58231F291559K26442K42503K55882K69427K87695L08479L27741L48160L74248
58222H932136M03738M32757M64464N03384N46412N89197O35880O92293P55595
58213A3955856Q21682Q96334R87040J090841J203297J332304J489083J673464
58205B3449901J883455K130722K430088K783825L195912L692457M308814N070226
58197D8945400O010096P193984Q698257J0580756J2901986J5752762J9225242
$$ plain form
58190 129308483 152690123 180941113 214614494 253491027 295679654 337217492 372909403
58183 372909403 398123352 410318715 409359445 396807670 375058915 346817411 314787488
58176 314787488 281370754 248431547 217256648 188652533 163046327 140561696 121105628
58169 121105628 104455472 90315006 78352828 68245365 59706909 52488584 46369166
58162 46369166 41161071 36715896 32912095 29641733 26813737 24358893 22220932 20347178
58154 20347178 18692574 17224343 15914986 14736329 13665906 12692544 11809259 11005690
58146 11005690 10272154 9604768 9000490 8451778 7951164 7496269 7085332 6711996 6368915
58137 6368915 6052295 5758809 5482455 5218903 4969183 4735130 4514921 4306638 4112089
$$ packed form
58190A29308483K3381640K8250990L3673381L8876533M2188627M1537838L5691911
58183C72909403K5213949J2195363r59270j2551775k1748755k8241504l2029923
58176C14787488l3416734l2939207l1174899k8604115k5606206k2484631j9456068
58169A21105628j6650156j4140466j1962178j0107463q538456p218325o119418
58162D6369166n208095m445175l803801l270362k827996k454844k137961j873754
58154B0347178j654604j468231j309357j178657j070423r73362q83285q03569
58146A1005690p33536o67386o04278n48712n00614m54895m10937l73336l43081
58137F368915l16620k93486k76354k63552k49720k34053k20209k08283j94549
$$ plain form
58128 4112089 3933001 3766953 3610905 3465339 3331158 3205737 3085895 2971919 2865114
58119 2865114 2764109 2666944 2574274 2487345 2405128 2326283 2251472 2181096 2113381 2047384 1985255
58108 1985255 1928819 1876452 1825900 1777561 1732362 1689078 1646502 1605724 1567515 1529923 1491215
58097 1491215 1452764 1416212 1380225 1343042 1306006 1271592 1239902 1209972 1182537 1158541 1136709
58086 1136709 1115542 1096079 1079755 1065030 1049019 1031202 1012906 994400 975143 955780 937293
58075 937293 919102 900272 881594 864334 847981 831275 814376 798049 781968 765824 750895
58064 750895 738379 727372 716482 706204 697582 689784 681234 672056 663178 654083 643685 632602 622368
58051 622368 613125 604036 595182 587106 579272 570956 562976 556676 551873 547497 543427 539925 536150 531191
$$ packed form
58128D112089j79088j66048j56048j45566j34181j25421j19842j13976j06805
58119B865114j01005r7165r2670q6929q2217p8845p4811p0376o7715o5997o2129
58108A985255n6436n2367n0552m8339m5199m3284m2576m0778l8209l7592l8708
58097A491215l8451l6552l5987l7183l7036l4414l1690k9930k7435k3996k1832
58086A136709k1167j9463j6324j4725j6011j7817j8296j8506j9257j9363j8487
58075I37293j8191j8830j8678j7260j6353j6706j6899j6327j6081j6144j4929
58064G50895j2516j1007j0890j0278q622p798q550r178q878r095j0398j1083j0234
58051F22368r243r089q854q076p834q316p980o300m803m376m070l502l775m959
$$ plain form
58037 531191 525851 521519 517914 513728 508753 503546 497695 490344 481986 473903 466192 457951 449010 440021
58023 440021 431301 422959 415583 409480 403880 398120 392750 388204 383564 378222 373562 371101 369964 368216
58009 368216 365807 364081 363096 361717 359951 358985 359031 359107 358860 358844 359104 359187 359364 360145 360716 359542 356454 352637
57991 352637 348752 344717 341106 338922 337849 336309 333562 330438 327902 326103 324886 324046 322981 321147
57977 321147 318805 316446 313775 310295 306468 303203 300588 298274 296636 296319 297035 297979 298930 299819 299984 299264
57961 299264 299010 300405 302478 303565 304034 305445 307473 308048 306548 304587 303274 301771 299213 296260 293982
57946 293982 292681 292490 293846 296710 300338 304365 309219 315194 322076 329827 338690 348469 358672 369416
57932 369416 381111 393240 404472 413947 421418 426318 428034 427060 424531 420566 414369 406089 397214 388882
$$ packed form
58037E31191n340m332l605m186m975n207n851p351q358q083p711q241q941q989
58023D40021q720q342p376o103n600n760n370m546m640n342m660k461j137j748
58009C68216k409j726r85j379j766r66M6P6k47j6K60Q3J77P81N71j174l088l817
57991C52637l885m035l611k184j073j540k747l124k536j799j217q40j065j834
57977C21147k342k359k671l480l827l265k615k314j638l17P16R44R51Q89J65p20
57961B99264k54J395K073J087M69J411K028N75j500j961j313j503k558k953k278
57946B93982j301j91J356K864L628M027M854N975O882P751Q863R779J0203J0744
57932C69416J1695J2129J1232R475P471M900J716r74k529l965o197q280q875q332
$$ plain form
57918 388882 381096 373762 367178 361199 355118 348780 342812 337651 333417 330697 330067 330674 330656 329308 327589
57903 327589 326231 324670 322235 319063 315400 311189 306848 303283 300707 298536 296833 296578 297992 299819
57889 299819 300963 301753 302951 304573 306380 308569 311159 313473 314946 315801 316293 315915 313960 310483 306331
57874 306331 302575 300040 298803 298051 297004 295954 295729 296338 297104 297955 299392 301191 302487 303322 304832 307595
57858 307595 311050 314884 319610 325273 330830 335420 339093 341801 343023 343038 343199 343993 344045 342042 338526 334722
57842 334722 330646 325651 320057 314849 310166 305271 299811 294158 288690 283568 279179 276122 274746 274965
57828 274965 276272 277733 278452 278395 278351 278827 279544 280199 281000 282042 282916 283432 284065 285171 286326 286929 286832 285968
57810 285968 283991 280782 276660 271711 265603 258543 251645 245779 240819 236517 233245 231195 229733 228429
$$ packed form
57918C88882p786p334o584n979o081o338n968n161m234k720o30O07j8j348j719
57903C27589j358j561k435l172l663m211m341l565k576k171j703k55J414J827
57889B99819J144P90J198J622J807K189K590K314J473Q55M92l78j955l477m152
57874C06331l756k535j237p52j047j050k25O09P66Q51J437J799J296Q35J510K763
57858C07595L455L834M726N663N557M590L673K708J222J5J61P94N2k003l516l804
57842C34722m076m995n594n208m683m895n460n653n468n122m389l057j376K19
57828B74965J307J461P19n7m4M76P17O55Q01J042Q74N16O33J106J155O03r7q64
57810B85968j977l209m122m949o108p060o898n866m960m302l272k050j462j304
$$ plain form
57796 228429 227955 228985 230904 232682 234478 237271 241198 245357 249097 252556 256015 259630 263786 268871
57782 268871 274580 280129 285230 290263 295450 300473 305072 309498 314072 318605 322443 324941 325759 324807 322082
57767 322082 317716 312211 306364 300651 294812 288398 281557 274842 268487 262496 257320 253600 251134 248925
57753 248925 246474 244281 242918 242451 243040 245144 248674 252739 256721 260813 265037 268678 271323 273594 276062
57738 276062 278217 279367 279858 280434 280949 280689 279572 278046 276140 273598 270811 268676 267529 266897 266269 265511
57722 265511 264602 263572 262622 261834 260830 259134 256745 253997 251103 248203 245542 243146 240595 237553 234197
57707 234197 230745 226979 222720 218303 214058 209809 205612 202451 201255 201441 201374 200254 198784 197961 197922 198122
57691 198122 198040 197514 196814 196488 196871 197685 198384 198758 198988 199322 200025 201411 203657 206859 211552 218701 228696
$$ packed form
57796B28429m74J030J919J778J796K793L927M159L740L459L459L615M156N085
57782B68871N709N549N101N033N187N023M599M426M574M533L838K498Q18r52k725
57767C22082m366n505n847n713n839o414o841o715o355n991n176l720k466k209
57753B48925k451k193j363m67N89K104L530M065L982M092M224L641K645K271K468
57738B76062K155J150M91N76N15k60j117j526j906k542k787k135j147o32o28p58
57722B65511r09j030r50p88j004j696k389k748k894k900k661k396k551l042l356
57707B34197l452l766m259m417m245m249m197l161j196J86o7j120j470q23l9K00
57691A98122q2n26p00l26L83Q14O99L74K30L34P03J386K246L202M693P149R995
$$ plain form
57674 228696 240917 255031 272406 295421 325611 363318 408989 463588 526904 595469 662258
57663 662258 718402 755964 770525 762293 735041 693970 644162 590086 535455 483148 435414 393947
57651 393947 359463 331379 308456 289768 274842 263102 253780 246349 240567 236040 232153 228533 225181
57638 225181 222048 218822 215380 212284 210537 210745 212484 214605 216212 217244 218002 218391 218117 217448 217115 217338
57622 217338 217524 217089 215969 214189 211692 208985 207192 206831 207103 206969 206412 206020 205880 205685 205525 205706 205951
57605 205951 205561 204342 202771 201296 199995 198795 197546 196010 194276 192997 192697 192973 192898 192032 190469 188159
57589 188159 184912 181091 177647 175253 173797 172796 171982 171436 171375 171814 172298 172205 171524 170981 171047 171185 170538 169023
57571 169023 167234 165565 164031 162752 161907 161214 160004 157936 155319 152777 150868 149896 149776 150159 150848 151890
$$ packed form
57674B28696J2221J4114J7375K3015L0190L7707M5671N4599O3316O8565O6789
57663F62258N6144L7562J4561q232k7252m1071m9808n4076n4631n2307m7734m1467
57651C93947l4484k8084k2923j8688j4926j1740r322p431n782m527l887l620l352
57638B25181l133l226l442l096j747K08J739K121J607J032P58L89k74o69l33K23
57622B17338J86m35j120j780k497k707j793l61K72j34n57l92j40j95j60J81K45
57605B05951l90j219j571j475j301j200j249j536j734j279l00K76p5q66j563k310
57589A88159l247l821l444k394j456j001q14n46o1M39M84r3o81n43O6J38o47j515
57571A69023j789j669j534j279q45o93j210k068k617k542j909r72j20L83O89J042
$$ plain form
57555 151890 153190 154487 155979 158413 162080 166200 169763 172553 174893 176904 178607 180118 181090 180555 178235
57540 178235 175597 174640 175846 178130 180454 182581 184492 186105 187562 188936 189705 189305 188065 186728 185176
57525 185176 182607 178989 175343 172459 170206 168300 166906 166231 166198 166779 168048 169791 171697 173995 177266
57510 177266 181626 186810 192969 200446 208667 216230 222445 227905 233184 237782 240905 242617 243699 244841
57496 244841 246290 247818 248639 247859 245413 242212 239107 236169 233210 230507 228556 227462 226936 226688 226633 226924
57480 226924 227881 229604 231571 232986 233614 233884 234191 234520 234785 234981 234876 234157 233089 232551 233092 234330 235557
57463 235557 236522 237382 238208 238914 239532 240257 241256 242474 243628 244473 245175 246199 247614 248828 249378 249687 250567
57446 250567 252269 254509 257116 259905 262157 263162 263315 263930 265741 268182 270308 271833 273115 274626 276641
$$ packed form
57555A51890J300J297J492K434L667M120L563K790K340K011J703J511R72n35k320
57540A78235k638r57J206K284K324K127J911J613J457J374P69m00j240j337j552
57525A85176k569l618l646k884k253j906j394o75l3N81J269J743J906K298L271
57510A77266M360N184O159P477Q221P563O215N460N279M598L123J712J082J142
57496B44841J449J528Q21p80k446l201l105k938k959k703j951j094n26k48n5K91
57480B26924R57J723J967J415O28K70L07L29K65J96j05p19j068n38N41J238J227
57463B35557R65Q60Q26P06O18P25R99J218J154Q45P02J024J415J214N50L09Q80
57446B50567J702K240K607K789K252J005J53O15J811K441K126J525J282J511K015
$$ plain form
57431 276641 279123 281834 284764 288210 292026 295230 297045 298053 299531 301923 304772 307817 311025 313728
57417 313728 315045 315399 316348 318530 320943 322726 324564 327543 331539 335568 339117 342339 345338 348000 350316
57402 350316 352417 354443 356616 359129 361821 364343 366749 369449 372514 375615 378813 382651 387309 392290
57388 392290 397231 402326 407703 413117 418624 424858 432174 440001 447388 453788 459082 463450 467461 471675
57374 471675 475934 479594 482549 485283 487820 489621 490784 492327 494776 497470 499898 502715 506659 511226
57360 511226 515389 519081 523073 527755 532854 538113 543567 549320 555481 562145 569078 575724 581820 587691
57346 587691 593744 600049 606546 613056 618968 623655 627495 631732 637028 642868 648695 654700 661041 667209
57332 667209 672816 678233 683870 689598 695422 701834 708887 715801 722243 729096 737119 745723 754014 762175
$$ packed form
57431B76641K482K711K930L446L816L204J815J008J478K392K849L045L208K703
57417C13728J317L54R49K182K413J783J838K979L996M029L549L222K999K662K316
57402C50316K101K026K173K513K692K522K406K700L065L101L198L838M658M981
57388C92290M941N095N377N414N507O234P316P827P387O400N294M368M011M214
57374D71675M259L660K955K734K537J801J163J543K449K694K428K817L944M567
57360E11226M163L692L992M682N099N259N454N753O161O664O933O646O096N871
57346E87691O053O305O497O510N912M687L840M237N296N840N827O005O341O168
57332F67209N607N417N637N728N824O412P053O914O442O853Q023Q604Q291Q161
$$ plain form
57318 762175 770828 779790 788638 797808 807944 818692 829323 840063 851555 863387 874378 884167
57306 884167 893392 902539 911684 921215 931632 942640 953453 963956 974697 985811 996915 1008021
57294 1008021 1019607 1031767 1044160 1056797 1070013 1083584 1096716 1109014 1120814 1132633 1144938
57283 1144938 1158307 1172917 1187932 1202226 1215743 1229387 1243697 1258537 1274003 1290578 1308200
57272 1308200 1326074 1343659 1361058 1378301 1395159 1411891 1429256 1447304 1464956 1481322 1496833
57261 1496833 1512573 1528901 1545327 1561465 1577658 1594676 1612988 1632211 1651293 1669484 1687094
57250 1687094 1705054 1723732 1742580 1760947 1778892 1797013 1815753 1834981 1854217 1873282 1892638
57239 1892638 1912854 1933721 1954396 1974589 1995025 2016432 2038685 2061466 2085103 2109967 2135446
$$ packed form
57318G62175Q653Q962Q848R170J0136J0748J0631J0740J1492J1832J0991R789
57306H84167R225R147R145R531J0417J1008J0813J0503J0741J1114J1104J1106
57294A008021J1586J2160J2393J2637J3216J3571J3132J2298J1800J1819J2305
57283A144938J3369J4610J5015J4294J3517J3644J4310J4840J5466J6575J7622
57272A308200J7874J7585J7399J7243J6858J6732J7365J8048J7652J6366J5511
57261A496833J5740J6328J6426J6138J6193J7018J8312J9223J9082J8191J7610
57250A687094J7960J8678J8848J8367J7945J8121J8740J9228J9236J9065J9356
57239A892638K0216K0867K0675K0193K0436K1407K2253K2781K3637K4864K5479
$$ plain form
57228 2135446 2160358 2184135 2207040 2229540 2252208 2275833 2300793 2326466 2352056 2377763 2404356
57217 2404356 2431848 2459459 2486778 2514072 2541542 2569192 2597396 2626733 2657086 2687661 2717937
57206 2717937 2747971 2777854 2807620 2837680 2868532 2900004 2931501 2962959 2994810 3027092 3059465
57195 3059465 3092012 3124934 3157380 3187698 3215235 3240907 3265581 3288844 3309982 3329332 3347844
57184 3347844 3365719 3382232 3396790 3409688 3421828 3433997 3446490 3459389 3473059 3487973 3503970
57173 3503970 3520194 3536234 3552866 3571086 3590814 3611215 3631931 3653191 3675062 3697483 3720865
57162 3720865 3745676 3771519 3797409 3822884 3848086 3873017 3897658 3922526 3948020 3973300 3996985
57151 3996985 4018962 4040366 4061818 4082890 4103402 4123810 4143989 4162914 4180035 4195814 4210385
$$ packed form
57228B135446K4912K3777K2905K2500K2668K3625K4960K5673K5590K5707K6593
57217B404356K7492K7611K7319K7294K7470K7650K8204K9337L0353L0575L0276
57206B717937L0034K9883K9766L0060L0852L1472L1497L1458L1851L2282L2373
57195C059465L2547L2922L2446L0318K7537K5672K4674K3263K1138J9350J8512
57184C347844J7875J6513J4558J2898J2140J2169J2493J2899J3670J4914J5997
57173C503970J6224J6040J6632J8220J9728K0401K0716K1260K1871K2421K3382
57162C720865K4811K5843K5890K5475K5202K4931K4641K4868K5494K5280K3685
57151C996985K1977K1404K1452K1072K0512K0408K0179J8925J7121J5779J4571
$$ plain form
57140 4210385 4222802 4232245 4238985 4243595 4246153 4246807 4246192 4244643 4241811 4237767 4233766 4231360 4231365 4234214 4240618
57125 4240618 4251304 4266578 4286459 4310715 4338614 4369419 4403320 4441019 4482278 4525894 4571354
57114 4571354 4619426 4670899 4726095 4786223 4853913 4931699 5021043 5123508 5241710 5378458 5536409
57103 5536409 5719772 5935625 6193031 6502367 6876792 7333563 7893195 8578835 9417727
57094 9417727 10442023 11686252 13183876 14965497 17056547 19472269 22213088 25263520
57086 25263520 28592171 32150020 35869155 39662000 43414198 46971579 50141195 52726687
57078 52726687 54585418 55665086 55992253 55629714 54641577 53084895 51017413 48505419
57070 48505419 45627418 42475191 39150799 35757983 32391760 29131820 26040740 23164025
$$ packed form
57140D210385J2417R443O740M610K558O54o15j549k832m044m001k406NK849O404
57125D240618J0686J5274J9881K4256K7899L0805L3901L7699M1259M3616M5460
57114D571354M8072N1473N5196O0128O7690P7786Q9344J02465J18202J36748J57951
57103E536409J83363K15853K57406L09336L74425M56771N59632O85640Q38892
57094I417727J024296J244229J497624J781621K091050K415722K740819L050432
57086B5263520L328651L557849L719135L792845L752198L557381L169616K585492
57078E2726687J858731J079668L27167l62539r88137j556682k067482k511994
57070D8505419k878001l152227l324392l392816l366223l259940l091080k876715
$$ plain form
57062 23164025 20530208 18152051 16029670 14154428 12511896 11083651 9848707 8784969
57054 8784969 7870361 7083583 6404962 5817444 5307037 4862287 4473465 4132168 3831093
57045 3831093 3563538 3323108 3104202 2902774 2716455 2544037 2384982 2239030 2105693
57036 2105693 1984052 1873244 1773013 1683532 1604875 1537004 1480039 1434214 1400018 1379209 1375260
57025 1375260 1391044 1424464 1466077 1501674 1518261 1508960 1473920 1417903 1347239 1268149 1186341
57014 1186341 1106638 1032197 964204 902680 847500 798527 755153 716400 681618 650758 623852
57003 623852 600472 579865 561387 544592 528987 513980 499235 485043 472107 460818 450870 441827
56991 441827 433949 428088 424807 423965 425259 428758 434742 443289 454063 466000 477013 484552 486960 484204
$$ packed form
57062B3164025k633817k378157k122381j875242j642532j428245j234944j063738
57054H784969r14608p86778o78621n87518n10407m44750l88822l41297l01075
57045C831093k67555k40430k18906k01428j86319j72418j59055j45952j33337
57036B105693j21641j10808j00231q9481p8657o7871n6965m5825l4196k0809l949
57025A375260J5784L3420M1613L5597J6587r301l5040n6017p0664p9090q1808
57014A186341p9703p4441o7993o1524n5180m8973m3374l8753l4782l0860k6906
57003F23852k3380k0607j8478j6795j5605j5007j4745j4192j2936j1289r948r043
56991D41827p878n861l281q42J294L499N984Q547J0774J1937J1013P539K408k756
$$ plain form
56977 484204 477204 466894 454095 439704 424466 408859 393570 379719 368242 359340 352894 348979
56965 348979 347508 347885 349696 353519 360393 370684 384036 400165 418806 438774 457699 472897 482219
56952 482219 484275 478708 466594 450117 431450 412072 393080 375557 360260 347219 336069 326775
56940 326775 319858 315903 315062 317117 322100 330681 343788 361866 384572 410973 439503 467580 491717
56927 491717 508459 515428 511848 498770 478898 455511 430904 406001 381468 358553 338400 321120
56915 321120 306133 293083 281853 272107 263524 256261 250518 245804 241321 237007 233555 231300 229760
56902 229760 228405 227331 226949 227413 228654 230693 233617 237369 241711 246437 251668 257955 266010 276289
56888 276289 289001 304440 322824 343434 364123 382040 394854 401388 401595 396374 387194 375543
$$ packed form
56977D84204p000j0310j2799j4391j5238j5607j5289j3851j1477q902o446l915
56965C48979j471L77J811L823O874J0291J3352J6129J8641J9968J8925J5198R322
56952D82219K056n567j2114j6477j8667j9378j8992j7523j5297j3041j1150r294
56940C26775o917l955q41K055M983Q581J3107J8078K2706K6401K8530K8077K4137
56927D91717J6742O969l580j3078j9872k3387k4607k4903k4533k2915k0153j7280
56915C21120j4987j3050j1230r746q583p263n743m714m483m314l452k255j540
56902B29760j355j074l82M64J241K039K924L752M342M726N231O287Q055J0279
56888B76289J2712J5439J8384K0610K0689J7917J2814O534K07n221r180j1651
$$ plain form
56876 375543 362700 349995 338777 329811 323090 318578 316777 318276 323203 331619 344095 361335 383547
56863 383547 410803 443838 483797 530915 583422 637337 686967 726168 750268 757504 748923 727313
56851 727313 696333 660044 622351 586490 554894 529119 509684 496436 489436 489241 496263 510551
56839 510551 532621 563849 605509 657980 721397 796044 880588 969650 1053788 1122203 1165978
56828 1165978 1180364 1165804 1127144 1071126 1004208 932292 861034 794877 735947 684831 642232
56817 642232 608905 584479 567815 558785 558637 568327 587553 615813 653568 701543 758841 821484
56805 821484 882219 932065 963359 972426 959793 928531 882977 828367 770024 712041 656931 606416
56793 606416 561848 523790 491996 466108 446036 431700 422998 420059 423049 431878 446676 468170
$$ packed form
56876C75543j2843j2705j1218q966o721m512j801J499M927Q416J2476J7240K2212
56863C83547K7256L3035L9959M7118N2507N3915M9630L9201K4100P236q581k1610
56851G27313l0980l6289l7693l5861l1596k5775j9435j3248p000j95P022J4288
56839E10551K2070L1228M1660N2471O3417P4647Q4544Q9062Q4138O8415M3775
56828A165978J4386j4560l8660n6018o6918p1916p1258o6157n8930n1116m2599
56817F42232l3327k4426j6664r030j48R690J9226K8260L7755M7975N7298O2643
56805H21484O0735M9846L1294R067j2633l1262m5554n4610n8343n7983n5110n0515
56793F06416m4568l8058l1794k5888k0072j4336q702k939K990Q829J4798K1494
$$ plain form
56781 468170 496521 529529 562636 590747 609664 616424 609832 591188 563627 530300 493622 455992
56769 455992 419890 386748 356594 329266 305210 284766 267519 252910 240745 230608 221486 212625
56757 212625 204279 197059 190946 185412 180129 175151 170726 167235 164966 163606 162330 160648 158817 157223
56743 157223 155756 154112 152367 150928 150103 149863 149898 149861 149732 149819 150183 150371 150132 150008 150557 151326 151436 151029
56725 151029 151192 152488 154441 156489 158529 160374 161619 162261 162649 162747 162303 161871 162550 164438 166340 167365
56709 167365 167860 168365 168705 168730 168988 169891 170923 171382 171350 171329 171460 171673 172115 172891 173772 174525 175169 175689 176026
56690 176026 176488 177454 178537 178878 178526 178562 179457 180318 180301 179813 179586 179505 179210 179093 179702 180658 181070 180733 180186
56671 180186 179939 180216 181154 182669 184368 185973 187532 189017 190245 191440 193202 195592 197997 200251 203059
$$ packed form
56781D68170K8351L3008L3107K8111J8917O760o592j8644k7561l3327l6678l7630
56769D55992l6102l3142l0154k7328k4056k0444j7247j4609j2165j0137r122q861
56757B12625q346p220o113n534n283m978m425l491k269j360j276j682j831j594
56743A57223j467j644j745j439q25k40L5l7j29Q7L64J88k39j24N49P69J10m07
56725A51029J63J296J953K048K040J845J245O42L88R8m44m32O79J888J902J025
56709A67365M95N05L40K5K58R03J032M59l2k1J31K13M42P76Q81P53O44N20L37
56690A76026M62R66J083L41l52L6Q95Q61j7m88k27q1k95j17O09R56M12l37n47
56671A80186k47K77R38J515J699J605J559J485J228J195J762K390K405K254K808
$$ plain form
56656 203059 206804 210837 214553 218227 222034 225175 226943 227889 228957 230044 230478 230362 230422 230876 231410 231971
56640 231971 232702 233403 233845 234258 234713 234437 232653 229771 226878 224368 221981 219808 218202 216785 214616 211400
56624 211400 207724 204084 200463 196947 193982 191896 190679 190276 190519 190782 190243 188615 186318 184026 182374
56609 182374 181827 182297 183041 183395 183459 183658 183901 183754 183224 182803 182743 182702 182101 180678 178880 177810 178296 179806
56591 179806 180859 180891 180958 182046 183512 184138 184105 184701 186307 187818 188257 188055 188376 189746 191695 193472 194847
56574 194847 196213 197919 199646 200752 201129 201264 201506 201990 203343 206521 211617 217654 224035 231270 239866
56559 239866 249553 260187 272237 285301 297182 305644 310434 312488 312084 309163 304784 300556 296787
56546 296787 292597 287775 283210 279440 276062 272721 269659 267022 264511 261915 259306 256635 253729 250656
$$ packed form
56656B03059L745M033L716L674L807L141J768R46J068J087M34j16O0M54N34N61
56640B31971P31P01M42M13M55k76j784k882k893k510k387k173j606j417k169l216
56624B11400l676l640l621l516k965k086j217m03K43K63n39j628k297k292j652
56609A82374n47M70P44L54O4J99K43j47n30m21o0m1o01j423j798j070M86J510
56591A79806J053L2O7J088J466O26l3N96J606J511M39k02L21J370J949J777J375
56574A94847J366J706J727J106L77J35K42M84J353L178N096O037O381P235Q596
56559B39866R687J0634J2050J3064J1881Q462M790K054m04k921m379m228l769
56546B96787m190m822m565l770l378l341l062k637k511k596k609k671k906l073
$$ plain form
56532 250656 247624 244757 242454 241403 241469 241223 239563 237331 236155 236159 236085 235304 234271 233129 231435 229395
56516 229395 227986 227439 226792 225331 223483 221943 220839 220032 219391 218490 216907 215033 213804 213432 213193 212574
56500 212574 211778 210965 209953 208869 208200 207876 207130 205537 203487 201439 199457 197696 196571 196152 195999 195769
56484 195769 195470 195116 194830 195187 196622 198538 199886 200605 201525 202871 203983 204636 205438 206636 207672 208401
56468 208401 209675 212028 214725 216784 218194 219456 220546 221067 220968 220488 219623 218197 216299 214407 213172
56453 213172 213109 214183 215711 216991 217913 218686 219280 219744 220722 222787 225442 227616 229036 230191 231093 231174 230526
56436 230526 230123 230486 230998 230848 229918 228511 227004 225940 225673 225767 225444 224688 224111 223731 222951 221841 221392 222149
56418 222149 223518 224680 225312 225256 224481 223637 223604 224196 224367 224004 224363 226218 228676 230440 231278 231611 231641 231564
$$ packed form
56532B50656l032k867k303j051O6k46j660k232j176Mp4p81j033j142j694k040
56516B29395j409n47o47j461j848j540j104q07o41r01j583j874j229l72k39o19
56500B12574p96q13j012j084o69l24p46j593k050k048j982j761j125m19j53k30
56484A95769k99l54k86L57J435J916J348P19R20J346J112O53Q02J198J036P29
56468B08401J274K353K697K059J410J262J090N21r9m80q65j426j898j892j235
56453B13172o3J074J528J280R22P73N94M64R78K065K655K174J420J155R02Q1o48
56436B30526m03L63N12j50r30j407j507j064k67R4l23p56n77l80p80j110m49P57
56418B22149J369J162O32n6p75q44l3N92J71l63L59J855K458J764Q38L33L0p7
$$ plain form
56400 231564 231834 232447 232639 231938 230892 230242 230072 230265 231028 232266 233138 232985 232238 231839 232105 232623 232879 232602
56382 232602 231937 231545 232139 233738 235791 238031 240544 243053 244989 246412 247962 249812 251569 253311 255602
56367 255602 258211 260023 260626 260894 261504 261976 261744 261130 260668 260437 260675 262012 264427 266909 268832 270705
56351 270705 272902 274680 275303 275151 274917 274593 274108 274040 274697 275325 275255 275146 276039 277820 279619 281185 282885
56334 282885 284824 286913 289441 292645 296079 299190 302195 305636 309432 313145 316866 321071 325797 330529
56320 330529 334684 337748 339324 339586 339362 339248 338927 337762 335680 333188 330912 329450 329188 329883 330927 332195
56304 332195 334077 336487 338688 340378 342140 344460 347133 350021 353417 357178 360490 363110 365920 369564
56290 369564 373499 377080 380572 384280 387619 390135 392700 396609 401954 407824 413690 419760 426293 433316
$$ packed form
56400B31564K70O13J92p01j046o50j70J93P63J238Q72j53p47l99K66N18K56k77
56382B32602o65l92N94J599K053K240K513K509J936J423J550J850J757J742K291
56367B55602K609J812O03K68O10M72k32o14m62k31K38J337K415K482J923J873
56351B70705K197J778O23j52k34l24m85o8O57O28p0j09Q93J781J799J566J700
56334B82885J939K089K528L204L434L111L005L441L796L713L721M205M726M732
56320C30529M155L064J576K62k24j14l21j165k082k492k276j462k62O95J044J268
56304C32195J882K410K201J690J762K320K673K888L396L761L312K620K810L644
56290C69564L935L581L492L708L339K516K565L909N345N870N866O070O533P023
$$ plain form
56276 433316 440792 448589 456569 464937 473997 483460 492734 502039 512300 523752 535753 548232 561966
56263 561966 576982 592267 607870 625793 647645 672788 699994 729745 763402 801175 842533
56252 842533 887974 938948 996409 1060577 1131684 1209859 1294606 1385203 1481102 1581281 1683956
56241 1683956 1787624 1891372 1993291 2089701 2177104 2253902 2319032 2370098 2404469 2421497 2422158
56230 2422158 2407120 2376739 2332526 2277035 2212403 2140120 2062025 1980333 1896820 1812767 1729389
56219 1729389 1647567 1567620 1490080 1416069 1346238 1280161 1217592 1159363 1106063 1056822 1010548
56208 1010548 967423 927959 891537 857266 825432 796700 770630 746387 724166 704544 687117
56197 687117 671220 657260 645830 636234 627362 619390 613022 607731 602432 597434 594038 592541 592172 592609
$$ packed form
56276D33316P476P797P980Q368R060R463R274R305J0261J1452J2001J2479J3734
56263E61966J5016J5285J5603J7923K1852K5143K7206K9751L3657L7773M1358
56252H42533M5441N0974N7461O4168P1107P8175Q4747R0597R5899J00179J02675
56241A683956J03668J03748J01919R6410Q7403P6798O5130N1066L4371J7028O61
56230B422158j5038l0381m4213n5491o4632p2283p8095q1692q3513q4053q3378
56219A729389q1822p9947p7540p4011o9831o6077o2569n8229n3300m9241m6274
56208A010548m3125l9464l6422l4271l1834k8732k6070k4243k2221j9622j7427
56197F87117j5897j3960j1430r596q872p972o368n291n299m998l396j497l69M37
$$ plain form
56183 592609 593913 595267 595384 594192 592826 592115 592190 593237 595383 598101 600847 603928 607757 611869 615730
56168 615730 619802 624668 629911 635126 641117 648705 657280 665977 675310 686001 697259 708110 719538
56155 719538 733237 748972 765334 782548 802333 825343 850933 879325 911996 949992 993799
56144 993799 1044966 1106169 1179475 1265714 1365068 1476547 1596928 1721431 1845066 1962473
56134 1962473 2067976 2158219 2234486 2300793 2360326 2415025 2466928 2516838 2562003 2597686 2621198
56123 2621198 2632881 2634129 2626942 2614708 2600265 2582598 2557218 2519657 2466920 2396605 2307745 2202978
56111 2202978 2087776 1967370 1846049 1728653 1620016 1522682 1437030 1363257 1301216 1249017
56101 1249017 1204297 1166578 1136079 1110985 1088672 1069112 1054156 1043769 1035945 1030021 1026991 1026619
$$ packed form
56183E92609J304J354J17j192j366p11P5J047K146K718K746L081L829M112L861
56168F15730M072M866N243N215N991P588Q575Q697R333J0691J1258J0851J1428
56155G19538J3699J5735J6362J7214J9785K3010K5590K8392L2671L7996M3807
56144I93799N1167O1203P3306Q6239R9354J11479J20381J24503J23635J17407
56134A962473J05503R0243P6267O6307N9533N4699N1903M9910M5165L5683K3512
56123B621198J1683J248p187j2234j4443j7667k5380l7561n2737p0315q8860j04767
56111B202978j15202j20406j21321j17396j08637r7334q5652p3773o2041n2199
56101A249017m4720l7719l0499k5094k2313j9560j4956j0387p824n924l030l72
$$ plain form
56089 1026619 1027345 1029082 1033046 1038738 1044191 1049290 1055692 1063303 1070171 1076191 1083496 1092605 1101542 1109554
56075 1109554 1118447 1129211 1140342 1150621 1160876 1172052 1184071 1197246 1212325 1228582 1244450
56064 1244450 1260364 1278257 1298023 1317497 1336156 1355692 1376574 1397307 1417544 1438556 1460094
56053 1460094 1480182 1498627 1517337 1536609 1554663 1571497 1589518 1609523 1629696 1649484 1670763
56042 1670763 1694200 1718187 1742401 1768791 1797960 1828172 1858819 1891147 1924777 1957570 1989922
56031 1989922 2025032 2063882 2104166 2145199 2189398 2237549 2287172 2337091 2389159 2443913 2499111
56020 2499111 2554232 2611890 2673139 2735932 2799817 2867348 2939200 3012873 3088020 3167929 3253808
56009 3253808 3342798 3433630 3528873 3629500 3732872 3838435 3949793 4068743 4192989 4322118
$$ packed form
56089A026619P26J737L964N692N453N099O402P611O868O020P305R109Q937Q012
56075A109554Q893J0764J1131J0279J0255J1176J2019J3175J5079J6257J5868
56064A244450J5914J7893J9766J9474J8659J9536K0882K0733K0237K1012K1538
56053A460094K0088J8445J8710J9272J8054J6834J8021K0005K0173J9788K1279
56042A670763K3437K3987K4214K6390K9169L0212L0647L2328L3630L2793L2352
56031A989922L5110L8850M0284M1033M4199M8151M9623M9919N2068N4754N5198
56020B499111N5121N7658O1249O2793O3885O7531P1852P3673P5147P9909Q5879
56009C253808Q8990R0832R5243J00627J03372J05563J11358J18950J24246J29129
$$ plain form
55999 4322118 4459766 4607318 4761727 4922285 5093104 5276102 5468304 5669118 5883220
55990 5883220 6112947 6355182 6609264 6880434 7171703 7480274 7806107 8155890 8534185
55981 8534185 8939203 9372015 9841045 10352333 10904559 11499048 12145265 12851046 13617794
55972 13617794 14451499 15367957 16380991 17497392 18730652 20107745 21655643 23395534
55964 23395534 25359338 27598453 30169253 33128800 36557716 40573089 45313713 50940789
55956 50940789 57674062 65812249 75712221 87782604 102517503 120506581 142398780
55949 142398780 168873264 200519856 237335886 277836911 318465500 354137668 379890715
55942 379890715 392563990 391468841 377988148 354772830 325035621 291975998 258296317
$$ packed form
55999D322118J37648J47552J54409J60558J70819J82998J92202K00814K14102
55990E883220K29727K42235K54082K71170K91269L08571L25833L49783L78295
55981H534185M05018M32812M69030N11288N52226N94489O46217P05781P66748
55972A3617794Q33705R16458J013034J116401J233260J377093J547898J739891
55964B3395534J963804K239115K570800K959547L428916M015373M740624N627076
55956E0940789O733273Q138187R899972J2070383J4734899J7989078K1892199
55949A42398780K6474484L1646592L6816030M0501025M0628589L5672168K5753047
55942C79890715J2673275j095149j3480693k3215318k9737209l3059623l3679681
$$ plain form
55935 258296317 225933999 196080777 169350002 145930306 125712633 108426285 93746546
55928 93746546 81334258 70847568 61972434 54448655 48060012 42615473 37953750 33951031
55920 33951031 30506686 27527691 24934994 22672093 20694022 18954999 17415047 16048477
55912 16048477 14835124 13750361 12771933 11888478 11092326 10370478 9710367 9107571 8559726
55903 8559726 8058529 7594888 7166244 6771952 6406801 6065637 5749225 5459106 5191317
55894 5191317 4941029 4708635 4495513 4298372 4113507 3942206 3786289 3642408 3506381
55885 3506381 3379400 3264497 3160258 3063096 2972307 2887802 2805977 2722881 2638967 2556418 2474589
55874 2474589 2392255 2311444 2234619 2160569 2087099 2015322 1947505 1883194 1821193 1762836 1709663
$$ packed form
55935B58296317l2362318k9853222k6730775k3419696k0217673j7286348j4679739
55928I3746546j2412288j0486690q875134p523779o388643n444539m661723m002719
55920C3951031l444345k978995k592697k262901j978071j739023j539952j366570
55912A6048477j213353j084763r78428q83455p96152p21848o60111o02796n47845
55903H559726n01197m63641m28644l94292l65151l41164l16412k90119k67789
55894E191317k50288k32394k13122j97141j84865j71301j55917j43881j36027
55885C506381j26981j14903j04239r7162r0789q4505q1825q3096q3914q2549q1829
55874B474589q2334q0811p6825p4050p3470p1777o7817o4311o2001n8357n3173
$$ plain form
55863 1709663 1660318 1613254 1569865 1531450 1495704 1459861 1424716 1391873 1359669 1325836 1291903
55852 1291903 1260919 1232673 1204972 1177823 1152580 1128521 1103887 1078973 1054892 1030740 1005209
55841 1005209 979608 956091 934205 912234 890599 870926 852996 835540 818880 804035 790454
55830 790454 777255 765381 755950 747843 739517 731627 725154 718482 709318 698154 686999 675960 663967
55817 663967 651625 640307 629431 617619 605657 595438 586733 577862 568912 561559 556225 552022 548992
55804 548992 547896 548226 548779 549813 552460 556531 560958 565756 571354 576561 579386 579367 577232 573032 566722
55789 566722 559728 553678 548177 542015 535903 531777 529807 528173 525326 520572 513132 502749 490765 478701
55775 478701 466503 454008 443064 435865 432048 429831 429183 431147 434587 436530 435738 433423 430444 426333
$$ packed form
55863A709663m9345m7064m3389l8415l5746l5843l5145l2843l2204l3833l3933
55852A291903l0984k8246k7701k7149k5243k4059k4634k4914k4081k4152k5531
55841A005209k5601k3517k1886k1971k1635j9673j7930j7456j6660j4845j3581
55830G90454j3199j1874r431q107q326p890o473o672r164j1164j1155j1039j1993
55817F63967j2342j1318j0876j1812j1962j0219q705q871q950p353n334m203l030
55804E48992j096L30N53J034K647M071M427M798N598N207K825j9k135m200o310
55789E66722o994o050n501o162o112m126j970j634k847m754p440j0383j1984j2064
55775D78701j2198j2495j0944p199l817k217o48J964L440J943p92k315k979m111
$$ plain form
55761 426333 421232 416289 411661 406283 400028 394140 389090 383837 377622 370825 363679 355767 347147 338540
55747 338540 330134 321536 313035 305557 299300 293726 288857 285201 282488 279903 277498 275936 274965 273605
55733 273605 271820 270537 269971 269295 267912 265808 262817 258892 254868 251529 248246 243981 239294 235649 232989
55718 232989 229864 225955 222577 220522 219151 218063 218009 219642 222642 226484 230987 235881 240831 245930 251147
55703 251147 255498 257932 258778 258992 258389 256120 252603 249126 245618 240666 233965 227011 221068 216092 211970
55688 211970 209129 207432 206023 204846 204907 206540 208727 210687 212844 215714 219094 222798 226986 231175 234108
55673 234108 235145 234829 233748 231901 229566 227631 226567 225999 225623 225547 225508 224870 223728 222938 222773 222687 222616 223200
55655 223200 224330 224829 224198 223498 223866 225253 227194 229642 232172 233451 232497 229863 226752 223547 219900
$$ packed form
55761D26333n101m943m628n378o255n888n050n253o215o797p146p912q620q607
55747C38540q406q598q501p478o257n574m869l656k713k585k405j562r71j360
55733B73605j785j283n66o76j383k104k991l925m024l339l283m265m687l645k660
55718B32989l125l909l378k055j371j088n4J633L000L842M503M894M950N099N217
55703B51147M351K434Q46K14o03k269l517l477l508m952o701o954n943m976m122
55688B11970k841j697j409j177O1J633K187J960K157K870L380L704M188M189K933
55673B34108J037l16j081j847k335j935j064n68l76p6l9o38j142p90j65q6p1N84
55655B23200J130M99o31p00L68J387J941K448K530J279r54k634l111l205l647
$$ plain form
55640 219900 215732 211417 207254 203238 199122 194511 189211 183604 178334 173685 169695 166639 164688 163310
55626 163310 161855 160543 159934 159588 158430 156469 154960 154603 154657 154124 152839 151121 149306 147860 147053 146266
55610 146266 144527 141928 139598 138151 137156 136272 135842 136091 136714 137446 138111 138006 136427 133918 131843 130503
55594 130503 128999 127124 125888 125693 125458 124304 122806 121807 121183 120627 120470 120828 120930 120229 119363 119129 119328
55577 119328 119398 119473 120010 121109 122875 125730 129654 133800 137519 141048 144622 147681 149672 150846 151563 151580
55561 151580 150757 149702 148904 147911 146141 143856 141613 139378 136993 134901 133620 133002 132665 132577 132563 131961 130564
55544 130564 129296 129112 129732 130201 130158 129799 129168 128351 127918 128362 129445 130740 132318 134178 135566 135726 134890
55527 134890 133704 132165 129933 127311 124974 123019 121124 119395 118175 117296 116332 115444 115159 115488 115983 116518
$$ packed form
55640B19900m168m315m163m016m116m611n300n607n270m649l990l056j951j378
55626A63310j455j312o09l46j158j961j509l57N4n33j285j718j815j446q07p87
55610A46266j739k599k330j447r95q84m30K49O23P32O65j05j579k509k075j340
55594A30503j504j875j236j95k35j154j498r99o24n56j57L58J02p01q66k34J99
55577A19328P0P5N37J099J766K855L924M146L719L529L574L059J991J174P17J7
55561A51580q23j055p98r93j770k285k243k235k385k092j281o18l37q8j4o02j397
55544A30564j268j84O20M69m3l59o31q17m33M44J083J295J578J860J388J60q36
55527A34890j186j539k232k622k337j955j895j729j220q79r64q88k85L29M95N35
$$ plain form
55511 116518 117246 117967 118299 118461 119124 120423 121694 122203 121719 120508 119191 118445 118285 117834 116412 114616 113641
55494 113641 113597 113245 111526 108784 106233 104628 103730 102865 101802 101024 101050 101709 102403 103002 103845 104746 104815 103700
55476 103700 102303 101627 101541 101388 101267 101746 102619 102956 102356 101328 100352 99314 98026 96697 95646 94920 94384
55459 94384 93851 93095 91960 90516 88976 87604 86861 87299 88934 90982 92616 93734 94594 95054 94834 94333
55443 94333 94400 95163 95736 95328 94223 93350 93181 93340 93185 92534 91813 91553 91895 92661 93737 95037 96114 96326
55425 96326 95654 94942 94979 95646 96317 96786 97266 97718 97808 97621 97833 98866 100150 100575 99719 98380 97732 98001 98268
55406 98268 97677 96488 95621 95450 95565 95650 96016 97087 98761 100464 101590 101881 101619 101346 101092 100161 98201
55389 98201 96199 95544 96221 96833 96540 95999 96078 96597 96866 96720 96444 96250 96293 96676 97048 96781 95971 95657 96633
$$ packed form
55511A16518P28P21L32J62O63J299J271N09m84j211j317p46j60m51j422j796r75
55494A13641m4l52j719k742k551j605q98q65j063p78K6O59O94N99Q43R01O9j115
55476A03700j397o76q6j53j21M79Q73L37o00j028r76j038j288j329j051p26n36
55459I4384n33p56j135j444j540j372p43M38J635K048J634J118Q60M60k20n01
55443I4333O7P63N73m08j105q73j69J59j55o51p21k60L42P66J076J300J077K12
55425I6326o72p12L7O67O71M69M80M52R0j87K12J033J284M25q56j339o48K69K67
55406I8268n91j189q67j71J15Q5L66J071J674J703J126K91k62k73k54r31j960
55389I8201k002o55O77O12k93n41P9N19K69j46k76j94M3L83L72k67q10l14R76
$$ plain form
55370 96633 98588 100739 102618 103854 104005 103254 102541 102405 102338 101824 101226 100952 100574 99654 98739 98533 98649 98224
55352 98224 97369 96961 97292 97864 98280 98421 97963 96687 95124 94078 93595 93142 92627 92463 92746 93157 93593 94128
55334 94128 94506 94393 94089 94266 95036 95895 96510 96916 97061 96845 96512 96388 96343 96135 96058 96538 97319 97792 97995 98487
55314 98487 99275 99658 99129 97806 96063 94441 93757 94441 95743 96373 95938 95080 94312 93604 93116 93382 94462
55297 94462 95639 96209 96017 95139 93687 92122 91174 91178 91883 92868 93688 93776 92925 91893 91833 93011 94635 95916
55279 95916 96642 96762 96204 95279 94587 94384 94515 94918 95537 95829 95204 93989 93182 93157 93387 93509 93833 94593 95557
55260 95557 96532 97480 97979 97468 96288 95531 95545 95484 94824 94331 94913 96304 97635 98642 99557 100298 100621 100791
55242 100791 101385 102448 103331 103362 102447 101172 100449 100832 102035 103292 104138 104492 104104 102581 100152 97790 96378
$$ packed form
55370I6633J955K151J879J236J51p51p13j36o7n14n98k74l78r20r15k06J16m25
55352I8224q55m08L31N72M16J41m58j276j563j046m83m53n15j64K83M11M36N35
55334I4128L78j13l04J77P70Q59O15M06J45k16l33j24m5k08p7M80P81M73K03M92
55314I8487P88L83n29j323j743j622o84O84J302O30m35q58p68p08m88K66J080
55297I4462J177N70j92q78j452j565r48MP05R85Q20Q8q51j032o0J178J624J281
55279I5916P26J20n58r25o92k03J31M03O19K92o25j215q07k5K30J22L24P60R64
55260I5557R75R48M99n11j180p57J4o1o60m93N82J391J331J007R15P41L23J70
55242A00791N94J063Q83L1r15j275p23L83J203J257Q46L54l88j523k429k362j412
$$ plain form
55225 96378 96137 96860 98075 98920 98654 97538 96532 95955 95207 94034 93149 93159 93761 94511 95541 96908 97948
55208 97948 98103 97776 97642 97621 97279 96770 96584 96696 96687 96477 96306 96253 96301 96559 96906 96792 96005 95251 95351 96198 97159
55187 97159 98063 99049 99773 99718 99097 98613 98370 97931 97388 97483 98439 99485 99831 99484 98809 97912 96856 96007 95731
55168 95731 95945 96260 96394 96298 96133 96293 97245 99109 101444 103499 104606 104423 103113 101353 99972 99379 99374 99480
55150 99480 99394 99214 99353 100181 101602 103073 104105 104642 104840 104789 104663 104852 105544 106344 106693 106528 106116 105436 104288
55131 104288 102985 102294 102436 102651 102116 100973 100076 99953 100419 101062 101662 102119 102303 102219 102143 102435 103246 104421
55113 104421 105568 106093 105464 103744 101850 100900 101106 101583 101433 100776 100485 101155 102680 104609 106404 107483
55097 107483 107591 107268 107446 108340 109137 109063 108347 107845 108016 108657 109384 109940 110132 109904 109465 109030 108457 107461 106234
$$ packed form
55225I6378k41P23J215Q45k66j116j006n77p48j173q85J0O02P50J030J367J040
55208I7948J55l27j34k1l42n09j86J12rk10j71n3M8K58L47j14p87p54J00Q47R61
55187I7159R04R86P24n5o21m84k43m39n43R5R56J046L46l47o75q97j056q49k76
55168I5731K14L15J34r6j65J60R52J864K335K055J107j83j310j760j381n93nJ06
55150I9480q6j80J39Q28J421J471J032N37J98n1j26J89O92Q00L49j65m12o80j148
55131A04288j303o91J42K15n35j143q97j23M66O43O00M57J84q4p6K92Q11J175
55113A04421J147N25o29j720j894r50K06M77j50o57k91O70J525J929J795J079
55097A07483J08l23J78Q94P97p4p16n02J71O41P27N56J92k28m39m35n73r96j227
$$ plain form
55078 106234 105495 105736 106659 107631 108526 109739 111324 112555 112734 112169 111801 111846 111470 110124 108569 107954 108218
55061 108218 108213 107286 105992 105170 105042 105451 106315 107420 108244 108403 108034 107486 106937 106560 106677 107340 108029 108069 107231
55042 107231 105781 104170 102893 102316 102360 102603 102914 103670 105094 106676 107662 107931 108080 108746 110064 111567 112427
55025 112427 112016 110570 109110 108478 108595 108839 108878 108823 108806 108740 108393 107568 106408 105660 106181 107900 109678 110602
55007 110602 111027 111849 113158 114293 115011 115749 116686 117264 116976 116171 115755 116295 117575 118867 119549 119651 119770
54990 119770 120308 120898 120903 120382 120087 120444 121018 121192 121026 121057 121478 121934 122077 121983 121908 121866 121654 121215 120780 120631 120847
54969 120847 121316 121876 122379 122783 123282 124191 125485 126633 127140 127182 127389 128034 128813 129390 129770 130055 130185 130121 129980
54950 129980 129839 129618 129264 128772 128003 126828 125549 124784 124767 125121 125528 126150 127103 127979 128293 128124 127872 127648
$$ packed form
55078A06234p39K41R23R72Q95J213J585J231J79n65l68M5l76j346j555o15K64
55061A08218nr27j294q22j28M09Q64J105Q24J59l69n48n49l77J17O63O89M0q38
55042A07231j450j611j277n77M4K43L11P56J424J582R86K69J49O66J318J503Q60
55025A12427m11j446j460o32J17K44L9n5j7o6l47q25j160p48N21J719J778R24
55007A10602M25Q22J309J135P18P38R37N78k88q05m16N40J280J292O82J02J19
54990A19770N38N90Nn21k95L57N74J74j66L1M21M56J43r4p5m2k12m39m35j49K16
54969A20847M69N60N03M04M99R09J294J148N07M2K07O45P79N77L80K85J30o4j41
54950A29980j41k21l54m92p69j175j279p65j7L54M07O22R53Q76L14j69k52k24
$$ plain form
54932 127648 127301 126925 126863 127287 128060 128971 129858 130561 131043 131551 132522 134321 137119 140914 145648 151401 158383
54915 158383 166424 174567 181593 186998 191043 193804 194763 193527 190405 185944 180420 174138 167704 161598
54901 161598 155881 150651 146288 142816 139623 136342 133475 131570 130287 128994 127803 127235 127200 127178 127167 127614
54885 127614 128560 129697 131186 133536 136610 139566 141943 144160 146754 149817 153338 157521 162501 168208
54871 168208 174626 181690 188730 194493 197922 198691 197043 193580 189150 184343 178983 172651 165743 159409
54857 159409 154260 149791 145359 141131 137736 135443 134055 133223 132478 131317 129654 128002 126913 126364 125891
54842 125891 125085 123806 122123 120327 118837 117947 117730 118137 118948 119594 119450 118486 117388 116892 117166 117894 118607
54825 118607 118858 118410 117516 116862 116985 117838 118920 119674 119757 119244 118630 118434 118693 119043 119258 119415 119535 119491 119354
$$ packed form
54932A27648l47l76o2M24P73R11Q87P03M82N08R71J799K798L795M734N753O982
54915A58383Q041Q143P026N405M045K761R59j236l122m461n524o282o434o106
54901A61598n717n230m363l472l193l281k867j905j283j293j191n68l5k2j1M47
54885A27614R46J137J489K350L074K956K377K217K594L063L521M183M980N707
54871A68208O418P064P040N763L429P69j648l463m430m807n360o332o908o334
54857A59409n149m469m432m228l395k293j388q32p45j161j663j652j089n49m73
54842A25891q06j279j683j796j490q90k17M07Q11O46j44r64j098m96K74P28P13
54825A18607K51m48q94o54J23Q53J082P54Q3n13o14j96K59L50K15J57J20m4j37
$$ plain form
54806 119354 119467 119937 120410 120572 120704 121443 123100 125312 127309 128423 128481 127777 126652 125270 123929 123310 123938
54789 123938 125408 126589 126738 126136 125553 125437 125758 126247 126595 126621 126485 126580 127098 127853 128600 129359 130298 131482
54771 131482 132834 134293 136025 138496 142182 147035 152442 157928 163668 169958 176421 182320 187500 192376
54757 192376 196854 199897 200484 198640 195248 191172 186777 182004 176668 170802 164888 159608 155290 151779
54743 151779 148807 146247 143998 141940 140075 138510 137263 136277 135606 135333 135400 135819 136842 138490 140066 140763
54727 140763 140773 141232 142924 145627 148885 152825 157775 163547 169516 175266 180812 186287 191506 195805 198343
54712 198343 198755 197427 194947 191467 186980 181930 176924 171957 166565 160789 155332 150692 146790 143602
54698 143602 141470 140558 140536 140989 141579 141725 140841 139124 137422 136080 134648 132991 131843 131803 132499 133265 133936
$$ packed form
54806A19354J13M70M73J62J32P39J657K212J997J114N8p04j125j382j341o19O28
54789A23938J470J181J49o02n83j16L21M89L48K6j36R5N18P55P47P59R39J184
54771A31482J352J459J732K471L686M853N407N486N740O290O463N899N180M876
54757A92376M478L043N87j844l392m076m395m773n336n866n914n280m318l511
54743A51779k972k560k249k058j865j565j247r86o71k73O7M19J023J648J576O97
54727A40763J0M59J692K703L258L940M950N772N969N750N546N475N219M299K538
54712A98343M12j328k480l480m487n050n006m967n392n776n457m640l902l188
54698A43602k132r12k2M53N90J46q84j717j702j342j432j657j148m0O96P66O71
$$ plain form
54681 133936 134447 134372 133612 132892 132843 133053 132727 131844 130941 130153 129190 127971 126587 124988 123352 122384 122485 122961
54663 122961 122920 122631 123091 124382 125454 125586 125171 124869 124747 124627 124666 125234 126510 128418 130607 132407 133214
54646 133214 133086 132724 132757 133222 133750 133982 133828 133503 133276 133052 132426 131404 130749 131184 132460 133670 134321 134628
54628 134628 134896 135169 135404 135488 135089 133999 132609 131561 130932 130287 129546 129239 129722 130608 131261 131490 131544 131660
54610 131660 131846 131977 131994 132037 132327 132796 133036 132816 132439 132274 132187 131883 131596 131838 132516 132898 132584 132028 131857 132116
54590 132116 132365 132248 131712 130868 129800 128493 126992 125685 125216 125831 127013 128086 128952 129809 130450 130490 130210
54573 130210 130402 131256 132027 132055 131580 131307 131624 132546 133940 135416 136318 136200 135216 133879 132665 132004 132238 133291
54555 133291 134514 135158 134958 134204 133416 133071 133393 134260 135429 136877 138722 140837 142868 144693 146502 148353
$$ packed form
54681A33936N11p5p60p20m9K10l26q83r03p88r63j219j384j599j636r68J01M76
54663A22961m1k89M60J291J072J32m15l02j22j20L9N68J276J908K189J800Q07
54646A33214j28l62L3M65N28K32j54l25k27k24o26j022o55M35J276J210O51L07
54628A34628K68K73K35Q4l99j090j390j048o29o45p41l07M83Q86O53K29N4J16
54610A31660J86J31J7M3K90M69K40k20l77j65q7l04k87K42O78L82l14n56j71K59
54590A32116K49j17n36q44j068j307j501j307m69O15J182J073Q66Q57O41M0k80
54573A30210J92Q54P71K8m75k73L17R22J394J476R02j18r84j337j214o61K34J053
54555A33291J223O44k00p54p88l45L22Q67J169J448J845K115K031J825J809J851
$$ plain form
54539 148353 149992 151255 152244 152949 153142 152951 153076 153984 155075 155173 153780 151466 149110 147144 145560 144255
54523 144255 143131 142057 140956 139906 139055 138467 138150 138203 138780 139787 140713 141038 140875 140972 141879 143238 144105
54506 144105 143921 142926 141700 140585 139624 138856 138470 138683 139429 140245 140614 140519 140448 140711 141020 140942 140509 139992 139379
54487 139379 138595 138092 138565 139950 141248 141597 141145 140681 140745 141350 142276 143366 144692 146580 149274 152384 154931
54470 154931 156162 156250 156092 156537 157832 159573 161066 161923 162427 163157 164198 164943 164813 163918 162876 162138 161670
54453 161670 161202 160642 160270 160467 161132 161469 160700 159024 157584 157310 158055 158969 159373 159047 157985 156275 154210
54436 154210 152247 150798 150117 150309 151338 153031 155140 157336 159162 160220 160496 160390 160297 160250 160035 159624 159387
54419 159387 159843 161189 163057 164794 165949 166353 165809 164120 161650 159425 158199 157610 156717 155206 153616
$$ packed form
54539A48353J639J263R89P05J93j91J25R08J091R8j393k314k356j966j584j305
54523A44255j124j074j101j050q51n88l17N3N77J007R26L25j63R7R07J359Q67
54506A44105j84r95j226j115r61p68l86K13P46Q16L69r5p1K63L09p8m33n17o13
54487A39379p84n03M73J385J298L49m52m64O4O05R26J090J326J888K694L110K547
54470A54931J231Q8j58M45J295J741J493Q57N04P30J041P45j30q95j042p38m68
54453A61670m68n60l72J97O65L37p69j676j440k74P45R14M04l26j062j710k065
54436A54210j963j449o81J92J029J693K109K196J826J058K76j06r3m7k15m11k37
54419A59387M56J346J868J737J155M04n44j689k470k225j226n89q93j511j590
$$ plain form
54404 153616 152520 152137 152700 154439 156970 159260 160548 160921 160792 160353 159847 159823 160622 161898 163099 164195
54388 164195 165500 167013 168374 169411 170272 171009 171326 170880 169698 168269 167208 166794 166816 166969 167278 167898 168586
54371 168586 168877 168804 168965 169641 170288 170231 169469 168522 167884 167965 169142 171358 173931 176203 178212 180339 182574
54354 182574 184558 186120 187274 187913 188082 188347 189245 190434 190977 190537 189623 188609 187193 185098 182715 180625
54338 180625 178917 177368 175933 174648 173335 171863 170482 169421 168319 166550 164157 161919 160372 159216
54324 159216 157965 156758 156048 155735 155228 154453 154205 155151 156803 157981 158120 157725 157584 158006 158855 159824 160432
54307 160432 160201 159274 158591 158977 160097 160737 160149 158776 157632 157283 157623 158286 158938 159216 158763 157476 155639
54290 155639 153720 152089 151013 150772 151494 152840 154104 154860 155381 156134 156985 157286 156813 156280 156654 158148 160063
$$ packed form
54404A53616j096l83N63J739K531K290J288L73j29m39n06k4P99J276J201J096
54388A64195J305J513J361J037Q61P37L17m46j182j429j061m14K2J53L09O20O88
54371A68586K91p3J61O76O47n7p62r47o38Q1J177K216K573K272K009K127K235
54354A82574J984J562J154O39J69K65Q98J189N43m40r14j014j416k095k383k090
54338A80625j708j549j435j285j313j472j381j061j102j769k393k238j547j156
54324A59216j251j207p10l13n07p75k48R46J652J178J39l95j41M22Q49R69O08
54307A60432k31r27o83L86J120O40n88j373j144l49L40O63O52K78m53j287j837
54290A55639j919j631j076k41P22J346J264P56N21P53Q51L01m73n33L74J494J915
$$ plain form
54273 160063 161459 161790 161091 159841 158676 157988 157720 157681 158013 159105 160977 162973 164292 164807 165128 165847 166891
54256 166891 167784 168297 168581 168750 168763 168819 169426 170732 172077 172583 172084 171118 170147 169205 168284 167560 167050 166413 165332
54237 165332 163860 162232 160545 158782 157085 155833 155432 156040 157364 158862 160232 161605 163105 164451 165281
54222 165281 165654 165800 165596 164812 163809 163377 163816 164686 165512 166115 166181 165261 163548 162030 161428 161447 161459 161398 161487
54203 161487 161560 161226 160403 159262 157990 157032 157083 158189 159198 158835 157216 155681 155211 155598 156103 156281 156082
54186 156082 155649 155211 154880 154510 154051 153942 154752 156451 158377 159917 160864 161255 161259 161189 161235 161224 160999 160902 161346 162003
54166 162003 161972 160838 159146 157811 157512 158598 160805 162914 163484 162366 160983 160637 161015 160923 160078 159386 159498
54149 159498 159880 159583 158521 157585 157617 158618 159959 161078 161791 162030 161718 161046 160587 160741 161157 161112 160532 160251
$$ packed form
54273A60063J396L31o99j250j165o88k68l9L32J092J872J996J319N15L21P19J044
54256A66891Q93N13K84J69J3N6O07J306J345N06m99r66r71r42r21p24n10o37j081
54237A65332j472j628j687j763j697j252m01O08J324J498J370J373J500J346Q30
54222A65281L73J46k04p84j003m32M39Q70Q26O03O6r20j713j518o02J9J2o1Q9
54203A61487P3l34q23j141j272r58N1J106J009l63j619j535m70L87N05J78j99
54186A56082m33m38l31l70m59j09Q10J699J926J540R47L91Mp0M6j1k25r7M44O57
54166A62003l1j134j692j335k99J086K207K109N70j118j383l46L78r2q45o92J12
54149A59498L82k97j062r36L2J001J341J119P13K39l12o72m59J54M16m5n80k81
$$ plain form
54131 160251 161037 162610 163957 164465 164398 164258 164042 163394 162340 161474 161333 161829 162583 163574 165085 167023 168772
54114 168772 169898 170632 171369 172007 172154 171792 171348 171198 171409 171902 172518 172939 172863 172368 171902 171861 172216 172555 172446
54095 172446 171918 171609 172154 173293 173926 173361 172148 171297 171018 170799 170433 170312 170729 171568 172764 174477 176671
54078 176671 179010 181370 184000 187119 190785 195296 201068 207829 214443 219963 224509 228719 232603 235335
54064 235335 236012 234332 230740 226232 221864 218115 214729 211254 207594 203991 200802 198512 197604 198054 199141
54049 199141 200123 200900 201763 202738 203645 204618 206062 208081 210391 212839 215558 218547 221627 225064 229695 235887
54033 235887 242668 248529 253079 257367 262492 268406 274329 279730 284357 287755 289582 290416 291514 293519
54019 293519 295916 297970 299607 300955 301580 300847 298806 296095 293064 289541 285433 281043 276716 272630 268969
$$ packed form
54131A60251P86J573J347N08o7j40k16o48j054q66j41M96P54R91J511J938J749
54114A68772J126P34P37O38J47l62m44j50K11M93O16M21p6m95m66m1L55L39j09
54095A72446n28l09N45J139O33n65j213q51k79k19l66j21M17Q39J196J713K194
54078A76671K339K360K630L119L666M511N772O761O614N520M546M210L884K732
54064B35335O77j680l592m508m368l749l386l475l660l603l189k290r08M50J087
54049A99141R82P77Q63R75R07R73J444K019K310K448K719K989L080L437M631O192
54033B35887O781N861M550M288N125N914N923N401M627L398J827Q34J098K005
54019B93519K397K054J637J348O25p33k041k711l031l523m108m390m327m086l661
$$ plain form
54004 268969 265846 263018 260153 257515 255839 255324 255221 254780 254183 254087 254498 254643 253857 252127 249674 246423
53988 246423 242188 237199 232149 227664 223895 220700 218037 215958 214312 212761 211177 209798 208820 208102 207455
53973 207455 206987 206912 207200 207710 208452 209387 210132 210268 209916 209663 209946 210810 212156 213830 215502 216889 218096
53956 218096 219371 220532 221059 220852 220491 220637 221499 222949 224777 226713 228482 230071 231768 233932 236833
53941 236833 240583 244926 249274 253403 257958 263752 270622 277548 283902 289969 296199 302634 309282 316413
53927 316413 324317 333359 344365 358100 373901 389407 402119 410798 415290 415945 413860 410842 408196
53914 408196 405885 403552 401829 401789 403425 405585 407282 408325 408801 408798 408700 409004 409594 409692 408598 406109 402322
53897 402322 397612 392803 388677 385120 381223 376322 370513 364114 357289 350388 344018 338352 332762 326540
$$ packed form
54004B68969l123k828k865k638j676n15j03m41n97r6M11J45p86j730k453l251
53988B46423m235m989n050m485l769l195k663k079j646j551j584j379r78p18o47
53973B07455m68p5K88N10P42R35P45J36l52k53K83Q64J346J674J672J387J207
53956B18096J275J161N27k07l61J46Q62J450J828J936J769J589J697K164K901
53941B36833L750M343M348M129M555N794O870O926O354O067O230O435O648P131
53927C16413P904R042J1006J3735J5801J5506J2712Q679M492O55k085l018k646
53914D08196k311k333j723m0J636K160J697J043M76lr8L04N90R8j094k489l787
53897D02322m710m809m126l557l897m901n809o399o825o901o370n666n590o222
$$ plain form
53883 326540 319664 312569 305492 298527 292075 286686 282373 278492 274464 270394 266766 263657 260550 256969
53869 256969 253099 249527 246475 243643 240830 238314 236370 234747 233013 231232 229843 228912 227934 226429 224443
53854 224443 222364 220602 219484 219145 219260 219090 218072 216332 214521 213226 212571 212271 211929 211323 210516 209698
53838 209698 208963 208273 207638 207264 207436 208232 209337 210176 210336 209915 209419 209301 209606 210050 210298 210139 209605 209039
53820 209039 208911 209421 210334 211265 212082 212940 213993 215197 216377 217482 218758 220627 223321 226726 230695 235345
53804 235345 240778 246620 252246 257441 262500 267653 272840 278099 283647 289338 294469 298441 301339 303626
53790 303626 305671 307761 310121 312566 314554 315961 317366 319096 320476 320638 319696 318379 316684 313749 309123
53775 309123 303427 297521 291560 285243 278606 272205 266585 261755 257195 252445 247709 243711 240881 238992
$$ packed form
53883C26540o876p095p077o965o452n389m313l881m028m070l628l109l107l581
53869B56969l870l572l052k832k813k516j944j623j734j781j389r31r78j505j986
53854B24443k079j762j118l39J15j70j018j740j811j295o55l00l42o06q07q18
53838B09698p35o90o35l74J72P96J105Q39J60m21m96j18L05M44K48j59n34n66
53820B09039j28N10R13R31Q17Q58J053J204J180J105J276J869K694L405L969M650
53804B35345N433N842N626N195N059N153N187N259N548N691N131L972K898K287
53790C03626K045K090K360K445J988J407J405J730J380J62r42j317j695k935m626
53775C09123n696n906n961o317o637o401n620m830m560m750m736l998k830j889
$$ plain form
53761 238992 237696 237013 236850 236488 235086 232588 229655 226956 224945 223964 223826 223527 222153 220038 218285 217206
53745 217206 216117 214769 213999 214559 216058 217571 218681 219405 219709 219725 220037 221092 222495 223450 223784 224080 224892
53728 224892 226237 227842 229483 231022 232389 233645 234932 236278 237454 238118 238151 237940 238177 239199 240624
53713 240624 241882 243007 244510 246590 248907 251222 253695 256415 259095 261564 264097 266899 269558 271528
53699 271528 272993 274811 277617 281275 285241 289197 293285 297801 302687 307318 310949 313364 314931 315990
53685 315990 316438 316073 315090 313992 313139 312519 311872 310926 309595 308047 306501 304965 303340 301776 300694 300355
53669 300355 300581 300940 301068 300803 300270 299823 299648 299381 298435 296744 294847 293224 291957 291126 290999 291572 292317
53652 292317 292714 292759 292705 292638 292565 292594 292722 292736 292613 292673 293085 293557 293891 294458 295673 297351 299081 300911 303066
$$ packed form
53761B38992j296o83j63l62j402k498k933k699k011r81j38k99j374k115j753j079
53745B17206j089j348p70N60J499J513J110P24L04J6L12J055J403R55L34K96Q12
53728B24892J345J605J641J539J367J256J287J346J176O64L3k11K37J022J425
53713B40624J258J125J503K080K317K315K473K720K680K469K533K802K659J970
53699B71528J465J818K806L658L966L956M088M516M886M631L631K415J567J059
53685C15990M48l65r83j098q53o20o47r46j331j548j546j536j625j564j082l39
53669C00355K26L59J28k65n33m47j75k67r46j691j897j623j267q31j27N73P45
53652B92317L97M5n4o7p3K9J28J4j23O0M12M72L34N67J215J678J730J830K155
$$ plain form
53633 303066 305169 306493 307061 307875 309838 312859 316218 319453 322645 326061 329769 333597 337370 341122 344937
53618 344937 348614 351764 354410 357230 360904 365449 370445 375640 380911 385939 390510 395037 400190 405973
53604 405973 411704 416919 421750 426315 430353 433716 436599 438918 439978 439289 437412 435475 434017 432780
53590 432780 431503 430347 429516 428874 428143 427241 426236 425164 423979 422543 420602 417995 414982 412155 409797
53575 409797 407499 404716 401679 399428 398736 399210 399676 399380 398528 397713 397170 396820 396791 397427 398747 400180 401094
53558 401094 401512 402046 403089 404242 404735 404326 403593 403211 403197 403104 402843 402974 404032 405836 407695 409250 410867
53541 410867 413175 416392 420200 424241 428591 433661 439721 446615 453962 461493 469135 476947 485070 493659
53527 493659 502691 512017 521768 532508 544656 557892 571540 585433 599936 615114 630467 645817
$$ packed form
53633C03066K103J324N68Q14J963L021L359L235L192L416L708L828L773L752L815
53618C44937L677L150K646K820L674M545M996N195N271N028M571M527N153N783
53604D05973N731N215M831M565M038L363K883K319J060o89j877j937j458j237
53590D32780j277j156q31o42p31r02j005j072j185j436j941k607l013k827k358
53575D09797k298k783l037k251o92M74M66k96q52q15n43l50k9O36J320J433R14
53558D01094M18N34J043J153M93m09p33l82j4r3k61J31J058J804J859J555J617
53541D10867K308L217L808M041M350N070O060O894P347P531P642P812Q123Q589
53527D93659R032R326R751J0740J2148J3236J3648J3893J4503J5178J5353J5350
$$ plain form
53515 645817 661925 679775 699524 720620 742729 766086 790946 817056 843741 870308 896422
53504 896422 922306 948496 975171 1001759 1027455 1052042 1075962 1099660 1123179 1146349 1168989
53493 1168989 1190815 1211572 1231502 1251459 1272210 1293658 1314938 1335324 1354875 1374088 1393079
53482 1393079 1411368 1428593 1445209 1462140 1479721 1497273 1513809 1528849 1542359 1554183 1563949
53471 1563949 1571398 1576481 1579129 1579165 1576426 1570742 1561866 1549807 1535290 1519639 1504054 1489048 1474487
53458 1474487 1459937 1444876 1428824 1411427 1392438 1371703 1349380 1326138 1302929 1280430 1258768
53447 1258768 1237722 1217054 1196683 1176818 1157955 1140532 1124547 1109726 1096094 1084139 1074278
53436 1074278 1066411 1060138 1055123 1051054 1047497 1044280 1041988 1041673 1043863 1048050 1053344 1059459 1066801 1075686
$$ packed form
53515F45817J6108J7850J9749K1096K2109K3357K4860K6110K6685K6567K6114
53504H96422K5884K6190K6675K6588K5696K4587K3920K3698K3519K3170K2640
53493A168989K1826K0757J9930J9957K0751K1448K1280K0386J9551J9213J8991
53482A393079J8289J7225J6616J6931J7581J7552J6536J5040J3510J1824R766
53471A563949P449N083K648L6k739n684q876j2059j4517j5651j5585j5006j4561
53458A474487j4550j5061j6052j7397j8989k0735k2323k3242k3209k2499k1662
53447A258768k1046k0668k0371j9865j8863j7423j5985j4821j3632j1955r861
53436A074278p867o273n015m069l557l217k292l15K190M187N294O115P342Q885
$$ plain form
53422 1075686 1085849 1096930 1109120 1123001 1138802 1156205 1174956 1195283 1217453 1241197 1265977
53411 1265977 1291752 1319147 1348740 1380396 1413424 1447244 1481900 1518065 1556590 1597918 1641841
53400 1641841 1687929 1736140 1786782 1839798 1894413 1949790 2005911 2063402 2122480 2182408 2242264
53389 2242264 2301924 2361864 2422004 2481255 2538393 2593050 2645537 2695970 2744011 2789339 2831830
53378 2831830 2871236 2907125 2939358 2968199 2993689 3015254 3032260 3044659 3052644 3055734 3052601 3041848
53366 3041848 3022820 2995745 2961412 2920805 2874880 2824554 2770901 2715116 2658182 2600682 2543013
53355 2543013 2485600 2428780 2372756 2317947 2265127 2214828 2166786 2120246 2074638 2029573 1984469
53344 1984469 1938823 1892835 1847182 1802210 1757908 1714768 1673885 1635896 1600460 1567247 1536848
$$ packed form
53422A075686J0163J1081J2190J3881J5801J7403J8751K0327K2170K3744K4780
53411A265977K5775K7395K9593L1656L3028L3820L4656L6165L8525M1328M3923
53400A641841M6088M8211N0642N3016N4615N5377N6121N7491N9078N9928N9856
53389B242264N9660N9940O0140N9251N7138N4657N2487N0433M8041M5328M2491
53378B831830L9406L5889L2233K8841K5490K1565J7006J2399P985L090l133j0753
53366C041848j9028k7075l4333m0607m5925n0326n3653n5785n6934n7500n7669
53355B543013n7413n6820n6024n4809n2820n0299m8042m6540m5608m5065m5104
53344A984469m5646m5988m5653m4972m4302m3140m0883l7989l5436l3213l0399
$$ plain form
53333 1536848 1510069 1486708 1465810 1446919 1430312 1415842 1402220 1387766 1371559 1353751 1335162
53322 1335162 1316827 1299551 1283467 1268084 1253017 1238624 1225762 1215048 1206565 1200116 1195438 1192188
53310 1192188 1190037 1188893 1188868 1190023 1192329 1195870 1200811 1207121 1214689 1223844 1235327 1249410 1265374 1282317
53296 1282317 1300291 1320146 1342385 1366742 1392799 1420314 1448761 1477279 1505490 1533788 1562279
53285 1562279 1589899 1615294 1638341 1660069 1681103 1700863 1718389 1733288 1745590 1755163 1761757 1765356
53273 1765356 1766094 1763879 1758414 1749555 1737484 1722477 1704686 1684214 1661310 1636357 1609616 1581129
53261 1581129 1551073 1520154 1489316 1458827 1427926 1395731 1362413 1329138 1296930 1265964 1236015
53250 1236015 1207078 1179284 1152453 1126121 1099925 1073749 1047536 1021189 994701 968224 941960
$$ packed form
53333A536848k6779k3361k0898j8891j6607j4470j3622j4454j6207j7808j8589
53322A335162j8335j7276j6084j5383j5067j4393j2862j0714q483o449m678l250
53310A192188k151j144k5J155K306L541M941O310P568R155J1483J4083J5964J6943
53296A282317J7974J9855K2239K4357K6057K7515K8447K8518K8211K8298K8491
53285A562279K7620K5395K3047K1728K1034J9760J7526J4899J2302R573O594L599
53273A765356P38k215n465q859j2071j5007j7791k0472k2904k4953k6741k8487
53261A581129l0056l0919l0838l0489l0901l2195l3318l3275l2208l0966k9949
53250A236015k8937k7794k6831k6332k6196k6176k6213k6347k6488k6477k6264
$$ plain form
53239 941960 916065 890678 866045 842537 820547 800320 781820 764790 748999 734507 721671
53228 721671 710764 701548 693228 684864 675750 665475 653964 641655 629309 617229 604796 591193
53216 591193 576485 561470 546600 531768 517260 504020 492482 481866 471284 460992 451833 443936
53204 443936 436793 430266 424435 418590 411450 402669 393275 384290 375732 367349 359561 352967 347353 341865
53190 341865 336024 330095 324561 319650 315335 311522 308173 305362 303139 301300 299515 297709 296131 294975
53176 294975 294138 293396 292530 291225 289201 286603 283980 281690 279624 277650 275966 274785 273939 273049 271940
53161 271940 270745 269793 269459 269817 270284 269954 268510 266523 264765 263556 262930 262902 263229 263320 262836 262057 261298 260324
53143 260324 258835 257198 256094 255629 255384 255283 255794 257183 259067 260856 262240 263100 263299 262844 262102 261668
$$ packed form
53239I41960k5895k5387k4633k3508k1990k0227j8500j7030j5791j4492j2836
53228G21671j0907r216q320q364r114j0275j1511j2309j2346j2080j2433j3603
53216E91193j4708j5015j4870j4832j4508j3240j1538j0616j0582j0292r159p897
53204D43936p143o527n831n845p140q781r394q985q558q383p788o594n614n488
53190C41865n841n929n534m911m315l813l349k811k223j839j785j806j578j156
53176B94975q37p42q66j305k024k598k623k290k066j974j684j181q46q90j109
53161B71940j195r52l34L58M67l30j444j987j758j209o26k8L27R1m84p79p59r74
53143B60324j489j637j104m65k45j01N11J389J884J789J384Q60J99m55p42m34
$$ plain form
53127 261668 262014 263190 264791 266211 267087 267457 267462 267176 266870 267175 268540 270597 272450 273608 274363 275229 276323
53110 276323 277312 277730 277252 275905 274081 272229 270500 268792 267079 265507 264175 263026 262004 261171 260575
53095 260575 260094 259432 258328 256862 255536 254874 254858 254979 254934 254988 255397 255820 255722 255180 254837 255118 255860 256740 257630
53076 257630 258425 258857 258677 257881 256678 255404 254473 254162 254296 254228 253242 251066 248192 245736 244676 244918 245266
53059 245266 244614 243048 241503 240594 240249 240330 240937 241966 242965 243701 244447 245436 246386 246856 246771 246349 245770 245254
53041 245254 245191 245794 246734 247440 247645 247433 246851 245892 244825 244181 244272 244865 245397 245421 244888 244153 243756 243981 244584
53022 244584 245096 245410 245934 246992 248272 249118 249338 249465 250056 251016 251868 252502 253211 253934 254023 253112 251872 251414
53004 251414 252043 253094 253967 254776 255805 256803 257215 256944 256503 256415 256638 256658 256096 255211 254781 255328 256535 257637
$$ packed form
53127B61668L46J176J601J420Q76L70Nk86l06L05J365K057J853J158P55Q66J094
53110B76323R89M18m78j347j824j852j729j708j713j572j332j149j022q33n96
53095B60575m81o62j104j466j326o62j6J21m5N4M09M23r8n42l43K81P42Q80Q90
53076B57630P95M32j80p96j203j274r31l11J34o8r86k176k874k456j060K42L48
53059B45266o52j566j545r09l45Q1O07J029R99P36P46R89R50M70q5m22n79n16
53041B45254o3O03R40P06K05k12n82r59j067o44R1N93N32K4n33p35l97K25O03
53022B44584N12L14N24J058J280Q46K20J27N91R60Q52O34P09P23Q9r11j240m58
53004B51414O29J051Q73Q09J029R98M12k71m41q8K23K0n62q85m30N47J207J102
$$ plain form
52986 257637 258350 259154 260603 262720 265146 267532 269573 271061 272271 273965 276460 278913 280114 280030 280001 281248
52970 281248 283659 286310 288711 291029 293347 295219 296085 295838 294861 293719 292901 292674 292955 293255 292871 291323
52954 291323 288769 285953 283619 281907 280417 278804 277059 275131 272689 269616 266562 264531 263921 264275 264974
52939 264974 265780 266616 267271 267616 267821 268051 268168 268014 267821 267940 268217 267986 266750 264682 262431 260629 259558
52922 259558 259080 258779 258279 257460 256422 255364 254619 254599 255424 256661 257622 257908 257559 256836 256052 255446 254941 254228
52904 254228 253330 252816 253049 253467 253171 252134 251215 251030 251443 252212 253356 254661 255567 255980 256624 258056 259831
52887 259831 261136 261783 262076 262114 261883 261713 261986 262512 262820 262897 263058 263191 262822 261986 261372 261458 262086 263072 264694
52868 264694 267157 269904 271906 272642 272593 272764 273791 275452 277006 277949 278336 278416 278304 278171 278341 278739 278516
$$ packed form
52986B57637P13Q04J449K117K426K386K041J488J210J694K495K453J201q4k9J247
52970B81248K411K651K401K318K318J872Q66k47r77j142q18k27K81L00l84j548
52954B91323k554k816k334j712j490j613j745j928k442l073l054k031o10L54O99
52939B64974Q06Q36O55L45K05K30J17j54j93J19K77k31j236k068k251j802j071
52922B59558m78l01n00q19j038j058p45k0Q25J237R61K86l49p23p84o06n05p13
52904B54228q98n14K33M18k96j037r19j85M13P69J144J305R06M13O44J432J775
52887B59831J305O47K93L8k31j70K73N26L08P7J61J33l69q36o14Q6O28R86J622
52868B64694K463K747K002P36m9J71J027J661J554R43L87Q0j12j33J70L98k23
$$ plain form
52851 278516 276773 273604 269949 266480 263175 259962 257131 254790 252496 249849 247169 245193 244255 244091 244274
52836 244274 244519 244565 244155 243276 242247 241401 240712 239862 238720 237549 236680 236151 235895 236088 236870 237756 237873 237025
52818 237025 236064 235888 236443 237033 237267 237219 237037 236908 237192 238028 239009 239719 240378 241393 242530 243238 243636 244369
52800 244369 245444 246010 245469 244132 242531 240768 238779 236668 234482 232175 230004 228452 227566 226953 226581
52785 226581 226933 228058 229205 229815 230206 230812 231484 232089 233072 234627 235939 236217 236016 236495 237563 237901 236876
52768 236876 235358 234359 233773 232995 232028 231317 230914 230542 230353 230927 232368 233868 234466 234107 233698 234176 235760
52751 235760 238045 240446 242292 242956 242457 241858 242436 244277 246227 247390 248125 249226 250740 252159 253344
52736 253344 254555 255805 256889 257966 259467 261349 263036 264222 265221 266343 267362 267867 267812 267435 266795 265673
$$ packed form
52851B78516j743l169l655l469l305l213k831k341k294k647k680j976r38j64J83
52836B44274K45M6m10q79j029q46o89q50j142j171q69n29k56J93P82Q86J17q48
52818B37025r61j76N55N90K34m8j82j29K84Q36R81P10O59J015J137P08L98P33
52800B44369J075N66n41j337j601j763j989k111k186k307k171j552q86o13l72
52785B26581L52J125J147O10L91O06O72O05R83J555J312K78k01M79J068L38j025
52768B36876j518r99n86p78r67p11m03l72j89N74J441J500N98l59m09M78J584
52751B35760K285K401J846O64m99n99N78J841J950J163P35J101J514J419J185
52736B53344J211J250J084J077J501J882J687J186R99J122J019N05n5l77o40j122
$$ plain form
52720 265673 263852 261405 258738 256383 254688 253724 253488 253923 254615 254791 254031 252838 252109 252119 252395 252521 252570
52703 252570 252695 252782 252640 252209 251464 250546 250086 250869 252884 255086 256448 256921 257084 257203 257169 257080 257231 257542 257546
52684 257546 257106 256705 256766 257061 257073 256704 256253 255851 255305 254512 253677 253030 252573 252244 252074 252048 252041 252096 252546 253550
52664 253550 254677 255328 255398 255169 254688 253857 253199 253790 255998 258763 260691 261620 262646 264709 267613 270351
52648 270351 272002 272280 271583 270595 269622 268341 266392 264086 262219 261292 261254 261915 263057 264092 264211 263251 262065
52631 262065 261695 262384 263690 265320 267389 269888 272347 274241 275519 276546 277579 278440 278688 278020 276426
52616 276426 274118 271437 268845 266765 265295 264145 263040 262110 261765 262165 262965 263599 263752 263583 263555 264036 265020
52599 265020 266216 267405 268550 269547 270124 270217 270259 270764 271643 272271 272346 272411 273340 275367 277761 279465 280018 279832
$$ packed form
52720B65673j821k447k667k355j695r64k36M35O92J76p60j193p29J0K76J26M9
52703B52570J25Q7j42m31p45r18m60P83K015K202J362M73J63J19l4q9J51L11M
52684B57546m40m01O1K95J2l69m51m02n46p93q35o47m57l29j70k6pN5M50J004
52664B53550J127O51P0k29m81q31o58N91K208K765J928R29J026K063K904K738
52648B70351J651K78o97r88r73j281j949k306j867r27l8O61J142J035J19r60j186
52631B62065l70O89J306J630K069K499K459J894J278J027J033Q61K48o68j594
52616B76426k308k681k592k080j470j150j105r30l45M00Q00O34J53j69k8M81R84
52599B65020J196J189J145R97N77R3M2N05Q79O28P5O5R29K027K394J704N53j86
$$ plain form
52581 279832 279619 279625 279570 279272 279044 279347 280308 281752 283416 284842 285312 284430 282813 281801 282207 283553 284596
52564 284596 284461 283250 281783 280896 280795 280996 280896 280343 279507 278385 276796 274823 272870 271238 269976 269196
52548 269196 269034 269153 268796 267738 266784 266831 267683 268353 268399 268336 268656 269061 269018 268667 268680 269331 270164 270646 270880 271407
52528 271407 272439 273489 273860 273415 272743 272577 273154 274165 275222 276181 277027 277728 278398 279441 281212 283490
52512 283490 285577 287101 288515 290543 293291 296243 299078 302053 305405 308666 310848 311211 309742 307015
52498 307015 303817 300708 297740 294569 290971 287176 283627 280654 278540 277596 277808 278464 278586 277810 276614
52483 276614 275651 275128 274874 274720 274638 274709 275075 275768 276509 276900 276962 277303 278580 280819 283414 285700 287438 288815
52465 288815 290164 291753 293771 296406 299783 303711 307589 310726 312825 314074 314697 314537 313129 310194 306077
$$ packed form
52581B79832k13On5k98k28L03R61J444J664J426M70q82j617j012M06J346J043
52564B84596j35j211j467q87j01K01j00n53q36j122j589j973j953j632j262p80
52548B69196j62J19l57j058r54M7Q52O70M6o3L20M05m3l51J3O51Q33M82K34N27
52528B71407J032J050L71m45o72j66N77J011J057R59Q46P01O70J043J771K278
52512B83490K087J524J414K028K748K952K835K975L352L261K182L63j469k727
52498C07015l198l109k968l171l598l795l549k973k114r44K12O56J22p76j196
52483B76614r63n23k54j54q2P1L66O93P41L91O2L41J277K239K595K286J738J377
52465B88815J349J589K018K635L377L928L878L137K099J249O23j60j408k935m117
$$ plain form
52450 306077 301695 297970 295207 293020 290957 289072 287748 287061 286477 285246 283029 280237 277828 276612 276506
52435 276506 276571 275985 274955 274371 274665 275374 275842 275942 275925 275955 276084 276469 277266 278387 279576 280685 281700 282575
52417 282575 283217 283631 283970 284444 285259 286539 288230 290163 292360 295207 299209 304666 311771 320869 332209
52402 332209 345243 358279 369129 376223 379186 378522 375003 369362 362356 354795 347397 340660 334821 329835
52388 329835 325382 321108 317032 313645 311467 310529 310390 310612 311107 312057 313628 315782 318237 320594 322618
52373 322618 324478 326705 329892 334399 340230 347048 354240 361049 366792 371101 374003 375703 376285 375772 374484
52358 374484 373052 371828 370600 369315 368843 370241 373157 375772 376711 376449 376373 377058 378165 379535 381423 383799
52342 383799 386310 389027 392525 397005 401978 407027 412367 418411 425287 433062 442017 452284 463516 475264
$$ packed form
52450C06077m382l725k763k187k063j885j324o87n84j231k217k792k409j216j06
52435B76506O5n86j030n84K94P09M68J00j7L0J29L85P97J121J189J109J015Q75
52417B82575O42M14L39M74Q15J280J691J933K197K847M002N457P105R098J1340
52402C32209J3034J3036J0850P094K963o64l519n641p006p561p398o737n839m986
52388C29835m453m274m076l387k178r38j39K22M95R50J571K154K455K357K024
52373C22618J860K227L187M507N831O818P192O809N743M309K902J700N82n13j288
52358C74484j432j224j228j285m72J398K916K615R39k62p6O85J107J370J888K376
52342C83799K511K717L498M480M973N049N340O044O876P775Q955J0267J1232J1748
$$ plain form
52328 475264 487508 500636 515069 531029 548445 567007 586515 607162 629103 651768 674063
52317 674063 695397 716091 736605 756939 777018 797112 817406 837585 857296 876683 895973
52306 895973 914885 932956 950234 967058 983338 998631 1012851 1026331 1039209 1051281 1062458
52295 1062458 1072728 1081539 1087836 1091051 1091567 1089824 1085474 1078011 1067966 1056816 1045726 1034993 1024839
52282 1024839 1016011 1009084 1003591 998557 993851 990446 989270 990296 992934 996727 1001363 1006574 1012608 1020510
52268 1020510 1031286 1044826 1060058 1075928 1091738 1106807 1120704 1133946 1147720 1162619 1178176
52257 1178176 1193822 1209589 1225489 1240839 1254917 1267900 1280526 1292928 1304267 1313444 1319799 1323248
52245 1323248 1324117 1322917 1320017 1315577 1309792 1302964 1295115 1285828 1274818 1262513 1249833 1237494 1225712
$$ packed form
52328D75264J2244J3128J4433J5960J7416J8562J9508K0647K1941K2665K2295
52317F74063K1334K0694K0514K0334K0079K0094K0294K0179J9711J9387J9290
52306H95973J8912J8071J7278J6824J6280J5293J4220J3480J2878J2072J1177
52295A062458J0270Q811O297L215N16j743m350p463j0045j1150j1090j0733j0154
52282A024839q828o927n493n034m706l405j176J026K638L793M636N211O034P902
52268A020510J0776J3540J5232J5870J5810J5069J3897J3242J3774J4899J5557
52257A178176J5646J5767J5900J5350J4078J2983J2626J2402J1339R177O355L449
52245A323248Q69j200k900m440n785o828p849r287j1010j2305j2680j2339j1782
$$ plain form
52232 1225712 1214295 1202729 1190477 1177655 1165307 1154619 1145902 1138646 1132410 1127199 1122979 1119349
52220 1119349 1115971 1113077 1111261 1110823 1111482 1112754 1114454 1116736 1119715 1123346 1127786 1133497 1140595 1148324
52206 1148324 1155692 1162521 1169326 1176228 1182704 1188500 1193971 1199218 1203769 1207606 1211765 1217178 1223459 1229599
52192 1229599 1235354 1241172 1247171 1253124 1259188 1265654 1272007 1277123 1280439 1282170 1282365 1280622 1276924 1271912
52178 1271912 1265936 1258490 1249007 1237779 1225737 1213728 1202321 1191953 1182865 1175032 1168340 1162720 1158126
52165 1158126 1154607 1152374 1151467 1151484 1152054 1153459 1156230 1160096 1163930 1166860 1168916 1170441 1171519 1172241 1172905
52150 1172905 1173537 1173643 1172896 1171762 1171049 1171136 1171884 1173024 1174279 1175377 1176214 1176869 1177269 1177153 1176580 1176127 1176285
52133 1176285 1177034 1178366 1180877 1185412 1192281 1201274 1212347 1225915 1242473 1262193 1284831 1309823 1336539
$$ packed form
52232A225712j1417j1566j2252j2822j2348j0688q717p256o236n211m220l630
52220A119349l378k894j816m38O59J272J700K282K979L631M440N711P098P729
52206A148324P368O829O805O902O476N796N471N247M551L837M159N413O281O140
52192A229599N755N818N999N953O064O466O353N116L316J731J95j743l698n012
52178A271912n976p446r483j1228j2042j2009j1407j0368r088p833o692n620m594
52165A158126l519k233r07J7N70J405K771L866L834K930K056J525J078P22O64
52150A172905O32J06p47j134p13Q7P48J140J255J098Q37O55M00j16n73m53J58
52133A176285P49J332K511M535O869Q993J1073J3568J6558J9720K2638K4992K6716
$$ plain form
52120 1336539 1364608 1393957 1424461 1455752 1487490 1519557 1551700 1583185 1613081 1640828 1666288
52109 1666288 1689320 1709562 1726676 1740727 1752299 1762094 1770230 1776058 1779096 1780162 1781055 1782823 1784720
52096 1784720 1785165 1783359 1779546 1774096 1766917 1757728 1746368 1732742 1716759 1698488 1678317 1657035 1635862
52083 1635862 1616148 1598750 1583702 1570642 1559443 1550340 1543678 1539768 1538712 1540139 1543324 1547895 1554283
52070 1554283 1563220 1574939 1589072 1605057 1622295 1640143 1658173 1676283 1694212 1711216 1726689
52059 1726689 1740876 1754393 1767169 1778531 1788301 1797074 1805229 1812351 1817934 1821975 1824396 1824365 1820845
52046 1820845 1813638 1803417 1790796 1775754 1757912 1737023 1713241 1687189 1659854 1632225 1605064
52035 1605064 1579036 1554787 1532520 1511690 1491617 1472458 1455185 1440441 1427737 1415967 1404347
$$ packed form
52120A336539K8069K9349L0504L1291L1738L2067L2143L1485K9896K7747K5460
52109A666288K3032K0242J7114J4051J1572R795Q136N828L038J066Q93J768J897
52096A784720M45j806l813n450p179r189j1360j3626j5983j8271k0171k1282k1173
52083A635862j9714j7398j5048j3060j1199r103o662l910j056J427L185M571O388
52070A554283Q937J1719J4133J5985J7238J7848J8030J8110J7929J7004J5473
52059A726689J4187J3517J2776J1362R770Q773Q155P122N583M041K421l1l520
52046A820845p207j0221j2621j5042j7842k0889k3782k6052k7335k7629k7161
52035A605064k6028k4249k2267k0830k0073j9159j7273j4744j2704j1770j1620
$$ plain form
52024 1404347 1392572 1380353 1367373 1353726 1339982 1326655 1313823 1301366 1289258 1277475 1265899
52013 1265899 1254573 1243795 1233614 1223382 1212219 1199805 1186335 1171766 1155708 1138151 1119706
52002 1119706 1100773 1080977 1059906 1038050 1016423 995427 974699 954076 934119 915576 898819
51991 898819 884009 871260 860241 849910 839132 827526 815477 803408 791261 778591 764928
51980 764928 750088 734386 718598 703487 689320 675864 662776 649814 636825 623865 611495
51969 611495 600682 592203 586150 582183 580139 580257 582800 587637 594220 601919 610223 618593 626199 632037
51955 632037 635483 636678 636092 633699 628933 621757 613491 606112 600608 596375 592376 588634 586350 586761 590216
51940 590216 596275 604327 613928 624714 636289 648325 660699 673330 685783 697128 706369 712987
$$ packed form
52024A404347j1775j2219j2980j3647j3744j3327j2832j2457j2108j1783j1576
52013A265899j1326j0778j0181j0232j1163j2414j3470j4569j6058j7557j8445
52002A119706j8933j9796k1071k1856k1627k0996k0728k0623j9957j8543j6757
51991H98819j4810j2749j1019j0331j0778j1606j2049j2069j2147j2670j3663
51980G64928j4840j5702j5788j5111j4167j3456j3088j2962j2989j2960j2370
51969F11495j0813q479o053l967k044J18K543M837O583P699Q304Q370P606N838
51955F32037L446J195n86k393m766p176q266p379n504m233l999l742k284M11L455
51940E90216O059Q052R601J0786J1575J2036J2374J2631J2453J1345R241O618
$$ plain form
51928 712987 716902 717971 715826 710301 701696 690461 676868 661343 644906 628888 614157 600857
51916 600857 588899 578385 569528 562475 557418 554698 554551 556716 560346 564333 567737 570039 571036 570635
51902 570635 568857 566130 563337 561334 560344 559936 559463 558332 555911 551470 544469 534936 523560 511360
51888 511360 499142 487148 475319 463929 453834 445933 440486 437066 435050 434058 434089 435455 438481 443130
51874 443130 449018 455808 463272 470853 477662 483326 488406 493420 497706 499878 499339 496704 492883 488444
51860 488444 483922 479904 476558 473615 471105 469626 469683 471250 474127 478098 482461 486037 488114 488896 488683
51845 488683 487166 484066 479936 475628 471241 466217 460282 453781 447259 441258 436361 432881 430521 428781
51831 428781 427668 427583 428588 430186 431783 433007 433604 433439 432621 431333 429512 426992 423913 420722 417801
$$ packed form
51928G12987L915J069k145n525q605j1235j3593j5525j6437j6018j4731j3300
51916F00857j1958j0514q857p053n057k720j47K165L630L987L404K302R97m01
51902E70635j778k727k793k003r90m08m73j131k421m441p001r533j1376j2200
51888E11360j2218j1994j1829j1390j0095p901n447l420k016r92L1J366L026M649
51874D43130N888O790P464P581O809N664N080N014M286K172n39k635l821m439
51860D88444m522m018l346k943k510j479N7J567K877L971M363L576K077P82k13
51845D88683j517l100m130m308m387n024n935o501o522o001m897l480k360j740
51831D28781j113q5J005J598J597J224N97j65q18j288j821k520l079l191k921
$$ plain form
51816 417801 415340 413456 412164 411302 410813 410989 412139 414090 416315 418424 420223 421445 421863 421601 420915 419757
51800 419757 418040 416268 415354 415685 416808 418145 419482 420564 420723 419398 416762 413473 409932 406178 402385
51785 402385 399045 396488 394471 392539 390708 389518 389286 389560 389671 389662 390209 391584 393200 394499 395809 397927
51769 397927 401171 405383 410596 417126 424952 433558 442484 451717 461422 471423 480906 488465 492728 493334
51755 493334 491169 487273 481711 474011 464503 454527 445278 437088 429862 423565 417991 412686 407553 403160
51741 403160 400150 398640 398418 399397 401605 405084 410068 416886 425290 434133 442088 448571 453679 457475 459819
51726 459819 460889 461555 462958 465660 469115 471954 472907 471567 468261 463464 457674 451701 446533 442652 439831
51711 439831 437709 436169 434899 433076 430025 426053 422261 419671 418824 419973 423027 427166 430962 433283
$$ packed form
51816D17801k461j884j292q62m89J76J150J951K225K109J799J222M18k62o86j158
51800D19757j717j772r14L31J123J337J337J082J59j325k636l289l541l754l793
51785D02385l340k557k017j932j831j190k32K74J11rN47J375J616J299J310K118
51769C97927L244M212N213O530P826Q606Q926R233R705J0001R483P559M263O06
51755D93334k165l896n562p700r508r976r249q190p226o297n574n305n133m393
51741D03160l010j510k22R79K208L479M984O818Q404Q843P955O483N108L796K344
51726D59819J070O66J403K702L455K839R53j340l306m797n790n973n168l881k821
51711D39831k122j540j270j823l051l972l792k590q47J149L054M139L796K321
$$ plain form
51697 433283 434150 434477 434940 435190 434384 432475 430650 430222 431288 432859 434108 434851 434757 432899 428669 422761
51681 422761 416687 411495 407363 404222 402172 401203 400983 401195 401890 403363 405766 408872 412184 415360 418694
51666 418694 423087 429333 437383 446382 455339 463542 470315 474752 475981 473748 468659 461874 454693 448379
51652 448379 444057 442438 443562 447060 452694 460324 469135 477289 482761 484527 482657 477577 469783 460185
51638 460185 450006 440053 430421 421088 412377 404628 397842 391995 387389 384386 382948 382692 383236 384313
51624 384313 385766 387534 389432 390855 391197 390716 390467 390987 391524 391069 389776 388721 388507 388775 389020 389178 389307
51607 389307 389245 388832 388131 387309 386618 386529 387506 389396 391392 392861 394105 396205 400231 406690 415439 425811
51591 425811 436709 446703 454238 458111 458052 454829 449672 443534 436944 430299 424061 418717 414798 412874
$$ packed form
51697D33283Q67L27M63K50q06j909j825m28J066J571J249P43r4j858m230n908
51681D22761o074n192m132l141k050r69k20K12O95J473K403L106L312L176L334
51666D18694M393O246Q050Q999Q957Q203O773M437J229k233n089o785p181o314
51652D48379m322j619J124L498N634P630Q811Q154N472J766j870n080p794r598
51638D60185j0179r953r632r333q711p749o786n847m606l003j438k56N44J077
51624C84313J453J768J898J423L42m81k49N20N37m55j293j055k14K68K45J58J29
51607C89307o2m13p01q22o91q9R77J890J996J469J244K100M026O459Q749J0372
51591D25811J0898R994P535L873n9l223n157o138o590o645o238n344l919j924
$$ plain form
51577 412874 413251 415734 420009 426268 435132 446743 460195 474173 488142 502745 518921 536675 554737
51564 554737 571497 586273 599711 613197 628166 645989 667970 694938 726640 761671 797998
51553 797998 833559 866550 895299 918019 932916 938916 936265 926121 909493 886994 859580 828843
51541 828843 796126 761925 726711 691919 659383 630033 603765 580390 560007 542472 527218
51530 527218 513688 501447 489963 478975 469143 461568 456405 452587 449090 445775 442708 439485 435867
51517 435867 432515 430384 429683 430003 431180 433387 436479 439850 442907 445280 446585 446424 444718 441783 438080
51502 438080 434054 430044 426105 422030 417837 414097 411436 409828 408706 407670 406709 405775 404554 402756 400421
51487 400421 397915 395814 394667 394556 394919 395056 394694 393829 392240 389684 386419 382981 379440 375532 371567
$$ packed form
51577D12874L77K483M275O259Q864J1611J3452J3978J3969J4603J6176J7754J8062
51564E54737J6760J4776J3438J3486J4969J7823K1981K6968L1702L5031L6327
51553G97998L5561L2991K8749K2720J4897O000k651j0144j6628k2499k7414l0737
51541H28843l2717l4201l5214l4792l2536k9350k6268k3375k0383j7535j5254
51530E27218j3530j2241j1484j0988r832p575n163l818l497l315l067l223l618
51517D35867l352k131p01L20J177K207L092L371L057K373J305j61j706k935l703
51502D38080m026m010l939m075m193l740k661j608j122j036r61r34j221j798k335
51487D00421k506k101j147j11L63J37l62q65j589k556l265l438l541l908l965
$$ plain form
51472 371567 368448 366435 364588 361987 358968 356540 354945 353532 351820 349928 347996 345900 343739 342006
51458 342006 340994 340495 340314 340679 341776 343305 344893 346649 348868 351379 353750 356166 359600 364942 372227
51443 372227 380927 390806 402235 415648 430687 445775 458594 467258 471303 471686 469915 467317 464900
51430 464900 463305 462401 461043 457745 451846 444001 435495 427284 419765 413174 407744 403377 399544 395867
51416 395867 392699 390751 390158 390347 391005 392678 395914 400042 403469 405333 406346 407780 410051 412632 415006
51401 415006 417181 419398 421805 424414 427000 429012 429943 429965 429905 430459 431716 433647 436712 441579 448308 456233
51385 456233 464782 474279 485837 500688 519730 543455 571914 604722 641419 682075 727266 777084
51373 777084 830040 883086 932741 976035 1010593 1034535 1046950 1048389 1040410 1024438 1001192 971144
$$ packed form
51472C71567l119k013j847k601l019k428j595j413j712j892j932k096k161j733
51458C42006j012m99j81L65J097J529J588J756K219K511K371K416L434N342P285
51443C72227Q700R879J1429J3413J5039J5088J2819Q664M045L83j771k598k417
51430D64900j595r04j358l298n899p845q506q211p519o591n430m367l833l677
51416C95867l168j948n93J89O58J673L236M128L427J864J013J434K271K581K374
51401D15006K175K217K407K609K586K012R31K2o0N54J257J931L065M867O729P925
51385D56233Q549R497J1558J4851J9042K3725K8459L2808L6697M0656M5191M9818
51373G77084N2956N3046M9655M3294L4558K3942J2415J439p979j5972k3246l0048
$$ plain form
51361 971144 935149 894499 850696 805431 760487 717247 676280 637680 601837 569658 541926
51350 541926 518578 498753 481538 466637 454292 444548 436660 429408 422080 414935 408500 402597 396481
51337 396481 389900 383529 378192 374057 370906 368751 367622 366915 365668 363575 361214 359109 357051 354661
51323 354661 352154 350096 348715 347920 347772 348360 349274 349783 349641 349295 349185 349307 349717 351020 353920 358401 363667
51306 363667 368827 373439 377437 380775 383197 384296 383848 382119 379737 377151 374309 370944 367068 363021
51292 363021 359149 355622 352584 350262 348809 348065 347589 347050 346579 346714 347939 350330 353673 357746 362366
51277 362366 367286 372239 377017 381322 384689 386823 387912 388338 388248 387783 387602 388583 390924 394014 397279 400592
51261 400592 403677 405805 406533 406250 405508 404212 402020 399172 396329 393826 391608 389676 388006 386194 383819
$$ packed form
51361I71144l5995m0650m3803m5265m4944m3240m0967l8600l5843l2179k7732
51350E41926k3348j9825j7215j4901j2345r744p888p252p328p145o435n903o116
51337C96481o581o371n337m135l151k155j129p07j247k093k361k105k058k390
51323C54661k507k058j381p95j48N88R14N09j42l46j10J22M10J303K900M481N266
51306C63667N160M612L998L338K422J099m48j729k382k586k842l365l876m047
51292C63021l872l527l038k322j453p44m76n39m71J35J225K391L343M073M620
51277C62366M920M953M778M305L367K134J089M26r0m65j81R81K341L090L265L313
51261D00592L085K128P28k83p42j296k192k848k843k503k218j932j670j812k375
$$ plain form
51246 383819 381098 378646 376659 374951 373693 373383 373933 374460 374238 373351 372183 370813 369231 367670 366363
51231 366363 365246 364156 363026 361709 359974 357911 355957 354281 352615 350991 350192 350925 352820 354704 355744
51216 355744 355981 355945 356246 357390 359571 362539 365909 369490 373100 376390 379297 382436 386502 391332 396061
51201 396061 400170 403776 406862 408915 409672 409682 409614 409349 408232 406059 403355 400728 398356 396122 393915 391652
51185 391652 389301 387104 385607 385255 385897 386798 387218 386975 386441 386003 385592 384885 383891 383162 383249 384102 385188 386173
51167 386173 387243 388728 390621 392566 394207 395419 396361 397437 399088 401418 403964 406004 407115 407410 407286
51152 407286 407077 406915 406768 406524 406121 405633 405203 404948 404953 405258 405684 405761 405099 403752 401980 399611 396140 391693
51134 391693 387538 385168 384880 385627 386224 386377 386448 386716 387183 387945 389265 391213 393469 395675 397830 400127
$$ packed form
51246C83819k721k452j987j708j258l10N50N27k22q87j168j370j582j561j307
51231C66363j117j090j130j317j735k063j954j676j666j624p99P33J895J884J040
51216C55744K37l6L01J144K181K968L370L581L610L290K907L139M066M830M729
51201C96061M109L606L086K053P57J0o8k65j117k173k704k627k372k234k207k263
51185C91652k351k197j497l52O42R01M20k43n34m38m11p07r94p29Q7Q53J086R85
51167C86173J070J485J893J945J641J212R42J076J651K330K546K040J111K95j24
51152D07286k09j62j47k44m03m88m30k55NL05M26P7o62j347j772k369l471m447
51134C91693m155k370k88P47N97J53P1K68M67P62J320J948K256K206K155K297
$$ plain form
51118 400127 402517 404702 406564 408309 410093 411778 413319 415084 417477 420418 423543 426783 430279 433827
51104 433827 436997 439830 442815 445956 448505 449982 450935 452163 453591 454495 454541 454043 453362 452636 452005 451574
51088 451574 451126 450386 449549 449108 449182 449433 449601 449605 449163 447972 446370 445192 444734 444437 443892 443599 444220 445595
51070 445595 447116 448838 451483 455283 459422 462964 466064 469977 475972 484514 495522 509017 525029
51057 525029 542741 560174 575157 586681 595181 601803 607884 615001 624710 637613 652793 668496
51045 668496 683398 697075 709334 719335 725605 727038 723853 717439 709294 700444 691819 684369 678042
51032 678042 670992 660793 646667 630054 612999 596644 581349 567301 554469 542613 532013 523810
51020 523810 519046 517568 518326 520469 523756 528235 534125 541810 551282 561585 571333 579873 587593 595112
$$ packed form
51118D00127K390K185J862J745J784J685J541J765K393K941L125L240L496L548
51104D33827L170K833K985L141K549J477R53J228J428R04M6m98o81p26o31m31
51088D51574m48p40q37m41P4K51J68Mm42j191j602j178m58k97n45k93O21J375
51070D45595J521J722K645L800M139L542L100L913N995Q542J1008J3495J6012
51057E25029J7712J7433J4983J1524Q500O622O081P117R709J2903J5180J5703
51045F68496J4902J3677J2259J0001O270J433l185o414q145q850q625p450o327
51032F78042p050j0199j4126j6613j7055j6355j5295j4048j2832j1856j0600q203
51020E23810m764j478P58K143L287M479N890P685R472J0303R748Q540P720P519
$$ plain form
51006 595112 602675 610383 618470 627004 635595 643772 651601 659749 668871 679042 689767 700498 711009
50993 711009 721291 731172 740297 748382 755312 760952 765196 768317 771063 774202 778213 783468 790473 799658
50979 799658 811081 824517 839602 855697 871872 887417 902433 917778 934570 953847 976458
50968 976458 1002953 1033563 1068435 1107817 1152007 1201300 1256039 1316435 1382149 1452173 1525218
50957 1525218 1599981 1675057 1749087 1821188 1890776 1956696 2017091 2070603 2117258 2157605 2191443
50946 2191443 2218183 2238241 2253263 2264949 2274325 2282165 2289281 2296008 2301893 2306186 2308432 2308464 2306254
50933 2306254 2301897 2295424 2286424 2274170 2258191 2238410 2214636 2186336 2152960 2114092 2069186 2017783
50921 2017783 1960356 1898525 1833969 1767487 1699535 1631335 1564757 1501098 1440572 1383151 1329409
$$ packed form
51006E95112P563P708Q087Q534Q591Q177P829Q148R122J0171J0725J0731J0511
50993G11009J0282R881R125Q085O930N640M244L121K746L139M011N255P005R185
50979G99658J1423J3436J5085J6095J6175J5545J5016J5345J6792J9277K2611
50968I76458K6495L0610L4872L9382M4190M9293N4739O0396O5714P0024P3045
50957A525218P4763P5076P4030P2101O9588O5920O0395N3512M6655M0347L3838
50946B191443K6740K0058J5022J1686R376P840P116O727N885M293K246L2k210
50933B306254m357o473r000j2254j5979j9781k3774k8300l3376l8868m4906n1403
50921B017783n7427o1831o4556o6482o7952o8200o6578o3659o0526n7421n3742
$$ plain form
50910 1329409 1280234 1236011 1196474 1161229 1130043 1102484 1077608 1054304 1032009 1010904 991402
50899 991402 973579 957198 942143 928601 916764 906492 897379 889180 882047 876214 871498 867367 863659
50886 863659 861034 860330 861542 863766 866149 868505 871020 873862 877344 881981 887970 894916 902423 910702
50872 910702 920258 931224 943379 956591 970854 986062 1002204 1019612 1038678 1059533 1082357 1107787
50860 1107787 1136499 1168640 1204187 1243624 1287619 1336282 1389536 1448202 1513885 1587678 1669738
50849 1669738 1760346 1860460 1970803 2091087 2220652 2359262 2506690 2662010 2823880 2991038
50839 2991038 3161807 3333256 3501439 3662327 3812061 3946686 4062557 4157361 4230459 4282289
50829 4282289 4313864 4326873 4323762 4307499 4281531 4249993 4217481 4188154 4164997 4149862 4143837 4147159
$$ packed form
50910A329409m9175m4223l9537l5245l1186k7559k4876k3304k2295k1105j9502
50899I91402j7823j6381j5055j3542j1837j0272r113q199p133n833m716m131l708
50886H63659k625p04J212K224K383K356K515K842L482M637N989O946P507Q279
50872I10702R556J0966J2155J3212J4263J5208J6142J7408J9066K0855K2824K5430
50860A107787K8712L2141L5547L9437M3995M8663N3254N8666O5683P3793Q2060
50849A669738R0608J00114J10343J20284J29565J38610J47428J55320J61870J67158
50839B991038J70769J71449J68183J60888J49734J34625J15871R4804P3098N1830
50829D282289L1575J3009l111j6263k5968l1538l2512k9327k3157j5135o025L322
$$ plain form
50817 4147159 4158726 4175821 4194332 4209334 4215769 4209203 4186449 4145733 4086267 4007684 3909996 3794053
50805 3794053 3661801 3515903 3359293 3195348 3028248 2862544 2702055 2549254 2405675
50796 2405675 2272506 2150590 2040265 1941661 1855073 1780758 1718411 1667102 1625711 1593202 1568472
50785 1568472 1550163 1536763 1526864 1519357 1513522 1508947 1505271 1501917 1498121 1493214 1486849 1478934 1469432
50772 1469432 1458298 1445588 1431532 1416354 1399994 1382103 1362386 1340949 1318308 1295092 1271707
50761 1271707 1248152 1224155 1199656 1175308 1152343 1131860 1114324 1099775 1088173 1079337 1072752 1067848
50749 1067848 1064423 1062646 1062816 1065342 1070716 1079180 1090663 1105393 1124241 1147883 1175813 1206954 1241323
50736 1241323 1280416 1325774 1377738 1435790 1499444 1568350 1642017 1719900 1801504 1886077 1972539
$$ packed form
50817D147159J1567J7095J8511J5002O435o566k2754m0716n9466p8583r7688j15943
50805C794053j32252j45898j56610j63945j67100j65704j60489j52801j43579
50796B405675j33169j21916j10325r8604q6588p4315o2347n1309m1391l2509k4730
50785A568472j8309j3400r899p507n835m575l676l354l796m907o365p915r502
50772A469432j1134j2710j4056j5178j6360j7891j9717k1437k2641k3216k3385
50761A271707k3555k3997k4499k4348k2965k0483j7536j4549j1602q836o585m904
50749A067848l425j777J70K526N374Q464J1483J4730J8848K3642K7930L1141L4369
50736A241323L9093M5358N1964N8052O3654O8906P3667P7883Q1604Q4573Q6462
$$ plain form
50725 1972539 2060082 2148448 2237288 2325495 2411549 2494160 2572061 2643421 2705953 2757465 2795969
50714 2795969 2819593 2827208 2819357 2798249 2766890 2728522 2686771 2645506 2608085 2576808 2553115 2537917
50702 2537917 2531402 2532753 2540423 2552678 2567707 2583127 2595560 2600914 2595401 2576547 2543427 2496152
50690 2496152 2435447 2362847 2281013 2193326 2102991 2012597 1924386 1840556 1762978 1692773 1630412
50679 1630412 1576206 1530504 1493451 1464886 1444669 1432919 1429675 1434470 1446584 1465609 1491264 1522488
50667 1522488 1557131 1592878 1628177 1662059 1693604 1722120 1747559 1770100 1789490 1805513 1819026
50656 1819026 1831738 1844691 1857553 1869582 1880656 1891070 1900900 1910078 1918758 1927308 1936354 1947181
50644 1947181 1961618 1981040 2005671 2035146 2069299 2107989 2150579 2196236 2244550 2295280 2347570
$$ packed form
50725A972539Q7543Q8366Q8840Q8207Q6054Q2611P7901P1360O2532N1512L8504
50714B795969K3624P615p851k1108l1359l8368m1751m1265l7421l1277k3693j5198
50702B537917o515J351P670J2255J5029J5420J2433N354n513j8854l3120m7275
50690B496152o0705p2600q1834q7687r0335r0394q8211q3830p7578p0205o2361
50679A630412n4206m5702l7053k8565k0217j1750l244M795J2114J9025K5655L1224
50667A522488L4643L5747L5299L3882L1545K8516K5439K2541J9390J6023J3513
50656A819026J2712J2953J2862J2029J1074J0414R830R178Q680Q550R046J0827
50644A947181J4437J9422K4631K9475L4153L8690M2590M5657M8314N0730N2290
$$ plain form
50633 2347570 2399985 2451314 2500928 2548340 2592980 2634644 2673880 2711487 2747274 2778890 2801776
50622 2801776 2810659 2801862 2774778 2731748 2677117 2616297 2554727 2496682 2444821 2400856 2366232 2341814
50610 2341814 2327373 2321865 2323992 2332023 2343411 2355260 2365159 2371134 2370961 2362161 2342812 2312078 2270092
50597 2270092 2217828 2157054 2089875 2018175 1943692 1868439 1794532 1723509 1656204 1593170 1534790
50586 1534790 1480999 1431454 1386103 1345224 1308801 1276232 1246721 1219618 1194386 1170677 1148583
50575 1148583 1128555 1111040 1096445 1085293 1077924 1073967 1072558 1073153 1075832 1080835 1088235 1097995 1109817
50562 1109817 1122925 1136619 1151227 1167969 1187731 1210476 1236008 1264651 1296784 1332170 1370135
50551 1370135 1409953 1450690 1491118 1530346 1568307 1605236 1640896 1674791 1706947 1738101 1769233
$$ packed form
50633B347570N2415N1329M9614M7412M4640M1664L9236L7607L5787L1616K2886
50622B801776Q883q797k7084m3030n4631o0820o1570n8045n1861m3965l4624k4418
50610B341814j4441n508K127Q031J1388J1849R899N975j73q800j9349l0734m1986
50597B270092n2264o0774o7179p1700p4483p5253p3907p1023o7305o3034n8380
50586A534790n3791m9545m5351m0879l6423l2569k9511k7103k5232k3709k2094
50575A148583k0028j7515j4595j1152p369l957j409N95K679N003P400R760J1822
50562A109817J3108J3694J4608J6742J9762K2745K5532K8643L2133L5386L7965
50551A370135L9818M0737M0428L9228L7961L6929L5660L3895L2156L1154L1132
$$ plain form
50540 1769233 1801305 1835314 1872193 1912561 1956818 2005541 2059585 2119731 2186301 2259020 2337281
50529 2337281 2420681 2509476 2604477 2706577 2816458 2934537 3060633 3193491 3330966 3470892
50519 3470892 3611479 3750713 3885728 4013087 4129372 4231253 4315393 4378887 4419866 4437407
50509 4437407 4431013 4400550 4346732 4271395 4177192 4067208 3944937 3814582 3681208 3550365
50499 3550365 3427215 3315890 3219673 3141496 3083719 3047341 3031903 3036340 3059385 3098750 3150285
50488 3150285 3208320 3266544 3318305 3356764 3375891 3371676 3342285 3287444 3208393 3108370 2992254
50477 2992254 2865182 2731504 2594902 2458796 2326178 2199238 2079364 1967386 1863765
50468 1863765 1768772 1682658 1605512 1536886 1475778 1421127 1372242 1328801 1290698 1257989 1230725
$$ packed form
50540A769233L2072L4009L6879M0368M4257M8723N4044O0146O6570P2719P8261
50529B337281Q3400Q8795R5001J02100J09881J18079J26096J32858J37475J39926
50519C470892J40587J39234J35015J27359J16285J01881Q4140O3494M0979J7541
50509D437407o394l0463n3818p5337r4203j09984j22271j30355j33374j30843
50499C550365j23150j11325r6217p8177n7777l6378j5438M437K3045L9365N1535
50488C150285N8035N8224N1761L8459J9127m215k9391n4841p9051j00023j16116
50477B992254j27072j33678j36602j36106j32618j26940j19874j11978j03621
50468A863765r4993q6114p7146o8626o1108n4651m8885m3441l8103l2709k7264
$$ plain form
50457 1230725 1208626 1190961 1176864 1165684 1157002 1150473 1145732 1142381 1140037 1138541 1138113 1139140 1141821
50444 1141821 1146249 1152797 1162040 1174018 1187785 1201864 1215006 1226437 1235742 1242977 1248826 1254268 1259987
50431 1259987 1266284 1273445 1281890 1291932 1303694 1317322 1332927 1350212 1368520 1387557 1407767 1429703
50419 1429703 1453291 1478144 1504413 1532828 1563975 1598219 1636415 1679985 1729702 1784783 1843671
50408 1843671 1905525 1970446 2038456 2108873 2180622 2252543 2323197 2390914 2454336 2512642 2565020
50397 2565020 2610185 2646581 2672697 2686928 2687501 2672978 2642768 2597066 2536744 2463875 2382171 2296191
50385 2296191 2209824 2125673 2045792 1972430 1907758 1853209 1809478 1777006 1756155 1746833 1748207 1758856
50373 1758856 1777098 1801026 1828215 1855487 1879150 1895657 1902289 1897432 1880505 1851841 1812683 1765066
$$ packed form
50457A230725k2099j7665j4097j1180q682o529m741l351k344j496m28J027K681
50444A141821M428O548R243J1978J3767J4079J3142J1431R305P235N849N442N719
50431A259987O297P161Q445J0042J1762J3628J5605J7285J8308J9037K0210K1936
50419A429703K3588K4853K6269K8415L1147L4244L8196M3570M9717N5081N8888
50408A843671O1854O4921O8010P0417P1749P1921P0654O7717O3422N8306N2378
50397B565020M5165L6396K6116J4231N73j4523l0210m5702o0322p2869q1704q5980
50385B296191q6367q4151p9881p3362o4672n4549m3731l2472k0851r322J374J0649
50373A758856J8242K3928K7189K7272K3663J6507O632m857j6927k8664l9158m7617
$$ plain form
50361 1765066 1711392 1653880 1594220 1533666 1473319 1414271 1357450 1303419 1252380 1204334 1159118
50350 1159118 1116429 1076112 1038574 1004754 975472 950869 930560 914235 901933 893782 889680 889254
50338 889254 892005 897533 905740 916704 930069 944519 958071 968939 975995 978544 976291 969880 961087
50325 961087 951878 943286 935542 929110 924988 923835 925342 928719 933383 938829 944365 949571 954778 960513
50311 960513 966540 972050 976758 981198 985837 990595 995486 1001066 1007758 1015179 1022705 1030394 1038800 1048121
50297 1048121 1058062 1068451 1079450 1091257 1104120 1118645 1135553 1155091 1177077 1201622 1229517
50286 1229517 1262007 1300556 1346205 1397662 1449348 1492384 1518925 1526024 1515503 1491138 1456913
50275 1456913 1417317 1377323 1340828 1309357 1282674 1260296 1241986 1227240 1215147 1204933 1196273
$$ packed form
50361A765066n3674n7512n9660o0554o0347n9048n6821n4031n1039m8046m5216
50350A159118m2689m0317l7538l3820k9282k4603k0309j6325j2302q151m102m26
50338H89254K751N528Q207J0964J3365J4450J3552J0868P056K549k253o411q793
50325I61087r209q592p744o432m122j153J507L377M664N446N536N206N207N735
50311I60513O027N510M708M440M639M758M891N580O692P421P526P689Q406R321
50297A048121R941J0389J0999J1807J2863J4525J6908J9538K1986K4545K7895
50286A229517L2490L8549M5649N1457N1686M3036K6541P099j0521k4365l4225
50275A456913l9596l9994l6495l1471k6683k2378j8310j4746j2093j0214q660
$$ plain form
50264 1196273 1188916 1182323 1175954 1169753 1164169 1159712 1156603 1154783 1154185 1155065 1158061 1163848 1172669 1184367
50250 1184367 1198980 1217059 1239215 1265644 1296431 1332103 1373247 1419542 1469672 1522284 1576415
50239 1576415 1630737 1683156 1731847 1776442 1817691 1856291 1892615 1927106 1959883 1989743 2014231
50228 2014231 2030916 2038162 2034612 2018764 1989688 1947941 1895512 1835088 1769501 1701484 1633553 1568107
50216 1568107 1507468 1453343 1405975 1364191 1326454 1291535 1258144 1224705 1190229 1155190 1120986
50205 1120986 1088636 1058333 1030035 1003956 980410 959570 941458 925911 912487 900565 889638
50194 889638 879465 870081 861678 854305 847504 840511 833003 825380 818095 810983 803682 796445 789938 784253
50180 784253 778630 772332 765369 758219 751254 744773 739262 735180 732448 730452 728601 726722 724919 723293
$$ packed form
50264A196273p357o593o369o201n584m457l109j820n98Q80K996N787Q821J1698
50250A184367J4613J8079K2156K6429L0787L5672M1144M6295N0130N2612N4131
50239A576415N4322N2419M8691M4595M1249L8600L6324L4491L2777K9860K4488
50228B014231J6685P246l550j5848k9076m1747n2429o0424o5587o8017o7931o5446
50216A568107o0639n4125m7368m1784l7737l4919l3391l3439l4476l5039l4204
50205A120986l2350l0303k8298k6079k3546k0840j8112j5547j3424j1922j0927
50194H89638j0173r384q403p373o801o993p508p623p285p112p301p237o507n685
50180G84253n623o298o963p150o965o481n511m082k732j996j851j879j803j626
$$ plain form
50166 723293 722001 721451 722152 724217 727158 730282 733261 736251 739640 743878 749444 756632 765321 775192 786213
50151 786213 798674 812670 827769 843298 858647 873181 886127 896922 905683 913188 920469 928459
50139 928459 937800 948732 961254 975694 993206 1015582 1044455 1080661 1124287 1175234 1233668 1299907
50127 1299907 1373961 1455243 1542634 1634509 1728676 1822714 1914888 2004688 2092299 2177799 2261179
50116 2261179 2342756 2422814 2500672 2574411 2641304 2697920 2740075 2763700 2766378 2747774 2708716
50105 2708716 2650635 2576066 2488700 2392271 2289829 2184347 2079126 1976865 1878851 1785804
50095 1785804 1699064 1620174 1549672 1487070 1431784 1383271 1340465 1302032 1267395 1236971 1211301
50084 1211301 1190381 1173834 1161209 1152028 1145867 1142362 1140887 1140465 1140411 1140782 1141680 1142414 1141982 1140196 1137540
$$ packed form
50166G23293j292n50P01K065K941L124K979K990L389M238N566P188Q689R871J1021
50151G86213J2461J3996J5099J5529J5349J4534J2946J0795Q761P505P281P990
50139I28459R341J0932J2522J4440J7512K2376K8873L6206M3626N0947N8434O6239
50127A299907P4054Q1282Q7391R1875R4167R4038R2174Q9800Q7611Q5500Q3380
50116B261179Q1577Q0058P7858P3739O6893N6616M2155K3625K678j8604l9058
50105B708716n8081p4569q7366r6429j02442j05482j05221j02261r8014r3047
50095A785804q6740p8890p0502o2602n5286m8513m2806l8433l4637l0424k5670
50084A211301k0920j6547j2625r181o161l505j475m22n4L71Q98P34m32j786k656
$$ plain form
50069 1137540 1134057 1129181 1122788 1115587 1108187 1100371 1091603 1081805 1071376 1060843 1050670 1041030 1031589
50056 1031589 1021813 1011643 1001601 992323 984358 978311 974569 972743 971884 971474 971812 973412 976508 981262
50042 981262 987899 996354 1006122 1016659 1027657 1038872 1050171 1061794 1074079 1086798 1099209 1110845
50030 1110845 1121775 1132055 1141580 1150621 1159788 1169081 1177589 1184453 1189621 1193324 1195543 1196447 1196806 1197435
50016 1197435 1198750 1201355 1206362 1214346 1224479 1235707 1248645 1265518 1288214 1317125 1351729 1391371
50004 1391371 1435092 1481310 1528170 1574079 1617916 1659269 1698795 1738122 1778949 1822026 1866674
49993 1866674 1910814 1951269 1984327 2006446 2014732 2007238 1983242 1943402 1889490 1823886 1749329 1668893
49981 1668893 1585757 1502709 1421927 1345139 1273765 1208757 1150393 1098365 1052036 1010718 973901
$$ packed form
50069A137540l483m876o393p201p400p816q768r798j0429j0533j0173r640r441
50056A031589r776j0170j0042r278p965o047l742j826q59m10L38J600L096M754
50042I81262O637Q455R768J0537J0998J1215J1299J1623J2285J2719J2411J1636
50030A110845J0930J0280R525R041R167R293Q508O864N168L703K219R04L59O29
50016A197435J315K605N007P984J0133J1228J2938J6873K2696K8911L4604L9642
50004A391371M3721M6218M6860M5909M3837M1353L9526L9327M0827M3077M4648
49993A866674M4140M0455L3058K2119Q286p494k3996l9840n3912o5604p4557q0436
49981A668893q3136q3048q0782p6788p1374o5008n8364n2028m6329m1318l6817
$$ plain form
49970 973901 941378 913070 888625 867305 848376 831523 816700 803572 791438 779941 769539
49959 769539 760869 753769 747449 741716 737391 735176 734718 735301 737032 740623 746183 752961 760205 767536 774535
49944 774535 780732 786166 791264 795989 799768 802504 804872 807232 808869 808796 806573 801808 793616 781482
49930 781482 766321 749823 732963 715830 698757 682719 668533 656318 645866 636995 629426 622891
49918 622891 617571 614028 612546 612779 614092 615870 617457 618327 618573 618951 620209 622632 626306 631482 638294
49903 638294 646338 654935 663838 673534 684709 697478 711152 724711 737431 748953 758876 766564 771513
49890 771513 773685 773401 771051 767098 762042 756054 748765 739778 729293 717906 705895 693153 679833
$$ packed form
49970I73901l2523k8308k4445k1320j8929j6853j4823j3128j2134j1497j0402
49959G69539q670p100o320n733m325k215m58N83J731L591N560O778P244P331O999
49944G74535O197N434N098M725L779K736K368K360J637p3k223m765q192j2134
49930G81482j5161j6498j6860j7133j7073j6038j4186j2215j0452q871p569o535
49918F22891n320l543j482K33J313J778J587Q70K46L78J258K423L674N176O812
49903F38294Q044Q597Q903R696J1175J2769J3674J3559J2720J1522R923P688M949
49890G71513K172k84k350l953n056n988p289q987j0485j1387j2011j2742j3320
$$ [...]
##END NTUPLES=NMR SPECTRUM
##END=
