
##TITLE=AC1382_GUAAH12194_7519056_AE5WHbNVYD
##JCAMPDX= 6.0         $$ Bruker NMR JCAMP-DX V2.0
##DATA TYPE= NMR SPECTRUM
##DATA CLASS= NTUPLES
##ORIGIN= BRUKER
##OWNER= Administrator
$$ 1.72 TOPSPIN		Version 2.1
$$ 2013-02-21 01:12:19.241 -0500  Administrator@X
$$ Compression mode = diff/dup
##.OBSERVE FREQUENCY= 400.02188249412
##.OBSERVE NUCLEUS= ^1H
##.ACQUISITION MODE= SIMULTANEOUS (DQD)
##.ACQUISITION SCHEME= undefined
##.AVERAGES= 8
##.DIGITISER RES= 22
##SPECTROMETER/DATA SYSTEM= spect
##.PULSE SEQUENCE= zg30
##.SOLVENT NAME= COFFEE_meoh
##.SHIFT REFERENCE= INTERNAL, COFFEE_meoh, 1, 14.98509
##AUDIT TRAIL= $$ (NUMBER, WHEN, WHO, WHERE, PROCESS, VERSION, WHAT)
$$ ##TITLE= Audit trail, TOPSPIN		Version 2.1
$$ ##JCAMPDX= 5.01
$$ ##ORIGIN= Bruker BioSpin GmbH
$$ ##OWNER= Administrator
$$ $$ E:\/data/COFFEE/nmr/AC1382_GUAAH12194_7519056_AE5WHbNVYD/10/pdata/1/auditp.txt
$$ ##AUDIT TRAIL=  $$ (NUMBER, WHEN, WHO, WHERE, PROCESS, VERSION, WHAT)
(   1,<2013-02-21 01:12:10.741 -0500>,<Administrator>,<X>,<go>,<TOPSPIN 2.1>,
      <created by zg
	started at 2013-02-21 01:11:04.531 -0500,
	POWCHK enabled, PULCHK disabled,
       configuration hash MD5:
       86 BA 57 50 F2 9D 5C 9B 26 00 A9 28 5F 66 2E 89
       data hash MD5: 64K
       6B AB 86 85 38 C5 BD 9C 20 F7 87 38 F6 6C 8B 16>)
(   2,<2013-02-21 01:12:13.928 -0500>,<Administrator>,<X>,<proc1d>,<TOPSPIN 2.1>,
      <Start of raw data processing
       efp LB = 0 FT_mod = 6 PKNL = 1 PHC0 = 0 PHC1 = 0 SI = 32K 
       data hash MD5: 32K
       34 27 C3 94 8B C8 47 FA 55 C5 EE 20 08 C4 94 7B>)
(   3,<2013-02-21 01:12:14.428 -0500>,<Administrator>,<X>,<proc1d>,<TOPSPIN 2.1>,
      <pk PHC0 = 68.2196 PHC1 = 0 
       data hash MD5: 32K
       F1 A3 DE E0 6B 04 2C EE 7D 05 05 B6 50 05 2A 35>)
(   4,<2013-02-21 01:12:14.647 -0500>,<Administrator>,<X>,<proc1d>,<TOPSPIN 2.1>,
      <abs ABSG = 1 
       data hash MD5: 32K
       AB 0E 84 10 60 34 FC 3A BD C1 BB C3 23 2E A8 1E>)
(   5,<2013-02-21 01:12:14.803 -0500>,<Administrator>,<X>,<proc1d>,<TOPSPIN 2.1>,
      <abs ABSG = 2 
       data hash MD5: 32K
       95 D9 66 E5 DD 3F B0 08 05 8E 31 BD 07 56 0D DE>)
(   6,<2013-02-21 01:12:14.944 -0500>,<Administrator>,<X>,<proc1d>,<TOPSPIN 2.1>,
      <abs ABSG = 3 
       data hash MD5: 32K
       88 B1 B6 94 74 10 82 B1 99 86 BD 72 71 7F 14 48>)
(   7,<2013-02-21 01:12:15.100 -0500>,<Administrator>,<X>,<proc1d>,<TOPSPIN 2.1>,
      <abs ABSG = 4 
       data hash MD5: 32K
       C4 9E 60 CC 02 52 0B C4 9F 60 A2 A1 25 02 6E 5E>)
(   8,<2013-02-21 01:12:15.287 -0500>,<Administrator>,<X>,<proc1d>,<TOPSPIN 2.1>,
      <abs ABSG = 5 
       data hash MD5: 32K
       00 22 15 9C 51 8A 1E BD 7F CC B8 37 3D 9E 8D 3A>)
$$ ##END=
$$ 
$$ $$ hash MD5
$$ $$ BA 2E B2 4E 7F 8B B4 A5 31 E0 72 14 89 D0 E1 F8
##$RELAX= 
##$RELAX= 
##$RELAX= 
##$RELAX= 
##$RELAX= 
##$RELAX= 
##$RELAX= 
$$ Bruker specific parameters
$$ --------------------------
##$DU= <E:\>
##$EXPNO= 10
##$NAME= <AC1382_GUAAH12194_7519056_AE5WHbNVYD>
$$ [...]
150 150 150 150 150 150 150 150
##$TP07= 0
##$TPNAME0= <>
##$TPNAME1= <>
##$TPNAME2= <>
##$TPNAME3= <>
##$TPNAME4= <>
##$TPNAME5= <>
##$TPNAME6= <>
##$TPNAME7= <>
##$TPOAL= (0..7)
0.5 0.5 0.5 0.5 0.5 0.5 0.5 0.5
##$TPOFFS= (0..7)
0 0 0 0 0 0 0 0
##$TUNHIN= 0
##$TUNHOUT= 0
##$TUNXOUT= 0
##$USERA1= <user>
##$USERA2= <user>
##$USERA3= <user>
##$USERA4= <user>
##$USERA5= <user>
##$V9= 5
##$VALIST= <valist>
##$VCLIST= <CCCCCCCCCCCCCCC>
##$VD= 0
##$VDLIST= <DDDDDDDDDDDDDDD>
##$VPLIST= <PPPPPPPPPPPPPPP>
##$VTLIST= <TTTTTTTTTTTTTTT>
##$WBST= 1024
##$WBSW= 4
##$XGAIN= (0..3)
0 0 0 0
##$XL= 0
##$YL= 0
##$YMAX_a= 563700
##$YMIN_a= -561223
##$ZGOPTNS= <>
##$ZL1= 120
##$ZL2= 120
##$ZL3= 120
##$ZL4= 120
##$ABSF1= 14.98509
##$ABSF2= -5.573092
##$ABSG= 5
##$ABSL= 3
##$ALPHA= 0
##$AQORDER= 0
##$ASSFAC= 0
##$ASSFACI= 0
##$ASSFACX= 0
##$ASSWID= 0
##$AUNMP= <proc_prof1d_extract_pilot.lims>
##$AXLEFT= 0
##$AXNAME= <>
##$AXNUC= <1H>
##$AXRIGHT= 0
##$AXTYPE= 0
##$AXUNIT= <>
##$AZFE= 0.1
##$AZFW= 0.1
##$BCFW= 0
##$BC_mod= 0
##$BYTORDP= 0
##$COROFFS= 0
##$CY= 15
##$DATMOD= 1
##$DC= 0
##$DFILT= <>
##$DTYPP= 0
##$F1P= 0
##$F2P= 0
##$FCOR= 0.5
##$FTSIZE= 32768
##$FT_mod= 6
##$GAMMA= 0
##$GB= 0
##$INTBC= 1
##$INTSCL= 1
##$ISEN= 128
##$LB= 0
##$LEV0= 0
##$LPBIN= 0
##$MAXI= 10000
##$MC2= 0
##$MEAN= 0
##$ME_mod= 0
##$MI= 0
##$NCOEF= 0
##$NC_proc= -8
##$NLEV= 6
##$NOISF1= 0
##$NOISF2= 0
##$NSP= 0
##$NTH_PI= 0
##$NZP= 0
##$OFFSET= 14.98509
##$PC= 1
##$PHC0= 68.2196
##$PHC1= 0
##$PH_mod= 1
##$PKNL= yes
##$PPARMOD= 0
##$PPDIAG= 0
##$PPIPTYP= 0
##$PPMPNUM= 2147483647
##$PPRESOL= 1
##$PSCAL= 4
##$PSIGN= 0
##$PYNMP= <proc.py>
##$REVERSE= no
##$SF= 400.02
##$SI= 32768
##$SIGF1= 0
##$SIGF2= 0
##$SINO= 400
##$SIOLD= 32768
##$SPECTYP= <>
##$SREGLST= <1H.CDCl3>
##$SSB= 0
##$STSI= 32768
##$STSR= 0
##$SW_p= 8223.68421052631
##$SYMM= 0
##$S_DEV= 0
##$TDeff= 65536
##$TDoff= 0
##$TI= <>
##$TILT= no
##$TM1= 0
##$TM2= 0
##$TOPLEV= 0
##$USERP1= <user>
##$USERP2= <user>
##$USERP3= <user>
##$USERP4= <user>
##$USERP5= <user>
##$WDW= 1
##$XDIM= 32768
##$YMAX_p= 461067876
##$YMIN_p= -688903
##$CURPLOT= <Network HP LaserJet P1505>
##$CURPRIN= <$Network HP LaserJet P1505>
##$DFORMAT= <normdp>
##$LAYOUT= <+/1D_H.xwp>
##$LFORMAT= <normlp>
##$PFORMAT= <normpl>
##$SURQMSG= 1
$$ End of Bruker specific parameters
$$ ---------------------------------
##NTUPLES= NMR SPECTRUM
##VAR_NAME=  FREQUENCY,     SPECTRUM/REAL,   SPECTRUM/IMAG
##SYMBOL=    X,             R,               I
##VAR_TYPE=  INDEPENDENT,   DEPENDENT,       DEPENDENT
##VAR_FORM=  AFFN,          ASDF,            ASDF
##VAR_DIM=   32768,         32768,           32768
##UNITS=     HZ,            ARBITRARY UNITS, ARBITRARY UNITS
##FACTOR=    0.250966925370066, 1,           1
##FIRST=     8223.43324360094, 41113,        -132674
##LAST=      0,             87348,           -119753
##MIN=       0,             -688903,         0
##MAX=       8223.43324360094, 461067876,    0
$$ Real data points
##PAGE= N=1
##DATA TABLE= (X++(R..R)), XYDATA
$$ [...]
19561a72870A01390g8451D8274K72912a41015j80043d0058A4747a33785m2680
$$ -172870 101390 -78451 48274 321186 -141015 -321058 -40058 14747 -133785 -176465
19551a76465f4424p6140k9102k30317m545a30050D2204a2003A7781a21765N2482
$$ -176465 -64424 -140564 -169666 -399983 -404528 -130050 42204 -12003 17781 -121765 -69283
19540f9283A8763h0275a8876C1452b29074j41223f093k10551b6993C06432B2681
$$ -69283 18763 -80275 -18876 31452 -229074 -370297 -6093 -216644 -26993 306432 22681
19528a96575G2870b5417j04853j7159F0140b6814H6972e2182l9904j02975i2184
$$ -196575 72870 -25417 -130270 -147429 60140 -26814 86972 -52182 -92086 -195061 -92184
19516h0962C6379J43100a62755g433r3651n4843j86198A64912c01294a8415I4968
$$ -80962 36379 179479 -162755 -7433 -101084 -155927 -342125 164912 -301294 -18415 94968
19504i2853f51k21180A77238a37194q186K1313k18259G3937a64704c9514A409
$$ -92853 -651 -221831 177238 -137194 -145380 -124067 -342326 73937 -164704 -39514 1409
19492a76890j06515F4073a58469A75173n1172k671a28649j5259e6016j89299A88729
$$ -176890 -283405 64073 -158469 175173 124001 121330 -128649 -143908 -56016 -245315 188729
19480e9499p6355L6883D5177b04871A6133K40179B23a1387l7099A02812N1060
$$ -59499 -135854 -98971 45177 -204871 16133 256312 223 -11387 -48486 102812 153872
19469A53872c5522o3960a7507A05707c57118A8368a14331d5664C3824b53278P4910
$$ 153872 -35522 -99482 -17507 105707 -357118 18368 -114331 -45664 33824 -253278 -178368
19458a78368n9978Q9163A97983A8083i4385p457A83164A4116b05548h3910j1200
$$ -178368 -238346 -149183 197983 18083 -94385 -101842 183164 14116 -205548 -83910 -95110
19447i5110d780j67294d259E1900a70865q2165I6143i9917M495j70599Q6526e7902
$$ -95110 -4780 -172074 -4259 51900 -170865 -253030 96143 -99917 -95422 -266021 -179495 -57902
19434h6194L7028l7268H917b3608l2886k8010j4851m4498B0651a55539k4534j3643
$$ -86194 -49166 -86434 8917 -23608 -56494 -84504 -99355 -143853 20651 -155539 -180073 -193716
19422a93716I2362B0364J00545b15584N7701a3179j0989B61994j11250n6281k3796
$$ -193716 92362 20364 120909 -215584 -157883 -13179 -24168 261994 150744 94463 70667
19411G0667c80487a78154e2996E7846a78743A3010a33865M067N4409F3759d57494
$$ 70667 -380487 -178154 -52996 57846 -178743 13010 -133865 -129798 -75389 63759 -457494
19399a40485M067P553k0492g2951a8860A81861a34146k81409a19795a2027p3477
$$ -140485 -136418 -128865 -149357 -72951 -18860 181861 -134146 -415555 -119795 -12027 -85504
19388h5504J2682H840a31719B03811r3522L72A1521K6269h8355A5346b8031l6610
$$ -85504 -72822 8840 -131719 203811 110289 110661 11521 37790 -88355 15346 -28031 -64641
19376f4641C7912K24689j23649a73580A23235Q6136l6977c89078a1166k41948
$$ -64641 37912 262601 138952 -173580 123235 209371 172394 -389078 -11166 -253114
19366b53114c2116j97000Q8790G2717L1712a09993k55616F1861C0127K47744a89517
$$ -253114 -32116 -229116 -140326 72717 104429 -109993 -365609 61861 30127 277871 -189517
19354C439c09177A7665H44h0454j8526j23789P8067B3498a69798R041j11837A80654
$$ 3439 -309177 17665 844 -80454 -98980 -222769 -144702 23498 -169798 -160757 -272594 180654
19341a25134A89975q2947a39826L6178b6983j09036p1125B55982b62811A45487
$$ -125134 189975 107028 -139826 -103648 -26983 -136019 -207144 255982 -262811 145487
19330G9840b58185B82425c88666C82889j82721l4133a14350e3787G9450b15794
$$ 79840 -258185 282425 -388666 382889 200168 166035 -114350 -53787 79450 -215794
19319B09373c37149j29015H1281O1764a41772p496N5024k964b6984n2585l77074
$$ 209373 -337149 -466164 81281 143045 -141772 -149268 -94244 -97208 -26984 -79569 -456643
19308d56643J72442J37362K1608b1868l50206A06866L9037A7643O8342B1294d4012
$$ -456643 -284201 -146839 -125231 -21868 -372074 106866 145903 17643 85985 21294 -44012
19296A6733f1400A78038f7719A25806b3749B26781b50817p432K1910E392i7931
$$ 16733 -61400 178038 -67719 125806 -23749 226781 -250817 -258249 -236339 5392 -97931
19284E0293a00673I3035c11840A9678a73723L5074f8375a7094j8407j76724O0174
$$ 50293 -100673 93035 -311840 19678 -173723 -138649 -68375 -17094 -35501 -212225 -152051
19273a52051A21308c2069A09557b13460c91A57709a47547A73933i0562I6549g5172
$$ -152051 121308 -32069 109557 -213460 -391 157709 -147547 173933 -90562 96549 -75172
19261c95037J77106N3146A21103e8641A15247a31720L9127M901j14101C33559
$$ -395037 -217931 -164785 121103 -58641 115247 -131720 -92593 -87692 -201793 333559
19250d5419k03343L3804d4570j24484A59442c06331b7594B22652d39104P8130
$$ -45419 -248762 -214958 -44570 -169054 159442 -306331 -27594 222652 -439104 -360974
19240c60974h5754d66j9553j11223a708l1241n8940B04916a95035H9821J86385
$$ -360974 -85754 -466 -20019 -131242 -1708 -32949 -91889 204916 -195035 89821 276206
19229B76206j36429a02723l10213a47953A4399a48461P0971A16156j0629a45659
$$ 276206 139777 -102723 -412936 -147953 14399 -148461 -77490 116156 105527 -145659
19218C6761i8204A445J19590a3192k98855A79912g0611B5949b26356k544I1446
$$ 36761 -98204 1445 121035 -13192 -312047 179912 -70611 25949 -226356 -228900 91446
19206a35737p0168j47258A24780D9428c0223j84665B81001a32329g668j48000
$$ -135737 -205905 -353163 124780 49428 -30223 -214888 281001 -132329 -7668 -155668
19196a55668r0413A77144J08751I511L1413K88752I5039b19082N9255f1819k7228
$$ -155668 -246081 177144 285895 9511 40924 329676 95039 -219082 -159827 -61819 -89047
19185h9047a7620k84049F9116A1971h0671b7387A63276o4681K11914b45373a20835
$$ -89047 -17620 -301669 69116 11971 -80671 -27387 163276 98595 310509 -245373 -120835
19173A49426b62084A94758a53460B8221a0802a400n5440d755l60343M6214j94535
$$ 149426 -262084 194758 -153460 28221 -10802 -1400 -56840 -4755 -365098 -318884 -513419
19162e13419D10846F7215a49738k04236J66279D2132g7611K6459A92278j8946
$$ -513419 410846 67215 -149738 -353974 -187695 42132 -77611 -51152 192278 173332
19152A73332a01167m6023c7600a1833k11686E808b5376o6550k10513J29617H865
$$ 173332 -101167 -147190 -37600 -11833 -223519 5808 -25376 -91926 -302439 -172822 8865
19140c9333a7155G357f5654a4841A9768b53806b6666P105j37927a2501A7921d14441
$$ -39333 -17155 7357 -65654 -14841 19768 -253806 -26666 -19561 -157488 -12501 17921 -414441
19127g0970D0864d1785B83612j18064B3641J58334a10562A3459J25542J30734
$$ -70970 40864 -41785 283612 165548 23641 181975 -110562 13459 139001 269735
19117B69735a13815j39173A42677b39924A18278J23156J28109a55500A19279a69762
$$ 269735 -113815 -252988 142677 -239924 118278 241434 369543 -155500 119279 -169762
19106c57220b0573j64216e9255B6273J85593b4606m67469a72242E157a67552C01580
$$ -357220 -20573 -184789 -59255 26273 211866 -24606 -492075 -172242 5157 -167552 301580
19094A09342j6063b36475N4509F9904P2187b29362j63637A89668h2700o0220g677
$$ 109342 93279 -236475 -181966 69904 142091 -229362 -392999 189668 -82700 -142920 -7677
19082a1131B00527i2919K4079B3123M15123C8084o737J832L58784j57785f1669
$$ -11131 200527 -92919 -68840 23123 438246 38084 31347 33179 391963 234178 -61669
19070f8006k09487J26774J013q4738J03212A3650b74420M6678G7861b19717g4091
$$ -68006 -277493 -150719 -149706 -234444 -131232 13650 -274420 -227742 77861 -219717 -74091
19058b82964L2160F5766Q4756a7590l43871c2440B22476d3759j64502N5498A7855
$$ -282964 -250804 65766 150522 -17590 -361461 -32440 222476 -43759 -208261 -152763 17855
19046b78140E1478K00576B3665a35915E6868P1891b60071A40525j163j8328e7752
$$ -278140 51478 252054 23665 -135915 56868 128759 -260071 140525 139362 121034 -57752
19034D6604K89736b62262B39031d2670n9750a0294E7025K09021A2845N2828J44824
$$ 46604 336340 -262262 239031 -42670 -102420 -10294 57025 266046 12845 65673 210497
19023B10497G758M7675h4379A87456C1701a77104C02348a27688l283o1170c8113
$$ 210497 7758 55433 -84379 187456 31701 -177104 302348 -127688 -130971 -192141 -38113
19011f6049k06968J19534K9834N749b2755C2612a76250k5976o233D6588J97692
$$ -66049 -273017 -153483 -123649 -117900 -22755 32612 -176250 -202226 -208459 46588 244280
19000B44280B6915l504K75808D1059a390l33080J45708f1571A64429d1093j36092
$$ 244280 26915 23411 299219 41059 -1390 -334470 -188762 -61571 164429 -41093 -177185
18989a77185M055k36909k05325D013b4348G2185A5246a61777p7159a7759e170
$$ -177185 -173130 -410039 -615364 4013 -24348 72185 15246 -161777 -238936 -17759 -5170
18977a98157l8347H2538i3330A00846K3494M5083c31910A53111a1188k50683g7470
$$ -198157 -236504 82538 -93330 100846 124340 169423 -331910 153111 -11188 -261871 -77470
18965d6815j99888g2681j11513F5158a20961I7861a43347A89363a12274A0225
$$ -46815 -246703 -72681 -184194 65158 -120961 97861 -143347 189363 -112274 10225
18954A46125Q5108a06846J6437c0758Q563p9340B31177K53038C3051c30957a60593
$$ 146125 231233 -106846 -90409 -30758 -22195 -101535 231177 484215 33051 -330957 -160593
18942A96903p5175b30168J09325c2708j93624d1191k38320R2488L1577j3906k6002
$$ 196903 121728 -230168 -120843 -32708 -226332 -41191 -279511 -187023 -155446 -169352 -195354
18931a95354B23038I9364a43859A1899e8641j34042A27148a26768d4467A1478
$$ -195354 223038 99364 -143859 11899 -58641 -192683 127148 -126768 -44467 11478
18920a90132b1299B56919c09008a33382o4867l1283B57210f6502p6154B2341a49350
$$ -190132 -21299 256919 -309008 -133382 -198249 -229532 257210 -66502 -142656 22341 -149350
18908b3957j26546j65745D37270A81716m6006a87989A64306f0008j5175q4363
$$ -23957 -150503 -316248 437270 181716 135710 -187989 164306 -60008 -75183 -159546
18898a59546F3195l0551a23214j30440B20107f2359C8273J01267B7757J38205
$$ -159546 63195 32644 -123214 -253654 220107 -62359 38273 139540 27757 165962
18888A65962d26779B8930J93774b00730L3195B0308J53948h0864j15585d3510
$$ 165962 -426779 28930 222704 -200730 -167535 20308 174256 -80864 -196449 -43510
18877c93238J01714A5462L8902J1555c34006A04283G617b2588j51306k21229A06814
$$ -393238 -291524 15462 54364 65919 -334006 104283 7617 -22588 -173894 -395123 106814
18865a14821B8752h6113R197F0986A7249M4324b2524m2831A74548i837B04138
$$ -114821 28752 -86113 -76916 60986 17249 61573 -22524 -65355 174548 -9837 204138
18853c85805a54290A3983J9624f9722C40510a68379J279d7425G3106B7558K44314
$$ -385805 -154290 13983 33607 -69722 340510 -168379 -167100 -47425 73106 27558 271872
18842B71872a75036A32902a78273f4818j94397d0123n6710B57881B8990J83908
$$ 271872 -175036 132902 -178273 -64818 -259215 -40123 -96833 257881 28990 212898
18832B12898F3101J45783a33279c1130A33959c16862d526A55586b24317A36503
$$ 212898 63101 208884 -133279 -31130 133959 -316862 -4526 155586 -224317 136503
18821a23238e0923c951b05r1362J1372A77440N7335g5162C53088j33870p4310
$$ -123238 -50923 -3951 -205 -91567 -80195 177440 234775 -75162 353088 219218 144908
18810A44908o9629J315R9132o643c6308l6959j54121A71840M04167a73797B98144
$$ 144908 75279 76594 175726 169083 -36308 -73267 -227388 171840 576007 -173797 298144
18798f3094C39591f5425H0963a0919I0753a11090A03758a68347P0294B52445A14564
$$ -63094 339591 -65425 80963 -10919 90753 -111090 103758 -168347 -98053 252445 114564
18786a60365q3292K9692i6532C6298a02969j42478C89933i9125j69251D8251i3337
$$ -160365 -243657 -213965 -96532 36298 -102969 -245447 389933 -99125 -268376 48251 -93337
18774a39970A86539b14898m1359J08225I2538g1999K6107G0469f9412k0210k06497
$$ -139970 186539 -214898 -256257 -148032 92538 -71999 -45892 70469 -69412 -89622 -296119
18763b96119A14911l6099g8245E3668c72593f9832n4227k08901A52821c74944
$$ -296119 114911 78812 -78245 53668 -372593 -69832 -124059 -332960 152821 -374944
18752c3355J374k88658I6667l1986a29869K9238j1740o7675k3818A72966C4039
$$ -33355 -31981 -320639 96667 64681 -129869 -100631 -112371 -180046 -203864 172966 34039
18740c01935c0926B17788G8694J9049b48617A05087a37313A37496n5076b08295
$$ -301935 -30926 217788 78694 97743 -248617 105087 -137313 137496 82420 -208295
18729A71668m931M7062F8149b32012R9108d919m14761E1245c23169A14009h1873
$$ 171668 166737 213799 68149 -232012 -132904 -4919 -419680 51245 -323169 114009 -81873
18717f6431K7762E6845O7543b18152e8820r5049H1538l366a65825N5468A10568
$$ -66431 -38669 56845 124388 -218152 -58820 -153869 81538 78172 -165825 -110357 110568
18705d4976p3123m7037A44470b4033n6736A02692B6255a90897F9229a99236N0683
$$ -44976 -118099 -165136 144470 -24033 -80769 102692 26255 -190897 69229 -199236 -148553
18694a48553D0391L568P8069e48335i7140k2914k5935I1996Q9609a20520n8071
$$ -148553 40391 43959 122028 -548335 -97140 -120054 -145989 91996 181605 -120520 -178591
18683a78591K8903G1336K40149e0277K2665A9265J92338c51477a5630A6841h5206
$$ -178591 -149688 71336 311485 -50277 -27612 19265 211603 -351477 -15630 16841 -85206
18671B34200b28974f5923B9800K86006b15773J07717C086i3623n1198c6296A22964
$$ 234200 -228974 -65923 29800 315806 -215773 -108056 3086 -93623 -144821 -36296 122964
18659b2431j22347B10709a08776k78112E0239a64931j677C7230b95730A95383
$$ -22431 -144778 210709 -108776 -386888 50239 -164931 -166608 37230 -295730 195383
18648e1643D3155b55409C08956c06802J40582l9658b2492j6630A43628J16442
$$ -51643 43155 -255409 308956 -306802 -166220 -205878 -22492 -39122 143628 260070
18638B60070d20381a13599o7788Q5755K5113C7718J59540c06477F0618b10346
$$ 260070 -420381 -113599 -181387 -95632 -70519 37718 197258 -306477 60618 -210346
18627D9679i6229D9492c10041e3207j77866B01637c76830a67123B41352l5270
$$ 49679 -96229 49492 -310041 -53207 -231073 201637 -376830 -167123 241352 206082
18617B06082i153j19335O3266j00901N6997H3408a79749j0329K0768j6094j23516
$$ 206082 -9153 -128488 -65222 -166123 -109126 83408 -179749 -190078 -169310 -185404 -308920
18606c08920a8846d091k2192n689l97281J9306b7689G658c4194k40772E5695K60482
$$ -308920 -18846 -4091 -26283 -31972 -429253 -409947 -27689 7658 -34194 -274966 55695 316177
18594C16177F3027d44878J86295Q4766C1145f7830k05800a29070Q028A67910a56006
$$ 316177 63027 -444878 -258583 -173817 31145 -67830 -273630 -129070 -121042 167910 -156006
18582b36276J13772A66283C1606j1540K49305c22956B02109c6187h753j275G730
$$ -236276 -122504 166283 31606 20066 269371 -322956 202109 -36187 -8753 -10028 7730
18570e543A37229f3284b119j3249k51084a18334B49689b89826R5129L1365P8965
$$ -5543 137229 -63284 -2119 -15368 -266452 -118334 249689 -289826 -194697 -163332 -84367
18559h4367B42233c25307j01969B27676h7188d0538k18639Q4936C1709e0400q5119
$$ -84367 242233 -325307 -427276 227676 -87188 -40538 -259177 -174241 31709 -50400 -135519
18548a35519B7531b29922A33544a01985j5303e7451K702N852k5798G6835J63329
$$ -135519 27531 -229922 133544 -101985 -117288 -57451 -54749 -48897 -74695 76835 240164
18537B40164m3822g728j15319j315I5136d7260j54697A1994b49654A30669b65131
$$ 240164 196342 -7728 -123047 -124362 95136 -47260 -201957 11994 -249654 130669 -265131
18525F4766a87040l8885G0368O1824a14339a2508k40916b9879A58464b8828j94242
$$ 64766 -187040 -225925 70368 132192 -114339 -12508 -253424 -29879 158464 -28828 -223070
18514b23070R9785c9621k92298l4225g8724m593A7733b02827o793D2096O577d6675
$$ -223070 -123285 -39621 -331919 -366144 -78724 -83317 17733 -202827 -209620 42096 48673 -46675
18501B06731A7097a49318c8538a8430I5738J5350b76324C5482M837b9160k3529
$$ 206731 17097 -149318 -38538 -18430 95738 111088 -276324 35482 40319 -29160 -52689
18490e2689j39578C0115a65858I2938D3691b28848A76786G7359M69527I0821a6055
$$ -52689 -192267 30115 -165858 92938 43691 -228848 176786 77359 546886 90821 -16055
18478b62940P6353o909A51921l1839a06713A03370l439a18271A19668k2578b68255
$$ -262940 -186587 -193496 151921 120082 -106713 103370 99931 -118271 119668 97090 -268255
18466a22531E3511a12803q1458c7318j68083C36024A42032i8249K6868G9688d22415
$$ -122531 53511 -112803 -194261 -37318 -205401 336024 142032 -98249 -71381 79688 -422415
18454a0394k79295b44C52820a45770c1439I3521R5632A6913M18567j36498D6587
$$ -10394 -289689 -244 352820 -145770 -31439 93521 189153 16913 435480 298982 46587
18442a28550j42067d5637A49877h8004A06233M8412C9302j875J38451h362C77552
$$ -128550 -270617 -45637 149877 -88004 106233 154645 39302 37427 175878 -8362 377552
18430C9723K07579b03877R7718j9268a7039k9191I5871b20782J7198C1358A4639
$$ 39723 247302 -203877 -106159 -125427 -17039 -46230 95871 -220782 -203584 31358 14639
18418c15598G3018J7264N943a65828A85157a73484l24378a29241J7384A6912N4270
$$ -315598 73018 90282 96225 -165828 185157 -173484 -497862 -129241 -111857 16912 71182
18407G1182a16580j28098e4653J2406j92244J1707C81606a9155A42667b90085
$$ 71182 -116580 -244678 -54653 -42247 -234491 -222784 381606 -19155 142667 -290085
18396A58607i5656A45654e7455k38098F8935L38252b66083A06678c53032J9032
$$ 158607 -95656 145654 -57455 -295553 68935 407187 -266083 106678 -353032 -334000
18386c34000J34958K9643B72668a68178A20568b40849O4864j50454C59517b09040
$$ -334000 -199042 -169399 272668 -168178 120568 -240849 -175985 -326439 359517 -209040
18375A11507e590B0418b05137A90940b3965B80766b10546g3842A3293b93338B6289
$$ 111507 -5590 20418 -205137 190940 -23965 280766 -210546 -73842 13293 -293338 26289
18363A80290b09128O0896l7397H3061d5095k68901J37207c5279A09263K43773
$$ 180290 -209128 -148232 -185629 83061 -45095 -313996 -176789 -35279 109263 353036
18353C53036a54825D20680d7258j56494e9761l6769l68913h6515j00284j71659
$$ 353036 -154825 420680 -47258 -203752 -59761 -96530 -465443 -86515 -186799 -358458
18343c58458a49084G0883I256i2439p4093m1926m2554A23467l7806f9963C1470
$$ -358458 -149084 70883 9256 -92439 -166532 -208458 -251012 123467 85661 -69963 31470
18331b66437b0666l1672j46081B14698c70541E9362b98101B39101a70562A53979
$$ -266437 -20666 -52338 -198419 214698 -370541 59362 -298101 239101 -170562 153979
18320f3321p7614K9445j07279I1226C4866b38140r0376h6047o868A56220f1048
$$ -63321 -140935 -111490 -218769 91226 34866 -238140 -328516 -86047 -92915 156220 -61048
18308a89938A41371K07679b68342A8760M9902L9745J65163b34550b7082p402j34743
$$ -189938 141371 349050 -268342 18760 68662 108407 273570 -234550 -27082 -34484 -169227
18297a69227O6076B65005a4931k94007R1896B17051n9185g6402k7514q9585c8959
$$ -169227 -103151 265005 -14931 -308938 -217042 217051 157866 -76402 -103916 -193501 -38959
18285H6100c0065J4582j96448A49209b2358O353p8998C3899b77818J15775q0156
$$ 86100 -30065 -15483 -211931 149209 -22358 -16005 -95003 33899 -277818 -162043 -242199
18274b42199p1934a54438P3323B7063i2900a2526D0486b13702j12052H7163c31751
$$ -242199 -314133 -154438 -81115 27063 -92900 -12526 40486 -213702 -325754 87163 -331751
18262b08870f3771E04547a7284j68255b8999j69593C5472i0805A3052c08671A37289
$$ -208870 -63771 504547 -17284 -185539 -28999 -198592 35472 -90805 13052 -308671 137289
18250a41950J6375j37796h5666G3379h1611b1990m45388D40430A28515b16528
$$ -141950 -125575 -263371 -85666 73379 -81611 -21990 -467378 440430 128515 -216528
18239e5174k58820a53292j31456h3226b6208r5090N9124A98626F321c78787D150
$$ -55174 -313994 -153292 -284748 -83226 -26208 -121298 -62174 198626 6321 -378787 4150
18227a69653j9913Q7718l6237K3269A78258l4612c63969b9855k05694m6045I3463
$$ -169653 -189566 -101848 -138085 -114816 178258 143646 -363969 -29855 -235549 -281594 93463
18215H75b31837P1210c616B07986b89787C8056f4334C3093K02076a83939G2956
$$ 875 -231837 -160627 -3616 207986 -289787 38056 -64334 33093 235169 -183939 72956
18203b37403K9868E7342O0998A5423a42847B819i784G7649a09360J4674h809j23386
$$ -237403 -207535 57342 118340 15423 -142847 2819 -9784 77649 -109360 -94686 -8809 -132195
18191a32195b8810j45525l3206j00541J21625B3652i1924j15266A81246b10616
$$ -132195 -28810 -174335 -207541 -308082 -186457 23652 -91924 -207190 181246 -210616
18180d9637j19531a2610k46349b6363A08355b8250j06732K1442c7128I4595J5929
$$ -49637 -169168 -12610 -258959 -26363 108355 -28250 -134982 -113540 -37128 94595 110524
18169A10524a0369m5628D0927Q492P2469o0535c9691F3667g9633C8032d0631j32778
$$ 110524 -10369 -55997 40927 49419 121888 61353 -39691 63667 -79633 38032 -40631 -173409
18157a73409A28646A911K5839b60132g7695E4461L9694K06484J0361c33136H9797
$$ -173409 128646 1911 27750 -260132 -77695 54461 94155 300639 311000 -333136 89797
18145b96309A1552d9784A35082b44643J07425k17001J54853c6561a5161A4613
$$ -296309 11552 -49784 135082 -244643 -137218 -354219 -199366 -36561 -15161 14613
18134H4467d936j36423O177G3584c8150B0361a73384j38984a7860D0168j6083
$$ 84467 -4936 -141359 -135182 73584 -38150 20361 -173384 -312368 -17860 40168 24085
18123B4085a00507j5111M8747a0560j82883E8970b4177j25642A27475k5528a57324
$$ 24085 -100507 -115618 -66871 -10560 -193443 58970 -24177 -149819 127475 101947 -157324
18111e4243q9441A34657M8718a13545N5048p8005L0440A78661C9257A7064P9053
$$ -54243 -143684 134657 183375 -113545 -58497 -136502 -106062 178661 39257 17064 96117
18100I6117O008c5535o0752A45855b34877A8381a56969n5633B31116a78191g657
$$ 96117 102125 -35535 -96287 145855 -234877 18381 -156969 -212602 231116 -178191 -7657
18088A05699c7713F7891k6190a82977A93570b29251J01924B51292e8242I0368
$$ 105699 -37713 67891 41701 -182977 193570 -229251 -127327 251292 -58242 90368
18077A23360h0759a8079j46201e0762C38342j17091c50230b3886O755l00131A5771
$$ 123360 -80759 -18079 -164280 -50762 338342 221251 -350230 -23886 -17131 -317262 15771
18065I8315J8959L5886e4801k3339j64069L0159K7093A00914n408k2565a49868
$$ 98315 117274 153160 -54801 -78140 -242209 -212050 -184957 100914 95506 72941 -149868
18053A88104o359K16731A04063a20665r910j88930D2344L5635O7935b37051B77820
$$ 188104 181745 398476 104063 -120665 -130575 -319505 42344 77979 145914 -237051 277820
18041a59651P1636n6784b7371j53104o4142J18760k14871L0999A31727a79260
$$ -159651 -88015 -144799 -27371 -180475 -244617 -125857 -340728 -309729 131727 -179260
18030a59551c0615A06208J39643e0615A36180a56798F7474a70753F0272b84371
$$ -159551 -30615 106208 245851 -50615 136180 -156798 67474 -170753 60272 -284371
18019b40817D3308b21065Q2327G3263k7633J23710p3539a70231l1556M5580B68651
$$ -240817 43308 -221065 -138738 73263 45630 169340 95801 -170231 -201787 -156207 268651
18007b2660j76050k25802e5610j9715J6801l4748R454j7606m3634k5874H2297
$$ -22660 -198710 -424512 -55610 -75325 -58524 -93272 -83818 -101424 -145058 -170932 82297
17995B53023g889j50393A75296J20963h3991D1608J32827a43171A07403b92820
$$ 253023 -7889 -158282 175296 296259 -83991 41608 174435 -143171 107403 -292820
17984c29597B49990A4906a88255g1647A81804C1611i1069I5656a83626p3800A58642
$$ -329597 249990 14906 -188255 -71647 181804 31611 -91069 95656 -183626 -257426 158642
17972a36808E6860J05725c06026B503L7460j8121M14674b30460h0566A41511f9658
$$ -136808 56860 162585 -306026 2503 39963 21842 436516 -230460 -80566 141511 -69658
17960a19256J4411C9517O8179O7536i2581C07064a30153A0365b3074G9061b10676
$$ -119256 -104845 39517 107696 175232 -92581 307064 -130153 10365 -23074 79061 -210676
17948c79788A06076P5761E0863J6325f2908j51247A49581j3277E9086a59831j34553
$$ -379788 106076 181837 50863 67188 -62908 -214155 149581 136304 59086 -159831 -294384
17937b94384f5910L0206I847c1660k15464J13578q2441A08827i4734l1246E72417
$$ -294384 -65910 -35704 9847 -31660 -247124 -133546 -215987 108827 -94734 -125980 572417
17925A17436a28541k05521Q5303G102b10223A7179i7384A81017O3231g4618j0988
$$ 117436 -128541 -334062 -248759 7102 -210223 17179 -97384 181017 244248 -74618 -85606
17914h5606D1831a61851J3899b2405j63867A54415a41422M6498C5937e3255j0393
$$ -85606 41831 -161851 -147952 -22405 -186272 154415 -141422 -94924 35937 -53255 -63648
17903f3648j46427A91545P8973b23885Q8265N1704b1225o3382l41390J89227M6956
$$ -63648 -210075 191545 270518 -223885 -135620 -83916 -21225 -84607 -425997 -236770 -189814
17892a89814h2536j8281o9756a992C8508I238K12537b11499e601k19025E081J74780
$$ -189814 -82536 -100817 -170573 -1992 38508 9238 221775 -211499 -5601 -224626 5081 179861
17880A79861B10i4976A56745c7724D5510M873a34339j86936C809a19514d120A89572
$$ 179861 210 -94976 156745 -37724 45510 50383 -134339 -321275 3809 -119514 -4120 189572
17867a49329b2210a0453A34948N5344J4064m1555j2639F038e889r0586j77253
$$ -149329 -22210 -10453 134948 190292 204356 162801 150162 6038 -5889 -96475 -273728
17856b73728g4837f597A9295b8432O320C25190d5558A15629i0211F7027a57289
$$ -273728 -74837 -6597 19295 -28432 -22112 325190 -45558 115629 -90211 67027 -157289
17844i4368E6928i5811j67716g9808A89676a79608c3158A07703i2795A28974a5489
$$ -94368 56928 -95811 -263527 -79808 189676 -179608 -33158 107703 -92795 128974 -15489
17832C1179b44713L0706b5362A0078L0777P733b22065d0038A32220a42530A52901
$$ 31179 -244713 -214007 -25362 10078 40855 48588 -222065 -40038 132220 -142530 152901
17820h5483k79723a655j67679F8234b19160R2560c2904C28970a72976g3478p8347
$$ -85483 -365206 -1655 -169334 68234 -219160 -126600 -32904 328970 -172976 -73478 -151825
17809a51825A13246c43508B68517A7125K64417j07327b03119B8577J4914J685
$$ -151825 113246 -343508 268517 17125 281542 174215 -203119 28577 43491 45176
17799D5176j3386a53764B56456F8421e2344F5543J08394e436J634B03493b43362
$$ 45176 31790 -153764 256456 68421 -52344 65543 173937 -5436 -3802 203493 -243362
17787A25188b12874A35073D6793i1538E7280G399N212J60265b60079N8946M1461
$$ 125188 -212874 135073 46793 -91538 57280 7399 12611 172876 -260079 -201133 -159672
17776a59672g7777q1486A72793a32773D4887J67124f5387o0876A05902a50260
$$ -159672 -77777 -159263 172793 -132773 44887 212011 -65387 -126263 105902 -150260
17765A03486k8493k9165K47948a8281A42670n447e0521b2107j27233f1789l4700
$$ 103486 74993 45828 293776 -18281 142670 137223 -50521 -22107 -149340 -61789 -96489
17754i6489n7828A41055b93788E1841b55158c0925B06921O7578b6599C67128b22384
$$ -96489 -154317 141055 -293788 51841 -255158 -30925 206921 274499 -26599 367128 -222384
17742a3349A27711e2448j06019G0623c71k63111a774n5492b7338k28206G4014
$$ -13349 127711 -52448 -158467 70623 -371 -263482 -1774 -57266 -27338 -255544 74014
17730B8040c51681D60403F1590J07723a04371j093D0443J32440G9227a86767A02583
$$ 28040 -351681 460403 61590 169313 -104371 -105464 40443 172883 79227 -186767 102583
17718a14404k9199B29065b64240B33837b9037B6796d8362j13654A23980k6718
$$ -114404 -143603 229065 -264240 233837 -29037 26796 -48362 -162016 123980 97262
17708I7262G747J79061C8542J92439a41341j83569J31624j03565I7180C1677J39842
$$ 97262 7747 186808 38542 230981 -141341 -324910 -193286 -296851 97180 31677 171519
17697A71519a3147j2268G347a29319O0993j14317C99673a29548A97557D6250a02793
$$ 171519 -13147 -25415 7347 -129319 -68326 -182643 399673 -129548 197557 46250 -102793
17685A0609Q6854d287A01473B4612b1931A58941J91892A43301d3615D7926a78820
$$ 10609 97463 -4287 101473 24612 -21931 158941 350833 143301 -43615 47926 -178820
17673g6365M170p8439A37083K00937j38504d05275J20239B4593f322B14645K9724
$$ -76365 -72195 -150634 137083 338020 199516 -405275 -285036 24593 -6322 214645 244369
17662B44369a20946k80202a2532k11368F1320J84872D161Q9287J09908G5994J94748
$$ 244369 -120946 -401148 -12532 -223900 61320 246192 4161 93448 203356 75994 270742
17651B70742b32072C6146P0637k7055B3191c2273q0713p3278K728B46131a6305
$$ 270742 -232072 36146 106783 79728 23191 -32273 -112986 -186264 -183536 246131 -16305
17639a93068L055C08783l8591b05579B56230c2458k28135J14878q5903D22461
$$ -193068 -190013 308783 270192 -205579 256230 -32458 -260593 -145715 -231618 422461
17628a57042A12160b38012D52635E4051i8778d0633j80616F0846b683k35025L3388
$$ -157042 112160 -238012 452635 54051 -98778 -40633 -221249 60846 -2683 -237708 -204320
17617b04320i206C4854b91549C38264A05907P6574b97043D07019C5913a80464
$$ -204320 -9206 34854 -291549 338264 105907 182481 -297043 407019 35913 -180464
17606a9411j58156B01841b3172j28637B53673m8427g3790l8351F2586K83476h8241
$$ -19411 -177567 201841 -23172 -151809 253673 205246 -73790 -112141 62586 346062 -88241
17594b9811B93331h2626G2131L44139d9829k49088H535a62647Q1044B67565I3598
$$ -29811 293331 -82626 72131 416270 -49829 -298917 8535 -162647 -81603 267565 93598
17582C53965c63774J33399J7151j01944A83988b7006C2169a7819B75159H4717
$$ 353965 -363774 -230375 -213224 -315168 183988 -27006 32169 -17819 275159 84717
17571C43128c8181H4630L5729a04890B36313B9881i1754C8388J22168J53500e0907
$$ 343128 -38181 84630 120359 -104890 236313 29881 -91754 38388 160556 314056 -50907
17559B58949G4347B5521b58605D9085c8457m636J8893G0806J38187A7423E711
$$ 258949 74347 25521 -258605 49085 -38457 -43093 -24200 70806 208993 17423 5711
17547E1894a82531A4706K08793b4762A21687A9283J63334a8036D97275B02308
$$ 51894 -182531 14706 223499 -24762 121687 19283 182617 -18036 497275 202308
17536H6780K17605d929C91964E5963a7506E065a31495L8244A93889l1214J64951
$$ 86780 304385 -4929 391964 55963 -17506 5065 -131495 -93251 193889 162675 327626
17525C27626a83152E6951E783b68019d3272E5782b3617j00918A04051J1119K98955
$$ 327626 -183152 56951 5783 -268019 -43272 55782 -23617 -124535 104051 115170 414125
17514D14125A85039p1096J95370F5294K99707A4030b911p0004H6714A388a37549
$$ 414125 185039 113943 309313 65294 365001 14030 -2911 -72915 86714 1388 -137549
17502B7302J79332k9869D140a85903q4947C8637A0274K50621G7897N8777J41160
$$ 27302 206634 176765 4140 -185903 -270850 38637 10274 260895 77897 136674 277834
17491B77834i1257H4967l8351J42824q6498M0280b295E26610p9526b52832B81335
$$ 277834 -91257 84967 46616 189440 102942 143222 -2295 526610 447084 -252832 281335
17479B64031h1179c3962D5023b01109D9506R6224F1585e6305D098L88161f2218
$$ 264031 -81179 -33962 45023 -201109 49506 145730 61585 -56305 4098 392259 -62218
17467A76130l6364P2044J10691O2463j23517a00756H8215J76910a1669B94014
$$ 176130 139766 211810 322501 384964 261447 -100756 88215 265125 -11669 294014
17456E5102P0731J06054k4955C9751N35794B71640r4411M1585P2009j44323a991
$$ 55102 125833 231887 206932 39751 575545 271640 177229 218814 290823 146500 -1991
17444B5452K2676A1361K27575m6023M2219N8505Q5207j06950j24755K24804l9347
$$ 25452 48128 11361 238936 192913 235132 293637 378844 271894 147139 371943 332596
17433C32596j60787M7913J0513Q1390h5812A88542J30785l6420J13732o583l5383
$$ 332596 171809 219722 230235 311625 -85812 188542 319327 282907 396639 390056 354673
17422C54673h7018I0528L3469L3464R8067r2979J89609A08450J70298L664k2063
$$ 354673 -87018 90528 123997 157461 255528 162549 352158 108450 278748 282412 260349
17411B60349J14252A22729C8294J27801n5996L2450J58637A34877d6577k31431
$$ 260349 374601 122729 38294 166095 110099 142549 301186 134877 -46577 -278008
17401b78008B52065j22803l7844m0012a06614G6001j244J51635Q300b82804C82021
$$ -278008 252065 129262 91418 51406 -106614 76001 74757 226392 234692 -282804 382021
17389A10428L12776A80319M877J86710a96264P3569A73417a58671N1366A38798
$$ 110428 423204 180319 185196 371906 -196264 -122695 173417 -158671 -107305 138798
17378A73163K7606F7312B6817J59851H3454b0494A12651A1055K49812n379G6727
$$ 173163 200769 67312 26817 186668 83454 -20494 112651 11055 260867 255488 76727
17366F1956h6630B51039A01646K32187a0701A35721K711h7026C25610F6357P0384
$$ 61956 -86630 251039 101646 333833 -10701 135721 138432 -87026 325610 66357 136741
17355A36741J83331q04A32623b7387D78503A71401O8149j4765B7910K57617G6630
$$ 136741 320072 319268 132623 -27387 478503 171401 239550 224785 27910 285527 76630
17343E0110J52574C5592J81721m3886E0048R6009c536l0902F4416K6969j0854
$$ 50110 202684 35592 217313 173427 50048 146057 -3536 -34438 64416 91385 80531
17332H0531b7151A89268c46333D13576A85892m6321R4577F1010J84989C0677b6608
$$ 80531 -27151 189268 -346333 413576 185892 139571 234148 61010 245999 30677 -26608
17320B26817A9478a3736B99249j11085N2205m4537q3716L8652K51034n7916A34420
$$ 226817 19478 -13736 299249 188164 240369 195832 112116 150768 401802 343886 134420
17308B06722o3059K84039G8656J77305a38709B01031r259c6062B03762J42013
$$ 206722 143663 427702 78656 255961 -138709 201031 191772 -36062 203762 345775
17298C45775K3719o6733j33530o5408b82200J26792C62335A40095l964K82495
$$ 345775 369494 302761 169231 103823 -282200 -155408 362335 140095 136131 418626
17288D18626C9428b85059A75160e0128A09854D5805J09733a08889B10368b9994
$$ 418626 39428 -285059 175160 -50128 109854 45805 155538 -108889 210368 -29994
17277A07224h1978A6653P9427K82877c48140A15441C6259J66420k0951L79319
$$ 107224 -81978 16653 96080 378957 -348140 115441 36259 202679 181728 561047
17267E61047D9843g0763C1898K72903O420A13811J74693j10974H6088a0213E0123
$$ 561047 49843 -70763 31898 304801 311221 113811 288504 177530 86088 -10213 50123
17255I1833K10676a2694H8968L78184a18657m0534C18864j28103J36777j44329
$$ 91833 302509 -12694 88968 467152 -118657 -159191 318864 190761 327538 183209
17245A83209C5444L24579A5679P530J66693K53497d9708k60209a22204C57555
$$ 183209 35444 360023 15679 23209 189902 443399 -49708 -309917 -122204 357555
17234I9658m5463J80692J60698A83768D5273M1140a66856e164C47903A32727J68461
$$ 99658 54195 234887 395585 183768 45273 86413 -166856 -5164 347903 132727 301188
17223C01188a71345J1899F3909N8312N787P5655F0283A5058K96332j9K18584C7488
$$ 301188 -171345 -159446 63909 122221 128008 203663 60283 15058 311390 311371 529955 37488
17210E49745A85288J82297K39715C02374M2411a1346B70478P3501J14690j72322
$$ 549745 185288 367585 607300 302374 344785 -11346 270478 343979 458669 286347
17200B86347E7512L90865j19563e4460D9183J57254K81031k33831o0619J40997
$$ 286347 57512 448377 328814 -54460 49183 206437 487468 253637 193018 334015
17190C34015j680j8002E6189R7121J4501K17909f9196b0619Q91C25357K25825
$$ 334015 332335 314333 56189 153310 167811 385720 -69196 -20619 -19728 325357 551182
17179E51182J9463j80953R5843k08397M3561j05769j4150J16995o6556p1060J08868
$$ 551182 570645 389692 485535 277138 320699 214930 200780 317775 251219 180159 289027
17168B89027M73318F9905N08581k49607J03364q7816K86348k32189j27357L60862
$$ 289027 762345 69905 578486 328879 432243 344427 630775 398586 271229 632091
17158F32091h3481I9566L75892N7696k44727j10091N2042m0176L05494h2638H4707
$$ 632091 -83481 99566 475458 533154 288427 178336 230378 190202 495696 -82638 84707
17146C75618o3345M4654j27825i4060B38940a56329E12161A76163P5487k2104
$$ 375618 312273 356927 229102 -94060 238940 -156329 512161 176163 251650 229546
17136B29546I9861J66650M65019A23526M45615J02274k51298A34667l5562K68157
$$ 229546 99861 266511 731530 123526 569141 671415 420117 134667 99105 367262
17126C67262J82700j78614M7056k1477m0879P1764j25584J61672j81628C1292
$$ 367262 549962 371348 418404 396927 356048 427812 302228 463900 282272 31292
17115A91690J72243n207j30621o5273J36101l3869r9324K79108o287A4354L64174
$$ 191690 363933 358726 228105 162832 298933 265064 165740 444848 438561 14354 378528
17104C78528j38114o1839M76089B27510k8353Q5231A21632K27416j25166L07904
$$ 378528 240414 178575 654664 227510 199157 284388 121632 349048 223882 531786
17094E31786n4970L5860R1369l0299j380r1373B24579k7732a6733D82139k05657
$$ 531786 476816 512676 604045 573746 572366 480993 224579 196847 -16733 482139 276482
17083B76482J9232K20669B33358L39671B52473L96291B86333L68581k35807G4261
$$ 276482 295714 516383 233358 573029 252473 648764 286333 654914 419107 74261
17072G57692C18250K26352B60463N37146k88755j99651R8068j41484J57181k39
$$ 757692 318250 544602 260463 797609 508854 309203 407271 265787 422968 422729
17062D22729R0616K06943l31338o3536k153N7353A56441J28362J67620L21255
$$ 422729 513345 720288 388950 325414 323261 380614 156441 284803 452423 773678
17052G73678H0189Q46679k87504J02420l65498K53643j35761j30466R4440J4194
$$ 773678 80189 926868 639364 741784 376286 629929 494168 363702 458142 472336
17042D72336L37377J14359D32951O7849J23500o9222M056o1055K4363M7459j7367
$$ 472336 809713 924072 432951 500800 624300 555078 559134 498079 522442 569901 552534
17031E52534K87552j63093q8976o9267M55434D86816K05967k40203L5263L73889
$$ 552534 840086 676993 588017 518750 974184 486816 692783 452580 487843 861732
17021H61732p5179P6350l28308J98546r7030j64997J08205l4911O9194L56243
$$ 861732 786553 862903 534595 733141 636111 471114 579319 544408 613602 969845
17011I69845l11612o3239J29417J21181j9086j89139P6154k40825j48509M02825
$$ 969845 658233 594994 724411 845592 826506 637367 713521 472696 324187 727012
17001G27012K4853J19263k4034n843M1233j02713L957p0128q7039J09567J28727
$$ 727012 751865 871128 847094 841251 882484 779771 783728 713600 626561 736128 864855
16990H64855p9950k22346J29080k6713K21828l36004K80480j00344n9728L73484
$$ 864855 784905 562559 691639 664926 886754 550750 831230 730886 671158 1044642
16980A044642j90423P7539l47504k4973K43306J03355R8533p8213L3664l0241
$$ 1044642 854219 931758 584254 559281 802587 905942 1004475 926262 959926 929685
16970I29685k3150L0252j09731M18951J43490n66557K78069k58527J01147P7111
$$ 929685 906535 936787 827056 1246007 1389497 822940 1101009 842482 943629 1020740
16960A020740j46762J05490Q9071l5904P2346J35165Q3543k37088k85503K35575
$$ 1020740 873978 979468 1068539 1032635 1104981 1240146 1323689 1086601 801098 1036673
16950A036673j25489J23570P1835J8000l849M13226m04438j6111p2844L34264
$$ 1036673 911184 1034754 1106589 1124589 1120740 1533966 1129528 1113417 1040573 1374837
16940A374837N4189k11314m3356J60013k19723N0928L02907k46963j50114J38745
$$ 1374837 1429026 1217712 1174356 1334369 1114646 1165574 1468481 1221518 1071404 1210149
16930A210149J65304k51128M68811k44463M1860M1987l92652K19659L74907k14040
$$ 1210149 1375453 1124325 1593136 1348673 1390533 1432520 1039868 1259527 1634434 1420394
16920A420394J92122k91696K70573P0856j27939k38015J39462L54473J39270o47845
$$ 1420394 1612516 1320820 1591393 1662249 1534310 1296295 1435757 1790230 1929500 1281655
16910A281655N18632o2287k94911L46290k71451M387L06209R0344N2821l09773
$$ 1281655 1800287 1738000 1443089 1789379 1517928 1522315 1828524 1918868 1971689 1661916
16900A661916L0149K33293K42066j17713r1948K39514P2336p19420L60652K13243
$$ 1661916 1692065 1925358 2167424 2049711 1957763 2197277 2269613 1550193 1910845 2124088
16890B124088m991J8636K05591l30693J98064J38399k50036L53913l06031L72657
$$ 2124088 2119097 2137733 2343324 2012631 2210695 2349094 2099058 2452971 2146940 2519597
16880B519597j8153k43874R9989N93102m98245l2663L03682k21749L91901k89985
$$ 2519597 2501444 2257570 2357559 2950661 2452416 2419753 2723435 2501686 2893587 2603602
16870B603602L8159Q7728n4132J97580j85953N30337l21292J44794J7325J16795
$$ 2603602 2641761 2729489 2675357 2872937 2686984 3217321 2896029 3040823 3058148 3174943
16860C174943p9238K58446j32801R6370k0578l9674M09121k96739O8691K49851
$$ 3174943 3095705 3354151 3221350 3317720 3297142 3257468 3666589 3369850 3438541 3688392
16850C688392K0774n1016k02328O45684m72600L43250r5932R2636J56071L1219
$$ 3688392 3709166 3658150 3455822 4101506 3628906 3972156 3876224 3968860 4124931 4156150
16840D156150o7980L49492M31973l25705k01193j64303K30037L98755o9385J64649
$$ 4156150 4088170 4437662 4869635 4543930 4342737 4178434 4408471 4807226 4737841 4902490
16830D902490Q2217J35747J8290O3527K65306n5866n802M36445k90854O33204
$$ 4902490 4984707 5120454 5138744 5202271 5467577 5411711 5405909 5842354 5551500 6184704
16820F184704p3085j98621L80156l52930N53570J17968n9222J18462N78572n0481
$$ 6184704 6111619 5912998 6293154 5940224 6493794 6611762 6552540 6671002 7249574 7199093
16810G199093o1954M01250J1842K45218N36073n8341l47544L81420K84750j27810
$$ 7199093 7137139 7538389 7550231 7795449 8331522 8273181 7925637 8307057 8591807 8463997
16800H463997M43396J55696Q7288O02749L02693o0934L92572l63715R25140K57218
$$ 8463997 8907393 9063089 9150377 9753126 10055819 9994885 10387457 10023742 10948882 11206100
16790A1206100K64246K92178M9226P85659J62321M14806K89962L50733L72944
$$ 11206100 11470346 11762524 11811750 12597409 12759730 13174536 13464498 13815231 14188175
16781A4188175N15566N45541K15769O66799M58806L75462Q18782K01750Q12806
$$ 14188175 14703741 15249282 15465051 16131850 16590656 16966118 17784900 17986650 18799456
16772A8799456P73571O93925P89084Q85860L87576O70423J303215L88959J391728
$$ 18799456 19573027 20266952 21056036 21941896 22329472 22999895 24303110 24692069 26083797
16763B6083797J290568K90833J671246J312970J542003J277724R06768J799756
$$ 26083797 27374365 27665198 29336444 30649414 32191417 33469141 34375909 36175665
16755C6175665J344579K402742J432867J855269K232990J987007K746691K088064
$$ 36175665 37520244 39922986 41355853 43211122 45444112 47431119 50177810 52265874
16747E2265874L005901K709210K946168L190569L806058L738851L709283M188152
$$ 52265874 55271775 57980985 60927153 64117722 67923780 71662631 75371914 79560066
16739G9560066M860302M564924N162561N508927N492043O161588O382011O745115
$$ 79560066 84420368 88985292 94147853 99656780 105148823 111310411 117692422 124437537
16731A24437537N993771P256232O973448O675505O873433O680743O363090N429889
$$ 124437537 130431308 137687540 144660988 151336493 158209926 164890669 171253759 176683648
16723A76683648N031810M167606L520624K118939R92770k28015j509459k390257
$$ 176683648 181715458 185883064 189403688 191522627 192515397 192287382 190777923 188387666
16715A88387666l895070m102063n605571o074613o291718p093830o939484p263618
$$ 188387666 184492596 180390533 174784962 168710349 162418631 155324801 148385317 141121699
16707A41121699p005684o906296o595734o879039o394421o082907n653468n154708
$$ 141121699 134116015 127209719 120613985 113734946 107340525 101257618 95604150 90449442
16699I0449442n525561m527230m613928m173133l809066l938591l256855l038550
$$ 90449442 84923881 80396651 75782723 71609590 67800524 63861933 60605078 57566528
16691E7566528l057834k913995k590115k406935k019987k152539k034580k061142
$$ 57566528 54508694 51594699 49004584 46597649 44577662 42425123 40390543 38329401
16683C8329401j689838j441703j494180j329919j554571j282776j296886j152186
$$ 38329401 36639563 35197860 33703680 32373761 30819190 29536414 28239528 27087342
16675B7087342j079456j073438q91348j150916o14456p69675o95242p78311q30175
$$ 27087342 26007886 24934448 24043100 22892184 22277728 21508053 20812811 20034500 19204325
16666A9204325p98330o08795m35222n64299m67503n05694o99948m82921l48255
$$ 19204325 18405995 17797200 17361978 16797679 16330176 15824482 15124534 14641613 14293358
16657A4293358n84602p3200n95414l86817n61766k14481l36304o7346p16463L7013
$$ 14293358 13708756 13635556 13040142 12653325 12091559 11877078 11540774 11473428 10756965 10793978
16647A0793978m40461j49594o71987j9128k531m67987J53049r14370j52579J13517
$$ 10793978 10353517 10203923 9531936 9512808 9510277 9042290 9195339 8280969 8128390 8241907
16637H241907k94690m76479J94149k74931q4978j96178K0982n87167P8542k11150
$$ 8241907 7947217 7470738 7664887 7389956 7304978 7108800 7129782 6542615 6621157 6410007
16627F410007p0844m09398M41373j77779m49907j97891k3215n17175O67194l10477
$$ 6410007 6339163 5929765 6371138 6193359 5743452 5545561 5522346 5005171 5672365 5361888
16617E361888m52634K75886j34010n7151l52820O9892k15555k34877o3888J32068
$$ 5361888 4909254 5185140 5051130 4993979 4641159 4711051 4495496 4260619 4196731 4328799
16607D328799k96k1311m42569Q9796K2780M1923k40092k8681j81689r3485J83420
$$ 4328799 4328503 4307192 3864623 3954419 3977199 4019122 3779030 3750349 3568660 3475175 3658595
16596C658595o2786m33111O0022K52781l92156L55250j37287k17730J84194l15533
$$ 3658595 3595809 3162698 3222720 3475501 3083345 3438595 3301308 3083578 3267772 2952239
16586B952239m04273L72851j34736M0896k52481K32846m50705K69379l90701N83182
$$ 2952239 2547966 2920817 2786081 2826977 2574496 2807342 2356637 2626016 2235315 2818497
16576B818497n38615L14336k28694J5768J3159k6111Q1795l93877O7018J10895
$$ 2818497 2279882 2594218 2365524 2381292 2394451 2368340 2450135 2056258 2123276 2234171
16566B234171m5339j49535J72051l802l62295L08759l83899l0306o9223K59962
$$ 2234171 2188832 2039297 2211348 2207546 1845251 2154010 1770111 1739805 1670582 1930544
16556A930544o6018J18515j77567k37966J47056K38552j67093j30572o9870R9908
$$ 1930544 1864526 1983041 1805474 1567508 1714564 1953116 1786023 1655451 1585581 1685489
16546A685489o8510J45929l39372J50858R1867K5084j84215J17393J8573j66163
$$ 1685489 1616979 1762908 1423536 1574394 1666261 1691345 1507130 1624523 1643096 1476933
16536A476933J35034l67296L82551n33200M76932m01103J72434l19464L57903
$$ 1476933 1611967 1244671 1627222 1094022 1570954 1169851 1342285 1022821 1380724
16527A380724L02341p562q8212n39471M1993J15687J09674Q9324k93806M55782
$$ 1380724 1683065 1675503 1587291 1047820 1089813 1205500 1315174 1404498 1110692 1566474
16517A566474l23342l77626K17255K09370j50934p3448K61702m68549J346L55847
$$ 1566474 1243132 865506 1082761 1292131 1141197 1067749 1329451 860902 862248 1218095
16507A218095k65815J35611j56562K0556R6904J38321l54141P5910j42908J61691
$$ 1218095 952280 1087891 931329 951885 1048789 1187110 832969 908879 765971 927662
16497I27662K6923J31971K34842o38341M75577j03643j42753L3376m5718M6600
$$ 927662 954585 1086556 1321398 683057 1158634 1054991 912238 945614 899896 946496
16487I46496k26528O77477n99845L87646j48956k29m80308K67371k86522K52534
$$ 946496 719968 1397445 797600 1185246 1036290 1036061 555753 823124 536602 789136
16477G89136j1302J56682J1750j73888k6115l3442L4081M4100L40337l27484J38423
$$ 789136 777834 934516 946266 772378 746263 712821 746902 791002 1131339 803855 942278
16466I42278k57094k6733j56197K27360K68924r4526j99373p3981M80822k38642
$$ 942278 685184 658451 502254 729614 998538 904012 704639 630658 1111480 872838
16456H72838C92464L27880n6090j29793L55833k54005J8186K40913q5288l61113
$$ 872838 392464 720344 664254 534461 890294 636289 654475 895388 810100 448987
16446D48987K38927j54855J61048k16805r0708K17741j11485R1695Q8031K0217
$$ 448987 687914 533059 694107 477302 386594 604335 492850 584545 672576 692793
16436F92793r6797R6059k09304K39167C17167R9240K16450j88373q0045l7087
$$ 692793 595996 692055 482751 721918 317167 416407 632857 444484 364439 327352
16426C27352P5697K23301J41379j34063R2033k77104O4712J2388A51207L24756
$$ 327352 403049 626350 767729 633666 725699 448595 513307 525695 151207 475963
16416D75963j22630K2576o8780M59429r8439L06088D36719J58972J37915B66990
$$ 475963 353333 375909 307129 766558 668119 974207 436719 595691 733606 266990
16405E09562r8273K90594l978k94989K17328M8053j15996j22653J85120B16674
$$ 509562 411289 701883 697905 402916 620244 668297 552301 429648 614768 216674
16394C13763K4722Q3784o7469L70229C08985J74864j01664P5035A27656J44254
$$ 313763 338485 422269 354800 725029 308985 483849 382185 457220 127656 271910
16384B71910A7372K69124g2310B52807a9854C03140j1083J07347p2928a23948
$$ 271910 17372 286496 -72310 252807 -19854 303140 292057 399404 326476 -123948
16373A24027L72936k31858L07712B40186O5236j9597K16852j91875J6090r6682
$$ 124027 496963 265105 572817 240186 305422 285825 502677 310802 326892 230210
16363B30210A0854L55202O507j60234l9849K97123q825K580k30144o4311K38399
$$ 230210 10854 366056 372563 212329 172480 469603 460778 463358 233214 168903 407302
16352D07302A05607g9979A86381k5496L46307j27028O9638L5840k22892M1303
$$ 407302 105607 -79979 186381 160885 507192 380164 449802 485642 262750 304053
16342C04053J23451A82320J50907K6114o930L59j19199j13131K04537j31793m0091
$$ 304053 427504 182320 333227 359341 352411 352770 233571 120440 324977 193184 153093
16331A53093K85755A72937J57664f4176A54614L32641B08600q3255J18078I8551
$$ 153093 438848 172937 330601 -64176 154614 487255 208600 125345 243423 98551
16320A66309L83854j74755e6905B84021P771C518P7514C8930b5537C54496P1652
$$ 166309 550163 375408 -56905 284021 291792 3518 81032 38930 -25537 354496 426148
16309D26148M6591r9162j48110j0378o4551A9179N0091B1604J04805K1279J12314
$$ 426148 472739 373577 225467 215089 150538 19179 69270 21604 126409 147688 260002
16298B60002h6290A23125K10063q0443Q347a4302N42B46719N7593q783j41322
$$ 260002 -86290 123125 333188 252745 261092 -14302 -13760 246719 304312 295529 154207
16287A54207J11233D5071h5827A23337J97806J40278A88033n7951K07648A13976
$$ 154207 265440 45071 -85827 123337 321143 461421 188033 130082 337730 113976
16276i7012a640B14642I8996J61710Q9732A34680J40363A26728b39552B89990
$$ -97012 -1640 214642 98996 260706 350438 134680 275043 126728 -239552 289990
16265D60516k15259I4542a3102C36810a4312A54512n3335g4969F6139J91071c4835
$$ 460516 245257 94542 -13102 336810 -14312 154512 101177 -74969 66139 257210 -34835
16253I8607O8301d9735G5508I29h3096A76051N3594c196B4229P4952l9051J7606
$$ 98607 166908 -49735 75508 929 -83096 176051 229645 -3196 24229 99181 60130 77736
16241G7736L0565c12739j18261d7394A72175a32901r795B52667F4918c139C99764
$$ 77736 108301 -312739 -431000 -47394 172175 -132901 -142696 252667 64918 -3139 399764
16229D01071p4936a08857k04078a27173H1306K19140c0677j02892A87583D5465
$$ 401071 326135 -108857 -312935 -127173 81306 300446 -30677 -133569 187583 45465
16218d791p0060a7698B34628j09541C8996a1277l7982C3333J0407K4015J50602
$$ -4791 -74851 -17698 234628 125087 38996 -11277 -49259 33333 43740 67755 218357
16207B18357C6100Q0701p451D6613a87079D21104C2209J88368C1956a9497A01883
$$ 218357 36100 116801 109350 46613 -187079 421104 32209 220577 31956 -19497 101883
16195b6467D5709A4352J60065e8031A38710k9949Q1034j0775d6993B23192c4676
$$ -26467 45709 14352 174417 -58031 138710 108761 189795 179020 -46993 223192 -34676
16183C2679p115a50921B06563c1179n2746B42145j6145a833n0103D57931g3427
$$ 32679 25564 -150921 206563 -31179 -83925 242145 226000 -1833 -51936 457931 -73427
16171f7120D6382L61738a02454m8925A36580L2269b18111b602A61937D7186D817
$$ -67120 46382 408120 -102454 -151379 136580 168849 -218111 -2602 161937 47186 4817
16159B08769p0964F4690J68417G3415h3408B43937E7060a56531a7834C8582J86551
$$ 208769 137805 64690 233107 73415 -83408 243937 57060 -156531 -17834 38582 225133
16148B25133O6253A22484e3410j93795J01473A05713L2303a41211f7689A38505
$$ 225133 291386 122484 -53410 -247205 -145732 105713 138016 -141211 -67689 138505
16137a55536b260A34858D7590J09511m722J35610j2112o106I4998c4503F2224
$$ -155536 -2260 134858 47590 157101 152379 287989 275877 269771 94998 -34503 62224
16125a29474A52285J8537o8357a02688B028a24170A29862e3043l3609j38499A68798
$$ -129474 152285 170822 102465 -102688 2028 -124170 129862 -53043 -86652 -225151 168798
16113a90142A53770a41932B9747J63381f9511j03466c7861B37985a59017g8829
$$ -190142 153770 -141932 29747 193128 -69511 -172977 -37861 237985 -159017 -78829
16102C78124a80731D8485J98387l461F5085Q0620O0753d1774D2201A0454a03655
$$ 378124 -180731 48485 246872 243411 65085 145705 206458 -41774 42201 10454 -103655
16090A7506J10758D8609h4636B52846a2971B01846a80724j18520a06315E0921
$$ 17506 128264 48609 -84636 252846 -12971 201846 -180724 -299244 -106315 50921
16079a63296E2064i9857B11692C9290a73752M2141D1011L21011j08644A25163
$$ -163296 52064 -99857 211692 39290 -173752 -131611 41011 362022 253378 125163
16068A49779C3993b27009J06548k23737C17737F1431P091A6715h9377A71968F6696
$$ 149779 33993 -227009 -120461 -344198 317737 61431 68522 16715 -89377 171968 66696
16056c2398A25081J8377a75347A69825i8767p7093c0723m9290J7213H7246J49428
$$ -32398 125081 143458 -175347 169825 -98767 -175860 -30723 -80013 -62800 87246 236674
16045B36674p1477a0297j603A5411c10318A50901j2178a76238p0150B04907a44509
$$ 236674 165197 -10297 -11900 15411 -310318 150901 138723 -176238 -246388 204907 -144509
16033A5011a09484A79169a36746d3188A26349j5992P9116M744i9528B09900j03539
$$ 15011 -109484 179169 -136746 -43188 126349 110357 189473 194217 -99528 209900 106361
16022A06361A1387b59283A0170g4241o4137j35820R3495B83250F9154J04782b04933
$$ 106361 11387 -259283 10170 -74241 -138378 -274198 -180703 283250 69154 173936 -204933
16010A21731l86k0367b39150P1834A73683e7531A25975b74872A27360M9951d09357
$$ 121731 121345 100978 -239150 -167316 173683 -57531 125975 -274872 127360 177311 -409357
15998c64715j0377A90629a94875h8724o981D24685G2475b9549C27551j54798a04672
$$ -364715 -375092 190629 -194875 -88724 -95705 424685 72475 -29549 327551 172753 -104672
15986a82270e7771D5190P1251J00064I9991e100C26258J35475j37597E3637a74759
$$ -182270 -57771 45190 116441 216505 99991 -5100 326258 461733 324136 53637 -174759
15974a97540C5417b17079K3127A32622b31114d133j17413N8630j32134a932j22175
$$ -197540 35417 -217079 -193952 132622 -231114 -4133 -121546 -62916 -195050 -1932 -124107
15963a24107k94713a9240A97124c50725c1139B9300b67519I7551C7947a7341j91375
$$ -124107 -418820 -19240 197124 -350725 -31139 29300 -267519 97551 37947 -17341 -208716
15952b08716D9773c70239A32075o5272i1150D4810g1314F9530c65663i4514r7931
$$ -208716 49773 -370239 132075 66803 -91150 44810 -71314 69530 -365663 -94514 -192445
15941a92445D8612J3869J01905K1153a72006A92840j766c83443D8054J57733b03078
$$ -192445 48612 62481 164386 185539 -172006 192840 191074 -383443 48054 205787 -203078
15929H0557J33821d3405l7158A78079f7022C664O9464a69757d1583a1926C09100
$$ 80557 214378 -43405 -80563 178079 -67022 3664 73128 -169757 -41583 -11926 309100
15917F8531a02553a0453A20202c31728j6421A89251b09901D585K0956g93j36327
$$ 68531 -102553 -10453 120202 -331728 -348149 189251 -209901 4585 25541 -793 -137120
15906a37120n2671N1937j30989g7251E2842J03083b53913I3096c02647A44319
$$ -137120 -189791 -137854 -268843 -77251 52842 155925 -253913 93096 -302647 144319
15895a14962c0107k7981o0068o2606G0614K2354b61422k8398B35517F3648a30585
$$ -114962 -30107 -58088 -118156 -180762 70614 92968 -261422 -289820 235517 63648 -130585
15883A81938a64037E0041a88512a9131H8734c69740h5191j76947O2887N9773K4340
$$ 181938 -164037 50041 -188512 -19131 88734 -369740 -85191 -262138 -199251 -139478 -115138
15872a15138A11891L4499e4784i675H7862c91353N9183A21530d5213j68745I2098
$$ -115138 111891 146390 -54784 -9675 87862 -391353 -332170 121530 -45213 -213958 92098
15860A02466K43857a50198e3887j27153Q5365A22910J9587b83243h9570F0492
$$ 102466 346323 -150198 -53887 -181040 -95675 122910 142497 -283243 -89570 60492
15849C72494a04239F5643b65543A51282h7803b0058H7338f6946j8908j22569e8002
$$ 372494 -104239 65643 -265543 151282 -87803 -20058 87338 -66946 -85854 -208423 -58002
15837a08827C1228a71904A11590a11169B00972Q0216d0367l8792l28566J1658
$$ -108827 31228 -171904 111590 -111169 200972 281188 -40367 -79159 -407725 -396067
15827c96067F4078K1975a00634K9391G884N5445a02118b3174A37608h2560D35302
$$ -396067 64078 86053 -100634 -71243 7884 63329 -102118 -23174 137608 -82560 435302
15815h341A47570e6505C7081K6175a79032p2970B57686e39839B4083Q0722a20617
$$ -8341 147570 -56505 37081 63256 -179032 -252002 257686 -539839 24083 104805 -120617
15803A06647j4269J33228a13961j72763B92449A28918J62548g2999j9542C67941
$$ 106647 92378 225606 -113961 -286724 292449 128918 291466 -72999 -92541 367941
15792C4551O0304h4624C2987J09362F2473a73427e1883o5608k14255J57227L8586
$$ 34551 94855 -84624 32987 142349 62473 -173427 -51883 -117491 -331746 -174519 -135933
15781a35933C03339G9168i20l77410c8516A84286P3545c7454a0633j9445l8572
$$ -135933 303339 79168 -920 -378330 -38516 184286 257831 -37454 -10633 -30078 -68650
15770f8650H1127A5914b5675E1904f6974j46821A61250h5211E1926f6499A29295
$$ -68650 81127 15914 -25675 51904 -66974 -213795 161250 -85211 51926 -66499 129295
15758C3428J81052p565n9698l3872D7616b9788k57476j70299A45327D7927j8760
$$ 33428 214480 206915 147217 113345 47616 -29788 -287264 -457563 145327 47927 29167
15747B9167b48522A76657i5293B1906K038J52184C2597b34348A38352b95468Q307
$$ 29167 -248522 176657 -95293 21906 23944 176128 32597 -234348 138352 -295468 -287161
15736b87161A13564i075l79293a21257r2438K4599A00347b4559j42724K5924M5747
$$ -287161 113564 -9075 -388368 -121257 -213695 -189096 100347 -24559 -167283 -141359 -95612
15725i5612k3955B36824b27017l6376b7695m2590n5879j6081O207e4747j03851
$$ -95612 -119567 236824 -227017 -263393 -27695 -70285 -126164 -142245 -136038 -54747 -158598
15714a58598E3835a8880j87095d2906C3722J08506b18332O8957H6708b0194m791
$$ -158598 53835 -18880 -205975 -42906 33722 142228 -218332 -149375 86708 -20194 -24985
15703b4985C41711a0410k2755A49264P8341a61077M6404b5094C27300d1653B11279
$$ -24985 341711 -10410 -33165 149264 227605 -161077 -114673 -25094 327300 -41653 211279
15691G8950K60120r9791a09230j51087a01346I8528d7577F7324a90j71897k96767
$$ 78950 339070 239279 -109230 -260317 -101346 98528 -47577 67324 -190 -172087 -468854
15680d68854a68573A38884K8678h5103J9598A31922b56738C25725A5625K24509
$$ -468854 -168573 138884 167562 -85103 -65505 131922 -256738 325725 15625 240134
15670B40134a75417B81265J0622p9887r9492c5860B3596J327c37342d010j60062
$$ 240134 -175417 281265 291887 212000 112508 -35860 23596 24923 -337342 -4010 -164072
15659a64072A89303b99132J43136a0638l89056B04967b31709g3690p6136A52283
$$ -164072 189303 -299132 -155996 -10638 -399694 204967 -231709 -73690 -149826 152283
15648i4567F39b26454j02466E02092k31120A03449c0246j95597R1436A39259J09927
$$ -94567 639 -226454 -328920 502092 270972 103449 -30246 -225843 -134407 139259 249186
15637B49186h5906F6215B7233J09724b19798J08328D8367K9715C036c2438j60387
$$ 249186 -85906 66215 27233 136957 -219798 -111470 48367 78082 3036 -32438 -192825
15626a92825i435A83582b82115B80076a8624M512H1733h9768A67027R940f6184
$$ -192825 -9435 183582 -282115 280076 -18624 -14112 81733 -89768 167027 176967 -66184
15614e7779K1328l92532a9867n9580k38667C63389K4296A90328J567c17558j07127
$$ -57779 -36451 -428983 -19867 -79447 -318114 363389 387685 190328 191895 -317558 -424685
15603d24685a43992c337j75149G0410g5811A16808b30149a01878d0261A20335
$$ -424685 -143992 -3337 -178486 70410 -75811 116808 -230149 -101878 -40261 120335
15592c380k25836C67305A34454a79780Q0178B0387K32299r1503n2974a96916O8235
$$ -3380 -229216 367305 134454 -179780 -99602 20387 252686 161183 108209 -196916 -128681
15581a28681e1858C05410a00620K1446B7027P539d1578A69845a0780m0526H0195
$$ -128681 -51858 305410 -100620 -79174 27027 34566 -41578 169845 -10780 -51306 80195
15569A88084o9432j2207g8397k215j78370c7623H859a06549B75359Q1299j73955
$$ 188084 118652 106445 -78397 -80612 -258982 -37623 8859 -106549 275359 356658 182703
15558A82703b76192c2867k54007B74781h0517A00027e6035H9559a46108D43103
$$ 182703 -276192 -32867 -286874 274781 -80517 100027 -56035 89559 -146108 443103
15547I9298a09666B22210F0546b64396L5339b8689B21552N7388K8287G1736J26320
$$ 99298 -109666 222210 60546 -264396 -229057 -28689 221552 278940 307227 71736 198056
15536A98056A8822J76928a7408j02592I7589a87887k5906I1544g0476j09460b8812
$$ 198056 18822 195750 -17408 -120000 97589 -187887 -213793 91544 -70476 -179936 -28812
15524b22051Q2647b2797q3668l32313J57285C04419E2931g9873A70764N7648f5351
$$ -222051 -139404 -22797 -106465 -438778 -281493 304419 52931 -79873 170764 228412 -65351
15512E1075d1293B69155c00j05170l3530f8389i18m2324B19541Q7903F8353F877
$$ 51075 -41293 269155 -300 -105470 -139000 -68389 -918 -43242 219541 307444 68353 6877
15499A76555l5194d34863J09379j7624k05885f5770k15183d9681o7257j77968
$$ 176555 141361 -434863 -325484 -343108 -548993 -65770 -280953 -49681 -116938 -294906
15489b94906A08316D343a05129A09601a93458A4468a45769F6354K70383D7046
$$ -294906 108316 4343 -105129 109601 -193458 14468 -145769 66354 336737 47046
15478A99981O8603A33529N3820b36823d2975E3400K2866a32240A18810A4741a56780
$$ 199981 268584 133529 187349 -236823 -42975 53400 76266 -132240 118810 14741 -156780
15466b38856A54726i5264J8960k8700D23106A27339i0633A30380b56626I085J57569
$$ -238856 154726 -95264 -76304 -105004 423106 127339 -90633 130380 -256626 9085 166654
15455A66654M6825a13948F9654j7094a49129a640j88268B36774R690H6977a92703
$$ 166654 213479 -113948 69654 52560 -149129 -1640 -189908 236774 246464 86977 -192703
15443a85868K3220h571k1924A27891a6702A85498i273k12821o7523L9731F6050
$$ -185868 -162648 -8571 -30495 127891 -16702 185498 -9273 -222094 -289617 -249886 66050
15431A77194c05505J43082d1639o3044C48245c41022J28908B07884a63942o6258
$$ 177194 -305505 -162423 -41639 -104683 348245 -341022 -212114 207884 -163942 -230200
15421b30200M6182M0207B57754p605E4470a3507p7283C9630c05902a10326e2273
$$ -230200 -184018 -143811 257754 250149 54470 -13507 -90790 39630 -305902 -110326 -52273
15409E3209a98794a4346C483N8070k6883J3073b39687A89455e54k08407B72822
$$ 53209 -198794 -14346 3483 61553 34670 47743 -239687 189455 -554 -208961 272822
15397a53902b7073A70523b59956k675B8442J21322c65348a14460J5613C73740
$$ -153902 -27073 170523 -259956 -262631 28442 149764 -365348 -114460 -98847 373740
15386h9115l9704N8327K5230C01826a52419O2432k9996L7355j73603C9138J23228
$$ -89115 -128819 -70492 -45262 301826 -152419 -89987 -119983 -82628 -256231 39138 162366
15375A62366b4457k36241C9823a89787l1493B13683n3392a5565j10221B47105
$$ 162366 -24457 -260698 39823 -189787 -221280 213683 160291 -15565 -125786 247105
15364B321a06357A83847C9627L922b0142B4995b74199o2239a25004b3348r492
$$ 2321 -106357 183847 39627 43549 -20142 24995 -274199 -336438 -125004 -23348 -32840
15353c2840B4984a69084B17444H048L6785a9922A25579J7631J12286A8263A350
$$ -32840 24984 -169084 217444 8048 44833 -19922 125579 143210 255496 18263 1350
15341b14885K2862B54507n0037C0959A1896b7648A08703J85128n4136a35240j9083
$$ -214885 -192023 254507 204470 30959 11896 -27648 108703 293831 239695 -135240 -154323
15330a54323j37918i327B2814K07765K3160H2144b2148j51904I6761J29612D4721
$$ -154323 -292241 -9327 22814 230579 253739 82144 -22148 -174052 96761 226373 44721
15318A06792f7647k1325B50113I2519m1556R8811C7007a22773j63598d5646c663
$$ 106792 -67647 -88972 250113 92519 50963 149774 37007 -122773 -286371 -45646 -3663
15306f9624J8704l4006A55724F2835a39788C49734b51159c4841C14373A41568
$$ -69624 -50920 -84926 155724 62835 -139788 349734 -251159 -34841 314373 141568
15295A02050c078D31271B15154b91943F0161a26467B03590G6855J19024n8451
$$ 102050 -3078 431271 215154 -291943 60161 -126467 203590 76855 195879 137428
15285A37428A6524i2825a5F9393j4586L09766l7272p5811p4660q870a03202C72001
$$ 137428 16524 -92825 -15 69393 54807 364573 327301 251490 176830 167960 -103202 372001
15272a81037C5225c0159a3626j2689D85492b49160A81494l3502C8782K05784H3199
$$ -181037 35225 -30159 -13626 -26315 485492 -249160 181494 147992 38782 244566 83199
15260a16339B582c8663A32243o098e4195E9825B5223J3780c2795C88290j72866
$$ -116339 2582 -38663 132243 126145 -54195 59825 25223 39003 -32795 388290 215424
15249B15424N05544J67660N63096j86140l07620K77591B50808b2464I0406g7296
$$ 215424 720968 888628 1451724 1265584 957964 1235555 250808 -22464 90406 -77296
15238A2976J55757J39929A37565A385J36777N7447b6965B66903b09815A96215
$$ 12976 168733 308662 137565 1385 138162 195609 -26965 266903 -209815 196215
15227b10165m1553d0641A97600c5126E3466O9955m1980b62850F9483J94079E8806
$$ -210165 -251718 -40641 197600 -35126 53466 123421 81441 -262850 69483 263562 58806
15215I6899J54381r4283L5463K9838b44829d9962C26741q3275o6959f0154B1010
$$ 96899 251280 156997 192460 222298 -244829 -49962 326741 243466 176507 -60154 21010
15203d0549G3276b38244N9509A2922N8254i0452A34582J46053a77517C34013c51727
$$ -40549 73276 -238244 -178735 12922 71176 -90452 134582 280635 -177517 334013 -351727
15191a97438C80334b05270B04450A01932J7077J88123G5498e4497B47953A02936
$$ -197438 380334 -205270 204450 101932 119009 307132 75498 -54497 247953 102936
15180B76020a99099B26717A06111K6519f2378g339B62736i3228L115M1497n7713
$$ 276020 -199099 226717 106111 132630 -62378 -7339 262736 -93228 -90113 -48616 -106329
15169a06329c2628A8978r290f0068A5724J24426B3253J9855f563H9489h7015B72274
$$ -106329 -32628 18978 9688 -60068 15724 140150 23253 43108 -6563 89489 -87015 272274
15156b20859j1631i7861A73218J48294L0355c15656I4041a12367A37910m4373
$$ -220859 -232490 -97861 173218 321512 351867 -315656 94041 -112367 137910 93537
15146I3537J79667n7339D1208b2178A17916j0058R9610I6111b47793C5844a56155
$$ 93537 273204 215865 41208 -22178 117916 107858 207468 96111 -247793 35844 -156155
15134C11710H9593J25948C1977K83842c6514F2495K69986D4371J96619a69120
$$ 311710 89593 215541 31977 315819 -36514 62495 332481 44371 240990 -169120
15123A96051b63439b3572D12146j64003d5165C44240j54872B7773M3379h0360
$$ 196051 -263439 -23572 412146 248143 -45165 344240 189368 27773 71152 -80360
15112a24480b0950C87356d3058A41579e6037k1183J6254G4197J22513q0230R1574
$$ -124480 -20950 387356 -43058 141579 -56037 -77220 -60966 74197 196710 116480 208054
15101B08054Q4176J52780j83260Q1155b44689H7548j9773K38182a56069B98245
$$ 208054 292230 445010 261750 342905 -244689 87548 67775 305957 -156069 298245
15090D36412B02148a41942B90654O756j16440j434G730J54545K9627Q7521j32312
$$ 436412 202148 -141942 290654 297410 180970 179536 7730 162275 191902 279423 147111
15079A47111M853i0190M0231B88574l1484b03682C79664A1603Q3434k5194J2049
$$ 147111 151964 -90190 -49959 288574 257090 -203682 379664 11603 95037 69843 81892
15068H1892l8132K70533K10639A23701b02903A03955l8168a57131C80630a126
$$ 81892 43760 314293 524932 123701 -202903 103955 65787 -157131 380630 -1126
15057B08146J89926E5153e3351K5792B46289r6364J00299I2467D935J59448o9368
$$ 208146 398072 55153 -53351 -27559 246289 149925 250224 92467 4935 164383 95015
15046I5015J71978m9518j02688O5016c9246A36358K00293I9069l5785M06467J80108
$$ 95015 266993 217475 114787 179803 -39246 136358 336651 99069 63284 469751 649859
15035F49859A22172J49222k5290P8932m9722M3884A36671J51757J0932r2391k4829
$$ 649859 122172 271394 246104 325036 275314 319198 136671 288428 299360 206969 182140
15024A82140p0896J39607C749K4068K46153F700i6576E2817J81471k4204C1956
$$ 182140 111244 250851 3749 27817 273970 6700 -96576 52817 234288 210084 31956
15012f9230A27530C8769A3823K05579c4446B45851H3013k1088K48459p2207H6587
$$ -69230 127530 38769 13823 219402 -34446 245851 83013 61925 310384 238177 86587
15000C20781I1784J77381i1947A90394K43087j67713D3720N8707R5806H5163J47612
$$ 320781 91784 269165 -91947 190394 433481 265768 43720 102427 198233 85163 232775
14989B32775K30886k17404a32808G6098M46085A67869J55607A34417N103a5761
$$ 232775 463661 246257 -132808 76098 522183 167869 323476 134417 139520 -15761
14978C40943j31707N6062q8723o8971P8478M967L6212H6344J89481g2507B91002
$$ 340943 209236 265298 176575 107604 186082 191049 227261 86344 275825 -72507 291002
14966B78800a03417B59634A13324L94076B35123J45213A24376M13473A10907h1816
$$ 278800 -103417 259634 113324 507400 235123 380336 124376 537849 110907 -81816
14955C2389J14243J68571A30579O4519L53966C6581a4626D03689A50478J68660
$$ 32389 146632 315203 130579 195098 549064 36581 -14626 403689 150478 319138
14945C19138B5678J33720L15833j61913J29781F584K61156J2823A38500a32541
$$ 319138 25678 159398 475231 313318 443099 6584 267740 280563 138500 -132541
14934A96847b258m1739B97319m9166o7579K91743J1767A65606K2510K23931j80045
$$ 196847 -2258 -43997 297319 248153 180574 472317 484084 165606 188116 412047 232002
14923B32002D0736J88072o38N21767B12381J70888j87276J33095f2891C35027
$$ 232002 40736 228808 228170 749937 212381 383269 195993 329088 -62891 335027
14912D21480q7326A61049k2197M13497k30022q9640j6119Q0710K3829r2076K40799
$$ 421480 334154 161049 138852 552349 322327 232687 216568 297278 321107 229031 469830
14901D69830D6485K17222J08688m9598P5988A6606L62443A40830J66145A12210
$$ 469830 46485 263707 372395 322797 398785 16606 379049 140830 306975 112210
14890B06927l7678P3941A2482N05460J4997r7073K38566l11680O3931R979p217
$$ 206927 169249 243190 12482 517942 532939 435866 674432 362752 426683 436662 429445
14879D29445j69571o7747K68880J49015A32861P5457J72627J0409A38597J72655
$$ 429445 259874 192127 461007 610022 132861 208318 380945 391354 138597 311252
14869C11252K001J95554I8276J41090r310J2973N1687o5077K0173K67020A71885
$$ 311252 313253 508807 98276 239366 230056 243029 294716 229639 249812 516832 171885
14857E28445j57054P8649J81484j87960G9653O5190Q3346K28190J1541M10314
$$ 528445 371391 450040 631524 443564 79653 144843 228189 456379 467920 878234
14847H78234C37151J00269A25687M34188J0437M6743P9365k34358q1329o8021
$$ 878234 337151 437420 125687 559875 570312 617055 696420 462062 380733 312712
14837C12712K1822j11047J21409L06666k78183n302J28716p0511K37074A48076
$$ 312712 334534 223487 344896 651562 373379 368077 496793 426282 663356 148076
14826C57232K37935j61784j39738L7569K76754k25722L99608l53428J29313A80600
$$ 357232 595167 433383 293645 331214 607968 382246 781854 428426 557739 180600
14815D83381j30626L76311C47036K07401k53296J81072q7786K73567N2175j33829
$$ 483381 352755 729066 347036 554437 301141 482213 394427 667994 720169 586340
14805E86340p2076j74183n8146L78264B94182K4810L14496n4256j04832K60355
$$ 586340 514264 340081 281935 660199 294182 318992 633488 579232 474400 734755
14795G34755o5407L5142B74177L45695k09878K76070k06427K30605j41820k6706
$$ 734755 669348 704490 274177 619872 409994 686064 479637 710242 568422 541716
14785E41716P9627L9193k19224J44839r2901n0408R2192j52129j29046O20261
$$ 541716 621343 660536 441312 586151 493250 442842 535034 382905 253859 874120
14775H74120j16932r3732K6483O2881J15688r8586j55835l4046L2680j2603j82731
$$ 874120 757188 663456 689939 752820 868508 769922 614087 580041 612721 600118 417387
14764D17387J35977J59092j36060L88651P2003j53719M561C77027L89538k04815
$$ 417387 553364 712456 576396 965047 1037050 883331 887892 377027 766565 561750
14754E61750K29695q4656Q0935k20883O5930q1032K24281N9501j51249k86183
$$ 561750 791445 706789 787724 566841 632771 551739 776020 835521 684272 398089
14744C98089L74618C34587L94187k39106K01859K108M1229k69698J67728Q8674
$$ 398089 772707 334587 728774 489668 691527 693635 734864 465166 632894 721568
14734G21568j77198J3835N6133J67965C61997K71546l6640L03632L21055o10699
$$ 721568 544370 558205 614338 782303 361997 633543 596903 900535 1221590 610891
14724F10891p2629L30488Q7007p6748k00532J6532k06120L54468m3769O47K98427
$$ 610891 538262 868750 955757 879009 678477 695009 488889 843357 799588 800235 1098662
14713A098662m38075o7984K49655K56518K10314o49290J71910K0028k46951K92388
$$ 1098662 660587 592603 842258 1098776 1309090 659800 831710 851738 604787 897175
14703H97175j38341j606L19232Q9759k16871j60261J2908K88669l49526J57713
$$ 897175 758834 757228 1076460 1166219 949348 789087 801995 1090664 741138 898851
14693H98851L2825L30949k32415L6179o4336j40244Q5834j03553J59371l57682
$$ 898851 931676 1262625 1030210 1066389 1002053 861809 947643 844090 1003461 645779
14683F45779M15883j13680Q4768k93061L81362j06410K91963k01137N897k63657
$$ 645779 1061662 947982 1032750 739689 1121051 1014641 1306604 1105467 1111364 847707
14673H47707L22694l59072K71945j45363R5988J27168j30403m49782N69569p9380
$$ 847707 1170401 811329 1083274 937911 1033899 1161067 1030664 580882 1150451 1071071
14663A071071j77033K20582m3405Q0049M7197k86945K83517k08830J88215l73790
$$ 1071071 894038 1114620 1071215 1151264 1198461 911516 1195033 986203 1174418 800628
14653H00628K19435J19912k92975K81896K7094R3847q940j72231J42320k1611
$$ 800628 1020063 1139975 847000 1128896 1155990 1249837 1240897 1068666 1210986 1189375
14643A189375j61361m5789L73490k59229P17332m55815O1738l7508R7704n0636
$$ 1189375 1028014 982225 1355715 1096486 1813818 1358003 1419741 1382233 1479937 1429301
14633A429301k01041J77205l34866N35231k54983k02838M5896J81487J38128L2329
$$ 1429301 1228260 1405465 1070599 1605830 1350847 1148009 1193905 1375392 1513520 1545849
14623A545849j36772k9221Q6596L21453l80125J12863n576l9797k32170M70266
$$ 1545849 1409077 1379856 1466452 1787905 1407780 1520643 1515067 1475270 1243100 1713366
14613A713366M3124k77591J91131n3542J6110k03253N0239K03611k16517K33791
$$ 1713366 1756490 1478899 1670030 1616488 1632598 1429345 1479584 1683195 1466678 1700469
14603A700469m0031K14439j34472J80972n902K656q7361O9194j56545K20752o5555
$$ 1700469 1660438 1874877 1740405 1921377 1915475 1918131 1830770 1899964 1743419 1964171 1898616
14592A898616o9126R9542l03135L12364k94673K72166J46756O8696k76463j36816
$$ 1898616 1829490 1929032 1625897 1938261 1643588 1915754 2062510 2131206 1854743 1717927
14582A717927K56937j75439K20931q8423R2511R3538p5557L02780N259l65020
$$ 1717927 1974864 1799425 2020356 1931933 2024444 2117982 2042425 2345205 2350464 1985444
14572A985444J32927L41897Q6724m4965j79739J6162K75724N3128l24712J41148
$$ 1985444 2118371 2460268 2546992 2502027 2322288 2338450 2614174 2667302 2342590 2483738
14562B483738j46259L06671J58710n0844N51430k31963J90883j0473K55881J68106
$$ 2483738 2337479 2644150 2802860 2752016 3303446 3071483 3262366 3251893 3507774 3675880
14552C675880N35595O80261J013054J990543M324584Q273574J7201694R644671
$$ 3675880 4211475 4891736 5904790 7895333 12219917 20493491 37695185 47339856
14544D7339856k2578425A2053939E301164k346130n52060k17370j32697p2375
$$ 47339856 24761431 12053939 5301164 2955034 2402974 2185604 2052907 1980532
14536A980532k7080J2333J93202j03497J43584K4310K08318j78237j22144J53279
$$ 1980532 1953452 1965785 2158987 2055490 2199074 2223384 2431702 2253465 2131321 2284600
14526B284600J49547j38167J22213J19973k0855j13257M92134l52728K85069l13938
$$ 2284600 2434147 2295980 2418193 2538166 2517311 2404054 2896188 2543460 2828529 2514591
14516B514591L18193m6345P7097j24110J53749r9837L47243m6540j95828K16581
$$ 2514591 2832784 2786439 2863536 2739426 2893175 2793338 3140581 3094041 2898213 3114794
14506C114794j90806R7043j69430M7906L05333n9030K32848k41289r7504L57339
$$ 3114794 2923988 3021031 2851601 2899507 3204840 3145810 3378658 3137369 3039865 3397204
14496C397204O1862j18815R9910L21870l49000J59011o1696K43323K86456n57151
$$ 3397204 3459066 3340251 3440161 3762031 3413031 3572042 3510346 3753669 4040125 3482974
14486C482974p3456Q16275l97606J66299k09811N19429n11451P7154K40902J70927
$$ 3482974 3409518 4225793 3828187 3994486 3784675 4304104 3792653 3869807 4110709 4281636
14476D281636j08933K40891j20879K390J90168k15496M14834j74095J08927J43197
$$ 4281636 4172703 4413594 4292715 4295105 4485273 4269777 4684611 4510516 4619443 4762640
14466D762640J87130j94753J37906l21858O09825j39935O322O47600n57756J70246
$$ 4762640 4949770 4755017 4892923 4571065 5180890 5040955 5047277 5694877 5137121 5307367
14456E307367l4115J02373Q9330o56688R15576N246K8268J35052m9232M43799
$$ 5307367 5273252 5375625 5464955 4808267 5723843 5729089 5757357 5892409 5843177 6286976
14446F286976j76213l4291N52506m40426J62673L69683l84553m189K87023L14341
$$ 6286976 6110763 6076472 6628978 6188552 6351225 6720908 6336355 6332166 6619189 6933530
14436F933530k59964J65344N0613K61025J3254J08139J00647K94681Q1744k19834
$$ 6933530 6673566 6838910 6889523 7150548 7163802 7271941 7372588 7667269 7749013 7529179
14426G529179L33448k711L55712k28652M05584j24740L2776K70183m4076J90245
$$ 7529179 7862627 7859916 8215628 7986976 8392560 8267820 8300596 8570779 8526703 8716948
14416H716948K09949L64246L5341N7846M20966m28718K87404N06128k06544J52549
$$ 8716948 8926897 9291143 9326484 9384330 9805296 9376578 9663982 10170110 9963566 10116115
14406A0116115J90996N42397j22977J60556M272M50100K27552m5692J28397N79198
$$ 10116115 10307111 10849508 10726531 10887087 10891359 11341459 11569011 11523319 11651716 12230914
14396A2230914j3764J0432M83475K88494J16076m32486N39518O14286J41892M5584
$$ 12230914 12217150 12227582 12711057 12999551 13115627 12683141 13222659 13836945 13978837 14024421
14386A4024421J75969J85075M98574L86813R6678K33600M48783N12987p6843M66813
$$ 14024421 14200390 14385465 14884039 15270852 15367530 15601130 16049913 16562900 16486057 16952870
14376A6952870J43596J43614L79113N88941j5847L41965L29877N65187P24434
$$ 16952870 17096466 17240080 17619193 18208134 18192287 18534252 18864129 19429316 20153750
14367B0153750O9719N66798L23348M50166N29778M97669P14921Q0011M26199O08773
$$ 20153750 20223469 20790267 21113615 21563781 22093559 22591228 23306149 23386160 23812359 24421132
14357B4421132J048190K24152O00145P01999N13164N98574Q70291O33616O83545
$$ 24421132 25469322 25693474 26293619 26995618 27508782 28107356 28977647 29611263 30294808
14348C0294808N80863Q63471Q35462J030224O64283P88913R80539J234196R95396
$$ 30294808 30875671 31739142 32574604 33604828 34269111 35058024 36038563 37272759 38268155
14339C8268155R21618J053846J256800R96655J090262J348314J657054J395123
$$ 38268155 39189773 40243619 41500419 42497074 43587336 44935650 46592704 47987827
14331D7987827J202106J371287J716643J494140J944579J780782K155396J680845
$$ 47987827 49189933 50561220 52277863 53772003 55716582 57497364 59652760 61333605
14323F1333605K249119K380543J983201K611369K579316K440166K989069L166725
$$ 61333605 63582724 65963267 67946468 70557837 73137153 75577319 78566388 81733113
14315H1733113K970703L202468L488842L358981L888414M043235M546444M127133
$$ 81733113 84703816 87906284 91395126 94754107 98642521 102685756 107232200 111359333
14307A11359333M671631M979013N595140N560305N877588N987967O863809P199442
$$ 111359333 116030964 121009977 126605117 132165422 138043010 144030977 150894786 158094228
14299A58094228P012736Q107941Q135909Q470091R174529R505119J0221788J0633667
$$ 158094228 165106964 173214905 181350814 189820905 198995434 208500553 218722341 229356008
14291B29356008J1165840J1819805J2358670J2599070J3319325J3593335J3645409
$$ 229356008 240521848 252341653 264700323 277299393 290618718 304212053 317857462
14284C17857462J4247364J4040243J4808298J4165393J4026775J3629600J3253156
$$ 317857462 332104826 346145069 360953367 375118760 389145535 402775135 416028291
14277D16028291J2375978J1149091R865508P540472M052533N6003o61175l55176
$$ 416028291 428404269 439553360 449418868 456959340 461011873 461067876 460406701 460051525
14269D60051525k94035m093255m177995n475250q228897j0564281j2033780j3414570
$$ 460051525 459757490 455664235 451486240 446010990 437782093 427217812 415184032 401769462
14261D01769462j3936597j4694632j5040761j5140495j5249489j4899679j4729213
$$ 401769462 387832865 373138233 358097472 342956977 327707488 312807809 298078596
14254B98078596j3272085j3381102j3102503j2385776j1829640j1181067j1049256
$$ 298078596 284806511 271425409 258322906 245937130 234107490 222926423 211877167
14247B11877167r968848r727712q645690q369813p868356p974929p233562o824025
$$ 211877167 201908319 192180607 183534917 175165104 167296748 159321819 152088257 145264232
14239A45264232o301256n644899n734407n312167n404153m755337m638793m030125
$$ 145264232 138962976 133318077 127583670 122271503 116867350 112112013 107473220 103443095
14231A03443095l750920l815865l968713l283651l414660l273632k661996l369973
$$ 103443095 99692175 95876310 91907597 88623946 85209286 81935654 79273658 75903685
14223G5903685k467549k572559k341993k194857j835669k279311k127380k044800
$$ 75903685 73436136 70863577 68521584 66326727 64491058 62211747 60084367 58039567
14215E8039567j676374j297708j629964j860630j939633j677594q52452j479939
$$ 58039567 56363193 55065485 53435521 51574891 49635258 47957664 47105212 45625273
14207D5625273o40881j006230j610457j285614j317156j278382q36750k99233
$$ 45625273 44984392 43978162 42367705 41082091 39764935 38486553 37649803 37350570
14199C7350570j193392r75987r59277q78514q56087l11254j109601j029936m14443
$$ 37350570 36157178 35181191 34221914 33343400 32487313 32176059 31066458 30036522 29622079
14190B9622079j058334m21126q27836p07994m69157p32714n69110k64272n30299
$$ 29622079 28563745 28142619 27314783 26606789 26137632 25404918 24835808 24571536 24041237
14181B4041237n27882m06039n25671l82906o94375m97395l91657o16295j57517
$$ 24041237 23513355 23107316 22581645 22198739 21504364 21006969 20615312 19999017 19841500
14172A9841500k37855o29987n6954o52188l53899k00620n61348Q1615n42498k62744
$$ 19841500 19603645 18973658 18916704 18264516 17910617 17709997 17148649 17230264 16687766 16425022
14162A6425022k11161m51825j40204m82799j86777J61180p48900k83781l99389
$$ 16425022 16213861 15762036 15621832 15139033 14952256 15113436 14364536 14080755 13681366
14153A3681366J34643l74327p6033o39345J93251j56072k93283l04170K4956l60751
$$ 13681366 13816009 13441682 13365649 12726304 12919555 12763483 12470200 12166030 12190986 11830235
14143A1830235j44329k34066l95207J51651k60887p9554m57847J67935k15198
$$ 11830235 11685906 11451840 11056633 11208284 10947397 10867843 10409996 10577931 10362733
14134A0362733l12961L5734m44678J60907o6468m49254j46796L47196k29311k93658
$$ 10362733 10049772 10085506 9640828 9801735 9735267 9286013 9139217 9486413 9257102 8963444
14124H963444k39126N2309k69311l2857J46814l65103j13377K96098p21124k66319
$$ 8963444 8724318 8776627 8507316 8474459 8621273 8256170 8142793 8438891 7717767 7451448
14114G451448M38997N3242l80382l80012L40272R8853o03014J08058k71145k9561
$$ 7451448 7890445 7943687 7563305 7183293 7523565 7622418 7019404 7127462 6856317 6826756
14104F826756M0052J54870k90339j60416K2210o9054N1450K3852k27154J14105
$$ 6826756 6866808 7021678 6731339 6570923 6593133 6524079 6575529 6599381 6372227 6486332
14094F486332l42906j37825L75152n57118J44275j47376L8848J32167l23131J21232
$$ 6486332 6143426 6005601 6380753 5823635 5967910 5820534 5859382 5991549 5668418 5789650
14084E789650k36676q5153P493o5283j4152k08014k8854j76606J71524k70048
$$ 5789650 5552974 5467821 5475314 5410031 5395879 5187865 5159011 4982405 5153929 4883881
14074D883881J83848k11065K99330m04745p0959J30463r018n4107Q8931N1091
$$ 4883881 5067729 4856664 5155994 4751249 4680290 4810753 4801735 4747628 4836559 4887650
14064D887650j59210j35518k67747J27839R5752q6463N4610K19068j27450m98040
$$ 4887650 4728440 4592922 4325175 4453014 4548766 4462303 4516913 4735981 4608531 4110491
14054D110491K47414l40080k3444k5483M719p6199K58366l09236K55100m96714
$$ 4110491 4357905 4017825 3994381 3968898 3973617 3897418 4155784 3846548 4101648 3604934
14044C604934L56271k20006L9594R76k89989n7629N57935m87916n3841k23981
$$ 3604934 3961205 3741199 3780793 3781769 3491780 3434151 3992086 3504170 3450329 3226348
14034C226348K7880J65738j11445J63284N2123O6946k37882M3175l80231M55806
$$ 3226348 3254228 3419966 3308521 3471805 3523928 3590874 3352992 3396167 3015936 3471742
14024C471742l02716j81185J04272k83329J69471j07962M6106O2205l087J20688
$$ 3471742 3169026 2987841 3092113 2808784 2978255 2870293 2916399 2978604 2975517 3096205
14014C096205k73781J02818m07977M12435m67520K28109j02401k88173M12952
$$ 3096205 2822424 2925242 2517265 2929700 2462180 2690289 2587888 2299715 2712667
14005B712667j1055l26005L57264Q0631l35297J33226m26487N7554L49020k60400
$$ 2712667 2701612 2375607 2732871 2813502 2478205 2611431 2184944 2242498 2591518 2331118
13995B331118J06719N4102J02139j9004N3799K83733Q24028L018845O288353J6777385
$$ 2331118 2437837 2491939 2594078 2575074 2628873 2912606 3736634 6755479 13043832 29821217
13985B9821217J7767991j7594787j4319270o138284l090073j157834o32808o03856
$$ 29821217 47589208 29994421 15675151 9536867 6446794 5288960 4656152 4052296
13977D052296o27778j99182M3169j07355r5175k86873R7323j40534J47882k36725
$$ 4052296 3424518 3225336 3268505 3161150 3065975 2779102 2876425 2735891 2883773 2647048
13967B647048r2698K11372j71492J29441l60891K6065Q0726n9089j30907M79461
$$ 2647048 2554350 2765722 2594230 2723671 2362780 2388845 2469571 2410482 2279575 2759036
13957B759036m54985o3090q6234J62460q7121L5552o8859p909j69045o2270M86931
$$ 2759036 2304051 2240961 2154727 2317187 2230066 2265618 2196759 2188850 2019805 1957535 2444466
13946B444466p88591O04987l77432Q4410N43151o82081L92281l57461K26968l95068
$$ 2444466 1655875 2260862 1883430 1967840 2510991 1828910 2221191 1863730 2090698 1695630
13936A695630J22345n5069K31726m17645K78986n0148K90974j35299j50574r0269
$$ 1695630 1817975 1762906 1994632 1576987 1855973 1805825 2096799 1961500 1810926 1720657
13926A720657P5226L4736j78484L54703j73648j43310K20260l7546l89307M45394
$$ 1720657 1795883 1830619 1652135 2006838 1833190 1689880 1910140 1872594 1483287 1928681
13916A928681l51843l4371K46623J23531o52168M60446j43613r2501P5011J15538
$$ 1928681 1576838 1542467 1789090 1912621 1260453 1720899 1577286 1484785 1559796 1675334
13906A675334L51m1462p9468M3412k7476M2541J73027j61539j40305k16683J63419
$$ 1675334 1675685 1634223 1554755 1598167 1570691 1613232 1786259 1624720 1484415 1267732 1431151
13895A431151p9155J41159k21587r3212L59686P6619l39602j06407J94837K77079
$$ 1431151 1351996 1493155 1271568 1178356 1538042 1614661 1275059 1168652 1363489 1640568
13885A640568n10035L48363N7142m88324L67970l66981M18074j13865k58190K30198
$$ 1640568 1130533 1478896 1536038 1047714 1415684 1048703 1466777 1352912 1094722 1324920
13875A324920q6482L43706o87228L52780j17137j21226N20241l44863n1281L58502
$$ 1324920 1238438 1582144 894916 1247696 1130559 1009333 1529574 1184711 1133430 1491932
13865A491932k98294K0364j54737K82455j63897J1932o969K01528k80185N86215
$$ 1491932 1193638 1214002 1059265 1341720 1177823 1189755 1182786 1384314 1104129 1690344
13855A690344o53310r973n9733J34928q5780r4410L72731k90175L04981K68762
$$ 1690344 1037034 1027061 967328 1102256 1016476 922066 1294797 1004622 1309603 1578365
13845A578365p30082k9678J09920P6906K047M49624j88101K46055m96477R5002
$$ 1578365 848283 818605 928525 1005431 1007478 1457102 1269001 1515056 1018579 1113581
13835A113581J9786N414M1243J10241k42522j4567n9858J39137l30294L00003
$$ 1113581 1133367 1138781 1180024 1290265 1047743 1033176 973318 1112455 782161 1082164
13825A082164k09246K97221k1057j23592j18040O0836R0513K78846k29867J4601
$$ 1082164 872918 1170139 1149082 1025490 907450 968286 1058799 1337645 1107778 1122379
13815A122379k80523L58796l91176L12063P2760m04836J62037J05937p8991K48917
$$ 1122379 841856 1200652 809476 1121539 1194299 789463 951500 1057437 978446 1227363
13805A227363m74354K64668J13846j88232L61521k58727q1058J25223j36151k4626
$$ 1227363 753009 1017677 1131523 943291 1304812 1046085 965027 1090250 954099 929473
13795I29473L0875l00908M16375n7125j97840J29556K46543m20282N3443J25334
$$ 929473 960348 659440 1075815 1018690 820850 950406 1196949 776667 830110 955444
13785I55444j44843m2117J6491j40920L94336C74690N77976j75234L49858m60833
$$ 955444 810601 768484 784975 644055 1038391 374690 952666 777432 1127290 666457
13775F66457J42523j38129P9010J38267p3299j23387J73210j02688J45403J01115
$$ 666457 808980 670851 749861 888128 814829 691442 864652 761964 907367 1008482
13765A008482l64806J14254n1899k51217M61065J56730k01372l38179L43760l33032
$$ 1008482 643676 757930 706031 454814 915879 1072609 871237 533058 876818 543786
13755E43786L61929K684R848J06718j07086l16892K11435j14178K75665j27906
$$ 543786 905715 908399 918247 1024965 917879 600987 812422 698244 973909 846003
13745H46003m2066J29075j19134J11384l22882O547L76334D79250J59194L71084
$$ 846003 803937 933012 813878 925262 602380 608927 985261 479250 638444 1009528
13735A009528m37883J52708B44719N06124C23689K88484K00092k62717j32382
$$ 1009528 571645 724353 244719 750843 323689 612173 812265 549548 417166
13726D17166M26929k44392J43190J86310k05732O3364j90900J84886j38645l6591
$$ 417166 844095 599703 742893 929203 723471 786835 595935 780821 642176 605585
13716F05585j1072l3371J34836j80118L3029K14498B01867M27916j85070K64279
$$ 605585 594513 561142 695978 515860 548889 763387 201867 629783 444713 708992
13706G08992r1175r0679K62245m2790l28452J71536J44388j56250p8011P8955
$$ 708992 617817 527138 789383 746593 418141 589677 734065 577815 499804 578759
13696E78759J26886k48268r6953K63312J10332K9939J62543B38068L32635r9873
$$ 578759 705645 457377 360424 623736 734068 764007 926550 238068 570703 470830
13686D70830L0474K93411j84394l9700J85410j39868j06007K34752j21934M6843
$$ 470830 501304 794715 610321 570621 756031 616163 510156 744908 622974 669817
13676F69817k6035n0614j36092p7236K09812p4207l2466J88534K26135l85786
$$ 669817 643782 593168 457076 379840 589652 515445 482979 671513 897648 511862
13666E11862D6674L09124P7867N8510K43697j68167j22639o6291J41386K7334
$$ 511862 46674 355798 433665 492175 735872 567705 445066 378775 520161 547495
13656E47495K77921r9190j49905p4967k07794N8792j53015N96721k45307k71522
$$ 547495 825416 726226 576321 501354 293560 352352 199337 796058 550751 279229
13646B79229K18699j90269M03510B22723J40350O0999J65418O891B45653j5471
$$ 279229 497928 307659 711169 222723 363073 424072 589490 596381 245653 230182
13636B30182R1669C9281M45044k24040K00117j71140J89288j25529M6698P0785
$$ 230182 321851 39281 484325 260285 460402 289262 478550 353021 399719 470504
13626D70504L27930B98530J02871K38200C02476l3049K37851j44060P1818K88002
$$ 470504 798434 298530 401401 639601 302476 269427 507278 363218 435036 723038
13616G23038L6882l51150K59j81659L65523B78104K31954j88449K50763n7147
$$ 723038 759920 408770 409029 227370 592893 278104 510058 321609 572372 515225
13606E15225R1681j87238j16046L98368B72549K25047B15402J14622K30404j18450
$$ 515225 606906 419668 303622 701990 272549 497596 215402 330024 560428 441978
13596D41978k03552L25680j32817J22404k31623n7091J91128B00433M55193k2024
$$ 441978 238426 564106 431289 553693 322070 264979 456107 200433 655626 633602
13586F33602k74628A42431K36865n8534J55816k03871Q3500M7379J0675p7652
$$ 633602 358974 142431 379296 320762 476578 272707 356207 403586 414261 336609
13576C36609F0155L58103o7083K54470r9712j6640J25522k97588J92262J05070
$$ 336609 60155 418258 351175 605645 505933 489293 614815 317227 509489 614559
13566F14559j95231A33606L73022k47394O5131J18471j8044A34611K04576K67758
$$ 614559 419328 133606 506628 259234 324365 442836 424792 134611 339187 606945
13556F06945k96619p2471C1115M52602K33896B47103J27789L16143C25268O8039
$$ 606945 310326 237855 31115 483717 717613 247103 374892 691035 325268 393307
13546C93307J17823p1137j29174J87625J44649j06124r0424J23675k22237j47321
$$ 393307 511130 439993 310819 498444 643093 536969 446545 570220 347983 200662
13536B00662J48959Q1403A02148J80765J69790p5633K26915A61067J27243L2442
$$ 200662 349621 431024 102148 282913 452703 377070 603985 161067 288310 320752
13526C20752J8973N2900M3724J10375e6641E70269k27205J10614j19764J75045
$$ 320752 339725 392625 436349 546724 -56641 570269 343064 453678 333914 508959
13516E08959j81108L407C8648J35659L32813j89304J60303j44502j51069k2606
$$ 508959 327851 331258 38648 174307 507120 317816 478119 333617 182548 159942
13506A59942N3930O1689J24578Q3612k9021A25428J99874O7129l0732j28189j0588
$$ 159942 213872 275561 400139 483751 454730 125428 325302 392431 361699 233510 222922
13495B22922N394L9415I7997L89668B14279j8325K82108k00275R5242j76154j1400
$$ 222922 228316 267731 97997 487665 214279 195954 478062 277787 373029 196875 185475
13484A85475J75509n1548J2463K32771k46038L2777a06876B83421J32096M510
$$ 185475 360984 309436 321899 554670 308632 341409 -106876 283421 415517 420027
13474D20027K00672A12296L29772j56010G3718J71897K18270A30711L59286B7121
$$ 420027 620699 112296 442068 286058 73718 245615 463885 130711 489997 27121
13463D3175J93050n6951n0997J52808j36213J94896J3630j25664j05887J34737
$$ 43175 236225 179274 128277 281085 144872 339768 353398 227734 121847 256584
13453B56584J20026j84460J6436P4719A22870L45961A22066L31865k02102b479
$$ 256584 376610 192150 208586 283305 122870 468831 122066 453931 251829 -2479
13442D93874o6227h2543B43118Q5051A33225f7206C0726L70335B6719J39289b21483
$$ 493874 427647 -82543 243118 328169 133225 -67206 30726 401061 26719 166008 -221483
13430C17177J66945j94404a0374B50629K47453q1037c4716A17192J73041J1129
$$ 317177 484122 289718 -10374 250629 498082 417045 -34716 117192 290233 301362
13420C01362m184o3214j6603B1123M74463A49627J46616j42803L29130J07848
$$ 301362 297178 233964 217361 21123 495586 149627 296243 153440 482570 590418
13410E90418O8776e9141C85851F3682J84049J00226A01213M69197i053I3800J30275
$$ 590418 659194 -59141 385851 63682 247731 347957 101213 570410 -9053 93800 224075
13399B24075N699A01402R2867L55278A86430O8054j02830Q3339A8724L50230A60935
$$ 224075 229774 101402 194269 549547 186430 254484 151654 234993 18724 368954 160935
13387C79546j2463j77407L55589B21846q0799A6840J77427K56784j49337A13450
$$ 379546 367083 189676 545265 221846 141047 16840 194267 451051 301714 113450
13376C01224m3250J02538J2798f525B25747l6285J3422n0090K10653j42260J40534
$$ 301224 257974 360512 373310 -6525 225747 189462 202884 152794 363447 221187 361721
13365C61721A30929J89560j30205K81744B23604M6653k5619M4094c388o9878A57553
$$ 361721 130929 320489 190284 472028 223604 270257 244638 288732 -3388 -73266 157553
13353D31671A70566O3049K60803j67760p0290j21035R4207f2891a3282A73041
$$ 431671 170566 233615 494418 326658 256368 135333 229540 -62891 -13282 173041
13342H9101P5095J81517M4949J32714j28718j09010m826L9404E5050r472P783
$$ 89101 164196 345713 390662 523376 394658 285648 280822 320226 55050 45578 53361
13331E3361Q7592a45490A67378P7819M865D5120M71040k52191Q264I2731J91387
$$ 53361 140953 -145490 167378 245197 250062 45120 516160 263969 272233 92731 284118
13320B84118a0321C61700K90892B07924k8115J0009e1130D80224j18513q2815
$$ 284118 -10321 361700 652592 207924 179809 189818 -51130 480224 361711 278896
13310B78896N715A38753K86402F4943j2887a31528B10022J585J2602l5104m699
$$ 278896 284611 138753 425155 64943 52056 -131528 210022 211607 224209 189105 184406
13299A84406C8140L86533j70805K3344B4884P6083Q1468J81442j65186d8886C70761
$$ 184406 38140 424673 253868 277212 24884 100967 182435 363877 198691 -48886 370761
13287D45619j90091c340E5163R1362K7749d5510B70241b8649B67520I4399K48926
$$ 445619 255528 -3340 55163 146525 174274 -45510 270241 -28649 267520 94399 343325
13276C43325j10070I6314h1735B35691A08071l7782R3747J11144L6748H96R557
$$ 343325 233255 96314 -81735 235691 108071 70289 164036 275180 311928 896 10453
13265A0453J05956L01406k05873c1400D49218Q8486B9248J07929b3733A28139
$$ 10453 116409 417815 211942 -31400 449218 537704 29248 137177 -23733 128139
13254a3967G1713J67506I5536L42007q9440j21140C3847J29020K5336O2060A05713
$$ -13967 71713 239219 95536 437543 348103 226963 33847 162867 188203 250263 105713
13242B7795O7895O8082J27779I9355C7586o354L16809K39426a24030F397N98979
$$ 27795 95690 163772 291551 99355 37586 31232 348041 587467 -124030 6397 605376
13231F05376j75248E0271j7010J7778R9833E3649C463L9173K08310P1210R6850
$$ 605376 430128 50271 33261 51039 150872 53649 3463 42636 250946 322156 419006
13220D19006j91414n9981L32177B05684R4122A32556p226K5786a75541H1872B2518
$$ 419006 227592 167611 499788 205684 299806 132556 125330 151116 -175541 81872 22518
13208A09943J0107q829K09424d2797C91963f0502J4916A92642C7183M8790N7395
$$ 109943 120050 111221 320645 -42797 391963 -60502 -45586 192642 37183 85973 143368
13197A43368a30168n0914B32739o0850P849a08438A43967p0978J40588O9802h8418
$$ 143368 -130168 -181082 232739 171889 179738 -108438 143967 72989 213577 283379 -88418
13185A19129J29948b15788f8875F7204N48190f0188p4158A07659J28863M9979
$$ 119129 249077 -215788 -68875 67204 615394 -60188 -134346 107659 236522 286501
13175B86501A12411A573M729J49716G426M5350L25886j51853B0222a00574F4253
$$ 286501 112411 1573 6302 156018 7426 52776 378662 226809 20222 -100574 64253
13163B78596m4290Q1707j36138L7917c0744r262l4219D32127f1147A15703g7192
$$ 278596 234306 316013 179875 217792 -30744 -40006 -74225 432127 -61147 115703 -77192
13151b4238B20747G3852e1997A32837J09230a16154L1252H6555C5188L17987G7589
$$ -24238 220747 73852 -51997 132837 242067 -116154 -84902 86555 35188 353175 77589
13139A80161C3529k765K7969J3544a79541g9129D6900a23772B31389d7852n4154
$$ 180161 33529 30764 58733 72277 -179541 -79129 46900 -123772 231389 -47852 -102006
13128a02006J8673C84059q9884A27898B2699J76141d1190E4359N08321a63996
$$ -102006 -83333 384059 294175 127898 22699 198840 -41190 54359 562680 -163996
13117A81509D5600J34746D284K46790A2798c5386j31730B54231j12063Q555J82792
$$ 181509 45600 180346 4284 251074 12798 -35386 -167116 254231 142168 150723 333515
13106C33515A30202J7753D6458K70108H0209f5553j05740B53235l8304Q5329K28081
$$ 333515 130202 147955 46458 316566 80209 -65553 -171293 253235 214931 300260 528341
13095E28341a86890Q9075A56161j1012g7284r8940Q5435A07921G69K27974K9682
$$ 528341 -186890 -97815 156161 145149 -77284 -176224 -90789 107921 769 228743 258425
13084B58425L8371a68009A48396J66177A57238c2080m1682j0966I6197K11306
$$ 258425 296796 -168009 148396 314573 157238 -32080 -73762 -84728 96197 307503
13074C07503G1462K62278b80562D26202a9843A88934q5082N1615k7010h600B89724
$$ 307503 71462 333740 -280562 426202 -19843 188934 103852 155467 128457 -8600 289724
13062A84958m3627m9720K95998N94A53472o8778J29785D0950J02631b8394C30996
$$ 184958 141331 91611 387609 388203 153472 84694 214479 40950 143581 -28394 330996
13050B03349g2145C6876R0170J90409N1161i213B25289j5320A7263L51510A63957
$$ 203349 -72145 36876 127046 317455 368616 -9213 225289 209969 17263 368773 163957
13038a12121B17129H4252J17918Q9371J19996f9889B53427m3784J73470A54309
$$ -112121 217129 84252 202170 291541 411537 -69889 253427 209643 383113 154309
13027D97116A07256b1470n5897A6824Q1007k8192o232h6171B05605b6868D08626
$$ 497116 107256 -21470 -77367 16824 97831 69639 63407 -86171 205605 -26868 408626
13015B15158a45645e1472j8316A65585p153F0679K31820D6075J66510p3065J20463
$$ 215158 -145645 -51472 -69788 165585 158432 60679 292499 46075 212585 139520 259983
13004B59983j24314K03653a34860A70990J19146a92382n0006G9202N3040B3476
$$ 259983 135669 339322 -134860 170990 290136 -192382 -242388 79202 132242 23476
12993C42110A42534E5267K79998A21815c8083C25673g4680C7737J49966D1639
$$ 342110 142534 55267 335265 121815 -38083 325673 -74680 37737 187703 41639
12982A05152R3066n1328o3657d0657A60705J67398e9214F2795f6340H7270J36234
$$ 105152 198218 146890 83233 -40657 160705 328103 -59214 62795 -66340 87270 223504
12971B23504p481j05721N6541b57855E08370g0752B15469G0014B7234i906K494
$$ 223504 216023 110302 166843 -257855 508370 -70752 215469 70014 27234 -9906 -7412
12960g412C80666A21616a07555b9463o7360A27562k64d50848a42340A53686a82134
$$ -7412 380666 121616 -107555 -29463 -96823 127562 127298 -450848 -142340 153686 -182134
12948C89726A15450i9610A43201G745e1086F4729K69961p1083b29024D30004h2638
$$ 389726 115450 -99610 143201 7745 -51086 64729 334690 263607 -229024 430004 -82638
12936f1814a5325E18303B02797N6625b43731B2087c2389E6147b16565f6338C0654
$$ -61814 -15325 518303 202797 259422 -243731 22087 -32389 56147 -216565 -66338 30654
12924b1059A6811a41024g769B73163I9699a39611A30037D7508A8292h9928A39558
$$ -21059 16811 -141024 -7769 273163 99699 -139611 130037 47508 18292 -89928 139558
12912A58389a29144B9724a06359A71760g3909B38488I3480b11954A36110b37914
$$ 158389 -129144 29724 -106359 171760 -73909 238488 93480 -211954 136110 -237914
12901A8363J97815A07319l851J36477a15394M7660B00116L72097a51626q0240
$$ 18363 216178 107319 103468 239945 -115394 -67734 200116 572213 -151626 -231866
12891b31866F7612J82673F3563b48203F1040M5700n2934F595J63898a77653A54984
$$ -231866 67612 250285 63563 -248203 61040 106740 53806 6595 170493 -177653 154984
12879A96987l9717a20967o0818E5017d1301B33760M9979A31084O2139b3896D8294
$$ 196987 157270 -120967 -181785 55017 -41301 233760 283739 131084 193223 -23896 48294
12867B06792D1705a407l2410C2524f5804a8722I8356J17270m7315L0904k919j5118
$$ 206792 41705 -1407 -33817 32524 -65804 -18722 98356 215626 168311 199215 196296 181178
12855A81178c7322a5130F2203J13224l539E2330N6936g2970B6622i4160n0117
$$ 181178 -37322 -15130 62203 175427 171888 52330 109266 -72970 26622 -94160 -144277
12844a44277A63311L30151A54912O2278N2438b50926H3731b22591L0833i2052
$$ -144277 163311 493462 154912 217190 269628 -250926 83731 -222591 -191758 -92052
12833A77493n7986E3997i5811d1565A22163j2660K19861H02R0883d8885B04530
$$ 177493 119507 53997 -95811 -41565 122163 109503 329364 802 91685 -48885 204530
12821A08080J15683o028O9934A9405a61441d7258C33665E5618L10786A44635j0726
$$ 108080 223763 217735 287669 19405 -161441 -47258 333665 55618 366404 144635 133909
12810A33909a17277C1023b7143B22506c4587I7458J18926C1363d6693G0960J3435
$$ 133909 -117277 31023 -27143 222506 -34587 97458 216384 31363 -46693 70960 84395
12799H4395c8456B04413b2955B76764G5741J18675e4408C78532b07498C04228
$$ 84395 -38456 204413 -22955 276764 75741 194416 -54408 378532 -207498 304228
12788A26264b4441k7693C5931L9588a4680B32230e180k01221o4396b376j33264
$$ 126264 -24441 -52134 35931 75519 -14680 232230 -5180 -206401 -270797 -2376 -135640
12777a35640B5033i8573E92828I8946B4399L10147i9213D12J47210J62634c5850
$$ -135640 25033 -98573 592828 98946 24399 334546 -99213 412 147622 310256 -35850
12765E740a63912D68109A51538i6736I2764A119K982O2158K30625F3815e501l4477
$$ 5740 -163912 468109 151538 -96736 92764 1119 4101 66259 296884 63815 -5501 -39978
12753c9978r7872j72560a01854B29762j09718H766a29064r4852b6519C95141a84282
$$ -39978 -137850 -310410 -101854 229762 120044 8766 -129064 -223916 -26519 395141 -184282
12741a4762j6860p5546A22630D5025P4884a5904A29553k0470l800a80806A27927
$$ -14762 -31622 -107168 122630 45025 119909 -15904 129553 109083 105283 -180806 127927
12729A35885c7874j21377B50788j08995J07481m6613i4956B34996a47921c0008
$$ 135885 -37874 -159251 250788 141793 249274 202661 -94956 234996 -147921 -30008
12718D6435L74464A55387a22672e1370F4488j7370J01713a29295A64850f2547
$$ 46435 420899 155387 -122672 -51370 64488 47118 148831 -129295 164850 -62547
12707C4386K67066j20939m5402J60683p9113d1293C61050I4927K47071H0551R8376
$$ 34386 301452 180513 135111 295794 216681 -41293 361050 94927 341998 80551 178927
12696A78927j7411b89552H9780L51210q5949A6734i9395G991O3741J44962j07980
$$ 178927 161516 -289552 89780 440990 355041 16734 -99395 7991 71732 216694 108714
12685A08714B5606b6961A58712C0861J7675K19975j03887E6878K76468f4939C50073
$$ 108714 25606 -26961 158712 30861 48536 268511 164624 56878 333346 -64939 350073
12673C60332G6875a00067D33702D0053K25909J16689O949c9470G4959J41759J24221
$$ 360332 76875 -100067 433702 40053 265962 382651 389600 -39470 74959 216718 340939
12662C40939A58066a2434l515B99030A12017C7039a16738C13777a00321A41924
$$ 340939 158066 -12434 -15949 299030 112017 37039 -116738 313777 -100321 141924
12651h3517A98514Q1756A25876J33788M3605j21970n2117b14753I3975a02754
$$ -83517 198514 280270 125876 259664 303269 181299 129182 -214753 93975 -102754
12640C8614J60964h520A93075f7612A53819J68639A24937f7319P225B39303e822
$$ 38614 199578 -8520 193075 -67612 153819 322458 124937 -67319 -60094 239303 -5822
12628A42770N4811j9129J1222a59650g301C2688J00383j3855L56614j99415G5771
$$ 142770 197581 178452 189674 -159650 -7301 32688 133071 119216 475830 276415 75771
12616e1163k7832I5739k1279L9723a7385K642o5635K3602B36870D0656b69164
$$ -51163 -78995 95739 74460 114183 -17385 -14743 -80378 -56776 236870 40656 -269164
12604E9684K1303K78145A28573J29801q8053J65425I1728J92084a21518A01431
$$ 59684 80987 359132 128573 258374 170321 335746 91728 283812 -121518 101431
12593D4810i6909A09789b71671J04912b2713C4300J20513A5581m447b76766E98118
$$ 44810 -96909 109789 -271671 -166759 -22713 34300 154813 15581 11134 -276766 598118
12581A47133D1899e3248j56281c818C8269Q6009D0164k711K9898K5144K1856P4730
$$ 147133 41899 -53248 -209529 -3818 38269 124278 40164 37453 67351 92495 114351 189081
12569A89081L0413j3186h452o7311j166A70337i3422C57854d5000j3515A58135
$$ 189081 219494 206308 -8452 -75763 -76929 170337 -93422 357854 -45000 -58515 158135
12557h073n5587E55530a16496F056N831K67427p3611J23045A4941J52399a88472
$$ -8073 -63660 555530 -116496 6056 11887 279314 205703 328748 14941 167340 -188472
12545h2232e782A77773F1441K25556a71638C8744J98225L4072c6186A34218a31122
$$ -82232 -5782 177773 61441 286997 -171638 38744 236969 271041 -36186 134218 -131122
12533C48134i9532A12891g2625l8676A1732n532M33360a69697b4303j3678D3233
$$ 348134 -99532 112891 -72625 -111301 11732 6200 439560 -169697 -24303 -37981 43233
12521a90860O1701B47673b56687B77545f0453A625L593c2648D1557O8184a30800
$$ -190860 -129159 247673 -256687 277545 -60453 1625 5218 -32648 41557 109741 -130800
12509C08648n2302C7061O388N3934L19281A30142i5331A3946J31462F7806k3505
$$ 308648 256346 37061 43449 97383 416664 130142 -95331 13946 145408 67806 44301
12498D4301J43909k4816a53319D1188a75912I2574A8508N8328A5318Q0549b1137
$$ 44301 188210 163394 -153319 41188 -175912 92574 18508 76836 15318 95867 -21137
12486a22575k26444Q1342A02612b4578A19791g0080j17028A76697J20983c0059
$$ -122575 -349019 -267677 102612 -24578 119791 -70080 -187108 176697 297680 -30059
12475A0174K2121b03542D0962M7950e9024J957A89393j7533o8514B4394a5608
$$ 10174 32295 -203542 40962 88912 -59024 -57067 189393 171860 103346 24394 -15608
12463A84991A5229a14640A60921b50141A09097f8972c2611h09B36109e5042A56767
$$ 184991 15229 -114640 160921 -250141 109097 -68972 -32611 -809 236109 -55042 156767
12451b04403F3169c9633A69830n8898O1583M5797D0995K218j2172L7282b44715
$$ -204403 63169 -39633 169830 110932 172515 218312 40995 43213 31041 68323 -244715
12439C01384j03642l2905b14756A8096b83842A10702M1675G1447a49571J3090
$$ 301384 197742 164837 -214756 18096 -283842 110702 152377 71447 -149571 -136481
12429a36481L6119a2107q2546B63770E9089d5558j25911A90152F6323a21264a3423
$$ -136481 -100362 -12107 -94653 263770 59089 -45558 -171469 190152 66323 -121264 -13423
12417a41793H4678M6771m6470J50546F9726M5130h8279A9128c3822j82778p2578
$$ -141793 84678 131449 84979 235525 69726 114856 -88279 19128 -33822 -216600 -289178
12406b89178A28638a66929n6890Q1530K2785k42169B85925j23471j9086L8293
$$ -289178 128638 -166929 -223819 -142289 -119504 -361673 285925 162454 143368 181661
12396A81661H2540a84803j65595I1460k2161b12869B9667b76100J16654B23453
$$ 181661 82540 -184803 -350398 91460 69299 -212869 29667 -276100 -159446 223453
12385a90832J4774h6308H3732a21139A12573j7405f5864I2910M9390A5820h1758
$$ -190832 -176058 -86308 83732 -121139 112573 95168 -65864 92910 142300 15820 -81758
12373A27257d41757C37015c29392A77706a43802e8511k3358A92934a24116F3343
$$ 127257 -441757 337015 -329392 177706 -143802 -58511 -81869 192934 -124116 63343
12362C6298j6765J30128G1432R7616A1582b3899l0673l64611B38244d1316n6510
$$ 36298 19533 149661 71432 169048 11582 -23899 -54572 -419183 238244 -41316 -97826
12351i7826K1204r9502B16912a85201A83134a35926C86010f6335L1159k23032
$$ -97826 -76622 -176124 216912 -185201 183134 -135926 386010 -66335 -35176 -258208
12341b58208d2569m0045B5103J26031a06397K8195p6971H1894K44977j6433A30121
$$ -258208 -42569 -82614 25103 151134 -106397 -78202 -155173 81894 326871 310438 130121
12329e8771B12953q7376l3338o925C8127Q7988A4063i6433C71286E1856g3940
$$ -58771 212953 125577 92239 85314 38127 126115 14063 -96433 371286 51856 -73940
12317a94741l5753B41459N344g7703o981b7311D0096b8296B41543L4194g2556
$$ -194741 -230494 241459 246803 -77703 -84684 -27311 40096 -28296 241543 275737 -72556
12305d489A44749a84804j7198A3687R7976c856m7814n9674K227A2434a81121g6567
$$ -4489 144749 -184804 -202002 13687 111663 -3856 -51670 -111344 -109117 12434 -181121 -76567
12292b2020F2439Q1843a95357D28771c16229B61901B4420a3672A35726Q0001C739
$$ -22020 62439 144282 -195357 428771 -316229 261901 24420 -13672 135726 215727 3739
12280C96673a48411B20362C3934O3831K49964q3076n5562K51057o9483l891e1764
$$ 396673 -148411 220362 33934 97765 347729 264653 209091 460148 390665 386774 -51764
12268B7522K6629Q7660B2331N7817J44232a01931q4389A81711K34547i5222r3168
$$ 27522 54151 141811 22331 80148 224380 -101931 -186320 181711 416258 -95222 -188390
12257a88390D1479D548L19719j06391q5571C6940M0182K41343l4817A01748i329
$$ -188390 41479 4548 324267 217876 132305 36940 77122 318465 283648 101748 -9329
12245A22385a33324M0304I1324J82909a5955B23579b75870B31258i2431D26492
$$ 122385 -133324 -93020 91324 274233 -15955 223579 -275870 231258 -92431 426492
12234H1562N121K9346h1236C41207l7861l1182J0880A01659A0641R833Q154M71554
$$ 81562 86683 116029 -81236 341207 303346 272164 283044 101659 10641 20474 28628 500182
12222E00182o8376B053N20233A78931Q3468r0695I793b8905C72287A02518b12557
$$ 500182 431806 2053 522286 178931 262399 171704 9793 -28905 372287 102518 -212557
12210B24133J34741F3072j8406a0386B76318J70623B19815J6339b13148A35691
$$ 224133 358874 63072 44666 -10386 276318 446941 219815 236154 -213148 135691
12199A50250D4582J59525r7881R7275c08309A02552f5390A45912J56634A10080
$$ 150250 44582 204107 106226 203501 -308309 102552 -65390 145912 302546 110080
12188g2666A59638e00j70762B4146a90081B99162d4563m8237A34956l9217R506
$$ -72666 159638 -500 -171262 24146 -190081 299162 -44563 -92800 134956 95739 105245
12177A05245L12141j14544M1317j44802Q4187G1345c3329B84606R4083j65040
$$ 105245 417386 302842 344159 199357 283544 71345 -33329 284606 378689 213649
12167B13649N7431A30996E6062b55974A73582B9336L18184n12O3547j87551m1317
$$ 213649 271080 130996 56062 -255974 173582 29336 347520 347008 410555 223004 181687
12156A81687R103P3471n8239b6214B63738P8305d92893H1537N1195E459J32237
$$ 181687 190790 264261 206022 -26214 263738 342043 -492893 81537 132732 5459 137696
12145A37696k5143l2621h9036L5549A96553L26963B60092D5464A4821f8046k35263
$$ 137696 112553 79932 -89036 -53487 196553 523516 260092 45464 14821 -68046 -303309
12134c03309B68059J9149a0529A11434B3445a9751q0412I8017a03917A90404K1267
$$ -303309 268059 287208 -10529 111434 23445 -19751 -100163 98017 -103917 190404 211671
12123B11671J1698q5453J8581E8049a52373B99658b0318j5799A18459i0439p7392
$$ 211671 223369 137916 156497 58049 -152373 299658 -20318 -36117 118459 -90439 -167831
12112a67831B97857m9254j15850f0315C28219E619N6229a93142M0560B223c64620
$$ -167831 297857 248603 132753 -60315 328219 5619 61848 -193142 -152582 2223 -364620
12100a15655D679M7225h0993B05097a9822A96377a37800q7410A19020a49938m718
$$ -115655 4679 51904 -80993 205097 -19822 196377 -137800 -225210 119020 -149938 -154656
12089a54656I4918d6803p0427B86960a57361j33581a24741j2212D6669J91564
$$ -154656 94918 -46803 -117230 286960 -157361 -290942 -124741 -136953 46669 238233
12079B38233a22491j74087J42015B67323N77324N02094P8022C79975H564J77815
$$ 238233 -122491 -296578 -154563 267323 844647 1346741 1424763 379975 8564 186379
12069A86379K7097F26J39529a03491k0026D4374L35428d3268D73003c2483o231
$$ 186379 213476 626 140155 -103491 -123517 44374 379802 -43268 473003 -32483 -38714
12058c8714A01302J44983a25915C63121b81767B8319K38220a77772j6968A88323
$$ -38714 101302 246285 -125915 363121 -281767 28319 266539 -177772 -194740 188323
12047E001J27717e6451k14124g2595d078j82416J2748b6893B38158q273C627c4701
$$ 5001 132718 -56451 -270575 -72595 -4078 -186494 -173746 -26893 238158 229885 3627 -34701
12034i8958B9441Q6795e2266k2859j82083G9776a99091I5203b1083A23291L4235
$$ -98958 29441 116236 -52266 -75125 -257208 79776 -199091 95203 -21083 123291 157526
12023A57526N9072k2782o3159g2526D9573e4347j11454j60281b7562H9759Q757
$$ 157526 216598 193816 130657 -72526 49573 -54347 -165801 -326082 -27562 89759 98516
12012I8516e7658m0934c2143j79621i8125n6435g0325b4247m625A7910b59384
$$ 98516 -57658 -98592 -32143 -211764 -98125 -154560 -70325 -24247 -28872 17910 -259384
12000e11k73412H6308b8160B6338K34829a20539A91097D072a61178f5444j19419
$$ -511 -273923 86308 -28160 26338 261167 -120539 191097 4072 -161178 -65444 -184863
11989a84863d7464I8894K8556K0897h0835p0115g1585k18877B4901a79261F2682
$$ -184863 -47464 98894 127450 148347 -80835 -150950 -71585 -290462 24901 -179261 62682
11977A17011O5090A9066J91765d49A63790a19902O637K3462A2672c28937I6643
$$ 117011 182101 19066 210831 -449 163790 -119902 -113265 -89803 12672 -328937 96643
11965D43702a07319F0560J82302e0743q405o3878q7908f738A39324J1458D8322
$$ 443702 -107319 60560 242862 -50743 -59148 -123026 -210934 -6738 139324 150782 48322
11953A02031L6752B2107a72335B62702f7105j46118O6158M2362C28552a71106
$$ 102031 138783 22107 -172335 262702 -67105 -213223 -147065 -104703 328552 -171106
11942a38869G7789J00747G5797g1986G7753a08029r222k90303A9535f1979B55571
$$ -138869 77789 178536 75797 -71986 77753 -108029 -117251 -407554 19535 -61979 255571
11930b34169I7016i7573a5379C16867H5450A280i4421j3851j4595r4208C71773
$$ -234169 97016 -97573 -15379 316867 85450 1280 -94421 -108272 -122867 -217075 371773
11918a63701B00235J48608A01338h3159G5200L9928n02g1062a2197j31255C5418
$$ -163701 200235 348843 101338 -83159 75200 115128 114626 -71062 -12197 -143452 35418
11906E0889h363B95316J03083C479a06086B25191a4980B69114b80604A12816E3759
$$ 50889 -8363 295316 398399 3479 -106086 225191 -14980 269114 -280604 112816 53759
11894b1422B38971e5231j72778m4220B2135J8446a37810J1898A8705a96922P0694
$$ -21422 238971 -55231 -228009 -272229 22135 40581 -137810 -125912 18705 -196922 -126228
11883a26228l9866p0440F141O5335a22045c2256A07554b11167f4598k96840f7333
$$ -126228 -166094 -236534 6141 71476 -122045 -32256 107554 -211167 -64598 -361438 -67333
11871a00616I7710B0249d5714i110A93850b98066a37477A10032a20685d4437H778
$$ -100616 97710 20249 -45714 -9110 193850 -298066 -137477 110032 -120685 -44437 8778
11859A24419f2680A21332J76095c483A05586a34596C856J62517c25012B9189a22313
$$ 124419 -62680 121332 297427 -3483 105586 -134596 3856 166373 -325012 29189 -122313
11847b26582B96891A8066c1976j64496b7005C3055c85505I0319d3152p3189A3850
$$ -226582 296891 18066 -31976 -196472 -27005 33055 -385505 90319 -43152 -116341 13850
11835i015n4427A70655c4887j28134H6537l1044e3685c25G668b2790o6357q7451
$$ -9015 -63442 170655 -34887 -163021 86537 55493 -53685 -325 7668 -22790 -89147 -176598
11823a76598A57040a76897A44634L3023O2286A8663K21414k6752b3263k05345
$$ -176598 157040 -176897 144634 177657 239943 18663 240077 213325 -23263 -228608
11813b28608O2414A22302f6918j02963F0753c1802D40241C8076b05168Q1762A02787
$$ -228608 -166194 122302 -66918 -169881 60753 -31802 440241 38076 -205168 -123406 102787
11801A32937M3351p5371N6281e8081A40119j7851a66791c6978H6325a71501o2965
$$ 132937 176288 100917 157198 -58081 140119 122268 -166791 -36978 86325 -171501 -234466
11790b34466A88803l5205b30916A20619M0244n0796b32134m0204C60217A23280
$$ -234466 188803 153598 -230916 120619 160863 110067 -232134 -272338 360217 123280
11779b5193A64912J14862c9380A38402a16751A69613h0276A22995a43619b7129
$$ -25193 164912 279774 -39380 138402 -116751 169613 -80276 122995 -143619 -27129
11768B0288b19057A22402J06368a92357D2453a05719A17898J7861h3564A35882
$$ 20288 -219057 122402 228770 -192357 42453 -105719 117898 135759 -83564 135882
11757A34870b1594A26563o1294a2768c676k2148A37861m1728d07409A57116R751
$$ 134870 -21594 126563 65269 -12768 -3676 -25824 137861 96133 -407409 157116 166867
11746A66867a70564B56164b45329A30418H710O4031J1230c55988A29887i0933
$$ 166867 -170564 256164 -245329 130418 8710 72741 83971 -355988 129887 -90933
11735a1660C55508a88793Q3385K4608l49910a73976n8166c9366G1929b88001a3924
$$ -11660 355508 -188793 -105408 -80800 -430710 -173976 -232142 -39366 71929 -288001 -13924
11723F180J26631d9527B24209F8186N4478b43848A31355o1793O2515k1649I856
$$ 6180 132811 -49527 224209 68186 122664 -243848 131355 69562 132077 110428 9856
11711F6214K864a94393q3536C11646b16506k34860b2054j6550B80157a37011A70955
$$ 66214 69078 -194393 -277929 311646 -216506 -451366 -22054 -38604 280157 -137011 170955
11699A49178N5938c74938E2189J3388a63291o5386A79846b0161A43780g8116a7942
$$ 149178 205116 -374938 52189 65577 -163291 -228677 179846 -20161 143780 -78116 -17942
11687A6210L97401B05121p9714K10596H0859B30a24673B07756m775n5131N2913
$$ 16210 413611 205121 125407 336003 80859 230 -124673 207756 202981 147850 200763
11676B00763C6867J23507b33039e8830F3617L05723d1498F2142a31412f2151A52562
$$ 200763 36867 160374 -233039 -58830 63617 369340 -41498 62142 -131412 -62151 152562
11664f3835A36816D5910a2331j81413C33392j26074c8211A22138b03678B0881
$$ -63835 136816 45910 -12331 -193744 333392 207318 -38211 122138 -203678 20881
11653H9474Q133C7526a6200A08432a79379L6552A27167a16031D0222m19A6345
$$ 89474 97607 37526 -16200 108432 -179379 -142827 127167 -116031 40222 39803 16345
11641A57156b6695j30913c4100A44947b77994a18967A00859b62094C7259h012
$$ 157156 -26695 -157608 -34100 144947 -277994 -118967 100859 -262094 37259 -8012
11630b3018m4430H4674j5726d4244B16122b639B90396P7032A21410d8081l2163
$$ -23018 -67448 84674 68948 -44244 216122 -2639 290396 367428 121410 -48081 -80244
11619h0244r5604h1631q027A8684a00877F7381B8390R4591N3426L9816o4553b7350
$$ -80244 -175848 -81631 -89658 18684 -100877 67381 28390 122981 176407 216223 151670 -27350
11606B84880r4766N3462B0503K79843J1156o2919P7768a12699h461k99380j5185
$$ 284880 190114 243576 20503 300346 311502 248583 326351 -112699 -8461 -307841 -323026
11595c23026b9302D6671K7169a43192C7612K55573e0168B02174h41B94226A22251
$$ -323026 -29302 46671 73840 -143192 37612 293185 -50168 202174 -841 294226 122251
11583A0226f2447C19580A54089J68462a43302F3450a55426B30328Q3374O3773
$$ 10226 -62447 319580 154089 322551 -143302 63450 -155426 230328 313702 377475
11573C77475k2225A31446J25568a4235G5283a40870G1224P023J73310k6898A6414
$$ 377475 355250 131446 257014 -14235 75283 -140870 71224 78247 251557 224659 16414
11561b1198D27888e5129A26342J27125j19507h0711o7B71808f483A88871a26560
$$ -21198 427888 -55129 126342 253467 133960 -80711 -80778 271808 -6483 188871 -126560
11549e3664B36241g5293B96585l7585b98121B85870N8636N6017j56951c8625I8824
$$ -53664 236241 -75293 296585 259000 -298121 285870 344506 400523 243572 -38625 98824
11537C49723A55744n6636f7195C07744R7844p7762j797d8293j4911l61575B20513
$$ 349723 155744 99108 -67195 307744 405588 327826 326029 -48293 -63204 -424779 220513
11525a34462R956C85528a49566B80258G8064P2275a81440E4008f5568k05119a5423
$$ -134462 -124506 385528 -149566 280258 78064 150339 -181440 54008 -65568 -270687 -15423
11513e2983n2149q954B74253O3062A29882a23594B00782J90348H1719f1662C74680
$$ -52983 -105132 -114086 274253 337315 129882 -123594 200782 391130 81719 -61662 374680
11501C6150R5321n7249J10358R7349h6772F3886K62488G5289F962Q3314a64083
$$ 36150 131471 74222 184580 281929 -86772 63886 326374 75289 6962 90276 -164083
11489c0954H031J0883K39782J3141b11284Q164G5451D641Q6191K24173A56424
$$ -30954 8031 18914 258696 271837 -211284 -203120 75451 4641 90832 315005 156424
11477D21846r5837J69007k00563H5879a76643D3724J17124J07573j14390Q3009
$$ 421846 326009 495016 294453 85879 -176643 43724 160848 268421 154031 237040
11467B37040F2872J50479b8263D4165K23633j33575J82730A09632d3337B81275
$$ 237040 62872 213351 -28263 44165 267798 134223 316953 109632 -43337 281275
11456a27683j60774G3905c1303n1656j84721l7364e7571B36863I2321B7855a55521
$$ -127683 -288457 73905 -31303 -82959 -267680 -305044 -57571 236863 92321 27855 -155521
11444a10424C00816o7348o1008D6627J63451O9098j9584b4089n4756j53925C1640
$$ -110424 300816 233468 172460 46627 210078 279176 259592 -24089 -78845 -232770 31640
11432h2055c6678A72740d4059C98744b35499A3936J61593A4817c81989A92142
$$ -82055 -36678 172740 -44059 398744 -235499 13936 175529 14817 -381989 192142
11421A53656p4434a29260e2943B49866G4869Q8748H0287l9027M0809J12846K7516
$$ 153656 79222 -129260 -52943 249866 74869 163617 80287 41260 82069 194915 222431
11410B22431b320A24284O2716c15293c4951J923l7612A29457m101a86149A79102
$$ 222431 -2320 124284 187000 -315293 -34951 -33028 -70640 129457 125356 -186149 179102
11398D0683b45754B68912j33891f9963K7944J7359r1018m947j91954D2768N2352
$$ 40683 -245754 268912 135021 -69963 -42019 -24660 -115678 -120625 -312579 42768 95120
11387I5120C9934L0651Q5087a05188B1651d2963H2769J07493b41169A28396c2166
$$ 95120 39934 70585 155672 -105188 21651 -42963 82769 190262 -241169 128396 -32166
11375D7259R8877d3416j01825A69982a6641C65564A51524a49152C764J32794a59508
$$ 47259 146136 -43416 -145241 169982 -16641 365564 151524 -149152 3764 136558 -159508
11363A52612g7885j74308a22055E5189b97557d680r68j67957O582H6696C3998
$$ 152612 -77885 -252193 -122055 55189 -297557 -4680 -5648 -173605 -167023 86696 33998
11351b11636b890B06866B6927Q7289d39456B58016a88814B04045m9711J84529
$$ -211636 -2890 206866 26927 114216 -439456 258016 -188814 204045 154334 338863
11341C38863b4495A47234Q494a24219R849d4269l29078A83386C2063a35636L7411
$$ 338863 -24495 147234 155728 -124219 -114370 -44269 -373347 183386 32063 -135636 -98225
11330i8225A02525b31446o8778C43697h9648p0844b0086j1354k67258D0938a02253
$$ -98225 102525 -231446 -300224 343697 -89648 -160492 -20086 -31440 -298698 40938 -102253
11318D36888F7813e8893j55896D38084A6216d3546j38464B91315B1367J63410
$$ 436888 67813 -58893 -214789 438084 16216 -43546 -182010 291315 21367 184777
11308A84777a83434I330J24768c09892I5878i6737A14159a17306A93504m1595
$$ 184777 -183434 9330 134098 -309892 95878 -96737 114159 -117306 193504 151909
11298A51909o4007a31329j7670P2094j2649E05519b29748J7465O3348N7154m2260
$$ 151909 87902 -131329 -148999 -76905 -89554 505519 -229748 -212283 -148935 -91781 -134041
11287a34041d5604k08727A26984n3634b17091B72783b71769D1102b90827A42929
$$ -134041 -45604 -254331 126984 73350 -217091 272783 -271769 41102 -290827 142929
11276h0270c6636j26181B60305H2041Q79J43859N1772J97712A64110M9013b3913
$$ -80270 -36636 -162817 260305 82041 82920 226779 278551 476263 164110 213123 -23913
11264a28429I9038a30025A66629d4506m6788o9907B72662a24932A31456E0696
$$ -128429 99038 -130025 166629 -44506 -91294 -161201 272662 -124932 131456 50696
11253c03223A25810a1736j99997A89907P4467b73416a19417B073c15897I4800
$$ -303223 125810 -11736 -211733 189907 264374 -273416 -119417 2073 -315897 94800
11242A62009b246A57911a13321B65312e9150A00821a29739k3809C46139D5520
$$ 162009 -2246 157911 -113321 265312 -59150 100821 -129739 -153548 346139 45520
11231b25446e096j2772l1559A66766j4820c5846B88920E6457e8778l3123C9964
$$ -225446 -5096 -17868 -49427 166766 151946 -35846 288920 56457 -58778 -91901 39964
11219B1262R1142J19807b30362D4084J21227c5431D9453L3673a13616L3561r9779
$$ 21262 112404 232211 -230362 44084 165311 -35431 49453 83126 -113616 -80055 -179834
11208a79834A33395d6415A36859N1052a92421B2789h7287G9987L88412b47585
$$ -179834 133395 -46415 136859 187911 -192421 22789 -87287 79987 468399 -247585
11197b42151a11738M8187j44817A51175b13009A13555a89960I3224J2243M8845
$$ -242151 -111738 -63551 -208368 151175 -213009 113555 -189960 93224 105467 154312
11187A54312c8911B36000b24665A98197c89117A18890a21043H3622l7396j6189
$$ 154312 -38911 236000 -224665 198197 -389117 118890 -121043 83622 46226 30037
11177C0037b60700f701j40922n7981n8106g3246A25916m5571d91171C3484b22344
$$ 30037 -260700 -6701 -147623 -205604 -263710 -73246 125916 80345 -491171 33484 -222344
11165b29168A58730a43526O1190D0893b97385f6756C369K9394B326d2276n3027
$$ -229168 158730 -143526 -82336 40893 -297385 -66756 3369 32763 2326 -42276 -95303
11154i5303L1178o7456C50567C9885i3747B56742a45272n3106h0334J1953k22036
$$ -95303 -64125 -131581 350567 39885 -93747 256742 -145272 -198378 -80334 -68381 -290417
11143b90417A32831K29319b5215A86840H9456k1052K2462f2209B61392j20113
$$ -290417 132831 362150 -25215 186840 89456 68404 90866 -62209 261392 141279
11133A41279K26464a73653Q2796c2539D8699J54626f9035j04302b703B26088j07322
$$ 141279 367743 -173653 -90857 -32539 48699 203325 -69035 -173337 -2703 226088 118766
11122A18766J07791h5461B45503c9078B25019d24285i9888j14214j52166d4886
$$ 118766 226557 -85461 245503 -39078 225019 -424285 -99888 -214102 -366268 -44886
11111A28348K74212h0519e643B39696j15564k332L80897A13990m9062K44597K41892
$$ 128348 402560 -80519 -5643 239696 124132 121800 502697 113990 64928 309525 551417
11100E51417B73688n3330b2623j05546C9661P771b9135f542A17891E0431J06840
$$ 551417 273688 220358 -22623 -128169 39661 47432 -29135 -6542 117891 50431 157271
11089A57271b1796B12656J77192A28135h3186F8663L94068k09385A9463K65330
$$ 157271 -21796 212656 389848 128135 -83186 68663 462731 253346 19463 284793
11079B84793j116m5609q372l6745L33077q5425j12417n6767L1627K85757j75646
$$ 284793 283677 238068 229696 192951 526028 440603 328186 271419 303046 588803 413157
11068D13157p1672o8432l5551J10747j9519J06400K15321r7265k15084K51632
$$ 413157 341485 273053 237502 348249 328730 435130 650451 553186 338102 589734
11058E89734Q7704j15804j5484o5270J80299M8373C23850N04904k31215J03408
$$ 589734 677438 561634 546150 480880 661179 709552 323850 828754 597539 700947
11048G00947J56777j67008K5829k4352r6413L73501k79999J44567k01201m0853
$$ 700947 857724 690716 716545 692193 595780 969281 689282 833849 632648 591795
11038E91795L9791K67503l8454l20793J67478j04729K52834L4185J75891D52769
$$ 591795 631586 899089 860635 539842 707320 602591 855425 889610 1065501 452769
11027C79037M07484k2353K08866l60410J57940J41506k19570J70910k81080K75109
$$ 379037 786521 764168 973034 612624 770564 912070 692500 863410 582330 857439
11017H57439r2448m8651j14799k72215K29222k48336K39142B54139M92371j03593
$$ 857439 764991 716340 601541 329326 558548 310212 549354 254139 746510 642917
11007F42917k53053L30447k70404L20931j06687m3148J5997J80531l41910K45971
$$ 642917 389864 720311 449907 770838 664151 621003 637000 817531 475621 721592
10997G21592M7855k08339J24767j03402J66071k27064M53902l15081J20732Q3414
$$ 721592 769447 561108 685875 582473 748544 521480 975382 660301 781033 864447
10987H64447l7544R6306J36509k57751M19945k30152J73827K50096j50356K27630
$$ 864447 826903 923209 1059718 801967 1221912 991760 1165587 1415683 1265327 1492957
10977A492957J27369K38078j03649L98319L23975L57082K47504k72403j8758j42825
$$ 1492957 1620326 1858404 1754755 2153074 2477049 2834131 3081635 2809232 2790474 2647649
10967B647649l33467k63016q3109j08981K30812k34270l1384k31332R0816M52796
$$ 2647649 2314182 2051166 1968057 1859076 2089888 1855618 1824234 1592902 1683718 2136514
10957B136514l40056O2762k10745J67223m03963P8621n14511K12874m30847o1847
$$ 2136514 1796458 1859220 1648475 1815698 1411735 1490356 975845 1188719 757872 696025
10947F96025j0656B36590J78293A77619K64382O1756B18705K162A6096M02033
$$ 696025 685369 236590 414883 177619 442001 503757 218705 220867 16096 418129
10937D18129H8332L08234a36434A17052a1375A1462L8648K0190C1084h7943A33680
$$ 418129 88332 396566 -136434 117052 -11375 11462 50110 70300 31084 -87943 133680
10925A10570Q5182m8552a40644d2475D0713c08306H9332K44610j05329f7414l0133
$$ 110570 195752 147200 -140644 -42475 40713 -308306 89332 333942 228613 -67414 -97547
10914i7547R21D1678J6782i2840B05655R5406G4744a34037a7196G0352b77413
$$ -97547 -96626 41678 58460 -92840 205655 301061 74744 -134037 -17196 70352 -277413
10902B55613o6874j3009b4455p2056j00777L7046C11690A01970c8035j42670c5235
$$ 255613 188739 175730 -24455 -96511 -197288 -160242 311690 101970 -38035 -180705 -35235
10890A41261a1778A61896b81667J22900A92114J69361D4744d5379A78970A9551
$$ 141261 -11778 161896 -281667 -158767 192114 361475 44744 -45379 178970 19551
10879E4383i2895A54873F0008L29770b0630H341J24074c17806A05352g4028c3923
$$ 54383 -92895 154873 60008 389778 -20630 8341 132415 -317806 105352 -74028 -33923
10867c28889a4549k65928J12952H4641P5611b07281A05570K0407E5941N8419a19349
$$ -328889 -14549 -280477 -167525 84641 160252 -207281 105570 125977 55941 114360 -119349
10855a02904m6216e0206G18b97572i5434I5803L10106b26739C87627a23016B53959
$$ -102904 -149120 -50206 718 -297572 -95434 95803 405909 -226739 387627 -123016 253959
10843c03718N9785f8237C0354g0630F1357L66171g1315A43589b03757D59749A03044
$$ -303718 -243933 -68237 30354 -70630 61357 427528 -71315 143589 -203757 459749 103044
10831A40606a34545A01298a26519j9408B83776b7052F5229c01192J9903R9154
$$ 140606 -134545 101298 -126519 -145927 283776 -27052 65229 -301192 -281289 -182135
10821a82135B25771a70833o4923A31234b03843a6806r6162A82321G180J18315
$$ -182135 225771 -170833 -235756 131234 -203843 -16806 -112968 182321 7180 125495
10811A25495b73400A04772N4320b59669i4582I6761d86500A05711m9783J4993
$$ 125495 -273400 104772 159092 -259669 -94582 96761 -486500 105711 55928 70921
10801G0921e4212B9824J03720r102a0699H0851i1401A85917b84940l2530D2360
$$ 70921 -54212 29824 133544 124442 -10699 80851 -91401 185917 -284940 -317470 42360
10789g1156j76379j20309C1512c0899a4248n1815A14964b43052Q2882j97586e7564
$$ -71156 -247535 -367844 31512 -30899 -14248 -66063 114964 -243052 -160170 -357756 -57564
10777A48550a81976f3165l9902F9482K60801A8515P5876m4466b7269c004l01175
$$ 148550 -181976 -63165 -103067 69482 330283 18515 94391 49925 -27269 -3004 -304179
10766c04179a19099j9147B41040j2565h2814H227e650A43259b03399J5683A6941
$$ -304179 -119099 -138246 241040 228475 -82814 8227 -5650 143259 -203399 -187716 16941
10754b00432A1703g9635E68489B9697r870J05112i608I5705f9892k5111f168o8907
$$ -200432 11703 -79635 568489 29697 19827 124939 -9608 95705 -69892 -95003 -6168 -75075
10742g5075k5784c8569B6404K28763E1996c58999f7949B85935e9074l3426F9062
$$ -75075 -100859 -38569 26404 255167 51996 -358999 -67949 285935 -59074 -92500 69062
10730b398j40485e1616m6605B28273a78594A16942k4759c60656a18899B04303
$$ -2398 -142883 -51616 -98221 228273 -178594 116942 92183 -360656 -118899 204303
10719b39745i6020j89349B8691P4049c6353C22540A08592a11853L2314G9616k4456
$$ -239745 -96020 -285369 28691 102740 -36353 322540 108592 -111853 -79539 79616 55160
10708E5160L7151j9977a42481f5626B5187h7686c2388l5883B52094g8203B62118
$$ 55160 92311 72334 -142481 -65626 25187 -87686 -32388 -68271 252094 -78203 262118
10696E4480e9522D00203H4293b89456A48321b96024E5873b67887L0022j61973
$$ 54480 -59522 400203 84293 -289456 148321 -296024 55873 -267887 -237865 -399838
10686c99838a18748L3403d0879m8340k43529i2091r919B4711p575b75775J13404
$$ -399838 -118748 -85345 -40879 -89219 -332748 -92091 -102010 24711 17136 -275775 -162371
10675a62371A89042e9917j07737G1936a06065d3086j60944N7667A59780g8864
$$ -162371 189042 -59917 -167654 71936 -106065 -43086 -204030 -146363 159780 -78864
10664C4040a22572J7130H8540b46813a2410D4136e11816a18238A07128j9747c25205
$$ 34040 -122572 -105442 88540 -246813 -12410 44136 -511816 -118238 107128 87381 -325205
10652A13553d0038C5473a41321A1251a18718p2733Q3599j61643L6715C7318J42871
$$ 113553 -40038 35473 -141321 11251 -118718 -191451 -107852 -269495 -232780 37318 180189
10641A80189L1866q6830c68863B57116b22014O7128G7526e1096q6267m49867a51766
$$ 180189 212055 125225 -368863 257116 -222014 -154886 77526 -51096 -137363 -587230 -151766
10629g1694B06294a37657C80580b51509I8613a26979I4824i7677A11802a1603
$$ -71694 206294 -137657 380580 -251509 98613 -126979 94824 -97677 111802 -11603
10618C06674d3440D16997c02291F1364g8421j37894I3168J94971n8920e7670D848
$$ 306674 -43440 416997 -302291 61364 -78421 -216315 93168 288139 229219 -57670 4848
10606i4281j43374A55079F8351h5388a4959B87800b31052N1440O5204A23612B3597
$$ -94281 -237655 155079 68351 -85388 -14959 287800 -231052 -179612 -114408 123612 23597
10594a33819G3395c33884P5238A77869e4262B29835n5393G9251g512k85108A02115
$$ -133819 73395 -333884 -258646 177869 -54262 229835 174442 79251 -7512 -292620 102115
10582a11077B05932a69416k312k24475A27358a43494I0489N1666b46144M0166
$$ -111077 205932 -169416 -171728 -396203 127358 -143494 90489 142155 -246144 -205978
10572b05978C4846M1814P5775b0646d131n0327F6542a66205C31299b31239J1870
$$ -205978 34846 76660 152435 -20646 -4131 -54458 66542 -166205 331299 -231239 -219369
10561b19369I6667K772j7052d4041A80270e9955A79188c70060a53689k36817A4740
$$ -219369 96667 99439 82387 -44041 180270 -59955 179188 -370060 -153689 -390506 14740
10549c9864A53195p2391a00676B2391a39456N6987q0295A10465f4107E7913c8912
$$ -39864 153195 80804 -100676 22391 -139456 -82469 -162764 110465 -64107 57913 -38912
10537a36242D82313d9173j34509m1779G3900A8014c4462j44889B5037g6923k19703
$$ -136242 482313 -49173 -183682 -225461 73900 18014 -34462 -179351 25037 -76923 -296626
10526b96626j33727a9413F8188A7766b02291j43E6825h1925k0427B75140a41047
$$ -296626 -430353 -19413 68188 17766 -202291 -202434 56825 -81925 -102352 275140 -141047
10514B1117J91459b58264C02242c43490f409p1468F6412o420i8044A52052b88641
$$ 21117 212576 -258264 302242 -343490 -6409 -77877 66412 59992 -98044 152052 -288641
10502I8609c36021J55692D2919J04019Q981e5378m8132j99104B12516a08780G6585
$$ 98609 -336021 -180329 42919 146938 155919 -55378 -103510 -302614 212516 -108780 76585
10490a13971j47944A6514J31438a7161k6482o132J8278B98666Q9883j33654K99033
$$ -113971 -261915 16514 147952 -17161 -43643 -49775 -31497 298666 388549 254895 553928
10479E53928j8205j59619A42850o4028a34465e3108D1044Q8335E8176K06418b68839
$$ 553928 535723 376104 142850 78822 -134465 -53108 41044 129379 58176 264594 -268839
10467C61684a19334B7984b403A1322a55965B5289a55339B06462a38466K5355p0274
$$ 361684 -119334 27984 -2403 11322 -155965 25289 -155339 206462 -138466 -113111 -183385
10456a83385P0084k2158A21506l2360a53482q0240c9721c829l7935j82589G894
$$ -183385 -113301 -135459 121506 89146 -153482 -233722 -39721 -3829 -41764 -224353 7894
10444A40402M8530m5136l2457K73369A55965b77293C10082G3151N8741a22222
$$ 140402 188932 143796 111339 384708 155965 -277293 310082 73151 131892 -122222
10433C74637F1306b14324D1314J40618a37669j02085a3424k50281I8958a34136
$$ 374637 61306 -214324 41314 181932 -137669 -239754 -13424 -263705 98958 -134136
10422a905E1491g4376l16953J95209g2668B15396G1626O127b23825Q8974B17812
$$ -1905 51491 -74376 -391329 -196120 -72668 215396 71626 77753 -223825 -134851 217812
10410a51622j02642Q0743C9283J67086c7979j15874A94266H7435c1756A72083
$$ -151622 -254264 -173521 39283 206369 -37979 -153853 194266 87435 -31756 172083
10399b97629d6084a7918j41607B03694r3074K83630f7803J8301j70397A39578
$$ -297629 -46084 -17918 -159525 203694 110620 394250 -67803 -49502 -219899 139578
10388A39197n9619j520c8774H4023a40427j49777A6284L05334a581j77182B23371
$$ 139197 79578 78058 -38774 84023 -140427 -290204 16284 321618 -1581 -178763 223371
10376D63098I6754e9104C48960A02401k0845K58352K94509k44813J2044O5165
$$ 463098 96754 -59104 348960 102401 81556 339908 634417 389604 401648 466813
10366D66813L35601k94546o5483A46717L08175o5621j57613J14008j22170C8913
$$ 466813 802414 507868 442385 146717 454892 389271 231658 345666 223496 38913
10355C12432A08538K41474A45386K13777J59388L25777B19751J05207P9004j37821
$$ 312432 108538 350012 145386 359163 518551 844328 219751 324958 403962 266141
10345B66141J33211j32728J65167n4696k0190m3443L2046R3685j23217l3049i9413
$$ 266141 399352 266624 431791 377095 356905 313462 345508 439193 315976 282927 -99413
10333C44793o0929o711i6521B71320j17294L00039A92682H8711K8435J54902r0055
$$ 344793 283864 277153 -96521 271320 154026 454065 192682 88711 117146 272048 181993
10322A81993B25K06260h1912A77915J32701F2050h100B36029I2627h6306q1686
$$ 181993 225 206485 -81912 177915 310616 62050 -8100 236029 92627 -86306 -167992
10311a67992A56289O3485a40257A09593a96650A9913J8031i2469i942j00667C67835
$$ -167992 156289 219774 -140257 109593 -196650 19913 37944 -92469 -9942 -110609 367835
10299d2069A36966d9032r9521m4995e9563A06936a57721P5772E1640a2540B8169
$$ -42069 136966 -49032 -148553 -193548 -59563 106936 -157721 -81949 51640 -12540 28169
10287a96262m2113g6759B1455N6586a35109D7433J4928k1742L3461h4974k3695
$$ -196262 -238375 -76759 21455 78041 -135109 47433 62361 40619 74080 -84974 -108669
10276a08669N2260A54263a67915c6548G1878N49C5988a96284r1680e3204O081
$$ -108669 -56409 154263 -167915 -36548 71878 72427 35988 -196284 -287964 -53204 -47123
10265d7123A32123L4481a5578o3659C66729J4374A77928L89720A65060K22423
$$ -47123 132123 166604 -15578 -79237 366729 381103 177928 567648 165060 387483
10255C87483J81629G4883a7259k83205a31646l0725F7117f8180b8201n4333F841
$$ 387483 569112 74883 -17259 -300464 -131646 -162371 67117 -68180 -28201 -82534 6841
10243B88480g8455K6154e582A51575a89991j08031j10127a55401j46749A20994
$$ 288480 -78455 -52301 -5582 151575 -189991 -298022 -408149 -155401 -302150 120994
10232g0700n6648G0204a6451k72748D6569O3090b36936g8202j2461M0839b3679
$$ -70700 -127348 70204 -16451 -289199 46569 109659 -236936 -78202 -90663 -49824 -23679
10220H3145b49525k7621N5025C5449N976p569J33034a88738J5633P1037A83535
$$ 83145 -249525 -277146 -222121 35449 41425 33856 166890 -188738 -173105 -102068 183535
10208g7962j90785K1254a6190r6668o8571A29946b508A51866a46466A21954J25091
$$ -77962 -268747 -247493 -16190 -112858 -181429 129946 -2508 151866 -146466 121954 247045
10197B47045D5477g7603F191a93626M1583C20980b80248C23059A44636E6760c10444
$$ 247045 45477 -77603 6191 -193626 -152043 320980 -280248 323059 144636 56760 -310444
10185A26320a1741A02836D0565b35416d4565j2890J3347D6982O017a34459j71157
$$ 126320 -11741 102836 40565 -235416 -44565 -57455 -44108 46982 52999 -134459 -305616
10174c05616A28479b60505e9654B58229D3819b20985A00543B5935o688a20196
$$ -305616 128479 -260505 -59654 258229 43819 -220985 100543 25935 19247 -120196
10163d7328A22212K1627a09807l3517B94859g0526l91495m425A29641a63356A39403
$$ -47328 122212 143839 -109807 -143324 294859 -70526 -462021 -466446 129641 -163356 139403
10151a84339j85956K1807a16213D4737g7418B28657C1192a50261F8171k6768K1706
$$ -184339 -370295 -348488 -116213 44737 -77418 228657 31192 -150261 68171 41403 63109
10140F3109d0347A888M0722a69397j45561C5069a11645b9833j11820c2730A24924
$$ 63109 -40347 1888 42610 -169397 -314958 35069 -111645 -29833 -141653 -32730 124924
10128c41386P3075j14986d8286n408r5444F1394a25394k11865a32490A22160c7511
$$ -341386 -268311 -383297 -48286 -53694 -149138 61394 -125394 -337259 -132490 122160 -37511
10116C19359a83817a963j16401a3077n1754D0198c13074C22595B0933J77445b79180
$$ 319359 -183817 -1963 -118364 -13077 -64831 40198 -313074 322595 20933 198378 -279180
10104A65116b94839f5251C0110K03098b350m86148f17m2585q0826A17573L4771
$$ 165116 -294839 -65251 30110 233208 -2350 -488498 -617 -43202 -124028 117573 152344
10093A52344a16578j28906k0370A44502E7516L443f578j08302A47300Q0172J20632
$$ 152344 -116578 -245484 -265854 144502 57516 60959 -6578 -114880 147300 227472 348104
10082C48104c74240a71496A59259a63542B3631M3439b60313j53562J21490a27648
$$ 348104 -374240 -171496 159259 -163542 23631 67070 -260313 -413875 -292385 -127648
10071I1158a53612j35149f1090J7061J1074N377B27567g5788h051A40347J13737
$$ 91158 -153612 -288761 -61090 -44029 -32955 -27578 227567 -75788 -8051 140347 254084
10060B54084j14617b28494e412l2897A94436b6929D1114a94027g3166K1683l12488
$$ 254084 139467 -228494 -5412 -38309 194436 -26929 41114 -194027 -73166 -51483 -363971
10049c63971C06089j46693a13557o1374M2008p2948h4290B05625B4835K133L3614
$$ -363971 306089 159396 -113557 -174931 -132923 -205871 -84290 205625 24835 26968 60582
10038F0582b1166r0217d2205A44507d95205f1965C6158i3606D2715a40623A66001
$$ 60582 -21166 -111383 -42205 144507 -495205 -61965 36158 -93606 42715 -140623 166001
10026C21158C9865b24680P9910f9728F2723O3537c25612h2030m6305L1108C3008
$$ 321158 39865 -224680 -144770 -69728 62723 126260 -325612 -82030 -128335 -97227 33008
10014A27791K1642a2946C8281c28566D2698R6219b02341R8304b1669n4038j3580
$$ 127791 149433 -12946 38281 -328566 42698 138917 -202341 -104037 -21669 -75707 -89287
10003h9287C48908a29237A31702m2244f6651j59472D03547a18569j90487M1659
$$ -89287 348908 -129237 131702 89458 -66651 -226123 403547 -118569 -309056 -267397
9993b67397D42K3223b2567k80555a33993j763a3766j64143H2751h4771a8704j17150
$$ -267397 442 23665 -22567 -303122 -133993 -135756 -13766 -177909 82751 -84771 -18704 -135854
9981a35854I9939a7303A69011g6703k29088H5328M6749l513J81258b52927h3974
$$ -135854 99939 -17303 169011 -76703 -305791 85328 132077 128564 309822 -252927 -83974
9969a86963m4929A481a76296R471g6643j16916n5254e0970A41003a64520A55782
$$ -186963 -231892 1481 -176296 -166825 -76643 -193559 -248813 -50970 141003 -164520 155782
9957C4547b14183a6712A6083e5046j6460k2334k2597G9347a31111k1176r7444
$$ 34547 -214183 -16712 16083 -55046 -71506 -93840 -116437 79347 -131111 -152287 -249731
9946b49731A44816g8995n7487A05167c46082R7838A08510d2696j18044B09658
$$ -249731 144816 -78995 -136482 105167 -346082 -248244 108510 -42696 -160740 209658
9935a90006j14322C84380a65701a2071m6381j22451A77622f9428l19212a2118
$$ -190006 -304328 384380 -165701 -12071 -58452 -180903 177622 -69428 -388640 -12118
9924E8096e8691p0337C4632R9018b22781K1099K0067o4383B42907B674M4066b03275
$$ 58096 -58691 -129028 34632 133650 -222781 -201682 -181615 -245998 242907 2674 46740 -203275
9911c76384A40403a06884C3616a74346K0966O4116B0375J04707a10984k25474
$$ -376384 140403 -106884 33616 -174346 -153380 -89264 20375 125082 -110984 -336458
9901c36458h3943j694b5441k30303B44944d33554a30806D0306a13997k5634A63337
$$ -336458 -83943 -85637 -25441 -255744 244944 -433554 -130806 40306 -113997 -139631 163337
9889d23431h7677b2190l10282e0017j63631f8620H5485b15410B11624J679c1749
$$ -423431 -87677 -22190 -332472 -50017 -213648 -68620 85485 -215410 211624 213303 -31749
9877i0381b3188j41630B1842L33995h5389l32256a65343m8359l8366A37247b67555
$$ -90381 -23188 -164818 21842 355837 -85389 -417645 -165343 -213702 -252068 137247 -267555
9865c699j12739A3989g0884B7377a47189C70464j31542H7505b68579F7943K17237
$$ -3699 -116438 13989 -70884 27377 -147189 370464 238922 87505 -268579 67943 285180
9854B85180g4710A9747a94793J8176h4803A76390d2391p6666H2500d03897c2631
$$ 285180 -74710 19747 -194793 -176617 -84803 176390 -42391 -119057 82500 -403897 -32631
9842b30609H9679a88726B07986D8118b50385f3586j28954o3196R3195O8338l5137
$$ -230609 89679 -188726 207986 48118 -250385 -63586 -192540 -255736 -162541 -94203 -129340
9831a29340J9495A51486m2210a06237A08642a20400o3551l4734J01444j23330
$$ -129340 -109845 151486 109276 -106237 108642 -120400 -183951 -218685 -117241 -240571
9821b40571a05605A9286b00330q993C9167J91175f5133m6076k6186j43717A37449
$$ -240571 -105605 19286 -200330 -209323 39167 230342 -65133 -111209 -137395 -281112 137449
9809f8696n4471A46927a26687j75184C11959C8288J02235R3a73769f0218r5721
$$ -68696 -123167 146927 -126687 -301871 311959 38288 140523 140616 -173769 -60218 -155939
9798a55939l8748e0394j7974J4692C33526E8071G645O0104j4427a33801B64c2007
$$ -155939 -194687 -50394 -68368 -53676 333526 58071 7645 67749 53322 -133801 264 -32007
9785F3609c25665k399a45263L2055k6065A74765a16432p9641h1727k58726B56631
$$ 63609 -325665 -328064 -145263 -113208 -139273 174765 -116432 -196073 -81727 -340453 256631
9773b94955h7093r0700B41751b03842B99899j44209a37106k12993a40847a4983
$$ -294955 -87093 -177793 241751 -203842 299899 155690 -137106 -350099 -140847 -14983
9762a06527A64624K86c20484i4860j30586O7598G1264k4726K40694B3900b80952
$$ -106527 164624 164910 -320484 -94860 -225446 -157848 71264 46538 287232 23900 -280952
9750a12199A00763PF450c87560g3986l11082A92099a43616m47465A59205N7552
$$ -112199 100763 100770 6450 -387560 -73986 -385068 192099 -143616 -591081 159205 216757
9739B16757A0200b82796d2499A2159g9875j41123N0518c2984C4405a68615O7054
$$ 216757 10200 -282796 -42499 12159 -79875 -220998 -170480 -32984 34405 -168615 -101561
9728a01561B08007h3449k6047j22248A11534P7416p5106d4608j75296C8924b8041
$$ -101561 208007 -83449 -109496 -231744 111534 188950 113844 -44608 -219904 38924 -28041
9716c27425c7491G1971j7331b11183q5067h6733d3082k47660O9203g8096F0769
$$ -327425 -37491 71971 54640 -211183 -296250 -86733 -43082 -290742 -221539 -78096 60769
9704a62271c1912A84902b25239I6925a7400q6423j87333J42619d2831A18219c79221
$$ -162271 -31912 184902 -225239 96925 -17400 -103823 -291156 -148537 -42831 118219 -379221
9692E4438f0749L0318q1628j12339E59142A45139J11391b22311j92628l1272B01446
$$ 54438 -60749 -30431 -112059 -224398 559142 145139 256530 -222311 -414939 -446211 201446
9680a41551j5166C0595J7117g9888m1650k2162r434A14786b41240b8525j11625
$$ -141551 -156717 30595 47712 -79888 -121538 -143700 -153134 114786 -241240 -28525 -140150
9669a40150f4294j5463j01795j06058e0327l29652R0502J02100q0619D0512a55094
$$ -140150 -64294 -79757 -181552 -287610 -50327 -379979 -289477 -187377 -267996 40512 -155094
9657e90802c1361k14634O4526M3474I123a00228m3243j6284M7647p1862j9814
$$ -590802 -31361 -245995 -181469 -137995 9123 -100228 -143471 -159755 -112108 -183970 -203784
9646b03784d3223F443J06481c1607G3310H457c59007a09914a5769H099f0315A4556
$$ -203784 -43223 6443 112924 -31607 73310 8457 -359007 -109914 -15769 8099 -60315 14556
9633c25696J49097A65681e5078r0594A64905a2275k1496J3909A81760e8522A4680
$$ -325696 -176599 165681 -55078 -145672 164905 -12275 -33771 -19862 181760 -58522 14680
9621C02384c53372A81917k9527J91127C674N9469c38317A15401j4774c8666A29025
$$ 302384 -353372 181917 152390 343517 3674 63143 -338317 115401 100627 -38666 129025
9609E8379k7888b07330a3240A72685B0698J14256o2687d14410E9290a59250f8802
$$ 58379 30491 -207330 -13240 172685 20698 134954 72267 -414410 59290 -159250 -68802
9597h3358P925C0706i5689G2199a32107r1630J01787D2497O7958b6059C63944
$$ -83358 -75433 30706 -95689 72199 -132107 -223737 -121950 42497 110455 -26059 363944
9585A9319L6175h0608j31597A44320a11348B44767g1955c563C5386a97643q3092
$$ 19319 55494 -80608 -212205 144320 -111348 244767 -71955 -3563 35386 -197643 -280735
9574b80735C16317b74630a155k93833b2063E8756q24b61555O4330L5996E8040
$$ -280735 316317 -274630 -1155 -294988 -22063 58756 57932 -261555 -197225 -161229 58040
9562a44687K0795D560J41720b28520e7888A39835b11009F1086a67706g5672q9831
$$ -144687 -123892 4560 146280 -228520 -57888 139835 -211009 61086 -167706 -75672 -165503
9551a65503J0658g4443k26767Q4550A56040A8820c6717A83010f5698n2785G0455
$$ -165503 -154845 -74443 -301210 -216660 156040 18820 -36717 183010 -65698 -118483 70455
9539c34422J53493Q7948c6460n8465k10002Q1676f4544a2058B16974a2583k7104
$$ -334422 -180929 -92981 -36460 -94925 -304927 -223251 -64544 -12058 216974 -12583 -39687
9528c9687l6886p947j14479c5411k5155k86717g0195k96135q2269b3829k47788
$$ -39687 -76573 -84520 -198999 -35411 -60566 -347283 -70195 -366330 -448599 -23829 -271617
9517b71617P7213i2652A53397B0916J84564a08000I6310C595M9133B912f8869
$$ -271617 -194404 -92652 153397 20916 205480 -108000 96310 3595 52728 2912 -68869
9505E5607b85134f7626a668A07091J03407b81013g9826I2103a92490B6397b88644
$$ 55607 -285134 -67626 -1668 107091 210498 -281013 -79826 92103 -192490 26397 -288644
9493a33657p3247g8607k546a7561B71454a28819N1507B7365c66382J2443A55276
$$ -133657 -206904 -78607 -81153 -17561 271454 -128819 -77312 27365 -366382 -353939 155276
9481i1195I0833O3262b77685b4700j51921n5497d8954a3886B83521B559R6329
$$ -91195 90833 154095 -277685 -24700 -176621 -232118 -48954 -13886 283521 2559 98888
9470I8888c8855n5755j68429g1872j19740K6218c1088j92422A26586b80161o1309
$$ 98888 -38855 -94610 -263039 -71872 -191612 -165394 -31088 -223510 126586 -280161 -341470
9459c41470G1290c52753k4389e2031B65834m1173I6406a44269r556f8844j07764
$$ -341470 71290 -352753 -377142 -52031 265834 224661 96406 -144269 -153825 -68844 -176608
9448a76608A54359a22177L4045E750i0897A33080d20774b6517A9730a76082k5372
$$ -176608 154359 -122177 -88132 5750 -90897 133080 -420774 -26517 19730 -176082 -201454
9437b01454A33671a6513G2000a2272A30263E4215b77905a12924j0570d4318q6516
$$ -201454 133671 -16513 72000 -12272 130263 54215 -277905 -112924 -123494 -44318 -130834
9426a30834k0471j23582K8009L8179A05225b15956p7723H3731j1593O4239b01535
$$ -130834 -151305 -274887 -246878 -208699 105225 -215956 -293679 83731 72138 136377 -201535
9414E34070a70500j24143A60628C9768J077d9204j85363l0121e6795N729B5022
$$ 534070 -170500 -294643 160628 39768 40845 -49204 -234567 -264688 -56795 -51066 25022
9402A11042O6507b05120d8431O640k5124A57392e4173C06558a18456L5763H196
$$ 111042 177549 -205120 -48431 -41791 -66915 157392 -54173 306558 -118456 -82693 8196
9390e1998j7833n9249A59461d7128k8957C04080f3626E3114a847l1644k07970
$$ -51998 -69831 -129080 159461 -47128 -76085 304080 -63626 53114 -1847 -33491 -241461
9379b41461g1182j5569A09825A6956O9479b16540m4544m5262K4455E5110b80256
$$ -241461 -71182 -86751 109825 16956 86435 -216540 -261084 -306346 -281891 55110 -280256
9367F9267J10800C0973c71095f3822l0944j2353j13598h0034j54684C57205a02546
$$ 69267 180067 30973 -371095 -63822 -94766 -107119 -220717 -80034 -234718 357205 -102546
9355i4366A72937a78556b5079r6884B6646J170b50220A47588b09789B80684I4661
$$ -94366 172937 -178556 -25079 -121963 26646 27816 -250220 147588 -209789 280684 94661
9343b93009a38087I208h9215j3672j71329f5882p358B29256D548M6453j132B3333
$$ -293009 -138087 9208 -89215 -102887 -274216 -65882 -73240 229256 4548 51001 49869 23333
9330d2138J3127l9467j78227J21427E5055a23458j44688J30783F7335A5856e228
$$ -42138 -29011 -68478 -246705 -125278 55055 -123458 -268146 -137363 67335 15856 -5228
9318h6998k08298J33872f6171j7777j8464A48167b72999b4275j11126A88589D6649
$$ -86998 -295296 -161424 -66171 -83948 -102412 148167 -272999 -24275 -135401 188589 46649
9306C2750b24579A85992A6792e1998r4181A26133D4314a19515n0722B4005J1309
$$ 32750 -224579 185992 16792 -51998 -146179 126133 44314 -119515 -170237 24005 35314
9295C5314a53278K9661m7498k10873A08635R7143b43367J03191k7765H298J0230
$$ 35314 -153278 -123617 -171115 -381988 108635 205778 -243367 -140176 -167941 8298 18528
9284A8528a01570j79498b8767j82190j64316J39201C4625a6114H7724a24999M1884
$$ 18528 -101570 -281068 -28767 -210957 -375273 -236072 34625 -16114 87724 -124999 -83115
9273h3115E0050h6997A58394c36979B15203a4510l4250A21658K3492a33743a1255
$$ -83115 50050 -86997 158394 -336979 215203 -14510 -48760 121658 145150 -133743 -11255
9261F8314i2017B12601E7044b83638B41320j6172n1556g3631B72724M087G5662
$$ 68314 -92017 212601 57044 -283638 241320 225148 173592 -73631 272724 276811 75662
9249a20908M4113k2624D177i4130r2217A12335c4867A73061a80824I8148c52464
$$ -120908 -76795 -99419 4177 -94130 -186347 112335 -34867 173061 -180824 98148 -352464
9237a48026j24696B942Q1987J59526c17451j64749J22883L6161G7943a83316Q8441
$$ -148026 -272722 2942 84929 244455 -317451 -482200 -359317 -323156 77943 -183316 -94875
9226i4875L6722A56205b36289A05443A4196J76400b96706A65201a76946R141O3466
$$ -94875 -58153 156205 -236289 105443 14196 190596 -296706 165201 -176946 -167805 -104339
9215a04339A75291a49492k06464G9992B1284G608a42735G6085a95653g4338n7888
$$ -104339 175291 -149492 -355956 79992 21284 7608 -142735 76085 -195653 -74338 -132226
9204a32226I373i9002o6380e2035B82309A02768b05684c9098A0378b05634c8827
$$ -132226 9373 -99002 -165382 -52035 282309 102768 -205684 -39098 10378 -205634 -38827
9192d3980m184B1430a74791L3024j03820E6933J77390j04431a61383A2235e3781
$$ -43980 -48164 21430 -174791 -141767 -245587 56933 234323 129892 -161383 12235 -53781
9180G335a30569l9246a1891k14187g8962G4222J28669a21363m63888b41273e8421
$$ 7335 -130569 -169815 -11891 -226078 -78962 74222 202891 -121363 -585251 -241273 -58421
9168A80879R355p5457c1803A45897k7684d1768A37402a99004I1890h5521E0735
$$ 180879 190234 114777 -31803 145897 118213 -41768 137402 -199004 91890 -85521 50735
9156B99997n7921l4774J27321c14880I0513a13379q2441d1925k96520C1929b59985
$$ 299997 242076 207302 334623 -314880 90513 -113379 -195820 -41925 -338445 31929 -259985
9144b42184Q3385k8138Q9604j68126A9778b76210i6420q6055j24048q216P8592
$$ -242184 -158799 -186937 -97333 -265459 19778 -276210 -96420 -182475 -306523 -314739 -236147
9133b36147A67640o8191c31361h2816A69689i1169m260r950K6134A37766C4529
$$ -236147 167640 99449 -331361 -82816 169689 -91169 -95429 -105379 -79245 137766 34529
9121a94838a9664H444f7759B71729a59880B03033a94584O3031A28154c6749A4913
$$ -194838 -19664 8444 -67759 271729 -159880 203033 -194584 -131553 128154 -36749 14913
9109a46153m0586P8353M5988A51120b5916k87282J23256M9848d636m5838C94802
$$ -146153 -186739 -108386 -62398 151120 -25916 -313198 -189942 -140094 -4636 -50474 394802
9097a89504j53989B13713b3854m7858A92149c74932B00459G7300b73459C88767
$$ -189504 -343493 213713 -23854 -71712 192149 -374932 200459 77300 -273459 388767
9086a18520A65115e6954o0611K1081r4504D9924A6530d3075o3407j89664a2372
$$ -118520 165115 -56954 -117565 -96484 -190988 49924 16530 -43075 -106482 -296146 -12372
9074B7704J86877a63178q6770c3604A13051B4270b24691k12466b1519l37393a23549
$$ 27704 214581 -163178 -249948 -33604 113051 24270 -224691 -437157 -21519 -358912 -123549
9062i8148j25962A09298a48298j06573A48128a22421j9466d4526j90005j57677
$$ -98148 -224110 109298 -148298 -254871 148128 -122421 -141887 -44526 -234531 -392208
9052c92208J10953b0753I4558J7342b19648a0927m75631C5498i361k00977A91781
$$ -392208 -281255 -20753 94558 111900 -219648 -10927 -486558 35498 -9361 -210338 191781
9040a76311c9521A25419J53282a68594c3509r343D1996M1164b45369I5771b42969
$$ -176311 -39521 125419 278701 -168594 -33509 -42852 41996 83160 -245369 95771 -242969
9028a92323L6536A08735A4754a40854O7972j44473R3478D12145b67577h1324C6668
$$ -192323 -155787 108735 14754 -140854 -72882 -217355 -123877 412145 -267577 -81324 36668
9016a18367a3547A2262D219b89212d8519B25894c64148J62910A55742M4490c4482
$$ -118367 -13547 12262 4219 -289212 -48519 225894 -364148 -201238 155742 200232 -34482
9004b2176n6587j46699A43007E3811a24705q1193A00232a66901A2588i7936l7853
$$ -22176 -78763 -225462 143007 53811 -124705 -205898 100232 -166901 12588 -97936 -135789
8993a35789j93225d528F013K88343B6025b19726D97012b79474j01621J16932B12619
$$ -135789 -329014 -4528 6013 294356 26025 -219726 497012 -279474 -381095 -264163 212619
8981A69962J8523b11080e4162o7938B47789d7384j50016C1677c74848J24748E7461
$$ 169962 188485 -211080 -54162 -122100 247789 -47384 -197400 31677 -374848 -250100 57461
8969A9902c2543A7975n742a4524B10744J2934e89874a208k36951a12422D3932
$$ 19902 -32543 17975 12233 -14524 210744 223678 -589874 -1208 -238159 -112422 43932
8957B2735a99986C3863i5867A30581H679J5046f0638L581B26491K1606f3302O255
$$ 22735 -199986 33863 -95867 130581 8679 23725 -60638 -57057 226491 248097 -63302 -57047
8945e7047k69326a02276j9310L1688k13687H2990a98607a5031C60453H6940O0426
$$ -57047 -326373 -102276 -121586 -89898 -303585 82990 -198607 -15031 360453 86940 147366
8934A47366J81699j60313j7681c41457A7828i6967k66563H6888c0628C45804L38316
$$ 147366 329065 168752 151071 -341457 17828 -96967 -363530 86888 -30628 345804 684120
8923F84120J194838L613760P786280D558908A143513D90403j2122j78685C0593
$$ 684120 1878958 5492718 13278998 4558908 1143513 490403 478281 299596 30593
8913C01544g1476A92136A3349P3728O6624K72844C7088Q050d8988A35559R0200
$$ 301544 -71476 192136 13349 87077 153701 426545 37088 45138 -48988 135559 225759
8902B25759D492b31220d0923A86822E435h9298I5582A9052b11711o5167a2384
$$ 225759 4492 -231220 -40923 186822 5435 -89298 95582 19052 -211711 -276878 -12384
8890H8843a95087H1961M1281M5833n9683g0528l23250J06952F159J65227d00667
$$ 88843 -195087 81961 123242 169075 109392 -70528 -393778 -286826 6159 171386 -400667
8878B9698J08981a62628A4442a79096B40799j4716e6814B45231i7440H4763h4272
$$ 29698 138679 -162628 14442 -179096 240799 226083 -56814 245231 -97440 84763 -84272
$$ [...]
##END NTUPLES=NMR SPECTRUM
##END=
