
##TITLE=AC1382_GUAAH12194_7519056_AE5WHbNVYD
##JCAMPDX= 6.0         $$ Bruker NMR JCAMP-DX V2.0
##DATA TYPE= NMR SPECTRUM
##DATA CLASS= NTUPLES
##ORIGIN= BRUKER
##OWNER= Administrator
$$ 1.72 TOPSPIN		Version 2.1
$$ 2013-02-21 01:25:22.322 -0500  Administrator@X
$$ Compression mode = diff/dup
##.OBSERVE FREQUENCY= 400.02188249412
##.OBSERVE NUCLEUS= ^1H
##.ACQUISITION MODE= SIMULTANEOUS (DQD)
##.ACQUISITION SCHEME= undefined
##.AVERAGES= 64
##.DIGITISER RES= 22
##SPECTROMETER/DATA SYSTEM= spect
##.PULSE SEQUENCE= noesygpps1d.comp
##.SOLVENT NAME= COFFEE_meoh
##.SHIFT REFERENCE= INTERNAL, COFFEE_meoh, 1, 14.9612
##AUDIT TRAIL= $$ (NUMBER, WHEN, WHO, WHERE, PROCESS, VERSION, WHAT)
$$ ##TITLE= Audit trail, TOPSPIN		Version 2.1
$$ ##JCAMPDX= 5.01
$$ ##ORIGIN= Bruker BioSpin GmbH
$$ ##OWNER= Administrator
$$ $$ E:\/data/COFFEE/nmr/AC1382_GUAAH12194_7519056_AE5WHbNVYD/12/pdata/1/auditp.txt
$$ ##AUDIT TRAIL=  $$ (NUMBER, WHEN, WHO, WHERE, PROCESS, VERSION, WHAT)
(   1,<2013-02-21 01:25:16.260 -0500>,<Administrator>,<X>,<go>,<TOPSPIN 2.1>,
      <created by zg
	started at 2013-02-21 01:13:45.897 -0500,
	POWCHK enabled, PULCHK disabled,
       configuration hash MD5:
       86 BA 57 50 F2 9D 5C 9B 26 00 A9 28 5F 66 2E 89
       data hash MD5: 64K
       5A C4 B1 33 B6 2C 56 CC 50 52 7F 06 F6 C7 F9 C3>)
(   2,<2013-02-21 01:25:19.463 -0500>,<Administrator>,<X>,<proc1d>,<TOPSPIN 2.1>,
      <Start of raw data processing
       efp LB = 0.3 FT_mod = 6 PKNL = 1 PHC0 = 0 PHC1 = 0 SI = 128K 
       data hash MD5: 128K
       01 DE 07 3B 49 0C 77 70 E4 88 82 DB 2C 1E F8 52>)
(   3,<2013-02-21 01:25:20.541 -0500>,<Administrator>,<X>,<proc1d>,<TOPSPIN 2.1>,
      <pk PHC0 = 250.0488 PHC1 = 0 
       data hash MD5: 128K
       18 2C AD A2 22 5F E4 AA 77 4E 86 22 7F E8 44 93>)
(   4,<2013-02-21 01:25:21.275 -0500>,<Administrator>,<X>,<proc1d>,<TOPSPIN 2.1>,
      <abs ABSG = 1 
       data hash MD5: 128K
       36 A3 5F 7B 95 ED 1A 29 05 E9 DD F1 88 3D 2E F0>)
(   5,<2013-02-21 01:25:21.463 -0500>,<Administrator>,<X>,<proc1d>,<TOPSPIN 2.1>,
      <abs ABSG = 2 
       data hash MD5: 128K
       28 2E A8 19 D7 5C 52 14 6B C0 61 65 5D 3E 25 9B>)
(   6,<2013-02-21 01:25:21.650 -0500>,<Administrator>,<X>,<proc1d>,<TOPSPIN 2.1>,
      <abs ABSG = 3 
       data hash MD5: 128K
       98 50 ED B3 A3 56 4D 97 BD D7 57 53 94 6A A1 C0>)
(   7,<2013-02-21 01:25:21.822 -0500>,<Administrator>,<X>,<proc1d>,<TOPSPIN 2.1>,
      <abs ABSG = 4 
       data hash MD5: 128K
       21 E8 92 F6 85 37 5A 87 46 11 A6 75 71 37 9A 75>)
(   8,<2013-02-21 01:25:21.994 -0500>,<Administrator>,<X>,<proc1d>,<TOPSPIN 2.1>,
      <abs ABSG = 5 
       data hash MD5: 128K
       FE AC 3E A9 72 8B 81 41 83 7D 58 9A 71 20 62 CB>)
$$ ##END=
$$ 
$$ $$ hash MD5
$$ $$ E9 03 CB D4 BA 4D 97 11 15 28 45 DB F3 74 8A EA
##$RELAX= 
##$RELAX= 
##$RELAX= 
##$RELAX= 
##$RELAX= 
##$RELAX= 
##$RELAX= 
##$RELAX= 
$$ Bruker specific parameters
$$ --------------------------
##$DU= <E:\>
##$EXPNO= 12
$$ [...]
150 150 150 150 150 150 150 150
##$TP07= 0
##$TPNAME0= <>
##$TPNAME1= <>
##$TPNAME2= <>
##$TPNAME3= <>
##$TPNAME4= <>
##$TPNAME5= <>
##$TPNAME6= <>
##$TPNAME7= <>
##$TPOAL= (0..7)
0.5 0.5 0.5 0.5 0.5 0.5 0.5 0.5
##$TPOFFS= (0..7)
0 0 0 0 0 0 0 0
##$TUNHIN= 0
##$TUNHOUT= 0
##$TUNXOUT= 0
##$USERA1= <user>
##$USERA2= <user>
##$USERA3= <user>
##$USERA4= <user>
##$USERA5= <user>
##$V9= 5
##$VALIST= <valist>
##$VCLIST= <CCCCCCCCCCCCCCC>
##$VD= 0
##$VDLIST= <DDDDDDDDDDDDDDD>
##$VPLIST= <PPPPPPPPPPPPPPP>
##$VTLIST= <TTTTTTTTTTTTTTT>
##$WBST= 1024
##$WBSW= 4
##$XGAIN= (0..3)
0 0 0 0
##$XL= 0
##$YL= 0
##$YMAX_a= 6502886
##$YMIN_a= -11355346
##$ZGOPTNS= <>
##$ZL1= 120
##$ZL2= 120
##$ZL3= 120
##$ZL4= 120
##$ABSF1= 14.9612
##$ABSF2= -5.596982
##$ABSG= 5
##$ABSL= 3
##$ALPHA= 0
##$AQORDER= 0
##$ASSFAC= 0
##$ASSFACI= 0
##$ASSFACX= 0
##$ASSWID= 0
##$AUNMP= <proc_prof1d_extract.lims>
##$AXLEFT= 0
##$AXNAME= <>
##$AXNUC= <1H>
##$AXRIGHT= 0
##$AXTYPE= 0
##$AXUNIT= <>
##$AZFE= 0.1
##$AZFW= 0.1
##$BCFW= 0
##$BC_mod= 0
##$BYTORDP= 0
##$COROFFS= 0
##$CY= 15
##$DATMOD= 1
##$DC= 0
##$DFILT= <>
##$DTYPP= 0
##$F1P= 0
##$F2P= 0
##$FCOR= 0.5
##$FTSIZE= 131072
##$FT_mod= 6
##$GAMMA= 0
##$GB= 0
##$INTBC= 1
##$INTSCL= 1
##$ISEN= 128
##$LB= 0.3
##$LEV0= 0
##$LPBIN= 0
##$MAXI= 10000
##$MC2= 0
##$MEAN= 0
##$ME_mod= 0
##$MI= 0
##$NCOEF= 0
##$NC_proc= -2
##$NLEV= 6
##$NOISF1= 0
##$NOISF2= 0
##$NSP= 0
##$NTH_PI= 0
##$NZP= 0
##$OFFSET= 14.9612
##$PC= 1
##$PHC0= 250.0488
##$PHC1= 0
##$PH_mod= 1
##$PKNL= yes
##$PPARMOD= 0
##$PPDIAG= 0
##$PPIPTYP= 0
##$PPMPNUM= 2147483647
##$PPRESOL= 1
##$PSCAL= 4
##$PSIGN= 0
##$PYNMP= <proc.py>
##$REVERSE= no
##$SF= 400.020009556346
##$SI= 131072
##$SIGF1= 0
##$SIGF2= 0
##$SINO= 400
##$SIOLD= 131072
##$SPECTYP= <>
##$SREGLST= <1H.CDCl3>
##$SSB= 0
##$STSI= 131072
##$STSR= 0
##$SW_p= 8223.68421052631
##$SYMM= 0
##$S_DEV= 0
##$TDeff= 65536
##$TDoff= 0
##$TI= <>
##$TILT= no
##$TM1= 0
##$TM2= 0
##$TOPLEV= 0
##$USERP1= <user>
##$USERP2= <user>
##$USERP3= <user>
##$USERP4= <user>
##$USERP5= <user>
##$WDW= 1
##$XDIM= 131072
##$YMAX_p= 424144674
##$YMIN_p= -12850
##$CURPLOT= <Network HP LaserJet P1505>
##$CURPRIN= <$Network HP LaserJet P1505>
##$DFORMAT= <normdp>
##$LAYOUT= <+/1D_H.xwp>
##$LFORMAT= <normlp>
##$PFORMAT= <normpl>
##$SURQMSG= 1
$$ End of Bruker specific parameters
$$ ---------------------------------
##NTUPLES= NMR SPECTRUM
##VAR_NAME=  FREQUENCY,     SPECTRUM/REAL,   SPECTRUM/IMAG
##SYMBOL=    X,             R,               I
##VAR_TYPE=  INDEPENDENT,   DEPENDENT,       DEPENDENT
##VAR_FORM=  AFFN,          ASDF,            ASDF
##VAR_DIM=   131072,        131072,          131072
##UNITS=     HZ,            ARBITRARY UNITS, ARBITRARY UNITS
##FACTOR=    0.0627417313425164, 1,          1
##FIRST=     8223.62146879497, 2077,         -66920
##LAST=      0,             4495,            -67051
##MIN=       0,             -12850,          0
##MAX=       8223.62146879497, 424144674,    0
$$ Real data points
##PAGE= N=1
##DATA TABLE= (X++(R..R)), XYDATA
$$ [...]
67892 75167 74730 74881 75418 76195 76886 77132 77026 77035 77207 76883 75624 74170 73873 75236 77469 79524 81079 82397
67874 82397 83740 85196 86725 88085 88921 89168 89094 88850 88282 87451 86918 87121 87676 87725 86874 85432 83863 82435
67856 82435 81367 80908 81034 81319 81320 81036 80827 80854 80726 79869 78294 76762 75975 75747 75306 74292 73024 71852
67838 71852 70796 69964 69704 70023 70326 70145 69770 69799 70402 71424 72834 74611 76523 78544 81179 84774 88767
67821 88767 92201 94827 97054 98973 100197 100660 100862 101203 101638 102071 102420 102213 100841 98493 96158 94362
67805 94362 92486 89735 86304 83134 80939 79845 79543 79361 78573 77082 75490 74185 72857 71383 70527
67790 70527 70934 71875 71975 71009 69986 69494 69046 68289 67735 67761 67815 67417 67241 68265 70226 71838 72420 72443 72488
67771 72488 72477 72149 71604 71100 70840 71199 72590 74756 76697 77751 78384 79463 81119 82825 84307 85735
67755 85735 87096 87958 87944 87038 85430 83437 81593 80379 79782 79443 79206 79139 79071 78725 78399 78908 80494 82317
67737 82317 83436 83896 84348 84916 85045 84347 83070 81662 80282 78861 77344 75735 74045 72339 70800 69692
67721 69692 69237 69395 69718 69597 68781 67555 66429 65777 65832 66665 67990 69235 70069 70631 71049 71022 70218 68872
67703 68872 67605 66770 66323 66218 66469 66881 67125 67199 67492 68242 69159 69755 69898 69930 70224 70712 70863 70251 69091
67684 69091 68034 67388 66874 66258 65859 66085 66757 67338 67662 68028 68651 69433 70225 70921 71340 71358 71182 71149 71280
67665 71280 71408 71721 72709 74455 76329 77530 77693 76950 75763 74778 74496 74878 75434 75744 75712 75361 74759 74142
67647 74142 73768 73573 73340 73252 73777 74858 75684 75593 74797 73915 73130 72287 71569 71506 72216 73028 73073 72161 71002 70610
67627 70610 71452 73153 74990 76622 78204 79845 81237 81975 82091 82119 82606 83587 84511 84743 84257 83748 83881
67610 83881 84513 84907 84677 84209 84152 84793 85953 87190 87942 87785 86777 85424 84154 82930 81466 79619 77555
67593 77555 75700 74578 74419 74827 75063 74734 74005 73116 72080 71028 70466 70808 71762 72451 72173 70946 69436
67576 69436 68394 68046 68002 67861 67776 68173 69022 69887 70665 71682 72857 73404 72820 71674 70928 70794 70782 70579 70280
67557 70280 69934 69468 69040 68931 69082 69213 69409 70057 71093 71836 71795 71193 70455 69647 68794 68360 68822 69897 70724
67538 70724 70927 71007 71440 71795 71219 69678 68215 67783 68184 68417 67903 67024 66550 66902 67969 69315 70399 70828
67520 70828 70632 70172 69707 69173 68448 67634 66968 66608 66596 66829 67001 66766 66128 65488 65193 65196 65255 65235 65069 64706 64359
67499 64359 64533 65514 66972 68295 69173 69594 69477 68700 67384 65871 64507 63705 64012 65590 67690 69130
67483 69130 69415 69030 68604 68279 68058 68234 68991 69877 70192 69840 69405 69373 69636 69887 70171 70728 71425 71715 71255
67464 71255 70375 69746 69733 70232 71035 71992 72781 72961 72532 72173 72510 73283 73697 73553 73547 74210 75031 75020 73920 72460
67444 72460 71493 71270 71514 71832 71939 71826 71907 72736 74345 76065 77217 77806 78273 78782 79198 79641 80488 81683
67426 81683 82475 82171 80853 79073 77181 75324 73856 73207 73358 73806 74104 74156 73944 73331 72243 70834 69420
67409 69420 68358 67994 68462 69502 70619 71437 71767 71512 70839 70349 70589 71307 71644 71265 70906 71525 73187 75053
67391 75053 76272 76585 76212 75476 74623 73848 73399 73544 74345 75489 76459 76832 76311 74709 72280 69990 68954
67374 68954 69462 70839 72314 73628 74734 75429 75610 75535 75529 75668 75939 76376 76810 76827 76308 75700 75475 75605 75846
67355 75846 76195 76634 76719 75913 74235 72292 70813 70372 71244 73087 75005 76384 77523 79051 80866 82167
67339 82167 82426 81879 81083 80469 80368 80970 82033 82919 83158 82887 82724 83293 84808 87005 89469 92029 94622
67322 94622 96829 97998 98020 97516 96934 95988 94460 93027 92509 92574 92055 90499 88657 87362 86673 86291 86158
67305 86158 86385 87048 88244 89912 91512 92430 92855 93656 95180 96720 97490 97602 97699 98107 98803 99866 101360
67288 101360 102926 103896 103820 102730 101043 99383 98257 97647 97026 95931 94378 92724 91477 91228 92275 94054
67272 94054 95412 95829 95997 96850 98411 100051 101487 102889 104186 104982 105162 105068 104976 104809 104484 104136 103869 103574
67254 103574 103148 102670 102321 102320 102947 104269 105763 106487 105896 104378 102873 102062 101967 102181 102352 102528 103082 104311
67236 104311 106129 108169 110079 111615 112596 113042 113245 113415 113297 112525 111350 110567 110525 110662 110378 110017 110466
67219 110466 111913 113529 114416 114480 114240 114137 114296 114685 115229 115780 116176 116357 116364 116243 115987 115574 115137 115081 115837
67200 115837 117303 118670 119192 119082 119265 120197 121369 122122 122435 122621 122757 122881 123341 124293 125123 125039 124120 123149
67182 123149 122494 121875 121261 121209 122073 123566 125389 127618 130104 132141 133286 134013 134980 136073 136739 136892 136834
67165 136834 136599 136064 135538 135521 135922 136166 136073 136026 136241 136514 136891 137963 140092 142692 144635 145253 144787 144072
67147 144072 143888 144455 145390 146191 146716 147125 147548 148050 148797 149903 151172 152333 153473 154878 156433 157589
67131 157589 158035 158111 158472 159521 161117 162552 162956 162128 161031 161019 162549 164951 167395 169559 171354 172639
67115 172639 173445 174039 174559 175026 175870 177779 180666 183351 184856 185600 186734 188578 190344 191268 191408 191325 191539
67098 191539 192383 193910 195756 197348 198443 199277 200159 201152 202224 203426 204763 206034 206972 207477 207668 207787
67082 207787 208149 209074 210690 212775 214849 216499 217682 218764 220251 222338 224658 226511 227487 227892 228524
67067 228524 229987 232245 234805 237208 239284 241118 242964 245027 247095 248512 248915 248964 249846 251945 254447
67052 254447 256540 258443 260819 263620 266157 268123 269844 271599 273332 275115 277238 279582 281489 282656
67038 282656 283752 285722 288693 291968 294973 297773 300619 303371 305652 307472 309396 311953 315020 318038
67024 318038 320772 323542 326644 329973 333411 337220 341693 346689 351848 356949 361631 365136 367051 368182
67010 368182 370008 373196 377182 381213 385156 389130 393035 396837 400926 405775 411393 417243 422554 426768
66996 426768 430019 433174 437069 441719 446630 451696 457161 462766 467765 471991 476204 481041 486270 491466
66982 491466 496792 502591 508709 514784 520908 527507 534796 542645 550746 558610 565840 572754 580335 589135
66968 589135 598565 607693 616334 624863 633359 641605 649776 658490 668146 678656 689768 701261 712827
66955 712827 724156 735159 745932 756613 767534 779304 792350 806376 820545 834193 847255
66944 847255 860196 873721 888352 904008 920134 936443 953298 971162 989918 1009033 1028173
66933 1028173 1047405 1067022 1087470 1109179 1132101 1155577 1178961 1202213 1225692 1249661 1274257
66922 1274257 1299644 1325797 1352390 1379259 1406703 1434989 1463907 1493212 1523165 1554100 1585783
66911 1585783 1617827 1650501 1684406 1719443 1754805 1790073 1825698 1862233 1899632 1937502 1975692
66900 1975692 2014404 2053962 2094577 2136135 2178185 2220327 2262561 2305040 2347600 2389788 2431291
66889 2431291 2472077 2512248 2551984 2591396 2630101 2667230 2702356 2736208 2769869 2803303 2835212
66878 2835212 2864440 2891012 2915735 2939247 2961573 2982179 3000227 3015107 3026910 3036254 3043563 3048686
66866 3048686 3051103 3050290 3046012 3038558 3028576 3016313 3001213 2982735 2961417 2938490 2914406 2888406
66854 2888406 2859780 2828962 2796989 2764218 2730025 2693667 2655153 2615261 2574810 2533972 2492386
66843 2492386 2449953 2407195 2364553 2321667 2277924 2233580 2189712 2146932 2104718 2062312 2019804
66832 2019804 1977930 1937086 1896969 1857100 1817401 1778223 1739997 1702961 1667179 1632666 1599307
66821 1599307 1566670 1534194 1501731 1469655 1438271 1407450 1377148 1347890 1320177 1293550 1266842
66810 1266842 1239361 1211420 1183779 1157086 1131836 1108290 1086167 1064817 1043830 1023199 1002893
66799 1002893 982697 962637 943109 924369 906190 888149 870035 851894 833973 816723 800584
66788 800584 785619 771520 757922 744490 730864 716936 703154 690094 677726 665584 653674
66777 653674 642615 632719 623459 614130 604580 595034 585662 576655 568294 560505 552550 543622 533694 523618
66763 523618 514448 506744 500239 493991 487057 479279 471296 463736 456686 450055 443987 438566 433392 427942
66749 427942 422257 416830 411780 406492 400293 393291 386299 379987 374304 368813 363380 358327 353998 350475
66735 350475 347737 345680 343815 341291 337598 333108 328617 324519 320638 316651 312339 307690 303108 299312
66721 299312 296587 294274 291497 288218 285067 282232 279172 275503 271600 268076 265049 262134 258949 255563
66707 255563 252598 250784 250182 249947 249174 247717 245878 243635 240751 237386 233980 230714 227688 225401 224233
66692 224233 223594 222431 220508 218398 216266 213757 211142 209365 208548 207477 205163 202066 199211 196893 194886
66677 194886 193154 191591 189670 187145 184670 183050 182265 181809 181477 181128 180152 178065 175434 173439 172591 172466
66661 172466 172534 172602 172456 171715 170152 167884 165234 162739 161093 160602 160722 160548 159811 159064 158847 158929 158530 157145
66643 157145 155081 153085 151468 149790 147643 145493 144248 144041 143960 143065 141213 138856 136647 135272 134978
66628 134978 135036 134432 133295 132883 133771 134957 135288 134938 134697 134507 133651 131968 130059 128542 127790 128048 129068
66611 129068 129920 129907 129401 129136 128962 128097 126377 124481 122991 121975 121425 121383 121582 121537 121020 120021 118425 116272
66593 116272 114185 112930 112562 112507 112359 112039 111358 110102 108566 107410 106945 106958 107169 107377 107340 107011 106771 106921
66575 106921 107141 107011 106790 106986 107348 107086 106021 104755 103745 102965 102406 102095 101576 100305 98751 98202 99165
66558 99165 100656 101474 101524 101521 102001 102962 103971 104267 103251 101173 98928 97004 95190 93516 92664 92955 93568
66541 93568 93489 92798 92337 92390 92451 92242 92243 92934 93955 94387 93814 92766 92011 91572 90832 89649 88898 89511 91254
66522 91254 92964 93808 93770 93052 91709 90031 88587 87606 86774 85888 85264 85219 85565 85870 85881 85464 84547 83416
66504 83416 82667 82553 82709 82789 82991 83532 83988 83709 82755 81861 81458 81152 80377 79289 78767 79532 81324 83040
66486 83040 83727 83380 82692 82137 81572 80722 79743 79139 79258 79958 80678 80807 80133 79035 78169 77947 78356 79139 79979
66467 79979 80611 80972 81229 81540 81850 82036 82036 81652 80535 78720 76920 75868 75569 75622 76038 77067 78349 78965
66449 78965 78530 77623 76947 76588 76325 76170 76249 76487 76686 76701 76421 75869 75385 75358 75693 75912 75873 75939 76349 76909 77488
66428 77488 78284 79322 80132 80269 79835 79194 78505 77817 77294 77025 76895 76907 77340 78336 79523 80354 80581 80237 79404
66409 79404 78296 77335 76858 76822 76897 76694 75912 74596 73271 72461 71949 71021 69556 68367 68150 68655 69284 69961
66391 69961 70902 71877 72335 72066 71303 70383 69780 70140 71661 73520 74545 74492 74183 74365 74954 75571 76273 77378
66373 77378 78839 80174 80981 81313 81489 81667 81694 81354 80652 79778 78874 78030 77461 77377 77580 77426 76416 74720
66355 74720 72978 71667 70796 70127 69553 69291 69708 70859 72193 72892 72545 71393 69960 68645 67665 67084 66789
66338 66789 66639 66702 67160 67933 68666 69147 69490 69833 70146 70404 70660 70816 70592 69898 68998 68203 67656 67500 67902
66319 67902 68686 69275 69263 68826 68352 67925 67434 66975 66824 67053 67432 67657 67555 67091 66365 65661 65484 66363 68298
66300 68298 70290 70843 69417 67202 66011 66499 67875 69152 69971 70329 70278 70142 70359 70839 71025 70757 70515
66283 70515 70625 70872 71138 71638 72161 71894 70614 69381 69311 70141 70697 70394 69577 68713 68008 67616 67546 67447 67022
66264 67022 66609 66844 67842 69057 69806 69653 68569 67203 66657 67477 69032 70343 71231 72113 73036 73611 73741
66247 73741 73726 73680 73475 73225 73262 73576 73759 73565 73130 72730 72658 73156 74016 74479 74089 73405 73231 73385 73057 72253
66227 72253 71955 72686 73791 74436 74585 74590 74519 74365 74406 74803 75191 75131 74712 74343 74143 73851 73179 72034 70601 69400
66207 69400 68999 69411 69968 70011 69552 69103 69092 69666 70780 72181 73466 74444 75332 76303 76991 76844 75969 75269 75472
66188 75472 76283 76769 76489 75881 75548 75546 75666 76050 76964 78032 78375 77721 76865 76622 76766 76499 75711 75130 75249
66169 75249 75683 75780 75434 75016 74688 74137 73043 71678 70835 71045 71979 72863 73417 73979 74734 75336 75525 75579 75803
66150 75803 75994 75893 75733 75798 75800 75347 74780 74808 75469 76173 76758 77718 79188 80444 80768 80313 79753 79406 79092 78628
66130 78628 78164 78033 78359 78787 78717 77974 77073 76517 76066 75164 73961 73312 73669 74549 75313 75957 76853 78056 79228
66111 79228 80054 80422 80346 79888 79133 78209 77361 76926 77029 77402 77793 78451 79796 81622 83059 83467 83062 82521
66093 82521 82296 82474 83034 84002 85402 87079 88592 89469 89756 90062 90738 91251 90852 89716 88789 88560 88585 88368
66075 88368 88073 88084 88335 88465 88342 88151 88167 88630 89567 90630 91382 91832 92402 93261 94069 94501 94669 94797 94825 94558
66055 94558 93996 93310 92671 92184 91803 91306 90607 90004 89750 89452 88473 86974 85949 86026 86863 87953 89352 91127
66037 91127 92764 93802 94632 95880 97221 97584 96571 95015 93957 93649 93853 94656 96395 98851 101047 102152
66021 102152 102430 102910 104162 105754 107045 108004 108883 109524 109650 109642 110220 111344 112143 112143 111890 112024 112428 112753 113269
66002 113269 114566 116745 119414 122305 125439 128869 132655 136947 141723 146583 151091 155183 158935 162176
65988 162176 164692 166683 168539 170201 171130 170981 170028 168795 167442 165549 162548 158383 153745 149508 145933
65973 145933 142667 139474 136535 133898 131107 127789 124323 121543 119875 119070 118620 118167 117620 117152 116976 116983
65957 116983 116773 116186 115518 114986 114365 113493 112848 113134 114431 116232 118207 120468 123076 125774 128300 130605
65941 130605 132650 134297 135599 136912 138493 140102 141219 141662 141833 142283 143124 144081 145113 146664 149043
65926 149043 151762 153956 155386 156578 158000 159608 161351 163480 166036 168614 171039 173874 177731 182446
65912 182446 187385 192264 197115 201738 205798 209293 212356 214710 215972 216460 217071 218209 219352 219821 219530
65897 219530 218808 217898 216850 215657 214278 212686 210945 209084 206972 204544 202016 199503 196509 192289 186777
65882 186777 180660 174535 168509 162788 158033 154703 152440 150506 148479 146164 143260 139699 136116 133326
65868 133326 131324 129426 127442 126105 126016 126703 127176 127107 126943 126995 126980 126577 125973 125659 125915 126693 127730 128584
65850 128584 128828 128496 128190 128498 129385 130404 131322 132250 133282 134388 135581 136786 137543 137284 136021 134473
65834 134473 133424 133232 133924 135346 137105 138764 140321 142153 144382 146705 149074 152046 156113 161043 166268
65819 166268 171632 177328 183332 189343 195086 200255 204272 206537 206924 205799 203628 200815 197711 194399
65805 194399 190627 186305 181934 178158 174992 171947 168870 166160 164050 162170 160061 157795 155817 154373
65791 154373 153326 152479 151917 152030 153171 155182 157277 158602 159020 159272 160373 162871 166679 171429 176929
65776 176929 183272 190487 198123 205328 211502 216806 221867 226948 231492 234430 234957 233055 229348 224418
65762 224418 218373 211169 203216 195283 187848 180897 174532 169376 166154 165114 166041 168557 172173 176387
65748 176387 181048 186472 192931 200260 208186 216784 226233 236306 246389 255824 264022 270529 275337 278843
65734 278843 281137 281581 279493 274982 268667 260839 251463 240826 229589 218215 206910 196114 186485
65721 186485 178298 171260 164978 159247 153895 148831 144277 140501 137264 133923 130182 126349 122870 120056
65707 120056 118235 117592 117677 117615 117114 116824 117422 118671 119686 119852 119243 118424 118085 118632 119857 121148 122146 122984
65689 122984 123801 124337 124274 123733 123248 123388 124475 126428 128736 130845 132716 134796 137373 140284 143417 147101
65673 147101 151715 157215 163427 170533 178902 188546 199108 210296 222027 234228 246815 259794 273026
65660 273026 285861 297352 306962 314804 321117 325792 328656 330044 330734 331324 331884 332311 332788 333645 334863
65645 334863 336042 337000 338168 340064 342386 343855 343089 339538 333568 325818 316658 306164 294318 281133
65631 281133 266816 252068 238030 225526 214240 203074 191534 180443 170921 163068 156195 150116
65619 150116 145385 142171 139720 137199 134474 131706 128850 126086 124123 123386 123260 122818 122013 121448 121243 120902
65603 120902 120244 119671 119448 119366 119262 119241 119215 118799 117938 117221 117246 117988 118993 119921 120718 121502 122411 123427 124323
65584 124323 125019 125922 127602 130196 133464 137309 141753 146447 150876 155268 160748 168240 177557 187838
65570 187838 198541 209704 221505 233892 246470 258548 269366 278429 285529 290459 292923 292788 290197
65557 290197 285478 279168 272058 264716 256896 247817 237203 225692 214177 203152 192893 183759 175952
65544 175952 169231 163178 157577 152408 147741 143816 140956 139180 138123 137539 137608 138541 140112 141894 143765
65529 143765 145888 148237 150388 151858 152567 152842 152882 152271 150387 147404 144420 142143 139888 136599 132603
65514 132603 129420 127751 126613 124823 122595 121077 120817 121267 121560 121311 120780 120463 120437 120183 119390 118797 119515
65497 119515 121437 123130 123625 123550 124049 125348 127008 128905 131155 133547 135875 138515 141922 145801 149509
65482 149509 153059 156884 160685 163357 164250 163937 163532 163621 163961 163874 162904 161297 159793 158665 157205 154547
65466 154547 150799 146851 143277 140016 137037 134596 132713 130996 129224 127662 126622 126110 126050 126424 126963
65451 126963 127105 126604 125910 125633 125821 126017 125914 125697 125720 126080 126564 126969 127396 128214 129733 131944 134531 137060
65433 137060 139226 141097 143109 145569 148124 150007 150851 150966 150708 150002 148722 147130 145544 143915 142135
65418 142135 140537 139568 139117 138622 137798 136927 136449 136578 137210 137861 137868 137064 136187 136258 137499 139162 140380 140879
65400 140879 141045 141633 143293 145952 148760 151012 153067 155901 159867 164330 168414 171556 173415 173909 173489
65385 173489 172806 171927 170386 168188 166159 164964 164287 163413 162251 161326 161018 161245 161714 162132 162258 162135 162256
65368 162256 163226 165140 167376 169019 169541 169313 169555 171533 175510 180495 185151 188930 192344 196353 201604
65353 201604 208089 215291 222703 230239 238046 245875 252892 258328 262127 264686 266026 265581 262908 258368
65339 258368 252943 247485 242313 237385 232608 227853 222906 217608 212018 206355 200794 195466 190517 186025
65325 186025 181874 177981 174541 171766 169391 166824 163890 161078 158893 157340 156223 155568 155397 155421 155339 155146
65309 155146 154777 153800 151993 150021 148878 148703 148640 147904 146562 145279 144755 145399 147018 148775 149922 150709
65293 150709 152103 154535 157386 159843 161742 163322 164607 165386 165494 164855 163574 162166 161291 160992 160574 159562
65277 159562 158418 157885 157957 157956 157454 156635 155884 155372 155032 154530 153386 151450 149266 147596 146609 145920 145350 145157
65259 145157 145365 145393 144771 143956 143979 145251 147067 148361 148699 148332 147466 145878 143458 140864 139228 139067 139676
65242 139676 139817 138905 137345 135817 134586 133611 133001 132984 133396 133586 133117 132485 132800 134595 137097 138859 139052
65225 139052 138017 136653 135543 134748 134121 133557 133043 132706 132842 133619 134696 135340 135139 134497 134162 134333 134528
65208 134528 134468 134693 135978 138237 140471 141792 142134 141787 140689 138661 136125 134026 132883 132300 131665 131075
65192 131075 131201 132334 133944 135317 136376 137637 139499 141838 144236 146333 147879 148723 148954 148898 148831 148825 148928
65175 148928 149268 149784 150152 150301 150732 151914 153520 154764 155475 156317 157852 159842 161657 163009 164107 165393
65159 165393 167300 169982 173168 176476 179930 183856 188307 193061 198200 204147 210989 218323 226047 234721
65145 234721 244853 256341 269007 283159 299141 316763 335660 355800 377064 398616 419232
65134 419232 438129 455178 470656 485050 498635 510823 520421 527000 531348 533960 533844 529837 522584
65121 522584 514039 505195 495418 483880 470438 455008 437283 417533 396836 376131 355721 335931
65109 335931 317443 300609 285109 270659 257444 245569 234760 224935 216455 209423 203372 197910
65097 197910 193039 188555 183914 179171 175223 172521 170277 167711 165402 164455 164795 165292 165386 165632 166638 168256
65081 168256 169928 171158 171549 171002 170058 169561 169733 169948 169550 168583 167544 166758 166187 165665 165166 164884 165038 165501
65063 165501 165715 165248 164394 163861 163885 163984 163736 163439 163695 164572 165541 166189 166636 167137 167595 167705 167388 166842 166225
65044 166225 165571 164963 164494 164039 163345 162451 161710 161319 161100 160860 160576 160065 158924 157101 155099 153258 151260
65027 151260 148764 146112 143857 142079 140815 140682 142109 144213 145411 145165 144245 143344 142481 141805 141819 142425
65011 142425 142794 142722 143197 144935 147210 148930 150212 151997 154555 157253 159591 161725 164034 166718 169703
64996 169703 172496 174308 174858 174915 175581 177074 178587 179255 178963 178355 178365 179615 181935 184511 186689 188506
64980 188506 190408 192659 195111 197170 197937 196890 194666 192684 191648 190898 189460 187176 184417 181364 178107
64965 178107 174947 171954 168717 165165 162140 160411 159509 158345 156697 155287 154588 154332 154106 153677 152809 151475
64949 151475 150179 149426 148953 148173 147215 146697 146532 145970 144978 144579 145432 146811 147530 147287 146602 145918 145354 145067
64931 145067 145302 146088 147142 148080 148642 148827 148900 149097 149358 149516 149633 149855 150010 149750 149105 148493 148216 148322 149016
64912 149016 150641 153075 155588 157577 159115 160557 161963 163239 164605 166523 169175 172249 175312 178360
64898 178360 181931 186593 192249 198086 203405 208368 213716 219800 226129 231764 236003 238850 241140 243971
64884 243971 247656 251314 253848 255142 255815 256009 255097 252623 248877 244404 239499 234440 229619 225119 220578
64869 220578 215850 211513 208389 206799 206469 206847 207223 206924 205739 204061 202389 200870 199448 198093 196571
64854 196571 194319 190972 186829 182475 178109 173636 169270 165549 162713 160509 158748 157666 157519 158093 158914
64839 158914 159771 160709 161616 162251 162707 163429 164504 165321 165339 164921 164815 164935 164368 162780 161112 160481 160937 161846
64821 161846 162995 164637 166723 168877 171155 174114 178027 182494 186954 191160 195117 199066 203660 209620
64807 209620 216978 224990 233004 241006 249066 256647 262829 266984 268921 268580 265982 261481 255786 249603
64793 249603 243288 236902 230557 224678 219741 215720 212033 208217 204466 201253 198699 196671 195251 194527
64779 194527 194052 193158 191925 191291 192037 194177 197445 201772 206901 212083 216651 220673 224708 229231 234566
64764 234566 240975 248291 255689 262299 268015 273355 278654 283825 288827 293864 299027 304005 308309 311549
64750 311549 313471 314021 313559 312823 312423 312271 311574 309454 305581 300302 294182 287531 280353 272638 264577 256478
64734 256478 248680 241579 235598 230980 227596 225014 222772 220592 218436 216402 214654 213444 213066 213595 214642
64719 214642 215616 216293 216962 217925 219142 220526 222343 224990 228455 232284 235981 239213 241680 243055 243077 241640
64703 241640 238913 235382 231577 227609 223306 218898 215131 212351 209968 207312 204609 202531 201119 199897
64689 199897 198785 198145 198008 198122 198722 200354 202819 205158 206934 208678 210747 212675 214238 216371 220181
64674 220181 225526 231379 237274 243594 250564 257744 264625 271156 277411 283087 287591 290447 291412 290267
64660 290267 286802 281206 274414 267671 261478 255234 248256 240936 234463 229612 226297 224139 222740 221526
64646 221526 220127 219066 219277 220773 222675 224887 228741 235279 243667 252145 260037 268033 276951 287107
64632 287107 298559 311008 323487 334888 344773 353121 359486 363192 364279 363486 361186 357047 350877
64619 350877 343140 334365 324616 313860 302458 291088 280573 271886 265718 261675 258362 254721 251046
64606 251046 248350 247075 246866 247366 248602 250508 252587 254306 255587 256639 257520 258063 258191 258025 257674 257150
64590 257150 256477 255677 254578 252954 251047 249634 249234 249449 249527 249441 249900 251310 253339 255649 258455 261972
64574 261972 265778 269235 272206 274825 276782 277458 276760 275294 273568 271417 268408 264493 259997 255114 249728
64559 249728 243669 236989 230004 223234 217338 212869 209832 207535 205141 202478 200125 198614 197819 197329 197162
64544 197162 197678 198843 200002 200479 200242 200001 200743 203013 206289 209206 210697 210772 209990 208575 206646 204896
64528 204896 204054 203671 202429 199920 197263 195641 195061 195112 196019 198133 200891 203162 204423 204949 205053 204798
64512 204798 204402 204417 205443 207848 211540 215735 219349 222036 224619 228120 232707 237965 243773 250337 257620
64497 257620 265340 273337 281406 288932 295236 300119 303587 305241 304549 301711 297678 293286 288750 283946
64483 283946 278841 273684 269081 265716 263687 262328 261016 259808 258851 257622 255430 252336 248879 245177
64469 245177 241118 237237 234385 232508 230687 228596 227054 226871 227937 229777 232223 235073 237785 240078
64455 240078 242417 245291 248313 250517 251323 250906 249864 248903 248643 249316 250674 252336 254105 255908 257717
64440 257717 259783 262627 266495 270995 275576 280317 285984 293333 302536 313310 325480 339245 354902
64427 354902 372476 391963 413953 439629 469881 504769 544287 589336 641392 701364 769392
64416 769392 845666 930565 1023486 1121937 1222073 1320020 1412713 1498135 1575256 1643493 1701809
64405 1701809 1748312 1780789 1797580 1797997 1782436 1752455 1710534 1659241 1600200 1533614 1458793 1375455
64393 1375455 1284987 1190529 1095665 1003024 914179 830473 753409 684230 623508 571162 526522
64382 526522 488491 456134 429185 407545 390292 375780 362833 351395 341813 333953 327221 321002
64370 321002 314785 308249 301537 295166 289396 283927 278348 272596 266794 260962 255176 249777 245176 241594
64356 241594 239022 237179 235516 233686 232168 231974 233584 236527 240183 244493 249648 255534 261834 268258
64342 268258 274370 279564 283538 286323 287505 286081 281764 276018 270938 267205 263865 260099 256436 253991
64328 253991 253130 253305 253827 254458 255381 256938 259391 262720 266475 269771 271547 271129 268747 265464 262461 260407
64312 260407 259449 259453 259997 260374 259991 258737 256744 253919 250026 245218 240128 235322 230846 226435 222005 217866
64296 217866 214515 212259 210931 209972 208867 207575 206473 205961 206240 207390 209433 212180 215181 218038 220795
64281 220795 223894 227698 232143 236911 241815 246924 252425 258554 265514 273097 280417 286508 291387 296107
64267 296107 301334 306205 309056 309186 307437 305146 303067 301347 299996 299074 298650 298726 299098 299299 298967 298209
64251 298209 297297 295975 293473 289231 283308 276087 268060 259999 252816 246939 242128 238048 234661 231841
64237 231841 229139 226296 223708 221934 220971 220357 219840 219566 219683 220084 220549 220938 221217 221461 221788 222228 222698
64220 222698 223156 223661 224239 224760 224995 224700 223703 222064 220085 217955 215452 212304 208804 205767 203888 203374
64204 203374 204051 205424 206751 207651 208622 210389 212697 214447 215187 215765 217225 219752 223095 227274 232314
64189 232314 237863 243839 251084 260651 272590 285893 299378 312220 323997 334766 344767 353479
64177 353479 359312 360893 358409 353043 345404 335354 323214 310191 297452 285524 274767 265686 258413
64164 258413 252407 246967 241698 236367 230861 225554 221240 218414 216967 216691 217539 219071 220338 220865 221368
64149 221368 222859 225283 227743 229887 232352 235693 239546 243218 246599 250008 253403 256280 258232 259171
64135 259171 258967 257423 254758 251687 248739 245853 243026 240914 240228 240696 241245 241271 241187 241664 242889 244786
64119 244786 247429 250897 255098 260021 265877 272670 279965 287379 295044 303260 311980 320960 330143 339469
64105 339469 348436 356176 361989 365671 367544 368407 369207 370454 372119 374167 376917 380670 385380 390949 397300
64090 397300 403720 408625 410720 410185 408100 404948 400400 394405 387595 380389 372470 363564 354226 345393
64076 345393 337375 329702 321898 314144 307157 301456 296907 293051 289795 287428 285921 284693 283410 282565
64062 282565 282763 283767 284823 285680 286634 287724 288582 289085 289467 289778 289934 290445 292274 295706 299942 304203
64046 304203 308651 313844 319836 326420 333854 342717 353136 364624 376651 389022 401708 414557 427147
64033 427147 438744 448550 456143 461629 465190 466682 465866 462902 458363 452857 446889 441067 436116 432536
64019 432536 430323 429082 428363 427762 426760 424619 420680 414849 407667 399809 391634 383335 375312 368086 361852
64004 361852 356374 351360 346760 342717 339452 337210 336085 335815 335902 336029 336281 336966 338343 340464 343115 345959
63988 345959 348902 352272 356409 361142 365874 370161 373987 377568 381250 385604 391270 398525 407152 416720
63974 416720 426813 437029 447095 457119 467481 478455 490108 502572 516121 530922 546969
63963 546969 564330 583191 603630 625594 649189 674783 702834 733876 768663 808038 852692
63952 852692 903495 962074 1030489 1110112 1201307 1304572 1421556 1554467 1704682 1872366
63942 1872366 2057145 2258588 2475902 2707526 2951110 3203704 3461842 3721520 3978033
63933 3978033 4225703 4457995 4668308 4850981 5001728 5117388 5195610 5234823 5234375 5194508
63923 5194508 5116211 5001104 4851606 4671362 4465421 4239738 4000275 3752525 3501653 3252612
63913 3252612 3009715 2776186 2554248 2345647 2151964 1974472 1813808 1669762 1541403
63904 1541403 1427536 1327112 1239147 1162309 1094924 1035554 983392 937880 898092 862765 830945
63893 830945 802397 777299 755561 736420 718641 701196 683817 666925 651053 636443 623103
63882 623103 610994 600027 590095 581250 573781 567995 564087 562343 563222 566940 573084 581027 590697 602546
63868 602546 616609 631965 647460 662836 678768 695802 713583 731198 747978 763710 778263
63857 778263 791361 802693 811978 818876 823102 824750 824311 822146 818055 811455 801909 789406 774301
63844 774301 757166 738681 719472 699987 680476 660977 641262 620963 599858 578064 555947
63833 555947 533994 512719 492440 473044 454218 436024 419023 403662 389820 377126 365447
63822 365447 354774 344897 335607 327051 319489 312759 306355 300040 294062 288755 284211 280345 277090 274493
63808 274493 272709 271784 271235 270098 267754 264671 261992 260448 259864 259561 258868 257371 255162 252837 250899
63793 250899 249143 246970 244266 241547 239249 237308 235478 233669 231894 230278 229177 228862 228994 228877 228289
63778 228289 227622 227090 226373 225333 224512 224462 224957 225316 225234 224846 224212 223263 222215 221542 221443 221618 221703 221716 221960 222601
63758 222601 223462 224154 224428 224372 224301 224433 224729 225034 225290 225539 225723 225632 225136 224489 224187 224386 224649 224633 224877 226391
63738 226391 229371 232879 236061 239052 242210 245070 246839 247659 248565 250225 252380 254527 256541 258619 261170
63723 261170 264785 269723 275359 280719 285566 290408 295479 300473 305326 310368 315356 319160 320891 320835 319880
63708 319880 318574 317168 315930 314823 313216 310475 306634 302193 297660 293693 291248 290959 292461 294737
63694 294737 297007 299041 300921 302829 304901 307021 308993 311049 313790 317298 320747 323249 324763 325780
63680 325780 326465 326562 325901 324572 322808 321092 320123 320322 321593 323840 327313 331880 336376 339375 340636 341207
63664 341207 342119 343434 344606 345246 345355 345092 344448 343077 340465 336414 331300 325787 320450 315713 311762
63649 311762 308246 304415 299978 295629 292334 290263 288832 287630 286835 286712 287138 287773 288495 289557 291361
63634 291361 294034 297222 300516 304095 308632 314391 320771 326974 332816 338665 344910 351841 359702 368415
63620 368415 377514 386781 396775 408269 421378 435679 451098 468179 487478 509038 532574 557863
63608 557863 584906 613861 644856 677778 712228 747539 782571 815526 844444 868105 886145
63597 886145 898261 903928 903277 897755 889388 879676 869464 859376 849694 840035 829623 817753 803731
63584 803731 786825 766770 744068 719379 693006 665485 638192 612677 589600 568861 550417
63573 550417 534361 520578 509084 500440 495013 492023 490217 489368 490267 493267 497713 502902 508751 515305
63559 515305 522379 529997 538530 548067 558180 568638 579944 592925 608189 626168 647214 671394
63547 671394 698499 728482 761705 798649 839470 883522 928706 971332 1007215 1033344 1048571
63536 1048571 1053224 1048781 1037817 1023356 1007809 992656 978899 967171 957340 948598 940050 930721
63524 930721 919094 903440 882834 857348 827282 792990 755635 717303 679855 644138 610542
63513 610542 579679 552050 527496 505413 485277 466783 449888 434917 422207 411510 402190 394110
63501 394110 387694 382890 378726 374247 369354 364396 359496 354751 350564 347313 344999 343577 343132 343365 343432
63486 343432 342787 341817 341163 340842 340581 340657 341831 344582 348842 354262 360274 366084 371090 375316 379183 382997
63470 382997 386729 389953 391784 391404 389032 385954 383067 379833 375229 369389 363599 358815 354915 351343
63456 351343 347918 344908 342815 342167 343100 345021 347060 348939 351161 354366 358748 364045 369746 375376 380985
63441 380985 387397 395615 405885 417646 430446 444565 460646 479083 500038 523756 550459 579758
63429 579758 610229 639629 665689 686954 703100 714667 722795 729275 736481 746639 760894 779210
63417 779210 801278 827318 857844 892844 931493 972636 1015161 1057519 1097068 1130461 1155053
63406 1155053 1169964 1175822 1173882 1165651 1152997 1137983 1122336 1107110 1092622 1078427 1063417 1046315
63394 1046315 1026139 1002148 973695 940656 903943 865159 825787 786964 749754 714942 682633
63383 682633 652671 625473 601787 581570 563974 548672 536381 527636 521778 517805 515667 516024 519045
63370 519045 524071 530258 537129 544798 554162 566537 582436 600741 619661 638487 658036 679517
63358 679517 703473 729953 759228 791993 828778 869145 911497 953861 994843 1033501 1068354
63347 1068354 1097168 1118115 1130769 1135637 1133295 1124575 1111267 1095846 1080371 1065831 1052200 1038656
63335 1038656 1023944 1007104 987776 965534 939369 908528 873794 837317 801183 766554 733980
63324 733980 703815 676249 651521 630189 612673 598604 587299 578844 573739 570993 567409 559609
63312 559609 546559 529672 510888 491408 472097 454027 438025 424057 411592 400467 391018 383386
63300 383386 377117 371685 367126 363850 361886 360694 359650 358397 356643 354056 350626 346852 343260 339861
63286 339861 336280 332300 328105 324142 320943 318859 317740 316960 315938 314556 313002 311550 310658 310894 312312
63271 312312 314124 315404 316002 316431 317067 317877 318758 319633 320237 320341 320256 320672 321916 323718 325803 328267 331249
63254 331249 334628 338252 342177 346369 350445 354050 357428 361419 366807 373707 381510 389421 397126 405015
63240 405015 413717 423508 434218 445640 457846 471175 486069 502868 521595 541944 563640 586710
63228 586710 611136 636334 661325 685570 709364 733225 757111 780463 802927 824775 846552
63217 846552 868514 890552 912605 934877 957475 979918 1001155 1020067 1035831 1047934 1056054 1059972
63205 1059972 1059359 1053680 1042542 1026190 1005417 980996 953560 924085 893979 864470 836267 810041
63193 810041 786697 766769 749927 735672 724245 716297 711910 710619 712367 717710 726916 739394 754304
63180 754304 771277 790224 810749 832145 853855 875736 897914 920538 943563 966572 988883
63169 988883 1010027 1030146 1049762 1068993 1087075 1102733 1114950 1123148 1126715 1124831 1117024 1103524
63157 1103524 1084702 1060549 1031317 998416 963813 928464 892064 854516 816867 780508 746325
63146 746325 715055 687615 664280 644067 625680 608650 592971 578251 564185 551417 540898
63135 540898 532568 525619 519857 515737 513038 510676 508095 505921 504831 504666 505142 506659 509733 514104 519042
63120 519042 524202 529630 535180 540439 545159 549357 553006 555899 557894 559174 560271 561795 564000 566572
63106 566572 568982 570989 572672 574129 575416 576681 578019 579206 579895 580024 579739 579028 577831 576362 574920
63091 574920 573403 571580 569756 568608 568255 568109 567778 567594 567990 568882 569953 571165 572679 574552 576740 579154
63075 579154 581647 584303 587732 592598 598748 605339 612025 619430 628159 637968 648333 659352 671563
63062 671563 685233 700359 717088 735673 756226 778942 804347 832833 864051 897225 932052
63051 932052 969005 1008836 1052171 1099460 1150832 1205786 1263262 1322104 1381429 1440613 1499178
63040 1499178 1556813 1613447 1669217 1724273 1778535 1831710 1883688 1934856 1985771 2036471 2086218
63029 2086218 2133817 2177852 2216647 2248424 2271713 2285405 2288415 2279681 2258682 2225743 2181798 2128152
63017 2128152 2066522 1998837 1926907 1852660 1778690 1707881 1642096 1581730 1526892 1478536 1437967
63006 1437967 1405733 1381609 1365341 1356768 1355396 1360566 1371993 1389686 1413275 1441818 1474260 1509651
62994 1509651 1546986 1585308 1624124 1663429 1703269 1743553 1784222 1825184 1865908 1905428 1942888
62983 1942888 1977840 2009796 2037687 2059951 2075067 2081863 2079412 2066855 2043511 2009230 1964693 1911353
62971 1911353 1851022 1785395 1715848 1643545 1569716 1495867 1423677 1354573 1289432 1228699 1172637
62960 1172637 1121299 1074426 1031654 992693 957048 923765 891997 861812 833953 808691 785403
62949 785403 763330 742191 721869 702144 683095 665213 648642 632766 617050 601880 587985
62938 587985 575451 563920 553399 544102 535679 527456 519473 512506 506927 502184 497635 493296 489476
62925 489476 486203 483416 481302 479964 479017 477876 476328 474501 472431 469989 467217 464430 461888 459551
62911 459551 457236 454930 452816 450991 449209 447010 444154 440850 437482 434225 431091 428250 426085 424836
62897 424836 424362 424273 424154 423639 422513 420972 419647 419085 419119 418921 417856 416219 414923 414486 414536 414466 414313 414676
62879 414676 415841 417337 418424 418760 418554 418358 418770 420004 421525 422412 422289 421622 420900 419879 418097 415846
62863 415846 414020 413001 412300 411461 410824 411019 411998 413005 413419 413332 413280 413637 414377 415245 416065 416891 417887 419041
62845 419041 420070 420715 421133 421777 422763 423535 423435 422534 421597 421180 421078 420799 420232 419566 418854 418036 417243 416684
62827 416684 416322 416025 415964 416434 417269 417901 418115 418352 419120 420488 422350 424831 428141 432201 436635 440998 444977
62810 444977 448617 452454 457117 462645 468425 473933 479232 484699 490604 497152 504496 512482 520751 529381
62796 529381 539072 550374 563037 576408 590143 604261 618989 635076 653850 676225 701767 729380
62784 729380 758902 791473 828388 870231 917292 970194 1029619 1095667 1167809 1245312 1327494
62773 1327494 1413660 1502980 1594431 1686682 1777937 1865845 1947642 2020563 2082266 2130903 2164961
62762 2164961 2183398 2186074 2173701 2147137 2106906 2053690 1989030 1915173 1834388 1748780 1660589
62751 1660589 1572090 1484975 1400142 1318190 1239912 1166144 1097349 1033565 974715 920896 872282
62740 872282 828753 789711 754419 722564 694286 669621 648118 629119 612132 596858 583150
62729 583150 571233 561612 554419 549007 544524 540730 537916 536199 535323 535137 535845 537710 540819 545200 550910
62714 550910 557922 566095 575360 585854 597869 611738 627725 645999 666835 690815 718594 750315
62702 750315 785605 824328 867097 914773 967696 1025610 1088053 1154515 1224568 1298269 1376086
62691 1376086 1457960 1542581 1627946 1712263 1793769 1869978 1937953 1995305 2040361 2071394 2086567
62680 2086567 2084911 2066924 2033984 1987567 1929097 1860086 1782262 1697941 1610253 1522372 1436265
62669 1436265 1352575 1271735 1194612 1121899 1053654 989922 931304 878360 830772 787631 748353
62658 748353 712963 681684 654619 631570 611790 594022 577219 561145 546060 532017 518817
62647 518817 506495 495329 485351 476188 467499 459375 452251 446587 442507 439526 436758 433717 430964 429615
62633 429615 430148 431897 433774 435107 435610 434944 432835 429626 426203 423192 420446 417587 414817 412855 412115
62618 412115 412274 412804 413616 415021 417242 420248 423951 428326 433377 439141 445628 452536 459129 464830 470030
62603 470030 476011 483832 493465 504234 515988 529506 545755 565085 587419 613014 642524 676157
62591 676157 713150 752432 793566 836576 880955 925470 968997 1010875 1050078 1084624 1112549
62580 1112549 1133195 1146980 1153899 1152846 1142560 1122910 1095252 1061853 1024951 985995 945556 904048
62568 904048 862403 821783 782812 745545 710198 677371 647435 620212 595554 573817 555291
62557 555291 539406 525015 511543 499518 489798 482439 476513 470962 465414 460120 455364 451212 447767
62544 447767 445223 443488 442084 440764 440010 440518 442249 444340 446024 447336 448861 450980 453489 455818 457566
62529 457566 458875 460292 462290 465051 468796 474077 481437 490911 502146 514955 529541 546245 565407
62516 565407 587449 612761 641349 672811 706827 743630 783926 828302 876573 927628 979939
62505 979939 1032268 1083742 1133296 1179414 1220584 1255697 1283798 1303828 1315128 1318043 1313662 1303072
62493 1303072 1287253 1267595 1246072 1224768 1205371 1189102 1176888 1169562 1167898 1172299 1182419 1197542
62481 1197542 1217490 1242780 1273489 1308390 1345564 1383345 1419958 1452679 1478356 1495023 1502583
62470 1502583 1501909 1493677 1477841 1453618 1420001 1376856 1325584 1268354 1206954 1142855 1078031 1014639
62458 1014639 953861 895850 840977 790361 744930 704706 669342 638724 612718 590868 572704
62447 572704 557975 546326 537146 529913 524318 520013 516642 514181 512748 512108 511974 512779 515363 519674
62433 519674 524566 529025 532875 535994 537716 537492 535452 531879 526761 520298 513130 505593 497440 488824
62419 488824 480776 473960 467676 460926 453889 447450 441754 436274 431026 426608 423039 419532 415645 411880
62405 411880 408854 406425 404013 401381 398846 396854 395566 394844 394578 394894 395801 396769 397214 397555 399122 402534
62389 402534 406739 410246 412903 415737 419368 423419 427383 431266 435234 439307 443622 448548 454327 460918
62375 460918 468290 476493 485416 494794 504532 514674 525045 535332 545720 557084 570392 586110
62363 586110 604295 624936 647965 673152 700375 730106 763479 801738 845555 894866 949213
62352 949213 1007979 1070144 1134070 1197826 1259626 1317651 1369590 1412900 1445786 1467713 1479085
62341 1479085 1480904 1474705 1462078 1443762 1419578 1389503 1354368 1315160 1272219 1225757 1176893 1127622
62329 1127622 1079846 1034748 992906 954550 919735 888524 860864 836205 813563 792249 772178
62318 772178 753153 734313 714811 694742 674836 655459 636505 618119 600926 585431 571652
62307 571652 559345 548298 538373 529503 521576 514226 506977 499878 493665 488920 485315 482109 479162 476953
62293 476953 475803 475558 475957 476835 478060 479659 481965 485213 489077 492940 496529 499965 503350 506757 510507
62278 510507 514976 520095 525343 530246 534703 539060 544069 550474 558253 566598 575109 584668 596572 611129
62264 611129 627754 646147 666615 689421 714745 743388 776663 815265 858832 906951 960045
62253 960045 1018875 1083383 1152194 1223018 1293461 1361672 1426229 1485237 1535897 1575528 1602997
62242 1602997 1618744 1623583 1618032 1602678 1578377 1545818 1505379 1457586 1403334 1343697 1280080 1214583
62230 1214583 1149502 1086234 1025200 967007 913029 864501 821574 783675 750265 720849 694738
62219 694738 671434 651075 634026 620121 608618 598732 589866 581480 573171 565022 557628 551615 547097
62206 547097 543516 540054 536342 532835 530438 529761 530823 533292 536769 540862 545321 550112 555193 560329
62192 560329 565427 570979 577708 585683 594224 602812 611683 621253 631331 641365 651353 662085 674311
62179 674311 687824 701534 714379 725987 736425 745642 753537 760509 767431 775010 783681 794270 808146
62166 808146 826240 848380 874167 904056 938890 978655 1022375 1069046 1117801 1167081 1214374
62155 1214374 1256978 1292664 1319764 1337420 1346091 1347273 1342450 1332435 1317563 1297898 1273244 1243590
62143 1243590 1209729 1172985 1134301 1094195 1053692 1014584 978455 945924 917068 891978 870578
62132 870578 852467 837400 825531 816809 810499 805656 801872 799208 797686 797159 797491 798643 800658 803680
62118 803680 807788 812814 818586 825359 833584 843069 852620 860537 865280 865922 862699 857287 851845 847438
62104 847438 843672 839898 836083 832220 827557 821042 812297 801877 790890 780657 772348 766461 762770
62091 762770 760875 760562 761504 763123 765046 767400 770448 774331 779359 786006 794260 803418 812956 823271
62077 823271 835168 848967 864558 881959 901217 921892 943198 964690 986540 1009057 1032160
62066 1032160 1055348 1078183 1100921 1124609 1150302 1178210 1207860 1238952 1271366 1304245 1335723
62055 1335723 1363893 1387571 1405933 1418181 1424120 1424533 1420367 1411887 1399011 1381890 1360520 1334338
62043 1334338 1303022 1267384 1228718 1187502 1143651 1097909 1052015 1007332 964075 922185 882251
62032 882251 845211 811641 781736 755459 732237 710853 690300 670771 653401 638961 627001
62021 627001 616310 605892 595345 584632 573895 563516 553984 545407 537333 529222 521024 513166 506135
62008 506135 500325 496057 493378 491887 491108 490994 491795 493551 496111 499498 503780 508674 513816 519348 525543
61993 525543 531835 537019 540703 543741 546804 549164 549516 547472 543616 538528 532421 525517 518059 509993
61979 509993 501208 492069 483293 475274 467931 461173 455131 449834 444952 440079 435161 430544 426580 423165
61965 423165 419826 416406 413467 411667 410843 410221 409543 409364 410076 411234 412207 413003 414010 415313 416705 418194
61949 418194 420167 423183 427682 433565 440037 446371 452975 460986 470622 480771 490751 501629 514907
61936 514907 530469 546771 562766 578699 595141 612141 629349 646209 661877 675615 687461
61925 687461 698091 707847 716252 722537 726285 727508 726405 723165 717871 710637 701971 692823 684108 676488
61911 676488 670775 668059 668930 672914 679233 687871 699278 713179 728343 743514 758050 771641 783888
61898 783888 794166 801538 804889 803707 798714 791302 782325 771789 759669 746491 733072 720086 707931
61885 707931 696659 685981 675656 665825 656602 647486 637590 626504 614559 602294 590081 578239
61873 578239 566999 556285 545909 536051 527179 519466 512701 506867 502405 499743 498866 499478 501342 504306
61859 504306 508185 512768 517914 523705 530643 539577 551200 565638 582612 601773 622663 644582 667040
61846 667040 690354 715454 742900 772142 801665 829672 854715 875951 892967 905531 913648 917652
61834 917652 917813 913839 905394 893342 879913 867301 856511 847921 842280 840473 842641 848205 856553
61821 856553 867160 879234 891789 903936 914667 922595 926359 925211 918950 907727 892213 873514
61809 873514 852400 829101 804227 779140 754756 730763 706898 684213 663853 645253 627038
61798 627038 609361 593724 580528 568460 556574 545401 535489 526348 517681 510373 505186 501324 497353
61785 497353 492934 488786 485367 482511 480069 478120 476667 475628 475041 474817 474453 473421 471762 470026 468690
61770 468690 467765 466849 465538 463983 463014 463351 464738 466302 467695 469253 471048 472592 473775 475357 478034
61755 478034 481595 485437 489399 493549 497561 500846 503106 504412 504946 504916 504408 503063 500192 495533 489626
61740 489626 483308 477239 472095 468567 466633 465172 462941 459813 456712 454473 453202 452661 452834 453909 455783
61725 455783 457794 459145 459744 460413 461959 464230 466491 468565 471021 474246 477986 481864 485729 489264 491858
61710 491858 493222 493680 493604 492925 491439 489209 486419 483193 479732 476266 472782 469181 465744 462928 460644
61695 460644 458317 455771 453401 451338 449089 446233 442838 439006 434754 430562 427238 424847 422520 419693
61681 419693 416728 413905 410742 407020 403597 401334 399829 398054 395777 393534 391591 389769 388005 386431
61667 386431 385101 384194 384072 384668 385274 385551 386156 387697 389634 391088 392154 393457 394853 395724 396276 397402
61651 397402 399284 401203 402826 404678 407125 409764 412048 413819 415035 415654 416004 416641 417692 418871 420185
61636 420185 421934 423910 425346 425953 426366 427198 428164 428498 427792 426122 423709 420855 417972 415347 412880 410136
61620 410136 406671 402494 398383 395457 394039 393212 392007 390696 390219 390513 390384 389134 387322 385507 383077
61605 383077 379025 373405 367339 361842 357209 353380 350305 347839 345614 343206 340405 337325 334313 331665
61591 331665 329391 327326 325356 323398 321284 318949 316685 314874 313456 311952 310064 307969 305982 304262
61577 304262 302891 301891 301074 300164 299214 298611 298592 299006 299621 300347 301039 301424 301388 301083 300644 300070 299503 299278 299483
61558 299483 299750 299723 299520 299534 299989 300849 301920 302878 303436 303726 304249 305188 306024 306147 305671 305271 305371 305961 307138
61539 307138 309248 312262 315441 317954 319675 321130 322828 324941 327447 330146 332505 333912 334311 334319 334479
61524 334479 334630 334260 333264 332003 330771 329592 328467 327409 326228 324680 322871 321205 319875 318820 318182
61509 318182 318230 318757 319144 319306 319908 321224 322425 322608 322044 321621 321475 321085 320522 320599 321600 322746 323251 323320
61491 323320 323634 324391 325336 326396 327738 329246 330362 330595 330074 329522 329584 330197 330696 330659 330443 330709 331706 333330
61473 333330 335602 338524 341524 343708 344777 345183 345233 344675 343452 342298 341995 342380 342627 342328 341756 341216 340701
61456 340701 340310 340465 341403 342702 343591 343687 343275 342959 343185 344042 345364 346928 348647 350584 352768 355019 357065
61439 357065 358872 360730 362911 365342 367757 370075 372410 374739 376832 378581 380120 381536 382708 383589
61425 383589 384404 385308 386057 386294 386065 385777 385699 385793 386002 386472 387381 388670 389970 390807 390990 390818 390726 390636 389907
61406 389907 388131 385660 383072 380414 377433 374368 371969 370629 369903 369030 367637 365883 364230 363209 363049
61391 363049 363372 363479 363150 362930 363375 364197 364473 363729 362572 362124 362995 364947 367493 370500 373982 377494 380183
61374 380183 381665 382613 384210 387077 390881 394805 398160 400579 401979 402514 402592 402860 404010 406318 409261
61359 409261 411850 413578 414884 416555 418904 421794 425207 429397 434534 440633 447803 456149 465261 474113
61345 474113 481731 487872 492984 497604 501926 505815 509131 511974 514670 517521 520570 523542 525937 527243
61331 527243 527280 526418 525324 524352 523227 521294 517992 513245 507729 502715 499216 497136 495534 493798 492178
61316 492178 491093 490545 490567 491640 494105 497561 501456 506044 512106 519883 528858 538495 548582 558857
61302 558857 568880 578398 587361 595488 602204 607089 610008 610727 608876 604542 598632 592431 586862 582103
61288 582103 577650 572743 566996 560748 554723 549431 544961 541128 537591 534148 531203 529704 530187 532121
61274 532121 534641 537612 541397 545834 550220 554277 558392 562762 566961 570524 573409 575788 577975 580673
61260 580673 584655 589974 596051 602725 610436 619014 627050 633068 636854 639065 640087 639968 639168 638473 638155
61245 638155 637795 637013 635875 634499 632738 630445 627781 625027 622192 618964 615026 610432 605685 601406 597880
61230 597880 594943 592362 590238 589006 589087 590503 592736 595036 597054 599219 602248 606249 610478 614080 616873
61215 616873 619379 622328 626174 630824 635619 639747 642887 645324 647374 648929 649717 649807 649653 649772 650625 652696
61199 652696 656387 661806 668871 677738 688920 702760 718797 735841 752774 769111 784656 798825
61187 798825 810699 819771 826252 830566 832997 834039 834560 835061 835050 833697 830954 827472 823569 818937 813425
61172 813425 807431 801267 794671 787262 779118 770547 761599 752128 742147 731820 721219 710358 699334
61159 699334 688271 677232 666358 656031 646714 638662 631873 626292 622000 619184 617935 618025 618952 620244
61145 620244 621594 622529 622116 619331 613857 606373 597996 589519 581159 572906 565045 558310 553409 550382 548644
61130 548644 547808 548189 550269 553900 558431 563532 569587 577360 587451 599916 614121 629112 644431
61117 644431 660441 677656 696058 715457 736075 758119 781008 803743 826046 848455 871212
61106 871212 893691 914998 934535 951835 966532 978852 989532 998793 1005683 1008838 1007628 1002346
61094 1002346 993587 981868 967661 951458 933739 914986 895618 875848 855740 835513 815660
61083 815660 796749 779177 763074 748249 734282 720862 708019 695870 684333 673399 663616 655888
61071 655888 650668 647518 645449 643596 641728 640368 640302 641761 644235 647235 650893 655490 660895 666942 673990
61056 673990 682403 691827 701720 712412 724728 738638 753156 767741 782974 799653 818013 838099
61044 838099 860131 883972 908814 933989 959768 986911 1015613 1045308 1075482 1106363 1138667
61033 1138667 1172658 1207618 1242593 1277724 1314447 1354108 1396845 1442118 1489695 1539488 1590822
61022 1590822 1642706 1694654 1746818 1799779 1854930 1914637 1981251 2056272 2141015 2237356 2346815
61011 2346815 2469637 2606028 2758178 2930486 3128986 3362091 3641091 3978245 4385091
61002 4385091 4874192 5461480 6165350 7006015 8009525 9210050 10640903 12319285 14236759
60993 14236759 16349538 18551771 20647169 22373716 23508616 23991740 23962327 23675507 23376311
60984 23376311 23227597 23301777 23576379 23908926 24044481 23707592 22739166 21173754 19200118
60975 19200118 17052515 14923283 12937120 11162118 9623341 8313743 7209462 6284372
60967 6284372 5514501 4875851 4345252 3904024 3537718 3232507 2974746 2753898 2563078
60958 2563078 2396342 2247678 2113025 1991042 1881123 1782108 1693212 1614474 1545487 1484781
60948 1484781 1430814 1382483 1338325 1296353 1255098 1214064 1173158 1132602 1093405 1056727 1022591
60937 1022591 990108 958918 929350 901223 873794 847062 821861 798453 776182 754870 735402
60926 735402 718482 703749 690502 678385 667057 656164 646006 637319 630033 623150 616210 609873
60914 609873 604615 599794 594665 589516 585186 582028 579909 578670 578076 577795 577806 578390 579395 580046 579842 579188
60898 579188 578795 578848 579013 578854 578037 576512 574620 572684 570540 567905 565066 562499 559920 556539 552277 547890
60882 547890 543701 539127 533713 527785 521689 515198 508155 501043 494413 488227 482165 476125 470134 464238
60868 464238 458762 454183 450561 447583 445302 444187 444265 444919 445846 447528 450382 454057 457905 461587 464845
60853 464845 467264 468767 469877 471074 472286 473379 474671 476520 478734 480779 482328 483336 483791 483601 482607
60838 482607 480699 478119 475481 473052 470247 466387 461774 457268 453020 448566 444175 440987 439521 439018
60824 439018 438665 438565 439002 439575 439689 439258 438402 437019 435168 433289 431547 429496 426841 423973 421268 418408
60808 418408 414854 410552 405771 400798 396175 392602 390122 387965 385619 383389 381428 379011 375524 371532
60794 371532 368018 365057 362127 359373 357599 357078 357106 356797 355770 354163 352450 351254 350885 351066 351309 351440
60778 351440 351517 351533 351563 351931 352899 354319 355886 357461 358935 360112 361074 362354 364398 367091 370090 373271
60762 373271 376551 379647 382401 385023 387637 389903 391451 392380 392922 392929 392137 390679 388981 387420 386390 386329
60746 386329 387173 388116 388434 388328 388440 388727 388415 386961 384507 381306 377267 372296 366769 361327 356325 351664
60730 351664 347228 343265 340136 337713 335407 333014 331154 330427 330406 330073 329100 328117 327750 328025 328720 329613 330284
60713 330284 330386 330265 330629 331481 332147 332496 333275 334815 336310 336902 336796 336723 336988 337686 339176 341565 344131
60696 344131 346001 347150 348194 349537 351222 353219 355333 357171 358720 360620 363308 366210 368335 369453
60682 369453 370153 371012 372181 373576 374949 375974 376623 377262 378084 378765 379032 379248 380063 381786 384295 387123
60666 387123 389291 389630 387813 384686 381163 377326 373116 369306 366942 366072 365698 364923 363660 362469 362110
60651 362110 363008 364751 366405 367642 369104 371314 373770 375715 377156 378412 379139 378688 377114 374975 372336
60636 372336 368752 364198 359309 354754 350921 348138 346580 346012 346031 346456 347136 347723 348084 348570 349359 349947 349910
60619 349910 349759 350238 351227 352163 353216 354922 356843 357747 357296 356511 356278 356288 355928 355405 355350 355825 356341 356650
60601 356650 357016 357726 358611 359114 358774 357710 356623 356288 357058 358814 361140 363463 365385 367093 369142 371608
60585 371608 373860 375446 376752 378294 379744 380293 379812 379110 379089 380026 381585 383201 384603 386239 388957 393005
60569 393005 397717 402522 407828 414418 422477 431791 442442 454406 466723 477944 487451 495588 502433
60556 502433 507159 508854 507497 503905 499128 494034 489193 484852 481069 477842 475175 473234 472522 473540
60542 473540 476164 479737 483970 489349 496455 505442 516412 529676 545110 561833 579049 596678 614591
60529 614591 631775 646856 658913 667163 670588 668846 663202 655598 647048 637685 627949 618719 610434
60516 610434 602941 596088 589741 583511 577362 572247 569242 568145 567772 567500 567696 568862 571292 575465 581789
60501 581789 589973 599594 611346 626804 646816 670943 698535 729514 763962 801721 842526 885834
60489 885834 930375 974493 1016942 1056736 1092343 1121905 1144300 1159198 1166019 1163728 1151817 1130784
60477 1130784 1101524 1064977 1022447 975613 926105 875635 826336 780078 737458 698239 662620
60466 662620 631141 603454 578470 555950 536779 521312 508435 496713 485609 475224 465714 457342
60454 457342 450261 443896 437379 430929 425865 422806 420815 418805 416799 415133 413428 411305 409386 408501
60440 408501 408313 407721 406406 405084 404262 403584 402613 401631 401289 401707 402279 402368 401993 401606 401352 400930 400260 399756
60422 399756 399575 399138 397920 396270 394870 393844 393131 393235 394628 396697 398362 399576 401157 403274 405243
60407 405243 406873 408760 411080 413260 415126 417227 419610 421393 422066 422276 422799 423667 424768 426420 428779
60392 428779 431484 434323 437416 440330 442079 442639 443518 446010 449607 452848 455023 456345 457218 458195 460018
60377 460018 462813 465677 467827 469732 472414 475993 479683 482923 485786 488364 490367 491388 491359 490816 490742
60362 490742 491716 493217 494253 494753 495667 497651 500502 504055 508656 514302 520260 526138 532488 539781 547590
60347 547590 555381 563259 571171 578190 583469 587222 589934 591270 590638 588205 584374 578842 571256 562494
60333 562494 554245 547425 541793 536840 532219 527470 522212 516676 511460 506858 502884 499649 497054 494390
60319 494390 490973 487076 483647 481260 479941 479786 480991 483330 486281 489799 494532 501189 510013 520830
60305 520830 533327 547286 562710 579499 596909 613772 629441 644022 657307 668038 674781 677143
60293 677143 675530 670099 660613 647160 630570 612246 593962 577424 563485 551920 542277 534607
60281 534607 529005 524862 521177 517364 513348 509163 504943 501033 497614 494366 490819 486797 482307 477354
60267 477354 472184 467289 462885 458891 455610 453742 453283 453130 452361 451236 450326 449378 447921 446381 445664 445966
60251 445966 446842 448034 449404 450410 450637 450623 451265 452551 453693 454362 454898 455396 455521 455323 455404 456039 456768 457096
60233 457096 457123 457260 457716 458433 459318 460418 461970 464203 467046 470249 473776 477647 481399 484372 486833 490025
60217 490025 494639 499933 504923 509694 514806 520130 525232 530442 536555 543821 552021 561157 571096 580898
60203 580898 589528 597111 604570 612138 619153 625200 630523 635259 639162 642212 644812 647236 649406 651170
60189 651170 652274 652153 650357 647049 642645 637292 631336 625849 621723 618417 614533 609522 603967 598321
60175 598321 592415 586355 580904 576640 573408 570837 568828 567353 566291 565522 564786 563531 561477 559181 557451
60160 557451 556332 555375 554607 554434 554650 554514 553802 552898 551873 550504 549371 549856 552585 556668 560856 564685
60144 564685 568068 570574 571830 572237 572723 573991 576310 579761 584359 590065 596753 604048 611338 618316 625355
60129 625355 632866 640407 647042 652457 656998 660626 662691 663020 662476 662047 662003 662380 663693 666475 670399 674391
60113 674391 677626 680070 682073 683719 684723 684863 684326 683447 682177 680094 677012 673278 669312 665214 661025
60098 661025 656983 653205 649550 646132 643470 641699 640107 638083 636132 635284 635829 637333 639561 642597 646149
60083 646149 649492 652120 653976 655157 655890 656511 656954 656543 654814 652172 649090 645141 639649 632904 625724
60068 625724 618093 609329 599543 589850 581037 572937 565266 558177 551733 545635 539792 534634 530615 527740
60054 527740 525576 523390 520536 517199 514478 513169 512911 513177 514504 517707 522334 527116 531750 536985 543029
60039 543029 549096 554594 559608 564078 567683 570703 573874 577115 579431 580264 579875 578289 575101 570644 566134
60024 566134 562126 557841 552531 546462 540063 533118 525511 517861 510715 503790 496635 489422 482558 476074
60010 476074 469888 464191 459226 455170 452376 451072 450635 449944 448666 447423 446591 445873 445282 445471 446578 447755
59994 447755 448416 449107 450543 452545 454538 456447 458582 461212 464633 469004 473759 477939 481414 485031 489191
59979 489191 493149 496036 497612 497664 495801 492510 489326 487153 485307 482988 480727 479414 478727 477628 475898
59964 475898 474214 473141 472926 473842 475882 478350 480506 482340 484168 485846 486992 487623 487998 488200 488287 488405
59948 488405 488260 487115 484878 482654 481540 481366 481261 480982 480933 481214 481347 480767 479123 476391 473078 469997
59932 469997 467482 465274 463396 462487 462881 464101 465785 468415 472510 477755 483573 489904 496748 503613 510137
59917 510137 516586 522940 528157 531301 532846 533954 534998 535822 536973 539396 543017 546704 549719 552321
59903 552321 554902 557327 559334 560994 562556 564242 566191 568248 569927 570882 571308 571612 572014 572816 574689
59888 574689 578143 582941 588421 594122 599768 605094 610187 615627 621739 627953 633388 637769 641373 644458
59874 644458 647178 649727 652030 653632 654261 654118 653266 651229 647704 643181 638346 633358 628278 623635 619861
59859 619861 616579 613147 609662 606818 605048 604270 604143 604183 604084 604406 606389 610619 616400 622950 630487 639492
59843 639492 649548 659623 668792 675960 679766 679974 678396 677284 677188 677384 677818 679107 680782 680982 678230
59828 678230 672596 665012 656379 647480 638854 630420 621868 613577 606509 601096 596779 592739 588512 583938
59814 583938 579091 574382 570236 566646 563372 560458 558073 556046 554036 551980 549885 547515 544927 543008
59800 543008 542698 543767 545031 545660 545740 545690 545868 546583 547784 548765 548818 548098 547253 546343 544887 542897 541072 539805
59782 539805 538703 537312 535774 534480 533442 532227 530396 528012 525786 524491 524110 523863 523339 523100 523811
59767 523811 525292 526972 528823 531201 534051 536940 539689 542482 545607 549507 554668 560926 567300 573102
59753 573102 578789 585239 592671 600949 610240 620561 631121 641030 650321 659439 668120 675660 681917 687188
59739 687188 691452 694689 697541 700627 703498 705310 706224 706985 707341 706162 703203 699584 696318 693338 690220
59724 690220 686983 683875 680983 678274 675523 672289 668459 664625 661334 658359 655387 652916 651460 650288
59710 650288 648174 645212 642697 641339 640783 640842 641917 644034 646629 649474 652752 656139 658960 661446 664656
59695 664656 668821 672907 676247 679492 683503 688194 692889 696913 699424 699636 697774 695065 692352 689442
59681 689442 686130 682921 680187 677389 673813 669460 664674 659437 653618 647471 641374 635351 629259 623180
59667 623180 617442 612467 608613 605826 603476 600996 598605 596921 596053 595737 596171 597841 600572 603593 606648
59652 606648 610224 614583 619418 624545 630013 635325 639389 641553 641990 640957 638422 634572 629836 624244
59638 624244 617571 610260 603319 597079 590912 584434 578150 572674 568145 564621 562155 560243 558079 555602
59624 555602 553401 551410 548781 545286 541677 538271 534341 529479 524413 519763 515105 510133 505801 503309
59610 503309 502558 502497 502452 502358 502224 502230 502970 504878 507576 510213 512111 512832 512203 510741 509535 509194 509374 509626
59592 509626 510127 511140 512397 513516 514517 515496 516318 517028 517920 518827 518984 518050 516582 514994 512829 509715
59576 509715 506339 503703 501897 500292 498457 496218 493336 489914 486738 484500 482962 481518 480260 479757
59562 479757 479989 480233 479989 479511 479373 479866 480772 481483 481451 480735 479973 479790 480471 482160 484857 488080 491088 493761
59544 493761 496823 500910 505805 510831 515658 520621 526669 535084 546735 561452 578594 597925 618940
59531 618940 639134 654246 661138 660127 654134 646174 638028 630491 624004 619131 616655 616881 618736 620286
59517 620286 620420 619487 618110 616209 613519 610050 605416 598634 589494 579549 570838 563885 557631 551026 544089
59502 544089 537606 532296 528212 524708 521109 517433 514107 511138 508288 505947 504827 504586 503859 502162 500730
59487 500730 500790 501986 503320 504820 507296 510978 515382 520135 525136 530112 534778 539278 544034 549344 555454
59472 555454 562561 570307 577611 583433 587448 589859 591111 591974 593137 594323 594468 593223 591590 590713 590760
59457 590760 591472 593001 595576 599106 603707 609942 617894 626663 635387 644021 652504 660027 665930 670589
59443 670589 674516 677176 677592 675605 671663 665855 658093 648998 639807 631556 624750 619419 615022 610776
59429 610776 606611 603289 601254 600041 599245 599206 600164 601770 604203 608793 616529 626697 638044 650546
59415 650546 665009 681658 700203 720594 742555 765046 787455 810499 834238 855425 868586
59404 868586 870177 860916 844431 825067 806950 793336 785700 783894 787475 796161 808490 820594 827064
59391 827064 823609 809520 788022 764026 741084 720403 702358 687766 677131 669638 664004 659881
59379 659881 657555 656744 656729 657442 659493 663096 667595 671981 675424 677653 679304 681516 684632 687771 690134
59364 690134 692039 693997 695620 696441 697151 698838 701397 703919 706387 709791 714591 720149 725840 731866 738845
59349 738845 747226 757236 768838 781685 795404 809801 824554 839156 853476 867805 881857 894396
59337 894396 904416 912010 917412 919992 919141 915495 910283 903969 896399 887757 878381 868106 856800 845115
59323 845115 833799 822737 811601 800900 791417 783076 775343 768204 761667 754907 747134 738920 731473
59310 731473 724962 718674 712367 706296 700257 693928 687907 683284 680484 679549 681043 685367 691650 698742
59296 698742 707018 717685 730341 742451 751080 754033 749874 738661 722812 705785 689554 674302
59284 674302 660209 648103 638435 631086 626230 624077 623795 624107 624971 627314 631214 635885 641471 649116
59270 649116 658985 669800 680772 692430 704993 717332 728289 737859 746432 753830 759624 763547 765243
59257 765243 764431 761505 757064 750904 742577 732976 723992 716369 709200 701902 695326 690466 687317 685521
59243 685521 685050 685692 686836 688251 690259 692943 696173 700459 706463 713345 718992 722445 724958 728109 731961
59228 731961 735645 738551 740265 740285 738548 735631 731965 727533 722494 717154 711157 703745 695141 686636 679057
59213 679057 672208 666043 661021 656881 652381 646995 641847 638274 636341 635157 633756 631313 627623 623845
59199 623845 621666 621229 620982 619965 619039 619271 620398 621680 623149 625187 627773 630861 634642 638812 642537
59184 642537 645731 649428 654279 659695 665048 670640 676730 682682 687912 692772 697662 702151 705784 709022
59170 709022 712604 716667 721141 726189 731608 736607 740842 744889 749062 752625 754827 755875 756198 755552 753540
59155 753540 750237 745582 738951 730016 719394 707902 695894 683811 672458 662129 652277 642588 633492
59142 633492 625135 616862 608363 600333 593375 587255 581792 577315 573530 569253 564222 559962 557788 557031
59128 557031 556435 556234 557458 560047 563064 566210 569807 573718 577562 581767 587333 594657 603296 612618 622065
59113 622065 631307 640779 651520 663723 675994 686713 695601 703403 710825 718497 727099 736491 745392
59100 745392 752863 759456 765905 771360 774069 773451 770431 766054 760825 755265 750190 746296 743863 742677
59086 742677 741946 740746 738953 737201 735620 733313 729519 724493 718749 712278 705115 697761 690340 682243
59072 682243 673380 664846 657494 650746 643786 636989 631131 625980 620839 615734 610882 605665 599461 593027
59058 593027 587743 583773 580122 576263 572591 569469 566902 565081 564333 564474 564863 565021 564731 563830 562436 561046
59042 561046 559953 558953 558029 557711 558237 559007 559431 559742 560442 561651 563460 566081 569161 571937 574728 579122
59026 579122 585923 594162 603152 614163 628537 645256 662051 678199 694499 710963 726212 739051
59014 739051 749186 756454 760630 761985 761027 757809 752487 746261 740650 735971 731510 727069 723396 721284
59000 721284 721111 723071 726939 731732 736367 740450 743885 746242 747318 747798 748400 748735 747871 745520 741888
58985 741888 736952 730933 724923 719944 715779 711695 707830 704821 702682 701295 701466 704149 708848 714109
58971 714109 719463 725677 733238 741842 751432 762533 775258 788753 801805 813521 823569 832286 840342
58958 840342 847753 853541 856783 857408 855527 850891 843776 835461 826779 816972 805059 791582 777809 764008
58944 764008 749874 736007 723507 712514 702501 693613 686414 680684 675827 672117 670184 669486 668620
58931 668620 667051 665391 664225 663604 663408 663147 661906 659549 657410 656602 656295 654989 652741 650591 648457
58916 648457 645490 642066 639491 637856 636049 633939 632772 633162 634360 635820 638066 641697 646799 653517
58902 653517 661953 671410 681024 691254 703422 717711 732854 747862 762716 777205 790539 802458
58890 802458 813608 824629 835898 848213 862460 878488 895375 912714 930406 947251 961297
58879 961297 971783 979458 984820 987464 987398 985512 982191 976626 968101 956997 944145 930126 915631
58866 915631 901671 888977 877697 867792 859139 851329 843976 837029 830247 822896 814824 807145 800647
58853 800647 794102 785621 775333 765248 756678 749244 742269 735607 729064 722338 715571 708833 701314 692334
58839 692334 682796 674189 666446 658408 650028 642313 635257 627810 619951 612911 607132 601866 597073 593839
58825 593839 592463 591890 591538 592030 593588 595335 596789 598587 601121 603781 606104 608389 610809 613153 615738
58810 615738 619145 622826 625451 626970 628749 631257 633186 633375 632136 630129 627360 623963 620635 617692
58796 617692 614750 611686 608785 605750 601933 597699 594108 591118 587708 584022 581573 580913 580911 580951 582106 585321
58780 585321 589916 594684 599196 603470 607630 612321 618076 623919 628039 630057 630964 630649 627598 621639 614884
58765 614884 609015 603487 597387 591218 585690 580384 574867 569741 565520 561845 558814 557701 559187 562086
58751 562086 564860 567265 569640 571795 573553 575299 577187 578782 580114 581961 584639 587761 591593 597131
58737 597131 604303 611678 618478 625248 632016 637729 642372 647684 654663 662058 668399 673814 678789 682861
58723 682861 685795 688512 691527 693983 695395 696868 699383 702365 705161 708444 712828 717547 721795 726041
58709 726041 730737 735067 738131 740003 740502 738556 734017 728450 722651 715005 703899 690223 675747 660520
58695 660520 643800 626360 609851 594728 580606 567900 557391 548762 541032 533931 527697 522222
58683 522222 517461 513797 510956 507557 502937 498361 495285 493503 492163 491321 491173 490946 490119 489704 490856
58668 490856 493155 495720 499050 504257 511319 519486 528630 538784 549087 558507 566837 573837 578258 579033
58654 579033 576746 572852 568210 563257 558532 553950 548650 542671 537638 534648 532617 529898 526347 522637
58640 522637 518828 515007 512152 510891 510403 509741 509193 509207 509326 509428 510572 513130 515517 516330 516489 517629
58624 517629 519628 521376 522797 524384 525772 526464 527038 528199 529649 531253 534040 538525 543319 546989 550066
58609 550066 553634 557283 560074 562242 564178 565155 564840 564708 566055 567944 568940 569440 570257 570479 569042 567111
58593 567111 566409 566364 565410 564131 564504 566787 569659 572900 577514 583636 590548 598355 607602 617676 627574
58578 627574 637690 648890 660444 670803 679850 688426 696317 702785 708523 715086 722891 731660 742210
58565 742210 755854 772588 791601 812902 836700 862075 888140 915573 944949 974480 1001425
58554 1001425 1024725 1044142 1058022 1064533 1064482 1060498 1054126 1045942 1037519 1030484 1024081 1016246 1006718 996744
58540 996744 986233 973702 958633 941488 921823 898921 874025 849587 826513 804284 783325
58529 783325 764856 748759 734016 720965 710816 703237 696740 691167 687481 685362 683342 681119 679551
58516 679551 678570 677213 675378 673518 671100 667479 663673 661112 659315 657031 654826 653967 653666 652180 649988
58501 649988 648987 649129 648784 648016 648424 649940 650773 650545 650636 651469 652135 652716 654326 656904 659533 662790 668145
58484 668145 675282 682737 690950 701896 715808 731063 747097 764672 783395 801841 819994 838655
58472 838655 856482 870486 879396 883845 883648 878032 868445 857912 847507 836380 825074 815632 808469
58459 808469 802414 797893 796788 799053 802840 808113 816787 828884 841901 854290 866311 877130 884455
58446 884455 887618 887854 885152 878097 867260 855445 844090 832541 821136 811561 803786 796138 788901
58433 788901 784433 783256 783472 784422 787278 791595 795208 798344 803979 813162 823571 833580 844063 855230
58419 855230 865387 873841 881421 887116 888064 883986 877918 871444 862983 852035 841074 831641 822324 812313
58405 812313 803354 796427 789883 782621 775972 770931 766742 763534 763077 765484 768458 771050 774790 779922
58391 779922 784203 786795 789654 793538 796355 797070 797655 799470 801178 801860 802714 804115 804458 803474 803245 804647
58375 804647 806358 808502 813285 820729 827976 834345 842740 854316 866213 876568 887378 900147 913031
58362 913031 924785 937373 952058 966828 980244 994037 1009368 1024215 1036819 1048134 1058637
58351 1058637 1066529 1071293 1075267 1079577 1082411 1083307 1084954 1088659 1092362 1095316 1100158 1107923 1115708 1121947
58337 1121947 1129407 1140144 1152136 1163883 1177694 1195140 1213587 1230498 1247028 1264313 1280458
58326 1280458 1294203 1307316 1320447 1330946 1337604 1343028 1348607 1352019 1352645 1354260 1359066 1364210 1367659
58313 1367659 1372248 1380281 1389353 1397374 1406546 1418489 1430625 1441352 1453527 1468862 1484286 1497985
58301 1497985 1513449 1533142 1553737 1572147 1590635 1611318 1631385 1648683 1666291 1686531 1706325
58290 1706325 1723661 1742615 1766397 1791441 1814200 1837766 1865646 1894995 1922511 1951249 1984847
58279 1984847 2020505 2054382 2088518 2125752 2163321 2198345 2234219 2274653 2316786 2357076 2398440
58268 2398440 2444604 2493085 2540939 2591604 2648679 2708808 2768244 2830392 2899080 2970522 3039983
58257 3039983 3110158 3184752 3260136 3331950 3403611 3479565 3556574 3630616 3705800 3787272 3872118
58246 3872118 3956642 4045521 4143923 4247941 4353042 4464438 4588397 4721022 4856796 5000334
58236 5000334 5158004 5326030 5499059 5682221 5882017 6093869 6312029 6542921 6794719
58227 6794719 7062953 7341309 7637220 7961022 8309304 8675641 9068007 9498118 9963677
58218 9963677 10459598 10996323 11587506 12230651 12921045 13673706 14509349 15430659 16436587
58209 16436587 17548135 18794801 20189306 21744619 23503572 25522817 27843894 30515282
58201 30515282 33629441 37304217 41648736 46792908 52933833 60306270 69129723 79644649
58193 79644649 92184837 107154699 124964449 146061560 170959896 200043404 233227873
58186 233227873 269781738 308253240 346142403 379489747 403297739 413265106 407839248
58179 407839248 388925087 360718844 327742090 293464707 259972571 228295504 198906848
58172 198906848 172109885 148169087 127222171 109189931 93833344 80867541 69994850
58165 69994850 60891684 53245361 46807850 41385004 36795026 32875333 29513088 26630123
58157 26630123 24145427 21980197 20085593 18432775 16982340 15689465 14529987 13494544
58149 13494544 12563092 11708939 10921786 10203949 9548697 8942796 8384911 7881012 7425582
58140 7425582 7005826 6620062 6274002 5962919 5674640 5406327 5161625 4934838 4714371
58131 4714371 4499178 4296605 4106748 3923603 3748754 3589045 3442635 3301270 3164586
58122 3164586 3038926 2923859 2812962 2706405 2609961 2522694 2437779 2354640 2278584 2209377
58112 2209377 2141553 2075271 2015744 1962350 1908984 1854856 1804700 1758620 1711726 1663725 1619163
58101 1619163 1578179 1536321 1493512 1454192 1418526 1382207 1345047 1311322 1281525 1251978 1222639
58090 1222639 1197202 1175401 1153180 1130613 1111879 1097142 1082048 1065554 1050800 1037894 1023085
58079 1023085 1005613 988428 971793 952915 932199 913145 895769 876767 856407 838617 823909
58068 823909 808813 792677 778490 766505 753655 739977 729181 721866 714355 705221 697034 690582
58056 690582 683160 673765 664573 656210 646690 635979 626523 618528 609709 600282 593170 588691 584106 578883
58042 578883 575211 572779 568348 561330 554646 549336 543402 536750 531942 529003 524583 517525 510344 504017
58028 504017 496194 485956 475650 466488 456804 446108 436607 429265 422436 415567 410204 406232 401337
58015 401337 395346 390957 388965 386930 383755 381380 380549 379125 376235 374157 374387 375451 376123 377276 379137
58000 379137 380263 380666 382494 386241 389655 391761 394466 398790 402898 405306 406826 407938 407445 405100 402433
57985 402433 399721 395242 388778 382750 378571 374902 370623 366425 362366 357084 350771 345778 342985 340573
57971 340573 337567 335414 334840 334368 333391 333565 335596 337608 338227 338468 339124 339171 338249 337892 338752 339220 338245 336923
57953 336923 335976 334289 331287 328123 325240 321413 316506 312505 310516 309366 308380 308809 311216 314224 317186
57938 317186 321414 327500 334212 341306 350415 361695 372595 381579 390111 399197 406927 411468 413757 415141
57924 415141 414867 411995 407441 402077 395055 385969 376532 368207 360278 352009 344500 338574 333031 326924
57910 326924 321445 317752 315010 312448 311275 312617 315383 317996 320371 322612 323829 323934 324463 325914 326467
57895 326467 325185 324218 325744 328807 331340 333317 335725 338293 340486 343035 346318 348844 349440 349322 349939
57880 349939 350403 349102 346321 343135 339296 334373 329431 325430 321379 316246 311261 308090 306141 303975
57866 303975 302109 301981 303175 304103 304714 306237 308818 311432 313731 316220 319125 322540 327070 332902 338999
57851 338999 344489 349907 355800 361285 365416 368830 372509 375976 378205 379236 379430 378328 375749 372761
57837 372761 370059 366612 361505 355836 351120 347075 342763 338625 335520 332870 329696 326514 324368 322977
57823 322977 321632 320890 321504 322599 322799 322326 322231 322408 322124 321620 321406 320878 319352 317501 315930 313344 308098
57806 308098 300705 292934 285310 277497 270213 264564 260091 255579 251270 248257 246294 244239 242221 241263
57792 241263 241172 240893 240669 241791 244279 246725 248416 249968 251920 254337 257695 262557 268492 274686 281404
57777 281404 289404 298238 306660 314432 322206 329924 336785 342538 347341 350686 351901 351439 350264 348349
57763 348349 345124 340924 336498 331636 325866 319934 314852 309941 303729 296489 290036 285118 280877 276890
57749 276890 273935 272509 272160 272546 273806 275712 277682 279645 281761 283466 284030 283864 284012 284552 284763 284585
57733 284585 284566 284648 284398 284157 284533 285018 284578 283418 282743 282988 283748 285141 287640 290697 293101 294679 296232
57716 296232 297900 299050 299621 300037 299986 298812 297087 296079 295637 294202 291098 287318 283863 280725 277675
57701 277675 274674 271288 266998 262262 258112 254709 251466 248514 246613 245645 244582 243050 241642 240613
57687 240613 239538 238311 237237 236212 235037 234393 235217 237257 239608 242467 246885 253073 260577 269949 282507
57672 282507 298475 317088 338661 364807 396504 433649 476607 526233 581659 639292 693952
57661 693952 739422 768285 774135 755635 717502 667063 610906 554444 502005 455797 415880 381917
57649 381917 353901 330994 311402 294172 279801 268505 259352 251664 245772 241604 238016 234375 231557
57636 231557 230484 230844 231962 233713 235796 237312 237967 238640 239922 241031 240923 239606 237729 235778 234290
57621 234290 233862 234307 234592 234149 233421 232853 232365 232089 232436 233053 232948 232092 231644 232073 232403 231829 230738 229433
57603 229433 227283 224048 220808 218642 217409 216687 216817 218069 219720 220795 220945 219980 217521 213829 210000
57588 210000 206696 203606 200684 198742 198116 197926 197444 197086 197258 197415 197140 196992 197326 197359 196398 194972 193740
57571 193740 192340 190386 188585 187679 187142 186149 185075 184810 185223 185400 184976 184241 183440 182788 182653 183020 183353
57554 183353 183589 184400 185823 186709 186467 186333 187732 190315 192855 195299 198511 202438 205921 208128 209103 209106
57538 209106 208444 207762 207737 208535 210100 212433 215046 216780 217002 216497 216471 217246 218618 220747 223729 226947 229818
57521 229818 232704 236193 239967 243269 246015 248572 250934 252968 255000 257298 259412 260847 261801 262441 262076
57506 262076 260050 256947 253899 251166 248317 245378 242818 240731 238957 237593 236626 235521 234052 232930
57492 232930 232666 232443 231256 229612 228842 229188 229808 230412 231526 233231 234902 236253 237609 239065 240314 241334
57476 241334 242417 243572 244672 246004 247798 249351 249631 248699 247670 247308 247514 248114 249175 250493 251569
57461 251569 252272 252866 253423 253926 254840 256756 259453 262033 264029 265734 267427 268964 270168 271059 271692 272292
57445 272292 273419 275428 277898 280152 282143 284231 286323 287993 289318 290922 293246 296321 300094 304315
57431 304315 308264 311255 313379 315294 317503 320313 324078 328722 333276 336680 338916 340750 342633 344518
57417 344518 346448 348567 350746 352919 355467 358555 361438 363337 364741 366862 369945 373138 375994 379112
57403 379112 383080 387563 391737 395051 397459 399325 401092 402772 403994 404908 406530 409614 413643 417630
57389 417630 421429 425448 429647 433817 438443 444108 450330 456100 461451 467333 473972 480464 486091 490992
57375 490992 495444 499436 503171 507160 511570 516088 520410 524226 526988 528569 529988 532516 536093 539570
57361 539570 542428 545236 548493 552151 556409 561817 568245 574702 580516 585944 591493 597439 604129 611850
57347 611850 620185 628266 635853 643395 651036 658422 665566 672917 680437 687589 694415 701649 709500 717232
57333 717232 724261 730799 737174 743457 749998 757356 765294 772764 779353 785938 793493 802048 811162 820591
57319 820591 830002 838904 847394 856316 866109 876113 885483 894256 903093 912490 922600 933272 943898
57306 943898 953787 963001 972367 982393 992728 1002932 1013169 1023807 1034871 1046214 1057834 1069813
57294 1069813 1082302 1095601 1109731 1123995 1137605 1150709 1164167 1178368 1193027 1208025 1223516
57283 1223516 1239219 1254643 1270112 1286501 1303836 1321224 1338373 1356047 1374713 1393891 1413223
57272 1413223 1433048 1453454 1474035 1495070 1517674 1541959 1566245 1589108 1611272 1634444 1659073
57261 1659073 1684304 1709472 1734596 1759814 1785258 1811217 1837727 1864316 1890700 1917300 1944561
57250 1944561 1972277 2000122 2028268 2056912 2085696 2114204 2142546 2170985 2199527 2228382 2258207
57239 2258207 2289314 2321169 2353168 2385306 2417642 2449834 2481769 2513932 2546495 2578808 2610453
57228 2610453 2642029 2674135 2706399 2738325 2770280 2802596 2834428 2864751 2894043 2923756 2954423
57217 2954423 2985375 3016132 3046946 3078033 3109279 3140740 3172609 3204655 3236507 3268469 3301413
57206 3301413 3335855 3371739 3408906 3447021 3485160 3522277 3558239 3593797 3629511 3665284 3700892
57195 3700892 3736310 3771468 3806256 3840875 3875683 3910582 3944984 3978451 4010959 4042527 4072971
57184 4072971 4102169 4130256 4157488 4184128 4210464 4236807 4263459 4290658 4318351 4345984 4372806
57173 4372806 4398588 4423794 4448997 4474458 4500268 4526354 4552207 4577236 4601680 4626591 4652605
57162 4652605 4679335 4706350 4734002 4762698 4791988 4821076 4849851 4878749 4908025 4937800 4968525
57151 4968525 5000751 5034554 5069588 5105413 5141474 5177202 5212608 5248308 5284622 5321177 5357811
57140 5357811 5395085 5433126 5470663 5506032 5538619 5568419 5594782 5616767 5634613 5649841 5664013
57129 5664013 5678342 5694403 5714143 5738842 5768770 5804039 5845195 5892729 5946476 6005629 6069096
57118 6069096 6135957 6206117 6280635 6361172 6449288 6546687 6656010 6780929 6925537 7093964
57108 7093964 7290423 7519223 7784993 8093651 8453612 8876408 9377031 9974762 10694199
57099 10694199 11565601 12624765 13913242 15478825 17375154 19659453 22388245 25612025
57091 25612025 29370868 33692306 38590203 44061946 50083120 56601961 63536503 70774906
57083 70774906 78175539 85560151 92697646 99291122 104994103 109469794 112469986 113884981
57075 113884981 113735639 112125558 109195598 105104909 100031726 94176275 87756250 80994403
57067 80994403 74101995 67264478 60634657 54332396 48445769 43031990 38120372 33717475
57059 33717475 29811549 26375795 23372948 20761075 18497371 16539213 14845459 13378976
57051 13378976 12107639 11002855 10038643 9192894 8448275 7790690 7207301 6686555 6219267
57042 6219267 5798562 5418828 5075021 4762583 4477600 4217132 3979348 3762901 3566159
57033 3566159 3387545 3226550 3083673 2959204 2852740 2764076 2693896 2643182 2612286 2600739
57023 2600739 2607395 2629769 2662041 2692746 2705133 2682685 2617431 2513942 2385100 2244348 2101753
57012 2101753 1964676 1838411 1725181 1624335 1534602 1455402 1385941 1324514 1269524 1220286
57002 1220286 1176337 1136777 1100828 1068292 1039062 1012746 988996 967498 947503 928111 909289
56991 909289 891961 876989 864740 855563 849784 847082 846759 848794 853792 861615 870696 878664 882939 880994
56977 880994 871291 854277 831775 805576 777425 749816 725070 703510 683974 666296 651770 640958
56965 640958 632782 626457 622823 622958 626852 634267 645585 660783 678696 698247 719285 740877 759557
56952 759557 770527 770501 759011 737884 710391 680245 650195 621427 594539 570545 550552 535026
56940 535026 523932 517158 514497 515713 520897 530216 543283 559596 579706 604916 635424 669431
56928 669431 703858 734620 756241 763423 754445 732197 701267 665099 626367 588102 552685 520670
56916 520670 491941 467208 447104 430699 416407 403839 393426 384691 376365 368065 360628 354763
56904 354763 350317 346846 344023 341490 338980 336593 334514 332657 331027 330154 330703 332971 337121 343428 351936
56889 351936 362415 375102 390853 410025 431768 454777 477900 499336 516069 525119 525211 516925
56877 516925 502019 483208 463700 445900 430773 418789 410690 406756 406326 409010 415678 427362 443917
56864 443917 464821 490707 522972 562227 608053 659792 716302 774656 829561 874110 901420
56853 901420 907007 891023 858200 815132 767694 720690 678168 642654 614708 594191 581510 577044
56841 577044 580351 591030 609758 637624 675220 723237 782897 854505 936236 1025195 1118167 1209236
56829 1209236 1287357 1338896 1354005 1330874 1275261 1197543 1109383 1020364 936081 859266 792078
56818 792078 736332 692241 658695 635044 621536 618066 623790 638250 661889 695196 738099 790211
56806 790211 850611 916696 983213 1042179 1083906 1099698 1085612 1044363 983402 911389 836200
56795 836200 764228 699355 642526 593434 552471 520286 496309 479218 468530 464455 466539 473906
56783 473906 486691 505783 531122 561315 594605 628658 659274 680794 688499 680356 657090 621871
56771 621871 579661 535268 491512 449703 411233 377392 348078 322330 300033 281681 266622
56760 266622 253268 241151 231151 223456 216930 210844 205632 201375 197077 192152 187365 183529 180338
56747 180338 177236 174421 172315 170839 169777 169106 168515 167401 165763 164333 163535 163076 162822 163126 163923 164373
56731 164373 163879 162750 161550 160537 159945 159981 160299 160275 160069 160529 161826 163115 163851 164456 165332 166191 166886 167983
56713 167983 169867 171931 173293 173845 174153 174677 175430 176105 176392 176460 177022 178469 180123 180953 180851 180550 180530 180755
56695 180755 181224 181821 181852 180748 179138 178226 178232 178418 178376 178152 177347 175497 173313 172126 172017 171861 171367 171576
56677 171576 173022 174799 175936 176457 176670 176606 176578 177103 177816 177644 176481 175557 175669 176204 176414 176503 176945 177752
56659 177752 178862 180274 181499 182040 182722 185218 189757 194638 198587 202253 206643 211413 215660 219306 222703
56644 222703 225686 227879 229275 229889 229592 228803 228552 229408 231068 233292 236167 239132 240931 241057 240196 238876
56628 238876 236906 234579 232941 232159 230991 228743 226443 225109 224122 222362 219803 216893 213487 209591 206245
56613 206245 204407 203662 203056 202512 202415 202590 202733 203134 203924 204233 203249 201612 200740 201050 201679 201658 200700 199168
56595 199168 197867 197479 197842 198227 198539 199419 200854 201750 201457 200709 200367 200203 199742 199375 199710 200526 201261 201954
56577 201954 202984 204426 206244 208469 210719 212304 213309 214685 216804 218942 220815 223446 227646 232689
56563 232689 237536 242546 248974 257398 267603 279450 293056 308432 325330 342786 358547 370013
56551 370013 376331 378813 379018 377583 375210 373205 372161 371331 370175 369220 368578 366993 363504 358801 353893
56536 353893 348685 343012 337739 333387 328793 322656 315546 308971 303250 297650 291900 286205 280376 274154
56522 274154 267939 262277 257246 253112 250633 249772 249114 247568 245590 243764 241432 238033 234560 232213 230605
56507 230605 228783 227010 225999 225330 224254 223278 223275 223741 223546 222876 222825 223546 224254 224626 224830 224663 223975 223467
56489 223467 223779 224309 224135 223462 222945 222308 220979 219405 218351 217593 216685 216317 217395 219402 221115 222418
56473 222418 223968 225662 226875 227680 228460 228882 228623 228469 229234 230253 230406 230008 230187 230966 231475 231500 231418 231161
56455 231161 230639 230486 231017 231294 230674 230297 231357 232891 233245 232813 233214 234466 235303 235781 237242 239796 241945
56438 241945 242741 242475 241385 239583 238120 238166 239055 238887 237104 234880 233143 231874 231211 231496 232241 232626 232897
56421 232897 233766 234789 235024 234953 235890 237678 238773 238569 237906 237521 237659 238991 241952 245282 247068 247227 247263
56404 247263 247779 248079 248015 248259 248711 248531 247808 247376 247057 245920 244247 243360 243461 243483 243127 243230 244095 245258
56386 245258 246907 249675 253000 255546 257319 259555 262505 265155 267102 268851 270286 270714 270383 270179 269988
56371 269988 269250 268793 269942 272022 273088 273019 273472 274771 275445 275109 275261 276662 278263 279324 280432 281912
56355 281912 283243 284456 286115 287646 287837 287210 287670 289545 291317 292532 294398 297096 299178 300295 301893
56340 301893 304371 306088 306183 305947 306382 306763 306784 307829 310823 314811 318783 322992 327454 331167 333911 336929
56324 336929 340746 344198 346658 349268 352854 356402 358780 360308 361585 362357 362505 362595 362675 362033 360807 360148
56308 360148 360276 360203 359878 360591 362648 364771 366463 368855 372504 376588 381052 387223 395234 403016 408912
56293 408912 413268 416647 418787 420323 423153 427748 432214 435247 437979 441760 446280 451122 456998 464088
56279 464088 471140 477578 484584 492848 501142 508399 515376 523124 531667 541192 552561 565573 578751
56266 578751 591774 606055 622101 638695 655683 675028 697828 722824 749193 778299 811292
56255 811292 847534 886958 931426 982120 1038151 1099467 1168571 1247308 1334389 1428073 1528911
56244 1528911 1637678 1752737 1871625 1993250 2116419 2238115 2355224 2466130 2568745
56235 2568745 2658987 2733204 2790222 2829317 2848413 2846416 2825234 2787365 2733474 2664402 2583458
56224 2583458 2494361 2398680 2297502 2193698 2090285 1988226 1887982 1791501 1700407 1613945
56214 1613945 1530942 1452237 1379091 1310836 1246312 1186053 1130934 1080078 1032160 987448 946723
56203 946723 909615 875627 845299 818687 794399 771687 751669 734991 720219 706116 693386
56192 693386 682610 672731 663279 655667 650478 645881 640674 636332 634056 632367 629818 627477 626411 625353
56178 625353 623285 621731 621924 622307 621481 621064 622815 625355 626649 627420 629302 631902 634521 638485 644868
56163 644868 652059 658281 664340 671330 678261 684714 693024 704789 717903 730232 743471 760015 778789
56150 778789 797885 818683 843534 871763 901991 936218 977654 1026523 1081855 1145511 1220536
56139 1220536 1307217 1404323 1512136 1630353 1754609 1878606 1997940 2108842 2206061 2286457
56129 2286457 2352911 2410831 2462531 2508330 2550115 2588954 2621010 2640484 2645525 2637861 2618966 2590812
56117 2590812 2558118 2524691 2488334 2443001 2384550 2311250 2221628 2116609 2002129 1885382 1770080
56106 1770080 1658741 1556514 1467885 1391931 1325580 1269292 1224777 1189682 1159843 1134819 1116091
56095 1116091 1101985 1089618 1079858 1074932 1072966 1070292 1067340 1066896 1068337 1068994 1069471 1072222 1076630 1080796
56081 1080796 1086211 1095235 1105958 1115092 1123727 1134630 1146301 1155816 1165099 1177893 1192719 1205510
56069 1205510 1217132 1231470 1248055 1263584 1278907 1297257 1317218 1334787 1350977 1370064 1391629
56058 1391629 1411645 1430119 1450199 1471042 1489125 1505474 1524000 1543854 1561095 1576696 1595068
56047 1595068 1615860 1635245 1654096 1676681 1702354 1726965 1751428 1780263 1812595 1843381 1872747
56036 1872747 1905226 1940541 1974287 2007138 2044091 2085052 2125462 2165704 2210426 2258974 2306188
56025 2306188 2352384 2402751 2457158 2510455 2562507 2617917 2676252 2732951 2789434 2851665 2919168
56014 2919168 2986385 3054347 3129573 3211860 3294916 3378728 3469144 3565622 3662027 3759402 3864950
56003 3864950 3978487 4093259 4210024 4336403 4472417 4611233 4754293 4910549 5080439
55994 5080439 5256362 5439268 5638335 5853599 6076152 6306428 6554567 6821724 7099803
55985 7099803 7391035 7708198 8053692 8418740 8805255 9227102 9687473 10177627 10700848
55976 10700848 11274166 11903460 12581916 13316730 14131030 15035527 16026401 17115922 18335834
55967 18335834 19706355 21235023 22952936 24918905 27183393 29788267 32811759 36375671
55959 36375671 40604638 45628511 51635854 58872765 67578887 77988411 90413082 105259326
55951 105259326 122951610 143922793 168676564 197676860 231008468 268110730 307692747
55944 307692747 347465942 383621113 410904040 424144674 420608985 401325442 370327551
55937 370327551 332665538 292785044 253922377 218106951 186324118 158791498 135315986
55930 135315986 115537670 99000080 85197680 73671350 64051320 56013186 49254085
55923 49254085 43531161 38674354 34539991 30986831 27906483 25234971 22916177 20883732
55915 20883732 19088162 17508069 16120488 14887176 13779950 12791984 11912946 11117411
55907 11117411 10387554 9723879 9123898 8571904 8058361 7588250 7161430 6764471 6390010
55898 6390010 6045116 5732456 5441445 5165908 4912742 4684868 4472280 4268161 4078245
55889 4078245 3906348 3745431 3590676 3447309 3318084 3196385 3078700 2971042 2876323 2787924
55879 2787924 2702069 2624010 2555360 2487440 2414001 2339326 2267483 2194790 2119277 2046623 1980070
55868 1980070 1914517 1846876 1782476 1725165 1670672 1615742 1564511 1519922 1477770 1435056 1395529
55857 1395529 1361348 1327765 1291651 1257038 1226832 1197197 1165533 1136000 1111635 1088618 1063602
55846 1063602 1039321 1017886 996003 971942 949883 932250 914841 894528 874668 857870 840616
55835 840616 820365 801045 786070 772417 756962 742292 730916 719946 706966 695265 687826 681701
55823 681701 673564 665380 659366 652688 642387 630642 620186 609349 596415 584047 574653 566003 556005
55810 556005 547089 541460 536828 531427 528322 529989 533280 534605 535714 539572 544840 549210 554085 561123
55796 561123 568002 572277 575619 579694 581638 578264 571269 563850 555616 545166 534193 524694 515457 505523
55782 505523 497778 494784 494124 491882 487574 481948 473683 462601 452781 447970 446842 446877 449695 458234 471619
55767 471619 487131 504150 521550 534033 536126 528163 514438 497661 479024 461175 446512 434088
55755 434088 421934 410792 402289 395470 388509 381751 375818 369000 359888 350271 342067 333737 323242
55742 323242 312253 303845 298118 293480 290068 288464 287230 285155 283834 284617 285254 282980 278742 274923
55728 274923 271213 266350 261638 258830 256493 252318 247211 243414 240417 236537 232702 230770 229694 227231
55714 227231 224159 223032 224094 226052 229537 235993 244175 251369 257213 262927 267735 269489 268128 265371
55700 265371 261688 256453 250242 244122 237579 229832 222079 215842 210356 204334 198904 195930 194770 193588
55686 193588 192567 192911 194059 194828 195972 198623 201644 203624 206029 211074 217740 223213 227041 230515 233098
55671 233098 233077 230963 228867 227112 224608 221875 220538 220453 220312 220335 221433 222593 222208 221187 221625 223190
55655 223190 224018 224383 226138 229078 231255 232478 234213 236335 237209 236768 236360 235734 233313 229392 225929 223148
55639 223148 219280 213793 207996 202334 195948 189104 183315 178691 173732 168059 163007 159260 156157 153531
55625 153531 152069 151643 151333 151128 151733 152824 153364 153389 153559 153395 151921 149536 147218 144590 140937 137369
55609 137369 135494 134542 132417 129064 126232 124330 122267 120151 119352 119920 120391 120235 120167 120162 119466 118422 118025
55592 118025 117834 116607 114700 113527 113051 112212 111413 111913 113098 113122 112067 111740 112384 112434 111567 111150 111453 111204
55574 111204 110360 110620 112610 114925 116548 118015 119756 121436 123256 125815 128470 129977 130865 132910 136114
55559 136114 138557 139398 139623 139550 138154 135385 132762 130952 128865 125760 122346 119344 116843 115356 115549
55544 115549 116619 116908 116362 116471 117731 119301 121160 124216 127997 130606 131470 132001 133142 134405 135640
55529 135640 137443 139371 139951 138938 137512 135937 133266 129729 127049 125765 124438 122091 119295 116308
55515 116308 112367 107478 102806 98714 94397 89890 86239 83366 80139 77111 76583 79071 82127 83707
55501 83707 84482 85847 87784 89787 91846 93401 93236 91450 89728 88818 87595 85420 83386 82304 81506
55486 81506 80655 80732 82063 83299 83525 83641 84564 85713 86324 86636 86801 86331 85510 85611 86748 87296 86391 85250
55468 85250 85051 85339 85553 86236 87547 88310 87754 86665 85828 84999 84324 84899 86762 88163 88003 87239 86747 85766
55450 85766 83857 82486 82969 84438 85384 85765 86119 86110 85491 85194 85915 86918 87538 88498 90305 91779 91737 90860
55432 90860 90370 90112 89487 89043 89483 90211 90445 90731 91756 92718 92585 92072 92604 94013 94926 94956 94952 95377 95813
55413 95813 95872 95588 95177 95143 96068 97603 98366 97554 95905 94396 92944 91167 89392 87984 86661 85390 84954
55396 84954 85696 86669 86992 87015 87247 87229 86605 86189 86741 87625 87887 87765 87936 88124 87758 87256 87423 88155 88839 89474
55376 89474 90300 90932 90892 90522 90486 90869 91493 92427 93459 93789 93006 91680 90326 88652 86501 84547 83273
55359 83273 82212 81028 80348 80703 81591 82441 83444 84589 84997 84242 83313 83232 83683 83961 84167 84458 84244 83358
55341 83358 82989 84152 86056 87225 87414 87313 87170 86889 86736 86849 86759 86315 86266 87040 87952 88517 89352 90742
55323 90742 91633 91392 91276 92545 94183 94191 92314 89885 87780 86155 85448 85849 86220 85282 83531 82571 82910
55306 82910 83828 84951 86388 87586 87627 86639 85660 85204 85053 85239 86080 87382 88541 89270 89445 88739 87316
55289 87316 86275 86352 86759 86390 85595 85611 86758 88389 90099 91726 92626 92239 91086 90115 89472 88924 88908 89865
55271 89865 91047 91315 90749 90260 90021 89580 89110 89186 89555 89448 88966 88943 89587 90379 91128 92036 92913 93393 93670
55252 93670 94011 93856 92526 90561 89185 88729 88668 88907 89820 91189 92285 92885 93207 93031 91993 90580 89783
55235 89783 89829 90176 90541 91014 91400 91419 91338 91578 92005 92388 93036 93993 94208 92709 90212 88434 88153 88951 90372
55216 90372 92088 93404 93860 94018 94474 94613 93651 92371 92299 93437 94423 94739 95123 95798 95932 95131 94097 93419
55198 93419 92910 92424 92320 92794 93572 94395 95097 95369 95213 95316 96084 96712 96253 95136 94455 94218 93738 93295 93782
55179 93782 94885 95318 94922 94902 95786 96734 97156 97483 97869 97559 96210 94712 94037 94207 94825 95751 96812 97628
55161 97628 98113 98526 98901 99093 99397 100282 101585 102736 103626 104280 103868 101379 97358 93850 92331 92584 93597
55144 93597 94525 94740 94098 93391 93593 94573 95442 96092 97188 98659 99467 99080 98055 96946 95769 94748 94466
55127 94466 94928 95474 95840 96406 97240 97929 98459 99203 99892 99739 98736 97738 97085 96332 95489 95303 95940 96605 96866
55108 96866 97235 98026 98813 99457 100570 102381 104139 105198 105797 106290 106482 106239 105923 105759 105451 104811 104109 103562
55090 103562 103249 103622 105200 107605 109778 111299 112512 113317 113054 111871 110909 110698 110460 109537 108453 108034
55074 108034 108431 109454 110917 112225 112586 112091 111683 111676 111370 110534 110078 110637 111533 111878 111702 111307 110447 108965
55056 108965 107424 106321 105374 104269 103398 103138 103021 102359 101180 99997 99143 98866 99532 101143 103011 104273
55040 104273 104465 103604 102278 101647 102480 104072 105012 105060 105278 106162 106900 106812 106313 105886 105314 104514 103997 103819 103185
55021 103185 101894 101075 101558 102522 102738 102339 102312 102954 103875 104936 106147 106971 106680 105203 103103 101066 99833
55004 99833 99990 101239 102422 102854 103072 103778 104761 105519 106194 107070 107756 107731 107304 107307 108169 109809 111932 113848
54986 113848 114563 113767 112336 111336 111014 111196 111882 112782 113025 112291 111699 112628 114989 117482 119150 119831 119455
54969 119455 117967 115909 114253 113504 113472 113869 114631 115722 117053 118567 120101 121334 122177 122953 123897 124734
54953 124734 125057 124822 124200 123314 122423 121968 122076 122317 122243 121836 121222 120388 119422 118638 118145 117701 117237 117057 117252
54934 117252 117337 116763 115463 113797 112418 112176 113461 115545 117306 118704 120728 123819 127347 130911 134982
54919 134982 139803 144825 149959 156234 164220 172642 179587 184455 187771 189667 189627 187390 183192 177393 170596
54904 170596 163886 158254 153888 150397 147296 143951 139725 134885 130777 128423 127379 126596 125840 125517 125654
54889 125654 125992 126722 128198 130098 131650 132652 133647 135132 137075 139140 141039 142816 145036 148401 152967
54874 152967 158123 163491 169206 175002 179855 183069 185048 186359 186630 185061 181560 176701 171102 165425
54860 165425 160501 156662 153308 149712 145904 142296 138940 135781 133118 131185 129672 128223 126973 126044
54846 126044 125034 123615 122129 120991 120032 119027 118277 118028 117810 117069 115990 115082 114492 114300 114813 115850
54830 115850 116402 115810 114677 113886 113385 112816 112567 113108 113851 113874 113334 113077 113173 113007 112563 112467 112805 112974 112700
54811 112700 112366 112305 112550 113179 114143 114923 115071 114993 115444 116422 117277 117729 118072 118500 118962 119532 120275 120906 121170
54792 121170 121275 121435 121391 121052 121127 122259 123913 124986 125194 125034 124739 124207 123689 123578 123713 123746 123964 124870 126258
54773 126258 127604 129095 131278 133913 136285 138503 141379 145087 149029 153128 158166 164599 171875 179142
54759 179142 185879 191675 196074 198850 199952 199175 196402 192030 186630 180383 173459 166588 160534 155334
54745 155334 150775 147196 144876 143053 140664 137894 135866 134930 134394 133863 133668 133890 134117 134361 135159 136532
54729 136532 137764 138442 138842 139221 139657 140771 143531 147970 152922 157335 161156 164786 168496 172599 177309
54714 177309 182074 185736 187594 187693 186006 182237 176746 170849 165761 161724 158369 155304 152156 148688 145207
54699 145207 142406 140635 139689 139269 139098 138697 137708 136394 135202 133964 132232 130260 128789 127895 126952 125775
54683 125775 124885 124614 124791 125389 126528 127754 128231 127879 127438 127272 126936 126109 125008 123724 122106 120560 119978
54666 119978 120537 121388 121852 122063 122237 122246 122255 122798 123763 124220 123743 123101 123142 123737 124289 124518 124260 123263 121734 120497
54646 120497 120092 120225 120470 120883 121567 122245 122667 122877 122772 122063 120956 120234 120284 120700 121061 121400 121636 121408 120869
54627 120869 120789 121432 122067 122080 121796 121766 122019 122489 123348 124339 124594 123778 122717 122254 122219 122159 122311 122932 123368 122820
54607 122820 121680 121147 121715 122839 123925 124898 125773 126310 126248 125604 124661 123752 122880 121628 119841 118394 118575
54590 118575 120515 122845 124273 124873 125463 126329 127046 127062 126046 124159 122329 121697 122371 123263 123504 123357 123370
54573 123370 123467 123526 124047 125400 126947 127772 127896 128035 128496 129099 129867 131000 132288 133229 133626 133597 133133 132197
54555 132197 131095 130274 129911 130098 131089 132920 135038 136871 138440 139849 140494 139620 137617 136012 135938 137073
54539 137073 138336 139278 140462 142560 145333 147694 148789 148751 148186 147236 145742 144127 143256 143197 142915 141602
54523 141602 139714 138245 137543 137369 137569 138033 138338 138121 137681 137672 138314 139253 140069 140578 140762 140730 140609 140263 139310
54504 139310 137653 135796 134440 133980 134446 135567 136729 137271 137066 136529 135955 135244 134397 133782 133692 134094 134951
54487 134951 136259 137584 138172 137854 137356 137393 137959 138743 139604 140265 140179 139212 138023 137365 137431 138161 139628 141694
54469 141694 143807 145584 147183 148794 150319 151836 153729 155986 158030 159624 161173 162709 163447 163022 162300
54454 162300 162124 161942 160637 158227 155800 154139 153273 153019 153068 152745 151526 149740 148241 147524 147580 148198 148840
54437 148840 148717 147714 146813 146903 147524 147575 146842 146035 145584 145307 145097 145093 145241 145389 145746 146643 147967 149403 150942
54418 150942 152561 153696 153796 153186 152682 152571 152672 153065 153888 154587 154285 152958 151475 150501 150072 150179 150957
54401 150957 152242 153600 154910 156319 157624 158358 158554 158820 159576 160684 161769 162454 162420 161782 161275 161526 162318
54384 162318 163076 163739 164423 164614 163729 162326 161658 161930 162016 161146 159916 159220 159055 158929 158818 159118 159991 161159
54366 161159 162193 162802 163100 163682 165118 167345 169870 172453 175140 177678 179570 180794 181882 183127 184197
54351 184197 184701 184651 184204 183335 181921 179835 176982 173609 170468 168123 166135 163608 160571 158112 156946
54336 156946 156561 156097 155437 154956 154738 154609 154670 155240 156360 157654 158713 159424 159974 160656 161556 162384 162704 162351
54318 162351 161533 160575 159644 158708 157635 156495 155777 155990 156902 157555 157376 156893 156897 157337 157571 157366 156914 156160 154925
54299 154925 153630 153060 153359 153977 154622 155452 156237 156226 155265 154285 154201 154881 155606 155999 156023 155611 154926 154651 155335
54280 155335 156506 157023 156406 155480 155545 157082 159394 161404 162591 163075 162923 161830 159741 157453 156095 156008
54264 156008 156547 157037 157492 158292 159493 160704 161477 161660 161550 161796 162951 164918 166940 168219 168541 168298 168046
54247 168046 168122 168589 169361 170192 170548 169809 167949 165891 164777 164831 165278 165317 164707 163523 162049 161046 161265 162298
54229 162298 162712 161875 160909 161110 162181 162935 163165 163690 164837 166027 166876 167691 168673 169437 169513 168729 167030 164583
54211 164583 162165 160802 160804 161605 162580 163494 164201 164536 164615 164721 164795 164501 163797 162940 161965 160735 159523 158967 159317
54192 159317 160210 161190 162022 162567 162871 163263 163788 163718 162453 160840 160604 162242 164328 165348 165468 165922 167211
54175 167211 168632 169337 169264 168954 168810 168820 168964 169548 170705 171704 171428 169786 167896 166432 164632 161763 158759
54158 158759 157218 157213 157402 157078 156787 156934 157164 157383 158132 159449 160431 160413 159807 159306 159078 159095 159434 159849 159850 159594
54138 159594 159903 160954 161805 161776 161529 162176 163934 166202 168365 169984 170778 171000 171360 172111 172715 172765 172583 172494
54120 172494 172216 171565 171064 171145 171312 170934 170479 171096 173087 175459 176965 177213 176804 176704 177371 178342 178879 179001
54102 179001 179406 180289 180907 180648 179905 179454 179512 179930 180814 182404 184654 187430 190829 194901 199354 203849 208288
54085 208288 212444 215713 217593 218066 217245 215070 211682 207649 203456 199203 195134 191957 190186 189553 189486
54070 189486 189748 190220 190553 190568 190645 191268 192448 193932 195554 197012 197768 197652 197172 196854 196735 196871 197771 199728
54052 199728 202207 204538 206840 209604 212704 215515 217866 220270 223287 227032 231137 234864 237476 238906
54038 238906 239881 241173 243041 245560 248949 253150 257568 261675 265497 269137 272373 275184 278144 281704
54024 281704 285532 289058 292209 295078 297410 299058 300415 301787 302834 303335 303887 304929 305568 304405 301248
54009 301248 297077 292574 287735 282747 278147 274007 269889 265750 262015 258612 254817 250333 245804 241990
53995 241990 239061 236909 235513 234600 233428 231389 228582 225610 222981 220788 218774 216647 214509 212825
53981 212825 211807 211065 210198 209421 209117 209111 209011 209039 209690 210633 210799 209696 207973 206483 205458 204834 204700 205054
53963 205054 205558 205998 206643 207859 209667 211915 214601 217694 220942 224196 227759 232107 237248 242631 247787
53948 247787 252999 259205 267128 276514 286323 295552 303529 309460 312398 312192 310117 307918 306349 305121
53934 305121 304077 303721 304460 305923 307337 308271 308822 309341 310176 311492 313164 314899 316486 317873 319164 320713
53918 320713 323109 326768 331601 337243 343516 350427 357833 365360 372627 379332 385277 390558 395603 400662
53904 400662 405364 409072 411564 413025 413477 412669 410648 408029 405522 403342 401142 398348 394567 389845 384592
53889 384592 379102 373176 366348 358495 350102 341925 334461 327725 321414 315300 309417 303848 298477 293200
53875 293200 288279 284088 280489 276869 272926 269028 265619 262711 260086 257608 255037 251988 248445 244973
53861 244973 242097 239744 237535 235281 232921 230339 227588 224952 222495 219965 217434 215504 214492 213897
53847 213897 213181 212617 212784 213608 214534 215283 215793 215712 214724 213285 212370 212407 212869 212921 212155 210882 209965 210160 211267
53828 211267 212275 212610 212826 213658 214900 215809 216143 216183 216109 216071 216557 217994 220193 222689 225292 227756 229423
53811 229423 230000 230282 231265 232850 234264 235415 236896 238986 241682 245458 250804 257009 262520 266634 269970
53796 269970 273275 276823 280982 286103 291501 295691 298178 300134 302808 306089 309158 311750 314097 316180
53782 316180 317722 318633 319001 318860 318151 316625 313657 308688 302059 295018 288710 283517 279309 275690 271956
53767 271956 267493 262537 258011 254393 251335 248473 245921 243662 241185 238220 235307 233164 231844 230879
53753 230879 229880 228694 227275 225682 223986 222121 220119 218448 217639 217566 217686 217981 218930 220435 221562 221712
53737 221712 221339 221179 221389 221855 222657 223740 224640 225091 225419 225849 225915 225144 223945 223195 223174 223511 224039 225141
53719 225141 227157 229788 232212 233689 234146 234265 234886 236291 238168 240193 242366 244779 247369 249938 252205
53704 252205 253973 255515 257574 260499 263596 265971 267808 270061 273005 276065 279168 283133 288249 293391
53690 293391 297279 299981 302468 305123 307355 308430 308113 306682 304738 302954 301757 301323 301810 303124 304456
53675 304456 304662 303462 301798 300693 300222 299904 299526 299132 298576 297609 296248 294786 293589 292970 292902 292799 292033
53658 292033 290794 289944 289892 290163 290221 290036 289594 288600 287099 285782 285201 285171 285321 285652 286176 286665 287246 288592
53640 288592 290899 293262 294799 295895 297654 300472 303896 307493 311024 313929 315481 315664 315417 315900 317671
53625 317671 320463 323501 326176 328578 331201 334165 337197 340481 344806 350496 356800 362743 367980 372361
53611 372361 375463 377353 379148 381903 385280 388214 390581 393298 396895 400901 404627 407797 410389 412536
53597 412536 414701 417263 419867 421689 422434 422582 422616 422561 422302 421832 421058 419838 418361 417031 415858 414360
53581 414360 412231 409723 407237 404887 402650 400585 398694 396795 394797 392936 391495 390438 389533 388799 388520
53566 388520 388679 388643 387799 386425 385468 385301 385225 384570 383775 383697 384217 384432 384160 384275 385319 386677 387563 388082 388806
53547 388806 389878 391106 392466 394023 395674 397396 399411 401797 404367 407186 410726 415152 419986 424883
53533 424883 430202 436377 443253 450454 457841 465210 472225 479235 487452 497564 508777 520034 531558
53520 531558 544305 558376 573053 588089 603880 620505 637651 655523 674867 695890 717941
53509 717941 740451 763533 787440 812024 837013 862392 888300 914776 941612 968245 993921
53498 993921 1018288 1041693 1064595 1086956 1108531 1129456 1150107 1170648 1191148 1211776 1232398
53487 1232398 1252406 1271544 1290495 1309962 1329572 1348518 1366884 1385368 1403982 1422139 1439961
53476 1439961 1458302 1477209 1495389 1511536 1525371 1537005 1546135 1552425 1556087 1557500 1556638 1553314 1547586
53463 1547586 1539523 1528840 1515271 1499209 1481686 1463738 1445951 1428478 1411251 1394043 1376404
53452 1376404 1357784 1337990 1317484 1296895 1276224 1254927 1232878 1210724 1189153 1168381 1148594
53441 1148594 1130147 1112864 1095977 1079470 1064769 1053193 1044304 1036788 1030425 1025967 1023458 1022066
53429 1022066 1021590 1022788 1025918 1030110 1034632 1039796 1046138 1053474 1061329 1069759 1079287 1090432 1103617 1119126
53415 1119126 1136877 1156520 1177774 1200390 1223957 1248339 1274249 1302705 1333857 1366910 1401160
53404 1401160 1436453 1472748 1510124 1549329 1591407 1636492 1683654 1732152 1782081 1833614 1886436
53393 1886436 1940343 1995666 2052635 2110869 2169840 2229317 2289067 2348753 2408403 2468303 2527987
53382 2527987 2585923 2640675 2691927 2740048 2785142 2826953 2865211 2899613 2929803 2955679 2977364
53371 2977364 2994698 3007255 3014991 3018276 3016956 3010020 2996537 2976345 2949484 2915660 2874911 2828262
53359 2828262 2777167 2722669 2665626 2607225 2548539 2489833 2430949 2372261 2314711 2259016 2205364
53348 2205364 2153869 2104837 2058435 2014298 1971557 1929278 1887028 1845067 1803811 1763138 1722537
53337 1722537 1682055 1642722 1605882 1572284 1541846 1513921 1487742 1463068 1440537 1421031 1404552
53326 1404552 1390100 1376628 1363590 1350519 1336819 1322317 1307510 1292864 1278345 1263930 1250076
53315 1250076 1237272 1225537 1214750 1205148 1197145 1190951 1186654 1184298 1183594 1183919 1184916 1186826 1190037 1194657
53301 1194657 1200770 1208596 1218124 1229011 1241199 1255263 1271782 1290745 1311841 1334894 1359635 1385448
53289 1385448 1411876 1439153 1467871 1498160 1529289 1559828 1588191 1613523 1636241 1657286 1676759
53278 1676759 1693827 1707997 1719669 1729100 1735640 1738532 1737753 1733531 1725710 1714344 1700401 1685101 1668873
53265 1668873 1651479 1632661 1611985 1588593 1562090 1533457 1504269 1475063 1445155 1413945 1381673
53254 1381673 1348949 1316241 1283924 1252282 1221324 1190959 1161382 1132932 1105623 1079135 1053160
53243 1053160 1027455 1001738 975945 950430 925530 901075 876743 852744 829756 808289 788477
53232 788477 770275 753465 737627 722579 708752 696738 686601 677912 670188 662792 654733 645263
53220 645263 634705 624073 613769 603110 591241 578068 564127 549919 535654 521406 507340
53209 507340 493759 481011 469363 458946 449720 441316 433057 424546 416245 409066 403239 398015 392570
53196 392570 386649 380135 372738 364622 356735 349970 344297 339249 334705 330587 326310 321340 316030 311136
53182 311136 306691 302129 297385 293130 289878 287492 285644 284190 283038 282061 281138 279908 277713 274277 270360
53167 270360 267198 265356 264602 264633 265280 266100 266492 266302 265858 265422 265110 265141 265473 265292 263630 260602 257387 254910
53149 254910 253192 252046 251593 251769 251987 251724 251075 250462 250146 250143 250237 249961 249073 248142 248148 249334 250938 252191 252992
53130 252992 253429 253393 253065 253185 254232 255724 256896 257784 259128 261318 263922 266190 267698 268518 269014 269538
53114 269538 270247 271269 272912 275354 278062 279999 280626 280360 279740 278612 276598 274061 271916 270443 268885
53099 268885 266504 263639 261381 260286 259753 258746 256951 255081 254095 254333 255429 256762 257773 258019 257361
53084 257361 256210 255325 255166 255510 255731 255386 254526 253569 252916 252561 252062 251027 249647 248550 248103 248040 247872 247485
53066 247485 247105 246839 246545 246201 246078 246297 246423 245874 244765 243922 243867 244128 243941 243346 243070 243449 244063 244488 244797
53047 244797 245118 245209 244868 244435 244568 245653 247515 249423 250354 249754 248190 246786 245873 244813 243388 242489 242850
53030 242850 243849 244382 244374 244518 244915 245076 245092 245695 247016 248214 248657 248704 248949 249321 249366 249005 248576 248397 248564 248989
53010 248989 249430 249651 249675 249732 249948 250289 250799 251608 252680 253776 254725 255517 256175 256713 257202 257636 257771 257304 256179
52991 256179 254696 253487 253404 254946 257504 259634 260512 260759 261432 262643 263763 264559 265429 266721 268601 271333
52975 271333 274937 278692 281709 283915 285757 287056 287072 285684 283651 281609 279648 277989 277162 277282 277948
52960 277948 279103 281143 283821 285907 286412 285560 284134 282524 280820 279195 277683 276071 274439 273309 272824
52945 272824 272341 271253 269735 268256 266908 265685 264885 264650 264526 264040 263332 262725 262049 260963 259663 258708
52929 258708 258275 258051 257682 256994 255964 254823 254009 253748 253909 254459 255614 257198 258316 258156 256899 255418
52913 255418 254307 253555 252937 252374 252073 252466 253695 254985 255131 253997 252987 253489 255249 256820 257166 256269
52897 256269 254597 252813 251723 251708 252180 252210 251680 251320 251705 252761 254115 255334 255895 255588 254976 254868 255295
52880 255295 255567 255374 255200 255469 255907 256052 255940 255954 256324 257117 258463 260466 263019 265895 268865 271607 273687
52863 273687 274853 275321 275660 276433 277889 279785 281394 281919 281146 279717 278540 277859 276950 274880 271523 267671
52847 267671 264151 261107 258267 255575 253091 250524 247469 244162 241403 239582 238289 237102 236162 235644 235256
52832 235256 234750 234459 234727 235199 235325 235300 235791 236862 237881 238431 238692 238789 238408 237339 235985 235012 234730 234929
52814 234929 235160 235102 234870 235000 235929 237460 238959 240063 240995 242191 243800 245440 246294 245625 243527 241062
52798 241062 239290 238280 237383 236316 235443 235022 234789 234452 234139 234064 234097 233982 233761 233716 234013 234540 235053 235409 235776
52779 235776 236501 237613 238497 238466 237634 236898 236892 237350 237599 237322 236574 235410 233902 232397 231400 231149 231439 231828
52761 231828 231935 231680 231313 231144 231145 231034 230844 231149 232425 234360 236083 237059 237442 237607 237678 237700 237970 238963 240960
52742 240960 243836 247125 250224 252717 254614 256237 257792 259156 260195 261082 262051 262977 263537 263777 264182 265078
52726 265078 266283 267428 268321 268829 268758 268160 267469 266976 266429 265494 264339 263297 262192 260599 258641 256889
52710 256889 255438 253809 251938 250569 250330 250976 251909 252917 253918 254477 254175 253232 252189 251215 250213 249421
52694 249421 249284 249760 250363 250912 251747 253004 254142 254482 253965 253148 252592 252453 252576 252854 253395 254284 255203 255468
52676 255468 254658 253109 251639 250780 250391 249921 248967 247671 246720 246791 247848 249065 249665 249695 249772 250208 250727 251019
52658 251019 251254 251893 253235 255189 257397 259526 261582 264019 267409 271810 276452 280108 281942 282045 281122
52643 281122 279721 277945 275948 274300 273408 272791 271488 269236 266760 264857 263761 263571 264633 266978 269837
52628 269837 272283 274153 275930 277910 279903 281514 282290 281779 279915 277266 274542 271978 269508 267274 265503
52613 265503 264105 262953 262398 262887 264102 265099 265394 265399 265665 266206 266772 267318 267908 268453 268818 268997 269047 269027 269027 269057
52593 269057 268885 268293 267529 267146 267310 267623 267798 268127 268979 270140 271027 271450 271827 272646 273922 275275 276448
52576 276448 277631 279183 281076 282730 283526 283357 282568 281453 280029 278250 276219 274179 272408 271111 270295
52561 270295 269822 269632 269733 269869 269556 268734 268097 268258 268782 268616 267429 265926 264752 263781 262750 261990 261954 262443
52543 262443 262914 263396 264478 266288 268015 268756 268558 268239 268321 268532 268478 268422 268998 270252 271433 271910 272002 272614
52525 272614 274188 276237 277831 278370 277984 277406 277462 278500 280252 282185 283879 285085 285721 286007 286427 287378
52509 287378 289032 291575 295173 299501 303645 306844 309017 310271 310337 309022 306917 304938 303250 301221 298379
52494 298379 294831 290831 286643 282954 280666 279902 279707 279066 277915 276866 276325 276216 276309 276429 276474 276527 276929
52477 276929 278040 279827 281714 282861 282773 281796 280945 281029 282088 283789 286016 288638 290997 292354 292899 293698
52461 293698 295472 297965 300659 303502 306506 309125 310599 310718 309856 308319 306019 302795 298841 294740 291031
52446 291031 287779 284698 281866 280013 279683 280229 280246 279074 277374 276118 275570 275523 275847 276389 276699 276406 275636
52429 275636 274703 273649 272504 271699 271725 272473 273315 273886 274438 275420 276968 278823 280470 281402 281488 281158 281095 281718
52411 281718 283055 285072 287913 291799 296756 302478 308468 314452 320817 328507 338251 349649 360964 369884
52397 369884 374718 375120 371872 366124 358892 351104 343610 336869 330883 325737 321960 319959 319226 318670 317741
52382 317741 316814 316440 316682 317315 318188 319173 320127 321100 322312 323763 325231 326809 329063 332411 336658 341315
52366 341315 346125 350967 355574 359600 362803 364997 366097 366380 366401 366393 366011 364948 363584 362703 362730 363464 364426
52349 364426 365214 365687 366076 366866 368392 370566 373013 375324 377178 378540 379821 381632 384237 387505 391441
52334 391441 396423 402733 410181 418378 427069 436061 445223 454852 465689 478202 492071 506654 521727
52321 521727 537470 553973 571053 588424 605861 623360 641316 660193 679850 699495 718573
52310 718573 737300 756073 774827 793442 812337 831996 852062 871493 889658 906857 923814
52299 923814 940987 958289 975064 990382 1003715 1015286 1025524 1034250 1040695 1044173 1044484 1041831 1036746
52286 1036746 1029985 1022161 1013543 1004447 995516 987211 979292 971386 963951 958050 954168 951821 950457 950225
52272 950225 951643 954909 959782 965896 973046 981359 991213 1002710 1015212 1027735 1039846 1051790 1063756
52259 1063756 1075505 1086957 1098680 1111470 1125671 1141147 1157566 1174370 1190703 1205890 1219958
52248 1219958 1233324 1245960 1257156 1266117 1272490 1276210 1277143 1275185 1270583 1263912 1255803 1246844 1237568
52235 1237568 1228180 1218261 1207177 1194932 1182330 1170112 1158300 1146721 1135732 1125806 1116687 1107670
52223 1107670 1098719 1090579 1083600 1077173 1070708 1064615 1059872 1057018 1055953 1056377 1057927 1060145 1062757 1065853
52209 1065853 1069526 1073581 1077904 1082795 1088547 1094880 1101145 1106914 1112069 1116628 1120894 1125495 1130789 1136387
52195 1136387 1141684 1146698 1151977 1157919 1164622 1172147 1180340 1188514 1195893 1202266 1207715 1211850 1213999 1214103
52181 1214103 1212663 1209669 1204288 1195989 1185436 1173976 1162612 1151781 1141651 1132253 1123517 1115555 1108745
52168 1108745 1103246 1098625 1094254 1090082 1086818 1085324 1085897 1088107 1091230 1094803 1098662 1102521 1105803 1108099
52154 1108099 1109595 1110781 1111840 1112616 1112992 1112996 1112585 1111732 1110730 1110074 1109996 1110317 1110719 1110925 1110682 1109940 1109023 1108277
52136 1108277 1107599 1106608 1105314 1104266 1104015 1104749 1106542 1109677 1114663 1122104 1132464 1145685 1161139 1178295
52122 1178295 1197332 1218776 1242602 1268157 1294864 1322506 1350792 1379226 1407540 1435777 1463795
52111 1463795 1491083 1517199 1541903 1564733 1585008 1602598 1618280 1632922 1646550 1658537 1668508
52100 1668508 1676831 1684385 1692005 1699861 1707098 1712298 1714485 1713578 1709829 1703135 1693168 1679888 1663650 1644951
52086 1644951 1624357 1602653 1580904 1560254 1541560 1525016 1510196 1496707 1484752 1474847 1467108 1461214
52074 1461214 1457021 1454685 1454165 1455097 1457413 1461627 1468257 1477288 1488333 1500937 1514485 1528279 1542075
52061 1542075 1556258 1571177 1586573 1601906 1616909 1631515 1645566 1658940 1671703 1683777 1694619
52050 1694619 1703503 1709892 1713403 1713771 1711190 1706313 1699489 1690283 1678172 1663442 1646930 1629111 1610038
52037 1610038 1590021 1569699 1549422 1529063 1508625 1488564 1469390 1451286 1434278 1418482 1403921
52026 1403921 1390266 1376922 1363362 1349467 1335654 1322560 1310366 1298484 1286152 1273327 1260739
52015 1260739 1249062 1238295 1227978 1217754 1207578 1197576 1187827 1178178 1168212 1157416 1145377 1131769
52003 1131769 1116356 1099262 1081066 1062299 1042856 1022275 1000687 979099 958572 939411 921400
51992 921400 904543 889176 875415 862848 850803 838631 825670 811300 795405 778678 762150
51981 762150 746271 730578 714333 697389 680388 664209 649351 635740 622964 610695 599070
51970 599070 588668 580043 573277 568108 564505 562963 564132 568190 574541 582077 589720 596869 603414 609300
51956 609300 614154 617437 618866 618520 616469 612518 606563 599193 591765 585693 581477 578565 576286 574913
51942 574913 575524 578856 584677 592479 602304 614462 628711 644270 660498 677051 693437 709014 723459
51929 723459 736670 748044 756504 761574 764023 765065 765237 764321 761963 757914 751792 743013 730924 714948
51915 714948 694960 671843 647453 623607 601169 580362 561674 545993 533803 524684 517772 512546
51903 512546 509092 507765 508710 511647 515995 521055 526001 529831 531590 530735 527157 520918 512267 501876
51889 501876 490706 479516 468758 458974 450868 444763 440345 437177 435198 434536 435224 437314 440848 445469
51875 445469 450508 455919 462582 471090 480537 489231 496433 502613 508020 511817 512968 511448 508245 504478
51861 504478 500796 497325 493858 490193 486462 483161 480884 480128 481229 484107 488028 491877 494791 496401
51847 496401 496498 494819 491279 486185 479992 472979 465301 457267 449436 442391 436431 431463 427244 423815 421544
51832 421544 420644 420765 421317 422130 423565 425949 429081 432246 434535 435255 434344 432449 430377 428431 426455 424412
51816 424412 422575 421164 420168 419634 419783 420676 422037 423575 425133 426360 426559 425333 423184 421120 419720
51801 419720 418898 418447 418389 418707 419162 419597 420138 420871 421529 421728 421320 420275 418448 415867 413154 411132 409959
51784 409959 409030 407902 406845 406229 405866 405372 404821 404474 404172 403676 403468 404474 406915 410173 414003 419096
51768 419096 426017 434229 442788 451541 460943 470928 480657 489333 496668 502448 506127 507076 505008 500039
51754 500039 492566 483205 472763 462167 452277 443529 435665 428100 420664 413705 407419 401645 396642 393517
51740 393517 393158 395068 397956 401303 405635 411350 418112 425566 433822 442874 452060 460445 467312 472086
51726 472086 474387 474675 474422 475099 477150 480175 483670 487017 489017 488262 484235 477775 470369 463288 457424
51711 457424 453439 451526 450906 449951 447228 442638 437447 433076 430004 428001 427124 427937 430573 434085 437069
51696 437069 438696 438933 438045 436336 434295 432587 431727 431877 432854 434131 434896 434465 432728 430077 426860 423131
51680 423131 418979 414822 411231 408546 406843 406154 406534 407900 409954 412364 415057 418248 422175 426784 431816
51665 431816 437348 444192 453429 465313 478664 491489 502149 509796 513889 513881 509677 502194 493088 483984
51651 483984 476070 470185 466793 465832 466920 469759 473950 478274 480688 479538 474731 467421 458751 449243
51637 449243 439268 429466 420471 412536 405717 400232 396287 393691 391968 390953 391028 392598 395481 398963 402335
51622 402335 405125 406945 407575 407331 406874 406310 404849 401871 398063 394788 392331 389552 385498 380742 376675
51607 376675 373976 372261 370899 369543 368087 366634 365558 365223 365728 367197 370059 374597 380400 386851 394089
51592 394089 402898 413472 424733 435006 442961 447832 449277 447507 443329 437764 431658 425740 420776
51579 420776 417384 415798 415960 417759 421108 426020 432788 441912 453548 467028 481189 495318 509794
51566 509794 525681 543564 562689 581303 597984 612793 627261 643388 662610 685387 711385
51555 711385 739930 770406 802190 834094 863939 888969 906899 916648 918225 912174 899134 879751
51543 879751 854849 825617 793578 760246 726754 693775 661826 631675 604480 581336 562459
51532 562459 546968 533799 522809 514549 508952 504868 501168 497805 495381 494114 493750 494045 494607 494434
51518 494434 492338 487927 481812 474908 467964 461546 455784 450130 443912 437270 431102 426034 421942 418485
51504 418485 415531 412946 410451 407948 405575 403324 401055 399034 397997 398383 399794 401326 402155 401820 400424
51489 400424 398751 397729 397570 397760 397885 397966 397930 397455 396619 396047 395968 395649 394279 392022 389730 387878 386268
51472 386268 384536 382500 380139 377572 374960 372301 369529 366912 364977 363809 362891 361927 361392 361797 362791
51457 362791 363403 362968 361451 359231 357001 355513 354956 354778 354559 354753 356129 358844 362635 367667 374486 383219
51441 383219 393406 404589 416554 428971 441275 452802 462603 469319 472027 471364 469307 467604 466688
51428 466688 465991 464685 461955 457175 450336 442244 434168 427327 422500 419658 417946 416435 414945 413844
51414 413844 413150 412354 411193 410023 409198 408568 407927 407476 407459 407602 407399 406796 406262 406245 406806 407726 408763 409817
51396 409817 410995 412411 413890 415065 415960 417294 420005 424566 430965 439115 448904 459908 471625 484304
51382 484304 499237 517807 540330 566203 595179 627933 665125 706385 750801 798071 848242
51371 848242 900037 950015 993847 1028151 1051098 1062042 1061349 1050315 1030480 1002936 968581 928795
51359 928795 885311 839563 792721 746216 701553 659565 620467 584723 553193 526166 502904
51348 502904 482517 464845 450127 438287 428896 421453 415253 409387 403369 397539 392393 387767 383146
51335 383146 378570 374674 371932 370320 369632 369554 369397 368382 366495 364673 363850 364101 364938 366142 367911 370343
51319 370343 373192 376133 378939 381294 382776 383280 383285 383382 383532 383092 381725 380012 378865 378486 378213 377325 375630
51302 375630 373230 370184 366686 363309 360781 359524 359469 360004 360002 358389 355177 351740 349548 348755 348419 347929
51286 347929 347513 347434 347532 347886 349208 352049 356087 360720 365894 371736 377781 383358 388576 393946 398998 402206
51270 402206 402704 401434 400080 399447 399408 399870 400975 402586 404335 406208 408436 410724 412230 412511 412003 411246
51254 411246 410045 407819 404500 400670 396907 393320 389729 385978 382019 377874 373706 369866 366779 364717
51240 364717 363622 363114 362702 362044 361072 359917 358737 357583 356419 355348 354701 354714 355045 354965 354222 353524 353799
51223 353799 355170 357007 358842 360788 363065 365608 368234 370788 372953 374324 374850 374919 374862 374747 374791 375478
51207 375478 376913 378510 379722 380749 382054 383525 384701 385674 387091 389294 391999 394883 397887 400754
51193 400754 402778 403379 402664 401164 399290 397290 395452 393990 392821 391746 390809 390235 390067 390131 390387 390983
51177 390983 391883 392697 393145 393454 393983 394531 394476 393687 392863 392676 392938 393024 392941 393395 394863 397119 399846 403136
51159 403136 407114 411390 415285 418381 420557 421714 421795 420924 419261 416837 413771 410476 407379 404553 401900
51144 401900 399516 397513 395583 393129 389923 386378 383202 380951 379860 379741 380042 380284 380503 381043 381959 382935
51128 382935 383855 385089 387028 389590 392449 395606 399412 403971 408735 412851 415868 418002 419664 420931
51114 420931 421676 422057 422498 423100 423430 423196 422899 423446 425207 427724 430273 432451 434187 435484 436321 436735 436889
51097 436889 437053 437416 437931 438390 438649 438597 437963 436548 434719 433328 432859 432964 433084 433168 433456 433920 434467 435409
51079 435409 437073 439025 440340 440703 440701 440939 441408 441956 442801 444209 446064 448190 450908 454821 460055 466073
51063 466073 472375 479182 487250 497039 508337 520880 535152 552073 571639 592154 611116 626816
51051 626816 639045 648735 657399 666674 677691 690584 704614 718562 730828 739669 744076 744437 741808
51038 741808 736563 728314 717086 703931 690292 677437 666586 658626 653059 647720 640304 630101 617963
51025 617963 604990 591837 579141 567857 558812 552154 547450 544268 542563 542524 544175 547297 551754 557639
51011 557639 564878 572874 580925 588950 597453 606798 616870 627436 638366 649382 660046 670191 680002
50998 680002 689413 697803 704564 709769 714002 717705 720815 722824 723097 721455 718691 716213 714884 714421 714180
50983 714180 714348 716112 720771 728836 739880 753044 767817 784369 802945 822918 842837 861611
50971 861611 879484 897750 917892 941132 968357 999993 1036069 1076646 1122015 1172276 1226995
50960 1226995 1285515 1347346 1411974 1478642 1546681 1615790 1685446 1754100 1819433 1879480 1933348
50949 1933348 1980972 2022567 2058325 2088325 2112622 2131516 2145673 2155867 2162865 2167806 2172408 2178125
50937 2178125 2184934 2191207 2195047 2195639 2193338 2188757 2181960 2172399 2159354 2142340 2121143 2095610 2065462
50924 2065462 2030354 1990043 1944556 1894227 1839521 1780812 1718516 1653648 1588041 1523622 1461501
50913 1461501 1402015 1345522 1292656 1243837 1199085 1158488 1122279 1090143 1060938 1033544 1007768
50902 1007768 984134 963068 944551 928219 913382 899208 885318 872141 860528 851119 844129 839213
50890 839213 835304 831134 826473 822556 820761 821079 822312 823437 824251 824997 826071 828033 831320 835837 841253
50875 841253 847565 854980 863398 872521 882378 893248 905191 918229 932857 949688 968541 988503
50863 988503 1009041 1030532 1053628 1078770 1106508 1137698 1172973 1212426 1256091 1304388 1357909
50852 1357909 1417134 1482676 1555508 1636664 1726865 1826480 1935465 2053225 2178910 2311997
50842 2311997 2452252 2598962 2750634 2905555 3062104 3218174 3370696 3516118 3651004
50833 3651004 3771918 3875398 3958866 4021522 4064017 4087511 4093589 4084848 4064854 4037373 4006014
50822 4006014 3974465 3946348 3924441 3910218 3904149 3905934 3914214 3926383 3938952 3947884 3948561 3936153
50810 3936153 3906971 3859691 3794928 3713549 3615730 3501682 3372794 3231729 3081704 2926137
50800 2926137 2768801 2613607 2463873 2321937 2189506 2067971 1958101 1859747 1772325 1695558
50790 1695558 1629532 1574111 1528626 1492098 1463480 1441640 1425315 1413232 1404248 1397516 1392620 1389344
50778 1389344 1387028 1384306 1379931 1373823 1366882 1359697 1351863 1342652 1331832 1319555 1305870 1290739 1274283
50765 1274283 1256629 1237695 1217546 1196788 1176230 1156159 1136364 1116875 1098265 1081145 1065746
50754 1065746 1052178 1040799 1031934 1025383 1020499 1016829 1014509 1014118 1016305 1021594 1030352 1042820 1059241
50741 1059241 1079892 1104916 1134131 1167219 1204118 1245065 1290215 1339490 1392981 1451120 1514140
50730 1514140 1581478 1652071 1725145 1800388 1877443 1955657 2034377 2113049 2190958 2267223 2341149
50719 2341149 2412069 2478646 2538759 2590313 2631766 2661620 2678041 2679705 2666931 2641704 2606951
50708 2606951 2566263 2523816 2483629 2448608 2420518 2400477 2388779 2384446 2385837 2391900 2402171 2415330
50696 2415330 2428452 2437994 2440975 2434944 2417512 2386691 2341637 2282851 2212006 2131893 2046114 1958167
50684 1958167 1870743 1785985 1705983 1632551 1566671 1508673 1458915 1417918 1385885 1362510 1347355
50673 1347355 1340062 1340143 1346892 1359671 1378073 1401577 1429168 1459468 1491135 1522968 1553675 1581897
50661 1581897 1606791 1628573 1648174 1666197 1682348 1696148 1708054 1719491 1731692 1744810 1758290
50650 1758290 1771795 1785528 1799839 1814958 1831222 1849364 1870415 1895264 1924332 1957602 1994988
50639 1994988 2036584 2082525 2132597 2186005 2241468 2297536 2352997 2407146 2459611 2509807 2556776
50628 2556776 2599757 2638766 2674320 2706786 2736296 2762834 2785319 2800249 2802142 2786463 2752499
50617 2752499 2703599 2645260 2583396 2523654 2470790 2427759 2395413 2373274 2360418 2355662 2357410 2363777
50605 2363777 2372841 2382535 2390451 2394069 2391334 2380807 2361202 2331073 2289395 2236537 2174448 2105681
50593 2105681 2032340 1956037 1878553 1802049 1728527 1659255 1594723 1534846 1479118 1426859 1377649
50582 1377649 1331557 1288928 1250052 1214999 1183596 1155522 1130647 1109357 1092262 1079386 1069875
50571 1069875 1062736 1057710 1055173 1055356 1057997 1062757 1069620 1078755 1090187 1103746 1119247 1136547 1155467
50558 1155467 1175803 1197520 1220933 1246596 1274860 1305466 1337618 1370518 1403843 1437711 1472216
50547 1472216 1506999 1541342 1574743 1607356 1639672 1671835 1703576 1735052 1767454 1802478 1841356
50536 1841356 1884770 1933450 1988230 2049437 2116824 2190338 2270476 2357523 2450900 2549738 2653948
50525 2653948 2764315 2881665 3006212 3137434 3274039 3413973 3554848 3694502 3830947
50516 3830947 3961763 4083804 4193637 4288172 4364876 4421649 4456679 4468535 4456472 4420724 4362457
50505 4362457 4283415 4185820 4072785 3948608 3818311 3686813 3558651 3438285 3330119 3237913
50495 3237913 3164280 3110805 3078409 3067294 3076609 3104339 3147426 3201786 3262221 3322644 3376658
50484 3376658 3417956 3440380 3438327 3407959 3348448 3261975 3152541 3024960 2884751 2737988 2590296
50473 2590296 2445750 2306888 2175489 2052895 1939781 1836334 1742863 1659829 1587109 1523655
50463 1523655 1468032 1418994 1375470 1336467 1301256 1269303 1239836 1212067 1186222 1163872 1146615
50452 1146615 1134603 1126747 1122074 1120297 1121345 1125083 1131538 1140757 1152245 1165085 1178879 1194139 1211501
50439 1211501 1230854 1251382 1272041 1291661 1308950 1322986 1333738 1341902 1348317 1353775 1359170 1365352
50427 1365352 1372681 1381004 1390145 1400179 1411157 1422852 1435038 1447870 1461873 1477726 1496230 1518233
50415 1518233 1544231 1574152 1607928 1646283 1690469 1741131 1797797 1859587 1925921 1996241 2069515
50404 2069515 2144493 2220103 2295074 2367490 2435435 2497990 2554962 2605606 2648192 2680839 2702192
50393 2702192 2711187 2706812 2688346 2655419 2607852 2546272 2473227 2392883 2309042 2223885 2139065 2057289
50381 2057289 1981962 1915616 1859441 1814157 1780546 1759111 1749808 1752126 1764879 1785860 1812082 1840459
50369 1840459 1868053 1891851 1908874 1916532 1912680 1895642 1864884 1821739 1768962 1709426 1645467 1579236
50357 1579236 1512956 1448580 1387535 1330845 1279109 1232302 1190029 1152001 1118002 1087561 1060359
50346 1060359 1036984 1018610 1005688 997420 992531 989793 987505 983370 975678 964396 950649 935595
50334 935595 920268 905975 893910 884405 877079 871675 868187 866311 865408 865144 865693 867290 870074 874417
50320 874417 880772 888938 897948 906965 915885 924742 933028 940078 945837 950751 955114 959082 963208 968254
50306 968254 974326 980710 986827 992990 999937 1007988 1016984 1026753 1037247 1048448 1060578 1074326 1090453
50293 1090453 1109102 1129818 1152289 1176866 1204341 1235471 1270728 1310099 1352687 1396032 1435347
50282 1435347 1463610 1473845 1463088 1434728 1396376 1355117 1314936 1277992 1246428 1221754 1203409
50271 1203409 1189407 1178393 1170211 1164637 1160680 1157458 1154947 1153359 1152342 1151319 1150411 1150554 1152743 1157360
50257 1157360 1164179 1172875 1183582 1197047 1214176 1235332 1260032 1287271 1316042 1345581 1375248 1404238
50245 1404238 1431495 1456117 1477990 1497940 1517169 1536584 1556531 1576681 1595860 1612202 1623810
50234 1623810 1629250 1627438 1617532 1599436 1574247 1543884 1510376 1475666 1441598 1409464 1379634 1352045
50222 1352045 1326877 1304202 1283056 1261359 1236878 1208131 1174803 1138011 1100095 1063455 1029349
50211 1029349 998041 969810 945078 923700 904969 888480 874284 861973 850480 839209 828786
50200 828786 820201 813628 808418 803807 799302 794789 790657 787434 785000 782485 779221 775350 771260 766934
50186 766934 762265 757518 752949 748373 743575 738813 734432 730328 726272 722417 718955 715630 712185 708975
50172 708975 706470 704392 702092 699702 698089 697625 697711 697766 698045 699190 701431 704576 708398 712699 717250 721949
50156 721949 726954 732465 738511 745139 752706 761777 772732 785514 799687 814695 830103 845682 861387
50143 861387 877422 894281 912523 932518 954678 980084 1010409 1046894 1089595 1137924 1191546
50132 1191546 1250159 1312489 1376176 1438899 1499349 1557158 1612399 1665353 1716383 1765619 1812723
50121 1812723 1856926 1896987 1930950 1956179 1970014 1970677 1957743 1931977 1894769 1847628 1792207 1730733
50109 1730733 1666028 1600762 1536715 1474991 1416705 1362965 1314212 1270156 1230526 1195407 1164554
50098 1164554 1136785 1110488 1084623 1058994 1033863 1009741 987421 967740 951065 937218 925883
50087 925883 916880 910039 905166 902340 901977 904280 908670 914106 919986 926426 933470 940388 946201 950844
50073 950844 955317 960490 966116 971289 975596 979363 982827 985531 986755 986310 984725 982699 980513 977943
50059 977943 974593 970270 965025 958997 952368 945506 938889 932750 926974 921552 916901 913454 911069 909292
50045 909292 908200 908533 910813 914767 919936 926482 934944 945347 957025 969374 982347 996076 1010367
50032 1010367 1024885 1039622 1054863 1070680 1086655 1102130 1116601 1130014 1142892 1156077 1170040
50021 1170040 1184396 1198432 1212236 1226958 1243802 1263040 1284312 1307515 1332802 1359745 1386919
50010 1386919 1412482 1434968 1453654 1468656 1480877 1491565 1501660 1511506 1521042 1529970 1537742 1543646
49998 1543646 1546804 1545760 1538302 1522424 1497703 1465307 1426669 1382910 1335806 1288262 1242861 1200307
49986 1200307 1159996 1121750 1086095 1053017 1021492 990595 960497 932112 906189 882943 862134
49975 862134 843219 825624 809097 793705 779546 766623 754884 744078 733796 724032 715581 709303
49963 709303 704920 701078 696693 691820 687173 683383 680888 679914 680169 681010 682305 684780 689162 695301 702467
49948 702467 710135 718030 725718 732721 739005 744940 750769 756357 761349 765246 767454 767648 766176 763785
49934 763785 760831 756792 750579 741339 729121 714927 699967 684800 669449 654479 641473 631929
49922 631929 625769 621417 617377 613391 610101 608077 607415 607980 609616 612040 614695 616912 618384 619533 621207
49907 621207 623888 627412 631527 636485 642718 650157 658300 666941 676435 687177 699160 712090 725523
49894 725523 738652 750242 759119 764755 767344 767438 765530 761777 756002 748087 738406 727714 716568 705086
49880 705086 693319 681566 670078 658722 647248 635832 625162 615968 608575 602787 598052 593809
49868 593809 589857 586406 583738 581974 581251 581849 583908 587167 591264 596239 602398 609717 617768 626307 635623
49853 635623 646066 657486 669369 681293 692896 703490 712207 718818 724124 729145 733897 737316 738474
49840 738474 737529 735098 731018 724400 715109 704599 694732 686043 677696 669019 660443 652802 646343 640815
49826 640815 636153 632567 630097 628529 627780 628110 629928 633539 639018 646064 654036 662396 671195 680906 691665
49811 691665 702831 713358 722495 730027 736058 740752 744343 747207 749733 751945 753295 753006 750779 747082
49797 747082 742651 737827 732531 726703 720415 713481 705307 695378 683851 671591 659687 648940 639667
49784 639667 631853 625455 620572 617253 615247 614105 613480 613133 612726 611985 611201 611191 612533 615043 618306 622453
49768 622453 627943 634655 641708 648360 654757 661478 668570 675289 680795 684863 687894 690400 692586 694301
49754 694301 695237 695127 693729 690690 685545 678072 668727 658571 648648 639446 631097 623931 618468 614793
49740 614793 612282 610220 608597 608034 608978 611144 613648 615554 616498 617085 618617 622037 627043 632437 637331
49725 637331 641750 646121 650641 655404 660752 667158 674862 683952 694640 707121 721136 735901 750497
49712 750497 764112 775776 784132 787833 786405 780658 772123 762123 751479 740976 731577 723840 717496
49699 717496 712119 708130 706555 707659 710227 712298 712212 708986 702475 693784 685164 678792 675514 674847 675902
49684 675902 678038 681024 685134 690976 698783 707999 718036 729333 743056 759687 778504 798692 820402
49671 820402 844081 868800 891584 908603 917233 917381 911261 901970 892074 883167 876308 872468 872470 876656
49657 876656 884604 894933 905211 912231 912822 904946 888595 865896 840206 814640 791067 770201
49645 770201 752356 737835 726669 718275 711685 706245 702060 699629 698992 699432 700144 701006 702290 703741
49631 703741 704454 703744 701614 698184 693234 686754 679479 672329 665577 659045 652837 647266 642278 637586 633290
49616 633290 629766 627005 624664 622808 621897 621919 622232 622567 623549 625756 628682 631227 632970 634484 636420 638679
49600 638679 640571 641584 641866 642019 642450 643053 643577 644072 644717 645343 645586 645635 646386 648578 651919 655258 657579
49583 657579 658748 659389 660046 660520 660234 659253 658535 658803 659632 660250 660914 662596 665422 668410 671012 674022 678548
49566 678548 684801 692429 701252 710976 720764 729903 738610 747453 756205 763945 770060 774367 776410 775530
49552 775530 771856 766566 760886 755236 749604 744283 739884 736856 735244 734807 735200 736073 737058 737718 737718 737216
49536 737216 736988 737883 740164 743516 747535 752013 756939 762627 769768 778996 790371 803611 818782 836362
49522 836362 856515 878660 901815 925020 947196 966893 982515 992885 997682 997629 994390 990054 986432
49509 986432 984702 985508 989094 995221 1003094 1011391 1018262 1021505 1019235 1010765 996774 978628 957761 935671
49495 935671 913946 893791 875622 859468 845668 834779 826730 820471 814729 808952 803326 798098 793356
49482 793356 789500 787391 787582 789516 791931 794027 795912 797888 799835 801522 803046 804574 806020 807455
49468 807455 809525 812788 816716 820048 822277 824225 826908 830411 834200 837982 841729 845208 848116 850571
49454 850571 852922 854974 855785 854373 850526 844988 839068 833857 829461 825042 819886 814342 809337 805226
49440 805226 801736 798964 797594 797897 799299 801447 805012 810785 818530 827568 838068 850688 865096 879986
49426 879986 894755 910246 927439 946294 966287 987277 1009276 1032166 1056242 1081964 1107780
49415 1107780 1128686 1138587 1134768 1119650 1098429 1075869 1055144 1038112 1025531 1017391 1013652 1014458
49403 1014458 1019457 1027557 1037822 1050127 1064443 1079924 1095346 1110196 1124718 1138996 1152619 1165282
49391 1165282 1177254 1188944 1200173 1210000 1217323 1221714 1223611 1223530 1221183 1215767 1207117 1196110 1183740
49378 1183740 1170366 1156206 1142035 1128867 1117255 1107411 1099677 1094253 1090647 1088112 1086625 1086922 1089464
49365 1089464 1093745 1098697 1103339 1107061 1109656 1111233 1111855 1111254 1109136 1105651 1101210 1095901 1089480 1081908
49351 1081908 1073531 1064736 1055894 1047694 1041057 1036522 1033982 1033094 1033587 1035031 1036693 1037926 1038509 1038427 1037474
49336 1037474 1035224 1031337 1025914 1019660 1013609 1008410 1003942 999885 996565 994834 995158 997243 1000599 1005000
49322 1005000 1010324 1016456 1023531 1031800 1041017 1050430 1059773 1069878 1081859 1095926 1111292 1126836 1141308
49309 1141308 1153097 1160501 1162498 1159084 1150977 1139291 1125459 1110963 1096915 1083931 1072391 1062529
49297 1062529 1054223 1047027 1040633 1035239 1031318 1029044 1027974 1027236 1026079 1024286 1022134 1019921 1017576 1014786
49283 1014786 1011396 1007475 1002950 997416 990549 982758 975247 969299 965524 963779 963691 965021 967562 970959
49269 970959 974839 979045 983554 988216 992604 996108 998186 998717 998201 997389 996586 995564 994381 993984 995688
49254 995688 1000329 1008331 1020246 1036376 1055767 1076375 1096599 1116029 1134161 1148925 1157341 1157681
49242 1157681 1150505 1137637 1120769 1101358 1081266 1062697 1047165 1034725 1024431 1015538 1008143 1002765
49230 1002765 999710 999049 1000908 1005301 1011642 1018792 1025758 1032225 1038424 1044711 1051348 1058441 1065919 1073653
49216 1073653 1081527 1089279 1096456 1102912 1109250 1116269 1123869 1130936 1136512 1140773 1144790 1149819 1156943 1166827
49202 1166827 1179351 1193776 1209566 1226663 1244743 1262780 1279950 1296512 1313131 1329641 1345200
49191 1345200 1359497 1373065 1386369 1399230 1411272 1422414 1432824 1442880 1453206 1464226 1475656
49180 1475656 1486981 1498551 1511589 1526915 1544324 1563610 1585562 1611455 1641949 1677113 1717223
49169 1717223 1762777 1813545 1867784 1922194 1972293 2013149 2040740 2053520 2053065 2043341 2029139 2014562
49157 2014562 2002139 1992798 1986529 1983001 1981622 1981350 1980898 1979462 1977338 1975795 1976166 1978848 1983186 1988489
49143 1988489 1994981 2003430 2013957 2025796 2038381 2052088 2067498 2084377 2101855 2119315 2136611 2153745
49131 2153745 2170923 2188771 2207867 2228104 2248993 2270400 2292344 2314187 2334958 2354659 2374507
49120 2374507 2395552 2417759 2440750 2464669 2489789 2516108 2544174 2575843 2613307 2657622 2709047
49109 2709047 2768654 2838835 2922354 3021707 3139183 3275881 3429273 3591596 3751507 3898886
49099 3898886 4030300 4151050 4270032 4388518 4491868 4554369 4556246 4498374 4400927 4287816
49089 4287816 4171773 4051789 3921290 3777460 3624704 3472082 3328609 3200122 3089081
49080 3089081 2995928 2919903 2858916 2809829 2769699 2736698 2709705 2687345 2667884 2649910 2632681
49069 2632681 2615823 2599068 2582510 2566895 2553297 2542257 2533206 2524875 2516361 2507717 2499452 2491715
49057 2491715 2484265 2477074 2470472 2464677 2459617 2455353 2452240 2450392 2449409 2448940 2449211 2450597 2452983 2456075 2460185
49042 2460185 2466101 2474166 2483968 2494881 2506274 2516969 2525194 2529702 2530722 2529500 2527187 2524600 2522700
49029 2522700 2522431 2523895 2526217 2528491 2530519 2532394 2533756 2533915 2532569 2530011 2526782 2523449 2520752 2519446
49015 2519446 2519779 2521315 2523457 2526085 2529592 2534439 2540784 2548430 2556946 2565823 2574656 2583337 2592185 2601831
49001 2601831 2612711 2624444 2635852 2645815 2654056 2660898 2666494 2670759 2673957 2676664 2678898 2679817 2678745
48988 2678745 2676060 2672665 2668883 2664506 2659655 2654883 2650382 2645722 2640615 2635451 2630779 2626628 2622598 2618413
48974 2618413 2614137 2609998 2606174 2602561 2598616 2593623 2587336 2580211 2572898 2565667 2558548 2551822 2546064 2541706
48960 2541706 2538791 2537249 2537307 2539479 2544115 2551041 2559736 2569904 2581636 2594872 2608979 2623331 2638254
48947 2638254 2654940 2674229 2695743 2718365 2741296 2764419 2787909 2811819 2836041 2860573 2885997
48936 2885997 2913637 2944812 2979670 3017085 3056050 3096900 3140781 3188209 3238623 3291165 3345281
48925 3345281 3400595 3456951 3514858 3575365 3639062 3705398 3773270 3842004 3911407 3981146 4050559
48914 4050559 4119121 4186707 4253247 4318329 4381320 4441783 4499668 4555106 4608080 4658332 4705648
48903 4705648 4750213 4792557 4833021 4871326 4906786 4939041 4968585 4996568 5024010 5050940 5076128
48892 5076128 5097795 5114849 5127506 5136677 5142849 5145768 5145042 5140672 5132937 5122121 5108553 5092553 5074038
48879 5074038 5052429 5027357 4999318 4969226 4937350 4903082 4865749 4825245 4781747 4735242 4685596
48868 4685596 4632828 4577083 4518599 4457964 4396211 4334321 4272758 4211772 4152033 4094521 4039673
48857 4039673 3986962 3935604 3885578 3837817 3793353 3752458 3714735 3679869 3647948 3618976 3592491
48846 3592491 3568098 3546216 3527783 3513254 3502358 3494866 3490956 3490600 3493166 3498053 3505276 3515060 3527261
48833 3527261 3541622 3558175 3576795 3596717 3617137 3638044 3659803 3682192 3704590 3726932 3749606
48822 3749606 3772456 3794823 3816764 3839306 3863026 3887187 3910727 3933512 3956056 3978557 4000861
48811 4000861 4022933 4044710 4065744 4085672 4104993 4124806 4145683 4167170 4188479 4209455 4230899
48800 4230899 4254057 4279724 4307623 4336676 4365908 4394875 4423262 4450510 4476168 4500212 4522651
$$ [...]
##END NTUPLES=NMR SPECTRUM
##END=
