
##TITLE=AC1383_ECUA12195_7519144_wWxNilQlzo
##JCAMPDX= 6.0         $$ Bruker NMR JCAMP-DX V2.0
##DATA TYPE= NMR SPECTRUM
##DATA CLASS= NTUPLES
##ORIGIN= BRUKER
##OWNER= Administrator
$$ 1.72 TOPSPIN		Version 2.1
$$ 2013-02-21 00:35:16.703 -0500  Administrator@X
$$ Compression mode = diff/dup
##.OBSERVE FREQUENCY= 400.02188249412
##.OBSERVE NUCLEUS= ^1H
##.ACQUISITION MODE= SIMULTANEOUS (DQD)
##.ACQUISITION SCHEME= undefined
##.AVERAGES= 8
##.DIGITISER RES= 22
##SPECTROMETER/DATA SYSTEM= spect
##.PULSE SEQUENCE= zg30
##.SOLVENT NAME= COFFEE_meoh
##.SHIFT REFERENCE= INTERNAL, COFFEE_meoh, 1, 14.98509
##AUDIT TRAIL= $$ (NUMBER, WHEN, WHO, WHERE, PROCESS, VERSION, WHAT)
$$ ##TITLE= Audit trail, TOPSPIN		Version 2.1
$$ ##JCAMPDX= 5.01
$$ ##ORIGIN= Bruker BioSpin GmbH
$$ ##OWNER= Administrator
$$ $$ E:\/data/COFFEE/nmr/AC1383_ECUA12195_7519144_wWxNilQlzo/10/pdata/1/auditp.txt
$$ ##AUDIT TRAIL=  $$ (NUMBER, WHEN, WHO, WHERE, PROCESS, VERSION, WHAT)
(   1,<2013-02-21 00:35:07.774 -0500>,<Administrator>,<X>,<go>,<TOPSPIN 2.1>,
      <created by zg
	started at 2013-02-21 00:34:01.150 -0500,
	POWCHK enabled, PULCHK disabled,
       configuration hash MD5:
       86 BA 57 50 F2 9D 5C 9B 26 00 A9 28 5F 66 2E 89
       data hash MD5: 64K
       45 4B B4 F4 C0 68 84 CF C0 6A 31 EB ED 3C 13 73>)
(   2,<2013-02-21 00:35:11.211 -0500>,<Administrator>,<X>,<proc1d>,<TOPSPIN 2.1>,
      <Start of raw data processing
       efp LB = 0 FT_mod = 6 PKNL = 1 PHC0 = 0 PHC1 = 0 SI = 32K 
       data hash MD5: 32K
       BC 62 D7 CF B6 4E B2 EA 41 1A 3E F8 E0 12 2E B4>)
(   3,<2013-02-21 00:35:11.727 -0500>,<Administrator>,<X>,<proc1d>,<TOPSPIN 2.1>,
      <pk PHC0 = 67.15393 PHC1 = 0 
       data hash MD5: 32K
       81 C8 20 80 FD E6 0F 5D C2 AF EC 18 14 07 CE A1>)
(   4,<2013-02-21 00:35:12.105 -0500>,<Administrator>,<X>,<proc1d>,<TOPSPIN 2.1>,
      <abs ABSG = 1 
       data hash MD5: 32K
       12 9F 95 16 0B 54 27 25 78 1E 2B 6F 10 E0 8C 99>)
(   5,<2013-02-21 00:35:12.277 -0500>,<Administrator>,<X>,<proc1d>,<TOPSPIN 2.1>,
      <abs ABSG = 2 
       data hash MD5: 32K
       C3 51 69 28 71 ED 38 6C BF 86 B3 93 EC 45 EF D4>)
(   6,<2013-02-21 00:35:12.449 -0500>,<Administrator>,<X>,<proc1d>,<TOPSPIN 2.1>,
      <abs ABSG = 3 
       data hash MD5: 32K
       FE 60 26 E9 5A 94 7A CC 95 20 20 BB 31 3E 7A 5D>)
(   7,<2013-02-21 00:35:12.604 -0500>,<Administrator>,<X>,<proc1d>,<TOPSPIN 2.1>,
      <abs ABSG = 4 
       data hash MD5: 32K
       BF 7A E0 94 FE B0 B3 88 30 31 49 41 F2 E4 82 30>)
(   8,<2013-02-21 00:35:12.743 -0500>,<Administrator>,<X>,<proc1d>,<TOPSPIN 2.1>,
      <abs ABSG = 5 
       data hash MD5: 32K
       26 F0 E5 D9 8F 4B E2 A9 FE A7 32 F3 14 0C 46 4D>)
$$ ##END=
$$ 
$$ $$ hash MD5
$$ $$ 5A 64 D5 59 EB C0 DC FB 8B A2 AF 0F 84 81 B8 A7
##$RELAX= 
##$RELAX= 
##$RELAX= 
##$RELAX= 
##$RELAX= 
##$RELAX= 
##$RELAX= 
$$ Bruker specific parameters
$$ --------------------------
##$DU= <E:\>
##$EXPNO= 10
##$NAME= <AC1383_ECUA12195_7519144_wWxNilQlzo>
$$ [...]
150 150 150 150 150 150 150 150
##$TP07= 0
##$TPNAME0= <>
##$TPNAME1= <>
##$TPNAME2= <>
##$TPNAME3= <>
##$TPNAME4= <>
##$TPNAME5= <>
##$TPNAME6= <>
##$TPNAME7= <>
##$TPOAL= (0..7)
0.5 0.5 0.5 0.5 0.5 0.5 0.5 0.5
##$TPOFFS= (0..7)
0 0 0 0 0 0 0 0
##$TUNHIN= 0
##$TUNHOUT= 0
##$TUNXOUT= 0
##$USERA1= <user>
##$USERA2= <user>
##$USERA3= <user>
##$USERA4= <user>
##$USERA5= <user>
##$V9= 5
##$VALIST= <valist>
##$VCLIST= <CCCCCCCCCCCCCCC>
##$VD= 0
##$VDLIST= <DDDDDDDDDDDDDDD>
##$VPLIST= <PPPPPPPPPPPPPPP>
##$VTLIST= <TTTTTTTTTTTTTTT>
##$WBST= 1024
##$WBSW= 4
##$XGAIN= (0..3)
0 0 0 0
##$XL= 0
##$YL= 0
##$YMAX_a= 561058
##$YMIN_a= -557566
##$ZGOPTNS= <>
##$ZL1= 120
##$ZL2= 120
##$ZL3= 120
##$ZL4= 120
##$ABSF1= 14.98509
##$ABSF2= -5.573092
##$ABSG= 5
##$ABSL= 3
##$ALPHA= 0
##$AQORDER= 0
##$ASSFAC= 0
##$ASSFACI= 0
##$ASSFACX= 0
##$ASSWID= 0
##$AUNMP= <proc_prof1d_extract_pilot.lims>
##$AXLEFT= 0
##$AXNAME= <>
##$AXNUC= <1H>
##$AXRIGHT= 0
##$AXTYPE= 0
##$AXUNIT= <>
##$AZFE= 0.1
##$AZFW= 0.1
##$BCFW= 0
##$BC_mod= 0
##$BYTORDP= 0
##$COROFFS= 0
##$CY= 15
##$DATMOD= 1
##$DC= 0
##$DFILT= <>
##$DTYPP= 0
##$F1P= 0
##$F2P= 0
##$FCOR= 0.5
##$FTSIZE= 32768
##$FT_mod= 6
##$GAMMA= 0
##$GB= 0
##$INTBC= 1
##$INTSCL= 1
##$ISEN= 128
##$LB= 0
##$LEV0= 0
##$LPBIN= 0
##$MAXI= 10000
##$MC2= 0
##$MEAN= 0
##$ME_mod= 0
##$MI= 0
##$NCOEF= 0
##$NC_proc= -8
##$NLEV= 6
##$NOISF1= 0
##$NOISF2= 0
##$NSP= 0
##$NTH_PI= 0
##$NZP= 0
##$OFFSET= 14.98509
##$PC= 1
##$PHC0= 67.15393
##$PHC1= 0
##$PH_mod= 1
##$PKNL= yes
##$PPARMOD= 0
##$PPDIAG= 0
##$PPIPTYP= 0
##$PPMPNUM= 2147483647
##$PPRESOL= 1
##$PSCAL= 4
##$PSIGN= 0
##$PYNMP= <proc.py>
##$REVERSE= no
##$SF= 400.02
##$SI= 32768
##$SIGF1= 0
##$SIGF2= 0
##$SINO= 400
##$SIOLD= 32768
##$SPECTYP= <>
##$SREGLST= <1H.CDCl3>
##$SSB= 0
##$STSI= 32768
##$STSR= 0
##$SW_p= 8223.68421052631
##$SYMM= 0
##$S_DEV= 0
##$TDeff= 65536
##$TDoff= 0
##$TI= <>
##$TILT= no
##$TM1= 0
##$TM2= 0
##$TOPLEV= 0
##$USERP1= <user>
##$USERP2= <user>
##$USERP3= <user>
##$USERP4= <user>
##$USERP5= <user>
##$WDW= 1
##$XDIM= 32768
##$YMAX_p= 460924458
##$YMIN_p= -666218
##$CURPLOT= <Network HP LaserJet P1505>
##$CURPRIN= <$Network HP LaserJet P1505>
##$DFORMAT= <normdp>
##$LAYOUT= <+/1D_H.xwp>
##$LFORMAT= <normlp>
##$PFORMAT= <normpl>
##$SURQMSG= 1
$$ End of Bruker specific parameters
$$ ---------------------------------
##NTUPLES= NMR SPECTRUM
##VAR_NAME=  FREQUENCY,     SPECTRUM/REAL,   SPECTRUM/IMAG
##SYMBOL=    X,             R,               I
##VAR_TYPE=  INDEPENDENT,   DEPENDENT,       DEPENDENT
##VAR_FORM=  AFFN,          ASDF,            ASDF
##VAR_DIM=   32768,         32768,           32768
##UNITS=     HZ,            ARBITRARY UNITS, ARBITRARY UNITS
##FACTOR=    0.250966925370066, 1,           1
##FIRST=     8223.43324360094, 223742,       -120943
##LAST=      0,             120958,          -208901
##MIN=       0,             -666218,         0
##MAX=       8223.43324360094, 460924458,    0
$$ Real data points
##PAGE= N=1
##DATA TABLE= (X++(R..R)), XYDATA
$$ [...]
19544B16364d9484a2378l8968I6835L2671b08625d1775B38919g5397k05788B270
19532e4899I2553p798K16924B4775a79365G5892J15737b3705A12724D6806a23842
19520B5519c3844A08042b38043j8140h6587C1939M14861e5379k42900D297g8520
19508e1336l97590d7761A72590d9519A76481b87082B47914F7489L5681a45344
19497c59393e4474J677J7680l84502a92151R1554L6322O748m3201A8435L91047
19486D09482a00362A33849H494c61836J53521f8756L2967m2778k64686a0481E7115
19474C00947c56451a52831m1674G9202b66200A37216k7663h4461E5052A5172P3460
19463H8632a0720q2077j77625a06204b6571n3212G5013c6885A76625c22766g5470
$$ plain form
19544 216364 -49484 -12378 -51346 96835 129506 -208625 -41775 238919 -75397 -281185 2270
19532 -54899 92553 84755 301679 24775 -179365 75892 191629 -23705 112724 46806 -123842
19520 25519 -33844 108042 -238043 -256183 -86587 31939 446800 -55379 -298279 4297 -78520
19508 -51336 -448926 -47761 172590 -49519 176481 -287082 247914 67489 103170 -145344
19497 -359393 -54474 -52797 -35117 -419619 -192151 -100597 -64275 -57527 -100728 18435 409482
19486 409482 -100362 133849 8494 -361836 -208315 -68756 -35789 -78567 -343253 -10481 57115
19474 300947 -356451 -152831 -194505 79202 -266200 137216 109553 -84461 55052 15172 88632
19463 88632 -10720 -92797 -270422 -106204 -26571 -79783 75013 -36885 176625 -322766 -75470
19451F2643L8217d9315E00852B13841H8563a47962a1219F556M8750a46086o0204
19440b06290E5124a27960d7337k38543d0353l70588J02496B95350c2290n6599
19430h8889A63545D0667L5457f8989j68827r784m155a1278A38401c639B6640e3792
19417C0284L09497j31003b21951i8346B0935c82485A47364h8162m76780a2200
19406a09627b8177j57422k01324a56243P0922b270k45262F792h0823n0121A76961
19394B2906a50834j56165g7723j15705r5197A49425a12129F0346a17389N050F4216
19382A7943a40993k21374E4049a44356E6138a00773m4838C794a78253r27J4163
19371a65017m3708C4951a95530j9229g2230c4242A38839e91I5304c29051i5004
$$ plain form
19451 62643 100860 -49315 500852 213841 88563 -147962 -11219 6556 55306 -146086 -206290
19440 -206290 55124 -127960 -47337 -285880 -40353 -410941 -308445 295350 -32290 -88889
19430 -88889 163545 40667 76124 -68989 -237816 -247600 -251755 -11278 138401 -3639 26640 -53792
19417 30284 339781 208778 -221951 -98346 20935 -382485 147364 -88162 -564942 -12200
19406 -109627 -28177 -185599 -386923 -156243 -85321 -2270 -247532 6792 -80823 -130944 176961
19394 22906 -150834 -306999 -77723 -193428 -288625 149425 -112129 60346 -117389 -112339 64216
19382 17943 -140993 -362367 54049 -144356 56138 -100773 -145611 3794 -178253 -179180 -165017
19371 -165017 -208725 34951 -195530 -214759 -72230 -34242 138839 -591 95304 -329051 -95004
19359A83371a22022H0097J5458L24365c39101a8359B82327c8964I2308a31743
19348a21273M8440A14354D5172a41762e1033J0532A8889D303N1144c90636n783
19337c96419D047a25194b3151k7802B05315c7616j8111j41856J1795B11205c8637
19325A8499c38458a02546h353k19038C49234b46626P4099f7405F0029b3652J622
19314b2030J515j70185k9288E2540b41924C3389E876a00487A99072a58340m1321
19303a99661A52186a04879E892J27102g5194l7935j75947K3896J8879A39999b89813
19291c08512J04712E2500J98576G5410B648g7350A26355a04024k98976A04556
19280a38225A31326e7213o9986N3900j5247j93687a39676l20646K23328f7473
$$ plain form
19359 183371 -122022 80097 95555 419920 -339101 -18359 282327 -38964 92308 -131743
19348 -121273 -72833 114354 45172 -141762 -51033 -40501 18889 4303 55447 -390636 -396419
19337 -396419 4047 -125194 -23151 -50953 205315 -37616 -55727 -197583 -185788 211205 -38637
19325 18499 -338458 -102546 -8353 -227391 349234 -246626 -172527 -67405 60029 -23652 -22030
19314 -22030 -20515 -190700 -219988 52540 -241924 33389 5876 -100487 199072 -158340 -199661
19303 -199661 152186 -104879 5892 132994 -75194 -113129 -289076 -265180 -246301 139999 -289813
19291 -308512 -203800 52500 251076 75410 2648 -77350 126355 -104024 -403000 104556
19280 -138225 131326 -57213 -127199 -73299 -88546 -282233 -139676 -460322 -236994 -67473
19269A8020h210j43031A2265Q4683k4256a5284j30524e6139j48022O6591A62644
19257h7537F4718d365q2392b7303B66817d098k30411g5338k94170c2459j64171
19246a96630A54685g0754l6595k87522i4565A66077h6043o8282H2142j5170a58401
19234b03104j95271i7381H5657B8679a1113o751F2621f2366A03602c70802a73040
19222A24011c12191G0235a31724N9054k22781A90682b15185j82937a14493A07040
19211a9057r1606o3962G2436K02635q3413r4743A1804b50696j2670N8588A5599
19199I8192a58341r7196M2660D1002O5723b76732D2366R0077h7313k34689e9233
19187i2245A72429a52491l5765M2808f3616k66685f8474m0069c5510C23230a79020
$$ plain form
19269 18020 -8210 -151241 12265 96948 72692 -15284 -145808 -56139 -204161 -137570 162644
19257 -87537 64718 -4365 -86757 -27303 266817 -4098 -234509 -75338 -369508 -32459 -196630
19246 -196630 154685 -70754 -107349 -394871 -94565 166077 -86043 -154325 82142 66972 -158401
19234 -203104 -398375 -97381 85657 28679 -11113 -17864 62621 -62366 103602 -370802 -173040
19222 124011 -312191 70235 -131724 -72670 -295451 190682 -215185 -398122 -114493 107040
19211 -19057 -110663 -174625 72436 275071 191658 96915 11804 -250696 -263366 -204778 15599
19199 98192 -158341 -255537 -212877 41002 106725 -276732 42366 132443 -87313 -322002 -59233
19187 -92245 172429 -152491 -188256 -145448 -63616 -330301 -68474 -108543 -35510 323230 -179020
19175C5501d68153f0904I3772e604E0103a09408J4241l69443b27474G3635B3375
19163g9583a0272A03300l4638d7220D8423P3301l980b39718a15752j09609O1086
19152a64275j01806C3903a37008e3916D3136J11149b48593i9488m56441d0505
19141G2621a81524A10727m0930a20874A29730J11329P6154a02015C11546e0737
19130d79j27934r0507E2819i9050H5423P9269F280L7673c67534m8011a7458A26081
19117B87542f2432A15883b9036k99440h8721k98A140J19905O3877a00608A33175
19105C6853h6682l8681j56241C9245a52091p8505a91H5672c85239i5435d2747
19093b32944i3845n6059f1804l5423k10447h7817j75316O271Q8044F6719k0151
$$ plain form
19175 35501 -468153 -60904 93772 -5604 50103 -109408 -95167 -464610 -227474 73635 23375
19163 -79583 -10272 103300 68662 -47220 48423 121724 117744 -239718 -115752 -225361 -164275
19152 -164275 -266081 33903 -137008 -53916 43136 154285 -248593 -99488 -555929 -40505
19141 72621 -181524 110727 69797 -120874 129730 241059 317213 -102015 311546 -50737
19130 -479 -128413 -218920 52819 -99050 85423 164692 6280 43953 -367534 -415545 -17458 126081
19117 287542 -62432 115883 -29036 -328476 -88721 -89019 1140 121045 184922 -100608 133175
19105 36853 -86682 -125363 -281604 39245 -152091 -230596 -191 85672 -385239 -95435 -42747
19093 -232944 -93845 -149904 -61804 -97227 -307674 -87817 -263133 -256862 -168818 66719 46568
19082D6568M7589a32272b5838B2080b20296k40231B9079J50112L9955a90177n0255
19071b40432j38429A54440i4232C615c94215a14038M1541B53838c1473A55895
19060h60l09785i6085j29367h2652B27826l4330B0276K2712a99478j166E5924
19048I9344b22054g4063j85817B19329i8775A05150i2109A1434a74946l7211k3006
19037b35163g3718m8182H9656N2058i8932b9293l6184A33144e7963A61582n3102
19026A08480J23156h7780A41816b27691A2000P1252j7924f6162B19408J2312A732
19014G9074c2574l15991a18419k99925a87969A3397a17065j766n5503A06646b86594
19002a39971N8206A878a54941B15140H7468b70893A30397b3419j29465m4541d1356
$$ plain form
19082 46568 94157 -132272 -25838 22080 -220296 -460527 29079 179191 219146 -190177 -240432
19071 -240432 -378861 154440 -94232 3615 -394215 -114038 -72497 253838 -31473 155895
19060 -860 -310645 -96085 -225452 -82652 227826 193496 20276 42988 -199478 -200644 55924
19048 99344 -222054 -74063 -259880 219329 -98775 105150 -92109 11434 -174946 -212157 -235163
19037 -235163 -73718 -121900 89656 141714 -98932 -29293 -65477 133144 -57963 161582 108480
19026 108480 231636 -87780 141816 -227691 12000 83252 65328 -66162 219408 231720 1732
19014 79074 -32574 -348565 -118419 -418344 -187969 13397 -117065 -118831 -174334 106646 -286594
19002 -139971 -81765 1878 -154941 215140 87468 -270893 130397 -23419 -152884 -197425 -41356
18990g3507c5732l59417d6150A49872L4918b52071g75j52389K565A97966Q8368
18979B86334a09609A08876B706f6136A57500F6349a11229A20261c2001A26621
18968e781C72437d1513k07884C9846j7791g735k4889H0131J9178P615A501K41497
18956B42998b13939a3736C68493D106b69581a30629E9933a77002j51914F9878
18945d8629N212j56260A29593a07538j8629j58022A12149e89773A153b57349B49621
18933C3458a08305j07433G7690i0115B17351m9496b920B9465c20495J40427A10606
18921G608K92075e1897k30353k178K0575c0084j76149A42408B4746a56592k00520
18910c57112h1629a9899k21297f9035l02051C3599c13248a27037N7512D0638c375
$$ plain form
18990 -73507 -35732 -395149 -46150 149872 184790 -252071 -775 -153164 -150599 197966 286334
18979 286334 -109609 108876 2706 -66136 157500 66349 -111229 120261 -32001 126621
18968 -5781 372437 -41513 -249397 39846 22055 -7735 -32624 80131 99309 106924 1501 242998
18956 242998 -213939 -13736 368493 4106 -269581 -130629 59933 -177002 -328916 69878
18945 -48629 -43417 -199677 129593 -107538 -126167 -284189 112149 -589773 1153 -257349 249621
18933 33458 -108305 -215738 77690 -90115 217351 167855 -2920 29465 -320495 -180068 110606
18921 7608 299683 -51897 -282250 -284428 -263853 -30084 -206233 142408 24746 -156592 -357112
18910 -357112 -81629 -19899 -241196 -69035 -371086 33599 -313248 -127037 -69525 40638 -3375
18898a74671f6904B1469a36555d2848k53294m9062A20097K08967D4426b418q5505
18887h7923A9847a83660A24643A5467f0017l0780n0447l9183C29569j09946a38713
18875b66911C84b7033j96935A23274g0639A68411F353J31027f6329r9669d58j5837
18863a6295C67356a15804k334B3032e2130b1599B08037b4691k2651B55867a38483
18851d5414B716K04887c8452j1786k09103e7249A28291i7978j09951R5942H9072
18839a18943j47554Q0008D54330b94613J14564Q1128C64718A69244a34988A2739
18828B55650C9524a0371B3779J3257b64775J31723c3542B14234a31323A68740
18817A43820E356L48561j04522J25989g9206n6326B34347J50798A82733G300J51832
$$ plain form
18898 -174671 -66904 21469 -136555 -42848 -296142 -345204 120097 329064 44426 -2418 -87923
18887 -87923 19847 -183660 124643 15467 -60017 -90797 -141244 -180427 329569 219623 -138713
18875 -266911 384 -27033 -223968 123274 -70639 168411 6353 137380 -66329 -165998 -458 -16295
18863 -16295 367356 -115804 -118138 23032 -52130 -21599 208037 -24691 -47342 255867 -138483
18851 -45414 2716 207603 -38452 -50238 -259341 -57249 128291 -97978 -207929 -111987 89072
18839 -118943 -266497 -186489 454330 -294613 -180049 -98921 364718 169244 -134988 12739
18828 255650 39524 -10371 23779 37036 -264775 -133052 -33542 214234 -131323 168740
18817 143820 5356 353917 249395 375384 -79206 -135532 234347 385145 182733 7300 159132
18806A59132J26993m1425q5583B2066a01623C4205b73849A80716d12752G2791
18795a10535o609K228m31754g2685k22404R3470M9615A1106J51964D671b32981
18783A71873d88527G5098a30288Q375A05686a7544B02307c24205J33835a6736
18772E3934a58014A30522N0029F126a65292A87407c6488j09886k040j6039M9606
18761a14847J6492j20850A96952a05233E8146b61005d398B86850A40301a76435
18750A8282a7157l52050A52932b88155A15395J64321p3124a03739D5678a24774
18739b48806A70096K83959d1205B3996a2149j96452P8689I2842a31853f4719C7271
18727a69627C27411C1744a23660B9118a25557k86997a47674d4684k95651B7603
$$ plain form
18806 159132 286125 244700 159117 22066 -101623 34205 -273849 180716 -412752 72791
18795 -110535 -117144 -114916 -546670 -72685 -295089 -201619 -152004 11106 163070 4671 -232981
18783 171873 -488527 75098 -130288 -121913 105686 -17544 202307 -324205 -190370 -16736
18772 53934 -158014 130522 180551 6126 -165292 187407 -36488 -146374 -148414 -164453 -114847
18761 -114847 -98355 -219205 196952 -105233 58146 -261005 -4398 286850 140301 -176435
18750 18282 -17157 -369207 152932 -288155 115395 279716 206592 -103739 45678 -124774
18739 -248806 170096 454055 -41205 23996 -12149 -208601 -129912 92842 -131853 -64719 37271
18727 -169627 327411 31744 -123660 29118 -125557 -412554 -147674 -44684 -340335 27603
18716A00084c36181I7925i2581G111J45879a55414m3024B17595b41542b3133k40768
18705b63901A3310b95741B6936J75947B7457g8342D1636b70811A73430a79073
18694a96976f5701A14416b09294j44275g4719q0197k44051P4037B00457a64617
18683F0011J28315i5325B50810i0144K1541A73459a51496A50473l2801L7127c69958
18671b74283H8966b42624i0023A80333b0553j77830K4944k99459A46591P1861
18661B18452C4966a03399o7780A92349h1933k92167k20339f833A88193i9554j93483
18650b93037A22510a60931f4614j06406J7459k51890a3971j33437K4713C03054
18639E9417p669f4171K3078j18512A3666a6074A79092K812a72384D7648j518b93482
$$ plain form
18716 100084 -336181 97925 -92581 7111 152990 -155414 -198438 217595 -241542 -23133 -263901
18705 -263901 13310 -295741 26936 202883 27457 -78342 41636 -270811 173430 -179073
18694 -196976 -65701 114416 -209294 -353569 -74719 -154916 -398967 -324930 200457 -164617
18683 60011 188326 -95325 250810 -90144 -68603 173459 -151496 150473 117672 154799 -369958
18671 -274283 88966 -242624 -90023 180333 -20553 -198383 -173439 -472898 146591 218452
18661 218452 34966 -103399 -171179 192349 -81933 -374100 -594439 -6833 188193 -99554 -293037
18650 -293037 122510 -160931 -64614 -171020 -153561 -405451 -13971 -147408 -122695 303054
18639 59417 51748 -64171 -41093 -159605 13666 -16074 179092 181904 -172384 47648 46130 -293482
18626a44038k59801b7271l04712J13417E809M6532J61237h9161j78524J4873B18509
18614b7187q8591m6890A4067K7910a79565G180J15168a0870B48674e9005j24287
18603a83292b3047j13416e0180D3157b97963K3831J03726P7393H1420h5693C70372
18591H7885b8390k64826A05351f3425D72795b39809a7821A10171a75063h1168
18580a1980l4699g740A38790F4553Q0216e1792A38230J03499e7202n543k91945
18569c54690A27022B8589J44093O7520b82288E2326J01467Q242C9457J0171c27119
18557B73498o8885a80450h3668C53276a487n31292A15559c8315k2426l90440i3033
18545B46004b3107n7833l231G5460P379a16066M5875j3317F2926a09938j46062
$$ plain form
18626 -144038 -403839 -27271 -331983 -218566 5809 52341 213578 -89161 -267685 -252812 218509
18614 -27187 -115778 -162668 14067 41977 -179565 7180 122348 -10870 248674 -59005 -183292
18603 -183292 -23047 -136463 -50180 43157 -297963 -274132 -170406 -93013 81420 -85693 370372
18591 87885 -28390 -293216 105351 -63425 472795 -239809 -17821 110171 -175063 -81168
18580 -11980 -46679 -7740 138790 64553 144769 -51792 138230 241729 -57202 -62745 -354690
18569 -354690 127022 28589 172682 240202 -282288 52326 153793 162035 39457 49628 -327119
18557 273498 204613 -180450 -83668 353276 -1487 -532779 115559 -38315 -60741 -451181 -93033
18545 246004 -23107 -80940 -84171 75460 82839 -116066 -70191 -83508 62926 -109938 -256000
18534b56000J23733A68874p1720c70029B1005b59796J13369H2779J7861J3639
18524A14279J43674e4364P421k26454F6292b22487A61734i7747j25108o5796o1184
18513c49835C6363J42928e2483k98870B03911b3249A19462c0365F6258I148h9643
18501b82828B44029c40691G2434l2425O3422a50774C33723d7806A0720g6773o3325
18490a40098k8028o3153P1140j56342J28064n4182F1880b4351A02108b06463k40308
18479d46771A18721a6078k72658C5087a38840j64875a09780d3246k1975k04910
18469b70131A8197g729A1658b12659G7872a31994k17122a54278C1076O326d2036
18457D7477J45613A4271R4753h0535n0996o8390A19762Q3151g3498G6171J2578
$$ plain form
18534 -256000 -132267 168874 97154 -370029 21005 -259796 -146427 82779 100640 114279
18524 114279 257953 -54364 -46943 -273397 66292 -222487 161734 -97747 -222855 -288651 -349835
18513 -349835 36363 179291 -52483 -351353 203911 -23249 119462 -30365 66258 9148 -89643
18501 -282828 244029 -340691 72434 40009 103431 -150774 333723 -47806 10720 -76773 -140098
18490 -140098 -168126 -231279 -160139 -316481 -188417 -242599 61880 -24351 102108 -206463 -446771
18479 -446771 118721 -16078 -288736 35087 -138840 -303715 -109780 -43246 -65221 -270131
18469 -270131 18197 -7729 11658 -212659 77872 -131994 -349116 -154278 31076 37402 -42036
18457 47477 193090 14271 109024 -80535 -131531 -199921 119762 202913 -73498 76171 88749
18446H8749i5785n7729A55502c5769H9214c68556Q1566n8689a08168I7012C1432
18434a6929j7934l2172j61314A50613O9205a18664E2602b31740A56864Q5370d5529
18422a64441K3505a8812l02773d5130J6676N156C20848c5663l37168J46932P9512
18411a46387C6450a60156M7931k5500N3903A04914J30222r3904K8206d43091a2158
18399E6653N4986h2738J985r813K4433D1309h2496j33392l6589A96491H5075B2109
18386i2362o5466j8449c5754n0880H226b80347g4859k10171a39987f1562A54295
18374D0560K5890d03419B9013b15817d5952C4616J38625B4409J84965N8182a86254
18362f2290A5242J65563n9434n2319a97921a5030j41837d2810k22072p3179A6096
$$ plain form
18446 88749 -95785 -153514 155502 -35769 89214 -368556 -286990 -345679 -108168 97012 31432
18434 -16929 -34863 -67035 -228349 150613 219818 -118664 52602 -231740 156864 242234 -45529
18422 -164441 -140936 -18812 -321585 -45130 -28454 -23298 320848 -35663 -372831 -225899 -146387
18411 -146387 36450 -160156 -112225 -137725 -83822 104914 235136 141232 169438 -443091 -12158
18399 56653 111639 -82738 -80753 -90566 -66133 41309 -82496 -215888 -252477 196491 85075 22109
18386 -92362 -157828 -176277 -35754 -86634 8226 -280347 -74859 -285030 -139987 -61562 154295
18374 40560 66450 -403419 29013 -215817 -45952 34616 173241 24409 209374 267556 -186254
18362 -62290 15242 180805 121371 69052 -197921 -15030 -156867 -42810 -264882 -338061 16096
18350I7955m4873a45320N0974L1172D5153K9570b65067g9669B4633a68238p7858
18339b46096E8644c42997A26379a23266B45350c40937a60512H7952M245c43908
18328b34059c360k8377B43857e11843f1029j2969E6325L3604b40778c2362k21730
18317b54092b2376F3816a03738c1077B23755a6305j66902H2411a59586j4839F0380
18305b09270k8764B29265c7642a2994B84250e2111k8902A01354j592j3928Q659
18294I4493c0423B19880L2140c27007B4963B872J97472a87267B88293A22937a06219
18282E9456g2641B36336a32124j27310N8880L5706m9176c4159n1346l9835A08958
18270b09998j02990h250m16508a34091A29411J27058j28094n0904Q5397n5736
$$ plain form
18350 97955 53082 -145320 -94346 -63174 45153 74723 -265067 -79669 24633 -168238 -246096
18339 -246096 58644 -342997 126379 -123266 245350 -340937 -160512 87952 92197 -343908
18328 -234059 -3360 -31737 243857 -511843 -61029 -73998 56325 89929 -240778 -32362 -254092
18317 -254092 -22376 63816 -103738 -31077 223755 -16305 -183207 82411 -159586 -174425 60380
18305 -209270 -238034 229265 -37642 -12994 284250 -52111 -81013 101354 99762 85834 94493
18294 94493 -30423 219880 252020 -327007 24963 2872 200344 -187267 288293 122937 -106219
18282 59456 -72641 236336 -132124 -259434 -200554 -164848 -214024 -34159 -85505 -125340 108958
18270 -209998 -312988 -8250 -424758 -134091 129411 256469 128375 77471 162868 107132
18260A07132E460N8248b41245J19487e5461H2545b4237B08115a62305N9598l1634
18249a34341J0866d0552H172K54526h9992j5428c3012B00657k2333F2479C1164
18237a55494j07289a20615F007J06940b90073a30236F8346a4686C8508i6548C37868
18225b34992O3637P0314C12484c10206G2937d9053B21248b72007P6334B6301L0205
18214E6506b7969J1975I1385a07237A81946H0938a66605P3283c937j8100k9350
18203e1387e526I4609b47756e3470E0092Q9652b7677k6616D8920b98837J40149
18192a58688d1028j03280j06581C6255a17383o3181q2385a6287k43610H7092c24754
18180G958a02725D1981d8799B03077C7457M3825J61036a61976b1099B6350a28804
$$ plain form
18260 107132 5460 63708 -241245 -121758 -55461 82545 -24237 208115 -162305 -102707 -134341
18249 -134341 -123475 -40552 8172 262698 -89992 -105420 -33012 200657 178324 62479 31164
18237 -155494 -262783 -120615 6007 112947 -290073 -130236 68346 -14686 38508 -96548 337868
18225 -234992 -171355 -101041 312484 -310206 72937 -49053 221248 -272007 -195673 26301 56506
18214 56506 -27969 -15994 91385 -107237 181946 80938 -166605 -93322 -3937 -22037 -51387
18203 -51387 -5526 94609 -247756 -53470 50092 139744 -27677 -54293 48920 -298837 -158688
18192 -158688 -41028 -144308 -250889 36255 -117383 -180564 -262949 -16287 -259897 87092 -324754
18180 7958 -102725 41981 -48799 203077 37457 81282 242318 -161976 -21099 26350 -128804
18168f3467n8842b4718B55687e3287A03112a78705M8365d3437l04844f8682c4052
18156c58197A12296b9587j72729A76381b39769q7038C0477b73479A50850a57678
18145b22350A0009h404A41278J39271b2074A75779p7265B1508B453L118J44051
18134A49622a9501j23145D7280h560l4833A47072a224j43716o5841b8229j78616
18123b06845c0496o5279N537F5942R75N4491h2651B04405O6195K29089k15788
18112B83901j32597D3793L42532e5543j62535g4249C44491j45598a947D7230b0977
18100a21226C32733C7832M97890b64020A91271a89500B431a85243C27378a70908
18089f8331m40088d7639A68278m6888J83032c72327A8608b19549O923A93391e0756
$$ plain form
18168 -63467 -122309 -24718 255687 -53287 103112 -178705 -130340 -43437 -348281 -68682 -34052
18156 -358197 112296 -29587 -202316 176381 -239769 -326807 30477 -273479 150850 -157678
18145 -222350 10009 -8404 141278 280549 -22074 175779 98514 21508 2453 5571 149622
18134 149622 -19501 -142646 47280 -8560 -43393 147072 -1224 -144940 -210781 -28229 -206845
18123 -206845 -30496 -95775 -90238 65942 66917 121408 -82651 204405 270600 499689 283901
18112 283901 151304 43793 386325 -55543 -218078 -74249 344491 198893 -1947 47230 -20977
18100 -121226 332733 37832 535722 -264020 191271 -189500 2431 -185243 327378 -170908
18089 -68331 -508419 -47639 168278 121390 304422 -372327 18608 -219549 -212626 193391 -50756
18077b77510N7576R6723A4893N9995j0520k7390d7323B73813a23932B9930O4604
18066I4534b22941P7468I2437d06940c7811a2569A55974B6760f3983a9867D5167
18054a33181A44148C864K6769d9902j59533j22089b7803F5951L2778h3208p1955
18043a55163A27186D7228c08358g3204k526q161H5081a76817B27018c12532J0842
18032c01690E20814B8512M0587g9778j08728e5515A60966j1918a64728D934K3114
18021B8048K68247b34029A46264J2192b14017I0935a8405j70956H3061b34885
18010D4824L8975J0776A3873h3584m9412a722j66628M3269p7612f7930G9766h1054
17997c22806c5896j17179A46049A5948a82912P8972A10455J09498d64201a37210
$$ plain form
18077 -277510 -219934 -123211 14893 74888 64368 36978 -47323 273813 -123932 29930 94534
18066 94534 -222941 -145473 92437 -406940 -37811 -12569 155974 26760 -63983 -19867 45167
18054 -133181 144148 3864 30633 -49902 -209435 -331524 -27803 65951 98729 -83208 -155163
18043 -155163 127186 47228 -308358 -73204 -75730 -83891 85081 -176817 227018 -312532 -301690
18032 -301690 520814 28512 69099 -79778 -188506 -55515 160966 149048 -164728 4934 28048
18021 28048 296295 -234029 146264 158456 -214017 90935 -18405 -189361 83061 -234885
18010 44824 83799 94575 13873 -83584 -132996 -1722 -168350 -125081 -202693 -67930 79766 -81054
17997 -322806 -35896 -153075 146049 15948 -182912 -103940 110455 219953 -464201 -137210
17986a27044j49478A33023a706q5559m5819D9030a55116C215Q3133J54433b01497
17974A95110p4748b10646B30606J14487A7900g055A06773m1209J51124b33213
17963A2624M22322A58006p4206M0419d2108l02188d2945A65802m4485O8469j8091
17952A71695a75559E5367j6278g0899A41744J27180f8685p2415j9290G8975J8732
17941I7707a27483A6535c15047A8216J04534k7632K0332a90859C4236e20389a0985
17929c2579o651k08921F3475b52192C23414a4869j53089B56430A1816d495A99253
17917A15265a96543g7622l24382c5934A10949c7913D7444d87833a6983F1459J79810
17906B41269b497F5788f8962B49130b98969a10833F0006A5086b82845m755f9573
$$ plain form
17986 -127044 -276522 133023 -1706 -87265 -133084 49030 -155116 3215 86348 240781 -201497
17974 195110 120362 -210646 230606 345093 17900 -7055 106773 65564 216688 -233213
17963 12624 434946 158006 83800 124219 -42108 -344296 -42945 165802 121317 189786 171695
17952 171695 -175559 55367 39089 -70899 141744 268924 -68685 -141100 -160390 78975 97707
17941 97707 -127483 16535 -315047 18216 122750 95118 115450 -190859 34236 -520389 -10985
17929 -32579 -39230 -248151 63475 -252192 323414 -14869 -167958 256430 11816 -4495 199253
17917 115265 -196543 -77622 -402004 -35934 110949 -37913 47444 -487833 -16983 61459 241269
17906 241269 -2497 65788 -68962 249130 -298969 -110833 60006 15086 -282845 -287600 -69573
17894a71571M0039k03632h7568k304H7747c9546k0703k38960J19744c768j91235
17883a95003j13060A72334b84900A10592J52248G4141h44A89872a16135e5700
17872A08881B7948b86384C9617a91504A99444A4661b18774Q4171H3317b7315J3274
17861a4041A57739G8197n203J97274j02165g1158j08306A62298a31688B77642
17850C52820b5602I838K03732b1054B9281K33004n823q3345b63285C6970M08418
17839D45388c07963C9038L21268f0936b9437j92730H1539a6920j14492A36853
17828b82710B32896P9881h7604A24496a63019g924q9118I3955O8529f2254H3452
17816a60082c1450j55402A06209J19412j286h967j51262C4155K858c65421E7150
$$ plain form
17894 -171571 -131532 -335164 -87568 -89872 87747 -39546 -60249 -299209 -179465 -3768 -195003
17883 -195003 -308063 172334 -284900 110592 262840 74141 -844 189872 -116135 -55700
17872 108881 27948 -286384 39617 -191504 199444 14661 -218774 -134603 83317 -27315 -14041
17861 -14041 157739 78197 72994 270268 168103 -71158 -179464 162298 -131688 277642
17850 352820 -25602 9838 213570 -21054 29281 262285 256462 173117 -263285 36970 445388
17839 445388 -307963 39038 360306 -60936 -29437 -222167 81539 -16920 -131412 136853
17828 -282710 232896 312777 -87604 124496 -163019 -7924 -97042 93955 162484 -62254 83452
17816 -160082 -31450 -186852 106209 225621 224335 -8967 -160229 34155 37013 -365421 57150
17804g3279H8429a0176j50765A56360N1179F7349a40589O2816j10400i016m1063
17793e0079C58462g786H0647B0858K66215I0353a71010o917A04510K9521g8312
17781G3059j3912N1722c56949A26090a72709A26624k4424h970H9925J17619k9333
17770A78211g883j9695I5356N4050a06249C31989a30186A32156M6619a90567h9535
17758C9994b1123B85270a70055A32315m9370a26647j91884c1697Q177d091q0788
17747h4879L2001D3737e58944B3731J27393o4213C293c61206a77761q8270J16608
17736a49423C488f1848G9580P3466G3923b05657F6872J55433e5523A38344m1533
17725I6811M7788G779L24000e87j18841A54277b12440B74820a07259F4628a30611
$$ plain form
17804 -73279 88429 -10176 -160941 156360 207539 67349 -140589 -77773 -188173 -9016 -50079
17793 -50079 358462 -7786 80647 20858 287073 90353 -171010 -177927 104510 134031 -78312
17781 73059 59147 110869 -356949 126090 -172709 126624 102200 -8970 89925 207544 178211
17770 178211 -7883 -27578 95356 149406 -106249 331989 -130186 132156 178775 -190567 -89535
17758 39994 -21123 285270 -170055 132315 82945 -126647 -318531 -31697 -23520 -4091 -84879
17747 -84879 -52878 43737 -558944 23731 151124 86911 3293 -361206 -177761 -266031 -149423
17736 -149423 3488 -61848 79580 153046 73923 -205657 66872 222305 -55523 138344 96811
17725 96811 144599 7779 331779 -587 -119428 154277 -212440 274820 -107259 64628 -130611
17713I2061K32699j44991l6068e3965m6394c0721m7028B4957d5017I5168d365
17701A36089J15424a4711E3882a64299B20311r4878B0067L7820f6742F7372j5359
17690E2013c33j61996A03839D7133c29685E2446k2561K89012F3164e6703A62875
17678a84115A76238d4207A35518K0856j4040a53342c6138o8524A40606b23044
17667c49816a71437D61507A63765b0108E5660K43258a8810B52409F249J85214
17657A91463a96431j0117f6717A23831J49700a2442I7328C9651J60733a17736
17646C23854c7908B4030J6459J59627j2105a38348N5249H3604P1910K7308a93478
17634a32290B50048B484J32477c59033a61711C4910J6494b15791A5466a50738
$$ plain form
17713 92061 324760 179769 143701 -53965 -100359 -30721 -77749 24957 -45017 95168 -4365
17701 136089 251513 -14711 53882 -164299 220311 125433 20067 57887 -66742 67372 52013
17690 52013 -333 -162329 103839 47133 -329685 52446 29885 318897 63164 -56703 162875
17678 -184115 176238 -44207 135518 156374 142334 -153342 -36138 -104662 140606 -223044
17667 -349816 -171437 461507 163765 -20108 55660 298918 -18810 252409 6249 191463
17657 191463 -196431 -206548 -66717 123831 273531 -12442 97328 39651 200384 -117736
17646 323854 -37908 24030 40489 200116 188011 -138348 -83099 83604 155514 182822 -193478
17634 -132290 250048 2484 134961 -359033 -161711 34910 51404 -215791 15466 -150738
17623B38884K90043G3944a93556P6425D6250a02360D0313F342c8322A67571a54138
17611B18504i1381A44083J46281A32248J68822b27367C88932A31498K10500I2442
17600A96059f2609A92151b36185C27655i5536A03606J75484F9278g5447A4004
17589A89017e3176B70729b14287N0291b5270B17694a21455C10249r4673q8653
17579A26923b30053D4177L66047b05300R1481l1707l52327J06623D6914b3794
17568B01597r0474a20153A05717e1308j50154N5850a2997C51839C7348J53721
17558A91069a11042A34647j821b0302B48067Q2844l2734d42203B0899J26555b22873
17546C80502b10177B5303a72041A15106i9482D24742b39578B06068n7696M2821
$$ plain form
17623 238884 528927 73944 -193556 -117131 46250 -102360 40313 6342 -38322 167571 -154138
17611 218504 -91381 144083 290364 132248 301070 -227367 388932 131498 341998 92442
17600 196059 -62609 192151 -236185 327655 -95536 103606 279090 69278 -75447 14004
17589 189017 -53176 270729 -214287 -163996 -25270 217694 -121455 310249 215576 126923
17579 126923 -230053 44177 410224 -205300 -113819 -145526 -497853 -391230 46914 -23794
17568 201597 111123 -120153 105717 -51308 -201462 -145612 -12997 351839 37348 191069
17558 191069 -111042 134647 132826 -20302 248067 330911 298177 -442203 20899 147454 -222873
17546 380502 -210177 25303 -172041 115106 -99482 424742 -239578 206068 148372 191193
17536A91193a2908A93235h8904C67a8343r7756B180c3204j03352B13465r6855
17525A16610L6183f0353B20689i0716J2397B43094i6770F2947J5898K41379G0643
17513g3127L910j49495e6079e625F1862J45467h2569o699G9059j0816J98837G3126
17500a61219C01380b82409G799e7595D39431D0462K97408B5494J83578K13312
17490D22384A47107b49118A70449G5031P1727a17416A86338B8091J61864c2147
17479c68271A12975K46805A0552K48061i0425C68468J30395B09673B7169K0958
17469D8127J85665o4581J03913A6450e9734r6194A79268M1803j08741o248K07174
17458C13256m5220A8180J59064H1900J86921f641A71658K05781j11279K00291
$$ plain form
17536 191193 -12908 193235 -88904 367 -18343 -116099 2180 -33204 -136556 213465 116610
17525 116610 152793 -60353 220689 -90716 -78319 243094 -96770 62947 78845 320224 70643
17513 -73127 -69217 -218712 -56079 -5625 61862 207329 -82569 -89268 79059 68243 267080 73126
17500 -161219 301380 -282409 7799 -57595 439431 40462 337870 25494 209072 422384
17490 422384 147107 -249118 170449 75031 146758 -117416 186338 28091 189955 -32147
17479 -368271 112975 359780 10552 258613 -90425 368468 498863 209673 27169 48127
17469 48127 233792 169211 273124 16450 -59734 -155928 179268 221071 112330 106082 313256
17458 313256 268036 18180 177244 81900 268821 -6641 171658 377439 266160 466451
17448D66451K5601B38496J79831j11999q1085j07109a58488A33515D0403K86113
17438C26516A00366j635J61824g702D88698p9470A94170r3608C1557K90082P4313
17427C95952C0861K1652K40163j20291J82043c0233A12113M59798B21145p9173
17417A41972o5082J42189L7800M4786q6840G2724J2800J44249h5015A26302l2110
17406I4192J8558K32897j16501i9492A1709K46913p3425L6835A6486J98385M2592
17395B57463j11502J8272A7216a25929E8744L70700B01859K2205l9308D6967L67973
17384D14940C5695O4024j385K47826o0580R1424A03456J73333c054D34328j91191
17373B43137a07185A04399B2168J86535a00639C8670K60617q7165f547m6843j30738
$$ plain form
17448 466451 492052 238496 418327 306328 225243 118134 -158488 133515 40403 326516
17438 326516 100366 98731 260555 -7702 488698 409228 194170 100562 31557 321639 395952
17427 395952 30861 52513 292676 172385 354428 -30233 112113 571911 221145 141972
17417 141972 76890 219079 256879 301665 214825 72724 85524 229773 -85015 126302 94192
17406 94192 112750 345647 229146 -99492 11709 258622 185197 222032 16486 214871 257463
17395 257463 145961 164233 17216 -125929 58744 429444 201859 224064 184756 46967 414940
17384 414940 35695 99719 98334 346160 285580 377004 103456 276789 -3054 434328 243137
17373 243137 -107185 104399 22168 208703 -100639 38670 299287 212122 -6547 -53390 -184128
17362a84128b695B66592j20321C0292J07440J47870j11760l7046a38545A68727
17351g6299E03463j66876r8888P8786l1692m8584K03362A89011K33749A65264
17340B15804P2039o4264b66951A07141M71289B08996r8850K6372F0962A923K68482
17329B70405b12192C44502A5055K84991F3649K1543b42507A29099L35304k11382
17319B53021p8257k2166L9717M7878J99997j42228j25435i6215B98411m308A38371
17307E9595a15182G9397K07328E4121q286g3975C11119q2501c7944E2739J40033
17296A92772l5006g9864j48232a1923A8594L03578q6176b20322A87197c0204A57043
17284E04719G4996a52305B81130L8020o6884J28815d3145C64162N0547j75151
$$ plain form
17362 -184128 -2695 266592 146271 30292 137732 285602 173842 136796 -138545 168727
17351 -76299 503463 336587 237699 316485 284793 236209 439571 189011 422760 165264
17340 215804 287843 223579 -266951 107141 578430 208996 110146 136518 60962 1923 270405
17329 270405 -212192 344502 15055 300046 63649 85192 -242507 129099 464403 253021
17319 253021 174764 152598 192315 240193 440190 297962 172527 -96215 298411 294103 138371
17307 59595 -115182 79397 286725 54121 45835 -73975 311119 228618 -37944 52739 192772
17296 192772 157766 -79864 -228096 -11923 18594 322172 235996 -220322 187197 -30204 157043
17284 504719 74996 -152305 281130 319150 252266 381081 -43145 364162 414709 239558
17274B39558l3562b5817A99812O0102i6478A85636N1004c612D19111j87851a7514
17262A15160K00209r9145e4338Q218B16393p7725M2459a053A62921j6951K78289
17251D24259j02874A34907J1468D2413c8784A45204R9999q4834c3705A49846K9910
17240A79756q5940a28787C59989j69398C9019O6273L5720L35615k30422G0773
17229E9578K82045j57791M7525H2106M31520B47204l2182J76355A03307J70101
17219B73408N9735A09806j2740a12135A41210c4934C18209J76B9591N08994B65905
17207D14973J26240H719M31995B00908K05326j53873p5815J94948l6821m4353
17197B90320F6146L55197I375J71753n8207L43846k806A33891N6894M4473c9728
$$ plain form
17274 239558 205996 -25817 199812 259914 -96478 185636 236640 -3612 419111 231260 -17514
17262 115160 315369 216224 -54338 -46120 216393 138668 181127 -1053 162921 145970 424259
17251 424259 321385 134907 146375 42413 -38784 145204 245203 160369 -33705 149846 179756
17240 179756 93816 -128787 359989 190591 39019 105292 141012 476627 246205 70773
17229 59578 341623 183832 231357 82106 513626 247204 215022 391377 103307 273408
17219 273408 333143 109806 97066 -112135 141210 -34934 318209 318385 29591 538585 265905
17207 414973 541213 8719 440714 200908 406234 252361 176546 371494 334673 290320
17197 290320 66146 421343 9375 181128 122921 466767 463961 133891 190785 235258 -39728
17185A27279J63835J62802l0684q7689J16270c0112E1341K1475C1152A5356J45377
17174A60733L331J5401L50676j55342J79607k74899L75414k44151j67670J25557
17164C68657A72217N5373J2256a29706F69282A93313F8550e7524D48500r9658
17154C48842L0830j2806j6360l8457L2072E2023J51130p5327M39429j28210m5722
17143C93323A72745f3081B52209J76501K5839M0633k07508D4019M238N97449F488
17131D03969I0556N02054G6016J21635o2042J69655m6688K0880L0283l850j30680
17120A75209J83582j08952j06298J95393J86407O8620c9725F37586B32891J54933
17110C87824N37305c7477B86457J73871p229A19099L17285K27198k93385L8359
$$ plain form
17185 127279 291114 453916 423232 335543 451813 -30112 51341 72816 31152 15356 160733
17174 160733 164064 179465 530141 374799 554406 279507 654921 410770 243100 368657
17164 368657 172217 227590 239846 -129706 669282 193313 68550 -57524 448500 348842
17154 348842 379672 366866 350506 312049 344121 52023 203153 127826 567255 439045 393323
17143 393323 172745 -63081 252209 428710 454549 495182 287674 44019 48257 645706 6488
17131 403969 90556 592610 76016 197651 135609 305264 258576 279456 309739 305889 175209
17120 175209 358791 249839 143541 338934 525341 593961 -39725 637586 232891 387824
17110 387824 925129 -37477 286457 460328 453099 119099 436384 663582 370197 408556
17100D08556K30992B15409J17094l9047G6256P546K69550Q6533J57240k58490
17090C38635N6991K93471B99989m6781K20249K88506k43866j86893M5202L84987
17080G61393n0082k78313L810I8496L91408K275K48454B71497J07172r7612N10173
17069G91230C12889K95826N6092L7542k10180p8499K617L2462J80406l7867O5631
17058F56919p0852n2839j89665L62966j21026k2142N0097K04378k02328k81112
17048C34396K95773Q0816Q7398l81436J94590n4421n8263j01439r8201K24731
17038E23944J22673k67577J10819k8836K44964K6436P2779k1378B93467N59110
17028H52577l72645Q2420J13926K02399k18054O9111N8681L83712l90210q6422
$$ plain form
17100 408556 639548 215409 332503 293456 76256 83802 353352 439885 597125 338635
17090 338635 395626 689097 299989 253208 473457 761963 518097 331204 376406 761393
17080 761393 711311 432998 436808 98496 489904 492179 740633 271497 378669 281057 791230
17069 791230 312889 608715 664807 702349 492169 413670 416287 448749 629155 591288 656919
17058 656919 586067 533228 343563 706529 585503 563361 613458 817836 615508 334396
17048 334396 630169 710985 798383 416947 611537 557116 498853 397414 299213 523944
17038 523944 646617 379040 489859 461023 705987 732423 805202 783824 293467 852577
17028 852577 479932 562352 676278 878677 660623 729734 788415 1172127 781917 695495
17018F95495k62648L85332p3719o6034J42463j73954L12577k69155K46859l74222
17008E62994L53833l65777M50555L218j86638k8130M0834o849j93938L57206k01546
16997G85762j28365N6884K36196l18968k67505N83397j74296J20615q8969j07717
16987F97034P166L53302m38896J28425N7152J21493K93603l90061M0799l9040
16977H30977Q6721L04492m40815M21012m24577j97148L46304K4123n5213R4391
16967I90267J41781k68086K23149r8702j78179M37371m88146M94376m55023K74446
16957A073254m2279J59618j60448j11002J55729j8115j67687r6449M2216L00466
16947A135303j09183O1254o3869J196J58817J35637P5458p4585q7880j78979M01245
$$ plain form
17018 695495 432847 818179 744460 678426 820889 646935 959512 690357 937216 562994
17008 562994 916827 551050 1001605 1004823 818185 790055 830889 824040 630102 987308 785762
16997 785762 657397 714281 950477 631509 364004 947401 773105 893720 804751 697034
16987 697034 704200 1057502 618606 747031 804183 925676 1219279 829218 870017 830977
16977 830977 917698 1222190 781375 1202387 777810 580662 926966 951089 895876 990267
16967 990267 1132048 863962 1087111 988409 810230 1247601 759455 1253831 798808 1073254
16957 1073254 1030975 1190593 1030145 919143 1074872 1056757 889070 792621 834837 1135303
16947 1135303 1026120 1087374 1023505 1024701 1183518 1319155 1394613 1320028 1232148 1053169 1454414
16936A454414K35735k65853j76942k0495L25324m21466L06859k24490K79783l60697
16926A132172K23375j08240r3986K08469l3141K80050L625k08885J86387j39851
16916A449975K39393k66364K64415k57286J72900j10965K40517k0073j67295J67441
16906A712658k54672L32103Q0592J06962l15947L20482K9659j21900J01179j51812
16896A839304K16707j06294j10766Q4297j22741J82058M53728k72176m23609O12740
16886B353248n11515J28790k0960N02223J5673l10070N0306J56579J97634m01936
16876B159972L31960l39563K32409J04614n1165K23493j917N2464k44393N08312
16866B976186l48328N8315M79655l02246J38001J1875j2964K66788k35257K9777
$$ plain form
16936 1454414 1690149 1424296 1247354 1226859 1552183 1130717 1437576 1213086 1492869 1132172
16926 1132172 1355547 1247307 1153321 1361790 1328649 1608699 1612324 1403439 1589826 1449975
16916 1449975 1689368 1423004 1687419 1430133 1603033 1492068 1732585 1712512 1545217 1712658
16906 1712658 1457986 1790089 1870681 1977643 1661696 1982178 2011837 1889937 1991116 1839304
16896 1839304 2056011 1949717 1838951 1923248 1800507 1982565 2436293 2164117 1740508 2353248
16886 2353248 1841733 1970523 1949563 2451786 2467459 2157389 2207695 2364274 2561908 2159972
16876 2159972 2491932 2152369 2384778 2489392 2438227 2661720 2659803 2712267 2467874 2976186
16866 2976186 2627858 2686173 3165828 2863582 3001583 3013458 3000494 3267282 3032025 3061802
16856C061802k64104K44193J38050J17212N0386O7635j89997J11926K80590J889
16846C619582N1702k52554J26582L80933Q8054m56187O33669j7411K5846k19963
16836C980253J40848j15741K59930K84372n9750L3517J17417P125j4084l106N38078
16825E168859j1820j37801L55467P3632j05736L26906J12919L90527q5475m3902
16815F043576J89575L9315K06947m2771O55343l21134N62620p42968Q03381j30020
16805G263864M22434R3445P5901N58588k71106K70962L05066J98798j5706L47689
16795I249935J95810N6489O71661K5590J62216O08198j56784N97277K66662M21364
16785A2098418N67219j1623K77769M67588M65562K08444M80460N27263O91335
$$ plain form
16856 3061802 2797698 3041891 3179941 3297153 3347539 3415174 3225177 3337103 3617693 3619582
16846 3619582 3671284 3418730 3545312 3926245 4014299 3558112 4191781 4174370 4200216 3980253
16836 3980253 4121101 4005360 4265290 4549662 4489912 4523429 4640846 4647971 4633887 4630781 5168859
16825 5168859 5157039 5019238 5374705 5448337 5342601 5669507 5782426 6172953 6087478 6043576
16815 6043576 6233151 6272466 6479413 6436642 7091985 6770851 7333471 6590503 7393884 7263864
16805 7263864 7686298 7779743 7855644 8414232 8143126 8414088 8719154 8917952 8902246 9249935
16795 9249935 9445745 9502234 10173895 10199485 10361701 10969899 10813115 11410392 11677054 12098418
16785 12098418 12665637 12654014 12931783 13399371 13864933 14073377 14553837 15081100 15772435
16776A5772435M3857N61583Q45953J90937R99391L64974M88040J190910M40222
16767B0898302N14926R65076O05455Q57835J170360R13824J115320O97759J015666
16758B8754523J595479J333546J042563J919350Q50932J898569J464418K073074
16750D0932454J965309K078943K466880J840338K639455K549727L116354K824447
16742F0413907L238144L604450L625168M231784L968361M580076M435724N108969
16734I3206583N413076N652337N906859O248487O963301O217084O945700P076307
16726A43629734O932317O671868O404606O580031N446914M924417M145607L401526
16718A88137020K173468J005327j23466j413989k447109l296869m945797n147513
$$ plain form
16776 15772435 15816292 16377875 17223828 17414765 18414156 18779130 19267170 20458080 20898302
16767 20898302 21413228 22378304 22983759 23841594 25011954 25925778 27041098 27738857 28754523
16758 28754523 30350002 31683548 32726111 34645461 35496393 37394962 38859380 40932454
16750 40932454 42897763 44976706 47443586 49283924 51923379 54473106 57589460 60413907
16742 60413907 63652051 67256501 70881669 75113453 79081814 83661890 88097614 93206583
16734 93206583 98619659 104271996 110178855 116427342 123390643 129607727 136553427 143629734
16726 143629734 150562051 157233919 163638525 170218556 175665470 180589887 184735494 188137020
16718 188137020 190310488 191315815 191192349 189778360 187331251 184034382 179088585 173941072
16710A73941072o128200n992390p013474p059646o775738p247828o978919o866855
16702A19878022o360574o432228o324166n219173n627567m997227m703689m508974
16694G5704424l981689m265255l542395l415404l033892l047192k684007k716579
16686D9018011k260771k495563k101320k277774j575640j548520j866099j481425
16678C3410899j319643j615123j287132j037062j289580r33968j159871j147715
16670B3620805o27904j007111o21095j004991n92284m96680r57948n10982o38880
16661A7162930m55059p55126p93883o3859n64203m92173l08881l62678n22838
16652A2844230m03450k31246o66166k20502l94243L7568n52795q0947m85681k70241
$$ plain form
16710 173941072 167812872 161820482 154807008 147747362 140971624 133723796 126744877 119878022
16702 119878022 113517448 107085220 100761054 95541881 89914314 84917087 80213398 75704424
16694 75704424 71722735 67457480 63915085 60499681 57465789 54418597 51734590 49018011
16686 49018011 46757240 44261677 42160357 39882583 38306943 36758423 34892324 33410899
16678 33410899 32091256 30476133 29189001 28151939 26862359 25928391 24768520 23620805
16670 23620805 22992901 21985790 21364695 20359704 19767420 19270740 18312792 17801810 17162930
16661 17162930 16707871 15952745 15158862 15095003 14530800 14038627 13729746 13367068 12844230
16652 12844230 12440780 12209534 11543368 11322866 10928623 10966191 10413396 10332449 9846768 9576527
16642I576527n58184L17044k13088o83913J27060l52299l0896l3847m71927j1154
16632G665323l36051K25023n16656r3361n9649k79271l12915j86545J02922l77154
16622E831666r3985p8104J34092l50434j51083j12199K50449n12143k22579L31370
16612E027050N7861o06446k51k8212n1256n2810N0633k25985j55362J8193k5994
16601D007421j91467K24908m30780K20852j58583o0053L5926j06283Q4646l88768
16591C237819r031o652l58903J515M89228m76209m07006K89476L31685o3251m93278
16580B535393J98572J1859q0132R8606o4760l14223J36107k03364J22792M4593
16570B485443r7592k5087p4373N0081j63256Q4337j82861K43528j64927M18N9576
$$ plain form
16642 9576527 9018343 9335387 9122299 8438386 8565446 8213147 8182251 8148404 7676477 7665323
16632 7665323 7329272 7554295 7037639 6944278 6884629 6605358 6292443 6105898 6208820 5831666
16622 5831666 5737681 5659577 5793669 5443235 5292152 5179953 5430402 4918259 4695680 5027050
16612 5027050 5084911 4478465 4478214 4450002 4398746 4345936 4396569 4170584 4015222 4033415 4007421
16601 4007421 3815954 4040862 3610082 3830934 3672351 3612298 3648224 3541941 3626587 3237819
16591 3237819 3228788 3222136 2863233 2864748 3353976 2877767 2470761 2760237 3091922 3028671 2535393
16580 2535393 2733965 2745824 2665692 2764298 2699538 2385315 2521422 2318058 2440850 2485443
16570 2485443 2387851 2362764 2288391 2338472 2175216 2259553 2076692 2320220 2155293 2155711 2215287
16559B215287m56323J75051q6053L1502m5322O4863O0742p1921K68549l34097
16549A822278L31981j45921k23536L21710k18295q6608j35956J43663k08245N4610
16539A655681o2983K1958j49508L2165j56319J33946K28688k09014j22386j78481
16529A193747J59176L36266l10731N1967J41082k87821j17327R4754K16159m94759
16519I82513K17305J95511k08072j03926k0180M96974o54646J51416J16525k22452
16509I50968O28597m47874J16591m9236r1224j76762k22039M23237j27963K18101
16499A222396k06593J00389K8221j44194J83627k93050K05636p2902R2541l74496
16489G41575n4195J32676M6208j09263K32623j31114J63848j41711j50721L36745
$$ plain form
16559 2215287 1758964 1934015 1847962 1879464 1834142 1899005 1959747 1887826 2156375 1822278
16549 1822278 2154259 2008338 1784802 2106512 1888217 1801609 1665653 1809316 1601071 1655681
16539 1655681 1592698 1614656 1465148 1497313 1340994 1474940 1703628 1494614 1372228 1193747
16529 1193747 1352923 1689189 1378458 1430425 1571507 1283686 1166359 1261113 1477272 982513
16519 982513 1199818 1395329 1187257 1083331 1063151 1560125 905479 1056895 1173420 950968
16509 950968 1579565 1131691 1248282 1199046 1107822 931060 709021 1132258 1004295 1222396
16499 1222396 1015803 1116192 1144413 1000219 1183846 890796 1096432 1023530 1116071 741575
16489 741575 687380 820056 866264 757001 989624 858510 1022358 880647 729926 1066671
16479A066671D22623L38697N9682Q5053p1080j9721k1821m6111k217R0976k86790
16468E49291J66053j0660J93223k97569K60565J39420l65311J58619j11325j12210
16458E70096P5705J53713k07414p4787R3627r2517J39363J60629j84881A45603
16447E86805j6991K50003j05522R611o9205j21889K26385m5618N8697l29224n176
16436D37876K03229r4528j85627L34330j59620R3107J52681j75353j29291K91830
16426G68634l53585r3583O8878j90809J98786P587j1709l5803K87087k69378L94522
16415G70627k06697Q3143l18252K05024O1579j24368P1532J2665J38700k17347
16405D76606j19305K70070j29266n0955C7268L47753J2414g9081F61448k13561
$$ plain form
16479 1066671 422623 761320 821002 906055 834975 815254 793433 747322 745105 836081 549291
16468 549291 715344 704684 897907 600338 860903 1000323 635012 793631 682306 570096
16458 570096 645801 799514 592100 517313 610940 518423 657786 818415 633534 145603
16447 586805 569814 819817 714295 723906 654701 532812 759197 713579 772276 443052 437876
16436 437876 641105 546577 360950 695280 535660 628767 781448 606095 476804 768634
16426 768634 415049 321466 390344 199535 398321 405908 394199 358396 645483 376105 770627
16415 770627 563930 647073 328821 533845 595424 471056 542588 555253 693953 476606
16405 476606 357301 627371 498105 447150 37268 385021 397435 -79081 661448 447887
16395D47887B23911J10841m0174J94875K7500M5282k21234J30733A69294L41150
16385E10444J45115A45223K84699J8945j51482J71435k28754M0714q6273K50833
16375D45340B17938O7064K54556j62083A61246M95397J25791g9751C65472n1058
16365C14414G6003P6781J59898N6462j15316L30196B14702L42133k20688J76564
16355E12711j87981n4175J56849E2957K85364a3852B37591p5868G9359L12418
16345C91777L6220h4905B89934k9345K39410n7388k0936a3416I7381m8339M03129
16334D52171I2447L08379j03121r117J85995j62860M7818A76310Q1755K98624
16324E56689k11800l3820j5163A34920N9550J67681J6248r8986a16247D54921
$$ plain form
16395 447887 223911 334752 294578 489453 516953 562235 341001 471734 169294 510444
16385 510444 655559 145223 429922 448867 297385 468820 240066 280780 194507 445340
16375 445340 217938 285002 539558 377475 161246 656643 782434 -79751 365472 314414
16365 314414 76003 152784 312682 369144 253828 584024 214702 556835 336147 512711
16355 512711 324730 270555 427404 52957 338321 -13852 237591 161723 79359 391777
16345 391777 427997 -84905 289934 260589 499999 442611 421675 -13416 97381 49042 452171
16334 452171 92447 400826 297705 288588 474583 311723 359541 176310 258065 556689
16324 556689 344889 311069 295906 134920 194470 362151 378399 279413 -116247 454921
16313a8299D74759A02926O362j2886K98768j58229J54559j16363J60141b2948
16302A65174J61547o2224j9125E2018J02002J8481L45392A61932J37186O2012
16292C61130E9796a2542B23461K34773m6170a7680A43278R3064A03759a9423A06855
16280A91254B3821J69928B9039J36959J23688j43555k4779D9237J23894P1426
16270B44557l9522n5346k031J47150o6326b02332E44269c7717A64217G1327J60398
16259B31725j08063N4699M557a5087D3097f1875j58736B92369R4708j83197k1893
16248A81987m7865J11933D4932f3454C9282a47755B73293F7765a53578C02908
16237B58705e1970a5129B742g2018B14190D743J51433d9807J0459A66588k0185
$$ plain form
16313 -18299 474759 102926 109288 96402 395170 236941 391500 275137 435278 -22948
16302 165174 326721 264497 245372 52018 154020 172501 517893 161932 299118 361130
16292 361130 59796 -12542 223461 458234 412064 -17680 143278 236342 103759 -19423 106855
16280 191254 23821 193749 29039 165998 289686 146131 121352 49237 173131 244557
16270 244557 205035 149689 147658 294808 228482 -202332 544269 -37717 164217 71327 231725
16259 231725 123662 178361 182918 -15087 43097 -61875 -220611 292369 387077 203880 181987
16248 181987 134122 246055 44932 -63454 39282 -147755 273293 67765 -153578 302908
16237 258705 -51970 -15129 2742 -72018 214190 4743 156176 -49807 -39348 166588 146403
16226A46403n7327C9987h6649B66358B934a81740C6650b6472q5354B25127c0828
16214g1807B17989b6390q2067d7062B3085J82016a03955b8845H9781J94539I3538
16202a01220C4448K27401j1916I6233k5698B5384J50469J01792j37388d5201A69604
16190B35836E5071L10933A78727i1281B57642j17747O7375I3593J94181j14177
16180A73597K19180A47201d12764A68755R4143b10223N7503I6700a50688F7727
16169I192P1034e7514E7495a0542C34565c6753r3051A11591C1024J09756C1058
16157D28562b33116A82883f6722C67376a88259A75790j4930C6925a33286a2932
16146g7530C0406Q4053L71182A98520B4920R4780B0953b90753B36723c31502A59459
$$ plain form
16226 146403 89076 39987 -86649 266358 2934 -181740 36650 -26472 -111826 225127 -30828
16214 -71807 217989 -26390 -108457 -47062 23085 205101 -103955 -28845 89781 284320 93538
16202 -101220 34448 261849 249933 96233 70535 25384 175853 277645 140257 -45201 169604
16190 235836 55071 366004 178727 -91281 257642 139895 207270 93593 287774 173597
16180 173597 392777 147201 -412764 168755 262898 -210223 -152720 96700 -150688 67727
16169 9192 80226 -57514 57495 -10542 334565 -36753 -129804 111591 31024 140780 31058
16157 428562 -233116 182883 -66722 367376 -188259 175790 160860 36925 -133286 -12932
16146 -77530 30406 114459 485641 198520 24920 119700 20953 -290753 236723 -331502 159459
16134D3445b1116q5987C1068K38786f6986j33715a8700H6266A9073M3449d16066
16122A1481c1649j06931A3564J4811K73159g4322A9342a6811j9185L548j67014
16111a99462B36403o8096O5927h5506I4392D0123g0291B00286n2387b52068A22777
16099C66433n7382c58009g2097A86307J25601A44325c52281a37106H791a06932
16088B40331c41737B72239b86549e3914A33558b93520J04728C55976a98394N8798
16078a39596A37447E5620a11309B32563a45507D8201L7018Q8289J02504A16655
16067H3652a11940B44577B002K01387i8591A2513J92678l1319e3374p1837r5242
16056b20453b4650i691B54890H9958B2805M2971c55178A79799L9509F5982d23088
$$ plain form
16134 43445 -21116 -107103 31068 269854 -66986 -200701 -18700 86266 19073 62522 -416066
16122 11481 -31649 -138580 13564 28375 301534 -74322 19342 -16811 -35996 -32448 -199462
16111 -199462 236403 168307 234234 -85506 94392 40123 -70291 200286 147899 -252068 122777
16099 366433 309051 -358009 -72097 186307 311908 144325 -352281 -137106 8791 -106932
16088 240331 -341737 272239 -286549 -53914 133558 -293520 -188792 355976 -198394 -139596
16078 -139596 137447 55620 -111309 232563 -145507 48201 85219 173508 276012 116655
16067 83652 -111940 244577 2002 203389 -98591 12513 205191 173872 -53374 -125211 -220453
16056 -220453 -24650 -9691 254890 89958 22805 65776 -355178 179799 219308 65982 -423088
16044d752D3410a59729M1003A71711B9299c56333A20095c8182A7065a2797G265
16032F6775k126c22330B91826j11310n3761P880b54935F817e6268b4460A06397
16020a61383B07732A8083f2238A03260a6239l3651G3303a35838A02265c9743I1233
16008A72537a88001A59998a61795d5960G7886J39184b5009H2182b66222a18219
15997a31471c5193j90070I2636a372j11247q5284B50715c15218a3701F625a69093
15985a32259A19064J96265a28745D14010j70939f1938C48054o3870A12978m2030
15975G0948c5896o6277A84678a8707A3022b1913j23289P367k14355f1481E7093
15963A7492J30235b88005B51435a28450b9465k16191j39384m1659A84415K03703
$$ plain form
16044 -4752 43410 -159729 -118726 171711 29299 -356333 120095 -38182 17065 -12797 7265
16032 66775 64649 -322330 291826 180516 126755 134635 -254935 6817 -56268 -24460 106397
16020 -161383 207732 18083 -62238 103260 -16239 -49890 73303 -135838 102265 -39743 91233
16008 172537 -188001 159998 -161795 -45960 77886 217070 -25009 82182 -266222 -118219
15997 -131471 -35193 -225263 92636 -1372 -112619 -197903 250715 -315218 -13701 6625 -169093
15985 -132259 119064 315329 -128745 414010 243071 -61938 348054 284184 112978 70948
15975 70948 -35896 -102173 184678 -18707 13022 -21913 -145202 -137835 -352190 -61481 57093
15963 17492 147727 -288005 251435 -128450 -29465 -245656 -385040 -426699 184415 388118
15953C88118A25483a93464A52858a01890k77528P2452j73537J56375g724n4606
15943f2330j05664L5048I8348i625G5541a78176p7298B75157e6090m5444C1719
15931a55767B78551a76373e5625j99734N3471B39439A11274a12167j11507C5586
15920f230o4044A33591i7409n44031f3381k10528J04855B04808D6987J25497h9993
15908a12963B48675G2324g4774L3694A23661a19216o0704N9113B7702b67071G0441
15896a7460A17351L545b42141o5512A17562r9g0068M070n2934H9657B5766J18483
15884A44249B0342M0435a24537B51405b45898N9191F9641I464a95418d8850j0685
15873e9535n2208b294k24081H6466a52019A2017K85406c36986J58635e4497q5140
$$ plain form
15953 388118 125483 -193464 152858 -101890 -379418 -306966 -480503 -324128 -7724 -62330
15943 -62330 -167994 -132946 98348 -9625 75541 -178176 -255474 275157 -56090 -101534 31719
15931 -155767 278551 -176373 -55625 -255359 -201888 239439 111274 -112167 -223674 35586
15920 -6230 -70274 133591 -97409 -641440 -63381 -273909 -169054 204808 46987 172484 -89993
15908 -112963 248675 72324 -74774 -41080 123661 -119216 -179920 -120807 27702 -267071 70441
15896 -17460 117351 120896 -242141 -307653 117562 117463 -70068 -65998 -118932 89657 25766 144249
15884 144249 20342 60777 -124537 251405 -245898 -186707 69641 9464 -195418 -48850 -59535
15873 -59535 -111743 -2294 -226375 86466 -152019 12017 297423 -336986 -178351 -54497 -139637
15862a39637G10j08K23323a31288k9231n8202i4110n0673A42915O5625c5461k89100
15850c24561B60031r8506i7700j65391K2536L3391j01193B42250a44472h031F7762
15838A01698Q961a52465e7061L300G3585J65111A9177a30238A08114L6216e2681
15826e3468E883b21147A06513a15480k92785a2293j10496m83596C6343K22406
15816B58749a77791A58523a2898k26971B51511c49151J73080o9310g957A45353
15805G2079a50760e4074E8996a62598j06258A61427i3970j31957E7620g5545D34272
15793a6181E7260b4511n5218j11626n5755Q9071G4126A576a40510E4966k6809
15782B8157a55720h813o2112k46865A2425a25866K1083j20898A95476B5269J8004
$$ plain form
15862 -139637 710 602 223925 -131288 -160519 -218721 -94110 -144783 142915 208540 -35461 -324561
15850 -324561 260031 161525 -97700 -263091 -240555 -207164 -308357 242250 -144472 -8031 67762
15838 101698 110659 -152465 -57061 -53761 73585 238696 19177 -130238 108114 144330 -52681
15826 -53468 5883 -221147 106513 -115480 -408265 -12293 -122789 -606385 36343 258749
15816 258749 -177791 158523 -12898 -239869 251511 -349151 -176071 -245381 -7957 145353
15805 72079 -150760 -54074 58996 -162598 -268856 161427 -93970 -225927 57620 -75545 434272
15793 -16181 57260 -24511 -79729 -191355 -247110 -158039 74126 1576 -140510 54966 28157
15782 28157 -155720 -8813 -70925 -317790 12425 -125866 -104783 -225681 195476 25269 43273
15771D3273I272a00629j4153b8845m04521J54744a19913l0706g3952m2770a6454
15759C4804Q3580b10171C96576A61924b21694P2182i943E8437d5031B32933a73058
15747h4658j05821J3305I9695J47292d13441f4870a7648r0860c9454A09521p788
15736A01733J44041A02453a29506I3662g0617R861A96981J2518e45621J66935
15726c78686D7583c201k31107a1246o5131G9381a0862n028H3829J2745b15001
15714A16283a10728m9758B52172k790b38961F8940b00608R4172j54739I3142a31163
15702a65432k3663M9904K7204d4611j19152C1182a89747C05033M4933G6215K23327
15691B99542K0594A31667g0930a5666F4025J05134R1436a67067F0654b75041a707
$$ plain form
15771 43273 9272 -100629 -114782 -28845 -433366 -278622 -119913 -150619 -73952 -116722 -16454
15759 34804 118384 -210171 396576 161924 -221694 -149512 -9943 58437 -45031 232933 -173058
15747 -84658 -190479 -177174 99695 246987 -413441 -64870 -17648 -108508 -39454 109521 101733
15736 101733 245774 102453 -129506 93662 -70617 -60756 196981 209499 -545621 -378686
15726 -378686 47583 -3201 -234308 -11246 -76377 79381 -10862 -15890 83829 96574 -215001
15714 116283 -110728 -160486 252172 249382 -238961 68940 -200608 -106436 -261175 93142 -131163
15702 -165432 -189095 -139191 -111987 -44611 -163763 31182 -189747 305033 349966 76215 299542
15691 299542 320136 131667 -70930 -15666 64025 169159 260595 -167067 60654 -275041 -1707
15679A03943Q4002a29947A06766P1176D9212g1467j26131j10445G4991i0117A8910
15667a48507B3408e9850j56193c484k77723A80376P7853a12162A61191a3241C60556
15655a07221A86201a49410A5944J83180h5631m7547O6334H8669a16144C9361c71203
15643C76579a62363m4185o8065E6081i8766o0985K5736N74j70613A9224g7967
15631A72260c8682B06350D5898a48382N3560A08818b17811R261a7097k20257E2993
15619H1092J4047f9681F4845b64836N2611K4931G1139b12982D4303d4458o6059
15608a10517k5772I1504b15767J7370M0286C0559a23212C01729c24031g2327A02675
15596b3347A11178h9692J9587A63576m4549K12509j36757a32888d973A39229f6077
$$ plain form
15679 103943 187945 -129947 106766 177942 49212 -71467 -197598 -308043 74991 -90117 18910
15667 -148507 23408 -59850 -216043 -3484 -281207 180376 258229 -112162 161191 -13241 360556
15655 -107221 186201 -149410 15944 199124 -85631 -133178 -66844 88669 -116144 39361 -371203
15643 376579 -162363 -206548 -274613 56081 -98766 -159751 -134015 -133441 -304054 19224 -77967
15631 172260 -38682 206350 45898 -148382 -94822 108818 -217811 -208550 -17097 -237354 52993
15619 81092 95139 -69681 64845 -264836 -212225 -187294 71139 -212982 44303 -44458 -110517
15608 -110517 -136289 91504 -215767 -198397 -158111 30559 -123212 301729 -324031 -72327 102675
15596 -23347 111178 -89692 -70105 163576 119027 331536 194779 -132888 -4973 139229 -66077
15584b51809C78845I6167B4675b22223A86236p1900R7282d9242A53423G307a84241
15572C17781A07089b65095j70368B0612c1266b05G25g5699o2974F4957b13061
15560D1456J48584d268k32407A33113K3361j4697D4690i8838A16584a00725A69199
15548a5668A10433j3180b85677D0021a71321A11367D096a4703A12641Q0865L4976
15537B28482J8361b75005A7955a21324B9656c07704A93186J36302C2402e2418
15526g1704B19976a57866M8838k0694N1938F3179R4919J0484b9525j63760R3402
15515i9883A05613J42055a3107D02439D2390B1157b57140a11925k07707C42329
15504i8383k7564F2320a95633G3650M3394a65241B30999D8525a20206H711b3695
$$ plain form
15584 -251809 378845 96167 24675 -222223 186236 114336 211618 -49242 153423 7307 -184241
15572 317781 107089 -265095 -435463 20612 -31266 -205 725 -75699 -138673 64957 -213061
15560 41456 190040 -4268 -236675 133113 156474 141777 44690 -98838 116584 -100725 169199
15548 -15668 110433 97253 -285677 40021 -171321 111367 4096 -14703 112641 193506 228482
15537 228482 246843 -275005 17955 -121324 29656 -307704 193186 329488 32402 -52418
15526 -71704 219976 -157866 -109028 -129722 -77784 63179 158098 168582 -29525 -193285 -99883
15515 -99883 105613 247668 -13107 402439 42390 21157 -257140 -111925 -319632 342329
15504 -98383 -125947 62320 -195633 73650 117044 -165241 230999 48525 -120206 8711 -23695
15492b79480a26182N8560j70546i0580I5742l9247J40488H9814R7465F631a44233
15480I2701e7513a5086D9316a39809B2198a64579c751A24022b87995a41084A37270
15468a54665l5773L1296N4898A06601f4851B44110b15422g400A74796k0693F4058
15456c7986K715j53060A15727c59195a35634b5340D9267c9129k80941C04167A16893
15444B4468K71739I6772a35399I4479m2240a21286c4452k04067B83637E5405j8943
15433C6462K24256c31032B26607b7547A82871a53970B52324F7507K2483J15601
15423B05591a64826a8024C0779f7750A03101l7315a24418B18305i1554a0613C80266
15411a48454n6923A02694g2652k20369J04368B53600r2445b6357A63376b4029
$$ plain form
15492 -279480 -126182 -67622 -238168 -90580 95742 56495 196983 89814 187279 6631 -144233
15480 92701 -57513 -15086 49316 -139809 22198 -164579 -3751 124022 -287995 -141084 137270
15468 -154665 -190438 -159142 -104244 106601 -64851 244110 -215422 -7400 174796 154103 64058
15456 -37986 -35271 -188331 115727 -359195 -135634 -25340 49267 -39129 -320070 304167 116893
15444 24468 296207 96772 -135399 94479 52239 -121286 -34452 -238519 283637 55405 36462
15433 36462 260718 -331032 226607 -27547 182871 -153970 252324 67507 89990 205591
15423 205591 -164826 -18024 30779 -67750 103101 65786 -124418 218305 -91554 -10613 380266
15411 -148454 -205377 102694 -72652 -293021 -188653 253600 161155 -26357 163376 -24029
15400d4307l43746C85K21921l1272a03855A35687b8554A14296a51362r6553e2372
15388f5811A47756J16782E6143a53063A04249c1063A78928a74477g5528B51827
15377A95466a57809r2510n8013c7032j2397j61100Q8205E6358b50286A59527N3524
15366B13051f8228p5480A8849K76167a25963H0894P19L5170d8802B79140a37513
15354I9940a94374f1362A73289l3488m0392L5980d2788f577B75468F5396b5034
15342h2797A58480b16476A49236L09395A72436n760d817B86571a41541A05422
15331c32969E9123J6015d99401a57014A82357B5148e2415A5435K03639j696n0254
15320A67124G6173A8417c3452j27252B74725h9668p4988A03486o434p86B3397
$$ plain form
15400 -44307 -388053 385 222306 191034 -103855 135687 -28554 114296 -151362 -247915 -52372
15388 -65811 147756 264538 56143 -153063 104249 -31063 178928 -174477 -75528 251827
15377 195466 -157809 -250319 -308332 -37032 -49429 -210529 -122324 56358 -250286 159527 213051
15366 213051 -68228 -143708 18849 295016 -125963 80894 81613 116783 -48802 279140 -137513
15354 99940 -194374 -61362 173289 139801 99409 135389 -42788 -6577 275468 65396 -25034
15342 -82797 158480 -216476 149236 458631 172436 166676 -4817 286571 -141541 105422
15331 -332969 59123 75138 -499401 -157014 182357 25148 -52415 15435 219074 217378 167124
15320 167124 76173 18417 -33452 -160704 274725 -89668 -164656 103486 97052 96266 23397
15308e3162n1599A17105b3344B45492A14872b55773A3771a54422C23202A54680
15297a7237j37030A82138r0128e7341j10425L1486f6233B95152f4646p6141E4511
15285g3188i635B06916J6991a70546G6336b18955b5590q188C11909A35732J91554
15274C27286e9076A88275p0089e4468A58251b13801A91743D2820P2837A4723E12
15262C587g305m5571r49k224C65937j26067k3109n5546n6879J37003P3636a6097
15249h0864A25294P39818P05426q477j22854k39521E03333j03731o2269j48917
15239A88416J54222J09828i6540C66298B0039c8709B82830c18469I0370J44378
15229B34748a5400A42591b46466c0637C14835j13294k7534b8760E5027K21037
$$ plain form
15308 -53162 -104761 117105 -23344 245492 114872 -255773 13771 -154422 323202 154680
15297 -17237 -154267 182138 92010 -57341 -167766 -136280 -66233 295152 -64646 -140787 54511
15285 -73188 -9635 206916 223907 -170546 76336 -218955 -25590 -33778 311909 135732 327286
15274 327286 -59076 188275 118186 -54468 158251 -213801 191743 42820 115657 14723 512
15262 3587 -7305 -52876 -53825 -56049 365937 239870 216761 161215 104336 241339 314975 -16097
15249 -80864 125294 865112 1570538 1562061 1439207 1199686 503333 399602 337333 188416
15239 188416 342638 452466 -96540 366298 20039 -38709 282830 -318469 90370 234748
15229 234748 -15400 142591 -246466 -30637 314835 201541 174007 -28760 55027 276064
15219B76064F3248b7871C53359A6668F818J44189K637l2156M8237J03347e794
15207D3824K57800a07571E2898N0426e5674j69109f4879D3558a52020L9294C00721
15195I4842R4213o533N8980g681A09665J8047a00781B28239D1025M2160Q9219
15184A72404a14693b1816D84933a80086D6720O2561m4919J18097m1471c1167A5181
15172B61854A06894O5573B1759K92221H5952a712C21399a412k6929F2594L918
15161F6512c01108C8485P6285K33323M5880d8641p0832E1031J55965p3255g7803
15149F4397a88186J286C24302j6180n1623j1730H5587Q2296L60241A78001p7071
15138A00930C3983b23552C8551b4779A93611j7423P1622a17969a4542E7166k7199
$$ plain form
15219 276064 63248 -27871 353359 16668 6818 151007 153644 121488 169725 273072 -5794
15207 43824 301624 -107571 52898 103324 -55674 -224783 -64879 43558 -152020 -112726 300721
15195 94842 189055 182522 241502 -7681 109665 127712 -100781 228239 41025 83185 172404
15184 172404 -114693 -21816 484933 -180086 46720 109281 64362 182459 140988 -31167 15181
15172 261854 106894 172467 21759 313980 85952 -1712 321399 -1412 -28341 62594 66512
15161 66512 -301108 38485 114770 348093 393973 -48641 -119473 51031 206996 133741 -77803
15149 64397 -188186 -186900 324302 308122 256499 244769 85587 167883 528124 178001 100930
15138 100930 33983 -223552 38551 -24779 193611 176188 247810 -117969 -14542 57166 29967
15127B9967R1836J46932k2880B6892K6490K55292n8583J96206J90876G7338h3939
15115a3636F3757J75740A9674R8224B8923c7584C71370A38969A1769K55617b13076
15103A50676J1876L1500F9910j3313L256N4917L73194A17397I561L49980A10553
15091I0954B2669b1419D8656P9512R079O8418G7580J59167P6189j28169r2311
15080I2456O2660K79808a57491p2087A57666g7239A42396J37476L20217A41595
15069c2990G7764L19719A71102J63871j67144f0775B01270J22735j21628n5713
15059A46664j8968J64881o6013O7062o850R716j4630k820q1650K71426e0595A77168
15046B71157K10927C4365K79078A1427b04706g439D51715J24080G2757K39768
$$ plain form
15127 29967 121803 268735 245855 26892 53382 308674 250091 446297 637173 77338 -83939
15115 -13636 63757 239497 19674 117898 28923 -37584 371370 138969 11769 267386 -213076
15103 150676 162552 194052 69910 56597 59853 114770 487964 117397 9561 359541 110553
15091 90954 22669 -21419 48656 128168 137247 205665 77580 236747 312936 184767 92456
15080 92456 155116 434924 -157491 -229578 157666 -77239 142396 279872 600089 141595
15069 -32990 77764 397483 171102 334973 167829 -60775 201270 324005 202377 146664
15059 146664 127696 292577 226564 293626 286776 296492 281862 279042 197392 468818 -50595 177168
15046 271157 482084 34365 313443 11427 -204706 -7439 451715 575795 72757 312525
15036C12525A3766a26947B49267B6433J09215C4680K22861K5531A3181K85602
15026B98783h058A47649M0163O4741A9121L6755L63902j79055C9804K32284C5360
15014a97351B5176L15990A30782P2038j0402L51670A47326l9927K21678d0590
15003C06455k5314n6709j258H539N8999A3187L68359J18613A63269J81056l317
14992C41008A04916K85010k8486O1290b4437A84090J17010M5446A70312C2632
14981B91185J73299G843e3514A77138k8872i5866B02381K05650j56564j23777
14971A27690D2027N141O7147L79778B3945M9876k9712K27812p1340K2047r3854
14960A28774M3510J6068J55644E7089c9589D58725K1686A76823J21183p7691N7064
$$ plain form
15036 312525 13766 -126947 249267 26433 135648 34680 257541 283072 13181 298783
15026 298783 -8058 147649 187812 252553 19121 55876 419778 240723 39804 272088 35360
15014 -197351 25176 341166 130782 202820 192418 544088 147326 107399 329077 -40590
15003 306455 281141 224432 223174 8539 67538 13187 381546 500159 163269 344325 341008
14992 341008 104916 389926 361440 422730 -24437 184090 301100 346546 170312 32632
14981 291185 464484 7843 -53514 177138 148266 -95866 202381 408031 251467 127690
14971 127690 42027 47168 114315 494093 23945 73821 44109 271921 200581 222628 128774
14960 128774 172284 188352 343996 57089 -39589 458725 480411 176823 298006 220315 277379
14949B77379J7864J47507m1060J5835k9186A90994O370m8651M7665R196J67542
14938C73116j1924j72325G3452J33785J37782L02019j55914A24973L54050j13642
14928C65381j2440A00492J63833L51620C3783M17888k17504P7582O5136k0045
14918C56840l9710L4469j01I4978l4416B4869M33964M1573Q4732A27496K30526
14907C58022J29586j14811L748N8332m5667J9168j26461K62556o490A40100L38229
14896D78329A59559K21137Q3821j42288J22167j59341J14266K34262B86688A38596
14885A97622r5502K93387K60323B70442N9032M9181J79408A93611K0519M30663
14875F44793A53305L0181J15909K13004j35456j2137l575J62185j16388n35J20472
$$ plain form
14949 277379 295243 442750 401690 417525 388339 190994 197364 148713 196378 205574 373116
14938 373116 361192 188867 73452 207237 345019 647038 491124 124973 479023 365381
14928 365381 352941 100492 264325 615945 33783 451671 234167 311749 376885 356840
14918 356840 317130 351599 351498 94978 60562 24869 458833 500406 585138 127496 358022
14907 358022 487608 372797 376545 434877 389210 408378 281917 544473 537983 140100 478329
14896 478329 159559 380696 464517 322229 444396 285055 399321 633583 286688 138596
14885 197622 102120 395507 655830 270442 329474 378655 558063 193611 214130 644793
14875 644793 153305 183486 299395 512399 376943 364806 361231 523416 407028 406493 526965
14864E26965j41461A87107M8990K02431K56599l13213J9663j22851K76544j03298
14854D51972j62372G5338N57757q1344j38377L5773m271j1335j89550K00858P8105
14843E22954M5935j64028k3317j74272K45599K5065K45954k06722k19482N3232
14833C50918L46961k95380J37125K63563j0285C50100n6802J50252J91475B89070
14822A25776L62016k0972j0339K49098l4876k31863J73113R462N4948A48499M68487
14811F16986o5727j18718j18362J8880J83242O4890o597J60290j87607J12530
14801F59807A52548M46049o5110B10105N48576j57459Q913K28476j22111B20618
14790G46090j44386Q8314C31071k5761K82921K42102k93114j0570m2407J95275
$$ plain form
14864 526965 385504 187107 236097 438528 695127 381914 401577 278726 555270 451972
14854 451972 289600 75338 633095 551751 413374 449147 444876 433541 243991 444849 522954
14843 522954 568889 404861 381544 207272 452871 477936 723890 517168 297686 350918
14833 350918 697879 402499 539624 803187 792902 350100 293298 443550 635025 289070
14822 125776 487792 466820 456481 705579 670703 438840 611953 621415 676363 148499 616986
14811 616986 551259 432541 314179 333059 516301 581191 574594 734884 547277 659807
14801 659807 152548 598597 533487 210105 758681 601222 610135 838611 716500 220618
14790 746090 601704 690018 331071 305310 588231 830333 537219 526649 484242 679517
14780F79517J58247k40288j13820M43539l82647L0935J71200n679j49490n2641
14770E38873j48753J79934M9092L23945B58542K09122R1342J42863j03012k77686
14760C21171L49087k3689l22629L57420J26425j65163K7730P0966k95496N62575
14750A008397m03232K25357m04514L43718l0691j03933J48226j37380j5103j3205
14740F17640J25522m7673O9302k74534N15371l32885R5351K4817J51066k18595
14730G25382N79224o32400L30500l00326j73716O06164m16014J65458J84998m54869
14720F14401J59950P2863k85077K75490p6873k3928J45615j7571k16395P4139
14710G22614K22109j29542J94208j73602j97431M44169p4699o3379j45915N5635
$$ plain form
14780 679517 837764 597476 483656 927195 544548 575483 746683 741004 591514 538873
14770 538873 390120 570054 619146 943091 258542 467664 559006 701869 598857 321171
14760 321171 670258 646569 323940 681360 807785 642622 670352 741318 445822 1008397
14750 1008397 605165 830522 426008 769726 739035 635102 783328 645948 630845 617640
14740 617640 743162 695489 764791 490257 1005628 672743 768094 792911 943977 725382
14730 725382 1304606 672206 1002706 702380 528664 1134828 718814 884272 1069270 614401
14720 614401 774351 847214 562137 837627 760754 736826 882441 864870 648475 722614
14710 722614 944723 815181 1009389 835787 638356 1082525 1007826 944447 798532 854167
14700H54167L16826j20016k28355N3617L10480k19675n5425k46633K77346K01491
14690A143823K5911j91268k84159L67445k04275J32106L71108p060n73586L24614
14680A104659l81702M13200k81245J06874l391J73312k62854L27701m32147M39551
14670A203958j41393p53n0067M41219l47939N4288K32409J9330n02440L32347
14660A240959j47948L6559j17725L94702m10609M98722j85064j39361M4057o6696
14650A147596k06431K23493K51473Q8873n59764N62267L1524l34402L65033o05058
14640I64604N63256k73238K35963l54456L29946m43788O97934m20757q9273P6338
14630A286529K13512k46557L48410k07542j7998R4711j6229j87392J50672J28934
$$ plain form
14700 854167 1170993 1050977 822622 876239 1186719 967044 911619 664986 942332 1143823
14690 1143823 1169734 978466 694307 1061752 857477 989583 1360691 1353631 780045 1104659
14680 1104659 722957 1136157 854912 961786 958395 1131707 868853 1196554 764407 1203958
14670 1203958 1062565 1061812 1011745 1452964 1105025 1159313 1391722 1411052 908612 1240959
14660 1240959 1093011 1129570 1011845 1406547 995938 1494660 1309596 1170235 1214292 1147596
14650 1147596 941165 1164658 1416131 1505004 945240 1507507 1539031 1204629 1569662 964604
14640 964604 1527860 1254622 1490585 1136129 1466075 1022287 1720221 1299464 1210191 1286529
14630 1286529 1500041 1253484 1601894 1394352 1376354 1471065 1454836 1267444 1418116 1547050
14620A547050K50860m00944K71075O4821m73844L21213L11919j96455j07260M3153
14610A631588o8762M7660j51808L06614j69703J72926J94232k57027N3665j61927
14600A597458q5410K89638J9685M41523o30866K71858l91509K81118L22670n54428
14590A561737K54632K6122J51574l11185J22781k8394N66528k61458j97650m7418
14580A837269K37532J72551j74623j87119L13061P5025j18804p1401M1493L95157
14570B520141j40538K19949j3900j94898K25325l30190K79200J54989K08748J2622
14560B941448P1175K14802J38781r3712q5746P19877l91402L26207M09495R68164
14550E219089P59943J998130L744851R191120J8159715M945205k1238618j0684363
$$ plain form
14620 1547050 1797910 1396966 1668041 1732862 1259018 1580231 1892150 1695695 1588435 1631588
14610 1631588 1562826 1610486 1458678 1765292 1595589 1768515 1962747 1705720 1759385 1597458
14600 1597458 1512048 1801686 1821371 2262894 1632028 1903886 1512377 1793495 2116165 1561737
14590 1561737 1816369 1842491 1994065 1682880 1805661 1777267 2343795 2082337 1884687 1837269
14580 1837269 2074801 2247352 2072729 1885610 2198671 2273696 2154892 2083491 2124984 2520141
14570 2520141 2379603 2599552 2585652 2390754 2616079 2285889 2565089 2720078 2928826 2941448
14560 2941448 3012623 3227425 3366206 3272494 3186748 3906625 3515223 3841430 4250925 5219089
14550 5219089 5979032 7977162 11722013 20913133 39072848 44018053 22779435 12095072
14542A2095072n762260k638283o90113n39376m16508j5352R2515J02402L7447
14533B265544r8280m020M29693l81746l9997j45716K71149K72973L20353k95279
14523B594674k83767J78044p7473K84854P1508n6881q9440M40148m10453N17795
14513C169009l83540L52929l57771J22808k85300M39732L10956l05869M4788k24176
14503B883566L99616j29084L02854k75447J22085J2485n1896K88735J82378N6511
14493C791803l51670J33698L24631j89465o8189J38474j83132L95836j44723j45545
14483C701718J20569m1839N08198N9887l27914J90038n8367J65934P6113J4301
14473D408638J70023k63621J8593j53351K97235O1981L01057j84090J90278k79302
$$ plain form
14542 12095072 6332812 3694529 3004416 2465040 2048532 2033180 2125695 2228097 2265544
14533 2265544 2167264 2163244 2592937 2211191 2171194 2025478 2296627 2569600 2889953 2594674
14523 2594674 2310907 2488951 2411478 2696332 2767840 2710959 2621519 3061667 2651214 3169009
14513 3169009 2785469 3138398 2780627 2903435 2618135 3057867 3368823 3062954 3107742 2883566
14503 2883566 3283182 3154098 3456952 3181505 3303590 3316075 3264179 3552914 3735292 3791803
14493 3791803 3440133 3573831 3898462 3708997 3640808 3779282 3596150 3991986 3847263 3701718
14483 3701718 3822287 3780448 4288646 4348533 4020619 4210657 4152290 4318224 4394337 4408638
14473 4408638 4578661 4315040 4333633 4180282 4477517 4539498 4840555 4656465 4846743 4567441
14463D567441j28748L12543M18145j75194O9480K78747J7833K06223l04426J55329
14453E417373k59997M86311j83967J19633J01189L19201j59415K05283M27742
14444F473353m02654K53697N3177M2080L84334j41744q5732J11925L35640N7077
14434G081153J8676K50491k10812L68108m14942M71242j93999L41782J12274j12986
14424G710987k9447L17959N13459k16455N21539q2092N0583K77187L41799l58698
14414I046821M51671j32541k5783L81166J28226K25948N0824m04708N67665M56746
14404A0746035m938K54102k16072J31347L79056M03280k31701O36620J81565R6960
14394A2376254L97128j86008N05456K07132J76362j14941O35103K0774J60068
$$ plain form
14463 4567441 4438693 4751236 5169381 4994187 5063667 5342414 5360247 5566470 5262044 5417373
14453 5417373 5157376 5643687 5459720 5579353 5680542 5999743 5840328 6045611 6473353
14444 6473353 6070699 6324396 6377573 6419653 6803987 6662243 6576511 6688436 7024076 7081153
14434 7081153 7099829 7350320 7139508 7507616 7092674 7563916 7369917 7711699 7823973 7710987
14424 7710987 7681540 7999499 8512958 8296503 8818042 8735950 8786533 9063720 9405519 9046821
14414 9046821 9498492 9365951 9340168 9721334 9849560 10075508 10126332 9721624 10289289 10746035
14404 10746035 10741097 10995199 10779127 10910474 11289530 11692810 11461109 12097729 12279294 12376254
14394 12376254 12773382 12587374 13092830 13299962 13476324 13361383 13996486 14017260 14177328
14385A4177328N02268R027K04730M94486L26017M96431n9118M68738k19485O82483
14375A7082905M43852K94568L24462K64043N97314K22591M34931J36500N47621
14366B0348787L13485K12608Q53008M67513N80061Q4633P16571P53678K78939
14357B4609283Q16185R37074J79589N68484L48237R27589Q64333K31932J186925
14348C0669631N8288J197966J044544O15070R24007J111527K44506J361278Q19378
14339C8046195J131892J239767P17198J747893Q30245J705875J545188J246072
14331D8210325J786262R69645J501213J884258J564773K023794K017389J789007
14323F1746666K016025K083949K851344J696087K799887K902794L336545K437268
$$ plain form
14385 14177328 14679596 14688623 14893353 15387839 15713856 16210287 16151169 16619907 16400422 17082905
14375 17082905 17526757 17821325 18145787 18409830 19007144 19229735 19664666 19801166 20348787
14366 20348787 20662272 20874880 21727888 22195401 22775462 22860095 23576666 24330344 24609283
14357 24609283 25425468 26362542 26542131 27110615 27458852 28386441 29250774 29482706 30669631
14348 30669631 30727919 31925885 32970429 33585499 34509506 35621033 35865539 37226817 38046195
14339 38046195 39178087 40417854 41135052 42882945 43713190 45419065 46964253 48210325
14331 48210325 49996587 50966232 52467445 54351703 55916476 57940270 59957659 61746666
14323 61746666 63762691 65846640 68697984 70394071 73193958 76096752 79433297 81870565
14315H1870565K856971L587172L727402L525496L765849M122694M299186M482762
14307A12238097M827519N212982N030744N797819N834777O381037O584623P350164
14299A59257762P353808P881677Q326760Q578603R626337R559429J0464038J1154928
14291B32203342J1139255J1899143J2572645J3021111J3131597J4260232J4114957
14284C22342282J4138360J4486230J4166816J4348553J3851728J2958664J2843548
14277D19136181J1545892J0054848Q607565O514091M310189P55692j070210j302149
14269D58552099j313388n872087m823814o383220r106506j0530644j2502404j3668581
14261C94351455j4026838j4233971j4914287j4945514j4788300j4552741j4164288
$$ plain form
14315 81870565 84727536 88314708 92042110 95567606 99333455 103456149 107755335 112238097
14307 112238097 117065616 122278598 127309342 133107161 138941938 145322975 151907598 159257762
14299 159257762 166611570 174493247 182820007 191398610 201024947 210584376 221048414 232203342
14291 232203342 243342597 255241740 267814385 280835496 293967093 308227325 322342282
14284 322342282 336480642 350966872 365133688 379482241 393333969 406292633 419136181
14277 419136181 430682073 440736921 449344486 455858577 460168766 460924458 459854248 458552099
14269 458552099 457238711 451366624 446542810 440159590 431053084 420522440 408020036 394351455
14261 394351455 380324617 366090646 351176359 336230845 321442545 306889804 292725516
14254B92725516j3315940j2870898j2595442j2272073j2047633j0667473j0721280
14247B08234777r835109r335975q913192p947371p944312p759265o823192p305776
14239A42370585n921199n690399n515502n336870n166694m727492m366724m017135
14231A01628570l754758l848759l729485l532384l235973l547264k363494l100030
14223G4516423k582216k646427k090745k110516k070230k146115k177622j983329
14215E6709223j749978j543371j156562k068798j453378j480329j322111j342238
14207D4592458l53398j205839j613591j229344j499116q07122p41825o99928j446566
14198C4995729q23677p23201q91008r73522m47060j170332l19440p24558p59647
$$ plain form
14254 292725516 279409576 266538678 253943236 241671163 229623530 218956057 208234777
14247 208234777 198399668 189063693 180150501 172203130 164258818 156499553 149676361 142370585
14239 142370585 136449386 130758987 125243485 119906615 114739921 110012429 105645705 101628570
14231 101628570 97873812 94025053 90295568 86763184 83527211 79979947 77616453 74516423
14223 74516423 71934207 69287780 67197035 65086519 63016289 60870174 58692552 56709223
14215 56709223 54959245 53415874 52259312 50190514 48737136 47256807 45934696 44592458
14207 44592458 44239060 43033221 41419630 40190286 38691170 37884048 37142223 36442295 34995729
14198 34995729 34172052 33448851 32557843 31584321 31137261 29966929 29647489 28922931 28163284
14189B8163284q07043q19839l03628n26040r44480n7451n89479r16756j45297
14180B3053271o95045l35239n37509k34055m90220p10316m04271k95283l39903
14171A9011430l11881l39657l42131n26555k09860m08064j21659l90566k08986
14162A6152071k16394n37058Q8836m62311l35820q6779k93721m44899K4019j98008
14152A3689936n90590l4671j31322m87909j34397L9400k30774p6144l07336m19760
14142A1316433J78243j21114n68245K3952p8879k27142R7452l17265P2976l59633
14132A0016778l27009J47450j16909m38797j30629j91784m1056l08390j9310M089
14122H594433n2714k5502j83028k58284j2848j60439n8531r4325k12885L22042
$$ plain form
14189 28163284 27356241 26536402 26232774 25706734 24762254 24704803 24115324 23198568 23053271
14180 23053271 22358226 22022987 21485478 21251423 20761203 20050887 19646616 19351333 19011430
14171 19011430 18699549 18359892 18017761 17491206 17281346 16873282 16751623 16361057 16152071
14162 16152071 15935677 15398619 15487455 15025144 14689324 14602545 14308824 13863925 13887944 13689936
14152 13689936 13099346 13064675 12933353 12445444 12311047 12350447 12119673 12043529 11736193 11316433
14142 11316433 11494676 11373562 10805317 10829269 10750390 10523248 10620700 10303435 10376411 10016778
14132 10016778 9689769 9837219 9720310 9281513 9150884 8959100 8918044 8609654 8590344 8594433
14122 8594433 8541719 8516217 8333189 8074905 8062057 7901618 7843087 7748762 7535877 7857919
14112G857919m77815P0838l03663r5817q5723M26149o64233j00840J42382n4826
14102F714371j01777o0282J83110l42265j87842q4513j37921J88503j02137j05606
14092E963641j07682K63702l00583j07750k46600K17724k01398j17686j7963p7939
14082E267466J46081k53463L64649l48748j63668J24784m71845K42663J90869
14073E098788l42944J02621J7797m8353J3698j4023k52900O1886l5921k22332
14063D378317k67852L00126M1134j73091N11784l65625J05920j07465J65285l69171
14053D219362j68582k24435K14605j07024j60576j74239K45774j27401n84567
14044C132917O48122k89061j1069J13043K6519m3397l46313L5900L62532j24518
$$ plain form
14112 7857919 7380104 7450942 7147279 7051462 6965739 7391888 6727655 6626815 6769197 6714371
14102 6714371 6612594 6552312 6735422 6393157 6205315 6120802 5982881 6171384 6069247 5963641
14092 5963641 5855959 6119661 5819078 5711328 5464728 5682452 5481054 5363368 5345405 5267466
14082 5267466 5413547 5160084 5524733 5175985 5012317 5137101 4665256 4907919 5098788
14073 5098788 4755844 4858465 4876262 4827909 4841607 4827584 4574684 4636570 4600649 4378317
14063 4378317 4110465 4410591 4451725 4278634 4790418 4424793 4530713 4423248 4588533 4219362
14053 4219362 4050780 3826345 4040950 3933926 3773350 3599111 3844885 3717484 3132917
14044 3132917 3781039 3491978 3480909 3593952 3620471 3577074 3230761 3266661 3629193 3504675
14034C504675j28145j30690J86480j58407p029p9369k33990L05755m29352N56772
14024C386700o04973L96028l49570k4811L8736k9512M5026j41147K0509J18899
14014B855885l44796l477Q5501k02866K75293j23844L746l10j57715O2663P9532
14003B529612k60993K5233Q4998J39515K81936n71092J87300k65020L54742J05206
13993B611437J05528k79854K87357J68245J377406K541451P340243J7414591J3901706
13984D5468110j8017761j2129925n694242k835838j709956k57842q62455m25334
13976C534757m9455k34314k46842j61382j29518K96132n78231L80322q3139J26873
13966B855203o20212j13307N48733o7746n78723K28129k84203Q5902K19252k19310
$$ plain form
14034 3504675 3376530 3245840 3432320 3273913 3266884 3187515 2953525 3259280 2829928 3386700
14024 3386700 2781727 3177755 2828185 2803374 2842110 2812598 2857624 2716477 2736986 2855885
14014 2855885 2511089 2507612 2593113 2390247 2665540 2541696 2545442 2545132 2387417 2450080 2529612
14003 2529612 2268619 2293852 2378850 2518365 2800301 2229209 2416509 2151489 2506231 2611437
13993 2611437 2716965 2437111 2724468 2892713 4270119 6811570 14151813 31566404 45468110
13984 45468110 27450349 15320424 9626182 6790344 5080388 4822546 3960091 3534757
13976 3534757 3485302 3250988 3004146 2842764 2713246 3009378 2431147 2811469 2728330 2855203
13966 2855203 2234991 2121684 2670417 2602671 2023948 2252077 1967874 2053776 2273028 2053718
13956B053718L49376n6065j55995r0880j22049N8861R4759p0839l6146j20423
13946A904317J13166J7337j50583J74563K46374l11339p673k07974j88708Q3957
13936A673437J50024O3266j7295k02628K89222j91814j7607P0272l7630k2690
13926A756557j67297j5645J82314j69016O8672k34995M10533j76703N5235k53377
13916A456278L72995k47523N5054q6255j79552M31763j88104n3199j02885q7312
13906A371260p769k6862K73218j61045K9811K36663p37568P22436j62488k5322
13896A512334K56505k03538J76260k36187Q0625J23027m71381J05572r914J00692
13886A433995Q8296l75799K96519n8193j8809j48359J35061J61322l14997J68120
$$ plain form
13956 2053718 2403094 2347029 2191034 2100154 1978105 2036966 2131725 2060886 2024740 1904317
13946 1904317 2017483 2034820 1884237 2058800 2305174 1993835 1986162 1778188 1589480 1673437
13936 1673437 1823461 1886727 1869432 1666804 1956026 1764212 1746605 1816877 1779247 1756557
13926 1756557 1589260 1573615 1755929 1586913 1655585 1420590 1831123 1654420 1709655 1456278
13916 1456278 1829273 1581750 1636804 1550549 1370997 1802760 1614656 1561457 1458572 1371260
13906 1371260 1363491 1336629 1609847 1448802 1478613 1715276 977708 1700144 1537656 1512334
13896 1512334 1768839 1565301 1741561 1505374 1585999 1709026 1237645 1343217 1333303 1433995
13886 1433995 1522291 1146492 1443011 1384818 1366009 1217650 1352711 1514033 1199036 1367156
13876A367156m87522k49326O89428k57364K02489r341k38726J73491j41882K66689
13866A315092K97526l73592K33214n75259J92677L36107j34319k37829l6787m6741
13856I70089O0695K16105k50538N65181o77624J73546n1270J64665K12108l08567
13846A074390j96790J61085K60848k92972J03541k00982M61014j91142j08028
13837A070964m180N8005M3455j37456j24042M9930k40376J55135M13843p8038
13827A207240k82177l8501p9115J94741k54814O3731Q2102l9145O6071r4544P5358
13816I00947P2697N6254k63098p0283K60092j02193l9682J97944J69539m62968
13806G19249K50041Q5982m14437J50916k95969N31561N6517q7038k14916K72336
$$ plain form
13876 1367156 879634 630308 1319736 1062372 1264861 1255520 1016794 1190285 1048403 1315092
13866 1315092 1612618 1239026 1472240 896981 1089658 1425765 1291446 1053617 1016830 970089
13856 970089 1030784 1246889 996351 1561532 883908 1057454 1006184 1170849 1382957 1074390
13846 1074390 877600 1038685 1299533 1006561 1110102 909120 1370134 1178992 1070964
13837 1070964 1066784 1124789 1168244 1030788 906746 956676 716300 871435 1285278 1207240
13827 1207240 925063 886562 807447 1002188 747374 811105 893207 854062 920133 825589 900947
13816 900947 973644 1029898 766800 696517 956609 854416 814734 1012678 1182217 719249
13806 719249 969290 1055272 640835 791751 495782 1027343 1083860 996822 781906 1054242
13796A054242l47957K17534j14650j12480l17547J67139M29643N6180D63148K61763
13786G24911M76062k70459j27695K25432n2689l59826n3833L48113j64727l428
13776G41861M7445K17995k96077O8707j82702O8583L15121D58493L56420k71656
13766E43257N3133L25877C97597J95752L30440p4036k74836N58834l84449p8794
13756F70508J28417j47323o7481p6512J21968J66263k60607j19820M06898j60371
13746F61940k35859K00529O2575j54254n5741L13435k80512K60167o0851j99330
13736E12099K12772j59231N5477L5016m193B57762O06984l42859J74896j45773
13726E51010J12128J86706k49806M172r8901J30680k04922M09137n1549j93439
$$ plain form
13796 1054242 706285 923819 809169 696689 379142 546281 975924 1032104 463148 724911
13786 724911 1200973 930514 802819 1028251 975562 615736 561903 910016 745289 741861
13776 741861 789306 1007301 711224 779931 597229 665812 980933 458493 814913 543257
13766 543257 596390 922267 397597 593349 923789 849753 574917 1133751 749302 670508
13756 670508 798925 651602 584121 507609 629577 795840 535233 415413 822311 661940
13746 661940 426081 626610 689185 534931 479190 792625 512113 772280 711429 512099
13736 512099 724871 565640 621117 656133 651940 257762 864746 521887 696783 551010
13726 551010 663138 849844 600038 604210 505309 635989 431067 840204 788655 595216
13716E95216j11518j2336J62367n3764L1266k46170K55651J03777j98250J39795
13706F66034J65125k3232l50947K32235l40632L36931j72650k4932n7936K02895
13696F32891K27031l67330j17410K73899C00815M33639j02995j09593J78618B53725
13685B79426M91301j89337j42007J7055M30879C99646j25989K98585j78011l6486
13675C57745O1544L39897o1577j71763l3854p9969J59229l5427N6477l2522r1687
13664D68093J75376l6682k7411j57875j74471M85825B12852K46631L2235N2195
13654E43913k25029J30025k1036l5766J23008Q9987k8017k33203J55441n4909
13644D44414J4333K07830k47953K5228n7411K77102A82573K71005l1967q7127
$$ plain form
13716 595216 483698 471362 633729 579965 611231 365061 620712 724489 526239 666034
13706 666034 831159 807927 456980 689215 348583 685514 512864 487932 429996 632891
13696 632891 859922 492592 375182 649081 300815 734454 631459 521866 700484 253725
13685 279426 770727 581390 439383 456438 887317 399646 273657 572242 394231 357745
13675 357745 419289 759186 697609 525846 491992 412023 571252 535825 592302 559780 468093
13664 468093 643469 606787 579376 421501 247030 732855 212852 459483 491718 543913
13654 543913 318884 448909 427873 392107 515115 605102 577085 343882 499323 444414
13644 444414 458747 666577 418624 443852 386441 663543 182573 453578 421611 334484
13634C34484r2835r118Q6927G3339M68965B41832j414J6235K39731E7203N06127
13623E63330k16461J45103Q3595l1884P288j01023k08184M11821q354B36383J21582
13612C57965L52986r1893A36730M80770I7987N41937A79557J18390K54804M0440
13602E93191k46536j18153k5726K72240B16763L2051P2800O1865K59632k05679
13592D37432Q4802k58137J33366j64954J59098A76438K70757o2390l9979K273
13582C47099q6500K60896j77624K74236B52983O852K81326k59426e277F80868
13571A3623M13766k9638K89730j31933j35986A78663O5272K20732j71873P9671
13561C72465K59553n6642k12587C7266K73696L1199J85154j53401n4155A42500
$$ plain form
13634 334484 241649 232531 319458 73339 542304 241832 240418 256653 496384 57203 563330
13623 563330 346869 491972 575567 543683 550971 449948 241764 653585 645231 236383 357965
13612 357965 710951 619058 136730 617500 97987 639924 179557 297947 552751 593191
13602 593191 346655 228502 202776 475016 216763 248814 321614 383479 643111 437432
13592 437432 522234 264097 397463 232509 391607 176438 447195 384805 344826 347099
13582 347099 260599 521495 343871 618107 252983 259835 541161 281735 -5277 680868
13571 13623 427389 397751 687481 555548 419562 178663 243935 464667 292794 372465
13561 372465 632018 575376 362789 37266 310962 342161 527315 373914 319759 142500
13550B40292A19935M21869j17515j07825R9075A03086K42215P9696l0771l0539
13540C63687Q095A40636n5154K31322Q2203P9132b0361F8804K41470K27071l0308
13529E07037k08389L0257f7151C40002j26839o4709J23338j08203i8232B12238
13518B83915m3590M105Q5401o7217K3044k6776M9821M01713B46543K18625H7075
13506E98524k54701L03462B26060o1680J3460j4283O9850q117N3142q6948J13489
13495C04973J96565J3997j32684b7634B5023M01655C1341J02163K94872a7034
13484D55523k3254A79231L36433A75825K7464b42408C97970I9191L2002N17849
13474F49042l15805l59I3692K41539K4678n5864A15627j1792l8902L31268m5815
$$ plain form
13550 240292 119935 541804 424289 316464 415539 103086 345301 424997 394226 363687
13540 363687 371782 140636 85482 316804 399007 478139 -20361 68804 310274 537345 507037
13529 507037 298648 328905 -67151 340002 213163 148454 271792 163589 -98232 212238
13518 283915 240325 244430 329831 262614 285658 258882 308703 710416 246543 465168 87075
13506 598524 343823 647285 226060 164380 177840 163557 233407 225290 278432 191484 304973
13495 304973 501538 515535 382851 -27634 25023 426678 31341 133504 428376 -17034
13484 455523 432269 179231 515664 175825 203289 -242408 397970 99191 131193 649042
13474 649042 333237 332878 93692 335231 359909 304045 115627 103835 64933 396201 350386
13463C50386j46590H0482J18930J35998q0011K2621f1775D5060J44854R2324j02284
13452A79954b5202E92638A08224a44027D9826h3190A68271e4281A12996a08440
13441A34893a7113F2055L75357j46919K35898k11330J36805j10419F0851a41330
13430B28038j8404J7579C7288A5383J81850D1375J80691O1139k4808G3601J44454
13419B18055K45543A62058J62640q0581A01305J41359j06327E8869J14884B7772
13408C39962A56103M33B8211O1472k1610K22609j26875K61518c319B27820N0727
13397B78547j24397K80L22064h5474l965A85511C5774J7359L52464A36565J25736
13386B62301J50362A22729R0034q8843R1184J6026m7595L23707k25130B4508K85505
$$ plain form
13463 350386 203796 80482 199412 335410 255399 278020 -61775 45060 189914 282238 179954
13452 179954 -25202 592638 108224 -144027 49826 -83190 168271 -54281 112996 -108440
13441 134893 -17113 62055 437412 290493 526391 315061 451866 341447 60851 -141330
13430 228038 209634 227213 37288 15383 197233 41375 222066 283205 258397 73601 218055
13419 218055 463598 162058 324698 244117 101305 242664 136337 58869 173753 27772
13408 339962 156103 156536 28211 89683 68073 290682 163807 425325 -3319 227820 278547
13397 278547 154150 154430 476494 -85474 -89439 185511 35774 53133 405597 136565 262301
13386 262301 412663 122729 212763 123920 215104 231130 183535 507242 282112 24508 310013
13375C10013J92021J23211h025B44606p8396N3318J4681B9376N1235O61658k68060
13364D74209k30528F5505g0916B02978a38804D47113A43031A1509n584L54600
13354C60525A69775O5303H8760L00580A69502K35729D3249M58139A00398N2633
13344A53031o6189K50514N22506k73018B50542j00552L9488L10274j24753K09945
13334E84944E0856e7350A27186J4375P2467K7221K55534A70844M9836J43605C8072
13322G7044K21432n1460M3546P6158A0635J48601O5581J36216K9787q1867k7476
13311B81477B261L54934A64413B688M27845r1349e9641K2109j33528C14383a3076
13299A16078K58182D5275c22638g4064B19586K55443j69738F3158M06776c9689
$$ plain form
13375 310013 502034 625245 -8025 244606 166210 219528 234209 29376 80611 742269 474209
13364 474209 243681 65505 -70916 202978 -138804 447113 143031 11509 5925 360525
13354 360525 169775 235078 88760 389340 169502 405231 43249 501388 100398 153031
13344 153031 86842 337356 859862 586844 250542 149990 189478 499752 374999 584944
13334 584944 50856 -57350 127186 141561 214028 241249 496783 170844 220680 364285 38072
13322 77044 298476 247016 290562 366720 10635 159236 224817 361033 390820 308953 281477
13311 281477 2261 357195 164413 2688 430533 339184 -59641 -37532 -171060 314383 -13076
13299 116078 374260 45275 -322638 -74064 219586 475029 305291 63158 469934 -39689
13288a07836A02437Q0956D1266J14391E4235d3163D18898B01392E246K0692J25060
13277A50998K28592j13534e0954B32233p582h1426C174a00364C00755E1710b953
13265A82350b30185C9684h3066C69429a44995D7157I957J77385J47959a7354B75941
13253C05849j13984c9306j14118B25360b05526A74031G4397b34932B16550j6151
13243B00399a64223C34017E0173M36493I6379Q7091a83192B19670I2167B0302
13232B59293L0597h4284B24656a05583a9459j00086A17225L41335B6541K23839
13222B50380j02460b70174A78898a59854L8901F1960J51084q7909b39380H9130
13211A43041P5219b259C58442H2896M22305B42546F6984J62330o0509N0531f3412
$$ plain form
13288 -107836 102437 183393 41266 155657 54235 -43163 418898 201392 5246 25938 150998
13277 150998 379590 266056 -50954 232233 224651 -81426 3174 -100364 300755 51710 -2953
13265 182350 -230185 39684 -83066 369429 -144995 47157 9957 187342 335301 -17354 275941
13253 305849 191865 -39306 -153424 225360 -205526 174031 74397 -234932 216550 200399
13243 200399 -164223 334017 50173 486666 96379 183470 -183192 219670 92167 20302
13232 259293 289890 -84284 224656 -105583 -19459 -119545 117225 458560 26541 250380
13222 250380 147920 -270174 178898 -159854 -120953 61960 213044 125135 -239380 89130
13211 143041 218260 -2259 358442 82896 505201 242546 66984 229314 168805 219336 -63412
13199B17391b00446a5154C78044A55571n9864e3253C14262a45152A32213L0361
13189A62574l5878J05091e074m361j15880I5700d4399B42863K7023h504A64917
13177c7299p5645A93903D7031P1294Q1017K7559J24185j29941m9713K3024K54319
13166D48775j81495a23899A16112L1866J71341p5433m9957b5070B62613H1179
13155C2614J36146A9977a8040C30874a9893E4975J4515J65407b53185D01338a756
13143B79197A4763K17224G9640K53701k1555D7095J03877J78810i8715d8949A55762
13131C8950J24569c61240C04903a69242N962C70608g6136I7886K26165c3030F2144
13119A45080d3511B35383b8068k37521B9825N422f7696A30712b06020A06484g341
$$ plain form
13199 217391 -200446 -15154 378044 155571 95707 -53253 314262 -145152 132213 162574
13189 162574 126696 231787 -5074 -9435 -125315 95700 -44399 242863 269886 -8504 164917
13177 -37299 -112944 193903 47031 118325 199342 226901 351086 221145 171432 194456 448775
13166 448775 267280 -123899 116112 147978 319319 243886 193929 -25070 262613 81179
13155 32614 168760 19977 -18040 330874 -19893 54975 69490 234897 -253185 401338 -1756
13143 279197 14763 231987 79640 333341 311786 47095 150972 329782 -98715 -48949 155762
13131 38950 163519 -361240 304903 -169242 -163280 370608 -76136 97886 324051 -33030 62144
13119 145080 -43511 235383 -28068 -265589 29825 35247 -67696 130712 -206020 106484 -7341
13107A04688J87872a72835A00276l9046d7479k4395C16528K03486f1457A20295
13096a66754A13978R6730l4631J0134a7023j4528i204m6294k85488A78502L5796
13085B14298c33503a34750A43096h2118m1647e4112K5187C2476M7906K84136A53776
13073A05227A3142J2085R0367d04051A96155n757q1675K9458d78037C13654q6777
13062B26877k8015J7242n8031J69560h659D05326A71975n6727l9922a19284N6674
13051f2610B55345r8074i1271A58194L49460a30067C56317e6136C4006J20890
13041A54896k6256n4925a16007b8219A7253J92859b51725a02614E65400b22742
13030A95276o4050R9201A9140J0773L14517a11375A25551J75338D9396h4054k334
$$ plain form
13107 104688 292560 -172835 100276 61230 -47479 -71874 316528 520014 -61457 120295
13096 -166754 113978 210708 176077 186211 -17023 -31551 -9204 -55498 -340986 178502 214298
13085 214298 -333503 -134750 143096 -82118 -123765 -54112 -28925 32476 80382 364518 153776
13073 105227 13142 25227 115594 -404051 196155 190398 108723 138181 -478037 313654 226877
13062 226877 198862 216104 158073 327633 -8659 405326 171975 115248 75326 -119284 -62610
13051 -62610 255345 157271 -91271 158194 507654 -130067 356317 -56136 34006 154896
13041 154896 128640 73715 -116007 -28219 17253 210112 -251725 -102614 565400 -222742
13030 195276 131226 230427 19140 29913 344430 -111375 125551 300889 49396 -84054 -86388
13019h6388l0121C53284k4270j39607G5422j7105a27174I3755N4341c3284E20630
13007F0118d8716B01410a41117A17866J57744N8409D366O1472O8109c8494J1553
12996b6941a0486A31019i3710C16844b69302R0643A80944F1693M12028B22677
12985f4018l6592j1811A71106b7365k9154G2561c9967H2900L60145C4032a42959
12973a27543C33839A19525L8662B3025c5538B59252a3122B05979A1720a5916A07599
12961a46955B98557O0598C5792i0201A11835N8090a36136L5336A62850f606r898
12950a6504A74525K47551a20790E53123G4658J63454f0111m8668K951b9691j32281
12939a61972I7301b07764Q7932A45217e914j71897f3702K0396A69293H2949h9526
$$ plain form
13019 -86388 -116509 353284 329014 189407 75422 58317 -127174 93755 148096 -33284 520630
13007 60118 -48716 201410 -141117 117866 275610 334019 4366 65838 133947 -38494 -26941
12996 -26941 -10486 131019 -93710 316844 -269302 -178659 180944 61693 473721 222677
12985 -64018 -100610 -112421 171106 -27365 -56519 72561 -39967 82900 443045 34032 -142959
12973 -127543 333839 119525 158187 23025 -35538 259252 -13122 205979 11720 -15916 107599
12961 -146955 298557 359155 35792 -90201 111835 169925 -136136 -100800 162850 -6606 -16504
12950 -16504 174525 422076 -120790 553123 74658 238112 -60111 -108779 -105828 -29691 -161972
12939 -161972 97301 -207764 -119832 145217 -5914 -177811 -63702 -43306 169293 82949 -89526
12927A5929J8026a52393H548K9545L27735j32305F6307k6788J37786K50504A04589
12915A25083K03496e0181j56083A3316O9853j6009e7302A38611d941A56497g2831
12903a32647r6050H5280h399A21738C9353d336k45566J08575B51551j21351b3323
12891a90949H3544b10675B26321L6973h7804B04278n0491o225a03202J7497M2791
12880d2914B43077J77648A8460f8746K779B6031c6765B67489j07351a52094i261
12868B40597C0036e5787D0932L5895J63261r4655b57357A45073o3182a6124l0823
12857d6947j6665j14843A32593J9073m7805b45199O0442B18760H3922a0966j52550
12846a63516h1506A60751b07626A52848o0297B3838a04923A07613b06978j4481
$$ plain form
12927 15929 33955 -152393 8548 38093 365828 233523 66307 39519 177305 427809 104589
12915 125083 328579 -50181 -206264 13316 83169 67160 -57302 138611 -4941 156497 -72831
12903 -132647 -228697 85280 -8399 121738 39353 -4336 -249902 -141327 251551 130200 -23323
12891 -190949 83544 -210675 226321 263294 -87804 204278 153787 147562 -103202 -85705 -42914
12880 -42914 243077 420725 18460 -68746 -65967 26031 -36765 267489 160138 -152094 -9261
12868 240597 30036 -55787 40932 76827 240088 145433 -257357 145073 81891 -16124 -46947
12857 -46947 -63612 -178455 132593 151666 103861 -245199 -184757 218760 83922 -10966 -163516
12846 -163516 -81506 160751 -207626 152848 92551 23838 -104923 107613 -206978 -221459
12836b21459c7475q9675k3934A2402e9351E9620J06376F0778h3365B70809j20307
12825A50502l8726C9554J26903a85544l3793O6646F7674K48005a43853B03944
12814B18923a28357k8193C58925A8560J32655J45436C6477K04542b621A18297
12803a61198r4511i6339C22605j00551h9418l5775A01270i8199D4477c3935r722
12792d3657j74086n2526A39104D1608i9781A39428J18125a3872k57824k76054
12782e47750I027Q0220E569J1852J27106k5382a13823b9195A04289J14953b30640
12770c464A43722a84179a1356o0394B5882J26522h8346B19959F9209R0588a69786
12758G1693q465b39048c931G4189h0557c100B3816f068A17086D8112K04808b55492
$$ plain form
12836 -221459 -37475 -127150 -151084 12402 -59351 59620 165996 60778 -83365 270809 150502
12825 150502 111776 39554 166457 -185544 -219337 -152691 67674 315679 -143853 203944
12814 218923 -128357 -156550 358925 18560 151215 296651 36477 241019 -2621 118297
12803 -161198 -255709 -96339 322605 222054 -89418 -125193 101270 -98199 44477 -33935 -43657
12792 -43657 -217743 -270269 139104 41608 -99781 139428 257553 -13872 -271696 -547750
12782 -547750 9027 89247 5569 17421 144527 119145 -113823 -29195 104289 219242 -230640
12770 -3464 143722 -184179 -11356 -71750 25882 152404 -88346 219959 69209 159797 -169786
12758 71693 63228 -239048 -3931 74189 -80557 -3100 23816 -6068 117086 48112 252920 -255492
12745c3104J0003p101A92754G2825i9817F5915N2659L9142E5253l244J42232l2926
12733A61315m4754K42891A40587d7289C62100n9409H64e7707I1005j5740P9611
12722A54876c157A3244a44527a473l98586A78703b59107b4181E7778J04195C075
12710A83639H1922R3840L34236O0303B4321K9512r415g7225l8897A97169H7845
12698h4867B14265J00151a95132H1013R2039C5397c29775A20746C9619G307b5846
12686a84252O2373B01617l5739F0975L00041a30933B01658J12141j55300G8876
12675B09893m5760f5332a8441j5114B5033a11748A48960b8851I7307K58486j18939
12664B36854J19684A047a10243A74667R5149H806N0116K41053d6468G5062L00513
$$ plain form
12745 -33104 -23101 -30202 192754 72825 -99817 65915 118574 157716 55253 52009 194241 161315
12733 161315 116561 359452 140587 -47289 362100 302691 864 -57707 91005 75265 154876
12722 154876 -3157 13244 -144527 -1473 -400059 178703 -259107 -24181 57778 161973 3075
12710 183639 81922 175762 509998 570301 24321 53833 44418 -77225 -116122 197169 87845
12698 -84867 214265 314416 -195132 81013 173052 35397 -329775 120746 39619 7307 -25846
12686 -184252 -121879 201617 165878 60975 361016 -130933 201658 313799 158499 78876
12675 209893 164133 -65332 -18441 -33555 25033 -111748 148960 -28851 97307 355793 236854
12664 236854 356538 1047 -110243 174667 269816 8806 58922 299975 -46468 75062 375575
12653C75575j69656M3647j00396R5235A0224J30458j1165J2741L6970B3881a13881
12641H9968b77936L0110A76935a42342A70315i2057J352p3432D97597F9540a50818
12629C4672a7537D52982B04053G7888J91678C5579r160Q5471B4893M7468l1448
12618D0913M16318A8902J44345J57629j42005h1885G9237j8871e0716F8632J86929
12607B55561a39330B6359a1177C386g1363l6232H7056f383B40658r9540a12502
12595C54737I3009M733K94588C0892J21916C626J5015J68513b12336O2404g33
12583c2894A26186c0980j67509K7374f8324a5372C3440a93496b2292J431H5661
12571b38262C5170I580J75285b0163B84163H095K1764K95655j08927a98434H758
$$ plain form
12653 375575 205919 249566 149170 244405 10224 140682 129517 142258 179228 23881 -113881
12641 89968 -277936 -247826 176935 -142342 170315 -92057 -90705 -164137 497597 69540 -150818
12629 34672 -17537 452982 204053 77888 269566 35579 26419 111890 24893 72361 40913
12618 40913 457231 18902 163247 320876 178871 -81885 79237 60366 -50716 68632 255561
12607 255561 -139330 26359 -11177 3386 -71363 -107595 87056 -6383 240658 141118 -112502
12595 354737 93009 97742 392330 30892 152808 3626 18641 187154 -212336 -149932 -733
12583 -32894 126186 -30980 -198489 -171115 -68324 -15372 33440 -193496 -22292 -20861 85661
12571 -238262 35170 9580 184865 -20163 284163 8095 29859 325514 216587 -198434 8758
12559c28690M5775A83439A6247K18592b03842A34027j0768R9676R0768a94083
12548a95491A03647d636A70624C8532P617a27520j71368M1622k07008J82001J20418
12537a61855G7524J55703C9624f9989j17727A39945J88423c17751J41787A23847
12526c083A35831c7050C80149d0242C6058A1208N40720f721r8583k50876J32435
12515b23745P7263r893H1802K12762f769j51134K1932c4250A55672a25913B37528
12503I3959K5796a33793d1337H0413k06d17213a00231A82125g221I7038g1084
12491C14839c21012E11496a3254I7713B7481J77144D6700L5458a07253G2898j2017
12480F0881K64280G2125a01511d7186A15272Q3641J47407a79387C0686L0140Q2757
$$ plain form
12559 -328690 -282915 183439 16247 234839 -203842 134027 123259 222935 313703 -194083
12548 -195491 103647 -4636 170624 38532 46149 -127520 -298888 -257266 -464274 -282273 -161855
12537 -161855 77524 233227 39624 -69989 -187716 139945 328368 -317751 -175964 123847
12526 -3083 135831 -37050 380149 -40242 36058 11208 551928 -6721 -105304 -356180 -223745
12515 -223745 -146482 -156375 81802 294564 -6769 -157903 -135971 -34250 155672 -125913 237528
12503 93959 119755 -133793 -41337 80413 80207 -417213 -100231 182125 -7221 97038 -71084
12491 314839 -321012 511496 -13254 97713 27481 204625 46700 82158 -107253 72898 60881
12480 60881 325161 72125 -101511 -47186 115272 198913 346320 -179387 30686 60826 143583
12469A43583a59643B09592A9767L1004Q1899c74317A23300b9498B36661a31058
12458A71958d06720A40052B2712N2759J45775a02572a0008B82040d0687k8179
12448f8866a5251A4879b71997B16010b7681B8341A2014M9737J6143e423F2881
12436f7591A06668b74586g4399B01065o1436a42676r5440B35833K12897A83791
12425a69641B23986p2073A1943d3904j54113M8447m1065A14404K43852j62925
12415A95331I282a46658K3263a3450I5032m1931K45738e4973K1177j71101N808
12404a99089H1074b01139a6304B58287b99071B02619J0447G2339Q8192G7457J27487
12393B04944M0962h3335j7529n9878N0005A26493h6830C9621b03596A2159J99954
$$ plain form
12469 143583 -159643 209592 19767 50771 132670 -374317 123300 -29498 236661 -131058
12458 171958 -406720 140052 22712 75471 221246 -102572 -10008 282040 -40687 -68866
12448 -68866 -15251 14879 -271997 216010 -27681 28341 12014 61751 77894 -5423 62881
12436 -67591 106668 -274586 -74399 201065 139629 -142676 -238116 235833 448730 183791
12425 -169641 223986 151913 11943 -43904 -198017 -149570 -190635 114404 358256 195331
12415 195331 9282 -146658 -123395 -13450 95032 53101 298839 -54973 -33796 -204897 -199089
12404 -199089 81074 -201139 -16304 258287 -299071 202619 213066 72339 160531 77457 204944
12393 204944 245906 -83335 -100864 -160742 -110737 126493 -86830 39621 -203596 12159 212113
12382B12113J29392a74618l3961f4657A28694b275n7802A92129H2174J00065D598
12370a45689B42991I47f273A26130j7579a48605j0356f0745C6054J24933N3217
12359B14204a78941B05421b84960A9192J85377b21155A26220l6039a82993A84430
12348d9960C16735b61749A33019b43185C3722b05042b2087l5927C6153i6342C35496
12336G5012P2923E2424J42660a41932E4932b48195F3070a88686j05478A33598
12325D08539A37819c93703A09297c90440A15545J73917B4348R7325L31862d02
12314a20110d8959j35411d3766A19990d6485A13605b14272L7312D5324J11577
12304A56901F5848g981B40600C1623c3981l97980A40592f1970G9828c3333p0145
$$ plain form
12382 212113 341505 -174618 -208579 -64657 128694 -2275 -60077 192129 82174 182239 4598
12370 -145689 242991 947 -6273 126130 108551 -148605 -158961 -60745 36054 160987 214204
12359 214204 -178941 205421 -284960 19192 204569 -221155 126220 90181 -182993 184430
12348 -49960 316735 -261749 133019 -243185 33722 -205042 -22087 -58014 36153 -96342 335496
12336 75012 147935 52424 195084 -141932 54932 -248195 63070 -188686 -294164 133598
12325 408539 137819 -393703 109297 -390440 115545 289462 24348 121673 453535 -402
12314 -120110 -48959 -184370 -43766 119990 -46485 113605 -214272 -176960 45324 156901
12304 156901 65848 -7981 240600 31623 -33981 -431961 140592 -61970 79828 -33333 -103478
12293a03478F3486N504g2248A87434A4172J33344k975p0842J94203a5450j44474
12282a59924f049B35875A10161q583l9353J94876n7599I5559N1256o8790L53749
12271D31774i1233M0277E29366C9462b03933C57303r3132j30778Q8037K08585
12261D30015j11293a90287j76287C06767d36038E04473H0918J47671C5823N4957
12251I0780d1611j962q330A80906F3747J69569A14451P5572A9518b01495A22626
12239A67390N4525b6731r8782C10894o0496h2277R849A10855f5835A38976K20118
12228C59094b1694C77716j32947A10867R5355j3276l2500J34996L33025B25781
12217C22358a29192A88783q5413a43408l8551C72477C0230J17566n8245a4945
$$ plain form
12293 -103478 63486 68990 -72248 187434 14172 147516 144541 73699 267902 -15450 -159924
12282 -159924 -6049 235875 110161 101578 62225 257101 199502 95559 146815 78025 431774
12271 431774 -91233 -50956 529366 39462 -203933 357303 264171 133393 221430 430015
12261 430015 318722 -190287 -366574 306767 -436038 504473 80918 228589 35823 90780
12251 90780 -41611 -43573 -51903 180906 63747 233316 114451 190023 19518 -201495 122626
12239 167390 221915 -26731 -125513 310894 250398 -82277 -72428 110855 -65835 138976 359094
12228 359094 -21694 377716 244769 110867 206222 192946 160446 295442 628467 225781
12217 322358 -129192 188783 103370 -143408 -181959 372477 30230 147796 89551 -14945
12206a1901A52594b78778A43994l1650L1844M4007J26207j51435l0615J90195
12196C22547c7482H7672E069K82401Q3079j76404J35604E6137M09935g4350I8214
12184C30103A17233K27236A43024m2407e6570B04609a0514A72001n0440K44767
12174C66328D5107c60164A28295i2023B984L82480a43915D9884K86885j51566
12164A85203H526N4046e3231A03779J30699a62387O7642c8731A30285J2636e1676
12152B83928F2432b77766a24393j26961A11978J09705f339I8223b4999j10662
12142a35661C69084a60318C2414J99801n7918L20553a52556A14772M7965J8497
12132A81234A7003N163g9007C27638a46215D6665K8196f5921A11193Q7798d07740
$$ plain form
12206 -11901 152594 -278778 143994 112344 144188 188195 314402 162967 132352 322547
12196 322547 -37482 87672 5069 287470 370549 194145 329749 56137 466072 -74350 98214
12184 330103 117233 344469 143024 100617 -56570 204609 -10514 172001 121561 366328
12174 366328 45107 -360164 128295 -92023 2984 385464 -143915 49884 336769 185203
12164 185203 8526 62572 -53231 103779 234478 -162387 -94745 -38731 130285 142921 -51676
12152 283928 62432 -277766 -124393 -251354 111978 221683 -6339 98223 -24999 -135661
12142 -135661 369084 -160318 32414 232215 174297 494850 -152556 114772 162737 181234
12132 181234 17003 22166 -79007 327638 -146215 46665 74861 -65921 111193 198991 -407740
12120a30028B25310b5993A67415a32781O1118F517Q0692a88542Q2805B16286L4861
12109B51147a20073m1812D66692l7885b26364f433j08320A06044l0524e586j98123
12098b03709A49726a68041B32478O9009A0903a49037e4632B44923i5019A63710
12087a71137f3727k2297k12576A67900a07192A71453c34427I0029a50513q3746
12077b34259q778a00697c646m60651B43760a0417j96516L1796I3417M50488L72299
12066I16204R05688H47645A34800a5292p3470A57483b59007B38546H1542K9788
12056A11330a85264Q0421K1564E3507c47682A98416n2459B9948a2382n2005A2727
12044h8033b1636A91876g9369A96354c3403Q346B07971B6942L24548a6826j64345
$$ plain form
12120 -130028 225310 -25993 167415 -132781 -71663 6517 87209 -188542 -105737 216286 251147
12109 251147 -120073 -161885 466692 428807 -226364 -6433 -114753 106044 75520 -5586 -203709
12098 -203709 149726 -168041 232478 301487 10903 -149037 -54632 244923 -95019 163710
12087 -171137 -63727 -86024 -298600 167900 -107192 171453 -334427 90029 -150513 -234259
12077 -234259 -243037 -100697 -3646 -464297 243760 -10417 -206933 -175137 93417 543905 916204
12066 916204 1821892 847645 134800 -15292 -88762 157483 -259007 238546 81542 111330
12056 111330 -185264 -104843 -83279 53507 -347682 198416 145957 29948 -12382 -64387 12727
12044 -88033 -21636 191876 -79369 196354 -33403 -25057 207971 26942 351490 -16826 -181171
12033a81171A64964D8230a08446r4215b2959j4898j64988B51759k5111r3269a04085
12021B73403a66598A45259C1485A0295J92080J57232b48803A31894C9568N5127
12011I4695M0353b0358o3651l8370l18421D412i4235B80749B712e8377B4372J39364
11999A63736a09886j36560j39168h1367A63772c47560J12647b6281j25320D09975
11988F2430K15501f1463G9625P8330c9959k24120J30101A31333n195C2222a33922
11976A11376b86922B8803h620A22910f2901B17692E0047c8578r4488A66373P3053
11965B39426j18690k0402b77787G42P6204l3128l754a16518N6568H704f712A1125
11952A87584e4981E9297K30837q3731b22951H999a35314c7968j89831A11100f8367
$$ plain form
12033 -181171 164964 48230 -108446 -202661 -22959 -37857 -202845 251759 226648 133379 -104085
12021 273403 -166598 145259 31485 10295 202375 359607 -248803 131894 39568 94695
12011 94695 135048 -20358 -84009 -122379 -440800 4412 -94235 280749 2712 -58377 24372 163736
11999 163736 -109886 -246446 -385614 -81367 163772 -347560 -234913 -26281 -151601 409975
11988 62430 277931 -61463 79625 157955 -39959 -264079 -133978 131333 126138 32222 -133922
11976 111376 -286922 28803 -8620 122910 -62901 217692 50047 -38578 -133066 166373 239426
11965 239426 120736 100334 -277787 742 76946 43818 40064 -116518 -59950 8704 -6712 11125
11952 187584 -54981 59297 290134 206403 -222951 8999 -135314 -37968 -227799 111100 -68367
11940A5865c5146k56012A9374a40912B0301M003i5956p4346E4373R4364a23415
11928E6162b6446p7645G9829M5702j7538A7708L47052b61026Q3153A04444P9332
11917A83776J3830i5075A45923c08035A45112a88914F9881K82445b13887B64615
11906G7019a9898j53118C10887A45954a08835q8734K3868g3672A24358g6900A65129
11894a61401j00759D4235J50524b36268R947k0802C5159a29106o8652A59470k2108
11883A37362c42533i2882Q304B6537J3567r662P771i4498k50274q4010B04302
11871F1308P9526b10265q5256b0410B87635b17089i8494F6657k9340O8196A2555
11859I7393M8856O1102a405D7260b71630j9182N6526k289d2105k72386J12383
$$ plain form
11940 15865 -35146 -291158 19374 -140912 20301 24304 -95956 -170302 54373 148737 -123415
11928 56162 -26446 -104091 79829 125531 107993 17708 364760 -261026 -177873 104444 183776
11917 183776 197606 -95075 145923 -308035 145112 -188914 69881 352326 -213887 264615
11906 77019 -19898 -173016 310887 145954 -108835 -197569 -173701 -73672 124358 -76900 165129
11894 -161401 -262160 44235 194759 -236268 -226321 -247123 35159 -129106 -197758 159470 137362
11883 137362 -342533 -92882 -84578 26537 40104 30442 38213 -94498 -344772 -428782 204302
11871 61308 140834 -210265 -295521 -20410 287635 -217089 -98494 66657 37317 105513 12555
11859 97393 146249 207351 -1405 47260 -271630 -290812 -234286 -236575 -42105 -314491 -202108
11848b02108G1606a64104k4710A56757K69360A3093L06961c91278c3943j49775
11838a83718F3085b35527g0232r3150j6287e52q2472K0035A50334b2640C4914
11826i3665j43340b2124B54552a14016A94300a83497L8321A07073K76121B5857
11815a84089D7600e4332b0522A26863a49075f9055A00480l9401b60716F8500a01731
11803c01341c4409B25173j2597h8934r6355e810k4425B41765b23959R3968C3336
11791b8077D7666b46776e8151J7816k75200a09615L1997K2716d814I2894J46113
11780B39007c3548A26432p91m201b4619m3421A366c01967A59815J24670c64335
11768A95126B2774M3251b33512b4327j91824P3802A04382a16549E1281B4592K82721
$$ plain form
11848 -202108 71606 -164104 -188814 156757 426117 13093 320054 -391278 -33943 -183718
11838 -183718 63085 -235527 -70232 -163382 -179669 -552 -83024 -62989 150334 -22640 34914
11826 -93665 -237005 -22124 254552 -114016 194300 -183497 -145176 107073 383194 25857
11815 -184089 47600 -54332 -20522 126863 -149075 -69055 100480 61079 -260716 68500 -101731
11803 -301341 -34409 225173 212576 -88934 -185289 -5810 -30235 241765 -223959 -129991 33336
11791 -28077 47666 -246776 -58151 -40335 -315535 -109615 -77618 -54902 -4814 92894 239007
11780 239007 -33548 126432 125641 121440 -24619 -68040 1366 -301967 159815 284485 -364335
11768 195126 22774 66025 -233512 -24327 -216151 -142349 104382 -116549 51281 24592 307313
11757C07313i7787F1569f6050j41926B39706F219b20150I9019B2690M9472C0377
11745A374a1642k9238F5823c720A12097b08003a4829j41378f3396q5591A21184
11733d539k0650j03975B36374n2240b69886h1993A09692O1324F1987b41151C11959
11721a20034C04516F6092a74147A06059a2922r7662C4351f6700j0253p6995e5528
11709E5878c7432F4372N78K9055O8714p5035J72690Q2406a3441C91450d1052r0065
11697a31117A48498K09843H7226a22616C18917B3009J62253o9182a32890b7444
11686C09196a10452o1741B5295L9988J23490D327K50190E8059J18480a83322i034
11674g390B49438o1411c2026H6954K14754a43390H598d6949j70867A28164m2138
$$ plain form
11757 307313 -97787 61569 -66050 -207976 239706 6219 -220150 99019 22690 72162 30377
11745 1374 -11642 -40880 65823 -3720 112097 -208003 -14829 -156207 -63396 -148987 121184
11733 -4539 -25189 -129164 236374 184134 -269886 -81993 109692 171016 61987 -241151 311959
11721 -120034 304516 66092 -174147 106059 -12922 -110584 34351 -66700 -76953 -153948 -55528
11709 55878 -37432 64372 64950 94005 162719 87684 260374 342780 -13441 391450 -41052 -131117
11697 -131117 148498 358341 87226 -122616 318917 23009 185262 116080 -132890 -27444
11686 309196 -110452 -172193 25295 65283 188773 4327 254517 58059 176539 -183322 -9034
11674 -7390 249438 188027 -32026 86954 301708 -143390 8598 -46949 -217816 128164 86026
11663H6026C0155J84147q0719a7931m5140I2089l4434i6660B42806E2366K59725
11652C12091D1818h6765c2728j92631A67655Q3115A1826R3330R664b68257d7357
11640B41672H0652M8211a66057l0122B07735a95424c3555j42951m4846P8360F860
11628A43390F7898g3454M071b9202A39553b60573G6830K2676a4307j57843I2853
11616G357J38648o3937i8485B98184A05370J70109g8269B88141b20287k6785N9311
11605a87761F2458K2623M0962a09648C40788D3887A9997d4384A85360K58440A70644
11593C37207h8402A49136b8580A54769k0503l3754j2288J62965j8284C8555J08950
11582A47505J70381o7393a29628E3060i674B69517J7338b60473g2279B57273A0102
$$ plain form
11663 86026 30155 214302 133583 -17931 -63071 92089 57655 -96660 242806 52366 312091
11652 312091 41818 -86765 -32728 -225359 167655 250770 11826 105156 114820 -268257 -47357
11640 241672 80652 128863 -166057 -196179 207735 -195424 -33555 -176506 -221352 -142992 6860
11628 143390 67898 -73454 -69383 -29202 139553 -260573 76830 99506 -14307 -172150 92853
11616 7357 146005 82068 -98485 298184 105370 275479 -78269 288141 -220287 -247072 -187761
11605 -187761 62458 85081 126043 -109648 340788 43887 19997 -44384 185360 443800 170644
11593 337207 -88402 149136 -28580 154769 134266 100512 88224 251189 232905 38555 147505
11582 147505 317886 250493 -129628 53060 -9674 269517 286855 -260473 -72279 257273 10102
11570D38653q0871A6995a88138c0833j60475A30936J39556b42479A39989B6017
11559B82178m6223a48748A44186f8899B6314a225j9926k3348B70663p9083E1996
11547C0816b7842G3322J53882l92m7178d393r9499j41360E3630K63135A51081
11535D4463q441J6688J11809o8336L1855L04889a60667B39666A16956a91169A8247
11523f3491G2687a31906K3565A45252R565N1868o0266Q9771N2619a51201a6978
11511g7902G0326b18145A77969i2377m0545A57661P2163q5061J48754F775K86296
11500B93071Q6430A72964m5158N7825F1507j3111J08867J01951A19719L09408
11490D29127I920K86299K3629O5007c0636j74955D18368c0810B05541F0652e8602
$$ plain form
11570 438653 357782 16995 -188138 -30833 -191308 130936 270492 -242479 139989 26017
11559 282178 235955 -148748 144186 -68899 26314 -1225 -21151 -44499 270663 191580 51996
11547 30816 -27842 73322 227204 226812 179634 -4393 -103892 -245252 53630 316765 151081
11535 44463 36022 52710 164519 96183 128038 432927 -160667 239666 116956 -191169 18247
11523 -63491 72687 -131906 -108341 145252 154817 206685 146419 236190 288809 -151201 -16978
11511 -77902 70326 -218145 177969 -92377 -132922 157661 229824 144763 293517 6775 293071
11500 293071 379501 172964 127806 185631 61507 48396 157263 259214 119719 429127
11490 429127 9920 296219 319848 384855 -30636 -205591 418368 -30810 205541 60652 -58602
11478B54456e8493F5021K64963a65103B17832R4937A527d5882A9305m753L2811
11467D7363J09686Q2858m2020Q097L13377j80416A23752D590J43132a12765A17661
11455A09115j5923b9022D16478b5556A21694J85934C3484R5943a47024B77717
11444a6057o3660d374A36870O0703a3157H0427c0260k5054j68369B79606a22467
11432A08160P9412A9867K3363J50859K1266l2656i0845G2832K7149J07847d3675
11420B82735a1891j93922j2042q4470a37964A42644a42900E7426b90018H0120
11409i3919A38647b7332k42086A52281f2660B3437F240Q3550J10195b2818i232
11397b18862A61885l1973a82701A38032n7210A1326b23884B84285b49507a14542
$$ plain form
11478 254456 -58493 65021 329984 -165103 217832 312769 1527 -45882 19305 14552 47363
11467 47363 157049 239907 197887 205984 519361 338945 123752 4590 147722 -112765 117661
11455 109115 93192 -29022 416478 -25556 121694 307628 33484 129427 -147024 277717
11444 -16057 -79717 -4374 136870 197573 -13157 80427 -30260 -55314 -223683 279606 -122467
11432 108160 187572 19867 43230 194089 215355 182699 -90845 72832 99981 207828 -43675
11420 282735 -11891 -205813 -217855 -302325 -137964 142644 -142900 57426 -290018 80120
11409 -93919 138647 -27332 -269418 152281 -62660 23437 6240 89790 199985 -22818 -9232
11397 -218862 161885 129912 -182701 138032 80822 11326 -223884 284285 -249507 -114542
11386A2724O1387Q3497a66455n819r4093C3186a81891L8463B95581e5395A14713
11374h5253B37575j4235b10171A66779B3965a69469A12165b68017B3653a05493
11363B64841d3362a3453A58368a27313G3449K0239l8855a45948A54665B9854b04385
11351a06275B50241I3948c21422a06582A93413N5057g4439l0570A16406J41702
11341B58108G8825b65479a26439a3344j060A32717g3430l87008g6643A28054M9480
11330A77534n6940F030g9635A70580j8570h538A55349e6884a5419k60072b8018
11318a24526L659e6025A86868O797i8505C2569J21440d1917m7214j57372e0206
11306a40348f4545j37761M6046P5599A12517a2007k3908n4241N76d2572k01230
$$ plain form
11386 12724 74111 157608 -166455 -172274 -266367 33186 -181891 -143428 295581 -55395 114713
11374 -85253 237575 223340 -210171 166779 23965 -169469 112165 -268017 23653 -105493
11363 264841 -43362 -13453 158368 -127313 73449 93688 54833 -145948 154665 29854 -204385
11351 -106275 250241 93948 -321422 -106582 193413 248470 -74439 -105009 116406 258108
11341 258108 78825 -265479 -126439 -13344 -14404 132717 -73430 -460438 -76643 128054 177534
11330 177534 120594 6030 -79635 170580 152010 -8538 155349 -56884 -15419 -275491 -28018
11318 -124526 -120867 -56025 186868 193665 -98505 32569 154009 -41917 -89131 -246503 -50206
11306 -140348 -64545 -202306 -156260 -80661 112517 -12007 -35915 -90156 -89580 -42572 -243802
11295b43802B29676n6650o1191h3994j30856G2867B3583a29435O2286b7304E7620
11283A9465a26479A56475b66209A49919A370h1059o8383A32813b61733A08294
11272b10994E6006J20810M9642b08669a00350j36600H1658a0789j31204J0587
11262a31406H7258a90782E4636c09174A66121b94881A46142C9746K500c95435
11251g0404A11959h0077p1820A08621R1805b1191A54969a94068J6711A69471a6027
11239B0786g452k59790J23816F5071k8533h0886R714c4747o2052k87890F161M7015
11227E3176B5631a84013H7533l2094a24511c4706k7291j98997I1304e3655A74389
11215d3938j19540A12283A1832f2408k72199C0532b1470k25984J0711e5376k81799
$$ plain form
11295 -243802 229676 173026 111835 -83994 -214850 72867 23583 -129435 -67149 -27304 57620
11283 19465 -126479 156475 -266209 149919 1370 -81059 -149442 132813 -261733 108294
11272 -210994 56006 176816 226458 -208669 -100350 -236950 81658 -10789 -141993 -131406
11262 -131406 87258 -190782 54636 -309174 166121 -294881 146142 39746 42246 -395435
11251 -70404 111959 -80077 -151897 108621 200426 -21191 154969 -194068 -177357 169471 -16027
11239 20786 -7452 -267242 -143426 65071 36538 -80886 -71172 -34747 -96799 -384689 6161 53176
11227 53176 25631 -184013 87533 55439 -124511 -34706 -61997 -260994 91304 -53655 174389
11215 -43938 -163478 112283 11832 -62408 -334607 30532 -21470 -247454 -236743 -55376 -337175
11204c37175A282O5096a0987k37153b3927j15670k08786C3805a2742B95396A26379
11192d3752l10292C17019j46567k7874a00881A98050b98885K4423c3953F7764
11181C331J25316a54627A82817b18018C1299b83160g7897H2338J0244b38099F9343
11169B2988e7019k97003A1670c02521j45624D103p26e1577l49706J73093i282
11157a60987J5974H092c69329a73499C78301j85569g8118j8028J0243m6805H3770
11145a94140C7577Q2064J3976c4200k23888B95933A18363K9501j6531Q0121J02217
11134C13671b50015A25704K27658A08520g0981i300j86334B08362n0824M9801
11124B07339d4792H6379J46201B9638a55986f5738J477p8818b8792A3386J77148
$$ plain form
11204 -337175 1282 66378 -10987 -248140 -23927 -139597 -348383 33805 -12742 295396 126379
11192 -43752 -354044 317019 170452 142578 -100881 198050 -298885 -274462 -33953 67764
11181 3331 128647 -154627 182817 -218018 31299 -283160 -77897 82338 92582 -238099 69343
11169 22988 -57019 -354022 11670 -302521 -448145 4103 3377 -51577 -401283 -228190 -9282
11157 -160987 -145013 8092 -369329 -173499 378301 192732 -78118 -96146 -85903 -132708 83770
11145 -194140 37577 119641 133617 -34200 -258088 295933 118363 147864 131333 211454 313671
11134 313671 -250015 125704 353362 108520 -70981 -9300 -195634 208362 157538 207339
11124 207339 -44792 86379 232580 29638 -155986 -65738 -64261 -143079 -28792 13386 190534
11113A90534D3152a5516B69666c797A13413r125P8189l5769a08472A77857K63162
11102D41019I8342Q4339K4866q8787E7224K27273F2721K72148j10363b68237B1293
11090A40832a3575A31750F3153J00288q0797J96051F0704i038B62960a63043B88986
11078B99406j33392L9568K99450B39627q3294B414K02681r9406K57795R0847j55434
11067B98897a08328C34062O473K25184j93162I8937L96915k14156J24602J74412
11057E80710J81322k14935L4391K24150k50155m0757K76016L5689K06518K1479
11047A054428m07284j7435N7443n6596k37073M28801l29765K95752M4790R2919
11037I25980j74380K21953j29375K96033k93959j46866Q8477k83704M1845P3641
$$ plain form
11113 190534 43152 -15516 269666 -3797 113413 104288 182477 146708 -108472 177857 441019
11102 441019 98342 182681 207547 118760 57224 284497 62721 334869 224506 -268237 21293
11090 140832 -13575 131750 63153 163441 82644 278695 60704 -9038 262960 -163043 288986
11078 299406 166014 205582 505032 239627 156333 2414 205095 105689 363484 454331 298897
11067 298897 -108328 334062 340535 565719 372557 98937 495852 281696 406298 580710
11057 580710 762032 547097 581488 805638 555483 514726 790742 826431 1032949 1054428
11047 1054428 647144 629709 687152 630556 393483 822284 492519 788271 833061 925980
11037 925980 751600 973553 844178 1140211 846252 699386 787863 504159 546004 619645
11027F19645N24795m59234J82443j57423r7819K22766B95278K15142q6265J26018
11017E50173J31393J62369m2151j10007J64414k91040j08861L15884M3025k26399
11007E88800m749K95837k40382R8237j11621K26356N6772k17599M8067k61846
10997D77872L88922r9346k18507L54398Q6045j99580K24662l66545R2119j08127
10987F31913K70364J71072N8405r858K12089l45330L9442M61066O5711K83886
10977A838760k90594L45145N53389M16998k42579J96226J80746M32078l42095
10968C088074j18345l90989j24704k58352J95965m33173K2060J18885l17745J64389
10958A946065O8554L9005J21438j6787Q3499n00566l24329o7206k24126k02653
$$ plain form
11027 619645 1144440 685206 867649 710226 612407 835173 295278 510420 424155 550173
11017 550173 681566 843935 801784 691777 856191 565151 456290 772174 815199 588800
11007 588800 584051 879888 639506 737743 626122 852478 909250 691651 739718 477872
10997 477872 866794 767448 548941 903339 989384 789804 1014466 647921 740040 631913
10987 631913 902277 1073349 1131754 1121896 1333985 988655 1028097 1489163 1554874 1838760
10977 1838760 1548166 1893311 2446700 2863698 2621119 2817345 2998091 3430169 3088074
10968 3088074 2969729 2578740 2454036 2195684 2391649 1958476 1980536 2099421 1781676 1946065
10958 1946065 2014619 2053624 2175062 2158275 2241774 1741208 1416879 1349673 1125547 922894
10948I22894p3899k11061J3025k12964j54971J67305m1724I7857K84938p1645
10938C11150l2444r9177K32987G3014a78588B20207m1749p98e9409B53317p8795
10927A74522F3585b36324a06962A01732K45735A07977a01107B16048h5807A29249
10916a83951I9455N3476K81166j20745a12199J3717I1152P786a29804J8250J3895
10905i7659D91085a35678A81691c21685N2910B29003a15211J226N1538A0109a51603
10893d2378B07899a67885m9970m6062E9716I565O8742L1044k6210K9374E5393
10881e2913A46073D5211R7257a35101A83756q9600K22429A40189B0553c8177j82779
10870b20956P4322e9582E1812a28380j95831A37292n44D1893M0451Q019b45458
$$ plain form
10948 922894 848995 637934 650959 437995 283024 450329 408605 97857 382795 311150
10938 311150 278706 179529 412516 73014 -178588 220207 178458 177660 -59409 253317 174522
10927 174522 63585 -236324 -106962 101732 347467 107977 -101107 216048 -85807 129249
10916 -183951 99455 152931 434097 313352 -112199 -98482 91152 98938 -129804 -111554 -97659
10905 -97659 491085 -135678 181691 -321685 -268775 229003 -115211 -113985 -62447 10109 -151603
10893 -42378 207899 -167885 -217855 -263917 59716 9565 78307 109351 83141 112515 55393
10881 -52913 146073 45211 142468 -135101 183756 94156 316585 140189 20553 -38177 -220956
10870 -220956 -146634 -59582 51812 -128380 -324211 137292 136748 41893 82344 90363 -245458
10858A33307L4229c17313a6295p5643C2863J97149r6035b8865A51735b84633b0112
10846B69191a4129A03042c87013A00335a1336B5404G124J21198a35088C9807d2692
10834b98492a34268F8588B1576a3829C20151G2666b55351e3158q3840A45942a45677
10822I9228c7757j31177A47644h8174r3752A37677j0635j7093E1827a39521d0224
10810C3080M7995a46332j63825J55071I2977f1919j66502A57347N4791O983n6304
10799A62817i6331k45040F708a28519k7066d4226o7100k7998D0191b26617d2970
10787a2224j71566a0204m3536A31147i5946A14758a59500e056A3918M8403b09790
10775i7278o7280d1403j22113A07231P7786f2619A13434N5386a93382a0582B58311
$$ plain form
10858 133307 167536 -317313 -16295 -91938 32863 230012 133977 -28865 151735 -284633 -20112
10846 269191 -14129 103042 -387013 100335 -11336 25404 7124 128322 -135088 39807 -42692
10834 -298492 -134268 68588 21576 -13829 320151 72666 -255351 -53158 -136998 145942 -145677
10822 99228 -37757 -168934 147644 -88174 -181926 137677 127042 109949 51827 -139521 -40224
10810 33080 81075 -146332 -310157 -155086 92977 -61919 -228421 157347 212138 219121 162817
10799 162817 -96331 -341371 6708 -128519 -155585 -44226 -111326 -139324 40191 -226617 -42970
10787 -12224 -183790 -10204 -53740 131147 -95946 114758 -159500 -5056 13918 62321 -209790
10775 -97278 -164558 -41403 -163516 107231 185017 -62619 113434 168820 -193382 -10582 258311
10763B474a83016k20583a46549B5235K45489c62747G6204a13348L149c4701j9017
10752e3718A38413c44091R4726a15711F6465J91011c01555g4239F6850A6994J67515
10741A84509a13960o4747F975P2061b42348J08741e0340B68698a68029g059D3009
10729G0795J37142b03159q2280A39168J29898e5627O724E7908k7760c9027q4869
10718a23896e6151q3950J5103f0861l0093p9346A61014c67918j24976b19735j68279
10707c88014j27207G6935a04727B66612E1159a69009D2159d6758j71145h7188
10696a02850b4834l49703A23995f9324F6427h8333J4276B63442n7259N818a85536
10684A71530b6543A19632a51907o725c7754J7036B20609a64016d0667I3083b83474
$$ plain form
10763 2474 -183016 -403599 -146549 25235 270724 -362747 76204 -113348 -110199 -34701 -53718
10752 -53718 138413 -344091 -249365 -115711 66465 257476 -301555 -74239 66850 16994 184509
10741 184509 -113960 -178707 6975 79036 -242348 -133607 -50340 268698 -168029 -7059 43009
10729 70795 207937 -203159 -285439 139168 269066 -55627 -48903 57908 30148 -39027 -123896
10718 -123896 -56151 -140101 -124998 -60861 -90954 -170300 161014 -367918 -492894 -219735 -388014
10707 -388014 -515221 76935 -104727 266612 51159 -169009 42159 -46758 -217903 -87188
10696 -102850 -24834 -374537 123995 -69324 66427 -88333 -74057 263442 206183 212001 -185536
10684 171530 -26543 119632 -151907 -158632 -37754 -20718 220609 -164016 -40667 93083 -283474
10672a9060A36225b10992l8978q6609O1307d2685k91310F1933B6787a50862j63898
10661c14760C9517b50183o6696e3820n6341j28166B0849q374d23717C81b26237
10649A12346E2691a16282n0281K5301C1393L08180i711j20562N4209A44400J42346
10638B86746r2934a63132B49603r8932b86537J27932C615c01798f7839C6896d90028
10626E1330d67873D8064K61657c8202j33060B27842d71349d531r3477G8430b9843
10614a37686A51147j5986m4644J86374F0767L5249M43941b8645A13321h2102A0549
10602C96668L609a68959k41746a42927a1963k03273l08283H641d6361k5050B832
10590G6996K24715b89348P1480A70023a2674k99957i7905B72770r0381b79266
$$ plain form
10672 -19060 136225 -210992 -249970 -336579 -275272 -42685 -333995 61933 26787 -150862 -314760
10661 -314760 39517 -250183 -316879 -53820 -110161 -238327 20849 12475 -423717 381 -226237
10649 112346 52691 -116282 -166563 -141262 31393 339573 -9711 -130273 -76064 144400 286746
10638 286746 193812 -163132 249603 150671 -286537 -158605 3615 -301798 -67839 36896 -490028
10626 51330 -467873 48064 309721 -38202 -171262 227842 -471349 -4531 -98008 78430 -29843
10614 -137686 151147 135161 90517 276891 60767 96016 539957 -28645 113321 -82102 10549
10602 396668 400277 -168959 -410705 -142927 -11963 -215236 -523519 8641 -46361 -71411 2832
10590 76996 301711 -289348 -217868 170023 -12674 -312631 -97905 272770 182389 -279266
10579D1821a41718j25623a20273N9242j22161h6467K8175G6002i1430B43529f4007
10567C5249h850H8341c5101k86460a28916L9306B70077b0749r6339C13699i6255
10555a79364n4859J01087l257K3332a631j9209A32883d23146a43815j7599j03531
10544b64945g3848H5170a31899M0746k8628N5344k38285N8331Q5024J8427O2425
10533g8515K0138k75751f180q9290C6375b57912A47612b46545A31417d87639A49754
10521A40509d2096g824j62551j68386O6820P7311G9003a46755j11423A96901m3763
10510A53138m4201a61679A7147K07359k4585d0182M490j20767M328B29052c86143
10498b20166I1625D916Q4629P129a86768e329F504c00103C24423a0735B00061
$$ plain form
10579 41821 -141718 -267341 -120273 -61031 -183192 -86467 -58292 76002 -91430 243529 -64007
10567 35249 -8850 88341 -35101 -321561 -128916 -89610 270077 -20749 -117088 313699 -96255
10555 -179364 -234223 -133136 -136393 -113061 -1631 -20840 132883 -423146 -143815 -161414 -264945
10544 -264945 -73848 85170 -131899 -91153 -119781 -64437 -302722 -244391 -159367 -140940 -78515
10533 -78515 -58377 -334128 -6180 -95470 36375 -257912 147612 -246545 131417 -487639 149754
10521 140509 -42096 -7824 -170375 -338761 -271941 -194630 79003 -146755 -258178 196901 153138
10510 153138 108937 -161679 17147 224506 199921 -40182 -35692 -156459 -152131 229052 -386143
10498 -220166 91625 4916 89545 96674 -186768 -5329 6504 -300103 324423 -10735 200061
10486g8949A59103b1212M867j2916Q595D34932Q5911k55580R2128E896K00266
10475B06162l1186J50672e01703a55995B48090c4372B83467j24484R0798b00212
10464A92787b93696a0142B27188D8308f0561k70415A4440c3113n4977n3949C2409
10452g0140J1602j37679g4734l9579C2615l483J64828D1790B59L35948a23827
10440B04221b91539B13624a39751e8442K1203A40624o3413l7426a79866h3517
10429f8963D4521g9988F2386k1882I266a24550r693f4263b639k39883B71769B3463
10416a09280j43896a07829A78653b50714e5133m7108p6109p2647a23422C07329
10405G059J51457o7923C9479a94566A0989a39151a1567C27296h0468j81809Q1854
$$ plain form
10486 -78949 159103 -21212 -16345 -29261 -20666 434932 520843 265263 357391 5896 206162
10475 206162 174976 325648 -501703 -155995 248090 -34372 283467 158983 249781 -200212
10464 192787 -293696 -10142 227188 48308 -60561 -330976 14440 -33113 -88090 -142039 32409
10452 -70140 -58538 -196217 -74734 -114313 32615 29132 193960 41790 259 336207 -123827
10440 204221 -291539 213624 -139751 -58442 -37239 140624 77211 39785 -179866 -83517
10429 -68963 44521 -79988 62386 40504 9266 -124550 -134243 -64263 -2639 -242522 271769 23463
10416 -109280 -253176 -107829 178653 -250714 -55133 -102241 -178350 -250997 -123422 307329
10405 7059 158516 90593 39479 -194566 10989 -139151 -11567 327296 -80468 -262277 -180423
10394a80423a5139q4585E7992c24063A25166C6412J48105Q924b496j51308g5613
10382F9830d2742Q212A92602k2754P4451M01014A07021K22754j39443K86959j09642
10371C67649l7227K15945j37956j21928J43083j79086N9832K93533k92899J4621
10361C25567E2057K75858j6622R414A806K55456A08152L66682A23269N423K02665
10350C31357R9176K44200j03573k75973o7335o5132M21336m4742J48966B38251
10339h8736I4102d1529C43285n0339r1062L9116H5511b40266a18390D6037K49219
10328B95256b32234R4496F3272e0340D28718a63209C12524J43965A75561K24154
10318C99715i8208B23945b6029B76218A10980b565A30020j0950a41817C4222Q6447
$$ plain form
10394 -180423 -15139 -99724 57992 -324063 125166 36412 184517 193441 -2496 -153804 -75613
10382 69830 -42742 -34530 192602 169848 244299 645313 107021 329775 190332 477291 367649
10371 367649 330422 546367 408411 286483 429566 250480 310312 603845 310946 325567
10361 325567 52057 327915 311293 320707 1806 257262 108152 474834 123269 128692 331357
10350 331357 430533 674733 571160 295187 227852 162720 584056 539314 688280 238251
10339 -88736 94102 -41529 343285 292946 201884 241000 85511 -240266 -118390 46037 295256
10328 295256 -232234 -137738 63272 -50340 428718 -163209 312524 456489 175561 399715
10318 399715 -98208 223945 -26029 276218 110980 -2565 130020 119070 -141817 34222 120669
10307A20669J8908b42112A08251e4571C20557A11445b19268A49303a46875L9900
10297a06975B05188R4016b56758B52657a69147j01156A33599b08895H1567D480
10286c04628C9314K2802Q6275n7375A1720L00653d8432C3074J00716D3642K00778
10275B44420b38336N1809j13736d5124l5849H2567Q5358B6132K01521N9772m226
10264B83199a45304c4984A13254L99574D4406J90376A13180K26927j02322J96470
10254D34255o6544f7253B43853b0051j9962r4935A69684e9404j68674A09691f251
10242A3853a27125A1514J34982P3688J1427c41698d4241j22882A29127a6433j58929
10231a75362b2234A82383J01036c63762a3024k38527a25206j6904q4045L7119
$$ plain form
10307 120669 139577 -242112 108251 -54571 320557 111445 -219268 149303 -146875 -106975
10297 -106975 205188 299204 -256758 252657 -169147 -270303 133599 -208895 81567 4480
10286 -304628 39314 62116 148391 91016 11720 312373 -48432 33074 133790 43642 244420
10275 244420 -238336 -186527 -300263 -45124 -80973 82567 167925 26132 227653 287425 283199
10264 283199 -145304 -34984 113254 512828 44406 234782 113180 340107 237785 434255
10254 434255 367711 -67253 243853 -20051 -40013 -134948 169684 -59404 -228078 109691 -6251
10242 13853 -127125 11514 146496 220184 231611 -341698 -44241 -167123 129127 -16433 -175362
10231 -175362 -22234 182383 283419 -363762 -13024 -251551 -125206 -142110 -226155 -189036
10221a89036f7475m33534a96541I5227a15359D5285g8900D9839N0219a9871o2237
10210h2108A68890F892c7947B16219H0358g7185j78135E1942K850A937a29281
10198i808q0565M2541f939B06620I7387i0132A14586a03527H544a53985f0438
10186b84621i2962c9083n91000H7790J3805K524b149m08891B6511b94766A93868
10174a51629D622a71118j85968A89580h6131g638A31742G14J45577a40970C8472
10162f1130d568j84539o8915E3256b70532a29303A45715C2521a22350k4854j74143
10151c21347k6936a71990L0398C30926a5899o0996b205m8884j37395D8664J36239
10140A84903b6080m7619j13020j14835a40555k01521A52731F9940b23095p3500
$$ plain form
10221 -189036 -67475 -501009 -196541 95227 -115359 45285 -78900 49839 100058 -19871 -82108
10210 -82108 168890 6892 -37947 216219 80358 -77185 -255320 51942 54792 1937 -129281
10198 -9808 -90373 -47832 -6939 206620 97387 -90132 114586 -103527 8544 -153985 -60438
10186 -284621 -92962 -39083 -630083 87790 101595 104119 -2149 -411040 26511 -294766 193868
10174 -151629 4622 -171118 -357086 189580 -86131 -7638 131742 714 146291 -140970 38472
10162 -61130 -4568 -189107 -258022 53256 -270532 -129303 145715 32521 -122350 -147204 -321347
10151 -321347 -348283 -171990 -141592 330926 -15899 -76895 -2205 -51089 -188484 48664 184903
10140 184903 -26080 -73699 -186719 -301554 -140555 -342076 152731 69940 -223095 -296595
10130b96595b3698B7883a69027k32947n927g1387I8270a56733K624n1715m821
10119b10645D09812A69932c70897d8399k71191a32254b8954k9195r51n3002I7584
10107h2183m34920A3462a0745B85267h0890B9905c09902a02110H4720a53288N7229
10096i6059j66276J18353I503a92763Q9300j88912A11477C9080N3354c43750A62892
10084c00719a49080O8215q8346G0249J12834b9024p0547p1610g1524p3434j09033
10073b53991A42313c33255B19550C0069d448B17379b66446B7429J18275i5304
10062E3681R5424A9425K01507a34434A18484d90564F3329c32675C8289a9310j80837
10051b00147q0133G2314b06257A7102c77643J49397A44116b33747H8517D981a36923
$$ plain form
10130 -296595 -23698 27883 -169027 -401974 -407901 -71387 98270 -156733 -154109 -205824 -210645
10119 -210645 409812 169932 -370897 -48399 -319590 -132254 -28954 -58149 -59100 -112102 97584
10107 -82183 -517103 13462 -10745 285267 -80890 29905 -309902 -102110 84720 -153288 -96059
10096 -96059 -262335 -143982 9503 -192763 -103463 -292375 111477 39080 92434 -343750 162892
10084 -300719 -149080 -80865 -169211 70249 183083 -29024 -99571 -171181 -71524 -144958 -253991
10073 -253991 142313 -333255 219550 30069 -4448 217379 -266446 27429 145704 -95304
10062 53681 149105 19425 220932 -134434 118484 -490564 63329 -332675 38289 -19310 -200147
10051 -200147 -280280 72314 -206257 17102 -377643 -228246 144116 -233747 88517 4981 -136923
10039A10141c65749a18061L107j1008B10108a82511G4155b58070m3463A25740
10028E0732g8062A66395P9118j22138A2058c8492A14566J4991n3734a10602J3464
10017i7138A70460K24824D0645a8951j78570j34774a43107j17318B41718a11298
10006A12805J36323a64825A92252a03651A32353a81A01074j4948b62131o7808
9996c29939C5380a46578j63497E0548J21606e3011j23665G5078c28017a06517
9985a87730a2028j012p8433I167a64633J4948f1188m8283K8019b1739j43216M2117
9973a22838j11188l7076K2302A53811a71172L9257B48505c96376F7770g9067A7763
9961a03331A16960c14839J51668F0477a2405C1245R488a40210B97184a14698l74863
$$ plain form
10039 110141 -365749 -118061 -114954 -125962 210108 -182511 74155 -258070 -301533 125740
10028 50732 -78062 166395 245513 123375 12058 -38492 114566 129557 75823 -110602 -97138
10017 -97138 170460 395284 40645 -18951 -197521 -332295 -143107 -260425 241718 -111298
10006 112805 249128 -164825 192252 -103651 132353 -181 101074 86126 -262131 -329939
9996 -329939 35380 -146578 -310075 50548 172154 -53011 -176676 75078 -328017 -106517
9985 -187730 -12028 -13040 -91473 9167 -164633 -149685 -61188 -109471 -81452 -21739 -164955 -122838
9973 -122838 -234026 -271102 -248800 153811 -171172 -131915 248505 -396376 67770 -79067 17763
9961 -103331 116960 -314839 -163171 60477 -12405 31245 40733 -140210 297184 -114698 -489561
9950d89561a29759l03376D90874b61567C4633e40381A72154i7038H4252a10543
9939d61449M5416c862m2310F3296J74115b14235P4598F8177d6774p6794B5284
9927E452b87237D7292c5310j18962d9995j45409M835p4485A40940a25569B41218
9915a18515D6117J80144m6168b05532P7083E6916n409b9156k5728B4217J72447
9904A96664c1953B8483a0877l54030B1668b19551A763K1472K28753b02432O8810
9893a33622I1991b1065k51325i1877G1579a89019A59108e792j18099a3143k46248
9882b59391J24086j32117E1284h642l51284a32035k9091G5299a42156j14961B93854
9870a13689k70965J38620l7854A8190i4873c3628j71800N277K782Q2657M8256
$$ plain form
9950 -489561 -129759 -433135 490874 -261567 34633 -540381 172154 -97038 84252 -110543
9939 -461449 -416033 -3862 -46172 63296 237411 -214235 -139637 68177 -46774 -123568 25284
9927 5452 -287237 47292 -35310 -154272 -49995 -195404 -190569 -265054 140940 -125569 241218
9915 -118515 46117 226261 180093 -205532 -128449 56916 51507 -29156 -54884 24217 196664
9904 196664 -31953 28483 -10877 -364907 21668 -219551 1763 23235 251988 -202432 -133622
9893 -133622 91991 -21065 -272390 -91877 71579 -189019 159108 -5792 -123891 -13143 -259391
9882 -259391 -135305 -267422 51284 -8642 -359926 -132035 -161126 75299 -142156 -257117 293854
9870 -113689 -384654 -246034 -283888 18190 -94873 -33628 -205428 -200151 -197369 -114712 -66456
9859f6456a4340k55287R4763a7976B24502B7467J20928a46265l7437h4785k40705
9848c25490g7685R814a8794F4711R7615J49803G0687L4547a90117I9849K24754
9837C24603E5838k7380b04352r2050j28815a75115c3705l8633j07025E9010K492
9826F1502j6206O4577P7805J10748a81102P3649B5392b1759B95911A09133a47050
9814b42678b3157m010j46621c9682A7529h5913f470k24962I580l64P0714b8670
9801d40741D7284a05017c5144r3959B30640b88045e0476j5671o9969E4484j6147
9790C8337b9665r2879A23790J14780a48942j16497A7791K49280c02531P0171L9267
9779a93093d4490k08416J01618I3155b77665A19039A8860a67678r3242A54602
$$ plain form
9859 -66456 -14340 -269627 -174864 -17976 224502 27467 148395 -146265 -183702 -84785 -325490
9848 -325490 -77685 -67871 -18794 64711 162326 312129 70687 105234 -190117 99849 324603
9837 324603 55838 28458 -204352 -296402 -425217 -175115 -33705 -72338 -179363 59010 61502
9826 61502 45296 109873 187678 298426 -181102 -107453 25392 -21759 295911 109133 -147050
9814 -242678 -23157 -27167 -173788 -39682 17529 -85913 -6470 -231432 9580 9216 79930 -28670
9801 -440741 47284 -105017 -35144 -129103 230640 -288045 -50476 -66147 -136116 54484 38337
9790 38337 -29665 -122544 123790 238570 -148942 -265439 17791 267071 -302531 -232360 -193093
9779 -193093 -44490 -252906 -151288 93155 -277665 119039 18860 -167678 -260920 154602
9768a90589P9784d7382p7059a7609l1321k44975B41984a90534q7124a16918B1237
9756c521k17707j8934a15204k70018e9318j85268N7705A86183E0010c8394j59614
9745a98008a2760m0295i388n2500C837b1577p3162b9926k1434q3913h976p1742
9733h0718c8832k03882A2296J8603b04169A8597c137D7713n441b0033o25D6759
9720c8691J4624j39046N0034A11188O9754L635a42631B06940b27128O2715O5653
9709i8760B09425g2346B36733a39533b4245l71893P0144i7750k61066b6877p5071
9698a01948A43025c73444h7909m4085c0674I592b52946c320o5448j86546G4017
9686f3257a9643q6101j32638a3760B73112G0514c72938H6034a24500r7461B70107
$$ plain form
9768 -190589 -110805 -47382 -124441 -17609 -48930 -293905 241984 -190534 -277658 -116918 21237
9756 -3521 -221228 -240162 -115204 -385222 -59318 -244586 -186881 186183 50010 -38394 -198008
9745 -198008 -12760 -53055 -9388 -61888 3837 -21577 -94739 -29926 -51360 -135273 -8976 -80718
9733 -80718 -38832 -242714 12296 30899 -204169 18597 -3137 47713 42272 -20033 -20658 46759
9720 -38691 -24067 -163113 -113079 111188 180942 184577 -142631 206940 -227128 -164413 -98760
9709 -98760 209425 -72346 236733 -139533 -24245 -396138 -325994 -97750 -358816 -26877 -101948
9698 -101948 143025 -373444 -87909 -131994 -30674 9592 -252946 -3320 -68768 -255314 74017
9686 -63257 -19643 -105744 -238382 -13760 273112 70514 -372938 86034 -124500 -221961 270107
9674c08369M6241i9742q955C33248a40345B5616L6776b06000m8249c9131A777
9662a08878H3836J51084h6915P416j37851O393l6054j08745g4226k73228A41186
9650e7333j015J1552k21447J21993J8946r6136Q1440F6087c26086B09326a04819
9638e31188f2496A87351a89594j32514Q1826e2904l7114o6494k31837a58351g2849
9626a17482B24325d1743n8027p1362d0203j45628k0248J00536K0361A82781b1949
9614a95978B01545I2168b19134D4721e4489C32842A64046a13770A7131a08679
9603A1980d4715o130A0930a67413a9464C6505K7354c54055P4752a37580c7553
9591D9701c49040h6663n2129A97225c87830a75545d6480A63740j1283c20548i5073
$$ plain form
9674 -308369 -262128 -99742 -108697 333248 -140345 25616 62392 -206000 -254249 -39131 1777
9662 -108878 83836 234920 -86915 -79499 -217350 -210957 -247011 -355756 -74226 -347454 141186
9650 -57333 -58348 -46796 -268243 -146250 -127304 -223440 -142000 66087 -326086 209326 -104819
9638 -531188 -62496 187351 -189594 -322108 -240282 -52904 -90018 -156512 -388349 -158351 -72849
9626 -117482 224325 -41743 -99770 -171132 -40203 -185831 -206079 -105543 -85182 182781 -21949
9614 -195978 201545 92168 -219134 44721 -54489 332842 164046 -113770 17131 -108679
9603 11980 -44715 -50845 10930 -167413 -19464 36505 63859 -354055 -279303 -137580 -37553
9591 49701 -349040 -86663 -138792 197225 -387830 -175545 -46480 163740 152457 -320548 -95073
9579b73655B75638C5013d4238H936e9957o4651K4733i150C85299b55119f635A20678
9566g4626D9007f0686G97b38778A6691a89447c4067B21176a24628j72030b7700
9554h2489o8090j3164d3242j41447A25155g1690k5204l4709m2540j50836B25128
9542A17613c19448P0493K8081G9699A1967d67454a23250B9612e3480Q943F564
9530F6268a26984j55699A01721K64942C6431J12211a01146G7048f7275o045A26747
9518A0950b04566I8853b11416D3463c0500A0598b8936l1009B2595b90354A04001
9506b05457j9092E221b03694j60732B92624g8094c4873a5822j95471A21788a77583
9494A09934c85965a4520j09712J5158k21370f9107o6297m40782b08594f4418k7391
$$ plain form
9579 -273655 275638 35013 -44238 8936 -59957 -124608 -99875 -9150 385299 -255119 -6635 120678
9566 -74626 49007 -60686 797 -238778 16691 -189447 -34067 221176 -124628 -296658 -27700
9554 -82489 -150579 -163743 -43242 -184689 125155 -71690 -96894 -131603 -174143 -324979 225128
9542 117613 -319448 -248955 -220874 79699 11967 -467454 -123250 29612 -53480 -44537 6564
9530 66268 -126984 -282683 101721 366663 36431 148642 -101146 77048 -67275 -73320 126747
9518 10950 -204566 98853 -211416 43463 -30500 10598 -28936 -59945 22595 -290354 104001
9506 -205457 -224549 5221 -203694 -364426 292624 -78094 -34873 -15822 -211293 121788 -177583
9494 109934 -385965 -14520 -124232 -109074 -330444 -69107 -135404 -576186 -208594 -64418 -91809
9483i1809n0582C2738f8860k7688n6992B44032d5513r1052N6886K2108H966b93920
9470A6363p122d8497k08686A30134a38044G747c58282j38911I8379i7191K8881
9459f8310o7999C4699b08786O3006J4896j43217J25659a4040j2145j01884k42619
9448c70688g0808b6576l3724n8416F2108a8697j34722O2418A58666D4296Q3131
9437A27427a70598d1116A13426g0107b7370k70784G8496e9576m9583A72692a55722
9425a3448p8000D8979a65359k623j8820r7762A08225a10516B8550b4871j12010
9414a36881r0891B9216i5048j08944F4692c34898J31097G5926b15020A17313c70347
9402g6555j86389P0433l525j10659A46152C7544J428K26830i6004E585c0852A41402
$$ plain form
9483 -91809 -142391 32738 -68860 -96548 -153540 244032 -45513 -136565 -79679 -57571 8966 -293920
9470 16363 9241 -48497 -257183 130134 -138044 7747 -358282 -497193 98379 -97191 -68310
9459 -68310 -136309 34699 -208786 -145780 -130884 -274101 -148442 -14040 -26185 -128069 -370688
9448 -370688 -70808 -26576 -60300 -118716 62108 -18697 -153419 -91001 158666 44296 127427
9437 127427 -170598 -41116 113426 -70107 -27370 -298154 78496 -59576 -109159 172692 -155722
9425 -13448 -91448 48979 -165359 -167982 -186802 -284564 108225 -110516 28550 -24871 -136881
9414 -136881 -227772 29216 -95048 -203992 64692 -334898 -203801 75926 -215020 117313 -370347
9402 -76555 -262944 -192511 -196036 -306695 146152 37544 38972 265802 -96004 5585 -30852 141402
9389A40416e6040A40182a16551b1907G5117a02878j11426N9861I2441a20899A81248
9377A92013p5002a9568G7744a70461Q4268G6766a6406n7974A41659a33579H9920
9365h6674H5654J19583q6440a9840n5568C7449d7113k95802B70492G8787b70245
9353d1388A22007L529L026i0231C0215J9865a41716A53459a93682F7572a09647
9341a33041b3000I624P918A383b89117A24063c8644n812A06005a39882E7449a94497
9328a85612l3347J0433f3751l26785H4652O896a12838j55898A50335i4112o8140
9317a62252b8568E4651g2294j5013c2942n2454k3483m3705A31173M0867a85516
9305A2001a65947p8218M8169P3795a1886k38252O1958C3822L8216a31881G6634
$$ plain form
9389 140416 -56040 140182 -116551 -21907 75117 -102878 -214304 -154443 92441 -120899 181248
9377 192013 117011 -19568 77744 -170461 -86193 76766 -16406 -74380 141659 -133579 89920
9365 -86674 85654 205237 118797 -19840 -75408 37449 -47113 -342915 270492 78787 -270245
9353 -41388 122007 125536 128562 -90231 30215 50080 -141716 153459 -193682 67572 -109647
9341 -133041 -23000 9624 17542 1383 -289117 124063 -38644 -44456 106005 -139882 57449 -194497
9328 -185612 -218959 -208526 -63751 -390536 84652 91548 -112838 -268736 150335 -94112 -162252
9317 -162252 -28568 54651 -72294 -87307 -32942 -85396 -108879 -152584 131173 172040 -185516
9305 12001 -165947 -244165 -195996 -122201 -11886 -250138 -188180 33822 72038 -131881 76634
9293d3833q6983a8449k5053A82259b89974N3901d0200a6488j09847c512A38094
9281a47874M3597C71318b4260C0829K3696O6246a75305a7684A80170C9701J60525
9270B00226a40586b8915m92613b44313h3711L8847I2566c57195a68369m3486e6735
9258b24768p1962B15234A5079e5254A03527o889b33775i9822d7373F3857e15033
9246A86224c6745k22213h3382I308J8780b98718P9275P6802N1153E6525a32413
9234A57058b17557d6300j66422N3805r8122j936J23345B47146F1744J5735k970
9223G4509C0287c42178B10183D5158c58885J30750D17547a67389K3497B30789
9212A20243J68993a40634b536B76960C3654a66506O0164l43478a29965j51187
$$ plain form
9293 -43833 -130816 -18449 -43502 182259 -289974 -236073 -40200 -16488 -126335 -3512 138094
9281 -147874 -104277 371318 -24260 30829 54525 120771 -175305 -17684 180170 39701 200226
9270 200226 -140586 -28915 -521528 -244313 -83711 -44864 92566 -357195 -168369 -211855 -56735
9258 -224768 -296730 215234 15079 -55254 103527 96638 -233775 -99822 -47373 63857 -515033
9246 186224 -36745 -258958 -83382 9308 28088 -298718 -219443 -142641 -91488 56525 -132413
9234 157058 -217557 -46300 -212722 -158917 -257039 -258975 -135630 247146 61744 77479 74509
9223 74509 30287 -342178 210183 45158 -358885 -228135 417547 -167389 -143892 230789
9212 120243 289236 -140634 -2536 276960 33654 -166506 -106342 -449820 -129965 -281152
9202b81152E9729b32323g599m62615a61536C25021B8984b3464a0357j74994a040
9190I907a29427c926A7202i9256a8379l2256j8120l50086A11766J39665a74468
9178H0299B3636J63895c71179a64833P7985b7554A02130K1239b22464A91408D3476
9166e85120e5265b1328n9775A46558L8440C2609J58871a58669j07156j1716L5162
9155b42379j77644H4636g7981j83387B30517a11643j0376I7131e12030K47448
9145b64582K8303A82512i9433E2449L63480a73736A00267a74503f6811o6069p0959
9134b03839N3593e3975A29984K3725c393l50476N351J35426A34638d6991n0883
9123i7874j40145K5479A1096M9859a27354B6425R3023c69837A2421K547c09351
$$ plain form
9202 -281152 59729 -232323 -7599 -470214 -161536 325021 28984 -23464 -10357 -185351 -1040
9190 9907 -129427 -3926 17202 -99256 -18379 -50635 -68755 -418841 111766 251431 -174468
9178 80299 23636 187531 -371179 -164833 -86848 -27554 102130 123369 -222464 191408 43476
9166 -585120 -55265 -21328 -81103 146558 184998 32609 191480 -158669 -265825 -277541 -242379
9155 -242379 -420023 84636 -77981 -261368 230517 -111643 -122019 97131 -512030 -264582
9145 -264582 -236279 182512 -99433 52449 415929 -173736 100267 -174503 -66811 -132880 -203839
9134 -203839 -150246 -53975 129984 153709 -3393 -353869 -348518 -213092 134638 -46991 -97874
9123 -97874 -238019 -212540 11096 60955 -127354 26425 119448 -369837 12421 14968 -309351
9111c0965j65272A7694K04589g5309b7184j10884j78621A21346Q1505b09795P4680
9100a35115m5629G7438a1045r348k32233c8988k04305J12297o1968F7838c0086
9088A31624K53455d9434k1511j91855e7083j03997I2037a0564j49036B22929g5991
9076a63976g0l9772j42444j08228K7991Q2403P7984A03548M2716e567m7583k01721
9064b54871D3286N308j5991a65585j2034E233L0654h5321k71335a06888M5797
9053f1091o2193A07393b58808A2436P1869A5203K16469c36671A48268c1143j0268
9042d1411j60279j09255A88606m9904c14219a53046f7989A26114f4149m5425o2096
9031a71670B66279G380L6871a05301j52165J23364k08942h1818G2938a54228K0007
$$ plain form
9111 -30965 -196237 17694 222283 -75309 -27184 -138068 -316689 121346 202851 -209795 -135115
9100 -135115 -180744 77438 -11045 -20393 -252626 -38988 -243293 -130996 -192964 67838 -30086
9088 131624 385079 -49434 -70945 -262800 -57083 -161080 92037 -10564 -159600 222929 -75991
9076 -163976 -70 -39842 -182286 -290514 -262523 -180120 -102136 103548 146264 -5567 -53150 -254871
9064 -254871 43286 48594 32603 -165585 -177619 5233 35887 -85321 -356656 -106888 -61091
9053 -61091 -123284 107393 -258808 12436 84305 15203 231672 -336671 148268 -31143 -41411
9042 -41411 -201690 -310945 188606 138702 -314219 -153046 -67989 126114 -64149 -109574 -171670
9031 -171670 266279 7380 44251 -105301 -257466 -134102 -343044 -81818 72938 -154228 -134221
9020a34221I9024a72196O7058j13033G4329B2664J02033J17636d0857o1521c4163
9008G0063L2296f3726k77781C8164M975a31701C8322b0057B74948a51745k1085
8997a72830Q5286B5693K03204b35621l813B24469a39568a9404G2687b55602d7170
8985D2904b55147m6224K9641l3105d8478G0739M4715h6951G929g5030C4023J47718
8973A81741n2591a77373A79201A6700o911J41246K5832o1190n2399f5124j0056
8962g5180B00039r0722a58209k06263A30517a35383j52103r912J35050c5629B0106
8950G2435A9389J20468J37242a60268M2166o882j04191i2365A23681b59196k2728
8939b81924a0036o345B24516r8266o1064K33118g5179B67139H6097Q4512c0003
$$ plain form
9020 -134221 99024 -172196 -105138 -218171 74329 22664 124697 242333 -40857 -102378 -34163
9008 70063 102359 -63726 -341507 38164 43139 -131701 38322 -20057 274948 -151745 -172830
8997 -172830 -87544 25693 228897 -235621 -239434 224469 -139568 -19404 72687 -255602 -47170
8985 42904 -255147 -301371 -271730 -304835 -48478 70739 115454 -86951 7929 -75030 34023 181741
8973 181741 129150 -177373 179201 16700 9789 151035 176867 115677 63278 -65124 -75180
8962 -75180 200039 109317 -158209 -364472 130517 -135383 -287486 -297398 -162348 -35629 20106
8950 72435 19389 139857 277099 -160268 -118102 -124984 -229175 -92365 123681 -259196 -281924
8939 -281924 -10036 -16381 224516 126250 65186 298304 -75179 267139 86097 170609 -30003
8927i6950B7625J81507L36328L33779J061060M674058N480586D079240A538482
8917D95302r7840d3229A37867a19353B23087k2514E1920e2665B21678R7638A08758
8905A5842f0938r6553f0619A36260b22490d7057m4703c5297A43932i2243D3340
8893b51860C18959a92181e7653H3259b9370k09755A5139a4666j77586j63334a73350
8881a36487M2015k8217A24564a41225K619d4887j65659G9619B4834J74162E1971
$$ plain form
8927 -96950 27625 209132 545460 879239 1940299 6614357 12094943 4079240 1538482
8917 495302 397462 -43229 137867 -119353 223087 200573 51920 -52665 221678 319316 108758
8905 15842 -60938 -157491 -60619 136260 -222490 -47057 -91760 -35297 143932 -92243 43340
8893 -251860 318959 -192181 -57653 83259 -29370 -239125 15139 -14666 -192252 -355586 -173350
8881 -136487 -94472 -122689 124564 -141225 -138606 -44887 -210546 79619 24834 198996 51971
$$ [...]
##END NTUPLES=NMR SPECTRUM
##END=
