
##TITLE=AC1383_ECUA12195_7519144_wWxNilQlzo
##JCAMPDX= 6.0         $$ Bruker NMR JCAMP-DX V2.0
##DATA TYPE= NMR SPECTRUM
##DATA CLASS= NTUPLES
##ORIGIN= BRUKER
##OWNER= Administrator
$$ 1.72 TOPSPIN		Version 2.1
$$ 2013-02-21 00:48:19.513 -0500  Administrator@X
$$ Compression mode = diff/dup
##.OBSERVE FREQUENCY= 400.02188249412
##.OBSERVE NUCLEUS= ^1H
##.ACQUISITION MODE= SIMULTANEOUS (DQD)
##.ACQUISITION SCHEME= undefined
##.AVERAGES= 64
##.DIGITISER RES= 22
##SPECTROMETER/DATA SYSTEM= spect
##.PULSE SEQUENCE= noesygpps1d.comp
##.SOLVENT NAME= COFFEE_meoh
##.SHIFT REFERENCE= INTERNAL, COFFEE_meoh, 1, 14.96105
##AUDIT TRAIL= $$ (NUMBER, WHEN, WHO, WHERE, PROCESS, VERSION, WHAT)
$$ ##TITLE= Audit trail, TOPSPIN		Version 2.1
$$ ##JCAMPDX= 5.01
$$ ##ORIGIN= Bruker BioSpin GmbH
$$ ##OWNER= Administrator
$$ $$ E:\/data/COFFEE/nmr/AC1383_ECUA12195_7519144_wWxNilQlzo/12/pdata/1/auditp.txt
$$ ##AUDIT TRAIL=  $$ (NUMBER, WHEN, WHO, WHERE, PROCESS, VERSION, WHAT)
(   1,<2013-02-21 00:48:13.404 -0500>,<Administrator>,<X>,<go>,<TOPSPIN 2.1>,
      <created by zg
	started at 2013-02-21 00:36:43.183 -0500,
	POWCHK enabled, PULCHK disabled,
       configuration hash MD5:
       86 BA 57 50 F2 9D 5C 9B 26 00 A9 28 5F 66 2E 89
       data hash MD5: 64K
       59 EF C3 26 D2 58 16 0D E2 6C DB DA 4A B6 40 76>)
(   2,<2013-02-21 00:48:16.482 -0500>,<Administrator>,<X>,<proc1d>,<TOPSPIN 2.1>,
      <Start of raw data processing
       efp LB = 0.3 FT_mod = 6 PKNL = 1 PHC0 = 0 PHC1 = 0 SI = 128K 
       data hash MD5: 128K
       C9 8D 13 92 49 7D 83 54 93 FB 16 02 66 47 53 8C>)
(   3,<2013-02-21 00:48:17.607 -0500>,<Administrator>,<X>,<proc1d>,<TOPSPIN 2.1>,
      <pk PHC0 = 249.126 PHC1 = 0 
       data hash MD5: 128K
       52 F2 D7 61 8D 92 00 BA C4 21 1E 3A EA 48 81 89>)
(   4,<2013-02-21 00:48:18.466 -0500>,<Administrator>,<X>,<proc1d>,<TOPSPIN 2.1>,
      <abs ABSG = 1 
       data hash MD5: 128K
       00 8D D3 86 FC A4 EC 6D 8A 27 86 79 06 15 0A 52>)
(   5,<2013-02-21 00:48:18.638 -0500>,<Administrator>,<X>,<proc1d>,<TOPSPIN 2.1>,
      <abs ABSG = 2 
       data hash MD5: 128K
       74 EA 28 11 C6 98 33 C1 29 4E D0 4A DE 83 FD BB>)
(   6,<2013-02-21 00:48:18.826 -0500>,<Administrator>,<X>,<proc1d>,<TOPSPIN 2.1>,
      <abs ABSG = 3 
       data hash MD5: 128K
       3C 3A 6C EE 57 35 DC D9 5C 05 BA 16 95 78 AA 85>)
(   7,<2013-02-21 00:48:18.998 -0500>,<Administrator>,<X>,<proc1d>,<TOPSPIN 2.1>,
      <abs ABSG = 4 
       data hash MD5: 128K
       B4 5E 66 E8 59 67 F0 19 9E C2 3B 4D 80 3E 62 4D>)
(   8,<2013-02-21 00:48:19.216 -0500>,<Administrator>,<X>,<proc1d>,<TOPSPIN 2.1>,
      <abs ABSG = 5 
       data hash MD5: 128K
       37 F4 AB 38 7B 78 40 04 80 8F 4F E3 69 6D E9 7D>)
$$ ##END=
$$ 
$$ $$ hash MD5
$$ $$ C9 EA B0 BB 3C 99 05 DA F9 87 D4 B6 37 4E 8C 76
##$RELAX= 
##$RELAX= 
##$RELAX= 
##$RELAX= 
##$RELAX= 
##$RELAX= 
##$RELAX= 
##$RELAX= 
$$ Bruker specific parameters
$$ --------------------------
##$DU= <E:\>
##$EXPNO= 12
$$ [...]
150 150 150 150 150 150 150 150
##$TP07= 0
##$TPNAME0= <>
##$TPNAME1= <>
##$TPNAME2= <>
##$TPNAME3= <>
##$TPNAME4= <>
##$TPNAME5= <>
##$TPNAME6= <>
##$TPNAME7= <>
##$TPOAL= (0..7)
0.5 0.5 0.5 0.5 0.5 0.5 0.5 0.5
##$TPOFFS= (0..7)
0 0 0 0 0 0 0 0
##$TUNHIN= 0
##$TUNHOUT= 0
##$TUNXOUT= 0
##$USERA1= <user>
##$USERA2= <user>
##$USERA3= <user>
##$USERA4= <user>
##$USERA5= <user>
##$V9= 5
##$VALIST= <valist>
##$VCLIST= <CCCCCCCCCCCCCCC>
##$VD= 0
##$VDLIST= <DDDDDDDDDDDDDDD>
##$VPLIST= <PPPPPPPPPPPPPPP>
##$VTLIST= <TTTTTTTTTTTTTTT>
##$WBST= 1024
##$WBSW= 4
##$XGAIN= (0..3)
0 0 0 0
##$XL= 0
##$YL= 0
##$YMAX_a= 6418529
##$YMIN_a= -11841446
##$ZGOPTNS= <>
##$ZL1= 120
##$ZL2= 120
##$ZL3= 120
##$ZL4= 120
##$ABSF1= 14.96105
##$ABSF2= -5.597132
##$ABSG= 5
##$ABSL= 3
##$ALPHA= 0
##$AQORDER= 0
##$ASSFAC= 0
##$ASSFACI= 0
##$ASSFACX= 0
##$ASSWID= 0
##$AUNMP= <proc_prof1d_extract.lims>
##$AXLEFT= 0
##$AXNAME= <>
##$AXNUC= <1H>
##$AXRIGHT= 0
##$AXTYPE= 0
##$AXUNIT= <>
##$AZFE= 0.1
##$AZFW= 0.1
##$BCFW= 0
##$BC_mod= 0
##$BYTORDP= 0
##$COROFFS= 0
##$CY= 15
##$DATMOD= 1
##$DC= 0
##$DFILT= <>
##$DTYPP= 0
##$F1P= 0
##$F2P= 0
##$FCOR= 0.5
##$FTSIZE= 131072
##$FT_mod= 6
##$GAMMA= 0
##$GB= 0
##$INTBC= 1
##$INTSCL= 1
##$ISEN= 128
##$LB= 0.3
##$LEV0= 0
##$LPBIN= 0
##$MAXI= 10000
##$MC2= 0
##$MEAN= 0
##$ME_mod= 0
##$MI= 0
##$NCOEF= 0
##$NC_proc= -2
##$NLEV= 6
##$NOISF1= 0
##$NOISF2= 0
##$NSP= 0
##$NTH_PI= 0
##$NZP= 0
##$OFFSET= 14.96105
##$PC= 1
##$PHC0= 249.126
##$PHC1= 0
##$PH_mod= 1
##$PKNL= yes
##$PPARMOD= 0
##$PPDIAG= 0
##$PPIPTYP= 0
##$PPMPNUM= 2147483647
##$PPRESOL= 1
##$PSCAL= 4
##$PSIGN= 0
##$PYNMP= <proc.py>
##$REVERSE= no
##$SF= 400.020009616147
##$SI= 131072
##$SIGF1= 0
##$SIGF2= 0
##$SINO= 400
##$SIOLD= 131072
##$SPECTYP= <>
##$SREGLST= <1H.CDCl3>
##$SSB= 0
##$STSI= 131072
##$STSR= 0
##$SW_p= 8223.68421052631
##$SYMM= 0
##$S_DEV= 0
##$TDeff= 65536
##$TDoff= 0
##$TI= <>
##$TILT= no
##$TM1= 0
##$TM2= 0
##$TOPLEV= 0
##$USERP1= <user>
##$USERP2= <user>
##$USERP3= <user>
##$USERP4= <user>
##$USERP5= <user>
##$WDW= 1
##$XDIM= 131072
##$YMAX_p= 419056448
##$YMIN_p= -11105
##$CURPLOT= <Network HP LaserJet P1505>
##$CURPRIN= <$Network HP LaserJet P1505>
##$DFORMAT= <normdp>
##$LAYOUT= <+/1D_H.xwp>
##$LFORMAT= <normlp>
##$PFORMAT= <normpl>
##$SURQMSG= 1
$$ End of Bruker specific parameters
$$ ---------------------------------
##NTUPLES= NMR SPECTRUM
##VAR_NAME=  FREQUENCY,     SPECTRUM/REAL,   SPECTRUM/IMAG
##SYMBOL=    X,             R,               I
##VAR_TYPE=  INDEPENDENT,   DEPENDENT,       DEPENDENT
##VAR_FORM=  AFFN,          ASDF,            ASDF
##VAR_DIM=   131072,        131072,          131072
##UNITS=     HZ,            ARBITRARY UNITS, ARBITRARY UNITS
##FACTOR=    0.0627417313425164, 1,          1
##FIRST=     8223.62146879497, -557,         -62824
##LAST=      0,             1676,            -63005
##MIN=       0,             -11105,          0
##MAX=       8223.62146879497, 419056448,    0
$$ Real data points
##PAGE= N=1
##DATA TABLE= (X++(R..R)), XYDATA
$$ [...]
61614D68224j085m86r8k00p77j706k818l756m187m240m330m556m641m470m226
61599D26648m000l793l870m509n296n380m588l684l201k743j882j144j334k266
61585C78958k961k908k530k371k487k780l311l982m301l860k802j661q05l39k89
61570C41571n99j049j388j534j470j065l15L62M36n8n22n90n49p48r72p42m5N95
61552C31318O67J27n98q44j87J063K061K262J881J346P71J90q0Q0K57J60J97Q06
61534C41477J574J887J983K449K947K535J256J65k44n76j256j840k004k159k572
61519C45622k818k622k386k363k123j443q78p93o57JO51N79Km05n46o98p70m55
61501C27898J69P48J011O98k73j240j249m25Ol96m84O20K008K331J640P22l98
$$ plain form
61614 468224 467139 466653 466555 466355 465578 463872 461054 457298 453111 448871 444541 439985 435344 430874 426648
61599 426648 422648 418855 414985 410476 405180 399800 395212 391528 388327 385584 383702 382558 381224 378958
61585 378958 375997 373089 370559 368188 365701 362921 359610 355628 351327 347467 344665 343004 342199 341860 341571
61570 341571 340972 339923 338535 337001 335531 334466 334151 334513 334949 334891 334369 333779 333230 332482 331510 330768 330723 331318
61552 331318 331985 332112 331514 330670 330483 331546 333607 335869 337750 339096 339867 340057 339977 340057 340314 340474 340671 341477
61534 341477 343051 344938 346921 349370 352317 354852 356108 356273 356029 355453 354197 352357 350353 348194 345622
61519 345622 342804 340182 337796 335433 333310 331867 330989 330196 329539 329540 330191 330770 330772 330367 329821 329123 328353 327898
61501 327898 328067 328815 329826 330524 330251 329011 327762 327337 327343 326947 326463 327083 329091 331422 333062 333784 333386
61484C33386j867k773k115m92O44J064J613K378K539J979J472J310J052O60N44
61469C41394M74j87j108j206m02K28K49L84R21J050L25m11l33K04M97N61O94P55
61451C44089N90N38Q84J289J242P09O7k68qO68J008N11j67M4J105K005K350K636
61433C59292K916K509J441Q15J186J734J730J694K199K654K264J405R22P56L03
61418C83820k80k01O98J686K045J676R17K72J19K52k4r78j911j982j200k52K86
61401C84943J78o17j734k393k121j318o54k43J83N55N18O4l53l54J6M39O85Q07
61383C78601J078J578J994K035J932K140K577K720K488K417K814L274L243K707
61369D11598K084J808K021K358K112J127K33J88M66P7p02o47L76J134J075J171
$$ plain form
61484 333386 331519 328746 326631 326139 326783 327847 329460 331838 334377 336356 337828 339138 340190 340850 341394
61469 341394 341868 341681 340573 339367 338965 339193 339442 339826 340747 341797 342122 341711 341378 341582 342079 342640 343334 344089
61451 344089 344679 345217 346101 347390 348632 349341 349408 349140 349132 349800 350808 351319 351152 351196 352301 354306 356656 359292
61433 359292 362208 364717 366158 366973 368159 369893 371623 373317 375516 378170 380434 381839 382761 383517 383820
61418 383820 383540 383339 384037 385723 387768 389444 390361 390633 390752 391004 390980 390002 388091 386109 384909 384657 384943
61401 384943 385121 384504 382770 380377 378256 376938 376284 376041 376224 376779 377297 377361 377008 376654 376670 377109 377794 378601
61383 378601 379679 381257 383251 385286 387218 389358 391935 394655 397143 399560 402374 405648 408891 411598
61369 411598 413682 415490 417511 419869 421981 423108 423341 423529 423995 424072 423370 422723 423099 424233 425308 426479
61353D26479K118L146L566M135N628P144P313O430N931O116N938M883L773L440
61339D96040L724M032M079L801L154K282J513R79N32N7l52n46m50j93j67o77j403
61322E16405j633j174n53j02M38J183J643J634J865K900M227N108N777O902Q315
61307E52935R342J0036J1096J2646J4123J5282J6371J7265J7235J5814J3241R991
61295G15377O439L055L36j621l013l894m360m989o374q189r419r622r344r179
61281F55203r057q654p906o863n528m105k985k257j624r75n94n92n06Q7R04J230
61265F05778Q12J43r5L34J136J882K450L143M337O039P678Q382P567N525L376
61250F58487K182J984J900J173j27j458k463l099l452l692l941m017l589k759
$$ plain form
61353 426479 428597 431743 435309 439444 445072 452216 459529 465959 471890 478006 483944 488827 492600 496040
61339 496040 499764 503796 507875 511676 514830 517112 518625 519604 520136 520193 519841 519295 518845 518652 518485 517808 516405
61322 516405 514772 513598 513045 512943 513381 514564 516207 517841 519706 522606 526833 531941 537718 544620 552935
61307 552935 562277 572313 583409 596055 610178 625460 641831 659096 676331 692145 705386 715377
61295 715377 721816 724871 725207 723586 720573 716679 712319 707330 700956 692767 683348 673726 664382 655203
61281 655203 646146 637492 629586 622723 617195 613090 610105 607848 606224 605249 604655 604063 603557 603644 604548 605778
61265 605778 606590 606733 606638 606972 608108 609990 612440 615583 619920 625959 633637 642019 649586 655111 658487
61250 658487 660669 662653 664553 665726 665599 664141 661678 658579 655127 651435 647494 643477 639888 637129
61236F37129k113j964j889j404p67n86q95j056m79Q59K588M262N572O486P180
61221F52923P777Q315Q966R934J1009J1572J1341J0814J0704J1119J1503J1150
61209G77127R777P853O482O390O946O745N349L818L313L902N145O866Q705R780
61195H68198R859J0229J2273J5498J8019J8869J8670J8086J6691J3851R891N922
61183A036056K919J188L28m89j857l617n180o378p574r056j0645j1946j2663j2805
61169I58281j2864j3636j5361j7158j7858j7390j6856j7132j7919j8302j7826
61158G75979j6825j5887j5226j4504j3237j1399r451p676n837l725j701k51O63
61145F60923J258J166j84k478m482n427n810o455p209p067n510l253j547q95o68
$$ plain form
61236 637129 635016 633052 631163 629759 628992 628406 627511 626455 625976 626835 629423 633685 639257 645743 652923
61221 652923 660700 669015 677981 687915 698924 710496 721837 732651 743355 754474 765977 777127
61209 777127 786904 794757 801239 807629 814575 821320 826669 830487 833800 837702 842847 849713 858418 868198
61195 868198 878057 888286 900559 916057 934076 952945 971615 989701 1006392 1020243 1030134 1036056
61183 1036056 1038975 1040163 1040491 1040002 1038145 1034528 1029348 1022970 1015396 1006340 995695 983749 971086 958281
61169 958281 945417 931781 916420 899262 881404 864014 847158 830026 812107 793805 775979
61158 775979 759154 743267 728041 713537 700300 688901 679450 671774 665937 662212 660511 660260 660923
61145 660923 662181 663347 663163 660685 656203 650776 644966 638511 631302 624235 618725 615472 613925 613030 612362
61130F12362N6J495L156M621N993P595R567J1893J4436J6850J8754K0203K1695
61117G48676K3532K5397K6818K7776K8615K9538L0415L0974L1024L0542K9575
61106A062882K8041K5794K3071K0517J8375J5985J2705Q909N322J594l182q675
61094A211338j3259j6171j8465k1288k4337k6765k8565l0043l0806l0337k9116
61083I42186k8165k7771k7371k6428k4795k2550k0090j8090j6868j6046j5093
61072F98919j3711j1605q690n857m480m611m681l619k191j382p20N96J951K180
61058F42099J601J644K861M519N967P219Q368R395J0477J1756J3023J4270J5958
61045G49157J8088J9763K0511K1260K2977K5206K6938K8140K9145K9553K9119
$$ plain form
61130 612362 612418 613913 617069 621690 627683 635278 644845 656738 671174 688024 706778 726981 748676
61117 748676 772208 797605 824423 852199 880814 910352 940767 971741 1002765 1033307 1062882
61106 1062882 1090923 1116717 1139788 1160305 1178680 1194665 1207370 1216279 1221601 1223195 1220013 1211338
61094 1211338 1198079 1181908 1163443 1142155 1117818 1091053 1062488 1032445 1001639 971302 942186
61083 942186 914021 886250 858879 832451 807656 785106 765016 746926 730058 714012 698919
61072 698919 685208 673603 664913 659056 654576 649965 645284 641665 639474 638092 637372 637968 639919 642099
61058 642099 643700 645344 648205 652724 658691 665910 674278 683673 694150 705906 718929 733199 749157
61045 749157 767245 787008 807519 828779 851756 876962 903900 932040 961185 990738 1019857
61034A019857K8897K9934L1409L1814L1384L1703L3284L5274L7227L9466M1852
61023A392101M3734M5065M6264M7226M7785M8751N1223N5491O1760P0866Q2519
61012A992785R4243J04178J13885J26112J41251J58989J82096K14826K58373L11743
61002C698481L76363M55360N49444O59553P93662R63855J175566J426623J713815
60993A1812722K017925K264600K317044K051321J470280P40708R9823k86247l83941
60984B2104235k47327M2482L77032N96967N33482J17083n51248j252720j786111
60975A9933875k065576k116484k011548j820778j597337j376975j176686r98823
60967F769668q41770p05986n91344m94562m12185l43420k88254k44903k10606
$$ plain form
61034 1019857 1048754 1078688 1110097 1141911 1173295 1204998 1238282 1273556 1310783 1350249 1392101
61023 1392101 1435835 1480900 1527164 1574390 1622175 1670926 1722149 1777640 1839400 1910266 1992785
61012 1992785 2087028 2191206 2305091 2431203 2572454 2731443 2913539 3128365 3386738 3698481
61002 3698481 4074844 4530204 5079648 5739201 6532863 7496718 8672284 10098907 11812722
60993 11812722 13830647 16095247 18412291 20463612 21933892 22674600 22774423 22488176 22104235
60984 22104235 21856908 21899390 22276422 22873389 23406871 23523954 22972706 21719986 19933875
60975 19933875 17868299 15751815 13740267 11919489 10322152 8945177 7768491 6769668
60967 6769668 5927898 5221912 4630568 4136006 3723821 3380401 3092147 2847244 2636638
60958B636638j83313j61383j43040j27139j13532j01958r1437q1213p1324o1982
60948A500317n3334m6060m1187l8956l8541l8953l9468l9283l7797l5388l3028
60937A058322l1110k9429k8091k7424k6991k5784k3593k1292j9602j8387j7257
60926G89362j6081j4741j3118j1447j0118r139q339p907q026q239p930p287o989
60913F60001p051o848o128n237m426l679l134k939k821k434j923j498q78R6P59
60898F11860N01r6j18L2q27k655m025l973k952j834j090r80j482j830j173K02
60882E89560J220J549J757K023J981J891K642M222N456N648N400N421N592N721
60868F40083O118O864P463P732Q171Q979R689J0268J1509J3690J5787J6816J7088
$$ plain form
60958 2636638 2453325 2291942 2148902 2021763 1908231 1806273 1714836 1633623 1562299 1500317
60948 1500317 1446983 1400923 1359736 1320780 1282239 1243286 1203818 1164535 1126738 1091350 1058322
60937 1058322 1027212 997783 969692 942268 915277 889493 865900 844608 825006 806619 789362
60926 789362 773281 758540 745422 733975 723857 714718 706379 698472 690446 682207 674277 666990 660001
60913 660001 652950 646102 639974 634737 630311 626632 623498 620559 617738 615304 613381 611883 611005 611101 611860
60898 611860 612361 612265 612147 612179 611352 608697 604672 600699 597747 595913 594823 593843 592361 590531 589358 589560
60882 589560 590780 592329 594086 596109 598090 599981 602623 606845 612301 617949 623349 628770 634362 640083
60868 640083 646201 653065 660528 668260 676431 685410 695099 705367 716876 730566 746353 763169 780257
60855G80257J7384J7597J7174J6279J5647J5621J6042J6706J7370J7673J7637
60844I65387J7795J8359J8739J8422J7714J6965J5703J3497J1122R834R537Q763
60832A141837O552L500O29j946m710p691j0311j2262j3949j5905j8024j9700k0668
60819A027352k1319k2025k2551k2516k2147k1985k2022k1701k0885k0103j9600
60808G90498j8812j7209j5218j3729j3003j2545j1943j1260j0569r558p857n683
60796F43112l879l262l877m937n515n289m616m017l683l414k977k547k727l884
60782E88488n492o508o466n821n108m413l934m272n500o555o421n495m919m895
60768E12689m734m323m328m868n150m801m448m524m437l645k752k707l368l672
$$ plain form
60855 780257 797641 815238 832412 848691 864338 879959 896001 912707 930077 947750 965387
60844 965387 983182 1001541 1020280 1038702 1056416 1073381 1089084 1102581 1113703 1123537 1133074 1141837
60832 1141837 1148389 1151889 1152518 1150572 1145862 1138171 1127860 1115598 1101649 1085744 1067720 1048020 1027352
60819 1027352 1006033 984008 961457 938941 916794 894809 872787 851086 830201 810098 790498
60808 790498 771686 754477 739259 725530 712527 699982 688039 676779 666210 656652 648795 643112
60796 643112 639233 635971 632094 627157 621642 616353 611737 607720 604037 600623 597646 595099 592372 588488
60782 588488 582996 576488 570022 564201 559093 554680 550746 546474 540974 534419 527998 522503 517584 512689
60768 512689 507955 503632 499304 494436 489286 484485 480037 475513 471076 467431 464679 461972 458604 454932
60754D54932l016j832r31p59j226j840k038j657r75k21P16J843K658K564J604
60739D49822M71k16m87q31j525k231k298j566n73J29N63R52J065N31m24j204j698
60722D40480k244k789k907k717k908l567l841l245k503k453k863l055l177l833
60708C98378m715m683l344j760j235j913k869l196k691j747r63p39r99j260j123
60693C65141o47j34L19Q37J352J429P79k24p91m97L96J380K183K807L331L806
60677C81467M077L783K824J882J959L132M304M499L995L708L882L969L559K800
60663D29840K038J511J335J392J377J272J506K230K852K844K641K994L698L843
60649D61373L252K733K845L222L258K789J843M63j047k222l052l956n030n859
$$ plain form
60754 454932 451916 450084 449153 448394 447168 445328 443290 441633 440658 440437 441153 442996 445654 448218 449822
60739 449822 450293 450077 449590 448759 447234 445003 442705 441139 440566 440695 441258 442210 443275 443806 443382 442178 440480
60722 440480 438236 435447 432540 429823 426915 423348 419507 416262 413759 411306 408443 405388 402211 398378
60708 398378 393663 388980 385636 383876 382641 380728 377859 374663 371972 370225 369262 368523 367524 366264 365141
60693 365141 364494 364360 364679 365516 366868 368297 369076 368852 368061 367564 367960 369340 371523 374330 377661 381467
60677 381467 385544 389327 392151 394033 395992 399124 403428 407927 411922 415630 419512 423481 427040 429840
60663 429840 431878 433389 434724 436116 437493 438765 440271 442501 445353 448197 450838 453832 457530 461373
60649 461373 464625 467358 470203 473425 476683 479472 481315 481778 480731 478509 475457 471501 466471 460612
60635D60612o207o312o360o248n977n699n230m189k741j547p71L4Q21P71l73j504
60619D09080j489o95m12j089j931k058j399m86J42L08K27K32L50L50K47L49O56
60602D02382P14L97K81P61J221P66m67j361j201l85L34Q32J530K611L637L963
60586D16015L361K139P68m23j179j251o55J28N17L85P2k7K86R73J752K298K725
60569D27884L574N040O532P535Q454R919J1556J2425J2451J2403J2371J1426R080
60556E50650O129L515J212j212l623n590o952p589p122n524l532j858l88J267
60542E19383K903M101N094O552Q624J0862J2941J4843J6372J7023J6466J4751
60530F49915J2061Q609M806J156k096n004p517r189r399p923n414l274k670l491
$$ plain form
60635 460612 454405 448093 441733 435485 429508 423809 418579 414390 411649 410102 409331 409365 410186 410957 410584 409080
60619 409080 407591 406896 406484 405395 403464 401406 400007 399521 399663 399971 400198 400430 400780 401130 401377 401726 402382
60602 402382 403096 403493 403774 404535 405756 406522 406055 404694 403493 403108 403442 404274 405804 408415 412052 416015
60586 416015 419376 421515 422283 421860 420681 419430 418775 418903 419420 419805 419877 419850 420136 421109 422861 425159 427884
60569 427884 431458 436498 443030 450565 459019 468938 480494 492919 505370 517773 530144 541570 550650
60556 550650 556779 560294 561506 560294 556671 551081 544129 536540 529418 523894 520362 518504 518116 519383
60542 519383 522286 526387 531481 538033 546657 557519 570460 585303 601675 618698 635164 649915
60530 649915 661976 670585 675391 676547 674451 669447 661930 652741 643342 635419 630005 626731 624061 620570
60516F20570m492m579l724k557j467m19O02J333J424Q38J49L52J993M511O814
60501F21348Q542J0382J3029J6418K0219K4443K9159L3974L8286M1824M4631M6749
60489I49004M8244M9086M8661M5581L8729K8426J6271L685r075k2229l5067m5596
60477A115720n1956n4108n3728n2328n0025m6446m2089l7894l3937k9665k5324
60466F38220k1957j9759j7641j4885j2183j0368r102p650o271n727n909n913n353
60453D95502m724m550m790n113n197m805m009l303l075l069k762k114j560j317
60439D45114j211j110j135j339j536j540j391j218r92n50J93R81J316R39J61m98
60423D36184q75j113j207r81n30j18K79Q88J539J744J504J423J832K359K537K366
$$ plain form
60516 620570 616078 611499 607775 605218 603751 603332 603934 605267 606691 607529 607678 608030 610023 614534 621348
60501 621348 629890 640272 653301 669719 689938 714381 743540 777514 815800 857624 902255 949004
60489 949004 997248 1046334 1094995 1140576 1179305 1207731 1224002 1227687 1218612 1196383 1161316 1115720
60477 1115720 1063764 1009656 955928 903600 853575 807129 765040 727146 693209 663544 638220
60466 638220 616263 596504 578863 563978 551795 541427 532325 524675 518404 512677 506768 500855 495502
60453 495502 490778 486228 481438 476325 471128 466323 462314 459011 455936 452867 450105 447991 446431 445114
60439 445114 443903 442793 441658 440319 438783 437243 435852 434634 433642 433092 433285 434266 435582 436521 436682 436184
60423 436184 435309 434196 432989 432008 431478 431360 431639 432527 434066 435810 437314 438737 440569 442928 445465 447831
60407D47831K044J682J448J497J539J076K66r1L08Q35R12P28O40O16O50J063J788
60390D64832K145J911J893K786M053M634M245L303K126J057P37J386K173K161
60376D99442J617J516K006K275J865J252J063J390J948K353K236J555P96M82N59
60361E22355O58P74J191J837K234K185K117K593L628M547M583L820L365M200N979
60346E66066P575Q728J0086J1521J1641R652O684M300K523L71k351m981p220r180
60332F15415j0438j0279q936p579o894o445n605m450l567l484m289n415n790m773
60318E27471k899j371q86j224j673j518m76R24J720J733J965L358N646P934R820
60303E50524J1281J2270J3212J5312J9139K3302K5590K5182K2739J8735J3017
$$ plain form
60407 447831 449875 451557 453005 454502 456041 457117 457383 457292 457600 458435 459347 460075 460715 461331 461981 463044 464832
60390 464832 466977 468888 470781 473567 477620 482254 486499 489802 491928 492985 493722 495108 497281 499442
60376 499442 501059 502575 504581 506856 508721 509973 511036 512426 514374 516727 518963 520518 521314 521796 522355
60361 522355 523013 523787 524978 526815 529049 531234 533351 535944 539572 544119 548702 552522 555887 560087 566066
60346 566066 573641 582369 592455 603976 615617 625269 631953 636253 638776 639147 636796 631815 624595 615415
60332 615415 604977 594698 585762 578183 571289 564844 559239 554789 551222 547738 543449 538034 532244 527471
60318 527471 524572 523201 522315 521091 519418 517900 517424 518348 520068 521801 523766 527124 532770 540704 550524
60303 550524 561805 574075 587287 602599 621738 645040 670630 695812 718551 737286 750303
60292G50303N955j281p869j3717j8526k1415k1876k0368j7744j4734j2133j0617
60280E95978j0020r372q040o404n277n044n503o120o384o189n880n693n429m914
60266E05709m468m330m072l172j829o49J01L38j75j230j774j120p6J63k13j25
60250D83078M11L09p11j552j269k2J562K886L188K053L88l16J12M55N8m04m14
60233D89812m09n68j00J388K950L569L506L524L608L369L060L217L648L674L183
60218E27431K799L045L848M749N368N700O112O860P693Q220Q532Q886R004Q467
60204F16714P771P942Q965R511Q684P135N930N111M070K790J937J946K432K517
60190F93455J512m08k271l336l904m637n347n335m765m684n499o452o836o784
$$ plain form
60292 750303 756258 754977 747108 733391 714865 693450 671574 651206 633462 618728 606595 595978
60280 595978 585958 576586 568546 562142 556865 551821 546318 540198 533814 527625 521745 516052 510623 505709
60266 505709 501241 496911 492839 489667 487838 487189 487290 487628 487453 486223 484449 483329 483253 483416 483203 483078
60250 483078 483489 483798 483087 481535 480266 480244 481806 484692 487880 489933 490321 490005 490117 490572 490630 490226 489812
60233 489812 489403 488835 488735 490123 493073 496642 500148 503672 507280 510649 513709 516926 520574 524248 527431
60218 527431 530230 533275 537123 541872 547240 552940 559052 565912 573605 581825 590357 599243 608247 616714
60204 616714 624485 632427 641392 650903 659587 666722 672652 677763 681833 684623 686560 688506 690938 693455
60190 693455 694967 694559 692288 688952 685048 680411 675064 669729 664964 660280 654781 648329 641493 634709
60176F34709o545n994n247m816m706m239l262k557k555k558j933j110p49p19o57
60161E87062p23j050j173q41o54j047j361q86j68j87p49p94j0R69J714K308K655
60144E85065K477K132K487L699M805M855M015L306L546M691O032O933P349P544
60130F48936P374O369M607K976K147J817J406R76R33J248J547J789K241K948L700
60115F91014M300M486L920K688J584J258J397J161L30n98j287j989l041m380n608
60100F95235o239n978n006l923l178k686k180j686j377j206r48m44L85J505K516
60085F64790K829K414K021K168K380J920R56K94J07l12j520l209m726n794o504
60070F57814o976p279p482p562p404p026o668o460o143n425m587m425n292o420
$$ plain form
60176 634709 628164 622170 616923 612107 607401 603162 599900 597343 594788 592230 590297 589187 588438 587719 587062
60161 587062 586339 585289 584116 583275 582621 581574 580213 579327 579159 578972 578223 577429 577419 578388 580102 582410 585065
60144 585065 587542 589674 592161 595860 600665 605520 609535 612841 616387 621078 627110 634043 641392 648936
60130 648936 656310 662679 667286 670262 672409 674226 675632 676608 677541 678789 680336 682125 684366 687314 691014
60115 691014 695314 699800 703720 706408 707992 709250 710647 711808 712138 711540 710253 708264 705223 700843 695235
60100 695235 688996 683018 678012 674089 670911 668225 666045 664359 662982 661776 660828 660384 660769 662274 664790
60085 664790 667619 670033 672054 674222 676602 678522 679478 679772 679879 679567 678047 674838 670112 664318 657814
60070 657814 650838 643559 636077 628515 621111 614085 607417 600957 594814 589389 584802 580377 575085 568665
60056E68665o594n487l916k688j818j060n73m73k12P98K296L515M251M832N309
60041E66845N453N461N761O129N931N245M852M958M767L630J791k06k111l712
60027F14794m761n456o281p180p683p987q875j0258j0872r995q490p489o934o174
60013E06359n157m178l134j878q12l53k35n2Rl55q25q78n51j75K34O37N44l37
59995D88863j371j610q96K66J525K777L721M167M536N388O432O691N670M003K803
59980E32965K539K580J866J37j632k410k407k598l114l203k694k384k625k697
59966E14323k131j490j225q28J52J207J846K470L388L941L566K890K741K919K915
59951E36684K971L266L048J891R45J431K539K526J292J85l90j318k783l770l802
$$ plain form
60056 568665 562071 556584 552668 549980 548162 547102 546529 546056 545844 546642 548938 552453 556704 561536 566845
60041 566845 572298 577759 583520 589649 595580 600825 605677 610635 615402 619032 620823 620617 618506 614794
60027 614794 610033 604577 598296 591116 583433 575446 566571 556313 545441 535446 526956 519467 512533 506359
60013 506359 501202 497024 493890 492012 491200 490847 490612 490560 490569 490214 489389 488511 487960 487785 488019 488656 489200 488863
59995 488863 487492 485882 484986 485252 486777 489554 493275 497442 501978 507366 513798 520489 526159 530162 532965
59980 532965 535504 538084 539950 540087 538455 536045 533638 531040 527926 524723 522029 519645 517020 514323
59966 514323 512192 510702 509477 508649 508801 510008 511854 514324 517712 521653 525219 528109 530850 533769 536684
59951 536684 539655 542921 545969 547860 548805 550236 552775 555301 556593 556778 556388 555070 552287 548517 544715
59936E44715l557l450l073k455k414l096l465k861j985j600j333n39M98J118J344
59921E17847J633K031K272K392K619K950L309L911N004O340P352P772P877Q058
59907E81367Q374Q515Q207P495O482M959K669L5j934k739k971l356l711l362k233
59892F07797r09J28P99J170J434J926K655L076K842K435K531K974L131K937K935
59877F37861L377L921M176L989L302K209J072J73n97j411k213l074m276n661o374
59862F36474n919m902m169l762l370l050k729j743L5J365J174K94L75J545K644
59847F14262L375M562O346P764Q350Q613Q600P422M772J683o97k042k239j061
59833F69710R32K252J985O89o80j917l160m306n400o872q657r789r500q239o997
$$ plain form
59936 544715 541158 537708 534635 532180 529766 526670 523205 520344 518359 516759 515426 514887 515385 516503 517847
59921 517847 519480 521511 523783 526175 528794 531744 535053 538964 543968 550308 557660 565432 573309 581367
59907 581367 589741 598256 606463 613958 620440 625399 628068 628103 626169 623430 620459 617103 613392 610030 607797
59892 607797 606888 607016 607815 608985 610419 612345 615000 618076 620918 623353 625884 628858 631989 634926 637861
59877 637861 641238 645159 649335 653324 656626 658835 659907 660080 659483 658072 655859 652785 648509 642848 636474
59862 636474 630555 625653 621484 617722 614352 611302 608573 606830 606865 608230 609404 609698 610073 611618 614262
59847 614262 617637 622199 628545 636309 644659 653272 661872 669294 674066 675749 675052 673010 670771 669710
59833 669710 670642 672894 674879 675568 674888 672971 669811 665505 660105 653233 644576 634787 625287 617048 610051
59818F10051o198n671n270m878m221l191k119j333p09M7R75J860K467K597K259
59803E86666J798J523J226N17m80j319k071l251m831o043o370o121n770n347m739
59788E45388m059l503l167l158l404l380k618j484q58r87j316j473j628j767j429
59773E11157n44K25M04L75P17J326J618J329P63M60P53J438J969K161K545L619
59757E30315M975N733N649N174M624M074L889M504N555O051N526M413L300K506
59743E96288K320K812L392L318K708K291K274K269K273K668L238L254K668K214
59729F33987K131J894J378J157J366J384J055J045J509J652J189J020J661K157
59715F54585J592O66O40J348J574R64M20O25J136J187P30M22Q51J922K978L521
$$ plain form
59818 610051 603853 598182 592912 588034 583813 580622 578503 577170 576461 576508 577483 579343 581810 584407 586666
59803 586666 588464 589987 591213 591730 591250 589931 587860 584609 579778 573735 567365 561244 555474 550127 545388
59788 545388 541329 537826 534659 531501 528097 524717 522099 520615 519757 518770 517454 515981 514353 512586 511157
59773 511157 510613 510838 511242 511617 512334 513660 515278 516607 517370 517830 518583 520021 521990 524151 526696 530315
59757 530315 535290 541023 546672 551846 556470 560544 564433 568937 574492 580543 586069 590482 593782 596288
59743 596288 598608 601420 604812 608130 610838 613129 615403 617672 619945 622613 625851 629105 631773 633987
59729 633987 636118 638012 639390 640547 641913 643297 644352 645397 646906 648558 649747 650767 652428 654585
59715 654585 656177 656843 657483 658831 660405 661369 661789 662414 663550 664737 665467 665889 666740 668662 671640 675161
59699F75161L696L848L915L676L396L565M147M719N181N558N304L797J502l63
59685G27102j406k202k876k764j783q81o87q76j283k406m170n496n797n859o374
59670F82242o745o298n639n654n951n516m351l316k772k339j758j106m03L13Q17
59655F31524J132J806L118M480N140N085M699M008K893J614M92n67j719k785l660
59640F57260m686o052p326q027q209p987p114n561l952k824j943j006m00o36j462
59625E90075k247k795l250l540l545l416l283l001k621k568l001l495l697l714
59611E45902l531k805j687r89r51p07M46K011L170L805L962L223J541j35r72j240
59595E51043j437j309p52o40j550k461k088q64k10l89n60m75o09q05l63N17P77
$$ plain form
59699 675161 678857 682705 686620 690296 693692 697257 701404 706123 711304 716862 722166 725963 727465 727102
59685 727102 725696 723494 720618 717854 716071 715190 714503 713627 712344 709938 705768 700272 694475 688616 682242
59670 682242 675497 669199 663560 657906 651955 646439 642088 638772 636000 633661 631903 630797 630394 630707 631524
59655 631524 632656 634462 637580 642060 647200 652285 656984 660992 663885 665499 665991 665424 663705 660920 657260
59640 657260 652574 646522 639196 631169 622960 614973 607859 602298 598346 595522 593579 592573 592173 591537 590075
59625 590075 587828 585033 581783 578243 574698 571282 567999 564998 562377 559809 556808 553313 549616 545902
59611 545902 542371 539566 537879 536890 535939 535232 535678 537689 540859 544664 548626 551849 553390 553255 552283 551043
59595 551043 549606 548297 547545 546905 545355 542894 540806 539942 539732 539343 538783 538308 537699 536894 536531 537048 537825
59578E37825J07p51j347k014k819l245l179l108l133k763k024j668j918j974j239
59563E06750k15L67N42O42N19m8n80l23P25J742K070J910J893K235K553K467K122
59546E25371J933K015K221K586L282M210N186O504Q641J1331J3825J6179J9197
59533F22481K2471K3529K0065J2504L643l774q331r638q137n186k309j28J493
59520F68683K571K895K578J957J016m25k146l791n481p481r359j0267j0100r674
59506F20976r679r876r529q299o659n538n442n830n660m696l684l124k506j304
59492E39150M0P81J006J297J794K289K846L545L933L569K895K819L550M433M849
59477E78796M777M683N260O911R045J0314J0073R128Q388P417N249K152m37j662
$$ plain form
59578 537825 537932 537181 535834 533820 531001 527756 524577 521469 518336 515573 513549 511881 509963 507989 506750
59563 506750 506535 506902 507444 508086 508605 508557 507977 507654 508379 510121 512191 514101 515994 518229 520782 523249 525371
59546 525371 527304 529319 531540 534126 537408 541618 546804 553308 561949 573280 587105 603284 622481
59533 622481 644952 668481 688546 701050 704693 700919 692588 682950 674813 669627 667318 667190 668683
59520 668683 671254 674149 676727 678684 679700 679275 677129 673338 667857 660376 651017 640750 630650 620976
59506 620976 611297 601421 591892 583593 576934 571396 565954 560124 554464 549768 546084 542960 540454 539150
59492 539150 539190 539971 540977 542274 544068 546357 549203 552748 556681 560250 563145 565964 569514 573947 578796
59477 578796 583573 588256 593516 600427 609472 619786 629859 638987 647375 654792 660041 662193 661756 660094
59463F60094j974k113k149j701n93R48K549M088N825P922R908J1094J1559J1991
59449G17448J2509J2558J2086J1744J1516J0406Q023N220K393j485o919j2214
59437G83285j5154j5487j4499j2958j0919q826p304o256n483n534o704p779p283
59424F59099n364l083n41K694N911P934R187J1176J4069J6564J8022J8984J9697
59411G74349K0226K1894K6044L0515K9760K0212M423j1301k2267k7453k7763k4313
59399H14326j8331j1094l363M475J1171J3895R772j140j4583k4757k8761k8056
59387G23554k5595k2789j9725j6707j4069j1332q098n261l866l371k541j513j305
59374E87382j615j021O93K146K567K733L413M339N090N723O140O046N702N733
$$ plain form
59463 660094 658120 656007 653858 652157 651564 652512 655061 659149 664974 672896 682804 693898 705457 717448
59449 717448 729957 742515 754601 766345 777861 788267 796290 801510 803903 802418 795499 783285
59437 783285 768131 752644 738145 725187 714268 705442 698138 691882 686399 680865 674161 666382 659099
59424 659099 653735 650652 650111 652805 658716 666650 675837 687013 701082 717646 735668 754652 774349
59411 774349 794575 816469 842513 873028 902788 923000 927423 916122 893855 866402 838639 814326
59399 814326 795995 784901 781538 786013 797184 811079 820851 819711 805128 780371 751610 723554
59387 723554 697959 675170 655445 638738 624669 613337 605239 599978 596112 592741 590200 588687 587382
59374 587382 585767 584746 585439 587585 590152 592885 596298 600637 605727 611450 617590 623636 629338 635071
59360F35071O056O170O382P409Q836R547R704J0669J2710J4478J5213J5807J7117
59347G75169J8738K0087K1264K2153K2098K1174K0462K0258J9286J6545J2791
59336I90025R255N988K413j335m691p592j0381j3163j5801j8052j9421j9514j8761
59323H78970j8055j7564j6728j5547j4734j4391j3631j1933r853q099o868o333
59311G25234o601o905o079m207k675k158j798p50O95K086L639N459P132Q673J0781
59296G32526J3557J6072J7679J8368J7428J3307N904k328q605j2180j3711j3615
59284G84402j2151j0139q260o339m175k302j078J48K009M045N515O640Q077R760
59270G76152J1018J1383J0770R443Q185P702P444O017L188L67j422k855m883p285
$$ plain form
59360 635071 641127 647297 653679 661088 669924 679471 689175 699844 712554 727032 742245 758052 775169
59347 775169 793907 813994 835258 857411 879509 900683 921145 941403 960689 977234 990025
59336 990025 999280 1005268 1007681 1006346 1001655 994063 983682 970519 954718 936666 917245 897731 878970
59323 878970 860915 843351 826623 811076 796342 781951 768320 756387 746534 738435 731567 725234
59311 725234 718633 711728 705649 701442 698767 696609 694811 694061 694756 696842 700481 705940 713072 721745 732526
59296 732526 746083 762155 779834 798202 815630 828937 834841 832513 823908 811728 798017 784402
59284 784402 772251 762112 753852 747513 743338 741036 739958 740106 742115 746160 751675 758315 766392 776152
59270 776152 787170 798553 809323 818766 826951 834653 842097 848114 851302 851669 850247 847392 842509 835224
59256H35224r521j1705j3761j4747j4237j3320j3000j2626j1213r384q524q572
59244F94614q148o525m211j874J86J673K445K969L800M752N176M852M045L031
59230G06785K029J240N16n98k194l939n824q050r967j0330r190q204q325q384
59216F35565p076n123m095l975l446k035n40M37J114J762K303K700K984L088L101
59201F26764L418M122M583M188L050J684N41J40Q72K246L172L425L896M981N853
59186F72935O001O110O579O425M920L228K993M082N013N028M451L569K438J423
59172G35195R31Q67J154K138L703M809M876M896N961P444P849O950N792M980M212
59157H01757L159J792j7k259m429o110p538q912r738r617r084q763q424p657o748
$$ plain form
59256 835224 825703 813998 800237 785490 771253 757933 744933 732307 721094 711710 703186 694614
59244 694614 686466 679941 675730 673856 674042 675715 678160 681129 684929 689681 694857 699709 703754 706785
59230 706785 708814 710054 710570 709972 707778 703839 698015 689965 679998 669668 660478 652274 643949 635565
59216 635565 628489 623366 619271 615296 611850 609815 609275 609712 610826 612588 614891 617591 620575 623663 626764
59201 626764 630182 634304 638887 643075 646125 647809 648350 648490 649362 651608 654780 658205 662101 667082 672935
59186 672935 678936 685046 691625 698050 702970 706198 709191 713273 718286 723314 727765 731334 733772 735195
59172 735195 736126 736993 738147 740285 743988 748797 753673 758569 764530 771974 779823 786773 792565 797545 801757
59157 801757 804916 806708 806691 804432 800003 793893 786355 777443 767705 758088 749004 740241 731817 724160 717412
59142G17412o064n299m279l591l515l279k463k038k705l269k311n49K21j65m34
59127F77672j80j08k50J48R45J161Q27J164K669M415N567O309O952P306P386P695
59111G29678Q449R224R603R553R076Q231P375O754N996M667L085J886J043R0j056
59096H13654k168l209m053m196l658l507m478n590n275l507j698q61r60j726k853
59081G65915l720m046m597o194q272r494r513r034q492p840p349p363p425o747
59067F65829n449m288l467k806k689l544m599m499l205k052j955k542l079l195
59053F18460k727j824j172j324j894k149k043j865j392m29L60K96r0J14O33M70
59037F03424m02j101j312j350j142l83M90P84P80J324K438L553M761O464Q216
$$ plain form
59142 717412 711348 706049 701770 698179 694664 691385 688922 686884 684179 680910 678599 678050 678271 678106 677672
59127 677672 677492 677384 677134 677282 678227 679388 680215 681379 684048 688463 694030 700339 707291 714597 721983 729678
59111 729678 738127 747351 756954 766507 775583 783814 791189 797943 803939 808606 811691 813577 814620 814710 813654
59096 813654 811486 808277 804224 800028 796370 792863 788385 782795 777520 774013 772315 771454 770494 768768 765915
59081 765915 762195 758149 753552 747358 739086 729592 720079 711045 702553 694713 687364 680001 672576 665829
59067 665829 660380 656092 652625 649819 647130 643586 638987 634488 631283 629231 627276 624734 621655 618460
59053 618460 615733 613909 612737 611413 609519 607370 605327 603462 602070 601641 602001 602297 602207 602321 602954 603424
59037 603424 603022 601921 600609 599259 598117 597734 598224 599008 599788 601112 603550 607103 611864 618328 626544
59022F26544R250R900J1018J2314J2694J2059J1233J0346Q819O833N221L970K310
59009G42511K52j379k387l208l550k575m64J610L122M434N539O041O276O891P419
58994G70532O860N552M757M475L523J835P23N24Oj423k765l349l880m788n113
58979G77469m012k086l75R59K244L617N257P352R433J0722J1401J2532J4448J6277
58965H65238J7234J7393J7028J6337J5831J5775J5233J2967R359N998L307J18
58953A011818m160q462j1675j3896j5613j6884j7793j8602j9134j8921j8101j7126
58941H31451j5802j3772j1711j0533r702p999n738m360l957l235k010j555k174
58928G38903k589k175j685j340m01P54M53j479k909k493j454j154r50J39J475
$$ plain form
59022 626544 635794 645694 656712 669026 681720 693779 705012 715358 724177 731010 736231 740201 742511
59009 742511 742763 741384 738997 735789 732239 729664 729200 730810 733932 738366 743905 749946 756222 763113 770532
58994 770532 777392 782944 787701 792176 795699 797534 798257 798781 798787 797364 794599 791250 787370 782582 777469
58979 777469 773457 771371 770996 771955 774199 777816 783073 790425 799858 810580 821981 834513 848961 865238
58965 865238 882472 899865 916893 933230 949061 964836 980069 993036 1002395 1008393 1011700 1011818
58953 1011818 1007658 999196 987521 973625 958012 941128 923335 904733 885599 866678 848577 831451
58941 831451 815649 801877 790166 779633 769931 761932 756194 751834 747877 744642 742632 741077 738903
58928 738903 736314 734139 732454 731114 730713 731467 731920 730441 727532 725039 723585 722431 721481 721620 723095
58913G23095K010J980J977J796J389J580K619L429L534M196O331Q785J0161J1045
58899G83927J2776J5062J6521J6748J6482J6232J5966J5662J5264J4752J4840
58888I54232J6642J9923K2788K3920K3947K3764K2888K0638J7645J4747J1476
58877A172610P002J851k714o423r840j3021j5457j7046j8098j8687j8670j8055
58865A043452j6882j5126j3075j1219r638q184p331p744q893r451r309r719j1117
58852I05764j2351j2662j2720j2919j2417j0891r625r637j0122r995r611r668
58840G73146r766r397r178r641r909r020p620o919o793o309n416m732m219l351
58826F70876k107q56L39J393J925K052K700M244N681O066N905O200O873P136O744
$$ plain form
58913 723095 725105 727085 729062 730858 732247 733827 736446 739875 743409 747605 753936 762721 772882 783927
58899 783927 796703 811765 828286 845034 861516 877748 893714 909376 924640 939392 954232
58888 954232 970874 990797 1013585 1037505 1061452 1085216 1108104 1128742 1146387 1161134 1172610
58877 1172610 1179612 1181463 1178749 1172326 1162486 1149465 1134008 1116962 1098864 1080177 1061507 1043452
58865 1043452 1026570 1011444 998369 987150 977512 969328 961997 954253 945360 935909 926600 916881 905764
58852 905764 893413 880751 868031 855112 842695 831804 822179 812542 802420 792425 782814 773146
58840 773146 763380 753983 744805 735164 725255 716235 708615 701696 694903 688594 683178 678446 674227 670876
58826 670876 668769 667913 668252 669645 671570 673622 676322 680566 686247 692313 698218 704418 711291 718427 725171
58811G25171N933M779L429K369J773J200M63j3j69o39j583k293k606l469n349
58796G28996p280q244q383q144p474o631o455o878o522m741k799j883j347p3J613
58781F53755K718L191L551L768L681L682L950L800K733J217k51j827l449m439
58767F76080m714n100n820o095n875o193o989o622m632l021l231l809k849j017
58753F10113j24j79M4O20P40N53Q73J662K292K741L220L531L823M915O748P861
58737F49433P569P239P977Q611P713O124N552N981O328O546P038P136O087M710
58723G44044M210M198L623K750K462K561K541L103N024P404Q755R088R185Q809
58709H17757P345N349L670J932m41k704m100n627q529j2000j4363j5688j7117
$$ plain form
58811 725171 731104 735883 739312 741681 743454 744654 745117 745104 744935 744296 742713 740420 737814 734345 728996
58796 728996 721716 713472 705089 696945 689471 682840 676385 669507 662985 658244 655445 653562 652215 652142 653755
58781 653755 656473 659664 663215 666983 670664 674346 678296 682096 684829 686046 685795 683968 680519 676080
58767 676080 671366 666266 660446 654351 648476 642283 635294 628672 624040 621019 617788 613979 611130 610113
58753 610113 609989 609810 609854 610474 611214 611767 612640 614302 616594 619335 622555 626086 629909 634824 641572 649433
58737 649433 657002 664241 672218 680829 688542 694666 700218 706199 712527 719073 726111 733247 739334 744044
58723 744044 748254 752452 756075 758825 761287 763848 766389 769492 774516 781920 790675 799763 808948 817757
58709 817757 825102 830451 834121 836053 835612 832908 828808 823181 814652 802652 788289 772601 755484
58696G55484j8532j8874j8268j7741j7394j6597j5382j4051j2177r616p618p211
58684E82023p442o904n900n377m909l826l065l630m357l575j952j243j161j60
58670E28522J515K272K253L201N477P629Q861R743J0557J0972J1060J0775Q943
58657F21780M806R6k647l344l880m904n454n350n505o002o027n640n630n743n001
58642E61555l573k545k127j806j717k065j873k91J605K283K247K908L806L376
58628E61783J793O41K50k57q13o38j43j91r1J323L187L677L066L215M538N927
58612E87267P076Q303Q726P330N309M656M905M122K485J812K013J200p83k102
58598F42319k222k424k993k855k110k066k601k264r99p2O78K587N231O784P295
$$ plain form
58696 755484 736952 718078 699810 682069 664675 648078 632696 618645 606468 596852 589234 582023
58684 582023 574581 567677 561777 556400 551491 547665 544600 540970 536613 533038 531086 529843 528682 528522
58670 528522 530037 532309 534562 537763 543240 550869 559730 569473 580030 591002 602062 612837 621780
58657 621780 626586 626682 624035 620691 616811 611907 606453 601103 595598 589596 583569 577929 572299 566556 561555
58642 561555 557982 555437 553310 551504 549787 547722 545849 545558 547163 549446 551693 554601 558407 561783
58628 561783 563576 564217 564467 564210 563397 562759 562616 562425 562334 563657 566844 570521 573587 576802 581340 587267
58612 587267 594343 602646 611372 618702 624011 628667 633572 637694 640179 641991 644004 645204 644421 642319
58598 642319 640097 637673 634680 631825 629715 627649 625048 622784 621785 621713 622391 624978 630209 636993 644288
58583F44288Q612J0952J2579J3047J3596J4227J3484J1488J0019R342Q028O207
58571G75869N698O561O889O578P847J1275J4690J7017J9908K4410K8986L2015
58559I57743L3498L3333L0760K6512K2719J9662J5269Q792K211k843o840j0010
58547A130806j1168j0044q293p121o195n632o557q971j1608j4432j8608k3409
58535I98768k6223k6342k5822k5774k4802k2094j9061j6747j4422j1806r999r151
58523G66525p860n754m038k824q21J705K713J969J635K464K651J389K54j09j232
58508G58667l424m483l322j775j342j152n40n58j495j877j356j617l063l747k846
58493G26070k050k128j462N05J804J584J862L907O024O849P634R396J1000J1885
$$ plain form
58583 644288 652900 663852 676431 689478 703074 717301 730785 742273 752292 761634 769662 775869
58571 775869 781567 788128 795017 801595 809442 820717 835407 852424 872332 896742 925728 957743
58559 957743 991241 1024574 1055334 1081846 1104565 1124227 1139496 1148288 1150499 1147656 1140816 1130806
58547 1130806 1119638 1109594 1101301 1094180 1087985 1082353 1075796 1066825 1055217 1040785 1022177 998768
58535 998768 972545 946203 920381 894607 869805 847711 828650 811903 797481 785675 775676 766525
58523 766525 758665 752911 748873 746049 745228 746933 749646 751615 753250 755714 758365 759754 760008 759899 758667
58508 758667 755243 750760 747438 745663 744321 743169 742629 742071 740576 738699 737343 735726 732663 728916 726070
58493 726070 724020 721892 720430 720935 722739 724323 726185 730092 736116 742965 750599 759995 770995 782880
58479G82880J3566J6530J8721J9066J9321K0475K0429J7378J2523P445J838m149
58467I46023q444j0094j0932j2209j2445j0604q360p142n838l439r40J190M387
58454H61153Q901J2443J3799J4585J5550J4702J1101P011L912M5n679j0840j3240
58441I33443j4132j5094j5053j3078j0816r512p681m414j679q06lK076L688L628
58427H50567L957O279Q800R884J0958J2976J3660J1471Q704P343N539J564k324
58414I49378l718m319o581r269j0179j0255j1244j2092j1275r932r307q100n586
58401H37521m064m772m874k188O58P11j88R13K699K435J215J750L443L993L531
58386H42783L277K550R36O08K729M377K992Q27J009K330K210J722L184N591O819
$$ plain form
58479 782880 796446 812976 831697 850763 870084 890559 910988 928366 940889 948334 950172 946023
58467 946023 937579 927485 916553 904344 891899 881295 872935 865793 859955 856516 855576 856766 861153
58454 861153 870054 882497 896296 910881 926431 941133 952234 959245 963157 963202 957523 946683 933443
58441 933443 919311 904217 889164 876086 865270 855758 848077 843663 841984 841178 841175 843251 846939 850567
58427 850567 854524 860803 869603 879487 890445 903421 917081 928552 937256 944599 950138 951702 949378
58414 949378 945660 941341 934760 925491 915312 905057 893813 881721 870446 860514 851207 843107 837521
58401 837521 833457 828685 823811 821623 822281 822992 822804 823717 826416 828851 830066 831816 835259 839252 842783
58386 842783 846060 848610 849546 850154 852883 857260 860252 861079 862088 864418 866628 868350 871534 877125 883944
58371H83944P673R460J0433Q961P374Q351J0357J0912J1251J3312J5362J5205
58359A012595J4658J6041J7401J6003J3450J2396J1374P931L842K019J265p13
58347A128262k168n10K316L029K751M231O295O421O021P670R966J0457J0721J3149
58333A208611J5819J6039J5762J7808K0008J9017J6596J6097J5966J2995Q879
58322A383597P124O578M315J889K291L840L469K805M653O863O340N486P822J0911
58308A457983J0751R438J1050J3788J3858J3277J5778J8862J8292J6691J8893
58297A618661K2421K1758J8639J8695K1026K0700J8710J9676K2341K2084K0433
58286A845144K2284K6183K7107K6323K8548L1935L1275K8675L0318L4882L5967
$$ plain form
58371 883944 891617 901077 911510 920471 927845 936196 946553 957465 968716 982028 997390 1012595
58359 1012595 1027253 1043294 1060695 1076698 1090148 1102544 1113918 1121849 1125691 1127710 1128975 1128262
58347 1128262 1126094 1125584 1127900 1130929 1133680 1137911 1144206 1150627 1156648 1164318 1174284 1184741 1195462 1208611
58333 1208611 1224430 1240469 1256231 1274039 1294047 1313064 1329660 1345757 1361723 1374718 1383597
58322 1383597 1390721 1397299 1401614 1403503 1405794 1409634 1413103 1415908 1420561 1427424 1433764 1439250 1447072 1457983
58308 1457983 1468734 1478172 1489222 1503010 1516868 1530145 1545923 1564785 1583077 1599768 1618661
58297 1618661 1641082 1662840 1681479 1700174 1721200 1741900 1760610 1780286 1802627 1824711 1845144
58286 1845144 1867428 1893611 1920718 1947041 1975589 2007524 2038799 2067474 2097792 2132674 2168641
58275B168641L4051L5051L8827M0113L9345M1623M6368M8727M9561N3451N8730
58264B654488O0311O0125O3681O8892O9827O8540P1186P5445P4612P1014P2002
58253C410123P5672P4612P0970P3097P9763Q2837Q3377Q9422R9809J06096J08903
58242D354681J16077J26482J32221J35263J44674J58871J68236J73766J85000
58233E695271K01178K13287K23017K40076K62297K78852K91525L11651L37808
58224H054962L58881L77362M06032M43246M76328N07737N51663O06252O57084
58215A2439547P06951P72802Q54305R36595J023129J132649J264520J402826J554229
58206B2087553J743750J973862K229373K522339K887455L334165L854001M475410
$$ plain form
58275 2168641 2202692 2237743 2276570 2316683 2356028 2397651 2444019 2492746 2542307 2595758 2654488
58264 2654488 2714799 2774924 2838605 2907497 2977324 3045864 3117050 3192495 3267107 3338121 3410123
58253 3410123 3485795 3560407 3631377 3704474 3784237 3867074 3950451 4039873 4139682 4245778 4354681
58242 4354681 4470758 4597240 4729461 4864724 5009398 5168269 5336505 5510271 5695271
58233 5695271 5896449 6109736 6332753 6572829 6835126 7113978 7405503 7717154 8054962
58224 8054962 8413843 8791205 9197237 9640483 10116811 10624548 11176211 11782463 12439547
58215 12439547 13146498 13919300 14773605 15710200 16733329 17865978 19130498 20533324 22087553
58206 22087553 23831303 25805165 28034538 30556877 33444332 36778497 40632498 45107908
58198D5107908N256478O224444P384774Q788463J0519918J2625515J5144517J8203914
58190A29255931K1961963K6437440L1480964L6785185M1515378M3767397M0901560
58183C72105818L1222624J5728006j928948j7433878k8004936l3156857l4068018
58176C04463811l2546947l0212470k7981133k5974037k3903590k1585187j9102553
58169A23157894j6630154j4282650j2139277j0272104q695802p360443o224013
58162D7553451n281357m514103l872473l323302k867290k495947k176664j892574
58154B1129741j655827j469033j310353j167152j049438r59440q79839q01985
58146A1836674p36098o84411o32244n74271n23140m83775m44217l99748l61823
$$ plain form
58198 45107908 50364386 56588830 63973604 72762067 83281985 95907500 111052017 129255931
58190 129255931 151217894 177655334 209136298 245921483 287436861 331204258 372105818
58183 372105818 403328442 419056448 417127500 399693622 371688686 338531829 304463811
58176 304463811 271916864 241704394 213723261 187749224 163845634 142260447 123157894
58169 123157894 106527740 92245090 80105813 69833709 61137907 53777464 47553451
58162 47553451 42272094 37757991 33885518 30562216 27694926 25198979 23022315 21129741
58154 21129741 19473914 18004881 16694528 15527376 14477938 13518498 12638659 11836674
58146 11836674 11100576 10416165 9783921 9209650 8686510 8202735 7758518 7358770 6996947
58137F996947l35194l09254k80006k58568k49754k42693k30503k19943k14226
58128D656806k05038j89114j75183j67387j58393j45254j35671j32318j26930
58119C221518j16070j07319j03983r8948q9598q3752q4518q3792p7104p1081o9810
58108B235543o7375o0393n4984n4725n3992m9540m6886m8901m9602m5457m1872
58097A661816m2448m2440l8728l5841l6365l5503l0810k7528k8616k9131k5913
58086A288493k3358k4233k4131k0507j8109j9908k1503j9942j9291k2027k3495
58075A051989k0676j8104j9438k1003j9402j7736j8679j8822j5604j2771j3342
58064H56412j3972j1714r685j0644j1387r012o587p363r116r221r635j2015j3489
$$ plain form
58137 6996947 6661753 6352499 6072493 5813925 5564171 5321478 5090975 4871032 4656806
58128 4656806 4451768 4262654 4087471 3920084 3761691 3616437 3480766 3348448 3221518
58119 3221518 3105448 2998129 2894146 2795198 2705600 2621848 2537330 2453538 2376434 2305353 2235543
58108 2235543 2168168 2107775 2052791 1998066 1944074 1894534 1847648 1798747 1749145 1703688 1661816
58097 1661816 1619368 1576928 1538200 1502359 1465994 1430491 1399681 1372153 1343537 1314406 1288493
58086 1288493 1265135 1240902 1216771 1196264 1178155 1158247 1136744 1116802 1097511 1075484 1051989
58075 1051989 1031313 1013209 993771 972768 953366 935630 916951 898129 882525 869754 856412
58064 856412 842440 830726 821041 810397 799010 789998 783411 776048 766932 757711 748076 736061 722572
58051G22572j1973j0315j0723j0587q004n873o330o688n063m280o017o901m868
58038F24950l524n616p849o956n405o218p408o543n834p597r417q794q077r858
58024E25854j1754j0696q327p479p134n494m189m942n630m086k308k792m092l973
58010D42958l524m242m496k753q98p69p34Q00K059J512J102K392L264J980P37
57995D39388J573K495J375n7J59L26j352l029k853k631m025m756k741l92o29j980
57979D20871j895j569l096m888m423k817k450k616j606n19j032j850j246n79j556
57964C88729k524j319O25Q47P9K65Q15L93j4O19N61j635l811l570k292k181k100
57947C73487j76K057K283J670K560M170M577M683O154P657P239O331P269Q912
$$ plain form
58051 722572 710599 700284 689561 678974 670970 665097 658767 652079 647016 642736 636719 629818 624950
58038 624950 621426 615810 607961 601005 595600 589382 581974 575431 569597 562000 552583 543789 535712 525854
58024 525854 514100 503404 495077 487598 480464 474970 470781 465839 460209 456123 453815 451023 446931 442958
58010 442958 439434 435192 430696 427943 427045 426276 425542 426342 428401 429913 431015 433407 436671 438651 439388
57995 439388 440961 443456 444831 444774 444933 445259 443907 440878 438025 435394 431369 426613 423872 423480 422851 420871
57979 420871 418976 417407 414311 409423 405000 402183 399733 397117 395511 394992 393960 392110 390864 390285 388729
57964 388729 386205 384886 385511 386358 386437 386702 387517 387910 387896 388515 389076 387441 383630 380060 377768 375587 373487
57947 373487 373311 375368 377651 379321 381881 386051 390628 395311 401465 409122 416361 422692 429961 438873
57933D38873Q884Q115Q879J0089R010O144M127L091J159j589l580n027p092q957
57919D72126r285r275j0701j2351j2009j0486j0002r991q420n942m765m540l287
57906C61072j385p93j221q84j92q94k333k286r78n80j246j163q2O15Q92J816K880
57889C53238K754K189K986M555M668L166J899J435Q00Rj09q9j115k656l477m103
57873C66150n595o968o685n687n794o232n048l000k510l424l395k058j292j616
57859C06846j576o94L8M86J427K521K937L386M872O152N368L428K661K906K210
57844C42968O56M1J76p79k607l164k239j852k538k642j585o71l75K53J176J187
57828C28005L88J92P61R92R67J785L168L865M121M973N572M329K287K127L931
$$ plain form
57933 438873 447757 455872 464751 474840 483850 489994 494121 497212 498371 496782 493202 488175 481083 472126
57919 472126 462841 453566 442865 430514 418505 408019 398017 388026 379606 373664 368899 364359 361072
57906 361072 359687 358894 357673 356789 356597 355703 353370 351084 350106 349526 348280 347117 347035 347650 348542 350358 353238
57889 353238 355992 358181 361167 365722 370390 373556 375455 376890 377690 377699 377590 377501 376386 373730 370253 366150
57873 366150 360555 353587 346902 341215 335421 329189 324141 321141 318631 315207 311812 309754 308462 306846
57859 306846 305270 304576 304614 305100 306527 309048 311985 315371 320243 326395 331763 335191 337852 340758 342968
57844 342968 343624 343665 343841 343062 340455 337291 335052 333200 330662 328020 326435 325764 325389 325642 326818 328005
57828 328005 328393 328585 329346 330338 331305 333090 336258 340123 344244 349217 354789 359118 361405 363532 367463
57813C67463N253N231N174N112L385Q5k589l937n505p700q897q491p812p363o249
57798C33160m856m885o042n856l682j844j878k590k783k925l079k097o3J162R85
57783B92727J085K273L073K529J897K242K810L022L748N309O416O314N947N953
57769C45345N591M590L870L523K265r2j907k392k783l757m154l422l034l900m587
57754C35156l713k288k009k759l286l089k371j314l53q9k50J9M48j55j717k695
57738C09535k535k341k621k470j636j342k076k615k142j487j322r99j12N48N74
57723B86959P10J231J269N35l1k4j98p26p47k76n25j603k054j422j147j900k383
57706B77668j806j307j709k052j629j390j916k081j215n54j026j521r56k32m49
$$ plain form
57813 367463 372716 377947 383121 388233 391618 391703 389114 385177 379672 371972 363075 354584 346772 339409 333160
57798 333160 328304 323419 317377 311521 307839 305995 304117 301527 298744 295819 292740 290643 290580 291742 292727
57783 292727 293812 296085 299158 301687 303584 305826 308636 311658 315406 320715 327131 333445 339392 345345
57769 345345 350936 355526 359396 362919 365184 365092 363185 360793 358010 354253 350099 346677 343643 339743 335156
57754 335156 331443 329155 327146 324387 321101 318012 315641 314327 313974 313885 313635 313654 314102 313947 312230 309535
57738 309535 307000 304659 302038 299568 297932 296590 294514 291899 289757 288270 286948 285949 285837 286385 286959
57723 286959 287669 288900 290169 290704 290673 290649 290451 289725 288978 288702 288177 286574 284520 283098 281951 280051 277668
57706 277668 275862 274555 272846 270794 269165 267775 265859 263778 262563 262009 260983 259462 258506 258274 257825
57691B57825r36p31m38q30j095k21J145J836K015K397K812K962L528N143P264
57676B82676R205J1239J3666J6028J8327K1827K7515L4916M3316N2848O3368P3331
57664F68262Q0265Q0930P1038M7806J4495j9706m6280o2694p0520p1198o5961
57653F26437n7730m9763m2930l6311k9847k4503k0458j6963j3668j0744q192o109
57641C09219n032m961m862m073l207k804k250j082j13q6l67j59J73J04R6N27P49
57624B81872L17q9j20o69k077l011k514j702j890k539k682k788l440l611k311
57609B52746p47o42j502j641r86p24r17o42k7m3n98o81k36k11r14j752k370k750
57591B35363k614j941j567k037k523k146j614k029k846k641j377l10q0l21p89
$$ plain form
57691 257825 256889 256158 255720 254890 253795 253574 254719 256555 258570 260967 263779 266741 270269 275412 282676
57676 282676 291881 303120 316786 332814 351141 372968 400483 435399 478715 531563 594931 668262
57664 668262 748527 829457 900495 948301 962796 943090 896810 834116 763596 692398 626437
57653 626437 568707 518944 476014 439703 409856 385353 364895 347932 334264 323520 315328 309219
57641 309219 304187 299226 294364 290291 287084 284280 282030 280948 280835 280749 280382 280223 280396 280500 280596 281123 281872
57624 281872 282189 282100 281980 281311 279234 276223 273709 272007 270117 267578 264896 262108 258668 255057 252746
57609 252746 251999 251357 249855 248214 247228 246504 245587 244945 244918 244875 244277 243596 243360 243149 242235 240483 238113 235363
57591 235363 232749 230808 229241 227204 224681 222535 220921 218892 216046 213405 212028 211718 211638 211317 210528
57576B10528j455j846j630j440j928k539k426j887j643j396n63K47O9p64j219
57561A90108j265j437j386n04N07M31m37p15j40K85J51N6K70M37O18J264K118
57544A90361K340J763R41J64o45j265j352j059n86L42J755K735K450J286P0j053
57528A98247j963j828l24J308J833J771K179K681K396J910K357L237L113K025
57514B18942J274J141Q21L48N81J360J499P31k0l38o35q38m01K86J72p24j297
57497B22902j203j171j487j656j694k239l168l548l115k523k046j369p03o68j029
57482A95283q72j61K58J97L32Q04R83O59K37k56r75j324o41K41k10j892l133l163
57464A86367k838k740k343j386m74J68J014J942K145J673J509J706J138k77r25
$$ plain form
57576 210528 209073 207227 205597 204157 202229 199690 197264 195377 193734 192338 191775 192022 192091 191327 190108
57561 190108 188843 187406 186020 185516 186023 186454 186017 185302 185162 185447 185598 185654 185924 186361 186979 188243 190361
57544 190361 192701 194464 195405 195569 194924 193659 192307 191248 190662 191004 192759 195494 197944 199230 199300 198247
57528 198247 196284 194456 194132 195440 197273 199044 201223 203904 206300 208210 210567 213804 216917 218942
57514 218942 220216 221357 222178 222526 223107 224467 225966 226697 226677 226339 225704 224866 224465 224751 224923 224199 222902
57497 222902 221699 220528 219041 217385 215691 213452 210284 206736 203621 201098 199052 197683 196980 196312 195283
57482 195283 194411 194250 194508 194705 195037 195841 196824 197483 197720 197464 196489 195165 194524 194765 194555 192663 189530 186367
57464 186367 183529 180789 178446 177060 176586 176754 177768 179710 181855 183528 185037 186743 187881 187604 186679
57449A86679J11J519J674P87J06M4J98L85O29P59O94O67P14N41K55L90R23J131
57431A98206Q25P08J097J237N23l76m19M60J439J818J499Q53L67J78j67r99j686
57414B05563j265J65J440J827J716J696J774J752J654J452R45J13p52j302j292
57399B15486o63J19L00j20j90N47J187R64O71J318K230K074J138Q60J494K084
57383B29499K542L666N104N289L860K327J781J613J093N57L15j54j007j326m81
57368B54678P64J298R47K19m09n39k2O17O71K98K13L87K28m6M00J411J858J543
57350B64516J488K052K329J932J727K174K463K059J660J833K005J730J604K049
57336B91621K322J757R04N86P06Q66J215J843K184J838J257R44P78O28P67J143
$$ plain form
57449 186679 186790 188309 189983 190770 190876 190920 191118 191503 192132 192891 193585 194252 194966 195507 195762 196152 197075 198206
57431 198206 199031 199739 200836 202073 202596 202220 201801 202261 203700 205518 207017 207870 208237 208415 208248 207249 205563
57414 205563 204298 204463 205903 207730 209446 211142 212916 214668 216322 217774 218719 218832 218080 216778 215486
57399 215486 214823 214942 215242 215122 214932 215479 216666 217630 218301 219619 221849 223923 225061 225921 227415 229499
57383 229499 232041 235707 240811 246100 249960 252287 254068 255681 256774 257331 257646 257492 256485 255159 254678
57368 254678 255442 256740 257687 257906 257497 256958 256936 257553 258224 258522 258735 259122 259350 259304 259704 261115 262973 264516
57350 264516 266004 268056 270385 272317 274044 276218 278681 280740 282400 284233 286238 287968 289572 291621
57336 291621 293943 295700 296604 297190 297896 298762 299977 301820 304004 305842 307099 308043 308821 309449 310216 311359
57320C11359J146O73N44J221K066K414K446K483K380K187K411L005L086K278J425
57305C41124J345J759K064K247K471K631K764L105L311K690J529J079J853L060
57291C73032M008M797N292M952M196M352N551O258N642M827M868N183N047N019
57277D43024N533N622M567L491L743M777N192M911M769M797M527M232M448M812
57263E08445M759M779N609O781P274P142P253P813Q358Q801R383R946J0258J0613
57249F17214J1217J1514J1105J0763J1501J3067J4380J4940J4948J4543J3961
57238G59153J3942J4926J6227J6864J6810J6703J6829J7152J7769J8474J8529
57227I43378J7681J6859J7001J7795J8352J8467J8424J8164J7621J7249J7388
$$ plain form
57320 311359 312505 313178 313722 314943 317009 319423 321869 324352 326732 328919 331330 334335 337421 339699 341124
57305 341124 342469 344228 346292 348539 351010 353641 356405 359510 362821 365511 367040 368119 369972 373032
57291 373032 377040 381837 387129 392081 396277 400629 406180 412438 418080 422907 427775 432958 438005 443024
57277 443024 448557 454179 458746 462237 465980 470757 475949 480860 485629 490426 494953 499185 503633 508445
57263 508445 513204 517983 523592 530373 537647 544789 552042 559855 568213 577014 586397 596343 606601 617214
57249 617214 628431 639945 651050 661813 673314 686381 700761 715701 730649 745192 759153
57238 759153 773095 788021 804248 821112 837922 854625 871454 888606 906375 924849 943378
57227 943378 961059 977918 994919 1012714 1031066 1049533 1067957 1086121 1103742 1120991 1138379
57216A138379J7662J7658J7554J7426J6827J5772J5230J5836J7012J8064J9140
57205A326560K0258K0684K0271K0280K1618K3329K4036K3787K3342K2726K1925
57194A568816K1742K2567K3279K2880K2185K2383K3023K3183K3425K4715K6286
57183A824484K6693K6199K6141K6537K6422K5988K6273K7103K7445K7437K7988
57172B118710K8667K8184K6830K6228K6682K6952K6793K7497K9462L1342L2132
57161B429479L2319L2394L2066L1471L1575L2625L3650L4039L4232L4387L3856
57150B792093L2566L1564L1478L1688L1534L1199L0931L0500K9961K9898L0487
57139C133899L1267L2142L3481L5000L5817L5967L6606L8244L9975M0984M1643
$$ plain form
57216 1138379 1156041 1173699 1191253 1208679 1225506 1241278 1256508 1272344 1289356 1307420 1326560
57205 1326560 1346818 1367502 1387773 1408053 1429671 1453000 1477036 1500823 1524165 1546891 1568816
57194 1568816 1590558 1613125 1636404 1659284 1681469 1703852 1726875 1750058 1773483 1798198 1824484
57183 1824484 1851177 1877376 1903517 1930054 1956476 1982464 2008737 2035840 2063285 2090722 2118710
57172 2118710 2147377 2175561 2202391 2228619 2255301 2282253 2309046 2336543 2366005 2397347 2429479
57161 2429479 2461798 2494192 2526258 2557729 2589304 2621929 2655579 2689618 2723850 2758237 2792093
57150 2792093 2824659 2856223 2887701 2919389 2950923 2982122 3013053 3043553 3073514 3103412 3133899
57139 3133899 3165166 3197308 3230789 3265789 3301606 3337573 3374179 3412423 3452398 3493382 3535025
57128C535025M2572M3661M4748M6430M9447N3924N9545O5898P2467P8993Q5951
57117D178661R3928J02604J11252J20237J30913J43942J58824J75269J94055K16288
57107E625973K42806K74403L11753L55145M05475M65604N39704O31300P43118
57098I595281Q78823J043645J243272J483211J768730K103326K486400K913099
57090B3515787L375851L864156M362947M853091N313908N724066O061154O302896
57082F3373856O426536O400068O171811N677406M870742L757331K401787R05816
57074I9985353o21476k081417l391745m490057n338067n923231o255544o361410
57066F5522406o277211o043632n700878n285301m827963m354667l886075l437179
$$ plain form
57128 3535025 3577597 3621258 3666006 3712436 3761883 3815807 3875352 3941250 4013717 4092710 4178661
57117 4178661 4272589 4375193 4486445 4606682 4737595 4881537 5040361 5215630 5409685 5625973
57107 5625973 5868779 6143182 6454935 6810080 7215555 7681159 8220863 8852163 9595281
57098 9595281 10474104 11517749 12761021 14244232 16012962 18116288 20602688 23515787
57090 23515787 26891638 30755794 35118741 39971832 45285740 51009806 57070960 63373856
57082 63373856 69800392 76200460 82372271 88049677 92920419 96677750 99079537 99985353
57074 99985353 99363877 97282460 93890715 89400658 84062591 78139360 71883816 65522406
57066 65522406 59245195 53201563 47500685 42215384 37387421 33032754 29146679 25709500
57058B5709500l017367k632053k284571j976329j705922j469833j264616j087869
57050A0270940r37091q08848o99689o07141n29255m63820m08576l61781l22141
57041E132598k88571k60188k36120k15250j96543j79666j64637j50922j37573
57032C303128j24219j11186r8659q6411p4114o1137m6406k9308j0174J0912L3997
57021B706423N5205O3866M8402P612m5609r3558j25614j40957j43379j37045j25871
57010B069475j13181j00657q8775p8214o9576o2178n4709m7151m0711l5894l1930
56999A346499k8287k5453k3812k2746k1394j9688j8066j6674j5250j3595j1802
56988A129732r991q017n519k307J394N109Q192R473P339J072p893j6716k3323
$$ plain form
57058 25709500 22692133 20060080 17775509 15799180 14093258 12623425 11358809 10270940
57050 10270940 9333849 8525001 7825312 7218171 6688916 6225096 5816520 5454739 5132598
57041 5132598 4844027 4583839 4347719 4132469 3935926 3756260 3591623 3440701 3303128
57032 3303128 3178909 3067723 2969064 2882653 2808539 2747402 2700996 2671688 2661514 2672426 2706423
57021 2706423 2761628 2825494 2873896 2881508 2835899 2742341 2616727 2475770 2332391 2195346 2069475
57010 2069475 1956294 1855637 1766862 1688648 1619072 1556894 1502185 1455034 1414323 1378429 1346499
56999 1346499 1318212 1292759 1268947 1246201 1224807 1205119 1187053 1170379 1155129 1141534 1129732
56988 1129732 1119741 1111724 1106205 1103898 1105292 1110401 1118593 1128066 1135405 1136477 1128584 1111868 1088545
56975A088545k7322k9010k8545k6380k3489k0592j7742j4912j2313r846p021l832
56963H67541r43J421M032P623J1915J6136J9770K2290K2668J9697J2759K341r650
56950I97600k0268k7198l0359l1190l0495k8006k4005j9877j6536j3535j0278
56939G45853o989l811r4M611R749J4653J9498K4605K9574L3484L5076L2401K3679
56926I62289R492o724k1164l1923l8531m0798l9273l5718l1808k7934k4046k0740
56914F53122j8487j6644j4414j2142j0551r448q256p249p036p262o849n389l462
56901E25933j880j207j512j957j243Q56L079M389N277O659Q396R998J1934J5039
56887E83761J9121K3153K6345K7992K6869K1937J3637L757n670j2920j6859j7628
$$ plain form
56975 1088545 1061223 1032213 1003668 977288 953799 933207 915465 900553 888240 878394 871373 867541
56963 867541 866598 868019 872051 879674 891589 907725 927495 949785 972453 992150 1004909 1007250 997600
56950 997600 977332 950134 919775 888585 858090 830084 806079 786202 769666 756131 745853
56939 745853 738864 735053 734959 739570 749319 763972 783470 808075 837649 871133 906209 938610 962289
56926 962289 971781 965057 943893 911970 873439 832641 793368 757650 725842 697908 673862 653122
56914 653122 634635 617991 603577 591435 580884 571436 563180 555931 548895 541633 534784 529395 525933
56901 525933 524053 522846 521334 519377 518134 518990 522069 526458 531735 538394 546790 556788 568722 583761
56887 583761 602882 626035 652380 680372 707241 729178 742815 746572 740902 727982 711123 693495
56875F93495j6574j4788j2278r091o188m170k061J436O039J0537J4726J9512K5401
56862G05996L2102L9366M7003N3962N8079N6773M7925L1045Q613j4246l2421m3338
56850I90859m7111m5343m0444l4813k9327k3190j5884q440j896M353J1553J9889
56838G80206K8999L9234N0977O3509P5756Q7053R5376R5693Q2505N4769J7538
56827A471615k0904n2856p3587q2497q2693p8308p1799o3865n4908m5411l5482
56816H09305k5392j6072q035l13Q358J7871K7484L7434M8380N9470O8016P0619
56804A097125O3895M5671J7615j3809m0885n9351o9038p1335o8016o1628n4526
56793G85718m7291l9554l1891k5284j9309j2890o355q15M126R830J6135K1644
$$ plain form
56875 693495 676921 662133 649855 640764 634576 630406 628345 629781 635820 646357 661083 680595 705996
56862 705996 738098 777464 824467 878429 936508 993281 1041206 1072251 1080864 1066618 1034197 990859
56850 990859 943748 898405 857961 823148 793821 770631 754747 746307 744411 748764 760317 780206
56838 780206 809205 848439 899416 962925 1038681 1125734 1221110 1316803 1399308 1454077 1471615
56827 1471615 1450711 1397855 1324268 1241771 1159078 1080770 1008971 945106 890198 844787 809305
56816 809305 783913 767841 759806 759493 767851 785722 813206 850640 899020 958490 1026506 1097125
56804 1097125 1161020 1206691 1224306 1210497 1169612 1110261 1041223 969888 901872 840244 785718
56793 785718 738427 698873 666982 641698 622389 609499 603144 602329 606455 616285 632420 654064
56781F54064K6280L1003L4653L3649K5653J1899m461k0386l3086m0519m2914m2414
56769F33421m0562l7344l2898k8321k4344k0772j7732j5793j4545j2757j0394
56758C77959q728q033p073n450m409m534m565l551k435k333k791k922k839k847
56744C15449k548j822j515k057k524k081j286j003j090j104j243j645j753j287
56730B92491q85j009j088o02m3j6k83m29n59o78l01O13J288J313J236J410J383
56713B93841R95Q86J213J142L66o6N61J339J186M71J58K27J11j60k71l89o80q01
56695C00129o84j003k011k794k545j774j326j077n47m3q4l72l36j88m70j032j307
56678B82536j207r70n90j10L4l86r15j111j160j275j135n49j3J3j69j10Q0J62
$$ plain form
56781 654064 680344 711347 746000 779649 805302 817201 812740 792354 759268 718749 675835 633421
56769 633421 592859 555515 522617 494296 469952 449180 431448 415655 401110 388353 377959
56758 377959 369231 361198 354125 348675 344266 339732 335167 331616 329181 326848 324057 321135 318296 315449
56744 315449 312901 311079 309564 307507 304983 302902 301616 300613 299523 298419 297176 295531 293778 292491
56730 292491 291606 290597 289509 288907 288864 288848 288565 288136 287577 286899 286598 287211 288499 289812 291048 292458 293841
56713 293841 294836 295722 296935 298077 298443 298377 298938 300277 301463 301934 302092 302319 302430 302270 301999 301610 300930 300129
56695 300129 299445 298442 296431 293637 291092 289318 287992 286915 286368 286325 286241 285869 285533 285345 284875 283843 282536
56678 282536 281329 280359 279769 279659 279693 279307 278392 277281 276121 274846 273711 273162 273149 273162 272993 272883 272963 273125
56660B73125L23P13J049J164J340J707J935J956K209K830L315L398L425L505L157
56645C05151K251J335P06J09k87J75J285J813J231M50K08j1o70j175r68m92j88
56628C10923K65R03Q63j80j225j591k038l200m172l980l284l213l502l244k648
56613B80677k528k791k787k581k581k494j883j231j187j387j244j186j798k328
56599B52671j548K36J413J218M00j25k17j05L6R4J18L48O57M85k67q33n80J92
56581B54193R50J586J905J430M60K89J420K584K504J644J147J041P74O52J258
56566B73837K157K566K790L663N017O018O708P998J0271J2955J5161J5991J4670
56553C79802J1287P101L426O74j054j462q94o62j454k333k309j941k228k890l080
$$ plain form
56660 273125 273448 274161 275210 276374 277714 279421 281356 283312 285521 288351 291666 295064 298489 301994 305151
56645 305151 307402 308737 309443 309552 309265 309440 310725 312538 313769 314219 314427 314416 313746 312571 311603 311111 310923
56628 310923 311188 312091 312954 312774 311549 309958 307920 304720 300548 296568 293284 290071 286569 283325 280677
56613 280677 278149 275358 272571 269990 267409 264915 263032 261801 260614 259227 257983 256797 254999 252671
56599 252671 251123 251359 252772 253990 254390 254265 254048 253943 253979 254073 254191 254539 255196 255681 255414 254581 254001 254193
56581 254193 255143 256729 258634 260064 260524 260813 262233 264817 267321 268965 270112 271153 271927 272579 273837
56566 273837 275994 278560 281350 285013 290030 296048 302756 310754 321025 333980 349141 365132 379802
56553 379802 391089 398190 401616 402290 401236 399774 398880 398218 396764 394431 392122 390181 387953 385063 381983
56538C81983k951l167l551l637l766m385m971m903m695m923m886l797k505k357
56524C27489l000l055k430k178k477k548k355k684l530m004l887l849m089m028
56510B83375l375k508j770j296j269j558j545j122j110j821k162j421p98j572
56496B60048k731k364o49N57N88M12M91K59l13m68j33L8M3L83O66N4r64j077l24
56477B54516j5l61j41R93J737J188J23l87k81Q8O19J028Q29K04q6J32K42q4n70
56458B59774j103j734j899q64R61K206K165J307K81n88q81k96P02J353J611J780
56442B64775J564N47o61j014n50j77k08k44k13k94j28O53J450J440Q76M91J27
56425B68434o08j005k05R65R16k92j133j032p50o29k00M66O65L94K68K49p2k26
$$ plain form
56538 381983 379032 375865 372314 368677 364911 360526 355555 350652 345957 341034 336148 332351 329846 327489
56524 327489 324489 321434 319004 316826 314349 311801 309446 306762 303232 299228 295341 291492 287403 283375
56510 283375 280000 277492 275722 274426 273157 271599 270054 268932 267822 266001 263839 262418 261620 260048
56496 260048 257317 254953 254304 254861 255449 255861 256352 256611 256298 255830 255697 255735 255778 256161 256827 256881 255917 254840 254516
56477 254516 254501 254140 253999 254992 256729 257917 258040 257653 257372 257460 258079 259107 259936 260140 260054 260186 260428 260344 259774
56458 259774 258671 256937 255038 254174 255135 257341 259506 260813 261094 260506 259625 259329 260031 261384 262995 264775
56442 264775 266339 266886 266225 265211 264661 264484 264276 264032 263819 263525 263397 264050 265500 266940 267816 268307 268434
56425 268434 267826 266821 266616 267581 268497 268205 267072 266040 265290 264661 264461 264927 265592 265986 266254 266503 266431 266205
56407B66205M97J471J488P86N32O09j01j417j913j301q08j035j321j280j209q89
56391B60314J87J363J462P60N07O65J63p41o43M78J232J365J947K877K721J443
56375B76100P30J083J098L40L21J576K349J374p9l57K56O94Q36R62Q62O13R12
56358B89670J718J983J288M54L2k71k35R47K844L697K809J348K58p39j528j080
56342C03195N65J769J684J434J964K539K352J892J725J474J010J089J957K777
56328C27426L117L533M023L677K515J894K372K886K727K454K267J437J54j69P00
56313C61013J130L65j22Q50K297K914K946K972K651J921J824K871M056M573N008
56298C97269N855O474O416O158N778M554K757J925K534L239L233L466M556N549
$$ plain form
56407 266205 266702 268173 269661 270447 270979 271588 271487 270070 268157 266856 266048 265013 263692 262412 261203 260314
56391 260314 260501 261864 263326 264086 264593 265258 265421 264680 264037 264515 265747 267112 269059 271936 274657 276100
56375 276100 276830 277913 279011 279351 279672 281248 283597 284971 284892 284535 284791 285485 286321 287283 288145 288758 289670
56358 289670 291388 293371 294659 295113 295145 294874 294639 295586 298430 302127 304936 306284 306542 305803 304275 303195
56342 303195 303760 305529 307213 308647 310611 313150 315502 317394 319119 320593 321603 322692 324649 327426
56328 327426 330543 334076 338099 341776 344291 346185 348557 351443 354170 356624 358891 360328 360482 360313 361013
56313 361013 362143 362508 362386 363236 365533 368447 371393 374365 377016 378937 380761 383632 387688 392261 397269
56298 397269 403124 409598 416014 422172 427950 432504 435261 437186 439720 442959 446192 449658 454214 459763
56284D59763N765N984O774P524P989Q888J0117J0465R935J0177J1739J3186J3813
56271E82119J4751J6400J7447J7535J8248K0138K1517K1701K2617K5503K8843
56260H06819L1360L4338L8866M3542M7213N1493N8151O6285P4439Q3340R4042
56249A429888J05514J16536J28025J40978J53950J65011J74511J83370J90416
56240B788199J93769J93383J89827J82114J68967J50804J28359J00985O8574L3688
56230D198669m51l2736o3169r0740j14348j34230j50572j62355j69342j73251
56220C107475j75093j73471j67541j59424j51416j43007j33129j23124j14698
56211A766572j06954r8229q9170q1297p4257o7078o0494n5381n0668m5348m0728
$$ plain form
56284 459763 465528 471512 478286 485810 493799 502687 512804 523269 533204 543381 555120 568306 582119
56271 582119 596870 613270 630717 648252 666500 686638 708155 729856 752473 777976 806819
56260 806819 838179 872517 911383 954925 1002138 1053631 1111782 1178067 1252506 1335846 1429888
56249 1429888 1535402 1651938 1779963 1920941 2074891 2239902 2414413 2597783 2788199
56240 2788199 2981968 3175351 3365178 3547292 3716259 3867063 3995422 4096407 4164981 4198669
56230 4198669 4198218 4165482 4102313 4011573 3897225 3762995 3612423 3450068 3280726 3107475
56220 3107475 2932382 2758911 2591370 2431946 2280530 2137523 2004394 1881270 1766572
56211 1766572 1659618 1561389 1472219 1390922 1316665 1249587 1189093 1133712 1083044 1037696 996968
56200I96968l8045l5740l1940k7754k5176k3544k1115j8450j7086j6359j4711
56189G27048j2755j1948j1511r820p580o603o507n635m171l513l551l208k685
56176F37561k668k490j483p65j280j672n91O86N46Q9J052K523K738K381L038M102
56160F43767M240M292N582P123P463P580Q832J0066R927R980J2101J4810J5842
56147G61605J6357J8784K2450K5263K7977L2741L9009M4880N0983N9016O8031
56136A167096P5993Q3329R0829R5826R4901Q8871Q0907P1481N9738M8309M1530
56125A998810L9600L8843L6810L2997K5979J4727K021p860j4135j8519k1110k1870
56113B106293k4404l2915m6188n9324p0262p9774q6399q7090q2346p5657o8250
$$ plain form
56200 996968 958923 923183 891243 863489 838313 814769 793654 775204 758118 741759 727048
56189 727048 714293 702345 690834 681014 673434 666831 660324 654689 650518 647005 643454 640246 637561
56176 637561 634893 632403 630920 630155 628875 627203 626612 627298 627844 627933 628985 631508 634246 636627 639665 643767
56160 643767 648007 652299 657881 665004 672467 680047 688879 698945 708872 718852 730953 745763 761605
56147 761605 777962 796746 819196 844459 872436 905177 944186 989066 1040049 1099065 1167096
56136 1167096 1243089 1326418 1417247 1513073 1607974 1696845 1777752 1849233 1908971 1957280 1998810
56125 1998810 2038410 2077253 2114063 2147060 2173039 2187766 2189787 2181927 2167792 2149273 2128163 2106293
56113 2106293 2081889 2048974 2002786 1943462 1873200 1793426 1707027 1619937 1537591 1461934 1393684
56102A393684n9118m9325m1315l4712k7604k1080j7547j5692j2349q200o287n972
56090A094483m104j136j88q00L31L018L970L091L341M736M562L328M350P405Q790
56075A135177P843P584Q820R458R524J1126J3548J4129J3633J5018J7464J7702
56063A281026J6493J7417K0004K0713J9968K1205K3618K3150K0234J9104J9802
56052A502734J8515J5577J5227J7419J7905J6579J7575K0870K2106K1084K2057
56041A707648K5142K6043K4834K6167L0039L1433L0032L1063L5333L7787L7346
56030B042867L8728M2911M5279M5022M6826N1334N3506N2409N2999N6285N7490
56019B585656N6011N7142O1763O4473O4156O6070P1292P4655P5423P9118Q6456
$$ plain form
56102 1393684 1334566 1285241 1243926 1209214 1181610 1160530 1142983 1127291 1114942 1106742 1100455 1094483
56090 1094483 1090379 1089243 1089055 1088255 1088586 1091604 1095574 1098665 1102006 1106742 1111304 1114632 1118982 1126387 1135177
56075 1135177 1143020 1150604 1159424 1168882 1178406 1189532 1203080 1217209 1230842 1245860 1263324 1281026
56063 1281026 1297519 1314936 1334940 1355653 1375621 1396826 1420444 1443594 1463828 1482932 1502734
56052 1502734 1521249 1536826 1552053 1569472 1587377 1603956 1621531 1642401 1664507 1685591 1707648
56041 1707648 1732790 1758833 1783667 1809834 1839873 1871306 1901338 1932401 1967734 2005521 2042867
56030 2042867 2081595 2124506 2169785 2214807 2261633 2312967 2366473 2418882 2471881 2528166 2585656
56019 2585656 2641667 2698809 2760572 2825045 2889201 2955271 3026563 3101218 3176641 3255759 3342215
56008C342215R1494R3113R7045J04234J08960J10799J16188J25705J32510J35884
55998D458147J43061J55039J64488J70497J80856J96568K09301K17680K30401
55989F126038K49413K66257K79094K96489L20049L41112L59172L84930M20259
55980I042813M54541M85895N25455N75454O25105O74008P35971Q13331Q92723
55971A4825296R73415J072667J195287J327223J468603J641621J855531K097974
55963B6457617K372819K710133L126657L617817M203973M939762N861604O976385
55955F0266767Q319475R966080J1969701J4365487J7257255K0801556K5055919
55948A68002240K9918293L5151491M0097409M3094472M1526856L3257240J8561999
$$ plain form
56008 3342215 3433709 3526822 3623867 3728101 3837061 3947860 4064048 4189753 4322263 4458147
55998 4458147 4601208 4756247 4920735 5091232 5272088 5468656 5677957 5895637 6126038
55989 6126038 6375451 6641708 6920802 7217291 7537340 7878452 8237624 8622554 9042813
55980 9042813 9497354 9983249 10508704 11084158 11709263 12383271 13119242 13932573 14825296
55971 14825296 15798711 16871378 18066665 19393888 20862491 22504112 24359643 26457617
55963 26457617 28830436 31540569 34667226 38285043 42489016 47428778 53290382 60266767
55955 60266767 68586242 78552322 90522023 104887510 122144765 142946321 168002240
55948 168002240 197920533 233072024 273169433 316263905 357790761 391048001 409610000
55941D09610000O21411j6162529k8544716l5543119l7898825l6994127l4174994
55934B20913101l0504235k6666498k2994565j9628930j6650420j4085449j1892983
55927G8490021j0020406q446035p145902o065639n155857m400184l784779l273654
55919C0197565k836191k468579k167560j910474j679698j480859j319124j180737
55911A5154343j053842r44960q59225p84952p12431o48606n99315n55271n08756
55902H486985m66780m35015m05183l70635l38797l16344k96769k73900k53528
55893E330034k40534k28131k10723j94638j85584j77671j65046j52673j45582
55884C629452j38603j26634j14461j06937r9563q8158p8293p5948p7668p8308
$$ plain form
55941 409610000 410231411 394068882 365524166 329981047 292082222 255088095 220913101
55934 220913101 190408866 163742368 140747803 121118873 104468453 90383004 78490021
55927 78490021 68469615 60023580 52877678 46812039 41656182 37255998 33471219 30197565
55919 30197565 27361374 24892795 22725235 20814761 19135063 17654204 16335080 15154343
55911 15154343 14100501 13155541 12296316 11511364 10798933 10150327 9551012 8995741 8486985
55902 8486985 8020205 7585190 7180007 6809372 6470575 6154231 5857462 5583562 5330034
55893 5330034 5089500 4861369 4650646 4456008 4270424 4092753 3927707 3775034 3629452
55884 3629452 3490849 3364215 3249754 3142817 3043254 2955096 2876803 2800855 2723187 2644879
55874B644879p9763q3938q5890q2197p7902p7449p6755p1708o6245o4450o2632
55863A815950n6963n1245m9491m8170m3411l8831l8621l9542l7209l4001l3531
55852A344935l3330l0172k6891k7025k8151k7028k5932k7542k8959k7128k4905
55841A037872k5593k6622k4701k2201k2303k2723k0329j7275j6726j6930j5171
55830H07298j3175j3183j3067j0595q156q087p965n692m424p118j0792j1732j1791
55817F81521j3868j5684j3951j0711r643r780q457o872p076p030m185p10J37k68
55803E73423R87K907L284L625O147Q913R039P718P219O050K133k358m437n591
55789F19059q570j1824j2336j1181j1112j1174q971n842m704n039m930n599q859
$$ plain form
55874 2644879 2565116 2481178 2395288 2313091 2235189 2157740 2080985 2009277 1943032 1878582 1815950
55863 1815950 1758987 1707742 1658251 1610081 1566670 1527839 1489218 1449676 1412467 1378466 1344935
55852 1344935 1311605 1281433 1254542 1227517 1199366 1172338 1146406 1118864 1089905 1062777 1037872
55841 1037872 1012279 985657 960956 938755 916452 893729 873400 856125 839399 822469 807298
55830 807298 794123 780940 767873 757278 749122 741035 733070 727378 722954 715836 705044 693312 681521
55817 681521 667653 651969 638018 627307 617664 607884 599427 592555 585479 578449 574264 573554 573691 573423
55803 573423 574410 577317 580601 584226 590373 599286 608325 616043 623262 629312 631445 629087 624650 619059
55789 619059 610489 598665 586329 575148 564036 552862 543891 538049 533345 528306 523376 517777 508918
55776E08918j2301j2290r763q096p101m214J90L725O631J0456J3434J2136O816
55763E08541Q21m276q855j1959j2223j1060j0901j1269j0268q651q607r809j0347
55750C91137j0365j1083j1651j0605r017q664q638p272n693n754o302n300l794
55737B86999l769l960k106L50K90j726k581j913j886k718k775k387l348n171n827
55722B47472n471n713n978m519k245j588k255j983p67m50p48K87K343L309L272
55707B24966M187N853O086M677L522K897J240j510l761n290p077q451p778n806
55693B13755m871m981m134k244j222j308q25L46N23l71m15R53K272K897L614M366
55677B08355M233L631L775M068K932R15j5N0o43j951j982o94l7m45m73L7k74j140
$$ plain form
55776 508918 496617 484327 474564 466468 459367 455153 455343 459068 465699 476155 489589 501725 508541
55763 508541 509362 505086 496231 484272 472049 460989 450088 438819 428551 419900 411293 401484 391137
55750 391137 380772 369689 358038 347433 338416 329752 321114 313842 308149 302395 296093 290793 286999
55737 286999 283230 279270 277164 277514 277804 276078 273497 271584 269698 266980 264205 261818 258470 253299 247472
55722 247472 242001 236288 230310 225791 223546 221958 219703 217720 216953 216503 215755 216042 218385 221694 224966
55707 224966 229153 235006 241092 245769 249291 252188 253428 251918 248157 242867 235790 227339 219561 213755
55693 213755 208884 203903 199769 197525 196303 194995 194170 194516 195039 194668 194253 195206 197478 200375 203989 208355
55677 208355 212588 216219 219994 224062 226994 227909 227894 227944 227301 225350 223368 222674 222637 222192 221719 221756 221482 220342
55659B20342o17J396K719K432J895J887J653J188J567K500K355R56k57r64k141
55644B36911l465l535k840l393n162n959n265m987n862o284n463m723m804m703
55630A70466m049l837m021l129j147p1o98j523j569j693k214j980q80n94j731
55615A41330k678k413k013k233k038q43J01j05n32m24o06j617k370k000j308j145
55599A19106j022m90k61q38j492j645j819k369k597j996j055k01P24J485J386
55584A06916O62M63J008J274Q55M85M50J53l81l07M02P84O83R11J438J295N81
55567A17672O23J718K686K931L017K887J747J39j56J043J804J039j85j011k094
55552A33860l563l963k548p69j47l76n81q60j379j495q76k04Q3M95J246J699J665
$$ plain form
55659 220342 219725 221121 223840 226272 228167 230054 231707 232895 234462 236962 239317 240273 240016 239052 236911
55644 236911 233446 229911 227071 223678 218516 212557 207292 202305 196443 190159 184696 179973 175169 170466
55630 170466 166417 162580 158559 155430 154283 154212 153514 151991 150422 148729 146515 144535 143655 143061 141330
55615 141330 138652 136239 134226 131993 129955 129112 129213 129108 128576 128152 127546 125929 123559 121559 120251 119106
55599 119106 118084 117594 117333 116495 115003 113358 111539 109170 106573 104577 103522 103321 104045 105530 106916
55584 106916 107578 108041 109049 110323 111178 111663 112113 112266 111885 111578 111980 112764 113447 114358 115796 117091 117672
55567 117672 118295 120013 122699 125630 128647 131534 133281 133420 133264 134307 136111 137150 136965 135954 133860
55552 133860 130297 126334 123786 123017 122870 122494 121913 121053 119674 118179 117303 117099 117182 117677 118923 120622 122287
55535A22287J856K401K424J601O85M7p52j524j356l80R8l41p15o56r43j686j924
55518A21122j566j643k167j891p89m69j413k174k107k391l387l549k236j072j089
55503I3179r89J34Q03j48j183n47Q14J065N53O95J186P55l14o47j44J07k02m19
55485I4698l00j78j27j19m09r38r90l11K65J59k4K13K16n55j354j329q51o07m35
55466H7024j26k48j048j550r21J75O96P08P32N64n0n32l71q4k51m04R0Q30J075
55447H6309Q69O34L81R5R6K95J2q36j341j018m76r5O68J887K440J643L67l77p61
55428I0792j090q12L28J348J396R99Q81P30J44l28k26j46n90r10m06N01J141J563
55410I5315J760J189ko08k70k83j421k429k013r35o59j135j485j677j999j899
$$ plain form
55535 122287 124143 126544 128968 130569 131254 131301 130549 129025 127669 127289 127387 127046 126331 125675 124732 123046 121122
55518 121122 119556 117913 115746 113855 113066 112597 111184 109010 106903 104512 101125 97576 95340 94268 93179
55503 93179 92190 92324 93127 92979 91796 91249 92063 93128 93681 94376 95562 96317 96003 95356 95212 95319 95117 94698
55485 94698 94398 94220 94093 93974 93565 92627 91637 91326 91591 91750 91726 91939 92155 91600 90246 88917 88066 87459 87024
55466 87024 86898 86650 85602 84052 83131 83306 84002 84710 85442 86006 85956 85424 85053 84969 84718 84314 84404 85234 86309
55447 86309 87178 87812 88193 88288 88384 88679 88691 87855 86514 85496 85020 84925 85593 87480 89920 91563 91930 91553 90792
55428 90792 89702 88890 89218 90566 91962 92961 93842 94572 94716 94388 94162 94016 93426 92516 92110 92611 93752 95315
55410 95315 97075 98264 98262 97654 97384 97101 95680 93251 91238 90303 89644 88509 87024 85347 83348 81449
55394H1449q99K08N23N05R44J373R44K6m33l74k40K3M35L94k27m52K28P85L83
55375H5595j05L00Q52M68l20m56k89o73j143q58m04p50j262o96N16R20L89m6k04
55356H1834p28j437j560j289j358j415n30Q81J451R91O18P76P65K73j15r6PJ49
55338G9217O19J150J080M32j45l78m66m05j41p1m62p13j46Q55J432J512J491J248
55320H6109N13l24p54j009j367j224qJ507K014J304J26r81j718j569m77O17R41
55303H3700Q94R84P83O6k12N34J100K46j105j201j33O80Q66J023R80K22m64J30
55285H9093J416J687P49n5k74p12j409j348m05K51O9k05n1J58K10M47Q24Q92P42
55266I2079P86O91j26j123j221o06m34q19p61l7M27K75J87M24L82j50o02p19q22
$$ plain form
55394 81449 80550 80758 81281 81786 82730 84103 85047 85073 84640 84266 84026 84049 84484 84878 84651 84199 84427 85212 85595
55375 85595 85490 85790 86642 87110 86790 86334 86045 85372 84229 83371 82967 82217 80955 80259 80775 81695 82084 82038 81834
55356 81834 81106 79669 78109 76820 75462 74047 73517 74398 75849 76840 77458 78234 78999 79272 79157 79061 79068 79217
55338 79217 79836 80986 82066 82498 82353 81975 81509 81104 80963 80892 80430 79717 79571 80426 81858 83370 84861 86109
55320 86109 86622 86298 85544 84535 83168 81944 81936 83443 85457 86761 86887 85906 84188 82619 82142 82759 83700
55303 83700 84594 85578 86361 86427 86215 86749 87849 88095 86990 85789 85656 86336 87202 88225 89205 89427 88963 89093
55285 89093 90509 92196 92945 92890 92616 91904 90495 89147 88742 88993 89062 88857 88806 88964 89174 89621 90445 91337 92079
55266 92079 92865 93556 93430 92307 91086 90480 90046 89227 88466 88429 88856 89131 89318 89742 90124 89974 89372 88653 87831
55247H7831q55m06K95N75M94O35Q51N03k49p30j052j767k426k059q95j0N20J406
55229H2661K315K086P45m78j110j638j782o51J187J874R07k77p09r46j321j067
55213H1796Q8J246J834K165K118J059l67m32J012J949J210J13J28P20P30K98Q1
55196I5748k2j97mN29L35j023k312k258j272m42oK48R3n35r60p41l24o0M13J076
55176H8286J009o4q69l00J003J727J618J129L96m14o12O4P40O30J55N1J47l6l37
55157I4323m43n53o59j24J102J803J094j41n47j82K6l9J50M76L57j21l70l20l30
55138I5502l44p2K45J20l20n05k77R9M91Q74J064R91Q99Q81N84j29q29j178j354
55119I6742j370p81L69J154J000M83J88k91j253j747q01Q00J374O45q5L7N18O67
$$ plain form
55247 87831 86976 86570 86865 87440 87934 88569 89420 89923 89674 88944 87892 86125 83699 81640 80745 80735 81255 82661
55229 82661 84976 87062 87807 87329 86219 84581 82799 82148 83335 85209 86116 85839 85130 84184 82863 81796
55213 81796 81884 83130 84964 87129 89247 90306 89939 89507 90519 92468 93678 93791 93919 94639 95369 95667 95748
55196 95748 95726 95529 95525 96054 96389 95366 93054 90796 89524 89082 89076 89324 89417 88882 87922 87181 86857 86797 87210 88286
55176 88286 89295 89231 88362 88062 89065 90792 92410 93539 93935 93521 92909 92973 93713 94343 94498 94549 94696 94660 94323
55157 94323 93880 93327 92668 92544 93646 95449 96543 96402 95855 95673 95699 95660 95810 96286 96643 96522 96152 95832 95502
55138 95502 95158 95086 95331 95451 95131 94626 94349 94448 94939 95813 96877 97868 98767 99648 100232 100103 99274 98096 96742
55119 96742 95372 94591 94960 96114 97114 97597 97785 97494 96241 94494 93693 94493 95867 96512 96427 96464 96982 97649
55101I7649N50N58P52J020J251J172N14n24j258j136j56J192K237K536K197J670
55085A10224J204P57M76O35R58O81l35j211j165n29j59l38p83j176j226o50K98
55068A07661P02Mj150j589q76M62J654K177J837R01o5o58q30n62J08O78M72m28
55050A10498j148j229j090j089q76k30L12K62l8q0Pk9L9L51L63l70j297j577j208
55031A01571p24k26M10P74L77l42l85L69R50O59k6j98K99P52M60m86j303j396
55013A01535r79o61n55k67L36Q74J111J297J657K026K209K157J728P90k74p53
54997A12231n71l94n52n41R7J040J657J661J057Q7n49j49R70J647J311N28q0n14
54979A18936o54k5J106J473M96p26r66n69n84j022j078o18k11pL18O76N48n2m49
$$ plain form
55101 97649 98199 98757 99509 100529 101780 102952 103466 102942 101684 100548 100392 101584 103821 106357 108554 110224
55085 110224 111428 112185 112661 113296 114254 114935 114600 113389 112224 111695 111536 111198 110415 109239 108013 107363 107661
55068 107661 108363 108367 107217 105628 104752 105214 106868 109045 110882 111783 111718 111060 110230 109668 109776 110454 110926 110498
55050 110498 109350 108121 107031 105942 105066 104836 105148 105410 105372 105292 105299 105270 105309 105660 106023 105653 104356 102779 101571
55031 101571 100847 100621 101031 101805 102182 101840 101455 101824 102774 103433 103407 103209 103508 104260 104720 104234 102931 101535
55013 101535 100556 99895 99340 99073 99409 100283 101394 102691 104348 106374 108583 110740 112468 113258 112984 112231
54997 112231 111660 111266 110714 110173 110270 111310 112967 114628 115685 115772 115223 115074 116044 117691 119002 119530 119450 118936
54979 118936 118282 118257 119363 120836 121332 120606 119640 119071 118487 117465 116387 115769 115558 115551 115869 116545 117093 117041 116592
54960A16592j34P27J618K087J912J265O19K74J16p9m11r24j472j558q51J08M71
54943A20360L23M67R51J012N94O04J197J225J45r28r40l93r3L02J183J678R98
54926A28685R8L64J434K007K306L745O371Q427Q763Q153P779P668P156N948M194
54911B03098K169J59j708l602n505o761o770n983n483n625n723n149m087l108
54897A45922k528k297k231k203k260k404k277j468k31O45Q84R78J234J349J241
54882A34354J412K019K485K635L199M503N697O104O321O965P324O485M906L580
54868A97989K399O45j485l244m635n989o774o346n419n314n927n963m993l870
54854A41074l219k828k537k374j907p21M90N99k42q68r67j327k166k663k386j828
$$ plain form
54960 116592 116458 117185 118803 120890 122802 124067 124686 124960 125076 124997 124586 123662 122190 120632 119781 119889 120360
54943 120360 120683 121150 122101 123113 123707 124311 125508 126733 126878 125950 125010 124617 124524 124826 126009 127687 128685
54926 128685 128783 129147 130581 132588 134894 138639 145010 153437 162200 170353 178132 185800 192956 198904 203098
54911 203098 205267 205426 203718 200116 194611 187850 181080 175097 169614 163989 158266 153117 149030 145922
54897 145922 143394 141097 138866 136663 134403 131999 129722 128254 128023 128668 129552 130530 131764 133113 134354
54882 134354 135766 137785 140270 142905 146104 150607 156304 162408 168729 175694 183018 189503 194409 197989
54868 197989 200388 201033 199548 196304 191669 185680 178906 172560 167141 161827 155900 149937 144944 141074
54854 141074 137855 135027 132490 130116 128209 127488 127978 128577 128335 127467 126500 125173 123007 120344 117958 116130
54838A16130j307n76K02L61m3j25L37M46l12j141j105l32M67Q93R04O02K83K09
54820A15893K06J5r4J69K82l95j274j066K81J424J523J082P08L10j40k17N6M4
54802A18807l37k90N08J244J246R38R07R09N06o9l25k61j45m1J9n4q3K87R33J287
54782A25986J218J140J117P76K88M58J379J971J475N76L33P42J141J496K373L954
54766A46423N725P105P904Q304Q588Q828Q719P906O432M533K165p23l587n607
54752B12715o640p195p542p459o949o390n905n263m514m044l848l466k742j977
54738A38781j303o40k23m26r04q38j14N90R15J198J620J973K378L273M434N019
54722A55733M851M708N159N938O624O953O400M585K286P71r4j685m230o098o078
$$ plain form
54838 116130 114823 114247 114449 114810 114767 114642 114979 115425 115113 113972 112867 112535 113002 113895 114799 115401 115684 115893
54820 115893 116099 116114 116020 116189 116471 116076 114802 113736 114017 115441 116964 118046 118754 119064 118924 118707 118763 118807
54802 118807 118470 118180 118688 119932 121178 122116 123023 123932 124438 124369 124044 123783 123638 123597 123616 123562 123479 123766 124699 125986
54782 125986 127204 128344 129461 130237 130525 130983 132362 134333 135808 136384 136717 137459 138600 140096 142469 146423
54766 146423 152148 159253 167157 175461 184049 192877 201596 209502 215934 220467 222632 221909 218322 212715
54752 212715 206075 198880 191338 183879 176930 170540 164635 159372 154858 150814 146966 143500 140758 138781
54738 138781 137478 136838 136615 136189 135285 134447 134333 134923 135838 137036 138656 140629 143007 146280 150714 155733
54722 155733 160584 165292 170451 176389 183013 189966 196366 200951 203237 204008 203914 202229 197999 191901 185823
54707A85823n010m335m333m629n141n579n091l496j933j367j373j259j298j830
54693A39149k204j806j203j096j040m14K00k0n52l78J74j8r39j490j289r64q09
54676A25301m58P3K76J17O8J25j45n59l81L98Q41L47p20j759k481k592j808m74
54658A16169N52R14R91J064R52O37N42Q07R31N30rj9N81J239J377Q83J20m19n89
54639A27253o64p64n23L37J282J395N23m92p94l79J52L32J25k59o39r97j377j608
54621A22903j349m87N72J249J303Q83K93j15l1N50J196J426J184P77M82K88l6
54604A31088o75j446j775j271k59N30P46O01L06j26m96m71j67j23m64o57l23K58
54586A25276P34J112J274P72l26j063p40K0R8n82j091q38j16N77J114J475J448
$$ plain form
54707 185823 180813 176478 172145 167516 162375 156796 151705 148209 146276 144909 143536 142277 140979 139149
54693 139149 136945 135139 133936 132840 131800 131386 131586 131566 131014 130636 130810 130792 129853 128363 127074 126110 125301
54676 125301 124843 124916 125192 125309 125377 125502 125357 124798 124417 124815 125656 126003 125283 123524 121043 118451 116643 116169
54658 116169 116721 117635 118626 119690 120642 121279 121821 122628 123559 124089 124080 124061 124642 125881 127258 128141 128261 127842 127253
54639 127253 126589 125825 125302 125639 126921 128316 128839 128347 127553 127174 127326 127658 127783 127524 126885 125888 124511 122903
54621 122903 121554 121067 121639 122888 124191 125074 125367 125252 125221 125771 126967 128393 129577 130354 130836 131124 131088
54604 131088 130413 128967 127192 125921 125662 126192 126938 127539 127845 127719 127223 126752 126585 126462 125998 125341 125018 125276
54586 125276 126010 127122 128396 129168 128842 127779 127039 127059 127157 126575 125484 124646 124530 125107 126221 127696 129144
54569A29144Q98R6l83j68N08R69P96K58j85n01p76o20L03J329J341L93k46P5N62
54550A33793L99jJ18O08Q80Q97R23Q65O35N56P62P34K35JO97J774K222J974J601
54531A49673J144K63q14j466j625j689j743j587j300j025n42K14O52L93P1L67
54515A40986P34K83n90o95J1L93n3o51q76j000j178j078o66l36n9N66J207R37
54497A37935j71q06k82M52L21l08m09J81P77R13O19O9m04l27L20Q52P20K52Q9
54478A40793K98M80M60L27L9m15o65k83N69J259J389J107P59O20Q89J551K125
54461A51302J922P62o61j352r95k28J34m2k87l22l55n83q25q93r43j073r48k50
54443A44363O61J010N09l70r78j012n44J06N33N96N32N95O90O47N57N40L74j76
$$ plain form
54569 129144 130042 130138 129755 129587 130095 131064 131860 132118 131933 131432 130656 130036 130339 131668 133009 133402 133156 133231 133793
54550 133793 134192 134191 134309 134917 135797 136694 137617 138482 139117 139673 140435 141169 141404 141405 142102 143876 146098 148072 149673
54531 149673 150817 151080 150266 148800 147175 145486 143743 142156 140856 139831 139289 139503 140155 140548 140619 140986
54515 140986 141720 142003 141413 140718 140729 141122 141069 140418 139542 138542 137364 136286 135620 135284 135225 135791 136998 137935
54497 137935 137764 136958 136676 137128 137449 137141 136732 136913 137690 138603 139222 139291 138887 138560 138880 139732 140452 140704 140793
54478 140793 141091 141571 142031 142358 142397 141982 141317 141034 141603 142862 144251 145358 146117 146737 147626 149177 151302
54461 151302 153224 153986 153325 151973 150978 150750 150884 150842 150555 150233 149878 149295 148470 147577 146634 145561 144613 144363
54443 144363 145024 146034 146543 146173 145195 144183 143639 143745 144278 144874 145406 146001 146691 147338 147895 148435 148809 148633
54425A48633q79j251j090m48O45J898K570K166J241Q14J058J239R12M42K20O4
54409A58234l17q16j187j365j289q44k19J12l2k09Q7P77J304J261P53K47J24L16
54391A56937M24K79J70L64P00R33J162J497J545Q32l80j254j331q57k55K32L69
54374A61367Pn70q46o91m40l09j60J02L31M28M40L72K39K64O23J083J271J291
54356A64802J465J634J317O24K90O12R48O28j24n12j28O89J247J114N81M66J246
54339A76899K491L450M065M758N357N052L605J935R78N72j14j335k555l244l495
54324A98419l722m018m043l490k604j982j874j973k047k277k704k765k030j049
54310A61841p18r86r74l68J25j44q55j254j030m32R4K09q6l49j89J94L01J31R7
$$ plain form
54425 148633 147754 146503 145413 144965 145610 147508 150078 152244 153485 154299 155357 156596 157508 157950 158170 158234
54409 158234 157917 157101 155914 154549 153260 152416 152197 152309 152277 152068 152155 152932 154236 155497 156250 156497 156621 156937
54391 156937 157361 157640 157810 158174 158874 159807 160969 162466 164011 164843 164463 163209 161878 161021 160766 160998 161367
54374 161367 161374 160804 159958 159267 158827 158518 158358 158460 158791 159219 159659 160031 160270 160534 161157 162240 163511 164802
54356 164802 166267 167901 169218 169842 170132 170744 171692 172320 172196 171684 171556 172245 173492 174606 175187 175653 176899
54339 176899 179390 182840 186905 191663 197020 202072 205677 207612 208590 209162 209048 207713 205158 201914 198419
54324 198419 194697 190679 186636 183146 180542 178560 176686 174713 172666 170389 167685 164920 162890 161841
54310 161841 161123 160137 159163 158795 158920 158776 157921 156667 155637 155205 155299 155508 155422 155073 154884 155078 155379 155510 155607
54291A55607K49J72k04l90j37J53J15n1j7J75L43N24P62R10Q64P18N39K96J64
54272A60792M17R33J170Q51K98r3k85l61k38J46O76J187J559J573J051J89o08
54255A69257j157j432j224m28M66Q16P54R35J352J281N50m3J2J49k49q07q71n92
54237A68769n88q93j012p75m72l20k96m22o90q37n92j21J63J65J55K81K92j50
54219A62657r35j417r50L32J456J592Q95P4n86j215j579j173j66N61N63L21L30
54202A60760M58N39Q41J418J620R41j57q01p66l90Q4N50P47N36K34J48N0k92m27
54183A66093K38J338J752R92k21r00q76o89p83j097j312j224q73m32q2Ok67p63
54165A60900j117j141j013r56q34m11J42M58N17N80O61O15O21R14J112N52n83
$$ plain form
54291 155607 155856 156028 155824 155434 155297 155450 155565 155514 155497 155672 156015 156539 157301 158211 159075 159793 160332 160628 160792
54272 160792 161209 162142 163312 164163 164461 164368 164083 163722 163484 163630 164306 165493 167052 168625 169676 169865 169257
54255 169257 168100 166668 165444 165016 165482 166298 167052 167987 169339 170620 171170 171127 171139 171288 171039 170232 169361 168769
54237 168769 168181 167288 166276 165501 165029 164709 164413 163991 163301 162464 161872 161751 161914 162079 162234 162515 162807 162657
54219 162657 161722 160305 159355 159687 161143 162735 163630 163704 163118 161903 160324 159151 158985 159546 160109 160430 160760
54202 160760 161218 161757 162598 164016 165636 166577 166420 165619 164853 164463 164547 165097 165844 166380 166614 166762 166812 166520 166093
54183 166093 166331 167669 169421 170413 170192 169292 168416 167727 166944 165847 164535 163311 162438 162006 161924 161930 161663 160900
54165 160900 159783 158642 157629 156673 155839 155428 155570 156028 156545 157125 157786 158401 159022 159936 161048 161600 161017
54148A61017j242q74r9K65J41k19p78j350j335m77N86J116J217J404J633J419
54132A62424P34J56J40N35Q06N86J4l50j46K91M02K25K35M07K78%M10J658K647
54113A71452K480J660J163J019O23m9m87n52m98l56K7M24M43J45j06k58n78j127
54095A75425j645j807j344k55Q53J109M99M7M04Q76N62k00l54K99J022J319J238
54078A78048Q16J07l31Q4J032J685J880K056K119J526N47L51J345K371K189J051
54062A96876J58N2K85L62L63N92J028J363J459J622K286L410M344M538M254M302
54046B27294N138O470P721Q632R343R931R992Q828O305L376J343N41K63K8K32
54031C05437J188K309K846K928L169L637L895L733L263K510J550P84M46J28n94
$$ plain form
54148 161017 159775 158901 158802 159067 159208 158989 158211 156861 155526 155049 155635 156751 157968 159372 161005 162424
54132 162424 163158 163314 163454 163989 164795 165381 165395 165045 164899 165190 165592 165817 166052 166459 166737 166737 167147 168805 171452
54113 171452 173932 175592 176755 177774 178397 178348 177861 177309 176811 176455 176482 176906 177349 177494 177388 177130 176552 175425
54095 175425 173780 171973 170629 170374 171227 172336 172835 172882 173286 174162 174724 174524 174170 174469 175491 176810 178048
54078 178048 178864 178971 178640 178724 179756 181441 183321 185377 187496 189022 189569 189920 191265 193636 195825 196876
54062 196876 197034 197086 197371 197733 198096 198688 199716 201079 202538 204160 206446 209856 214200 218738 222992 227294
54046 227294 232432 238902 246623 255255 264598 274529 284521 293349 299654 303030 304373 304914 305177 305205 305437
54031 305437 306625 308934 311780 314708 317877 321514 325409 329142 332405 334915 336465 337249 337695 337823 337229
54016C37229j363j584j506j909k875l672l849l688l581l694m208n169o014o044
54002B88073n423n062n347n675n437m802m292m077l966l720l205k573k210k242
53988B30042k182j607r22q56j335j635j497j325j270j061p47p48r55p62k07r2
53972B12841o09q32k12M03K2r15j154l36P71J436J546J232O84L19M68Q50R01O30
53954B18045O13J122J738K036K151K443K893L168L127K927K752K708K997L808
53940B52528M933N738N888N825O155O717O855O583O710P541Q224P954P182O855
53926C45688O930O557N457M249L429K959K810L035L156K484J364J218K825N204
53912C97365O754P022O786O859P402Q044Q165P235N328L216J632O24j34p03r73
$$ plain form
54016 337229 335866 334282 332776 330867 327992 324320 320471 316783 313202 309508 305300 300131 294117 288073
54002 288073 282650 277588 272241 266566 261129 256327 252035 247958 243992 240272 237067 234494 232284 230042
53988 230042 227860 226253 225331 224475 223140 221505 220008 218683 217413 216352 215605 214857 213902 213140 212933 212841
53972 212841 212232 211400 211188 211591 211613 210698 209544 209208 209979 211415 212961 214193 214877 215196 215664 216514 217415 218045
53954 218045 218658 219780 221518 223554 225705 228148 231041 234209 237336 240263 243015 245723 248720 252528
53940 252528 257461 263199 269087 274912 281067 287784 294639 301222 307932 315473 323697 331651 338833 345688
53926 345688 352618 359175 364632 368881 372310 375269 378079 381114 384270 386754 388118 389336 392161 397365
53912 397365 404119 411141 417927 424786 432188 440232 448397 455632 460960 464176 465808 466432 466298 465595 464622
53897D64622j083j239j292r53m13k37n49o89J16J960M237O162O990N959K551k902
53881D83240r033j4233j7702j9496j9778j8488j5934j3144j1134j0061r429q832
53869C15976q132p203o054n080m666m655m611m453m327m050l316k425k068k334
53855B52602k573k398k152k128k057j745j617k102k851l124k732k112j630j243
53841B22138q20m34j87%K71N62N87J85l62n66k99Q2K46K52K39J37n5j14j6j15
53821B21731m34k58Q77K185K419J502N15K05M56J144K416L797M128L016J611J314
53805B46624K243L549M650N500O018O001N531N020M819N073N723O414O581N938
53791C19684M762L589K721K211K050K133K206K035J552P82j35r67j585k173k988
$$ plain form
53897 464622 463539 462300 461008 460055 459642 459405 458856 458167 458283 460243 464480 470642 477632 483591 486142 483240
53881 483240 474207 459974 442272 422776 402998 384510 368576 355432 344298 334237 324808 315976
53869 315976 307844 300641 294587 289507 284841 280186 275575 271122 266795 262745 259429 257004 254936 252602
53855 252602 250029 247631 245479 243351 241294 239549 237932 235830 232979 229855 227123 225011 223381 222138
53841 222138 221318 220884 220697 220697 220968 221530 222117 222302 221940 221374 221075 221157 221403 221655 221894 222031 221976 221862 221846 221731
53821 221731 221297 221039 221916 224101 226520 228022 228537 228742 229198 230342 232758 236555 240683 243699 245310 246624
53805 246624 248867 252416 257066 262566 268584 274585 280116 285136 289955 295028 300751 307165 313746 319684
53791 319684 324446 328035 330756 332967 335017 337150 339356 341391 342943 343725 343590 342623 341038 338865 335877
53776C35877l956m808n469n929n906n243m510m545n333n970n878n328m696l918
53762B64388l051k632k994l666l897l434k523j565j018j137j563j598j133p72
53748B33405q31q95o79n74q76j116p94k68k39p29j192j284r97l60M30Q44N67j
53730B24411k42n4L70J068K074K856K703J629M03k98l85j38J52L32M89Q22J259
53713B37451J501J635K256L585M830M946L842K357J281Q53J059J800K702L210
53699B73308L052K470J985K037K690L544M066M074L808L511L243L029K836K356
53685C16009J368L49OJ64j56j270k280k450k189k065j706o06O23R11K30n24q83
53668C05531j065j136q64m13k55l31r2N10P74J77r99k040k368j773n86L83N45
$$ plain form
53776 335877 331921 327113 321644 315715 309809 304566 300056 295511 290178 284208 278330 273002 268306 264388
53762 264388 261337 258705 255711 252045 248148 244714 242191 240626 239608 238471 236908 235310 234177 233405
53748 233405 232574 231679 231000 230426 229550 228434 227640 227372 227133 226404 225212 223928 222931 222571 223001 223845 224412 224411
53730 224411 224169 224115 224485 225553 227627 230483 233186 234815 235218 234920 234535 234397 234549 234881 235370 236192 237451
53713 237451 238952 240587 242843 246428 251258 256204 260046 262403 263684 264537 265596 267396 270098 273308
53699 273308 276360 278830 280815 282852 285542 289086 293152 297226 301034 304545 307788 310817 313653 316009
53685 316009 317377 317726 317732 317896 317740 316470 314190 311740 309551 307486 305780 305174 305797 306708 306938 306414 305531
53668 305531 304466 303330 302466 302053 301798 301467 301375 301885 302659 302836 301837 299797 297429 295656 295070 295453 295998
53651B95998J41j79j79kL69R24J164N93m16r35o75j52K01L92M28L19M98J388K522
53632C02399K938K619K526L015L175K272R30K26L00O13J039J894L101M041M257
53617C35345L872L362L216L617M247M519M236L843L814M036M106L936L753L656
53603C89558L520L263K985K813K849L117L457L559L265K721K152J622J159R22
53589D26962R46Q66K07r20j696j383j69R38J182Q33P05J058J392J345J258J469
53573D34993J502N93j129k576k980k708k653l189m013m671m852m368l207j706
53559C99036m64J19J86J89L04K40j94n87l42M54J042J026Q42R86J269J298J262
53542D06666J580K124K428K499K755L286L817M403N373O510O989O525N932O190
$$ plain form
53651 295998 296139 295960 295781 295779 296148 297072 298236 298829 298413 297478 296803 296651 296852 297244 297672 297991 298489 299877 302399
53632 302399 305337 307956 310482 313497 316672 318944 319874 320100 320400 321013 322052 323946 327047 331088 335345
53617 335345 339217 342579 345795 349412 353659 358178 362414 366257 370071 374107 378213 382149 385902 389558
53603 389558 393078 396341 399326 402139 404988 408105 411562 415121 418386 421107 423259 424881 426040 426962
53589 426962 427908 428774 428981 428061 426365 424982 424813 425751 426933 427766 428471 429529 430921 432266 433524 434993
53573 434993 436495 437088 435959 433383 430403 427695 425042 421853 417840 413169 408317 403949 400742 399036
53559 399036 398572 398691 398877 399066 399370 399610 399416 398829 398487 398941 399983 401009 401851 402837 404106 405404 406666
53542 406666 408246 410370 412798 415297 418052 421338 425155 429558 434931 441441 448430 454955 460887 467077
53528D67077P382Q875J0200J1277J2093J2571J2704J2567J2310J2269J2893J4263
53516F06481J5851J6925J7243J7201J7459J8420J9935K1464K2636K3597K4676
53505H21888K5830K6664K7028K7094K6930K6386K5530K4740K4153K3475K2580
53494A102298K1882K1627K1260K0105J8521J7677J8076J8903J9130J8809J8783
53483A317071J9400K0082K0195J9847J9485J9165J8596J7765J6985J6259J5043
53472A519893J2886J0000O996M286J998J92j260k884n327q677j2246j5006j6255
53459A494596j5999j4972j4223j4464j5639j7124j8278j8892j9270j9948k1137
53448A304650k2320k2654k1852k0483j9335j8720j8476j8303j7828j6758j5169
$$ plain form
53528 467077 474459 483334 493534 504811 516904 529475 542179 554746 567056 579325 592218 606481
53516 606481 622332 639257 656500 673701 691160 709580 729515 750979 773615 797212 821888
53505 821888 847718 874382 901410 928504 955434 981820 1007350 1032090 1056243 1079718 1102298
53494 1102298 1124180 1145807 1167067 1187172 1205693 1223370 1241446 1260349 1279479 1298288 1317071
53483 1317071 1336471 1356553 1376748 1396595 1416080 1435245 1453841 1471606 1488591 1504850 1519893
53472 1519893 1532779 1542779 1549775 1554061 1556059 1556251 1554991 1552107 1546780 1538103 1525857 1510851 1494596
53459 1494596 1478597 1463625 1449402 1434938 1419299 1402175 1383897 1365005 1345735 1325787 1304650
53448 1304650 1282330 1259676 1237824 1217341 1198006 1179286 1160810 1142507 1124679 1107921 1092752
53437A092752j3421j1558r242o568m432l541l426l013j904m87R38K397L727M574
53423A046796N055N758O985Q458R931J1563J3442J5215J6534J7609J9074K1316
53411A197736K4015K6256K7371K7768K8674L0699L3000L4389L4953L5921L7986
53400A538768M0527M2593M4042M5412M7211M9498N1897N3864N5231N6436N7809
53389B083288N8885N8967N8294N7880N8076N8096N7156N5368N3166N0650M7889
53378B697715M5312M3067M0499L6858L2259K7445K2793J8081J3043P707K258l070
53366B983967q121j3177j9023k6126l3858m0845m6182m9997n2853n4962n6164
53355B582659n6471n6322n6191n6066n5380n3601n0828m7769m5211m3586m2956
$$ plain form
53437 1092752 1079331 1067773 1058531 1051963 1047531 1043990 1040564 1037551 1035647 1035160 1036098 1038495 1042222 1046796
53423 1046796 1051851 1057609 1064594 1073052 1082983 1094546 1107988 1123203 1139737 1157346 1176420 1197736
53411 1197736 1221751 1248007 1275378 1303146 1331820 1362519 1395519 1429908 1464861 1500782 1538768
53400 1538768 1579295 1621888 1665930 1711342 1758553 1808051 1859948 1913812 1969043 2025479 2083288
53389 2083288 2142173 2201140 2259434 2317314 2375390 2433486 2490642 2546010 2599176 2649826 2697715
53378 2697715 2743027 2786094 2826593 2863451 2895710 2923155 2945948 2964029 2977072 2984779 2987037 2983967
53366 2983967 2975846 2962669 2943646 2917520 2883662 2842817 2796635 2746638 2693785 2638823 2582659
53355 2582659 2526188 2469866 2413675 2357609 2302229 2248628 2197800 2150031 2104820 2061234 2018278
53344B018278m3180m4002m5034m5711m5392m3731m1060l8166l5625l3443l1511
53333A571423k9924k8605k7068k4915k2394j9953j7600j5181j3065j1973j2136
53322A348609j3137j4428j5565j6073j5744j4960j4207j3394j2166j0699r459
53311A198777q345o872n114l598k287o46J230K567L286M356O336Q538J0175J1555
53297A219958J3393J5689J7934J9925K1680K3032K3926K4772K5943K7257K8342
53286A461851K9126K9543K9206K7831K5639K3094K0603J8692J7695J6891J4824
53275A714995J1035O799L425O65k398n709q573j1092j3922j6907j9163k0494k1596
53262A617065k2832k3869k4631k5577k6763k7541k7604k7514k7822k8365k8874
$$ plain form
53344 2018278 1975098 1931096 1886062 1840351 1794959 1751228 1710168 1672002 1636377 1602934 1571423
53333 1571423 1541499 1512894 1485826 1460911 1438517 1418564 1400964 1385783 1372718 1360745 1348609
53322 1348609 1335472 1321044 1305479 1289406 1273662 1258702 1244495 1231101 1218935 1208236 1198777
53311 1198777 1190432 1183560 1178446 1174848 1172561 1171915 1173145 1175712 1178998 1183354 1189690 1198228 1208403 1219958
53297 1219958 1233351 1249040 1266974 1286899 1308579 1331611 1355537 1380309 1406252 1433509 1461851
53286 1461851 1490977 1520520 1549726 1577557 1603196 1626290 1646893 1665585 1683280 1700171 1714995
53275 1714995 1726030 1732829 1736254 1736919 1734521 1728812 1720239 1709147 1695225 1678318 1659155 1638661 1617065
53262 1617065 1594233 1570364 1545733 1520156 1493393 1465852 1438248 1410734 1382912 1354547 1325673
53251A325673k9518l0392l0927l0453k9065k7479k6292k5698k5650k5878k5963
53240A018358k5720k5366k5017k4278k2738k0781j9343j8799j8495j7613j6185
53229G84023j4819j3692j2362j0674r278q859r267r878j0556j1548j2570j2834
53217F47686j2259j1910j2719j4271j5403j5590j5208j4653j3868j2716j1342
53206D97747j0018q923q114p524p048o735o793p233p708p872p732p511p383p443
53192C89710p665p729p306o663o523p004p200o324m784l607l134k961k793k678
53178C13339k544k255k060k289k596k225j111r2J47k24o99j060j245j126p45m70
53162B92745n07n85m23k17l69q78j334j457j419j577j967k163j716p62n2j69q02
$$ plain form
53251 1325673 1296155 1265763 1234836 1204383 1175318 1147839 1121547 1095849 1070199 1044321 1018358
53240 1018358 992638 967272 942255 917977 895239 874458 855115 836316 817821 800208 784023
53229 784023 769204 755512 743150 732476 723198 714339 705072 695194 684638 673090 660520 647686
53217 647686 635427 623517 610798 596527 581124 565534 550326 535673 521805 509089 497747
53206 497747 487729 478806 470692 463168 456120 449385 442592 435359 427651 419779 412047 404536 397153 389710
53192 389710 382045 374316 367010 360347 353824 346820 339620 333296 328512 324905 321771 318810 316017 313339
53178 313339 310795 308540 306480 304191 301595 299370 298259 298167 298314 298090 297391 296331 295086 293960 293215 292745
53162 292745 292238 291653 291230 291013 290644 289766 288432 286975 285556 283979 282012 279849 278133 277371 277319 277150 276348
53145B76348j084o02J22K93k71j022j365j249j082j085r45k77P14J389J511J505
53129B72900J700J729J067j11j041j234q15j37N62J071J227J092R29R10R57Q90
53113B81696O59M40N31R36J156O67k92q97q67q75j481k191k171j491r52r47j221
53096B72700j559j943k078j589q29o08r70r83j41Q02R64O51P50J184R40l19j544
53079B65428j610p65j71l17n41j59O25J226J487J487J028L4p80n76K74M48m52
53062B66666j316j255r10j229j795j548o46k27m78k24J202K809L170K118O32l49
53046B66620n80l28m7m7j97j50Q3P6l76r64j360j595j717j522r50l95k58m06m03
53027B55484j25K17M60N41L10l45j146j494j042r2P20R75P58M26K55L07N43Q87
$$ plain form
53145 276348 275264 274662 274784 275077 274806 273784 272419 271170 270088 269003 268058 267781 268495 269884 271395 272900
53129 272900 274600 276329 277396 277285 276244 275010 274195 274058 274620 275691 276918 278010 278939 279849 280806 281696
53113 281696 282355 282795 283326 284262 285418 286085 285793 284896 284029 283154 281673 279482 277311 275820 274868 273921 272700
53096 272700 271141 269198 267120 265531 264702 264094 263124 262141 262000 262802 263766 264417 265167 266351 267291 266972 265428
53079 265428 263818 263053 262882 262565 262024 261865 262490 263716 265203 266690 267718 267752 266972 266396 266670 267118 266666
53062 266666 265350 264095 263185 261956 260161 258613 257967 257740 257262 257038 258240 261049 264219 266337 266969 266620
53046 266620 266040 265712 265665 265618 265421 265271 265354 265430 265054 264090 262730 261135 259418 257896 256946 256551 256293 255887 255484
53027 255484 255359 255576 256036 256577 256887 256542 255396 253902 252860 252768 253488 254463 255221 255647 255902 256209 256752 257639
53009B57639J175J199R34O98R06J636K444K651J938P16j50j48L46N17Rq01j337
52992B70372j312p53O4O35N81J48p5L7P4k8K85J214K011J930J314J053J296J431
52974B80277J167J017J518K497L190K974J922Q38M89P65Q72M31p2j70q8j54r9
52957B97374M04J007J073M59n70j767k720k828k133j571j681j690q40R3j64j364
52941B83082k078j812j354j098n47M00J043J128J212J404R43m30j793k357k421
52926B75322k423k071j148l66m85j151j431j024l87mn3l78m46J91J124J305M28
52909B67003n85q45n76m48n11m06j41k6j87n47r52j062n77J65M45K34K65P51R54
52890B62954N01J54M95Q54M44k42k89M3k25j102j596j243n92j66R9L79O18P97
$$ plain form
53009 257639 258814 260013 260947 261645 262551 264187 266631 269282 271220 271936 271786 271638 271984 272501 272510 271709 270372
52992 270372 269060 268307 268371 269006 269587 269735 269660 269697 269771 269743 270028 271242 273253 275183 276497 277550 278846 280277
52974 280277 281444 282461 283979 286476 289666 292640 294562 295400 295889 296654 297526 297957 297885 297715 297627 297473 297374
52957 297374 297778 298785 299858 300317 299747 297980 295260 292432 290299 288728 287047 285357 284517 284610 284446 283082
52941 283082 281004 279192 277838 276740 276193 276593 277636 278764 279976 281380 282323 281893 280100 277743 275322
52926 275322 272899 270828 269680 269314 268829 267678 266247 265223 264836 264832 264779 264401 263955 264146 265270 266575 267003
52909 267003 266418 265573 264997 264549 264038 263632 263491 263465 263278 262731 261779 260717 260140 260305 260750 260984 261249 262000 262954
52890 262954 263455 263609 264104 264958 265402 265160 264871 264914 264689 263587 261991 260748 260156 259990 260089 260468 261086 261883
52872B61883Q87O17o2m95K0J157J942K133K396L065L563L340K662K094J703J158
52856B88063L19o17j331j603j493j354j492j849k115k184k234k443k792l120l180
52841B60575k837k298j959j894j790j512j342j406j341q93m15k80k49L9L58L03
52825B43059K7r4k06n85q40m31J88m6j156j915j564q12o16p41k55J042K416L197
52807B40668L351L125K676K155J710J194J75j418k737k674j244L9k18j575k301
52792B42926j668q37j079j984k179j215J15J000J273J000L54q3K83J183J691J492
52776B42272J215J321J437J151P96Q57J103R37K99k82m17j99O7J24j74p36j216
52759B48555j395j474j703j819j284j44P69P98L08J56M42L68m86j378j319m63
$$ plain form
52872 261883 262770 263387 263325 262830 262850 264007 265949 268082 270478 273543 277106 280446 283108 285202 286905 288063
52856 288063 288382 287765 286434 284831 283338 281984 280492 278643 276528 274344 272110 269667 266875 263755 260575
52841 260575 257738 255440 253481 251587 249797 248285 246943 245537 244196 243303 242888 242608 242359 242398 242756 243059
52825 243059 243086 242992 242786 242201 241361 240930 241118 241072 239916 238001 236437 235625 235009 234268 234013 235055 237471 240668
52807 240668 244019 247144 249820 251975 253685 254879 255054 253636 250899 248225 246981 247020 246802 245227 242926
52792 242926 241258 240421 239342 237358 235179 233964 234079 235079 236352 237352 237706 237623 237906 239089 240780 242272
52776 242272 243487 244808 246245 247396 248192 249049 250152 251089 251388 251106 250689 250490 250557 250681 250507 249771 248555
52759 248555 247160 245686 243983 242164 240880 240736 241505 242303 242611 242767 243209 243577 243091 241713 240394 239931
52743B39931J80K73O12J819L326M059L750K895J941J056N48O84J142J206P14L16
52727B64452N96J295J714J600J348J361J470J104N6j126j601j143l35J74L05K86
52711B71556J23l82j203j995k453k507k232j703r97k61K15J29m18p45k72P11J312
52694B58878J190Q32O26L20k93p97p84n05l16J0Q21J786K248K114J809J491R77
52677B70407K72l22n36k38M61R46M32q83j644j028m3j28j014j179k50M80R8p28
52659B65103r88o78l21K2O02J373K087K635K909K771K375K066J742Q86n45j821
52643B80218k349k356k373k489k509k373k047j414n73Q0L70N35P10O58L63L03
52627B64754Q20J563J971J953J747J455J112Q72P32L87l04r66j126p90l54j79
$$ plain form
52743 239931 240111 240384 240996 242815 246141 250200 253950 256845 258786 259842 260390 261074 262216 263422 264136 264452
52727 264452 265048 266343 268057 269657 271005 272366 273836 274940 274996 273870 272269 271126 270791 270965 271270 271556
52711 271556 271679 271297 270094 268099 265646 263139 260907 259204 258207 257946 258161 258290 257872 257127 256855 257566 258878
52694 258878 260068 260900 261526 261846 261553 260756 259972 259467 259151 259161 259982 261768 264016 266130 267939 269430 270407
52677 270407 270679 270357 269821 269583 270044 270990 271422 270539 268895 267867 267824 267696 266682 265503 265253 265733 265831 265103
52659 265103 264115 263437 263116 263138 263740 265113 267200 269835 272744 275515 277890 279956 281698 282584 282039 280218
52643 280218 277869 275513 273140 270651 268142 265769 263722 262308 261735 261815 262185 262720 263430 264088 264451 264754
52627 264754 265574 267137 269108 271061 272808 274263 275375 276247 276979 277366 277062 276096 274970 274180 273826 273647
52611B73647m05r07j190p64J15N43J17m34j87P33J380J210O42M17Q31J459J583
52594B78790R39J08j43J12J23k56k27O40J500J338M74J18P13J562J958J896J609
52577B91254J150N85P2m59j218j987k152j496n93j43k26l77j95L75J071J449J141
52560B88251K15p68j215r96m82j44j50k88k59m0J02%k20l84n09o17n04o2K98L4
52540B82262o68r23k83N80P20K30P1O58J190P48l92j065o63K34P74P49M90K57
52522B84969J34K25M76N75L83K86O70J254J514J605K188L243L867L514K806K651
52506C10360L068L336K901J689j55k171l542l758l305l196l724m171l801k662
52492B90869j341l41N2k77j060j647j544r19l12N1L33N44L36l87j048r46j31P04
$$ plain form
52611 273647 273242 272335 271145 270381 270496 271039 271156 270722 270535 271268 272648 273858 274500 274917 275748 277207 278790
52594 278790 279729 279837 279694 279806 279929 279673 279446 280086 281586 282924 283398 283516 284229 285791 287749 289645 291254
52577 291254 292404 292989 293061 292602 291384 289397 287245 285749 285156 285013 284787 284410 284215 284590 285661 287110 288251
52560 288251 288466 287698 286483 285487 285005 284861 284711 284423 284164 284124 284226 284226 284006 283622 283113 282496 281992 281930 282228 282262
52540 282262 281594 280671 280388 280968 281688 281918 281989 282647 283837 284585 284193 283128 282465 282699 283473 284222 284712 284969
52522 284969 285103 285328 285804 286379 286762 287048 287718 288972 290486 292091 294279 297522 301389 304903 307709 310360
52506 310360 313428 316764 319665 321354 321199 319028 315486 311728 308423 305227 301503 297332 293531 290869
52492 290869 289528 289187 289239 288962 287902 286255 284711 283792 283480 283531 283864 284408 284744 284357 283309 282363 282232 282936
52474B82936J216J812K830L756L784K912K003J690J748J707J641K010K903L827
52460C16775M231L994L362K534J496K19j099k153k871l482m199m919n361n358
52446C03169m868l899k598j366o16m60o49p64m78J98Q05Q68N31M21O92O87l9r09
52428B90725j050n74k55k33Q7Q06J093M14n57o94K59J535K213J974J250Q83J425
52411B99301K594L594L957L877L784L975M731O248Q312J0339J1855J2526J1776
52398C86869R035M612j46l961o515q073q756q590p852o900n834m653l516k599
52384C33121j892j365j087j031r32o01q9N26J275K081K735L255L881M609N128
52369C49614N372N696O242O516N939M510K771J328M77N9m59j296j861j441l47
$$ plain form
52474 282936 284152 285964 288794 292550 296334 299246 301249 302939 304687 306394 308035 310045 312948 316775
52460 316775 321006 325000 328362 330896 332392 332611 331512 329359 326488 323006 318807 313888 308527 303169
52446 303169 298301 294402 291804 290438 289822 289362 288713 287949 287471 287669 288474 289342 289873 290294 290986 291673 291634 290725
52428 290725 289675 289101 288846 288613 288700 289506 290599 291013 290456 289762 290021 291556 293769 295743 296993 297876 299301
52411 299301 301895 305489 309446 313323 317107 321082 325813 332061 340373 350712 362567 375093 386869
52398 386869 395904 400516 400370 396409 389894 381821 373065 364475 356623 349723 343889 339236 335720 333121
52384 333121 331229 329864 328777 327746 326814 326213 326124 326650 327925 330006 332741 335996 339877 344486 349614
52369 349614 354986 360682 366924 373440 379379 383889 386660 387988 388465 388524 388065 386769 384908 383467 383120
52354C83120L30K17O2M02P62O42M95R39J686K005J818J606J643J912K482L352
52338D03473M191M756N291O044O805P338P863Q622R410J0080J1006J2404J3727
52325E11010J4395J4707J5354J6386J7415J8350J9226J9703J9523J9105J8960
52314G04134J8888J8534J8231J8450J8835J8853J8898J9647K0687K0996K0595
52303I16748K0430K0718K0730K0258J9909J9750J8976J7331J5592J4164J2269
52292A116875R213N455J880j214l813n684o749p373p790p874p785q050q634q672
52278A059785p629o008m482l071j598j89J158K726M341N376N955P129R210J1001
52264A083704J1606J1902J3042J4488J4947J4609J4782J5721J6448J6682J7326
$$ plain form
52354 383120 383450 383667 383729 384131 384893 385535 386030 386969 388655 390660 392478 394084 395727 397639 400121 403473
52338 403473 407664 412420 417711 423755 430560 437898 445761 454383 463793 473873 484879 497283 511010
52325 511010 525405 540112 555466 571852 589267 607617 626843 646546 666069 685174 704134
52314 704134 723022 741556 759787 778237 797072 815925 834823 854470 875157 896153 916748
52303 916748 937178 957896 978626 998884 1018793 1038543 1057519 1074850 1090442 1104606 1116875
52292 1116875 1126088 1131543 1133423 1132209 1128396 1122712 1115963 1108590 1100800 1092926 1085141 1077091 1068457 1059785
52278 1059785 1052156 1046148 1041666 1038595 1036997 1036808 1037966 1040692 1045033 1050409 1056364 1063493 1072703 1083704
52264 1083704 1095310 1107212 1120254 1134742 1149689 1164298 1179080 1194801 1211249 1227931 1245257
52253A245257J8621J9327J8412J6498J4874J3789J2458J0241P204L833O90j832
52241A379372l789n475o919p805q100q276q706r189r365r308r390r688r889r682
52227A263791r129q620q437q365p856o789n820n547n523m710k965j360p16m95
52213A187459L16J735K916L496L989M783N521N836O116O903P803P744O459N142
52199A256218N149O353P352P256O718O927Q052R131R327Q797Q283Q151Q039P296
52185A363049N651L516J640L63p56k480n058q016j0569j2097j2341j1520j0332
52172A301050r494r091q594p610o354n277m474l661k580j223K17J492K462L175
52158A250038L636L565K701J434O38O00N66k25j396j959j640j102q83p99m81Q8
$$ plain form
52253 1245257 1263878 1283205 1301617 1318115 1332989 1346778 1359236 1369477 1376681 1380514 1381204 1379372
52241 1379372 1375583 1370108 1363189 1355384 1347284 1339008 1330302 1321113 1311748 1302440 1293050 1283362 1273473 1263791
52227 1263791 1254662 1246042 1237605 1229240 1221384 1214595 1208775 1203228 1197705 1192995 1190030 1188670 1187954 1187459
52213 1187459 1187775 1189510 1192426 1195922 1199911 1204694 1210215 1216051 1222167 1229070 1236873 1244617 1251076 1256218
52199 1256218 1261367 1267720 1275072 1282328 1289046 1295973 1304025 1313156 1322483 1331280 1339563 1347714 1355753 1363049
52185 1363049 1368700 1372216 1373856 1374219 1373463 1370983 1365925 1357909 1347340 1335243 1322902 1311382 1301050
52172 1301050 1291556 1282465 1273871 1266261 1259907 1254630 1250156 1246495 1243915 1242692 1242909 1244401 1246863 1250038
52158 1250038 1253674 1257239 1259940 1261374 1262012 1262612 1263178 1262953 1261557 1259598 1257958 1256856 1255973 1255174 1254693 1254781
52142A254781P43J306J464R50K2p18j200j904k847l183k243l85J681L807O078
52127A258352Q194R904J1656J4004J6710J9255K1787K4652K7222K8438K8467K8670
52115A497311K9644L0462L0194K9072K7634K5756K3315K0947J9256J7882J6244
52104A767717J4680J3964J4051J4168J3918J3479J2851J1654R705P191M327J302
52092A899007j601m347p412j1140j5032j8269k0635k2270k2820k1785j9670j7761
52080A716265j6510j5045j2615r732p396n843m579l138j316J001L707O373Q691
52067A659863J0745J2628J4006J4574J4667J5003J5862J6865J7548J7769J7571
52056A827101J6941J5908J4628J3289J1961J0609R153P416N091J960j755n416
$$ plain form
52142 1254781 1255524 1256830 1258294 1259244 1259266 1258548 1257348 1255444 1252597 1249414 1247171 1246786 1248467 1252274 1258352
52127 1258352 1266546 1276450 1288106 1302110 1318820 1338075 1359862 1384514 1411736 1440174 1468641 1497311
52115 1497311 1526955 1557417 1587611 1616683 1644317 1670073 1693388 1714335 1733591 1751473 1767717
52104 1767717 1782397 1796361 1810412 1824580 1838498 1851977 1864828 1876482 1886187 1893378 1897705 1899007
52092 1899007 1897406 1893059 1885647 1874507 1859475 1841206 1820571 1798301 1775481 1753696 1734026 1716265
52080 1716265 1699755 1684710 1672095 1662363 1654967 1649124 1644545 1641407 1640091 1641092 1644799 1651172 1659863
52067 1659863 1670608 1683236 1697242 1711816 1726483 1741486 1757348 1774213 1791761 1809530 1827101
52056 1827101 1844042 1859950 1874578 1887867 1899828 1910437 1919590 1927006 1932097 1934057 1932302 1926886
52044A926886q527j1262j4123j7135j9645k1188k2123k3062k3832k3651k2310
52033A720028k0742j9994j9998j9769j8738j7383j6381j5624j4627j3666j3722
52022A529384j5006j6340j6522j5828j5307j5058j4291j2906j1837j1564j1441
52011A373284j0961j0621j0938j1537j1973j2608j3829j5162j6075j7018j8645
52000A223917k0655k2308k3492k4216k3739k1618j9061j7733j7425j6542j4796
51989A002332j3768j4450j5912j6861j7200j7369j7408j7371j7597j7962j7770
51978H18664j7011j6645j7086j7410j6842j5916j5317j4506j2597r854p212m847
51966F53421k328K94K535M378O097P445P887P536P016O410N123K766l17l440o036
$$ plain form
52044 1926886 1918359 1907097 1892974 1875839 1856194 1835006 1812883 1789821 1765989 1742338 1720028
52033 1720028 1699286 1679292 1659294 1639525 1620787 1603404 1587023 1571399 1556772 1543106 1529384
52022 1529384 1514378 1498038 1481516 1465688 1450381 1435323 1421032 1408126 1396289 1384725 1373284
52011 1373284 1362323 1351702 1340764 1329227 1317254 1304646 1290817 1275655 1259580 1242562 1223917
52000 1223917 1203262 1180954 1157462 1133246 1109507 1087889 1068828 1051095 1033670 1017128 1002332
51989 1002332 988564 974114 958202 941341 924141 906772 889364 871993 854396 836434 818664
51978 818664 801653 785008 767922 750512 733670 717754 702437 687931 675334 665480 658268 653421
51966 653421 651093 651387 653922 658300 664397 671842 679729 687265 694281 700691 705814 708580 708263 704823 698787
51951F98787p778q710r102q947p882n934l856k257p75J250L676N792P426R022
51937F70712J0739J2175J2993J3256J3059J2312J0928Q847N852J783k997p607
51925G62052j1157j3201j3974j4335j5168j6548j7682j7916j7405j6590j5539
51914E92537j4137j2552j0941r151p168n437m210k977j132J177L406N402P202
51901E42019Q529R287J0145J1701J3167J2915J0352O539K963M20r20j144n90K89
51887F25672J179J693J064j264m805q331j0951j2365j2344j0807q335n795l311
51874E51300m43K600M809N630N533N000L748J476j330l839n724p001p515p101
51860E47143o070n066m469m121l528k253l51J522K674L007K884K453J533J63j306
$$ plain form
51951 698787 691009 682299 673197 664250 656368 650434 646578 644321 643546 644796 648472 654264 661690 670712
51937 670712 681451 693626 706619 719875 732934 745246 756174 765021 770873 772656 769659 762052
51925 762052 750895 737694 723720 709385 694217 677669 659987 642071 624666 608076 592537
51914 592537 578400 565848 554907 545756 538588 533151 528941 525964 524832 526009 529415 534817 542019
51901 542019 550548 559835 569980 581681 594848 607763 618115 624654 627617 628037 627117 625973 625383 625672
51887 625672 626851 628544 629608 628344 623539 615208 604257 591892 579548 568741 560406 554611 551300
51874 551300 550857 553457 558266 563896 569429 574429 578177 579653 578323 574484 568760 561759 554244 547143
51860 547143 541073 536007 531538 527417 523889 521636 521285 522807 525481 528488 531372 533825 535358 535521 534215
51845E34215k702m085n247n755n683n716o218o694o595o077n602n125m143k422
51831D62151k66J708K932L174K741K198J751J112J8j425k939m214m771m193k835
51816D57142j788j737k126j880o87P82J730J882J389N12m80j324j811j831j482
51801D48291j051p98o86n13k43N2M85J203J913J988J162j40j289j925j939j466
51785D45044j031j177j692j707q67L7M8p81j629k032k120j967j353j93J192K510
51769D32282L862N523P471R214J0153J0120R599R163Q770P794N843L126k6l506
51755E19388o935r321r881r055q152p969q176q082p465o504n328l966k589j524
51741D24441r55o49j0J478L697N844P167P781Q512R806J1003J0930R090O105L035
$$ plain form
51845 534215 531513 527428 522181 516426 510743 505027 498809 492115 485520 479443 473841 468716 464573 462151
51831 462151 461885 463593 466525 469699 472440 474638 476389 477501 477519 476094 473155 468941 464170 459977 457142
51816 457142 455354 453617 451491 449611 448924 449706 451436 453318 454707 455219 454739 453415 451604 449773 448291
51801 448291 447240 446442 445756 445243 445000 445052 445537 446740 448653 450641 451803 451663 450374 448449 446510 445044
51785 445044 444013 442836 441144 439437 438570 438607 438655 437874 436245 434213 432093 430126 428773 428580 429772 432282
51769 432282 436144 441667 449138 458352 468505 478625 488224 497387 506157 513951 519794 522920 522894 519388
51755 519388 512453 503132 493251 484196 476044 468075 459899 451817 444352 437848 432520 428554 425965 424441
51741 424441 423486 422837 422827 424305 428002 433846 441013 448794 457306 467112 478115 489045 498135 504240 507275
51726E07275N89r01j143q4J626K782K586J279l85j968l389m470m904m672m016
51711D90205l111k137j638k171l430m285m007l008j992q49J010L433N248N332
51697D78600L565P34k127m164m816l930j874N85K584L506L122J574o98l012m702
51682D68947n547n873n981n637m449k649r88K09J290K324K527J248q01k006j500
51667D41114J54J897L307M618O058P439Q239P919O319L864J292r22k776m429n731
51652D78362o129n037k358J176M401O617Q012Q914Q757O397J631m032q560j1069
51638D87082j2027j2074j1314r754p813o083m824l987l413k779j662o4J317J759
51624D14364J509J631K813M511N467M842K840M61j273k067k447k954l407l286
$$ plain form
51726 507275 507864 506963 505820 505736 507362 510144 512730 514009 513624 511656 508267 503797 498893 494221 490205
51711 490205 487094 484957 483319 481148 477718 473433 469426 466418 464426 463577 464587 468020 473268 478600
51697 478600 482165 482899 480772 476608 471792 467862 465988 466573 469157 472663 475785 477359 476661 473649 468947
51682 468947 463400 457527 451546 445909 441460 438811 437823 438032 439322 441646 444173 445421 444620 442614 441114
51667 441114 441268 443165 446472 451090 457148 464587 472826 480745 487064 490928 492220 491298 488522 484093 478362
51652 478362 472233 467196 464838 466014 470415 477032 485044 493958 502715 509112 510743 506711 498151 487082
51638 487082 475055 462981 451667 441913 434100 428017 423193 419206 415793 413014 411352 411288 412605 414364
51624 414364 415873 417504 420317 424828 430295 435137 437977 438438 437165 435098 432651 429697 426290 423004
51610D23004k684k344k563k716k266j615j445j600j310k50J212K692M045N043
51596D17203N524N971P251R563J2103J3993J4945J4697J2539Q128K531k307n188
51583E16953o378o695o398n309l554j696k4J863M546P981J1387J3883J5115J5422
51569E57096J5641J6692J8876K1454K3146K3182K1805J9853J8339J8370K0777
51558G75231K5327L0744L5883M0443M4138M5759M3832L7942K8801J7367M658p829
51546A122296j8578k7084l3829l9131m2717m4458m4784m4097m2387l9667l6252
51535G09312l2450k8476k4762k1728j9142j6399j3614j1628j0635r663p959o136
51523E06720n212n136n019m420l646k994k476k213k458l177m025m673m889m416
$$ plain form
51610 423004 420320 417976 415413 412697 410431 408816 407371 405771 404461 404211 405423 408115 412160 417203
51596 417203 422727 428698 435949 445512 457615 471608 486553 501250 513789 521917 524448 522141 516953
51583 516953 510575 503880 497482 492173 488619 486923 486899 488762 493308 501289 512676 526559 541674 557096
51569 557096 572737 589429 608305 629759 652905 676087 697892 717745 736084 754454 775231
51558 775231 800558 831302 867185 907628 951766 997525 1041357 1079299 1108100 1125467 1130125 1122296
51546 1122296 1103718 1076634 1042805 1003674 960957 916499 871715 827618 785231 745564 709312
51535 709312 676862 648386 623624 601896 582754 566355 552741 541113 530478 520815 512856 506720
51523 506720 501508 496372 491353 486933 483287 480293 477817 475604 473146 469969 465944 461271 456382 451966
51509D51966l206j735p64p87j828l437m711m731l459j893q86j51J023K432L163
51494D30996K993K715K997L628M215M843N600N996N452M154K799J672M06j298
51480D77168l203m880o102o688o440n581m991n383o320o550n552m185l619m033
51466D03641m728n134n173m888m238l270k121q94J52O12M80M09Q33J203P60j07
51450C77537j64J002K590L858M938O075P067P937R326J1651J4429J6927J8728
51437D81901J9172J7170J2444O534J661j154k272k310j780j538k554m956p920
51424E14398j0517j2219j2706j1903j0328q857p921p229o290m922l266j657n43
51411D16040o9K13R14J969K592K172J011M1rR12K316L592M340M485M341M468N167
$$ plain form
51509 451966 448760 447025 446261 445474 443646 440209 435498 430767 427308 425415 424529 424378 425401 427833 430996
51494 430996 433989 436704 439701 443329 447544 452387 457987 463983 469435 473589 476388 478060 478466 477168
51480 477168 473965 469085 462983 456295 449855 444274 439283 433900 427580 421030 415478 411293 407674 403641
51466 403641 398913 393779 388606 383718 379480 376210 374089 373195 373347 373959 374439 374848 375681 376884 377644 377537
51450 377537 377373 378375 380965 384823 389761 395836 402903 410840 420166 431817 446246 463173 481901
51437 481901 501073 518243 530687 537221 538882 537728 535456 533146 531366 529828 527274 522318 514398
51424 514398 503881 491662 478956 467053 456725 447868 439947 432718 426428 421506 418240 416583 416040
51411 416040 415971 416184 417098 419067 421659 423831 424842 424883 424874 425786 428102 431694 436034 440519 444860 449328 454495
51394D54495N949N901M943M310N189P270R386J1282J3659J6495J8712J9977K1522
51381E99090K4543K8786L3549L8958M5095N0758N4582N6943N9246O1367O1077
51370A113994N6215M6568L3514J8786L875j0201k3032l4428m3906n0912n5469
51359A055004n8089n9117n8661n6944n4148n0078m4668l8704l3312k8793k4626
51348E47864k0566j7030j4334j2323j0819r813r108q342p454o590n617m361l183
51335D18324k680k721k541j903j401j447j651j481r92n59l26k01q9n7l19j048
51319C98908j897k103j453p85r52j638j932j645j228o80L27J409J729J289Q74
51304C90223N99k15j491k036j229M7P22Q40Q26N03l59j218j327p20K0N60R31J258
$$ plain form
51394 454495 460444 466345 471288 475598 480787 488057 497443 508725 522384 538879 557591 577568 599090
51381 599090 623633 652419 685968 724926 770021 820779 875361 932304 991550 1052917 1113994
51370 1113994 1170209 1216777 1250291 1269077 1272952 1262751 1239719 1205291 1161385 1110473 1055004
51359 1055004 996915 937798 879137 822193 768045 717967 673299 634595 601283 572490 547864
51348 547864 527298 510268 495934 483611 472792 462979 453871 445529 438075 431485 425868 421507 418324
51335 418324 415644 412923 410382 408479 407078 405631 403980 402499 401507 400948 400622 400421 400332 400275 399956 398908
51319 398908 397011 394908 393455 392670 391718 390080 388148 386503 385275 384595 384922 386331 388060 389349 390223
51304 390223 390822 390607 389116 387080 385851 385898 386620 387460 388286 388789 388430 387212 385885 385165 385185 385745 386676 387934
51286C87934J750K541L271L344K831K474K647L017L434M146M816M383K517K31
51272D29336j548k994m283m637l490j763q04o98n81l3Q90K258L718L972K176n26
51256D20993k144k277k091k175j939j174p79j371k342k764k485j881j266r03r97
51241C94405j356j509j316j020o91k96j68o82j380j345n18K37M93P15J088R83
51225C87640J74m26m2P27Q46M33M24R94J346R82L34j4l7J3J07M07R62J562J843
51206C98275J599J185J341K303L268L319K708K554L226L719L048J613O00L95K75
51191D29428l64j208j558j189l96L95P71M91k11o52m69j33l88j274k150k540k571
51174D15982k544k510k341j967j439r53p61q05o23N3O89N61r6j74R48K674L996
$$ plain form
51286 387934 389684 392225 395496 398840 401671 404145 406792 409809 413243 417389 422205 426588 429105 429336
51272 429336 427788 424794 420511 415874 412384 410621 409817 409119 408538 408505 409395 411653 415371 419343 421519 420993
51256 420993 418849 416572 414481 412306 410367 409193 408414 407043 404701 401937 399452 397571 396305 395402 394405
51241 394405 393049 391540 390224 389204 388513 388217 388049 387367 385987 384642 384124 384361 384854 385569 386657 387640
51225 387640 387814 387388 387346 388073 388919 389352 389776 390770 392116 393098 393432 393418 393381 393394 393501 393908 394870 396432 398275
51206 398275 399874 401059 402400 404703 407971 411290 413998 416552 419778 423497 426545 428158 428758 429153 429428
51191 429428 429064 427856 426298 425109 424713 425108 425879 426370 426159 425507 425038 424905 424517 423243 421093 418553 415982
51174 415982 413438 410928 408587 406620 405181 404228 403467 402662 402039 402092 402781 403342 403246 403072 404020 406694 410690
51157D10690M487M236L432K415J728J596J593J172L14n66j069r82m63j76q41k241
51141D25325l256l213k752k796l215l099k044m94Q69J577J456Q97P51J457K406
51126D13869K716K325J739J117L77j08J88J023J559J511J273J056P06M18P31J607
51110D32107K321K483K399K239J736J049J006J944L046L386L084K768K530K111
51096D64209J653J518J598J500J179Q54N01L6k39N2O78J032R37O52J76p62j904
51079D73670k385j754n80K47L99O7n38j148j285p10J12N23O18J156K487M018N060
51062D79957N730O591P752Q922J0214J2222J4933J7024J6731J3424Q290L567J227
51049F06584K017N304R666J3668J6246J6803J5507J3499J2085J1277R580N753
$$ plain form
51157 410690 415177 419413 422845 425260 426988 428584 430177 431349 431663 431097 430028 429046 428583 428407 427566 425325
51141 425325 422069 418856 416104 413308 410093 406994 404950 404456 405325 406902 408358 409255 410006 411463 413869
51126 413869 416585 418910 420649 421766 422143 422035 422223 423246 424805 426316 427589 428645 429351 429769 430500 432107
51110 432107 434428 436911 439310 441549 443285 444334 445340 447284 450330 453716 456800 459568 462098 464209
51096 464209 465862 467380 468978 470478 471657 472511 473012 473048 472809 472861 473539 474571 475508 476160 476336 475574 473670
51079 473670 471285 469531 468951 469198 469597 469664 469126 467978 466693 465983 466095 466618 467236 468392 470879 474897 479957
51062 479957 485687 492278 500030 508952 519166 531388 546321 563345 580076 593500 601790 605357 606584
51049 606584 608601 613905 623571 637239 653485 670288 685795 699294 711379 722656 732236 737989
51037G37989M84m160o699p073o012m547m104n940r879j4205j7267j8734j8944
51024F20909j7824j5208j1798q855o888n333l634k013r01r2J040K738M572N999
51010E62712O874P447P958Q351Q345P836P210P142P955R214J0123J0370J0422
50997F71959J0930J1989J3189J4164J4828J5035J4492J3173J1628J0531J0009
50986H11927R658R199Q840Q858R162R487R898J0795J2356J4112J5298J5532J4993
50973I60115J4018J2879J2084J2451J4453J7713K1593K6190L2105L9135M5944
50962A208680N1412N5854O0364O5293O9887P3222P4999P5474P5056P3995P2044
50951A956280O8560O3203N6504M9383M2300L5285K8622K2841J8028J3830J0392
$$ plain form
51037 737989 738473 734313 727614 720541 714529 709982 705878 699938 690059 675854 658587 639853 620909
51024 620909 603085 587877 576079 567224 560336 555003 551369 549356 548455 548363 549403 552141 556713 562712
51010 562712 569586 577033 584991 593342 601687 609523 616733 623875 631830 641044 651167 661537 671959
50997 671959 682889 694878 708067 722231 737059 752094 766586 779759 791387 801918 811927
50986 811927 821585 830784 839624 848482 857644 867131 877029 887824 900180 914292 929590 945122 960115
50973 960115 974133 987012 999096 1011547 1026000 1043713 1065306 1091496 1123601 1162736 1208680
50962 1208680 1260092 1315946 1376310 1441603 1511490 1584712 1659711 1735185 1810241 1884236 1956280
50951 1956280 2024840 2088043 2144547 2193930 2236230 2271515 2300137 2322978 2341006 2354836 2365228
50940B365228Q640R097J0735J1547J0223P059L282j57l111n883q676j1555j4773
50927B381656j8788k3835k9601l5626m1773m8109n4466o0464o5871p0538p4058
50916A858527p5816p5544p3524p0240o6095o1441n6580n1622m6631m1915l7821
50905A201298l4300l1037k8029k5625k3818k2030j9821j7450j5453j3995j2880
50894I56860j1890j0807r391p673o105n106m600m213l663k748j222P96K507L061
50880H95806K615K283K942M386N837O981Q166R706J1327J2426J2766J2809J3301
50867A001351J4578J6272J7713J8632J9448K0857K3146K6019K9095L2401L6167
50856A255679M0347M4641M9119N4388O0908O8444P6545Q5225R4766J04942J15041
$$ plain form
50940 2365228 2373868 2382965 2393700 2405247 2415470 2422529 2425811 2425654 2422543 2416660 2407984 2396429 2381656
50927 2381656 2362868 2339033 2309432 2273806 2232033 2183924 2129458 2068994 2003123 1932585 1858527
50916 1858527 1782711 1707167 1633643 1563403 1497308 1435867 1379287 1327665 1281034 1239119 1201298
50905 1201298 1166998 1135961 1107932 1082307 1058489 1036459 1016638 999188 983735 969740 956860
50894 956860 944970 934163 924772 917099 910994 905888 901288 897075 893412 890664 889442 890238 892745 895806
50880 895806 898421 900704 903646 908032 913869 920850 929016 938722 950049 962475 975241 988050 1001351
50867 1001351 1015929 1032201 1049914 1068546 1087994 1108851 1131997 1158016 1187111 1219512 1255679
50856 1255679 1296026 1340667 1389786 1444174 1505082 1573526 1650071 1735296 1830062 1935004 2050045
50845B050045J24644J33911J42949J51380J58765J64992J69920J72912J73138
50836C442656J70060J63251J52000J35786J15358R2913P0773M9991L0501J2535
50826D435824k614j3509j9976k3091k3688k1429j5618o590M127J4751K3726K9339
50814D381252K9726K3825J2107l981k3055m4099o5986q7423j07518j26147j43435
50803C845266j58916j71326j79293j82163j80217j74282j65278j54071j41479
50794B338241j28248j15062j02513r0921q0121o9681n9395m9481m0373l2524k6370
50783A543552k1969j8618j5316j1946r457q500q444q292q092q576r697j0510j0584
50770A393551j0667j1648j3475j5420j6904j7767j8152j8462j9013j9649j9907
$$ plain form
50845 2050045 2174689 2308600 2451549 2602929 2761694 2926686 3096606 3269518 3442656
50836 3442656 3612716 3775967 3927967 4063753 4179111 4272024 4342797 4392788 4423289 4435824
50826 4435824 4433210 4419701 4399725 4376634 4352946 4331517 4315899 4309309 4313436 4328187 4351913 4381252
50814 4381252 4410978 4434803 4446910 4442929 4419874 4375775 4309789 4222366 4114848 3988701 3845266
50803 3845266 3686350 3515024 3335731 3153568 2973351 2799069 2633791 2479720 2338241
50794 2338241 2209993 2094931 1992418 1901497 1821376 1751695 1692300 1642819 1602446 1569922 1543552
50783 1543552 1521583 1502965 1487649 1475703 1466246 1457746 1449302 1441010 1432918 1424342 1414645 1404135 1393551
50770 1393551 1382884 1371236 1357761 1342341 1325437 1307670 1289518 1271056 1252043 1232394 1212487
50759A212487j9664j9169j8436j7113j5078j2663j0088p248m270j634N30K722
50747A090376N245P714R828J2101J5151J8785K2354K5774K9431L3338L7139M0979
50735A348215M5663N1680N8549O5303P1301P6364Q0426Q3404Q5391Q6749Q7835
50724B140880Q8686Q9021Q8593Q7348Q5112Q1337P5486O7500N7519M5316L0650
50713B937448J4255k108j6793k8944l7990m3177m4136m1396l5919k8449j9653
50702B653138j0410j447O923J4243J9527K1911K1234J7374R641k403j7775l4576
50690B697380n1502o7921q2640r3802j00354j02825j02230r8962r3246q6004p8367
50679A739527p0568o2023n2552m2988l4367k6866j9761j2357m722K469Q558J3263
$$ plain form
50759 1212487 1192823 1173654 1155218 1138105 1123027 1110364 1100276 1093028 1088758 1087124 1087654 1090376
50747 1090376 1095621 1103335 1113163 1125264 1140415 1159200 1181554 1207328 1236759 1270097 1307236 1348215
50735 1348215 1393878 1445558 1504107 1569410 1640711 1717075 1797501 1880905 1966296 2053045 2140880
50724 2140880 2229566 2318587 2407180 2494528 2579640 2660977 2736463 2803963 2861482 2906798 2937448
50713 2937448 2951703 2949595 2932802 2903858 2865868 2822691 2778555 2737159 2701240 2672791 2653138
50702 2653138 2642728 2641281 2648204 2662447 2681974 2703885 2725119 2742493 2752134 2749731 2731956 2697380
50690 2697380 2645878 2577957 2495317 2401515 2301161 2198336 2096106 1997144 1903898 1817894 1739527
50679 1739527 1668959 1606936 1554384 1511396 1477029 1450163 1430402 1418045 1413323 1415792 1424350 1437613
50667A437613J6617J8892K0542K1877K2584K1880J9487J6302J3712J2305J1551
50656A633362J0702R759R360R889J0943J1778J2201J2751J3953J5728J7818K0433
50644A788677K3834K7570L0910L4102L8239M3586M8983N3345N6932O0302O2928
50633B269408O3863O3204O1807N9901N7129N3793N0818M8581M6873M5901M5660
50622B866938M3799L5739J8547n562l0257m9333n9786o1927n8027n0924m2803
50611B606404l4562k6301j8278j1108n274r08J923L067K403k44n230j2816k2582
50598B476494l3432m4240n4388o3574p1357p7083q0286q0995p9646p6730p2674
50587A742089o7963o3181n8623n3965m8574m2356l6086l0799k6750k3251j9479
$$ plain form
50667 1437613 1454230 1473122 1493664 1515541 1538125 1560005 1579492 1595794 1609506 1621811 1633362
50656 1633362 1644064 1653823 1663183 1673072 1684015 1695793 1707994 1720745 1734698 1750426 1768244 1788677
50644 1788677 1812511 1840081 1870991 1905093 1943332 1986918 2035901 2089246 2146178 2206480 2269408
50633 2269408 2333271 2396475 2458282 2518183 2575312 2629105 2679923 2728504 2775377 2821278 2866938
50622 2866938 2910737 2946476 2965023 2959461 2929204 2879871 2820085 2758158 2700131 2649207 2606404
50611 2606404 2571842 2545541 2527263 2516155 2510881 2509973 2511896 2514963 2517366 2517122 2511892 2499076 2476494
50598 2476494 2443062 2398822 2344434 2280860 2209503 2132420 2052134 1971139 1891493 1814763 1742089
50587 1742089 1674126 1610945 1552322 1498357 1449783 1407427 1371341 1340542 1313792 1290541 1271062
50576A271062j5464j2071r955q720p334n341l270j746o15O90K243L658M856O281
50562A224274Q272J0650J3052J5333J7487J9480K1347K3262K5316K7409K9421
50551A435303L1295L2858L3759L3711L2612L0500K7591K4474K1974K0580K0231
50540A744888K0741K2237K4971K8847L3369L8048M2780M7887N3769O0444O7374
50529B185355P3973Q0352Q7339R5632J04999J14439J23046J30519J36867J41764
50519C274285J44441J44297J41409J36143J28302J17087J02116Q4138O4397M3576
50509D380191K1815n61k2892m4715o5700q4913j00746j12010j18728j21532j20578
50498C609631j15419j05770r2036p5219n6557l7233j8175K9J6906L1821M3884
$$ plain form
50576 1271062 1255598 1243527 1233572 1224852 1217518 1212177 1208907 1207161 1206546 1207236 1209479 1213137 1217993 1224274
50562 1224274 1232546 1243196 1256248 1271581 1289068 1308548 1329895 1353157 1378473 1405882 1435303
50551 1435303 1466598 1499456 1533215 1566926 1599538 1630038 1657629 1682103 1704077 1724657 1744888
50540 1744888 1765629 1787866 1812837 1841684 1875053 1913101 1955881 2003768 2057537 2117981 2185355
50529 2185355 2259328 2339680 2427019 2522651 2627650 2742089 2865135 2995654 3132521 3274285
50519 3274285 3418726 3563023 3704432 3840575 3968877 4085964 4188080 4272218 4336615 4380191
50509 4380191 4402006 4401445 4378553 4333838 4268138 4183225 4082479 3970469 3851741 3730209 3609631
50498 3609631 3494212 3388442 3296406 3221187 3164630 3127397 3109222 3109251 3126157 3157978 3201862
50487C201862N2057N5346N2889M4003K8365O581j9293m6172p1282r3038j10635
50476C100683j23348j30863j33976j34075j31871j27303j20695j13175j05545
50467A979832r7528q8686p9562p1222o3976n7224n0447m3781l7602l1994k6771
50456A331039k1731j6803j2144q069m727j922O47L046N224P281R353J1320J2982
50443A315496J4533J6595J9564K3017K5831K6949K6011K3364J9580J5087J0275
50432A536302N655J703j344l374m215l891k903j819o54R55K962M869O522Q363
50418A549131J0719J3442J6527K0468K5524L1168L6768M2388M8321N4218N9349
50407A908023O3511O6970O9679P1181P1247O9944O7212O2999N7791N2308M6540
$$ plain form
50487 3201862 3253919 3309265 3362154 3406157 3434522 3441103 3421810 3375638 3304356 3211318 3100683
50476 3100683 2977335 2846472 2712496 2578421 2446550 2319247 2198552 2085377 1979832
50467 1979832 1882304 1793618 1714056 1642834 1578858 1521634 1471187 1427406 1389804 1357810 1331039
50456 1331039 1309308 1292505 1280361 1272292 1267565 1265643 1266290 1269336 1274560 1281841 1291194 1302514 1315496
50443 1315496 1330029 1346624 1366188 1389205 1415036 1441985 1467996 1491360 1510940 1526027 1536302
50432 1536302 1541957 1543660 1542316 1538942 1534727 1530836 1527933 1526114 1525460 1526415 1529377 1534246 1540768 1549131
50418 1549131 1559850 1573292 1589819 1610287 1635811 1666979 1703747 1746135 1794456 1848674 1908023
50407 1908023 1971534 2038504 2108183 2179364 2250611 2320555 2387767 2450766 2508557 2560865 2607405
50396B607405L9673L1123K0971R368l721j7848l1875m4931n6977o7948p6914q2781
50384B325545q5395q5210q2225p6178o7610n7866m7801l7262k6065j4783m140
50373A741010N709J4665K1912K6349K7570K5822K1115J3189K428r742k1693l2418
50361A835916m1456m8526n3635n7057n8791n8368n5687n1821m8340m5981m4382
50350A271872m2996m1582l9830l7305l4018l0559k7302k3978k0370j6881j3922
50339I43129j1187q209n307l187j725OK277M157M873N104O139Q145J0001J0874
50325I65090J1214J1965J3456J5529J8173K1317K4240K6074K6922K7579K7742
50314A189301K5414J9014R671M46o564j1441j4788j6246j5359j2891j0242p925
$$ plain form
50396 2607405 2647078 2678201 2699172 2708540 2704819 2686971 2655096 2610165 2553188 2485240 2408326 2325545
50384 2325545 2240150 2154940 2072715 1996537 1928927 1871061 1823260 1785998 1759933 1745150 1741010
50373 1741010 1746719 1761384 1783296 1809645 1837215 1863037 1884152 1897341 1899769 1890027 1868334 1835916
50361 1835916 1794460 1745934 1692299 1635242 1576451 1518083 1462396 1410575 1362235 1316254 1271872
50350 1271872 1228876 1187294 1147464 1110159 1076141 1045582 1018280 994302 973932 957051 943129
50339 943129 931942 923733 918426 915239 913514 913520 915797 919954 924827 929931 936070 944215 954216 965090
50325 965090 976304 988269 1001725 1017254 1035427 1056744 1080984 1107058 1133980 1161559 1189301
50314 1189301 1214715 1233729 1243400 1243846 1237282 1225841 1211053 1194807 1179448 1166557 1156315 1148390
50302A148390n586l313j895j621j723j321k82J155K901M756O147O787P229Q285
50288A169909J0056J2080J4214J6939K0928K6732L4279M1632M4372L7822K1219
50277A450182n59k0118l2519l7275l6559l2706k7317k1493j6008j1415q151o366
50265A199696n582n025m419m106m249m457m369m134l966l687l156k778l009l658
50251A143101m211m647n343o192o449n569l771j725K4J280K187L139M471O179
50237A122474Q082J0077J2027J3586J4559J5341J6574J8393K0417K2282K3787
50226A297599K4537K4141K2741K0872J8743J6235J3592J1490J0168R179Q281P826
50214A485404P863P450N487J793l174r217j6345k4004l1041l6422l9563m0112
$$ plain form
50302 1148390 1142804 1139491 1137596 1135975 1134252 1132931 1132649 1133804 1136705 1141461 1147608 1154395 1161624 1169909
50288 1169909 1179965 1192045 1206259 1223198 1244126 1270858 1305137 1346769 1391141 1428963 1450182
50277 1450182 1449623 1429505 1396986 1359711 1323152 1290446 1263129 1241636 1225628 1214213 1206062 1199696
50265 1199696 1194114 1189089 1184670 1180564 1176315 1171858 1167489 1163355 1159389 1155702 1152546 1149768 1146759 1143101
50251 1143101 1138890 1134243 1128900 1122708 1116259 1110690 1106919 1105194 1105218 1106498 1108685 1111824 1116295 1122474
50237 1122474 1130556 1140633 1152660 1166246 1180805 1196146 1212720 1231113 1251530 1273812 1297599
50226 1297599 1322136 1346277 1369018 1389890 1408633 1424868 1438460 1449950 1460118 1469297 1477578 1485404
50214 1485404 1493267 1500717 1506204 1507997 1504823 1495606 1479261 1455257 1424216 1387794 1348231 1308119
50202A308119l8071l4156k9550k5006k0462j5627j0785o967n424o881j0967j6337
50190A087886k1470k5427k7864k8598k7583k5286k2670k0501j8751j6944j4973
50179H37819j3348j2466j1936j0984r513q222p562p068o119m932m135l755l353
50166G34426k991l150l632l510k484j395r95r82q18o53o87k89J258L481N162N945
50150G28686O608P738Q936R439Q864P181M617J863j04q63r68j262j958k567k558
50135G73652j876q42L17J709L497N501P257Q476R220R594R691R903J0755J2152
50121H59006J3333J3978J4922J7073K0084K2840K5092K7801L1755L6573M1299
50110A123756M5443M9040N2034N3978N4370N3225N1319M9672M8605M7645M6610
$$ plain form
50202 1308119 1270048 1235892 1206342 1181336 1160874 1145247 1134462 1127495 1122071 1115190 1104223 1087886
50190 1087886 1066416 1040989 1013125 984527 956944 931658 908988 888487 869736 852792 837819
50179 837819 824471 812005 800069 789085 779572 771350 763788 756720 750601 745669 741534 737779 734426
50166 734426 731435 728285 724653 721143 718659 717264 716269 715287 714469 713816 713129 712840 714098 717579 722741 728686
50150 728686 735294 743032 751968 761407 770271 777452 782069 783932 783828 782965 781997 780735 778777 776210 773652
50135 773652 771776 770934 771251 772960 776457 781958 789215 797691 806911 816505 826196 836099 846854 859006
50121 859006 872339 886317 901239 918312 938396 961236 986328 1014129 1045884 1082457 1123756
50110 1123756 1169199 1218239 1270273 1324251 1378621 1431846 1483165 1532837 1581442 1629087 1675697
50099A675697M6290M7302M8461M7165M1612L2087K0005O521p507k0937l2504m1539
50087A862653m8058n2321n4605n5233n4494n2504m9375m5377m0746l5379k9124
50076A345437k2406j6388j2206j0150r600r725j0024j0226j0116r693r309r238
50064A206356r244q989q756r155j0112j0789j0736j0447j0461j0613j0620j0762
50052A085672j1283j1633j1113r880q575p305n788m207k988j848k7K521M974O791
50038A025311Q234R642J0930J1913J2511J2551J2081J1794J2305J3004J2660J1252
50026A164188J0032R486Q477O110L150P25j345l786o196p502p661p693q124q694
50012A151167r541j1478j4551j7300j8035j6506j3913j1642j0266r444q378o452
$$ plain form
50099 1675697 1721987 1769289 1817750 1864915 1906527 1938614 1958619 1965140 1957633 1936696 1904192 1862653
50087 1862653 1814595 1762274 1707669 1652436 1597942 1545438 1496063 1450686 1409940 1374561 1345437
50076 1345437 1323031 1306643 1294437 1284287 1274687 1264962 1254938 1244712 1234596 1224903 1215594 1206356
50064 1206356 1197112 1188123 1179367 1170212 1160100 1149311 1138575 1128128 1117667 1107054 1096434 1085672
50052 1085672 1074389 1062756 1051643 1041763 1033188 1025883 1020095 1015888 1012900 1011052 1011025 1013546 1018520 1025311
50038 1025311 1033545 1043187 1054117 1066030 1078541 1091092 1103173 1114967 1127272 1140276 1152936 1164188
50026 1164188 1174220 1183706 1192183 1198293 1201443 1202168 1200823 1197037 1190841 1183339 1175678 1167985 1159861 1151167
50012 1151167 1141626 1130148 1115597 1098297 1080262 1063756 1049843 1038201 1027935 1018491 1010113 1003661
50000A003661l655l60L263P466J2493J8069K3403K7608L0174L1193L1209L0839
49988A215363L0501L0363L0231K9416K6992K2629J7188J2289R181Q101Q498R527
49976A450279J0189R253N580j106r789j8825k7200l4878m1792m6981m9310m8851
49964A196569m6858m4361m1413l7816l3875k9989k6019k1665j7167j3160r919
49953H74327p116m189q45K686N661P356P714P272O356M783K537K99j144j732k012
49938I01953k441l111l978n039o434q531j1559j4974j7639j8945j9336j9329j8654
49925G51983j6937j4689j2744j1048q927o480m687m017l737k914j471R2J389K265
49911F68078K651K721K831L104L336L530M156N594P656R860J1890J3536J4501
$$ plain form
50000 1003661 1000006 999646 1002909 1010375 1022868 1040937 1064340 1091948 1122122 1153315 1184524 1215363
49988 1215363 1245864 1276227 1306458 1335874 1362866 1385495 1402683 1414972 1424153 1432254 1440752 1450279
49976 1450279 1460468 1469721 1475301 1474195 1464406 1445581 1418381 1383503 1341711 1294730 1245420 1196569
49964 1196569 1149711 1105350 1063937 1026121 992246 962257 936238 914573 897406 884246 874327
49953 874327 867211 863022 862177 864863 870524 877880 885594 892866 899222 904005 906542 906841 905697 903965 901953
49938 901953 899512 896401 892423 887384 880950 872419 860860 845886 828247 809302 789966 770637 751983
49925 751983 735046 720357 707613 696565 687638 681158 676471 672454 668717 665803 664332 664424 665813 668078
49911 668078 670729 673450 676281 679385 682721 686251 690407 696001 703657 713517 725407 738943 753444
49898G53444J4729J4643J4663J4584J3767J1905R340O611L983J414j251m136p212
$$ plain form
49898 753444 768173 782816 797479 812063 825830 837735 847075 853686 857669 859083 857832 853696 846484
$$ [...]
##END NTUPLES=NMR SPECTRUM
##END=
