
##TITLE=AC1384_HONAH12196_7519100_lsiuzFzhO4
##JCAMPDX= 6.0         $$ Bruker NMR JCAMP-DX V2.0
##DATA TYPE= NMR SPECTRUM
##DATA CLASS= NTUPLES
##ORIGIN= BRUKER
##OWNER= Administrator
$$ 1.72 TOPSPIN		Version 2.1
$$ 2013-02-20 20:58:00.850 -0500  Administrator@X
$$ Compression mode = diff/dup
##.OBSERVE FREQUENCY= 400.02188249412
##.OBSERVE NUCLEUS= ^1H
##.ACQUISITION MODE= SIMULTANEOUS (DQD)
##.ACQUISITION SCHEME= undefined
##.AVERAGES= 8
##.DIGITISER RES= 22
##SPECTROMETER/DATA SYSTEM= spect
##.PULSE SEQUENCE= zg30
##.SOLVENT NAME= COFFEE_meoh
##.SHIFT REFERENCE= INTERNAL, COFFEE_meoh, 1, 14.98509
##AUDIT TRAIL= $$ (NUMBER, WHEN, WHO, WHERE, PROCESS, VERSION, WHAT)
$$ ##TITLE= Audit trail, TOPSPIN		Version 2.1
$$ ##JCAMPDX= 5.01
$$ ##ORIGIN= Bruker BioSpin GmbH
$$ ##OWNER= Administrator
$$ $$ E:\/data/COFFEE/nmr/AC1384_HONAH12196_7519100_lsiuzFzhO4/10/pdata/1/auditp.txt
$$ ##AUDIT TRAIL=  $$ (NUMBER, WHEN, WHO, WHERE, PROCESS, VERSION, WHAT)
(   1,<2013-02-20 20:57:52.460 -0500>,<Administrator>,<X>,<go>,<TOPSPIN 2.1>,
      <created by zg
	started at 2013-02-20 20:56:45.866 -0500,
	POWCHK enabled, PULCHK disabled,
       configuration hash MD5:
       86 BA 57 50 F2 9D 5C 9B 26 00 A9 28 5F 66 2E 89
       data hash MD5: 64K
       10 FA BF D6 0E F8 A1 30 9A B1 E6 4D C7 6D 7C 6A>)
(   2,<2013-02-20 20:57:55.522 -0500>,<Administrator>,<X>,<proc1d>,<TOPSPIN 2.1>,
      <Start of raw data processing
       efp LB = 0 FT_mod = 6 PKNL = 1 PHC0 = 0 PHC1 = 0 SI = 32K 
       data hash MD5: 32K
       94 B9 EF 7E DB 66 C3 B6 7A 3C 9F 6D 05 4A FD D4>)
(   3,<2013-02-20 20:57:55.991 -0500>,<Administrator>,<X>,<proc1d>,<TOPSPIN 2.1>,
      <pk PHC0 = 70.07629 PHC1 = 0 
       data hash MD5: 32K
       97 90 F7 DA 9C 6B 38 CB B4 88 92 EC E9 5A 8D 2D>)
(   4,<2013-02-20 20:57:56.272 -0500>,<Administrator>,<X>,<proc1d>,<TOPSPIN 2.1>,
      <abs ABSG = 1 
       data hash MD5: 32K
       12 5D 2C 7A 60 3C 6E FB 10 32 7D 3B 21 B3 1B BD>)
(   5,<2013-02-20 20:57:56.428 -0500>,<Administrator>,<X>,<proc1d>,<TOPSPIN 2.1>,
      <abs ABSG = 2 
       data hash MD5: 32K
       C6 E7 15 74 9B 75 3A 08 8D 4C 8B 4E 20 09 11 AD>)
(   6,<2013-02-20 20:57:56.569 -0500>,<Administrator>,<X>,<proc1d>,<TOPSPIN 2.1>,
      <abs ABSG = 3 
       data hash MD5: 32K
       F9 DA 14 2D BC 28 FE 5E 01 51 0B 44 68 5E BC 01>)
(   7,<2013-02-20 20:57:56.725 -0500>,<Administrator>,<X>,<proc1d>,<TOPSPIN 2.1>,
      <abs ABSG = 4 
       data hash MD5: 32K
       7A D7 83 15 9A 82 F6 93 C7 30 1C CC 2E EC 1B 1E>)
(   8,<2013-02-20 20:57:56.835 -0500>,<Administrator>,<X>,<proc1d>,<TOPSPIN 2.1>,
      <abs ABSG = 5 
       data hash MD5: 32K
       8E BA 80 74 F0 49 A2 AF 71 0A 98 41 70 D5 96 A0>)
$$ ##END=
$$ 
$$ $$ hash MD5
$$ $$ EC 3B AD 94 BE 17 F9 93 0E 5C 4A DD 70 DE 36 39
##$RELAX= 
##$RELAX= 
##$RELAX= 
##$RELAX= 
##$RELAX= 
##$RELAX= 
##$RELAX= 
$$ Bruker specific parameters
$$ --------------------------
##$DU= <E:\>
##$EXPNO= 10
##$NAME= <AC1384_HONAH12196_7519100_lsiuzFzhO4>
$$ [...]
150 150 150 150 150 150 150 150
##$TP07= 0
##$TPNAME0= <>
##$TPNAME1= <>
##$TPNAME2= <>
##$TPNAME3= <>
##$TPNAME4= <>
##$TPNAME5= <>
##$TPNAME6= <>
##$TPNAME7= <>
##$TPOAL= (0..7)
0.5 0.5 0.5 0.5 0.5 0.5 0.5 0.5
##$TPOFFS= (0..7)
0 0 0 0 0 0 0 0
##$TUNHIN= 0
##$TUNHOUT= 0
##$TUNXOUT= 0
##$USERA1= <user>
##$USERA2= <user>
##$USERA3= <user>
##$USERA4= <user>
##$USERA5= <user>
##$V9= 5
##$VALIST= <valist>
##$VCLIST= <CCCCCCCCCCCCCCC>
##$VD= 0
##$VDLIST= <DDDDDDDDDDDDDDD>
##$VPLIST= <PPPPPPPPPPPPPPP>
##$VTLIST= <TTTTTTTTTTTTTTT>
##$WBST= 1024
##$WBSW= 4
##$XGAIN= (0..3)
0 0 0 0
##$XL= 0
##$YL= 0
##$YMAX_a= 552714
##$YMIN_a= -551404
##$ZGOPTNS= <>
##$ZL1= 120
##$ZL2= 120
##$ZL3= 120
##$ZL4= 120
##$ABSF1= 14.98509
##$ABSF2= -5.573092
##$ABSG= 5
##$ABSL= 3
##$ALPHA= 0
##$AQORDER= 0
##$ASSFAC= 0
##$ASSFACI= 0
##$ASSFACX= 0
##$ASSWID= 0
##$AUNMP= <proc_prof1d_extract_pilot.lims>
##$AXLEFT= 0
##$AXNAME= <>
##$AXNUC= <1H>
##$AXRIGHT= 0
##$AXTYPE= 0
##$AXUNIT= <>
##$AZFE= 0.1
##$AZFW= 0.1
##$BCFW= 0
##$BC_mod= 0
##$BYTORDP= 0
##$COROFFS= 0
##$CY= 15
##$DATMOD= 1
##$DC= 0
##$DFILT= <>
##$DTYPP= 0
##$F1P= 0
##$F2P= 0
##$FCOR= 0.5
##$FTSIZE= 32768
##$FT_mod= 6
##$GAMMA= 0
##$GB= 0
##$INTBC= 1
##$INTSCL= 1
##$ISEN= 128
##$LB= 0
##$LEV0= 0
##$LPBIN= 0
##$MAXI= 10000
##$MC2= 0
##$MEAN= 0
##$ME_mod= 0
##$MI= 0
##$NCOEF= 0
##$NC_proc= -8
##$NLEV= 6
##$NOISF1= 0
##$NOISF2= 0
##$NSP= 0
##$NTH_PI= 0
##$NZP= 0
##$OFFSET= 14.98509
##$PC= 1
##$PHC0= 70.07629
##$PHC1= 0
##$PH_mod= 1
##$PKNL= yes
##$PPARMOD= 0
##$PPDIAG= 0
##$PPIPTYP= 0
##$PPMPNUM= 2147483647
##$PPRESOL= 1
##$PSCAL= 4
##$PSIGN= 0
##$PYNMP= <proc.py>
##$REVERSE= no
##$SF= 400.02
##$SI= 32768
##$SIGF1= 0
##$SIGF2= 0
##$SINO= 400
##$SIOLD= 32768
##$SPECTYP= <>
##$SREGLST= <1H.CDCl3>
##$SSB= 0
##$STSI= 32768
##$STSR= 0
##$SW_p= 8223.68421052631
##$SYMM= 0
##$S_DEV= 0
##$TDeff= 65536
##$TDoff= 0
##$TI= <>
##$TILT= no
##$TM1= 0
##$TM2= 0
##$TOPLEV= 0
##$USERP1= <user>
##$USERP2= <user>
##$USERP3= <user>
##$USERP4= <user>
##$USERP5= <user>
##$WDW= 1
##$XDIM= 32768
##$YMAX_p= 456741753
##$YMIN_p= -798661
##$CURPLOT= <Network HP LaserJet P1505>
##$CURPRIN= <$Network HP LaserJet P1505>
##$DFORMAT= <normdp>
##$LAYOUT= <+/1D_H.xwp>
##$LFORMAT= <normlp>
##$PFORMAT= <normpl>
##$SURQMSG= 1
$$ End of Bruker specific parameters
$$ ---------------------------------
##NTUPLES= NMR SPECTRUM
##VAR_NAME=  FREQUENCY,     SPECTRUM/REAL,   SPECTRUM/IMAG
##SYMBOL=    X,             R,               I
##VAR_TYPE=  INDEPENDENT,   DEPENDENT,       DEPENDENT
##VAR_FORM=  AFFN,          ASDF,            ASDF
##VAR_DIM=   32768,         32768,           32768
##UNITS=     HZ,            ARBITRARY UNITS, ARBITRARY UNITS
##FACTOR=    0.250966925370066, 1,           1
##FIRST=     8223.43324360094, -349977,      -150146
##LAST=      0,             20290,           -131451
##MIN=       0,             -798661,         0
##MAX=       8223.43324360094, 456741753,    0
$$ Real data points
##PAGE= N=1
##DATA TABLE= (X++(R..R)), XYDATA
$$ [...]
19578a28750o6488a5581a324j80003k3583l1728r5179E3371c09891a20877B96672
19566g2175k61134e248A02352b33939P1609l6621e5593A385a43009f7180I1183
19554A00069K3698g513k83809J41029A54804a16104B49095g5893K6741m6415k5894
19543a21461k84616a89073c229l33184A36514J99100h8119b1210l3698j296j06679
19532a62883G5581C2177Q0973O0634J57796b75709J22796j13005B01574b24056
19521A00882a32394I2130c71315a30612e6443l10054B3724d30846K07549k4421
19511b47718c7758m3848H5580k6474B7033J09768b64890b5225j05342M8567n2885
19500a34885I2827N5941a01393d7687j36744B68997g9149j40547L2108B32919
$$ y = [-128750, -195238, -15581, -1324, -181327, -204910, -236638, -331817, 53371, -309891, -120877, 296672, -72175, -333309, -5248, 102352, -233939, -162330, -198951, -55593, 1385, -143009, -67180, 91183, 100069, 123767, -7513, -291322, -150293, 154804, -116104, 249095, -75893, -49152, -95567, -121461, -406077, -189073, -3229, -336413, 136514, 335614, -88119, -21210, -54908, -56204, -162883, 75581, 32177, 113150, 173784, 331580, -275709, -152913, -265918, 201574, -224056, 100882, -132394, 92130, -371315, -130612, -56443, -366497, 23724, -430846, -223297, -247718, -37758, -81606, 85580, 59106, 27033, 136801, -264890, -25225, -130567, -82000, -134885, 92827, 148768, -101393, -47687, -184431, 268997, -79149, -219696, -187588, 232919]
19489b06418k3705R8258d0588j16751J0223C7942a23172B2188c41400a30557o168
19478a36725N0826n7002O3127j95200Q1167i185q6889o0261B9110J0016K18861
19467B57987b13735A19292b42457f8928d862j4721D3999a37943b6906k8685G8627
19455a48847a1395C16964b10922J4050g7551k16372B44261j8488b8913j94076
19445b22989b5850k65833O0275D3093B387b06390A78908e559G7162i2335G0972
19433a87865d999j06649d7839A16015e1670m1097j45804N3612H1420a63210p4337
19422b37547G3316i6821j19235F4405b1461k37034A30498j3908e7060A92543e0321
19410I8499b59613A12863a9961n0641d172l4300j05756A83347a68278L1563n4024
$$ y = [-206418, -230123, -131865, -40588, -157339, -147116, 37942, -123172, 22188, -341400, -130557, -136725, -85899, -142901, -79774, -274974, -193807, -9185, -96074, -156335, 29110, 39126, 257987, -213735, 119292, -242457, -68928, -4862, -19583, 43999, -137943, -26906, -55591, 78627, -148847, -11395, 316964, -210922, -196872, -77551, -293923, 244261, 225773, -28913, -222989, -25850, -291683, -231408, 43093, 2387, -206390, 178908, -5559, 77162, -92335, 70972, -187865, -4999, -111648, -47839, 116015, -51670, -92767, -238571, -184959, 81420, -163210, -237547, 73316, -96821, -216056, 64405, -21461, -258495, 130498, 116590, -57060, 192543, -50321, 98499, -259613, 112863, -19961, -70602, -4172, -38472, -144228, 183347, -168278, -136715, -190739]
19399a90739J9349p7108J8761E1957L7709a17847O275q6926c3205k0609j9285
19388g3099C7757b88733H7057a64773d5947A59003g0035B10098h1674c2680A22885
19376a31394E5708a76815A14235J36512b73592B61805i0845A79071d04170B2045
19365d522j29878j33701b4628j64801d6825D4000h2275A31305b43278a04714B67640
19353a25512m596O0823r0251j21221r8177J54130A52652a56416o9334e1908A2213
19341a63264r485A8549a27224m15278b69564A6226d82531A60292E1593K6937h9424
19329g650k00005h1510l227k73787O9490A31386d3057k38102B63202o9624i5484
19317A57303a46776E483L16055i738k60910M6093I6720b08434e3978o193D10513
$$ y = [-190739, -171390, -248498, -229737, 51957, 89666, -117847, -111572, -198498, -33205, -53814, -73099, 37757, -288733, 87057, -164773, -45947, 159003, -70035, 210098, -81674, -32680, 122885, -131394, 55708, -176815, 114235, 250747, -273592, 261805, -90845, 179071, -404170, 22045, -4522, -134400, -268101, -24628, -189429, -46825, 44000, -82275, 131305, -243278, -104714, 267640, -125512, -130108, -69285, -159536, -280757, -378934, -224804, 152652, -156416, -225750, -51908, 12213, -163264, -172749, 18549, -127224, -542502, -269564, 16226, -482531, 160292, 51593, 78530, -89424, -7650, -207655, -81510, -84737, -358524, -289034, 131386, -43057, -281159, 263202, 193578, -95484, 157303, -146776, 5483, 321538, -9738, -270648, -224555, 96720, -208434, -53978, -60171, 410513]
19305a19018j19045j26968a4367k85434C8774h2214C1856P9254b15152b7472j84742
19294b12214B15123b19316M7700k4422j20473F75500I8243D8806K1934Q9123G4421
19282e2152l2903l8735E0319a41466B9432a49118n724n9350b3467k619B7008b57208
19269d6189C72096F4101b85324D20870A04436c3393l15712a21921j52418k0353
19259b94692A72395a68380P6530j7890a4889B1244b91550A91224b02142b6701
19248A03105B0933O2776P627m4964a61733b7001H6288J9789k1153C750K00277
19237B04027d3722G2444J57817g4128A49843L983C8755e0819p4854C6638b93247
19225d7239k94641a29512J7038k4529k81447b3709j2767I6535d9781m1796j5889
$$ y = [-119018, -238063, -365031, -14367, -299801, 38774, -82214, 31856, 111110, -215152, -27472, -212214, 215123, -219316, -171616, -196038, -316511, 675500, 98243, 48806, 70740, 159863, 74421, -52152, -85055, -123790, 50319, -141466, 29432, -149118, -154842, -214192, -23467, -26086, 27008, -257208, -46189, 372096, 64101, -285324, 420870, 104436, -33393, -349105, -121921, -274339, -294692, 172395, -168380, -91850, -109740, -14889, 21244, -291550, 191224, -202142, -26701, 103105, 20933, 83709, 91336, 46372, -161733, -27001, 86288, 106077, 84924, 3750, 204027, -43722, 72444, 230261, -74128, 149843, 153826, 38755, -50819, -125673, 36638, -293247, -47239, -341880, -129512, -112474, -137003, -418450, -23709, -36476, 96535, -49781, -91577, -107466]
19214a07466j1532j836j2185r4754J7553A10053g4950I5362J13275r7360d76216
19202H2064d55225a19441j09253K9935M1249L9345B4269b96877f298B6261b68466
19190B51294b28277A70825a32689a8803p3811O604o8020G5206a93071p4051A59355
19178D9266k2397e2161o5416j04062P2802B40398b52713D3297N1775a5258r1159
19167a06417B2456i9784F6847g4952n9215d0894C443J6238b51367A59766i5293
19155A01433J12961D5386b65395Q2509o013R2240M4723B11611a23187K4379D4108
19143D5037a83841A66036J90097c43242R7403G1854c51646M0746J55212r8318
19133b54006C3131c36058A64420a04726j15197Q0806k1163j13719H7266c6954
$$ y = [-107466, -118998, -120834, -133019, -227773, -210220, 110053, -74950, 95362, 208637, 111277, -476216, 82064, -455225, -119441, -228694, -198759, -157510, -118165, 24269, -296877, -6298, 26261, -268466, 251294, -228277, 170825, -132689, -18803, -92614, -86010, -154030, 75206, -193071, -267122, 159355, 49266, 26869, -52161, -117577, -221639, -148837, 240398, -252713, 43297, 95072, -15258, -106417, 22456, -99784, 66847, -74952, -134167, -40894, 3443, 19681, -251367, 159766, -95293, 101433, 214394, 45386, -265395, -182886, -188899, -96659, -51936, 211611, -123187, -98808, 44108, 45037, -183841, 166036, 356133, -343242, -245839, 71854, -351646, -310900, -155688, -254006, 33131, -336058, 164420, -104726, -219923, -139117, -160280, -273999, 87266, -36954]
19122b30129B65143i7562b1278l43460Q6015M4283R7163B15537b95738A43540
19111a01036k1062k63092A6928i2553j8402j16739m5292O2285A59124F2653c58604
19099F8653e6935J8013j63A1726J16088a82598I5104R0606p4048e406j90486j63495
19087c59387A38680A9445e5585j63301g7856a5193A86504a18686M8919j9687D323
19075a30217e12A19323I941N2518a14890j74667a9144k26282D8911h5524J739
19064h3785C7059N0894g7269D4480N00350a30451N943j86659A46402Q5691a27357
19052g4453A33108A3346b74266H1602A1074a03058p3942j30089A68804b19424
19041A55495a8335B52450c78453f4698a5562j32975a7113j9957j84299A58896
$$ y = [-230129, 265143, -97562, -21278, -364738, -278723, -234440, -137277, 215537, -295738, 143540, -101036, -122098, -385190, 16928, -92553, -110955, -227694, -272986, -210701, 159124, 62653, -358604, 68653, -56935, -38922, -39085, 11726, 127814, -182598, 95104, 185710, 111662, -5406, -195892, -359387, 138680, 19445, -55585, -218886, -77856, -15193, 186504, -118686, -69767, -89454, 4323, -130217, -512, 119323, 9941, 62459, -114890, -289557, -19144, -245426, 48911, -85524, -83785, 37059, 87953, -77269, 44480, 544830, -130451, -124508, -311167, 146402, 232093, -127357, -74453, 133108, 13346, -274266, 81602, 11074, -103058, -177000, -307089, 168804, -219424, 155495, -18335, 252450, -378453, -64698, -15562, -148537, -17113, -37070, -221369, 158896]
19030C7961J85201P1970B4329L48819A67386e2394C71735C4040K22258C4343J84856
19019B19199G1354J9813i1864q0200k35367C5293e736j12317r2220N2268D7764
19007B0737e6655a328G3971a29205a7011E6454a11172E9276b4449k48594r5457
18996c68500J35933B05370D7521a34045A63905a46046K6617A35178o3685d524
18985A5128K5536c64409J28728J7667B0534J1168f919k44197h7057a0780k83360
18974b94140J40561k5500o8197A8860a25805k1127e4877j39240h9910G273f0424
18962d5292j80102A76209b18392j44499E8535m527b48956B7933R3837e04699h4596
18950I0769G253M9578f9860B74381j24605a09955G2077F118J23722d2665A87210
$$ y = [37961, 223162, 295132, 24329, 373148, 167386, -52394, 371735, 34040, 256298, 34343, 219199, 71354, 91167, -91864, -172064, -407431, 35293, -5736, -118053, -210273, -158005, 47764, 20737, -56655, -1328, 73971, -129205, -17011, 56454, -111172, 59276, -24449, -273043, -368500, -232567, 205370, 47521, -134045, 163905, -146046, -119429, 135178, 71493, -4524, 15128, 40664, -364409, -235681, -218014, 20534, 31702, -6919, -251116, -87057, -10780, -294140, -153579, -179079, -247276, 18860, -125805, -146932, -54877, -194117, -89910, 7273, -60424, -45292, -225394, 176209, -218392, -362891, 58535, 54008, -248956, 27933, 121770, -504699, -84596, 90769, 7253, 56831, -69860, 274381, 149776, -109955, 72077, 6118, 129840, -42665, 187210]
18938b17983C4555H805K50418P6015f9118n4953l8831P3272M3017k32716j24500
18927d03829A07389a25110j68239a06196A8746b4002F0677b72153B37196b46670
18916a15060j8077a6499k53977C4268J78023a91975l4420G1794a1487j31885k4261
18905a67633C24798e3164k21221r156C22892b05412A28036a44071N928G6654e00622
18893A35346a71190A31913K64871G707e7223F0461b95286A26957a70660P9855
18883i0805j46509D4570a1444p9109L1597J6070k52578P2078D0288a84898A01083
18871B5496a01041A46622b39864B43102b71130A1359i7514F5455f713B09027a38513
18859A54428c8738j12676G1249c26483B9778f1262j15500A53385k9762D6411b24127
$$ y = [-217983, 34555, 8805, 259223, 335238, -69118, -124071, -162902, -89630, -46613, -279329, -403829, 107389, -125110, -293349, -106196, 18746, -24002, 60677, -272153, 237196, -246670, -115060, -133137, -16499, -270476, 34268, 212291, -191975, -226395, 71794, -11487, -143372, -167633, 324798, -53164, -274385, -283541, 322892, -205412, 128036, -144071, -138143, 76654, -500622, 135346, -171190, 131913, 396784, 7707, -57223, 60461, -295286, 126957, -170660, -90805, -237314, 44570, -11444, -90553, -58956, -42886, -295464, -223386, 40288, -184898, 101083, 25496, -101041, 146622, -239864, 243102, -271130, 11359, -97514, 65455, -6713, 209027, -138513, 154428, -38738, -151414, 71249, -326483, 29778, -61262, -176762, 153385, 123623, 46411, -224127]
18847C32533H5119B0637J58084k9067n6961g3769o6866B9792b6618j874l79849
18836d08341A08644J17818b63707g6217C81684b76841j0481G5443J4279e10569
18825d9190O829p8872G3840L28493G630b0635l15961i9809b092C23299E1314B2249
18812D69003a72752O24D941a43453I7513f5812j71858c1686k12676J07888G938
18800a35888A64571b8876o6818N962A85233b93472C7797o716a53690M4517j21450
18789b30623f1336o0271j54045B6212b10723r265j2588i6580K0402C15968c66814
18777F1237d3617p7709n924k91140a45427a3236k90034K4649J11132j89488B9371
18765a08095E2441e6680K5918H3385i4860A64867a02513J0765B24508D9348b71629
$$ y = [332533, 85119, 20637, 178721, 149654, 92693, -73769, -140635, 29792, -26618, -28492, -408341, 108644, 226462, -263707, -76217, 381684, -276841, -287322, 75443, 89722, -510569, -49190, -42361, -121233, 73840, 402333, 7630, -20635, -336596, -99809, -2092, 323299, 51314, 22249, 469003, -172752, -172128, 4941, -143453, 97513, -65812, -237670, -31686, -244362, -136474, 7938, -135888, 164571, -28876, -95694, -89732, 185233, -293472, 37797, 31081, -153690, -109173, -230623, -61336, -121607, -275652, 26212, -210723, -219988, -232576, -96580, -76178, 315968, -366814, 61237, -43617, -121326, -127250, -418390, -145427, -13236, -303270, -278621, -167489, -356977, 29371, -108095, 52441, -56680, -30762, 83385, -94860, 164867, -102513, -91748, 224508, 49348, -271629]
18753a93676A591c33555E5856K19027A8148J19670a80444o6882A22795d23972
18742A39806a70984F4089a03453D3947b99387A70198C1976b02969h2037o831B25446
18730i4461j96078H3912A2390K4669b20545c4573A09357A4637O0175e3958n5069
18719a09027R88A3985J05676b43093i4793d4145p833l42209B01730i3180k7657
18708a20837k39655M9870a07864j74425G0921A1834c26771D5267Q610i4123j2411
18697a06534B24310b59058H8978L8856i0624A8347i3886A75909g7970k46197g9517
18685a26690e8199p3021d9308o422o3440m8175C44871a24433J893A58256b5605
18673c8798l16875a24831o0002B71747C1507b50043C1169O4216a12206j65990
$$ y = [-193676, 1591, -333555, 55856, 274883, 18148, 137818, -180444, -247326, 122795, -423972, 139806, -170984, 64089, -103453, 43947, -299387, 170198, 31976, -202969, -82037, -88868, 225446, -94461, -290539, 83912, 12390, 37059, -220545, -34573, 109357, 14637, 74812, -53958, -109027, -108039, 13985, 119661, -243093, -94793, -44145, -51978, -394187, 201730, -93180, -120837, -360492, -310622, -107864, -282289, 70921, 11834, -326771, 45267, 53877, -94123, -106534, 224310, -259058, 88978, 127834, -90624, 18347, -93886, 175909, -77970, -324167, -79517, -126690, -58199, -131220, -49308, -55730, -119170, -167345, 344871, -124433, -122540, 158256, -25605, -38798, -355673, -124831, -184833, 271747, 31507, -250043, 31169, 95385, -112206, -278196]
18663b78196l2226L2759d2657o9105p3163p0348c8874C37548b40423B51764c24217
18651F0111b5090r0384D658K61123a93552j8499C03903b71435j14349a49584j01247
18640b50831J0026L0285a157r4162E1081J7920C094O4777G068J93678N843A0607
18627a79062B16914a42096F6407J03613o4232B5779e323q4548a0467G4506a19275
18615A89320a97507A57497a50991I295b05412B58825I6802Q8469B6210p06c6129
18603b36767e5101j87558h8162n4854D0454a49361A98197d5893F1890a75047E1023
18591C15042b24278A57845a33126o0047A32864b75799E3245a05412j94629a3097
18580I3942g2670B6047g7486A57945O6301l277p8136J04448a52646M6607A69425
$$ y = [-278196, -310422, -277663, -42657, -111762, -184925, -255273, -38874, 337548, -240423, 251764, -324217, 60111, -25090, -115474, 4658, 265781, -193552, -212051, 303903, -271435, -385784, -149584, -250831, -240805, -210520, -1157, -95319, 51081, 69001, 3094, 67871, 7068, 200746, 206589, 10607, -179062, 216914, -142096, 66407, 170020, 105788, 25779, -5323, -89871, -10467, 74506, -119275, 189320, -197507, 157497, -150991, 9295, -205412, 258825, 96802, 185271, 26210, 25504, -36129, -236767, -55101, -242659, -88162, -143016, 40454, -149361, 198197, -45893, 61890, -175047, 51023, 315042, -224278, 157845, -133126, -193173, 132864, -275799, 53245, -105412, -300041, -13097, 93942, -72670, 26047, -77486, 157945, 224246, 220969, 142833, 247281, -152646, -106039, 169425]
18568b0279A31345b79381k3767A67594D3386c48124h9137p7438g1804o8594l96139
18557e36537K03306J5710J46563B34853I2922C5227c17302C3243L931K7252J5068
18546G9494a81887H601P426a58479A42219b54853c9425j31330O0681C14989A12369
18534c73196C4052b54970A19714i9383A02284l4968c94930J94746m7499C484e3210
18522a2174r869B5110a39868L0581j64730h990G2718i4383j32471A31012a64518
18510B71647d14474J20874H2663b92969B54805a45246e253k24230K1711h4531
18499A45233g6451j12592A04212a61211C5294b04420D4385r839J05236A734b9771
18487c4612B1199m400g9763H7990a05880J3670F2997a49748B3541b73938H8103
$$ y = [-20279, 131345, -279381, -303148, 167594, 43386, -348124, -89137, -166575, -71804, -140398, -536537, -333231, -317521, -170958, 234853, 92922, 35227, -317302, 33243, 37174, 64426, 79494, -181887, 8601, 16027, -158479, 142219, -254853, -39425, -170755, -110074, 314989, 112369, -373196, 34052, -254970, 119714, -99383, 102284, 67316, -394930, -200184, -247683, 3484, -53210, -12174, -22043, 25110, -139868, -109287, -274017, -8990, 72718, -94383, -226854, 131012, -164518, 271647, -414474, -293600, 82663, -292969, 254805, -145246, -5253, -229483, -207772, -84531, 145233, -76451, -189043, 104212, -161211, 35294, -204420, 44385, 34546, 139782, 1734, -29771, -34612, 21199, 16799, -79763, 87990, -105880, -92210, 62997, -149748, 23541, -273938, 88103]
18475B42430d2018l2393l2486b888C31264i0636b9023j81709a0497p0193C1888
18463b44488A14668R561b94749P2250g9581j43663J01974C26661a9630B08227
18452d5209j13193A996a56138c996B9308c929k38798j1272A61339a1715A30613
18440b03869L2353C1059b44235g1546G8404a50995f2574A39115F409a052p6629
18429g7681k82387a34031F3481b54763g0809a0279C6772h4141l5701n8256B0675
18417d00862a88003C7309j15J27638l029q0599b16093a04750l39544C1921b22594
18405i5867A02912J85545b67241C5787a15376j05399r8366B07824a26665B67893
18394a41575D5970b08897R3127r2238A48350I946J70413f5064B83710a80824B36126
$$ y = [242430, -42018, -74411, -106897, -2888, 331264, -90636, -29023, -210732, -10497, -80690, 31888, -244488, 114668, 124229, -294749, -222499, -79581, -223244, -121270, 326661, -19630, 208227, -45209, -158402, 1996, -156138, -3996, 29308, -3929, -242727, -253999, 161339, -11715, 130613, -203869, -171516, 31059, -244235, -71546, 78404, -150995, -62574, 139115, 6409, -1052, -77681, -360068, -134031, 63481, -254763, -70809, -10279, 36772, -84141, -119842, -178098, 20675, -400862, -188003, 37309, 37194, 164832, 161803, 81204, -216093, -104750, -444294, 31921, -222594, -95867, 102912, 288457, -267241, 35787, -115376, -220775, -319141, 207824, -126665, 267893, -141575, 45970, -208897, -115770, -208008, 148350, 9946, 180359, -65064, 283710, -180824, 236126]
18382i58k21229J900F5854c65210A74565a67234j77290C9066d9420b3187Q975
18371a4212k26696B84961j39968a11277G9063K15212e2879j99847F7483b550k53573
18360b56123n5547b0946j043q1948H8860K68790c59332A03846b56158B49760G2639
18348D2536e0580r8499L6529A25870b3595A51025E6673a23572l29030a46903K1131
18337a25772N1621A37907e9719D2852a69014c8340j49437m0451A8072a03137H3842
18325b5962r9541C5632O3196D8124a36270q3972a09666L6614H8374a71669B90981
18313b1428C4487O2164Q602a37384o4978P3134A23015a59566c9450k85534g8383
18301a12899j0341c4132a1758k09660d4167j82122h1856k7272j5481C7684a30030
$$ y = [-958, -222187, -220287, 65854, -365210, 174565, -167234, -344524, 39066, -49420, -23187, -14212, -240908, 284961, 144993, -111277, 79063, 294275, -52879, -252726, 67483, -2550, -256123, -311670, -20946, -21989, -103937, 88860, 357650, -359332, 103846, -256158, 249760, 72639, 42536, -50580, -149079, -112550, 125870, -23595, 151025, 56673, -123572, -452602, -146903, -125772, -74151, 137907, -59719, 42852, -169014, -38340, -187777, -228228, 18072, -103137, 83842, -25962, -125503, 35632, 98828, 48124, -136270, -220242, -109666, -73052, 88374, -171669, 290981, -21428, 34487, 96651, 105253, -137384, -202362, -129228, 123015, -159566, -39450, -324984, -78383, -112899, -123240, -34132, -11758, -221418, -44167, -226289, -81856, -109128, -124609, 37684, -130030]
18289A93035r3545b18471F5965a82549b3921a306A8008b1425A62016G983R5122
18278A03105j2829a6378p1559B4243b02095g1804j6077j7356L3397j94435B7249
18266D930b15538c7796e937A81612c7997A76713a52830a1160l70039a43541r4013
18255b37554j973m3116e8777A09451K8561n2843J69751c30529C29033a18564o7477
18244a86041j13207j02767A75894o6822b76747P8001e6310k07082f2533l05343
18234c67876a20842A99637a49951j64671A72670a38721b443H1871P4461h757k03663
18223b12420a03114A48446n017Q9489q2443a66873j4316C2741K11189L1890g7409
18211A3667b34646A4445b58713A10940K36007j29632b31464N2784B40632a74173
$$ y = [193035, 99490, -218471, 65965, -182549, -23921, -1306, 18008, -21425, 162016, 7983, 103105, 90276, -16378, -87937, 24243, -202095, -71804, -87881, -105237, -71840, -266275, 27249, 4930, -215538, -37796, -5937, 181612, -37997, 176713, -152830, -11160, -381199, -143541, -237554, -239527, -282643, -58777, 109451, 138012, 85169, 254920, -330529, 329033, -118564, -186041, -299248, -402015, 175894, 109072, -276747, -198746, -56310, -263392, -62533, -367876, -120842, 199637, -149951, -314622, 172670, -138721, -2443, 81871, 156332, -8757, -212420, -103114, 148446, 143429, 232918, 150475, -166873, -181189, 32741, 243930, 275820, -77409, 13667, -234646, 14445, -258713, 110940, 346947, 217315, -231464, -178680, 240632, -174173]
18200A04838m1706b42063H2512H575K35326b28786I4031J62604c06120g0327j11333
18189a81660g8922B71281d7178D8640h5391c9838m2339A14994c04676a2511j38727
18178a51238k07889C03088a74693M0910a2705I8401a34824D1510b93059J23583
18168a69476A61697e4412C48760f4552l4934j05953A5924k334b77113j3269F8745
18156b95483A21577m3821A5569a37918n7952D0103f7026A18130h5520E0685b55961
18144A30197Q4696i7663k36905B27437a05700d0038C20281l6559j30212b34852
18133a89386A3298Q2589R5231a77470e3672m596j20230Q7129m4181k33315a52188
18121i096B3147J7279a97521i8378O643E3951j3482J90629G0837a48565G7543
$$ y = [104838, 63132, -242063, 82512, 8575, 243901, -228786, 94031, 256635, -306120, -70327, -181660, -78922, 271281, -47178, 48640, -85391, -39838, -82177, 114994, -304676, -12511, -151238, -359127, 303088, -174693, -133783, -12705, 98401, -134824, 41510, -293059, -169476, 161697, -54412, 348760, -64552, -99486, -205439, 15924, 13590, -277113, -290382, 68745, -295483, 121577, 77756, 15569, -137918, -195870, 40103, -67026, 118130, -85520, 50685, -255961, 130197, 214893, -97663, -334568, 227437, -105700, -40038, 320281, 283722, 153510, -234852, -189386, 13298, 95887, 191118, -177470, -53672, -58268, -178498, -91369, -135550, -368865, -152188, -9096, 23147, 40426, -197521, -98378, -91735, 53951, 40469, 231098, 70837, -148565, 77543]
18109D0056a28071B8840J5457j1360a30920E4553a62904D6126J98503j09165i7821
18097a75017M390D0478a42387j3888k10420g3723B7200J79385a18814k07225c4922
18085D5660b41757A09919b26442c749A5370g3882B52346A24857J35420a47023
18074D1489J72679a64473l630B2102a15696b5375j52057f9813j9575B96063A26499
18062A93623f353q7497A60787c47166A70619g5100a3998l40814G2047f2454A36260
18050b93310A61177a9115E40926B59544Q7509A14554J4881B5206J08368e8128
18039d3209D5996a34332A8171a8526j4427k39935K7874b051k00556B72216b04011
18027b73408G3610c31070A01838h9993C8422b9394k9219f84A11718A5168R4877
$$ y = [40056, -128071, 28840, 44297, 32937, -130920, 54553, -162904, 46126, 244629, 135464, -97821, -175017, -170627, 40478, -142387, -156275, -366695, -73723, 27200, 206585, -118814, -326039, -34922, 45660, -241757, 109919, -226442, -3749, 15370, -73882, 252346, 124857, 260277, -147023, 41489, 214168, -164473, -168103, 22102, -115696, -25375, -177432, -69813, -89388, 296063, 126499, 193623, -6353, -93850, 160787, -347166, 170619, -75100, -13998, -354812, 72047, -62454, 136260, -293310, 161177, -19115, 540926, 259544, 347053, 114554, 129435, 25206, 133574, -58128, -43209, 45996, -134332, 18171, -18526, -32953, -272888, -245014, -2051, -202607, 272216, -204011, -273408, 73610, -331070, 101838, -89993, 38422, -29394, -58613, -684, 111718, 15168, 110045]
18016A10045a51892E1658e2733k3850j5858C0178g3413r0291n04895a30318d2902
18004h6620C4698b08403A80370b996A5821J01441f1272b3246j03618j65380B78292
17992i0100A43060a44752C6783m773K5633a22764l6915A44427b44127A07041b1092
17980I9101c37283C4456H6a35951C54610c55990E5238J79858a86725B0507a40312
17968A51986c85552a35964k8202d287j66248J2309B16320l1323e0421E18212g7378
17956e6884b058r6461j19659I5552Q3016b1123k19352Q1810j44228f4017A4433
17944c8556B79931c0310j92988k81230b38426a9798o5010k36761C66880b11271
17933d76547B38582a58411B41736h0012G319a07059A73480o397Q8959J80388b62174
$$ y = [110045, -151892, 51658, -52733, -76583, -92441, 30178, -73413, -163704, -668599, -130318, -42902, -86620, 34698, -208403, 180370, -2996, 15821, 117262, -61272, -23246, -126864, -292244, 278292, -90100, 143060, -144752, 36783, 32010, 57643, -122764, -159679, 144427, -244127, 107041, -21092, 99101, -337283, 34456, 86, -135951, 354610, -355990, 55238, 235096, -186725, 20507, -140312, 151986, -385552, -135964, -164166, -4287, -170535, -158226, 216320, 184997, -50421, 518212, -77378, -56884, -2058, -98519, -218178, 95552, 178568, -21123, -240475, -158665, -302893, -64017, 14433, -38556, 279931, -30310, -223298, -504528, -238426, -19798, -84808, -321569, 366880, -211271, -476547, 238582, -158411, 241736, -80012, 7319, -107059, 173480, 167083, 256042, 436430, -262174]
17921a80884c7923C09981C7266a13499c5791r3157J2547c5264H0456a67776E7860
17909B22618d37173b2607A34347a14478A0153b77488J23737B32119c45872a12250
17898g0370j13084i1185K9851A99737F9676C0687i4595H6607d20779K02899R1460
17887a26420p1273p28A13770a24252D7967e1696H0472J12056b08516m1565A5873
17875A07371J70096A639b98281N4874d0941C3316J43876a63100D32225F5092a04383
17863d7845J2116C5178b31956I1635a57608A50741c5289A81156o7895a13869D3098
17851b53412N3468G4821b65453B9091a22757b7094B58847c6590l23767f0674l00897
17840c61571J72561C0963a30434f4424A00444a87562C7166K27170f899A72386
$$ y = [-180884, -37923, 309981, 37266, -113499, -35791, -128948, -116401, -35264, 80456, -167776, 57860, 222618, -437173, -22607, 134347, -114478, 10153, -277488, -153751, 232119, -345872, -112250, -70370, -183454, -91185, -61334, 199737, 69676, 30687, -94595, 86607, -420779, -217880, -126420, -197693, -198421, 113770, -124252, 47967, -51696, 80472, 192528, -208516, -250081, 15873, 107371, 277467, 1639, -298281, -243407, -40941, 33316, 177192, -163100, 432225, 65092, -104383, -47845, -35729, 35178, -231956, 91635, -157608, 150741, -35289, 181156, 113261, -113869, 43098, -253412, -199944, 74821, -265453, 29091, -122757, -27094, 258847, -36590, -360357, -60674, -361571, -189010, 30963, -130434, -64424, 100444, -187562, 37166, 264336, -6899, 172386]
17829D3116a14953c1242A41868a00360G8038B0297M8251K00956b77667K2941f4453
17817b22947K8725i4230G571a08231c716F6343a36573n9716H4080B2250c52524
17805A91170a20346e4350D3184a36177H8005J08829K0437b12995b2112A34870
17794B19325E182J23099a39663B46502a2903j0030A30068a41684I7166a44212
17783a81830B14565j5668i0637j31960L5343j46795A68225G756R0375a75932B39559
17771A5162N9535b09055f2824h986k07514m009i8621D3282F650O179a90574r269
17759a99843C4450A0497a53042g1827A4607J12327Q1877K24835D1601R4354c02547
17747i7241B08476Q5480A9596c1094C0924g7308j24071C72064a09286J5707j43604
$$ y = [43116, -114953, -31242, 141868, -100360, 78038, 20297, 68548, 269504, -277667, -254726, -64453, -222947, -194222, -94230, 7571, -108231, -3716, 66343, -136573, -196289, 84080, 22250, -352524, 191170, -120346, -54350, 43184, -136177, 88005, 196834, 217271, -212995, -22112, 134870, 219325, 5182, 128281, -139663, 246502, -12903, -22933, 130068, -141684, 97166, -144212, -181830, 214565, 198897, -90637, -222597, -187254, -334049, 168225, 7756, 98131, -175932, 239559, 15162, 74697, -209055, -62824, -8986, -216500, -220509, -98621, 43282, 6650, 12829, -190574, -199843, 34450, 10497, -153042, -71827, 14607, 126934, 208811, 433646, 41601, 135955, -302547, -97241, 208476, 293956, 19596, -31094, 30924, -77308, -201379, 372064, -109286, -93579, -237183]
17736b37183F976h5701G3316J01458J69733D4441j8779d1591F3649a79820a5785
17724A43896i1695L1769r803r2232A07041K98901r0408a38972A05558k7192i2237
17712B11068r3991E241c86048A22924K21927A6555d91453B7520a59235d4487F7303
17700f2786D2985M482a28476g330j15530A02842D8040J56387J46853a16410G3152
17688I7123a30768C2304a62386a8024p900B74321F2446a37942E3315b9483E96933
17676c85036A50297B3626b23680f0977B7495b07403h6575A77903b06F4799B1494
17664a9922A60532f1099j32958E8630J55522d32853a25144A84205b32662A33582
17653G562a0183H2286P8081b78598B67678D4816M3627b20568k59497b9199G8872
$$ y = [-237183, 6976, -85701, 73316, 174774, 344507, 44441, 25662, -41591, 63649, -179820, -15785, 143896, -91695, -59926, -69729, -161961, 107041, 405942, 315534, -138972, 105558, 78366, -92237, 211068, 117077, 5241, -386048, 122924, 344851, 16555, -491453, 27520, -159235, -44487, 67303, -62786, 42985, 47467, -128476, -7330, -122860, 102842, 48040, 204427, 351280, -116410, 73152, 97123, -130768, 32304, -162386, -18024, -25924, 274321, 62446, -137942, 53315, -29483, 596933, -385036, 150297, 23626, -223680, -60977, 27495, -207403, -86575, 177903, -206, 64799, 21494, -19922, 160532, -61099, -194057, 58630, 214152, -432853, -125144, 184205, -232662, 133582, 7562, -10183, 82286, 160367, -278598, 267678, 44816, 88443, -220568, -480065, -29199, 78872]
17641c92052B62712G9208b5083l42377A28668J83059e200j60556B45336b21561
17630F8994O7288c19777A50110B8660J15463o3953k7161j5270K6954p648J66179
17619B23224o1461B8071b19163e5914r0191B61365b3677C80018j64653H970K2063
17608C1033O811K66420N5586b5007A25167c53993a05336p659L0019j53682A59557
17596h5652k33119h5385B24499a19404e8643B32107A15854m040h725C8455c0440
17584A07417B085N4659l869c33674C22319r4033b5436j18012B10968b25234a08613
17572B11400H6432K39697h6283H3998a00828K8181B23809E5376a4967p4537A54880
17560A95904r0447L6148A8750d2072A36771g5721B74057a2241j73710B31592D0534
$$ y = [-392052, 262712, 79208, -25083, -367460, 128668, 311727, -5200, -165756, 245336, -221561, 68994, 136282, -319777, 150110, 28660, 144123, 80170, 53009, 37739, 64693, 57045, 223224, 161763, 28071, -219163, -55914, -146105, 261365, -23677, 380018, 215365, 8970, 31033, 37844, 304264, 359850, -25007, 125167, -353993, -105336, -112995, -82976, -236658, 159557, -85652, -318771, -85385, 224499, -119404, -58643, 232107, 115854, 111814, -8725, 38455, -30440, 107417, 2085, 56744, 52875, -333674, 322319, 228286, -25436, -143448, 210968, -225234, -108613, 211400, 86432, 326129, -86283, 83998, -100828, -72647, 223809, 55376, -14967, -89504, 154880, 195904, 105457, 141605, 18750, -42072, 136771, -75721, 274057, -12241, -185951, 231592, 40534]
17548b89001g5298j0166A72520c1965C33843r9276A4156K05422B1969K8856a61718
17536H5468C3124a38806K6460j00048A53132D1801M0669R2828J3774q8992K45388
17525C45468e1637C8563q816b36345G8128K01660F8810K6262O9848m6557P6136
17514A94499f1858F4690a17161E5926J71524f8127p3910B08368G2955J36791F7009
17502a00467c1516A65919f1785A75167J56590a02773H1450K31107a67521K8056
17492a39465H3090P9718A8825J5117K4054a83733C8755K19150n2554D8627J35661
17481A84288d1270r3448H8057l8353b15210F0265K26740M21690e492j34447B92699
17469I9189l3636O2207g190j78839A53754l3164j4419B4193i4702C58558j26731
$$ y = [-289001, -75298, -85464, 172520, -31965, 333843, 234567, 14156, 219578, 21969, 50825, -161718, 85468, 33124, -138806, -112346, -212394, 153132, 41801, 82470, 175298, 189072, 100080, 345468, -51637, 38563, 29747, -236345, 78128, 279788, 68810, 95072, 164920, 118363, 194499, -61858, 64690, -117161, 55926, 227450, -68127, -142037, 208368, 72955, 209746, 67009, -100467, -31516, 165919, -61785, 175167, 331757, -102773, 81450, 312557, -167521, -139465, 83090, 162808, 18825, 33942, 57996, -183733, 38755, 257905, 205351, 48627, 184288, -41270, -134718, 88057, 49704, -215210, 60265, 287005, 708695, -5492, -139939, 292699, 99189, 65553, 127760, -7190, -186029, 153754, 120590, 106171, 24193, -94702, 358558, 231827]
17458B31827c1906C86233e1146A94240J30903I535J05270L9568J90095j10476
17448B33992J43328h794D30456j80951p0816m0051R5728C9731L07156j17670J17971
17437C47188J98407c4821B87364A19150C5333O8563K75480p3982O1037j14183
17427B52248A11735J17735f4338E3988K60769q956b0915C21205F9558J02815C3905
17415G8666K14266O355J02162A74469a5861D50885k1990A16724b45929B47901
17404C57502a71720A23614P6787d5407A20491L11388A43439L055R2120a5047C51326
17392H3859K69705K03404A5204L47321h2031C04446j34622F0347J54572q3245
17382A31674L1009n0064c603B8004Q4739Q8021I0888c072D5685L25509A47301
$$ y = [231827, -31906, 386233, -51146, 194240, 325143, 9535, 114805, 154373, 344468, 233992, 377320, -8794, 430456, 249505, 178689, 138638, 234366, 39731, 346887, 229217, 347188, 545595, -34821, 287364, 119150, 35333, 103896, 379376, 305394, 366431, 252248, 111735, 229470, -64338, 53988, 314757, 305801, -20915, 321205, 69558, 172373, 33905, 78666, 292932, 299287, 401449, 174469, -15861, 450885, 428895, 116724, -245929, 247901, 357502, -171720, 123614, 200401, -45407, 120491, 431879, 143439, 146494, 238614, -15047, 351326, 83859, 353564, 556968, 15204, 362525, -82031, 304446, 169824, 60347, 214919, 131674, 162683, 112619, -3603, 28004, 112743, 200764, 90888, -3072, 45685, 371194, 147301]
17370A68075h6486B27061R1091a26343D36600D5119Q8116K7346n919O7308I9308
17358b8976A69723i3056k0804A11154M27522C6727J86672a13250A79574j2130
17348A67444a03615d2134k10510A67361J3117g1237C06030I7629J12193p6589
17338A33233b4305B68794E4609K08188O0496j06785l5130a6358j02246A0989J64910
17327A75899q589F0479L4360L51620A63435e8532D8197O3100J45371L4592K5926
17316C17186p6637C9215M25239r3063A22207a10165d8359A17886e8082b4410A40983
17304C81119b937k8522B95755j21593P7940Q2861j33455L8131j6876k5958J88475
17293C85280q3166a45793C43146l5283F002M1751g8765C94172j96999a31455D48513
$$ y = [168075, -86486, 227061, 318152, -126343, 436600, 45119, 133235, 160581, 154662, 221970, 99308, -28976, 169723, -93056, -113860, 111154, 538676, 36727, 223399, -113250, 179574, 167444, -103615, -42134, -252644, 167361, 180478, -71237, 306030, 97629, 209822, 133233, -24305, 268794, 54609, 262797, 323293, 216508, 181378, -16358, -118604, 10989, 175899, 167310, 60479, 94839, 446459, 163435, -58532, 48197, 111297, 256668, 291260, 317186, 240549, 39215, 464454, 371391, 122207, -110165, -48359, 117886, -58082, -24410, 140983, 381119, -2937, -31459, 295755, 174162, 252102, 334963, 201508, 239639, 222763, 196805, 385280, 302114, -145793, 343146, 307863, 6002, 47753, -78765, 394172, 197173, -131455, 448513]
17281H1210Q9516g0279b3956A71008P0723n638K7862O4380b02553C96172b5377
17269A48176J37140A38522K82690j71193m299J59724j95370M5273J78942a3730
17258A65815a51705A88159M3548M4769g2736B18824D3450K95881q4233o4314h7582
17246A15468f2375B57401j09844A2516K40798d9932B23509M9396j12073j2749
17236A48083J88788G408K50824j26662k2152O4876j2763G2257J05401J45444A19603
17224E64390a0756k0977G3780A5762J89226H3550K46437D477J88246J05183A36121
17212A88490J45443G6562J465K62334e3436B5410a31255E70636k29218g851E12832
17200a53496G5735J28680P833J80581A19615D1060J91379d2692A24411J73195
$$ y = [81210, 170726, -70279, -23956, 171008, 241731, 236093, 263955, 328335, -202553, 396172, -25377, 148176, 285316, 138522, 421212, 250019, 245720, 405444, 210074, 255347, 434289, -13730, 165815, -151705, 188159, 231707, 276476, -72736, 218824, 43450, 339331, 255098, 190784, -87582, 115468, -62375, 257401, 147557, 12516, 253314, -49932, 223509, 272905, 160832, 148083, 336871, 7408, 258232, 131570, 109418, 174294, 161531, 72257, 177658, 323102, 119603, 564390, -10756, -31733, 73780, 15762, 204988, 83550, 329987, 4477, 192723, 297906, 136121, 188490, 333933, 76562, 78027, 340361, -53436, 25410, -131255, 570636, 341418, -7851, 512832, -153496, 75735, 204415, 212248, 392829, 119615, 41060, 232439, -42692, 124411, 297606]
17190B97606n7675q9844K37075p2205j30379n1201J99565j03453j0876B9591K65357
17179B94948j04514J39375A26843Q5516K25224j51304A745N1393j6913K8137L43823
17168D08185N2849r6195N6609L1880A66214P174O1287Q9163A36567K28548L0321
17157C95436A95996F5823J99722A15453J69274L64396K07340l40621l8470j15516
17147C61856j77549L0155A0450L79253j8026j00882A27833J73619M2851A22791
17136C64842f31C36508j7671j31887e9109C76807J03300k06394L8992B9211K58860
17125B88071Q4965J01715l2539A28039K37453N6752I6028L39018A92605M92912
17115F85517j29439F2148J81122J68597J24879J38873k91217j68211q1306J41907
$$ y = [297606, 239931, 150087, 387162, 314957, 184578, 133377, 332942, 229489, 218613, 29591, 294948, 190434, 329809, 126843, 212359, 437583, 286279, 1745, 53138, 36225, 64362, 408185, 461034, 364839, 421448, 453328, 166214, 173388, 234675, 323838, 136567, 365115, 395436, 195996, 65823, 265545, 115453, 284727, 649123, 856463, 515842, 477372, 361856, 184307, 214462, 10450, 389703, 371677, 270795, 127833, 301452, 344303, 122791, 364842, -631, 336508, 318837, 186950, -59109, 376807, 480107, 273713, 312705, 29211, 288071, 373036, 474751, 442212, 128039, 365492, 422244, 96028, 435046, 192605, 685517, 556078, 62148, 243270, 411867, 536746, 675619, 384402, 216191, 134885, 276792]
17105B76792J04066N0120j42708J82125J0574I8291J23111L29010j81704j10792
17095B57916L10799B08636P7304A41674O1364N23860J07706l75183k05440K10350
17085D64331J2941j12515K47740k38808M4094J51657n3647j19470A36533J84656
17075C21189K68409o6030j78102J46897k34786J79627B18342I178N37333j44251
17065D02260K02345m5902j62423A06699K47578l617j06913A2357J75350Q19683
17055A007390C30706K82967B24153L22962G3080P8078K29003q1515L94607l7645
17045F55608k82284L8519j90476J93627J74319k68776K77798l8439J58745j09959
17035F08682j07532J5018j09362j15063J39762P1317j59552L2976M2891L05351
$$ y = [276792, 380858, 430978, 288270, 470395, 480969, 98291, 221402, 550412, 368708, 257916, 568715, 208636, 285940, 141674, 203038, 726898, 834604, 459421, 253981, 464331, 477272, 364757, 612497, 373689, 417783, 569440, 515793, 396323, 136533, 321189, 589598, 523568, 345466, 492363, 257577, 437204, 218342, 9178, 546511, 402260, 604605, 558703, 396280, 106699, 354277, 350660, 243747, 12357, 187707, 1007390, 330706, 613673, 224153, 547115, 73080, 151158, 380161, 298646, 693253, 655608, 373324, 411843, 221367, 414994, 589313, 320537, 598335, 559896, 718641, 608682, 501150, 516168, 406806, 291743, 431505, 502822, 343270, 376246, 419137, 724488]
17025G24488j66255J99828j09993N4141A76078N85412K32501l78242N6037J3095
17015F84881n7869m7635q0314M46480D23588L34866j43538j91484K69433r3916
17005E98949B48420L86493L82459m95332O7875J72201j08256q162o64M38669E01814
16993F08421L79652Q8182k87833k48792M0503L04794m05912L10706j13307L5242
16983G11656R8293q5223R8503l17829J97214M44162k01721k21657j31714L20847
16973I12531j30773m6269K16381l01830K11584K75664o8082K49850l92074J19959
16963A046941j31566j02617J74343k9236k70433L03382N7939j64389L13768l92079
16953H06053M81438m80261K80560l0082J21191n1625m6454n5684l4278J65313
$$ y = [724488, 558233, 758061, 648068, 702209, 176078, 761490, 993991, 615749, 671786, 684881, 627012, 579377, 499063, 945543, 423588, 758454, 614916, 423432, 692865, 598949, 248420, 634913, 1017372, 522040, 589915, 762116, 653860, 645698, 645034, 1083703, 501814, 608421, 988073, 1076255, 788422, 539630, 580133, 884927, 479015, 789721, 676414, 711656, 809949, 724726, 823229, 505400, 702614, 1146776, 945055, 723398, 591684, 912531, 781758, 735489, 951870, 650040, 861624, 1137288, 1069206, 1319056, 926982, 1046941, 915375, 812758, 987101, 957865, 687432, 990814, 1048753, 884364, 1198132, 806053, 1287491, 807230, 1087790, 1057708, 1178899, 1127274, 1080820, 1025136, 990858, 1156171]
16943A156171q3401Q1868K3086N0456R3055j48277R9325l3060O0525j72246N87827
16932A715329m50067l93234K96444P652J96660r3747R7875J14273n01989K31717
16922A220913j02354J55612L78917k72645j34400J59347r7580M74199k48372J9220
16912A552857k85522K95748J17811k66931Q528J36271N22256k69250k07649K84677
16902A888796j51372K60873R5505m67420K07007q0941O48795n58062K56633j11468
16892A988346j47655J04444K64283k97153O7716L3146j87672M28286J05366K53326
16882B612433p58744M21630j03500N7332j08719K35556j09603J16246k29669N17235
16872B650197k79087p5362J23646J40744K50579r5396j27419k76331L99377j45220
$$ y = [1156171, 1072770, 1154638, 1177724, 1228180, 1321235, 1172958, 1272283, 1239223, 1299748, 1127502, 1715329, 1265262, 872028, 1168472, 1176124, 1372784, 1279037, 1376912, 1491185, 989196, 1220913, 1118559, 1274171, 1653088, 1380443, 1246043, 1405390, 1307810, 1782009, 1533637, 1552857, 1267335, 1563083, 1680894, 1413963, 1422491, 1558762, 2081018, 1811768, 1604119, 1888796, 1737424, 1998297, 2093802, 1626382, 1833389, 1752448, 2401243, 1843181, 2099814, 1988346, 1840691, 1945135, 2209418, 1912265, 1979981, 2013127, 1825455, 2253741, 2359107, 2612433, 1853689, 2275319, 2171819, 2229151, 2120432, 2355988, 2246385, 2362631, 2132962, 2650197, 2371110, 2295748, 2419394, 2560138, 2810717, 2715321, 2587902, 2311571, 2710948, 2565728]
16862B565728L16004j99701J28834o7577M75670k82272K67775k72830L03993j81654
16852C053970M15801l53721J94275L22800p5460j7856J35755k9838R2623o5374
16842C672975o6746M58939r984K28640L9251l9220m40223N76569q7602J72412
16832D505011J50085j8186R077K05871o2431o5099Q0053K60883k762q8233L99670
16821E373939J830L86921k24005K78779N10088k81284K39449l12594M51131r3376
16811F330878M59567O50117l95730K38104o3871J82999P3283M31568K0342M91575
16801H418832m4572L07187j17713M97676J87747K22860N49610m27824O18044N17824
16791A0729671N01887k65674L18598O08266J78934K86150N53044J25454K48939
$$ y = [2565728, 2881732, 2682031, 2810865, 2743288, 3218958, 2936686, 3204461, 2931631, 3235624, 3053970, 3469771, 3116050, 3310325, 3633125, 3557665, 3539809, 3675564, 3645726, 3738349, 3672975, 3606229, 4065168, 4055184, 4283824, 4323075, 4283855, 3843632, 4420201, 4332599, 4505011, 4655096, 4636910, 4645987, 4851858, 4789427, 4724328, 4804381, 5065264, 5062502, 4974269, 5373939, 5375769, 5762690, 5538685, 5817464, 6327552, 6046268, 6285717, 5973123, 6424254, 6330878, 6790445, 7440562, 7044832, 7282936, 7219065, 7402064, 7475347, 7906915, 7927257, 8418832, 8374260, 8681447, 8563734, 9061410, 9249157, 9472017, 10021627, 9593803, 10211847, 10729671, 11231558, 10965884, 11284482, 11892748, 12071682, 12357832, 12910876, 13036330, 13285269]
16782A3285269O64710M20643M77002L8535J078659K22578N80346M32000P14731
16773A7914473O39924N61861Q14099Q48392N62301M37089J134119N57825J233205
16764B4703288Q64053P25235J457221J060282J266675J716620P88617J739966
16756C4321957J446901J515284J882696J672030K030326J787541K358842K477329
16748D9492906K561653K666715K955413L224905L227300L506859L931935M295599
16740G5863285M087540M628530M811930N300131N668016N367487O093785O712190
16732A18532894O427135P151703P015010O924285P022286O426445P153281N804926
16724A72457965N298953M750225L743104K317782J633723L78362j090227j875355
$$ y = [13285269, 13949979, 14370622, 14847624, 14886159, 15964818, 16187396, 16767742, 17199742, 17914473, 18554397, 19116258, 19930357, 20778749, 21341050, 21778139, 22912258, 23470083, 24703288, 25567341, 26292576, 27749797, 28810079, 30076754, 31793374, 32581991, 34321957, 35768858, 37284142, 39166838, 40838868, 42869194, 44656735, 47015577, 49492906, 52054559, 54721274, 57676687, 60901592, 64128892, 67635751, 71567686, 75863285, 79950825, 84579355, 89391285, 94691416, 100359432, 105726919, 111820704, 118532894, 124960029, 132111732, 139126742, 146051027, 153073313, 159499758, 166653039, 172457965, 177756918, 182507143, 186250247, 188568029, 190201752, 190580114, 189489887, 187614532]
16716A87614532l260529l815495n022196n905000o296706o575584p156329p258744
16708A42323949o988238p072377o997464o715971o245201o061332n967546n222618
16700I1053202n085404n291663m371706m183064l835641m161025l385180l219672
16692E7519847k801146k909850k836065k379272k281832j991142k304701j657177
16684C8358662j877707j771097j173940j310565j530980j580336o16486j814202
16676B6683349r61228q78646r91358p46435r20912r07617q24868o79621p89369
16667A8983295m01485j005353k70948n24403r37196m41357n28067r7322o03706
16658A4173458m11472n99270m54452l31303r1352o24896r2253m75325j67855q55331
$$ y = [187614532, 184354003, 180538508, 175516312, 169611312, 163314606, 156739022, 149582693, 142323949, 135335711, 128263334, 121265870, 114549899, 108304698, 102243366, 96275820, 91053202, 85967798, 80676135, 76304429, 72121365, 68285724, 64124699, 60739519, 57519847, 54718701, 51808851, 48972786, 46593514, 44311682, 42320540, 40015839, 38358662, 36480955, 34709858, 33535918, 32225353, 30694373, 29114037, 28497551, 26683349, 25722121, 24843475, 23852117, 23105682, 22184770, 21277153, 20452285, 19772664, 18983295, 18581810, 17576457, 17305509, 16781106, 15843910, 15402553, 14874486, 14777164, 14173458, 13761986, 13162716, 12708264, 12376961, 12285609, 11660713, 11568460, 11093135, 10925280, 10069949]
16648A0069949k2009K6604l60343n51272P1166p44305q4813K31703l04731n6920
16638H275029m78420k34405k10268J21669j78419m25138m8896K62951q79269J28088
16628F332922k27590J60495l22390k1598k21812n1603J4666k60901l38774J45998
16618E209413l6757L5571j62308j67382k36778R4387O0098k48244l33000L44292
16608D559292k75738m54687N13288m83981J38226k94377j27972L15260m39599
16599C449712L30247j72597k30937J00624J11034p7946l16157J3255K9763k64867
16589B972131R2909j03972j22445p2160K93676r0952j37019r2667M3783L2960
16579B816244l71596r222K66912L4316k06688k58993K10602k14460K52576n2335
$$ y = [10069949, 10047940, 10074544, 9714201, 9162929, 9234095, 8489790, 8404977, 8636680, 8331949, 8275029, 7796609, 7562204, 7351936, 7473605, 7295186, 6870048, 6821152, 7084103, 6204834, 6332922, 6105332, 6265827, 5943437, 5921839, 5700027, 5648424, 5663090, 5402189, 5063415, 5209413, 5172656, 5208227, 5045919, 4878537, 4641759, 4736146, 4796244, 4548000, 4215000, 4559292, 4283554, 3828867, 4342155, 3858174, 3996400, 3702023, 3574051, 3889311, 3449712, 3779959, 3607362, 3376425, 3477049, 3588083, 3510137, 3193980, 3207235, 3236998, 2972131, 3065040, 2961068, 2838623, 2766463, 3060139, 2969187, 2832168, 2739501, 2783284, 2816244, 2444648, 2435426, 2702338, 2736654, 2529966, 2270973, 2481575, 2267115, 2519691, 2467356]
16569B467356k72202R0664o5458p6917J62947q8781k00356O4510j22756j14417
16559A844590L35795j29110R7896j89317j65456K75046j16170j04882J86911l97183
16549A638120J85414J15949j32766J8810k25216M9082k19838J78033K72467k29959
16539A650096l76329N79428k73320K0663Q7906k01866Q8488m70342j44142M50948
16529A411530J76998j84298l03757L06102J75314j26989p6907l0746K9632n9976
16519A316903K6378N4590l22913K55818K03394l45060l3648J94080l05821K16455
16509A260176j48063K5105n4421J28518j46586j2317o9145P6304K29076J86155
16499A474802n45915L57073o08411K45739K21573K2570l31192L35528k62251m5520
$$ y = [2467356, 2195154, 2285818, 2220360, 2143443, 2306390, 2217609, 2017253, 2081763, 1959007, 1844590, 2180385, 2051275, 2149171, 1959854, 1794398, 2069444, 1953274, 1848392, 2035303, 1638120, 1823534, 1939483, 1806717, 1825527, 1600311, 1649393, 1429555, 1607588, 1880055, 1650096, 1273767, 1853195, 1579875, 1600538, 1688444, 1486578, 1575066, 1104724, 960582, 1411530, 1588528, 1404230, 1100473, 1406575, 1581889, 1454900, 1377993, 1347247, 1376879, 1316903, 1343281, 1397871, 1074958, 1330776, 1534170, 1189110, 1155462, 1349542, 1043721, 1260176, 1112113, 1137218, 1082797, 1211315, 1064729, 1052412, 983267, 1059571, 1288647, 1474802, 928887, 1285960, 677549, 923288, 1144861, 1167431, 836239, 1171767, 909516, 863996]
16489H63996m3152J05003p6688j33016K01930J6405p0573K01995j01073j52319
16479H12508j63002N43318n93453M17528K13399n30575M2836q8699J00556J33197
16469H87613k62327L36600q5898q0775K9626k25577L05374k41877m1693J70062
16459G91128o9015M8399j11098k9920L8348k33082J99387J55201l38143J46540
16449E97745n0115B34003L59817m7125Q8072j73185n0530j76027L75022j7967
16439E92080R4399L50121B61103N85216k51062K10319k6630B90263L78747k54521
16429D14489J11828O7641R3310k47826J40611B81684M46549A42235K62685J7869
16419D22789L69747k51113O2900k81253J85254q150l5534j72049M0593J87001
$$ y = [863996, 820844, 925847, 849159, 716143, 918073, 934478, 863905, 1065900, 964827, 812508, 649506, 1192824, 599371, 1016899, 1230298, 699723, 742559, 653860, 754416, 887613, 625286, 961886, 875988, 795213, 824839, 599262, 904636, 662759, 621066, 791128, 722113, 770512, 659414, 629494, 667842, 434760, 634147, 789348, 451205, 597745, 547630, 234003, 593820, 546695, 634767, 461582, 411052, 235025, 610047, 592080, 686479, 1036600, 261103, 846319, 595257, 805576, 778946, 290263, 669010, 414489, 526317, 593958, 687268, 439442, 580053, 281684, 728233, 142235, 404920, 422789, 792536, 541423, 604323, 323070, 508324, 500174, 464640, 292591, 333184, 520185]
16409E20185L1307K43142l27704l5109J08408O7795J89913C88280J08108j39831
16399C56557n496R4897j93804J38065J15172k23353K62834j42213j16196J66268
16389D52731A85761J91514q9392J38910J78930B79441O0240L5141L91455j94051
16379E72226o4510k01531O7119A66882L48345j28174L0174K15037j37323m750
16369D90191J85945B58316L63365B33773J51754L38568k90372j73458q2924J49715
16359C27056j10565K75711m9841K80H1150K25205K85497B30556c8741C65577l666
16348C61911r4981j28311M24919k69374R1334A00169R948J48277Q5967A62136
16337B70634K49262B42037l2314J04959q9534B4091J15774K17752q3605J07566
$$ y = [520185, 551492, 794634, 466930, 431821, 540229, 608024, 797937, 388280, 496388, 356557, 351061, 445958, 252154, 390219, 505391, 282038, 544872, 402659, 286463, 452731, 185761, 377275, 287883, 426793, 605723, 279441, 339681, 374822, 766277, 572226, 507716, 306185, 373304, 166882, 515227, 387053, 417227, 632264, 494941, 490191, 676136, 258316, 621681, 233773, 385527, 724095, 433723, 260265, 177341, 327056, 216491, 492202, 442361, 442641, 81150, 306355, 591852, 230556, -38741, 365577, 361911, 266930, 138619, 563538, 294164, 385498, 100169, 110117, 258394, 344361, 162136, 270634, 519896, 242037, 209723, 314682, 225148, 24091, 139865, 357617, 274012, 381578]
16327C81578j50140A08873J80882r4917J50604q2398J60157A61431J83847L4818
16317C80096j7920R7691j62019l2883j19580N439L82791j48590A00704D6830a54157
16305C34633H9415B6117J78587c0163C52196f541C41424A36683b10B63884k7782
16294B36102H6829K99607A34014J30023J57666p6562A36660L20080a14025j19467
16284b33492B83774A9031L22526D3513L1559L0315N46396k38653G0550J48613
16274B19163B4156N38212k58117D5808P9613J01063a237E8275h55C0211J15230
16263A45441C8036a79528E5380L19327G9596K85816H2474L0596J17348B5861K12137
16252B37998j0116m7830Q7527J07082j47385j09321P5675n6536Q3189B3743L84828
$$ y = [381578, 231438, 108873, 289755, 194838, 345442, 263044, 423201, 161431, 345278, 380096, 362176, 459867, 297848, 264965, 145385, 150824, 533615, 385025, 100704, 46830, -154157, 334633, 89415, 26117, 204704, -30163, 352196, -6541, 341424, 136683, -210, 263884, 236102, 86829, 386436, 134014, 264037, 421703, 345141, 136660, 456740, -114025, -233492, 283774, 19031, 341557, 43513, 75072, 105387, 651783, 413130, 70550, 219163, 24156, 562368, 304251, 45808, 125421, 226484, -1237, 58275, -855, 30211, 145441, 38036, -179528, 55380, 374707, 79596, 365412, 82474, 113070, 230418, 25861, 237998, 227882, 180052, 267579, 374661, 227276, 117955, 193630, 137094, 220283, 23743, 408571]
16241D08571O3602k25203F9411k3476K98798A03854B8469J95449J32226b4003
16230A2674f766C22553A16441n3747o764J31012m6084B3502J87166J71759A72656
16218c80080A37927L8122O5433F0070K67751a74225A41178B3811J22049g2288
16207B54627f2940B13878E9911J34981O6134L245A24831B8937J79073a27638N0921
16196g6717B44943R4638a56997L0212E1638a46233A98780b0616n2458K2034B33572
16184A64219F3456M8814b80858O6943c68A07134J61243o7070d8129j56600B57866
16172B66377H7215Q0615A637a65058A72971G6028J07650b8130n5176l0191B23989
16160A38130K14509r7317J14008C0855E730b6249j74792N8349C72763A07211L16447
$$ y = [408571, 472173, 246970, 69411, 45935, 344733, 103854, 28469, 223918, 356144, -24003, 12674, -6766, 322553, 116441, 62694, 55930, 186942, 140858, 23502, 210668, 382427, 172656, -380080, 137927, 176049, 241482, 60070, 327821, -174225, 141178, 23811, 145860, -72288, 254627, -62940, 213878, 59911, 194892, 261026, 264271, 124831, 28937, 208010, -127638, -76717, 244943, 339581, -156997, -126785, 51638, -146233, 198780, -20616, -73074, -51040, 233572, 164219, 63456, 112270, -280858, -213915, -368, 107134, 268377, 201307, -48129, -204729, 257866, 266377, 87215, 167830, 1637, -165058, 172971, 76028, 183678, -28130, -83306, -113497, 223989, 138130, 352639, 255322, 369330, 30855, 5730, -26249, -201041, -142692, 372763, 107211, 423658]
16149D23658H289i6328B71373H679J92593C8586a23363d4364j1244H0648e4975
16137G9337J37081K8839a15779d6761B2014R5094O7309a21016A93732j7916N152
16126A80968m8081F1174b8077a3227B1895J41230D5154J3921O0581a98103H0777
16114D1838K18569q1823E8332c3628j00413A76764F8659c8853j58535B12127p1210
16103A40917D925M40723j12685G9662K61710c9441C14967j22050B5105Q8950J83300
16092B97355C7380J22569J40870A2448R1495J3278h7654C54922a17611A11146
16081B15815C8055J31402i9304K5860b2805j56521J880c0979r0252A93129A0464
16069D8072g5449C12415D2456O5898B0888i9138j50289A49072J02484j17562P185
$$ y = [423658, 8289, -96328, 271373, 8679, 201272, 38586, -123363, -44364, -55608, 80648, -54975, 79337, 216418, 245257, -115779, -46761, 22014, 117108, 184417, -121016, 193732, 175816, 180968, 132887, 61174, -28077, -13227, 21895, 163125, 45154, 59075, 119656, -198103, 80777, 41838, 260407, 178584, 58332, -33628, -134041, 176764, 68659, -38853, -197388, 212127, 140917, 4925, 445648, 332963, 79662, 341372, -39441, 314967, 192917, 25105, 114055, 297355, 37380, 159949, 300819, 12448, 103943, 117221, -87654, 354922, -117611, 111146, 215815, 38055, 169457, -99304, -73444, -22805, -179326, -177446, -30979, -121231, 193129, 10464, 48072, -75449, 312415, 42456, 108354, 20888, -99138, -249427, 149072, 251556, 133994, 141179]
16058A41179g2279k33115E886K9395J67842D8543J55233a81329J8714j37586b179
16046B34027a05004J6283A75212P9002b63020B6598a00337A3208d2530B55209
16035H2308c5226A71932a00639A22596J86276I9024c0755k66336J05553O0063
16025a31475f4650l7822d7824k959J4539F0567L1284i1979k88755J65950F5569
16013c75616A02090d4094A35229J09394F4345J40542b92524a33696D7075e3793
16002B13982Q3991a16395L293k58955a59710B0707L6912J26362k4384a84775C01376
15990E1972a06194C1263d9458j18330p1906A56938a45718H6163L17740j84739
15980B19164K52115j36315j59528b52677C38966d8429l87756a87561K2541A40779
$$ y = [141179, -72279, -305394, 5886, 35281, 203123, 48543, 203776, -181329, -162615, -300201, -2179, 234027, -105004, -88721, 175212, 254214, -263020, 26598, -100337, 13208, -42530, 255209, 82308, -35226, 171932, -100639, 122596, 308872, 99024, -30755, -297091, -191538, -131475, -64650, -102472, -47824, -50783, -36244, 60567, 91851, -91979, -380734, -214784, 65569, -375616, 102090, -44094, 135229, 244623, 64345, 204887, -292524, -133696, 47075, -53793, 213982, 297973, -116395, -113102, -372057, -159710, 20707, 57619, 183981, 159597, -184775, 301376, 51972, -106194, 31263, -49458, -167788, -239694, 156938, -145718, 86163, 403903, 219164, 471279, 334964, 175436, -252677, 338966, -48429, -436185, -187561, -165020, 140779]
15969a01377B36849p3865c13244d4230l42812A61192h7916m5096a4425B10416
15958a84247E9567j1462j0936a80413I8075m295i0345A71605a20146K0774r7377
15947a96749p032Q6436B9444a25467C5783J42428a12862q6903K766E9367N1412
15936A10779C3774b846k54592f3233I9272o308b00043b2533l67474@A99404a65852
15923G606q93c27769f9672k607Q186J5096K0682l9213G9458g9431A00862k5596
15911G5266B2209a29914n2325k2901A49844P870j9244D1664a14834d1612j17467
15900a59079A29308f6328A39437i8283F5848a55622f5572B32183a44744E6552
15889A6445b6446k11499O1395k4594A98814f8704F7346A4899a1101A35454f1505
$$ y = [-101377, 236849, 162984, -313244, -44230, -387042, 161192, -87916, -133012, -14425, 210416, -184247, 59567, 48105, 37169, -180413, 98075, 93780, -90345, 171605, -120146, -99372, -196749, -203781, -117345, 29444, -125467, 35783, 178211, -112862, -199765, -196999, 59367, 110779, 33774, -2846, -257438, -63233, 99272, 92964, -200043, -22533, -390007, 0, 199404, -165852, 7606, 6713, -327769, -69672, -72279, -64093, -48997, -28315, -67528, 79458, -79431, 100862, 75266, 22209, -129914, -182239, -205140, 149844, 157714, 138470, 41664, -114834, -41612, -159079, 129308, -66328, 139437, -98283, 65848, -155622, -65572, 232183, -144744, 56552, 16445, -26446, -237945, -176550, -201144, 198814, -68704, 67346, 14899, -11101, 135454, -61505]
15877A07016g2876A42782O0111F8542c20750e2439A99440h1270A45399a38513
15866b68515j93186E5596J65399k1890I404K32976a49681M5023a5159q2600m4617
15855a42376c0128k4703A6097K07956p6438g2805A14137b72744B4780J26447A6385
15843D5459a68744o0804c2791A54597G805a61087l7494G5792h5207K8630n2421
15832a08998k12682g310r0895j45969N5978e0519j03321j94159d5940b02k30573
15821b30775B58649m4077a89462E3679j0384h629H8692k5246j588K7610O2112
15810A51580D787K625a89406A4651h3746A87241a77381h3149k8480D8539c26346
15798h5073E1589J9242a53305M5834d4933A02250N2179a20266M4210j941c8908
$$ y = [107016, -72876, 142782, 202893, 68542, -320750, -52439, 199440, -81270, 145399, -138513, -268515, -461701, 55596, 220995, 199105, 9404, 242380, -149681, -104658, -15159, -97759, -142376, -30128, -54831, 16097, 224053, 147615, -72805, 114137, -272744, 24780, 151227, 16385, 45459, -168744, -229548, -32791, 154597, 7805, -161087, -198581, 75792, -85207, -56577, -108998, -321680, -7310, -98205, -244174, -188196, -50519, -153840, -347999, -45940, -202, -230775, 258649, 214572, -189462, 53679, 43295, -8629, 88692, 63446, 61858, 89468, 151580, 4787, 7412, -189406, 14651, -83746, 187241, -177381, -83149, -111629, 48539, -326346, -85073, 51589, 70831, -153305, -107471, -44933, 102250, 154429, -120266, -76056, -77997, -38908]
15786g8387l6252E3370c02092h8530K3041E1175K72874c7548j67014j12851A30481
15774a01847j3776A52607a18971d1393r5674j5641r2477N9676B35911C6971f1075
15762b89011G6826i9368B01312B1437a40889K5340E8712O7818C5328A7251a1464
15750A62696c942p9227j27878a00194C1247P4237K72304E3356N091e1097A32540
15738d37774a65487B20034E9198a04331a4532k4042a8284k81752a3695G0666d7709
15726b96943G8462L62843c48622B5601e83m7272A31887a62121A63908c49628G7852
15714c1613C2028b68237g3350A51J62039a29116A8605c0586j01266j0551I9364
15702I6227Q9134m4325e7489j14608B18991C7130e9482k44059f9900c3456H0666
$$ y = [-78387, -114639, 53370, -302092, -88530, -65489, 51175, 324049, -37548, -204562, -317413, 130481, -101847, -115623, 152607, -118971, -41393, -137067, -152708, -245185, -185509, 235911, 36971, -61075, -289011, 76826, -99368, 201312, 21437, -140889, -115549, 58712, 126530, 35328, 17251, -11464, 162696, -3942, -83169, -211047, -100194, 31247, 105484, 377788, 53356, 58447, -51097, 132540, -437774, -165487, 220034, 59198, -104331, -14532, -38574, -18284, -300036, -13695, 70666, -47709, -296943, 78462, 441305, -348622, 25601, -583, -47855, 131887, -162121, 163908, -349628, 77852, -31613, 32028, -268237, -73350, 151, 162190, -129116, 18605, -30586, -131852, -142403, 99364, 96227, 185361, 141036, -57489, -172097, 218991, 37130, -59482, -303541, -69900, -33456, 80666]
15690a59338E2588d1904l93805B7484b99173A34675h4998k29006K4609J12961
15680a76434A58503a92256e0745A50026b20737G3112c0440D6325R4673B3306K39998
15669B63304R6034a45117j30678F017O4736A6233K4892d8517k44670c6381a7584
15657A57007f6441E3558a57000b8732r8600A22115e9340r6613K0276E6222N6349
15646A12571c71200a19424l1329j93623A09620A5182b6599l4144a5318A64243
15635A44186C8491g7876H9388a06225N30e25B14194M4923A21200l5135b38157
15623A59655a49131c3715H2546J18635k5152J38759G5444a26492m2914J4859A05585
15611b74413d20j67684k19165a21242B8596a40052F4932h7163o6497K9156i982
$$ y = [-159338, 52588, -41904, -435709, 27484, -299173, 134675, -84998, -314004, -289395, -176434, 158503, -192256, -50745, 150026, -220737, 73112, -30440, 46325, 140998, 23306, 263304, 359338, -145117, -275795, 6017, 70753, 16233, 41125, -48517, -293187, -36381, -17584, 157007, -66441, 53558, -157000, -28732, -127332, 122115, -59340, -155953, -135677, 56222, 112571, -371200, -119424, -150753, -344376, 109620, 15182, -26599, -60743, -15318, 164243, 144186, 38491, -77876, 89388, -106225, -105695, -525, 214194, 259117, 121200, 86065, -238157, 159655, -149131, -33715, 82546, 201181, 176029, 314788, 75444, -126492, -169406, -154547, 105585, -274413, -420, -168104, -387269, -121242, 28596, -140052, 64932, -87163, -153660, -124504, -9982]
15599b79106b5175C75031A54697a31495j35934R1473G3576b98351J40819J0592
15589a46940k1508e4882C08647g8335C2317b9871B60485b67038A83765b32156
15578B23014A09646c70452n0911F4162a71136C06807b72595J10658A47325C9298
15567b7004n7256j13152A64298o1099a5070B90648r4868J21393j26542h9705j4154
15556a03859c449l15728H176K8283j4061f2461C817a1376A61398c02943c8626
15544b936j66703b3838C7790i8739G5112a26435J1922a0412A61131K70870A77633
15532A66432b52390J24546C9124c6344k664j46593C3848J7991N6379l2170g8116
15520a94007m0580e7136k03735r6235C36460c22664a01363E1285J01863n7848
$$ y = [-279106, -25175, 375031, 154697, -131495, -267429, -175956, 73576, -298351, -157532, -146940, -168448, -54882, 308647, -78335, 32317, -29871, 260485, -267038, 183765, -232156, 223014, 109646, -370452, -421363, 64162, -171136, 306807, -272595, -161937, 147325, 39298, -27004, -84260, -197412, 164298, 103199, -15070, 290648, 195780, 317173, 190631, -89705, -103859, -3449, -319177, 8176, 36459, 22398, -62461, 3817, -11376, 161398, -302943, -38626, -2936, -169639, -23838, 37790, -98739, 75112, -126435, -114513, -10412, 161131, 432001, 177633, 166432, -252390, -127844, 39124, -36344, -39008, -185601, 33848, 51839, 108218, 76048, -78116, -194007, -234587, -57136, -260871, -357106, 336460, -322664, -101363, 51285, 153148, 95300]
15510I5300b824E2404c86585a45460A31303b74006L1213d6305k2809A91414J19548
15499C10962l0344d3862E6014a57187d8057E5494K67941c3169F14J12733j9701
15488I3646b80929A51449K34242A62954a41869B67035A29104B7093d8920k12082
15478b61002E1701K12115a00802q2809m6024E0375D710f0613j12431d1590E9775
15466a10450A46594b68294b8809A43170g5777G9976a64894A01042a25079a1401
15455I3767a3574j83289G9989d4691J8476B41265a15226j8455K5105l61346b08056
15443a69575E492d5026A27311c8325A51084B0476e28120a43344d2061g376N02
15432f874k16166A96783d1194A3528J69168b7152A90028d6833m8508B13931l5170
$$ y = [95300, -2824, 52404, -386585, -145460, 131303, -274006, -242793, -46305, -69114, 191414, 310962, 280618, -43862, 56014, -157187, -48057, 55494, 323435, -33169, 614, 113347, 93646, -280929, 151449, 385691, 162954, -141869, 267035, 129104, 27093, -48920, -261002, 51701, 263816, -100802, -183611, -229635, 50375, 4710, -60613, -173044, -41590, 59775, -110450, 146594, -268294, -28809, 143170, -75777, 79976, -164894, 101042, -125079, -11401, 93767, -13574, -196863, 79989, -44691, -26215, 241265, -115226, -133681, -108576, -469922, -208056, -169575, 5492, -45026, 127311, -38325, 151084, 20476, -528120, -143344, -42061, -7376, -6874, -223040, 196783, -41194, 13528, 182696, -27152, 190028, -46833, -95341, 213931, 178761]
15421A78761a823k13419C3640M2826a13833N2732B88968g5869j85824I915a22927
15409B38337F6888O3804B951Q6949B1296J05121f8805f123B73315D7005b39947
15397a23942q0943Q4815K8601c4381k18014B17949j00346L33628i2335M0127A69033
15385A23758q251J6605b5472A27807b9116j66087d6382D26737d59963B894J32518
15374A35412J45861g562B5685f0913A83921B7368J92358K0435B6740a32751B02958
15362a98272R6547j125D0468b53699A51623c13644e4575A42710k1927a66293A52214
15350B20147o1967q271a45609A2632b27102A47013a26950m3501n087I5661K05043
15339C00704A04307o661a10591A02142N5167a61003q1923A27617J35421b3604
$$ y = [178761, -1823, -215242, 33640, 76466, -113833, -61101, 288968, -75869, -261693, 9915, -122927, 238337, 66888, 130692, 2951, 89900, 21296, 126417, -68805, -6123, 273315, 47005, -239947, -123942, -204885, -120070, -91469, -34381, -252395, 217949, 117603, 451231, -92335, -52208, 169033, 123758, 115507, 132112, -25472, 127807, -29116, -195203, -46382, 426737, -459963, 2894, 135412, 281273, -7562, 25685, -60913, 183921, 27368, 219726, 240161, 26740, -132751, 202958, -198272, -101725, -102850, 40468, -253699, 151623, -313644, -54575, 142710, 120783, -166293, 152214, 220147, 158180, 149909, -145609, 12632, -227102, 147013, -126950, -170451, -175538, 95661, 300704, 104307, 97646, -110591, 102142, 157309, -161003, -242926, 127617, 263038, -23604]
15328b06728F0869M751d10751B3744f2550H2500b51036a09232M8224k26282B1592
15316B4225J14506n7051K21248f0871i220F2064a0778E978J77300K26295a592
15304A67833O2815K28627B13027P8068A6487a64391m272J4271D27097d2396D3387
15292I2206j8442C3762a34128F972R490a11069a6820k31158A93392f9299n6803
15281a26102A08024n1262h6849B77782F7097O814f5763a6511r4312B14753B8386
15269a63534C5304b06730O6873c0624A12850m9973K6126L6570P024c43872d1757
15257C37868J79556E1184A1608O3323a30522A52406K1508J62752M8084Q36695
15247A221445K97594k74924K5191l03636D19626o3109F7627M009J55551J0496
$$ y = [-206728, 60869, 65620, -410751, 23744, -62550, 82500, -251036, -109232, -61008, -287290, 21592, 24225, 138731, 81680, 302928, -60871, -9220, 62064, -10778, 5978, 183278, 409573, -1592, 167833, 230648, 459275, 213027, 291095, 16487, -164391, -168663, -154392, 427097, -42396, 43387, 92206, 73764, 33762, -134128, 6972, 16462, -111069, -16820, -247978, 193392, -69299, -126102, 108024, 56762, -86849, 277782, 67097, 73911, -65763, -16511, -110823, 214753, 28386, -163534, 35304, -206730, -139857, -30624, 112850, 62877, 89003, 125573, 132597, -343872, -41757, 337868, 517424, 51184, 11608, 74931, -130522, 152406, 173914, 336666, 384750, 1221445, 1519039, 1244115, 1269306, 965670, 419626, 356517, 67627, 71636, 227187, 237683]
15237B37683c08497E1371J76944r7727N3830a04348J0209j17024A86517b27810
15226D10053d04097a97041k06010A663J49443n006b7878E9001e6853j8268q2490
15215a57611A29408b64612a26445B646J54220P2443J8146D7963P6886f3905G2266
15203D1993c62218A89516A8079L8131c36225B59689j01273A169i1057p7206N0808
15192a17455m7363O8430B48754h3653D63b32333G585M22340A88266I3066l2111
15181F0955e5841b6069A60788E8993B4443K09341A7847L8461J32281b99013I3296
15169B61670b9672B30543a14629E5464J31814J17900C9502K7008J94383e6327
15158A17903a03399C36868q4855c0523C08618B8997h2466j09058b6181l7783k9785
$$ y = [237683, -308497, 51371, 228315, 130588, 184418, -104348, -94139, -211163, 186517, -227810, 410053, -404097, -197041, -403051, 1663, 151106, 146100, -27878, 59001, -56853, -75121, -157611, 129408, -264612, -126445, 2646, 156866, 229309, 247455, 47963, 124849, -63905, 72266, 41993, -362218, 189516, 18079, 56210, -336225, 259689, 158416, 1169, -91057, -168263, -117455, -164818, -96388, 248754, -83653, 463, -232333, 7585, 429925, 188266, 93066, 60955, -55841, -26069, 160788, 58993, 24443, 233784, 17847, 56308, 188589, -299013, 93296, 261670, -29672, 230543, -114629, 55464, 187278, 305178, 39502, 66510, 260893, -56327, 117903, -103399, 336868, 252013, -30523, 308618, 28997, -82466, -191524, -26181, -63964, -93749]
15147i3749A87848n6759c0167D9578O5513B9133J32898D1748Q1711f5683B89845
15135I8385P6380j1734K4356a00017A72691O7357H0470J06261h6768B3095a836
15123C75190A10540E2757L3746J009f4759A01975C9291a1075E013J29790n5141
15112G9662b00256F74984A28396K25765f6334D7255O1611J34332i465m6835B09443
15100B39384j12524Q2675G9422j2761k6543J2269K56636A14352M3885o2582c04614
15088g9135F3769N1575m0677A0105f808C66580r6062R6162i1329B39585o8936
15077A70649h0088l8605B08763J44395R4323f5154B9659J22206a04381P271A1629
15065C97245b44923G7696M32652H4501J14844f9371B7682a55888A79718O646L9396
$$ y = [-93749, 187848, 131089, -30167, 49578, 115091, 29133, 162031, 41748, 123459, -65683, 289845, 98385, 174765, 163031, 187387, -100017, 172691, 240048, 80470, 186731, -86768, 23095, -1836, 375190, 110540, 52757, 86503, 87512, -64759, 101975, 39291, -11075, 5013, 134803, 79662, -200256, 674984, 128396, 354161, -66334, 47255, 108866, 243198, -9465, -56300, 209443, 239384, 126860, 209535, 79422, 66661, 40118, 52387, 309023, 114352, 158237, 95655, -304614, -79135, 63769, 115344, 74667, 10105, -6808, 366580, 270518, 366680, -91329, 239585, 170649, -80088, -118693, 208763, 353158, 447481, -65154, 29659, 151865, -104381, -97110, 11629, 397245, -244923, 77696, 510348, 84501, 199345, -69371, 27682, -155888, 179718, 186364, 225760]
15054B25760a60350B75880b3403B87147j34850F4761Q1773k86K7778N060c3002
15042F3509O5297L3444j6586b14927J8829a4997C7929A5400K61140f7619A49558
15030B21841L2677j26880j8354K1436a89840h3637b6111A27514J6688K44583A00586
15018B45727m1911J28598A20470K32020J9645A40930a91184B0117J30342K09577
15008C60036J698m4750N9311c1925l5482b9954B47756A01856i0692A19995A2958
14996B46754B8615J94228O8966O8624j69373a763A73001K5675J24600c1608A75639
14984e5300H7680Q7875J80317o7234M0584h6798A63271a08620B5773L85895A06831
14972B55616O0290J08310o4009J14587G2573J47831k9400K03456j2546f8976B50913
$$ y = [225760, -160350, 275880, -23403, 287147, 152297, 64761, 146534, 146248, 174026, 179086, -33002, 63509, 128806, 162250, 145664, -214927, -196098, -14997, 37929, 15400, 276540, -67619, 149558, 221841, 254518, 127638, 109284, 130720, -189840, -83637, -26111, 127514, 144202, 388785, 100586, 245727, 203816, 332414, 120470, 352490, 372135, 140930, -191184, 20117, 150459, 360036, 361734, 316984, 376295, -31925, -67407, -29954, 247756, 101856, -90692, 119995, 12958, 246754, 28615, 222843, 291809, 360433, 191060, -1763, 173001, 198676, 323276, -31608, 175639, -55300, 87680, 175555, 355872, 288638, 329222, -86798, 163271, -108620, 25773, 411668, 106831, 255616, 315906, 424216, 360207, 474794, 72573, 220404, 191004, 394460, 381914, -68976, 250913]
14960E47877B28792K93189j72420l2084N3425j38344J73505q4097F5942J68006
14950B33948N7253n8396J36139j1602A55114j2438m5364K44916A49287N6145e4699
14938A67282J32842j03587n9013K37917j60111K63829j1087B00468J04134L12671
14928F17273B43116J30451P2545k22562L4036E1215K55658q7188J37242j35803
14918B21124L60649B77008l4748e0792j44286G5950K00393O0487R8759o2464c0903
14906G4989J53804K3032A12676O0952J01832B7108M27880I5393J62102O6478L751
14895C27724j11804o8114J32098L2236j35768L7557J58028i6625D84580a7095
14884E00311k35315L51909B81198G4776P7619K42157r964A41628K84656J92511
$$ y = [547877, 228792, 521981, 349561, 317477, 370902, 232558, 406063, 321966, 65942, 233948, 291201, 232805, 368944, 357342, 155114, 142676, 97312, 342228, 149287, 205432, -54699, 167282, 300124, 196537, 137524, 375441, 215330, 479159, 468072, 200468, 304602, 617273, 243116, 373567, 446112, 223550, 257586, 51215, 306873, 219685, 356927, 221124, 581773, 277008, 242260, -50792, -195078, 75950, 276343, 336830, 435589, 373125, -30903, 74989, 228793, 251825, 112676, 173628, 275460, 27108, 454988, 95393, 257495, 323973, 327724, 215920, 147806, 279904, 312140, 176372, 213929, 371957, -96625, 484580, -17095, 500311, 264996, 616905, 281198, 74776, 152395, 394552, 384588, 141628, 426284, 618795]
14874F18795k73533J24457n2712M02406C63602a60591F84720A92874J50676J94241
14864E37791N0207A49478M51883A50366M68812k11649J77622k83195J74664B35056
14853B92903j3812D2059L85418J11449k9363j82514q2949K13511o4263l0561r4969
14842B67818A10361L36686j48945N9081p2542R3130A29957J74462K31582o9382
14832D66619M5417m6985o6763E6743p269M34095P6151k76753J88889J32691k58042
14821C46505K67736k66969J65116j69939K28157B05145M27700q9252R5080N4965
14811F93638M3245k28273J52751B79923J68966K65573r1776m4750j34439L1504
14801D75001j63078J12050j37152M46525C51396L51205j13272q4021L37947k16244
$$ y = [618795, 345262, 469719, 417007, 819413, 363602, -160591, 684720, 192874, 343550, 537791, 587998, 149478, 601361, 150366, 619178, 407529, 585151, 301956, 476620, 235056, 292903, 279091, 42059, 427477, 538926, 509563, 327049, 244100, 457611, 393348, 362787, 267818, 110361, 447047, 298102, 357183, 284641, 377771, 129957, 304419, 536001, 466619, 512036, 465051, 398288, 56743, 49474, 483569, 559720, 282967, 471856, 604547, 346505, 614241, 347272, 512388, 342449, 570606, 205145, 632845, 543593, 638673, 693638, 736883, 508610, 661361, 279923, 448889, 714462, 622686, 577936, 443497, 475001, 311923, 423973, 286821, 733346, 351396, 702601, 589329, 505308, 843255, 627011]
14791F27011l0319o8943j10911P2378J68838k79233L56724j96109N7113M1054
14781F37603r3428r0578K24826B89602L90767j73721k08978O25484k79828r6006
14771E47320K47684k85356K62743k62460q4909j53843O09759j66204C11562J13790
14761D25352K4817r2407o2304L83929r0908J80395J3857p0091o2228J2495C06190
14749G74764J3392l36381j51835L87308o1619J66590k38738J19949k88323J03426
14739D88533J39513K1959C06422M76844m9698B74233L79125J55265k83505R1651
14729F16769R9670J88969m06626O7170K54132P8077j46653k95079L09537r2510
14719F73456J89135J43109l40268J76633o5110L2444k58690K29085K63985j62541
$$ y = [627011, 596692, 527749, 416838, 489216, 658054, 378821, 735545, 539436, 596549, 637603, 544175, 453597, 678423, 289602, 680369, 506648, 297670, 923154, 643326, 547320, 795004, 509648, 772391, 509931, 425022, 271179, 880938, 714734, 311562, 425352, 450169, 357762, 295458, 679387, 588479, 768874, 782731, 712640, 650412, 662907, 306190, 774764, 788156, 451775, 299940, 687248, 625629, 792219, 553481, 673430, 385107, 488533, 628046, 650005, 306422, 783266, 733568, 274233, 653358, 808623, 525118, 616769, 716439, 905408, 498782, 565952, 820084, 898161, 751508, 456429, 765966, 673456, 862591, 1005700, 665432, 842065, 776955, 809399, 550709, 779794, 1043779, 881238]
14709H81238l30039K91226r5788j12350K67716J3145D08350r6M48510J04530k94243
14698F67051J20896J29316o8640l0244j11790j205J97366J8471m3445J56443p7912
14687I56307J7669j47993n9297K62984k51548j90097M44268J6721m9925j40754
14677H58335J6479l1036J66037j88901K69300q9207j25539K90481p1242L6954
14667A131661m06858K76377k21153M56346l99611N45376k51703L87531j39237
14658A378729P411j68320k84927K63908P3993L0351J92783j47058m88108J79689
14648A038451L15459l83366J38426j78654J69426K43039l05159K60984l79184
14639I19422J55354L62997M3587j12161M1647r7546q7238k7069L4672J71619J11040
$$ y = [881238, 551199, 842425, 746637, 634287, 902003, 915148, 408350, 408254, 856764, 961294, 667051, 787947, 917263, 848623, 818379, 706589, 705384, 902750, 921221, 877776, 1034219, 956307, 973976, 825983, 766686, 1029670, 778122, 588025, 1032293, 1049014, 999089, 858335, 874814, 843778, 1009815, 820914, 1090214, 1001007, 875468, 1165949, 1094707, 1131661, 724803, 1001180, 780027, 1236373, 836762, 1382138, 1130435, 1517966, 1378729, 1386140, 1217820, 932893, 1196801, 1270794, 1301145, 1493928, 1346870, 858762, 1038451, 1353910, 970544, 1108970, 930316, 1099742, 1342781, 1037622, 1298606, 919422, 1074776, 1437773, 1481360, 1369199, 1410846, 1313300, 1226062, 1198993, 1233665, 1405284, 1516324]
14628A516324k32488K12848l48069L86201J9690m09909P4504K76154k69917J05797
14618A331135O8470j32638J75408j34639K09982j40832K77191l3050L705j61213
14608A463519M3988P6229J6978o2984j46822L42746m1546m46504K29442L52447
14598A827493L6427m02023J56722n9803J41612q5263K8040L35218m8423k65637
14588A664363j8857Q2930K99510J14019j98376k19161K65500M5103J47320J10131
14578B292482m91353L28010L4314o0356P2848j7122k3532k5351j06268K99549
14568B303221p5151N0055M32210l07818k7769N5243J03063M08411o1878k11914
14558B667673J26516K77952J62570K25368J6840K41463M85609N76745J308125
$$ y = [1516324, 1283836, 1496684, 1148615, 1534816, 1554506, 1144597, 1219101, 1495255, 1225338, 1331135, 1399605, 1266967, 1442375, 1307736, 1517718, 1376886, 1654077, 1621027, 1624732, 1463519, 1507507, 1583736, 1600714, 1537730, 1390908, 1733654, 1692108, 1245604, 1475046, 1827493, 1863920, 1461897, 1618619, 1558816, 1700428, 1615165, 1643205, 1978423, 1930000, 1664363, 1645506, 1728436, 2027946, 2141965, 1943589, 1724428, 1989928, 2035031, 2182351, 2292482, 1801129, 2129139, 2163453, 2103097, 2175945, 2158823, 2135291, 2109940, 2003672, 2303221, 2228070, 2278125, 2710335, 2402517, 2374748, 2429991, 2533054, 2941465, 2879587, 2667673, 2794189, 3072141, 3234711, 3460079, 3476919, 3718382, 4203991, 4780736, 6088861]
14549F088861K297673M330156Q001826J5334065P141803j9328018A1517126E522551
14540C301970r95355Q0945n34176J61729Q5416P9682j69193L1492J42859j82525
14530B002844J09918k12822J69165K25761M3811l34854r0715O40414R9632J09579
14520B762733k65474J41117K7627k98673L94554J07199k61756N91199n79996K23640
14510B842170J15240l20829L17979l3647o5930K46674K77695m4892l97136M69999
14500C407323l59090L5278P2295m9170K33399J44728n8075J33899o3746P151K39117
14489C743109q0677J18651k46727K94751j59660J40554o1288L07923k07782o8338
14479C780516L31366L3775K19025J08015n21592J93374L31184J69949o01941J75571
$$ y = [6088861, 8386534, 12716690, 20718516, 36052581, 43194384, 23866366, 11517126, 5522551, 3301970, 2306615, 2387560, 1853384, 2015113, 2100529, 2180211, 2011018, 2042510, 2185369, 2002844, 2112762, 1899940, 2069105, 2294866, 2338677, 2003823, 1913108, 2553522, 2653154, 2762733, 2497259, 2638376, 2666003, 2367330, 2761884, 2869083, 2607327, 3198526, 2618530, 2842170, 2957410, 2636581, 2954560, 2920913, 2854983, 3101657, 3379352, 3334460, 2937324, 3407323, 3048233, 3083511, 3155806, 3106636, 3340035, 3484763, 3426688, 3560587, 3496841, 3503992, 3743109, 3662432, 3781083, 3534356, 3829107, 3669447, 3810001, 3748713, 4056636, 3848854, 3780516, 4111882, 4145657, 4364682, 4472697, 3951105, 4144479, 4475663, 4645612, 4043671, 4219242]
14469D219242K61514j53443M941M75936o53333N83980R9501j88998K26520l08368
14459D567492O16007k78876J30788J82053j16296L44821r8011J32229m7939K03576
14449E635844l0316J97131j55196M41720k96283J52773K05079j06353P1169L31100
14439F446668o7767j25886K18271J17254K93743O9671j29909J52051n8590k4965
14429F890541O53405l64612L48565o8717L04680k8275j02360K98689K31651m37283
14419G726284P22109k57686J9165M47019J92411k14944N59008k66296O0174M0746
14409I027990N59938J3363M98005l50747N48942J36720o7751j09581K97185K36045
14399A0790109j8096P19678L963L33031l16201M71077J70461K36295N15171j49024
$$ y = [4219242, 4480756, 4327313, 4332254, 4808190, 4154857, 4738837, 4838338, 4649340, 4875860, 4567492, 5183499, 4904623, 5035411, 5217464, 5101168, 5445989, 5347978, 5480207, 5432268, 5635844, 5605528, 5802659, 5647463, 6089183, 5792900, 5945673, 6150752, 6044399, 6115568, 6446668, 6378901, 6253015, 6471286, 6588540, 6882283, 6951954, 6822045, 6974096, 6915506, 6890541, 7543946, 7179334, 7527899, 7459182, 7763862, 7735587, 7633227, 7931916, 8163567, 7726284, 8448393, 8190707, 8209872, 8656891, 8849302, 8634358, 9193366, 8927070, 8987244, 9027990, 9587928, 9601291, 10099296, 9748549, 10297491, 10434211, 10366460, 10256879, 10554064, 10790109, 10772013, 11491691, 11495654, 11828685, 11512484, 11983561, 12154022, 12390317, 12905488, 12756464]
14389A2756464L72858l966K69244K10361L21724J15423M12976M96202p0781J53138
14379A5033643L66746L95390M44292J03052K51771M18826N47262L81062N8438
14370A8000482M05213N71639o908O00817J48344N81710K53281N33001R14741J82033
14360B2184353Q22143K54013K95259N52967N69020N99539P62111M77690O23725
14351B7140820O02830Q15743M17519J096481O75308R03995O47762Q23449Q65932
14342C3989839O95400J011133P75232J292820O90277J478564J045009J423269
14334D2401543Q16802J697547J256542R26814J888330J214240J815227J694436
14326E3711481J967358J339014K380452J849856K054151K164449K588283K075852
$$ y = [12756464, 13129322, 13125356, 13394600, 13604961, 13926685, 14042108, 14455084, 14951286, 14880505, 15033643, 15400389, 15795779, 16240071, 16343123, 16594894, 17013720, 17560982, 17942044, 18000482, 18405695, 18977334, 18970426, 19571243, 19719587, 20301297, 20554578, 21087579, 22002320, 22184353, 23006496, 23260509, 23555768, 24108735, 24677755, 25277294, 26039405, 26517095, 27140820, 27743650, 28559393, 28976912, 30073393, 30748701, 31652696, 32300458, 33123907, 33989839, 34685239, 35696372, 36471604, 37764424, 38454701, 39933265, 40978274, 42401543, 43218345, 44915892, 46172434, 47099248, 48987578, 50201818, 52017045, 53711481, 55678839, 57017853, 59398305, 61248161, 63302312, 65466761, 68055044, 70130896]
14318G0130896K349559L086966K740846K628432L621947K873566L521932L620047
14310I4574191L593468M220231M524795M362796M613432N467343N115404N924646
14302A32396306N860595O237864O412698P087831P886310Q023920Q158365Q937259
14294A91001148R439861R659970J0415467J0988236J1085560J2125218J2842402
14287B67557862J2452796J3594770J4009556J4228755J4604859J4685737J4327842
14280C65462177J4638359J4376883J3518772J3090264J1361900J0401165P885165
14273D50734685L710282L18627K84116R78728P15315l722443m723018m542855
14265D43753437p224803r553262j0421742j2502875j3588671j4243819j4726291
$$ y = [70130896, 72480455, 75567421, 78308267, 80936699, 84558646, 87432212, 90954144, 94574191, 98167659, 102387890, 106912685, 111275481, 115888913, 121356256, 126471660, 132396306, 138256901, 144494765, 150907463, 157995294, 165881604, 173905524, 182063889, 191001148, 200441009, 210100979, 220516446, 231504682, 242590242, 254715460, 267557862, 280010658, 293605428, 307614984, 321843739, 336448598, 351134335, 365462177, 380100536, 394477419, 407996191, 421086455, 432448355, 442849520, 450734685, 454444967, 454763594, 455047710, 456026438, 456741753, 453019310, 448296292, 443753437, 436528634, 426975372, 416553630, 404050755, 390462084, 376218265, 361491974]
14258C61491974j5110386j5810772j4998290j4260875j3646860j3537916j3491792
14251B60635083j2738666j1944415j1524020j0841378j0547883r977396q780410
14244A84280915q526463p980582q074614p099119p367199o036711o166128n523180
14236A27506919n586590n498625m476246m682636m266916l979526l993661l471081
14228I1551638l576796l514614l250823k878543k832283k804830k362849k162004
14220F8168896k353325k296707k041622k152051j867485j754353j605380j423134
14212E2674839j935599j487137j592925j139450j518423r22794r48024j439953
14204D1690534j713564o86881j262132o10351o74801j316767o29695j271542p50176
$$ y = [361491974, 346381588, 330570816, 315572526, 301311651, 287664791, 274126875, 260635083, 247896417, 235952002, 224427982, 213586604, 203038721, 193061325, 184280915, 175754452, 167773870, 159699256, 152600137, 145232938, 139196227, 133030099, 127506919, 121920329, 116421704, 111945458, 107262822, 102995906, 99016380, 95022719, 91551638, 87974842, 84460228, 81209405, 78330862, 75498579, 72693749, 70330900, 68168896, 65815571, 63518864, 61477242, 59325191, 57457706, 55703353, 54097973, 52674839, 50739240, 49252103, 47659178, 46519728, 45001305, 44078511, 43130487, 41690534, 39976970, 39290089, 38027957, 37417606, 36742805, 35426038, 34796343, 33524801, 32774625]
14195C2774625p45820q84597l41568j282397p50266k24094r64927o87626k63250
14186B6630080r13761k33042j025776k01026n71514o58772k67058n70691o16335
14177B1572105k83933n54473k59212l62005m61635l74054l63098m59026l09634
14168A8145035m38827k48410m47516k29792k60816n70697k23955k72398j0956
14159A5441668k1561n96519k58194j06530o13461l78955K33641k43904m37591
14150A3018594K32880n17635k10052j29202j97670k93564j00881k69240j21831
14141A1411399m20625l75180J84843p8852k46853r4831k35230L0593l89131k71740
14131I514393L23547m98646J17706l05791r1119n2914r4702p8725n48259K06793
$$ y = [32774625, 32028805, 31144208, 30802640, 29520243, 28769977, 28545883, 27580956, 26893330, 26630080, 25716319, 25483277, 24457501, 24256475, 23684961, 23026189, 22759131, 22188440, 21572105, 21288172, 20733699, 20474487, 20112482, 19650847, 19276793, 18913695, 18454669, 18145035, 17706208, 17457798, 17010282, 16780490, 16519674, 15948977, 15725022, 15452624, 15441668, 15420107, 14823588, 14565394, 14458864, 13845403, 13466448, 13700089, 13456185, 13018594, 13251474, 12733839, 12523787, 12394585, 12196915, 11903351, 11802470, 11533230, 11411399, 10990774, 10615594, 10800437, 10721585, 10474732, 10379901, 10144671, 10175264, 9786133, 9514393, 9837940, 9339294, 9457000, 9151209, 9060090, 9007176, 8912474, 8833749, 8285490, 8492283]
14121H492283k13403j90923J4264j55411M6729Q501l05060k0078k4726L8214m55503
14110G234887K50008m63454J80022o2408j68126k50993J93371j03558k87372l42838
14100F179539K79144m3243k53133p3151Q0966l8101j81418J49153r3602r5760
14090E910394j58703K9932J14376n98291P6287K62414l19364j35987j51694l1549
14080D997815J25364Q6520l35253M81071l36711J10920o14535J90857J00175J9981
14070D826204L3807l18447q8132O0933j44166O320L288M9701m1039l56485L1087
14059D063071r5346K44014q9618J14747j07692l18847L95235n54509q5111Q5358
14049C651302m1843J64497p465k99496L8848K34928M5101j18950k41501K2179
$$ y = [8492283, 8278880, 8087957, 8102221, 7946810, 7993539, 8002040, 7696980, 7676902, 7652176, 7690390, 7234887, 7484895, 7021441, 7201463, 7139055, 6970929, 6719936, 6913307, 6809749, 6522377, 6179539, 6458683, 6415440, 6162307, 6089156, 6170122, 6132021, 5950603, 6099756, 6006154, 5910394, 5751691, 5781623, 5895999, 5297708, 5373995, 5636409, 5317045, 5181058, 5029364, 4997815, 5123179, 5209699, 4874446, 5355517, 5018806, 5129726, 4515191, 4706048, 4806223, 4826204, 4860011, 4541564, 4453432, 4514365, 4370199, 4376519, 4379807, 4429508, 4388469, 4031984, 4063071, 3967725, 4211739, 4122121, 4236868, 4129176, 3810329, 4205564, 3651055, 3565944, 3651302, 3609459, 3773956, 3766491, 3466995, 3505843, 3740771, 3785872, 3666922, 3425421, 3447600]
14039C447600K15975q9678j61868R2392p0081l18078L77454l56433L79030m13166
14029C103147J43742J42664k54806J48680n0633j49914r3739K75028j95615k17566
14019B850988j56880l91277M40603L65679m4236k72674P8416m3402j77836K68830
14009B918211j45349k4600m28576L99110j57023r6421N22252p06135M47009L4355
13999B762833m10293J37910n38153M1193J73133L2455L6882l23066Q72330M98354
13989C283578J284377K973110O549557J5672051J3487035j5398029j2093816o701393
13981I056470k396908j410822o08088p68065l57904Q5160l58754j57394j84961
13972B898734o7954j14953q5688K14010j67076P410j23809j85342L84276m97241
$$ y = [3447600, 3663575, 3573897, 3412029, 3504421, 3434340, 3116262, 3493716, 3137283, 3516313, 3103147, 3246889, 3389553, 3134747, 3283427, 3232794, 3082880, 2989141, 3264169, 3068554, 2850988, 2694108, 2302831, 2743434, 3109113, 3064877, 2792203, 2870619, 2827217, 2649381, 2918211, 2772862, 2748262, 2319686, 2718796, 2561773, 2465352, 2987604, 2281469, 2728478, 2762833, 2352540, 2490450, 1952297, 1993490, 2166623, 2199078, 2235960, 1912894, 2785224, 3283578, 4567955, 7541065, 14090622, 29762673, 43249708, 27851679, 15757863, 9056470, 6659562, 5248740, 4640652, 3872587, 3514683, 3599843, 3241089, 3083695, 2898734, 2830780, 2715827, 2630139, 2844149, 2677073, 2684483, 2560674, 2375332, 2759608, 2262367]
13962B262367r2071K19563j49535J06694j27495J10876n65712K54068K10896o6787
13952B162864J63465p21867M35556j72995M24466p9488J8925l74807L17047n3367
13942B119799q0624K6459j11971k94665L80119l40520K68865j95177Q1353J79612
13932B033250k51776j01342K12062j03010k28213K43937R7841j92682L3109j11480
13922A631696j27123L33095P479m42369L27254j87747j13301M82198m78643M8236
13912A480775j36763K14401K10337k8121L9324k97036K73221m6236l03415J04548
13902A511035J318J08544K40698m34285O5384P743L00313o57476K87974j01529
13892A329719J79296J24077m14152K15507o6446L6602K10099Q1750j72059L9918
$$ y = [2262367, 2170296, 2389859, 2240324, 2347018, 2219523, 2330399, 1764687, 2018755, 2229651, 2162864, 2326329, 1604462, 2040018, 1867023, 2291489, 2212001, 2230926, 1856119, 2173166, 2119799, 2039175, 2065634, 1953663, 1658998, 2039117, 1698597, 1967462, 1772285, 1853638, 2033250, 1781474, 1680132, 1892194, 1789184, 1560971, 1804908, 1902749, 1710067, 1743176, 1631696, 1504573, 1837668, 1845147, 1402778, 1730032, 1542285, 1428984, 1911182, 1432539, 1480775, 1344012, 1558413, 1768750, 1740629, 1779953, 1482917, 1756138, 1709902, 1406487, 1511035, 1512353, 1620897, 1861595, 1427310, 1492694, 1500437, 1800750, 1143274, 1431248, 1329719, 1509015, 1633092, 1218940, 1434447, 1368001, 1404603, 1614702, 1696452, 1524393, 1564311]
13882A564311k81850l24158M39909j60274Q9276O0292j75176k1288J592j10943
13872A081691J87088K9300J60612k32395J58497l27808L00519q1783j50595J7735
13862A142861k90960J52431J36512j31714M22411j88896J09074n54507L07638
13853A104850L86183l08981l03203L17779k30300j07478N10399j90062j3152k53357
13843I12678L22762j68959m36332J67808Q4822k54963J49815L30190j1957m8085
13833A047779N0463k37750k15421K34552K34888l59567K62915j23492K16794J20371
13823A231532k70221K8852K56668k89202j35730j46159K26310k1791K0317o3212
13813H37364M919L20574j363J67222l86977r6739o6515L12791k90695K51136O1654
$$ y = [1564311, 1282461, 958303, 1398212, 1237938, 1327214, 1387506, 1212330, 1191042, 1192634, 1081691, 1268779, 1298079, 1458691, 1226296, 1384793, 1056985, 1357504, 1275721, 1125126, 1142861, 851901, 1004332, 1140844, 1009130, 1431541, 1242645, 1351719, 797212, 1104850, 1491033, 1182052, 878849, 1196628, 966328, 858850, 1369249, 1179187, 1166035, 912678, 1235440, 1066481, 630149, 797957, 882779, 627816, 777631, 1107821, 1095864, 1047779, 1098242, 860492, 645071, 879623, 1114511, 754944, 1017859, 894367, 1111161, 1231532, 961311, 990163, 1246831, 957629, 821899, 675740, 902050, 880259, 900576, 837364, 842283, 1162857, 1161494, 1328716, 941739, 845000, 778485, 1091276, 800581, 1051717, 1113371]
13802A113371J4058k24483L7048q1287j29340M75809r5206j93763k06038k3756
13792F86413J05254L4203J59970l88672M33959k71501J11065L05366p7708k90353
13782H07996n5581M32692m04713m0732K09745l3370k01388J35898M3179Q8047
13772I81773K3650k44809K86723l65635K3413l5471K28434o6880l5300k06998
13762E88900Q5301L27957k00217n8519j81908O8821Q3734j87443M21427j40529
13752H07524j14725k1450j09576J55551j11228L25574r2133n4164j58864j35935
13742D90574K02997J04563J99358l36410j83712K62898o1541M00286n06747r3038
13732D79228L71219j64964k94245Q3042J98699n3991K3549M88450n60426L8180
$$ y = [1113371, 1127429, 902946, 939994, 858707, 729367, 1205176, 1109970, 916207, 710169, 686413, 791667, 825870, 985840, 597168, 1031127, 759626, 870691, 1176057, 1098349, 807996, 752415, 1185107, 780394, 739662, 949407, 916037, 714649, 850547, 893726, 981773, 1005423, 760614, 1047337, 681702, 705115, 669644, 898078, 831198, 795898, 588900, 674201, 1002158, 801941, 743422, 561514, 630335, 714069, 526626, 948053, 807524, 692799, 671349, 561773, 717324, 606096, 931670, 839537, 785373, 626509, 490574, 693571, 798134, 997492, 661082, 477370, 740268, 678727, 1079013, 572266, 479228, 850447, 685483, 391238, 474280, 672979, 618988, 642537, 1130987, 570561, 608741]
13722F08741L79908k2250p2493l78963q7156J21469o7141R204p4265M33666j29359
13711G21361p892o9528l3622R1024j69526K78111k33408p2507O7751O1528M1451
13700F74743j08134M06687k36348J45229k77969K6399P1933k89225j10407K26356
13690E29264j20455K32959j28929M7799m3728L22172B80222K14052l8815K84775
13680G40234j90313j79933j05525K82551j21210K14783l14708L92146j45065k67996
13670C04964n8285N32155B61173j19946M38743m5560m5853K21657l39857M32850
13660H03207k80756A41573M30970K46122p5921j61720J46204A72786J66918J98139
13650E37843B66600M8370J14713j11377n2146J63369J1118B05754K57386K6057
$$ y = [608741, 988649, 966399, 893906, 514943, 427787, 549256, 482115, 491319, 417054, 850720, 721361, 713469, 643941, 610319, 701343, 531817, 809928, 576520, 504013, 571764, 633292, 674743, 566609, 973296, 736948, 882177, 604208, 630607, 702540, 413315, 302908, 529264, 408809, 641768, 512839, 560638, 516910, 839082, 280222, 494274, 455459, 740234, 549921, 369988, 264463, 547014, 425804, 640587, 325879, 718025, 572960, 304964, 246679, 778834, 261173, 141227, 579970, 534410, 488557, 710214, 370357, 803207, 522451, 141573, 572543, 818665, 742744, 581024, 727228, 172786, 339704, 537843, 266600, 314970, 429683, 318306, 266160, 429529, 440647, 205754, 463140, 489197]
13640D89197p6145L45053l1936j26299H9389K54768l966L2975j03824O8632K15825
13629E53799P9328k18349n7719O3654n4754J77982j29286k5433O6840J24376L7863
13618F18301o1377k03047M94828l72349A40139N27038l32563M08320C13862m3460
13608B70402J09479k7071J86483M7510L6659k89612J02485J21731k03913K91603
13598F45756A73035J01152K43404k25183J9395H9779K40876r3798H3875K10313
13588B94188K14909o5048A44682L84706r8177J3217J05740k0399j80432M4007
13578C93344j75145l7207J19795O1954O1482J69495k67717F9257L6982R1205J02461
13567B99905K57506j25104J97842B32024L66560k75164J2643J25312N8703j4870
$$ y = [489197, 413052, 758105, 726169, 599870, 89389, 344157, 340191, 373166, 269342, 337974, 553799, 633127, 414778, 357059, 420713, 365959, 543941, 414655, 389222, 456062, 580438, 618301, 556924, 353877, 848705, 476356, 140139, 667177, 334614, 742934, 313862, 270402, 379881, 352810, 539293, 586803, 623462, 333850, 436335, 558066, 354153, 645756, 173035, 274187, 517591, 292408, 311803, 89779, 330655, 236857, 83875, 294188, 509097, 444049, 144682, 529388, 431211, 444428, 550168, 529769, 349337, 393344, 218199, 180992, 300787, 362741, 424223, 593718, 326001, 69257, 106239, 197444, 299905, 557411, 432307, 630149, 232024, 598584, 323420, 336063, 461375, 520078, 505208]
13557E05208J50913A38821J01165J24405K08784B12217J00453J17316j51035J78465
13547D57416A85797J64880m6116q0281J56383J39970j50675J47026J06457j31502
13537D91939D8247J22615D8792K30531a6644C01913K3468o7610K1261J36238K72558
13526F87828B39515J71190R4529A08810K76346J35758B45253P8104R7992A01809
13515a1292A30686J98719K91436A29485f1363A49576K20864j30814J80473R8147
13505E18246A36949J31093l7553r2036L1408L59487A64717P701L13003j28931
13495C56490A74477J27108A08218Q6892J16483A25818L54924j48338A40811L13859
13485D54670A95948L53816N9785A80183Q0198O8295L4732r0067K68079A56319
$$ y = [505208, 656121, 138821, 239986, 364391, 573175, 212217, 312670, 429986, 278951, 457416, 185797, 350677, 304561, 224280, 380663, 520633, 369958, 516984, 623441, 491939, 48247, 170862, 48792, 279323, -16644, 301913, 325381, 257771, 279032, 415270, 687828, 239515, 410705, 505234, 108810, 385156, 520914, 245253, 323357, 421349, 101809, -11292, 130686, 329405, 620841, 129485, -61363, 149576, 370440, 239626, 420099, 518246, 136949, 268042, 230489, 138453, 169861, 529348, 164717, 172418, 485421, 356490, 174477, 301585, 108218, 195110, 311593, 125818, 480742, 332404, 140811, 454670, 195948, 549764, 609549, 180183, 260381, 328676, 363408, 273341, 541420, 156319]
13474B26483K39281I5632L07520R7989j63416k169j63904N4805D8165M0776L41521
13463D30462J01214k23300J422j19815K63004A8940K36280G7607J43109g0665
13452A98041R7023R483N5838r5976P7210C0988e819E09816q3436A47397R8923
13441B46320p3294R6368q5476n4446Q4592j6749K67981I0355R3010A7055L36544
13430C53599A10307e9816B42360J21615A25253M2938J23130g0057B33716j5908
13420B17808I8713K79092H4651m704a3134E85909A72782H5268J04704J38751R8898
13409D27621A45050K96892l778A86642J11982p442Q7983G5580K88628A18515K42
13398A18757J96349M3017A70126a8391B67723J72987A55771J0058J3377f1255
$$ y = [226483, 465764, 95632, 403152, 501141, 337725, 335556, 171652, 226457, 48165, 88941, 430462, 531676, 308376, 309798, 189983, 452987, 18940, 255220, 77607, 220716, -70665, 198041, 295064, 304547, 360385, 264409, 341619, 30988, -5819, 509816, 426380, 147397, 246320, 173026, 269394, 183918, 129472, 214064, 197315, 465296, 90355, 183365, 17055, 353599, 110307, -59816, 242360, 363975, 125253, 168191, 291321, -70057, 233716, 217808, 98713, 377805, 84651, 79947, -13134, 585909, 172782, 85268, 189972, 328723, 427621, 145050, 441942, 438164, 186642, 298624, 291182, 379165, 75580, 364208, 118515, 118757, 315106, 358123, 170126, -18391, 267723, 440710, 155771, 165829, 179206, -61255]
13387A92096k5347k0379J81613L1557G2735J01363L27534B33731H5306a4461I1452
13375B86622L70514B91270E7527Q3906F2624N14176k41520F7029M36928j31818
13365C72139J65414B56785J06171p4611J78375j94485M635a95772A87946J20586
13355C08532M0127M4821p0175L07183j66921A52364A1833L95471q0310j100N1062
13344C76956j45567j2682K65328O6404k45418j00577J39200J28854j7473B8045
13333A58548K22186j32922j07109L48559A73378L35098j27044B9423K36943I3607
13322D58841C6273J98425A09062P0994J23345M1738D6827M70324G5565O7779B5732
13310B80317L2162Q133o3622E5255c1043D84205F4947K51239b63544i3358B80174
$$ y = [192096, 166749, 146370, 327983, 359540, 72735, 174098, 501632, 233731, 85306, -14461, 91452, 286622, 657136, 291270, 57527, 141433, 62624, 576800, 335280, 67029, 503957, 372139, 537553, 256785, 362956, 288345, 466720, 272235, 276870, -195772, 187946, 308532, 348659, 393480, 323305, 630488, 463567, 152364, 11833, 407304, 326994, 325894, 376956, 231389, 218707, 484035, 550439, 305021, 204444, 343644, 472498, 455025, 28045, 158548, 380734, 247812, 140703, 489262, 173378, 508476, 381432, 29423, 266366, 93607, 458841, 36273, 234698, 109062, 180056, 303401, 345139, 46827, 517151, 75565, 143344, 25732, 280317, 312479, 320612, 256990, 55255, -31043, 484205, 64947, 316186, -263544, -93358, 280174]
13298F3182M21278A54250K63281A89729l0271K2885o2987K05638A8827O2880L90142
13287D71849d6994E8652J61957J3835k2886J31400j39760Q0684E4622L54936e9199
13275B65558j8376n6750K01668H0012d9700B67650o0633L07207j31145j11503
13265B71576N7563H9439J525m5312a05428B26163O1856A35419f5819l06473C07613
13253b5931A01791M62804k76308j03189o8056a69492A56589Q565n5759J0084l3778
13242H5701b17073B86462F8374J28144J58500o2834H9678J06169a362A05640J38291
13231B43931H9139K1251R1625i4126j47757b4663k742C33349j3583b4028A72480
13219D03143d966A2516K61737j27574j3772I294d5252A50588K1255F6309K2125
$$ y = [63182, 484460, 154250, 417531, 189729, 159458, 182343, 119356, 324994, 18827, 81707, 471849, -46994, 58652, 220609, 234444, 211558, 342958, 203198, 283882, 54622, 409558, -59199, 265558, 247182, 190432, 392100, 80012, -49700, 267650, 207017, 514224, 383079, 271576, 329139, 89439, 90964, 45652, -105428, 226163, 288019, 135419, -65819, -372292, 307613, -25931, 101791, 564595, 288287, 185098, 117042, -169492, 156589, 165154, 109395, 119479, 85701, -217073, 286462, 68374, 196518, 355018, 292184, 89678, 195847, -1362, 105640, 243931, 89139, 110390, 202015, -94126, -241883, -24663, -27405, 333349, 319766, -24028, 172480, 403143, -4966, 12516, 274253, 146679, 132907, 9294, -45252, 150588, 171843, 66309, 88434]
13208H8434k7103M23178B08617A5976J32663A523a86179h2736p7916L056A21574
13196I4137l551o664F283K60997H6692K93514e5160H5892K00729d3732G2926C0426
13183c7746C966R936K27822J9091b3345G7386B1438K63014i8847j30893C40663
13171A31653O1394E7882a40042j43832A89126I4353J28261A9842a22220c5129
13160A05118J72401a42310F454L24232A28195a9136A40119D8866d4277b1677A74428
13148B32293J55035A46929a58885B04243B7872J98796A03970L6720b2319I1446
13137A75732n4591R0739l0377H9089K96698i4096k92050A43664C8278I308L89270
13126C98578M2106A03903R9447P180J68932k6053j39119p8395N0753H1377P4108
$$ y = [88434, 61331, 484509, 208617, 15976, 148639, 1523, -186179, -82736, -160652, -157596, 121574, 94137, 90586, 83922, 6283, 267280, 86692, 380206, -55160, 85892, 286621, -43732, 72926, 30426, -37746, 3966, 13902, 241724, 260815, -23345, 77386, 21438, 284452, -98847, -229740, 340663, 131653, 193047, 57882, -140042, -283874, 189126, 94353, 222614, 19842, -122220, -35129, 105118, 277519, -142310, 6454, 330686, 128195, -19136, 140119, 48866, -44277, -21677, 174428, 232293, 387328, 146929, -158885, 204243, 27872, 226668, 103970, 140690, -22319, 91446, 175732, 121141, 211880, 181503, 89089, 385787, -94096, -386146, 143664, 38278, 9308, 398578, 440684, 103903, 203350, 210530, 379462, 353409, 214290, 135895, 186648, 81377, 155485]
13115A55485J35628R8436j47526p8967M01776A99089b46326A08881J58566I5052
13104A29441M9598l8724J03917d2498D7198g8624A36305k7013k9063e9791j11915
13093a71706A13312M1216f2573J0274A22025i0582D5764f095D80031M8159D714
13081h5713a9559B09912b6946B06340E1127K89536b3728F2408K61391j17507j2106
13070A94186a75323B22562J70225b01150D01659C8489N8490a3086B88596A2816
13059D2716R106J02821G5014J52241m5205k4474p6530C2570G311L49114a56065
13047A51653P400N1716K55126J36152k62681A3247K00859R6308a57502F09484
13036a44211C75069j12225A07245R8573J35086l2900M2185j07714F4434a19605
$$ y = [155485, 291113, 389549, 242023, 163056, 564832, 199089, -246326, 108881, 267447, 95052, 129441, 179039, 140315, 244232, -42498, 47198, -78624, 136305, 109292, 80229, -59791, -171706, 113312, 154528, -62573, -52299, 122025, -90582, 45764, -6095, 480031, 528190, 4714, -85713, -19559, 209912, -26946, 206340, 51127, 340663, -23728, 62408, 323799, 206292, 194186, -175323, 222562, 392787, -201150, 401659, 38489, 96979, -13086, 288596, 12816, 42716, 51822, 154643, 75014, 227255, 182050, 157576, 81046, 32570, 7311, 356425, -156065, 151653, 159053, 210769, 465895, 602047, 339366, 13247, 214106, 310414, -157502, 609484, -144211, 375069, 262844, 107245, 205818, 340904, 308004, 350189, 242475, 64434, -119605]
13025A48283c0962B35885c7387B72335h446G9666K00715j08351a4302k47085A0335
13013A9910K82339a11189e1189K4203C48282A29483G170L91963h7213j393C17859
13001D8077L35855k1329c07558e7475A68817J31857g1944B79983A17738K0734
12991A38472j0239J61844L7945h3443A37219N8103k8391D9655B0207g6328E8375
12979B59100d2390E0855c80695a55234F4568a81344k43397A17073e6102b7647
12968A95397b8068F2248K9156k8830a32911G1182C2601K93921a83710F696c2578
12956C192b71476G5941f0859B58758b0963A28152b06458C8928f3148j00116C9754
12944i0926A80390g287B17862m1900c1892D2102J7144P5976E5279e0224j3169
$$ y = [148283, -30962, 235885, -37387, 272335, -8446, 79666, 280381, 172030, -14302, -261387, 10335, 19910, 302249, -111189, -51189, -26986, 348282, 129483, 7170, 399133, -87213, -88606, 317859, 48077, 383932, 362603, -307558, -57475, 168817, 300674, -71944, 279983, 117738, 138472, 128233, 290077, 328022, -83443, 137219, 195322, 166931, 49655, 20207, -76328, 58375, 259100, -42390, 50855, -380695, -155234, 64568, -181344, -424741, 117073, -56102, -27647, 195397, -28068, 62248, 91404, 62574, -132911, 71182, 32601, 326522, -183710, 6696, -32578, 3192, -271476, 75941, -60859, 258758, -20963, 128152, -206458, 38928, -63148, -163264, 39754, -90926, 180390, -7287, 217862, 175962, -31892, 42102, 59246, 135222, 55279, -50224, -63393]
12933f3393A27202n4325J87441a07112A76216J95088j69510E26K44166j12787
12923A31905F3101k9470M4571g9913l47609g049B93740F7873b5258o3136L1143
12912e7251B16016E8823J91609b23882B1406J09499e7288A41839C9251A4609J73111
12901A87720k4151j1107J79458f3718b9516c374B6260Q3230D7119J6089R6854
12890A60062J97214A57111G407b30338A04037Q6423p9543n487j7666b06139A04961
12878f1565A53001o0874a32672A67614J30144g1880k46652a20416D9162a38915
12867A82273d2986B85833r1248J94435I7631J10733a2377G8575Q0043a77373h336
12855A38476i4367b931p158n9777b9894H3295L1586D9258b06154c3044r5241B03284
$$ y = [-63393, 127202, 72877, 260318, -107112, 176216, 371304, 201794, 526, 244692, 131905, 63101, 33631, 78202, -79913, -427522, -7049, 293740, 67873, -25258, -88394, -57251, 216016, 58823, 250432, -223882, 21406, 130905, -57288, 141839, 39251, 14609, 187720, 163569, 152462, 331920, -63718, -29516, -3374, 26260, 109490, 47119, 63208, 160062, 357276, 157111, 7407, -230338, 104037, 190460, 110917, 105430, 87764, -206139, 104961, -61565, 153001, 92127, -132672, 167614, 297758, -71880, -318532, -120416, 49162, -138915, 182273, -42986, 285833, 194585, 389020, 97631, 208364, -12377, 78575, 158618, -177373, -8336, 138476, -94367, -2931, -10089, -69866, -29894, 83295, 114881, 49258, -206154, -33044, -128285, 203284]
12842G0388k6262J54733E7025J27934L79B0956K77071A20065d0751I8323g4353
12830C8894a53458j47902A13569K4967N6046d6842j58169f6986n536K0099A3942
12818B59533a81158H1784M6225K41946A78944m218G3299K85984h0693i825B39871
12806b11459g799C45893E8940J40604B5846c10035B89704r8478m5684K2443n4040
12795A13945E5631O1307n8214k1430a99615m2257e0419F9977M0511c41637E2049
12783A5536c33225C268J38850E664J99987K3340d01167C722a4590q7651A13951
12771B0732K22446b86003A41458b2201N939q2019n9898B08065C4688f7058A08226
12759B38654m9902a54665E190c4654D20997d0876A67196c2411q3656B81353b39621
$$ y = [70388, 44126, 198859, 57025, 184959, 185338, 20956, 298027, 120065, -40751, 98323, -74353, 38894, -153458, -301360, 113569, 138536, 194582, -46842, -205011, -66986, -72522, -52423, 13942, 259533, -181158, 81784, 128009, 369955, 178944, 174726, 73299, 359283, -80693, -9825, 239871, -211459, -7799, 345893, 58940, 199544, 25846, -310035, 289704, 191226, 145542, 167985, 113945, 55631, 116938, 58724, 37294, -199615, -241872, -50419, 69977, 110488, -341637, 52049, 15536, -333225, 3268, 142118, 5664, 205651, 228991, -401167, 3722, -14590, -102241, 113951, 20732, 243178, -286003, 141458, -22201, -16262, -98281, -158179, 208065, 34688, -67058, 108226, 238654, 188752, -154665, 5190, -34654, 420997, -40876, 167196, -32411, -116067, 281353, -239621]
12747B41329a68991A54873c49829h619A01022a32022A80185a61313C14109j52008
12737A62101a31457K5889I9819J32182a2684k78586J23567D4857M09819b57489
12726b73943D34698a11445b5638j32774K1626B8727b35202A19238J67296E459
12715A4924M4947f8407A14124J36045r2989r296E6064L03908A54047J04625J77807
12704D36479M6076q314a64525b8341R328j00614A19845g2381C15230A22064K7798
12693A49862f8818A04097e165C80500A29755l0436K0376J00355q6274L8678a40160
12681A07611a07219K6238A04189h2802p302A23977P293K15567j63210J02876a24772
12669a64153B03851r8227D0438e0911J7526G0355J59499J97437j30841a64102
$$ y = [241329, -168991, 154873, -349829, -8619, 101022, -132022, 180185, -161313, 314109, 162101, -131457, -105568, 99819, 232001, -12684, -291270, -167703, 44857, 454676, -257489, -273943, 434698, -111445, -25638, -158412, -136786, 28727, -235202, 119238, 286534, 5459, 14924, 59871, -68407, 114124, 250169, 157180, 147884, 56064, 359972, 154047, 258672, 436479, 482555, 474241, -164525, -28341, -19013, -119627, 119845, -72381, 315230, 122064, 149862, -68818, 104097, -5165, 380500, 129755, 99319, 119695, 220050, 133776, 172454, -140160, 107611, -107219, -80981, 104189, -82802, -90104, 123977, 131270, 346837, 183627, 286503, -124772, -164153, 203851, 105624, 40438, -50911, -33385, 70355, 229854, 427291, 296450, -164102]
12658B00908j5200P7297b55325C81214p555D4546J49075J2270I3074Q5317d8479
12646A87866H5485L2075E2967Q0041P5116r990h8676j54745J21258J3742A77762
12634A11977J04476J02A4231J83925j2211J48760J76626k11870M5957c2550p4993
12623a07543A46053C8097K04724m1041l3900a12951M899N3858B0019K42156b19978
12611A44820K9252b52960A23711b42939C81548a10296N0742p5236C0007L10566
12601C40573I9389K68522j38311M3990G0517a12399M1757H5489K68645G0647Q6529
12590A57176L6990J08606d0986A01892n0553a39217m995J3607B6943P425a33100
12578a14372I6055e9355m9152b5194H1952k9190a43448A64840p6685J37168f8807
$$ y = [200908, 185708, 263005, -255325, 381214, 373659, 44546, 193621, 205891, 93074, 178391, -48479, 187866, 85485, 117560, 52967, 133008, 208124, 198134, -88676, -243421, -122163, -108421, 177762, 111977, 216453, 216555, 14231, 198156, 185945, 334705, 511331, 299461, 345418, -32550, -107543, 146053, 38097, 242821, 201780, 167880, -112951, -108052, -54194, 20019, 262175, -219978, 144820, 174072, -252960, 123711, -242939, 381548, -110296, -59554, -134790, 30007, 340573, 99389, 367911, 229600, 273590, 70517, -112399, -70642, 85489, 354134, 70647, 157176, 194166, 302772, -40986, 101892, 51339, -139217, -144212, -130605, 26943, 34368, -133100, -114372, 96055, -59355, -108507, -25194, 81952, 52762, -143448, 164840, 88155, 225323, -68807]
12566B66440p0984c5514B998J81499a91917R1183B30720m87L8246a02475A47722
12554a26914r0199C06395B2238a63884H5773j0066f8653F8279R6154m0460J84996
12543C08969a45494B29489N2498I6499a65406B97592J4217N1193a94550E82K49606
12532B50188b21132f4947n3138B966L10569A8279b63207e7326I4246h5929B9807
12520A17320e7102A48436k3811Q975K66844A20057L19640j44546A47260e036A18092
12508f5679q1696B6989f4745j27013I8244b16262B60017r1177g6065p1120A52803
12496C73694f3247A01597a29305B07670M2624I1408a2672E8934M26702A69088
12485A7775J71854a0503B38677a71202d0360k6608B13516C4201O1829a77414P5133
$$ y = [266440, 195456, -35514, 2998, 184497, -191917, -100734, 230720, 230233, 268479, -102475, 147722, -126914, -217113, 306395, 22238, -163884, 85773, 75707, -68653, 68279, 164433, 123973, 308969, -145494, 229489, 281987, 96499, -165406, 297592, 311809, 363002, -194550, 582, 250188, -221132, -64947, -118085, 2966, 313535, 18279, -263207, -57326, 94246, -85929, 29807, 117320, -57102, 148436, 124625, 133600, 400444, 120057, 439697, 295151, 147260, -5036, 118092, -65679, -147375, 26989, -64745, -191758, 98244, -216262, 260017, 168840, -76065, -147185, 152803, 373694, -63247, 101597, -129305, 207670, 250294, 91408, -12672, 58934, 485636, 169088, 17775, 189629, -10503, 238677, -171202, -40360, -66968, 213516, 34201, 96030, -177414, -102281]
12474a02281A11587g1142A27074b29417R7521L2909j8844B78667A7658n578g9489
12462A4953a1761A93195L5191h6370M1912E3368a74688E8323a80980E6976f378
12450I9250M1381J298M6079K8229L6174a53161e8794n9173q1069A52293j5292
12439A37001o3961J82947i7183K4419n647A24503e3375j70897R9509j38762B01558
12427G640a13955A59148a71001B97278C8864R299Q6779h8195F2275Q9206a16886
12415a24097N9255A81732g3502n7934B44271a86633B66753o0375J0894k478d16983
12403g3462k30814J21152i358j44165b3199j6622l19122f5771A11463R0392G7468
12391D00995A69312b65069g2700G2563J53841a32494F3378Q6972a68004j07979
$$ y = [-102281, 111587, -71142, 127074, -229417, -131896, -98987, -117831, 278667, 17658, 12080, -79489, 14953, -11761, 193195, 228386, -86370, -44458, 53368, -174688, 58323, -180980, 56976, -6378, 99250, 140631, 141929, 188008, 216237, 252411, -153161, -58794, -117967, -199036, 152293, 137001, 73040, 255987, -97183, -72764, -78411, 124503, -53375, -224272, -124763, -263525, 201558, 7640, -113955, 159148, -171001, 297278, 38864, 48163, 134942, -88195, 62275, 151481, -116886, -124097, -64842, 181732, -73502, -131436, 244271, -186633, 266753, 206378, 217272, 214794, -416983, -73462, -304276, -183124, -9358, -153523, -23199, -39821, -358943, -65771, 111463, 201855, 77468, 400995, 169312, -265069, -72700, 72563, 226404, -132494, 63378, 150350, -168004, -275983]
12381b75983R6070I7594l9529J20603c1125k95921D8826K07263k6109M418g7389
12369G6714b45567G7683K81042F151e2651A66381m5966l1523i581k4987j35871
12358a70439O2058A79139a49762c6472j0118A52122C9644f020p3205k79016A4808
12346f5596D6037P8477e5545A1640a21876l6592g1732D3941a44758l5642C40753
12334I6768b70608a20982C45327b07958C26344J27309a58428M3896B16381B1621
12323g3012H0341K46534G7870K24404a99775C3546c2392B24494a00702K9352A10560
12311a22834F1557J31394b2044C70806a04255n9436A87930e0169l07961A53725
12300a37267B95780q7155n7983b03557A54267i5058b760n5537f309j7068k434
$$ y = [-275983, -179913, 97594, 58065, 178668, -31125, -327046, 48826, 256089, 229980, 234398, -77389, 76714, -245567, 77683, 358725, 6151, -52651, 166381, 120415, 88892, -9581, -34568, -170439, -108381, 179139, -149762, -36472, -46590, 152122, 39644, -6020, -79225, -358241, 14808, -65596, 46037, 124514, -55545, 11640, -121876, -158468, -71732, 43941, -144758, -180400, 340753, 96768, -270608, -120982, 345327, -207958, 326344, 453653, -158428, -114532, 216381, 21621, -73012, 80341, 326875, 77870, 302274, -199775, 33546, -32392, 224494, -100702, -71350, 110560, -122834, 61557, 192951, -22044, 370806, -104255, -163691, 187930, -50169, -358130, 153725, -137267, 295780, 208625, 150642, -203557, 154267, -95058, -2760, -58297, -6309, -23377, -25811]
12289b5811E6527P3729D7963e5420A13449B5469J36226E6470A600J07359b16155
12277G2964M46643D1810L48720j30757J92561A63971L76617A8828a56182C25276
12266B23807h4169r624A67877a11444F5493K06030K0906D0133Q2513A5864a03892
12254C19260a09736A266J24873O9581i9510B32181b2005A10328J63750G6383c83881
12242a91337B61914m4441A9883N9277b31013B16380E6283M0630A3017J10119J2121
12231A35257n9784k4887J79146F5988L40355A60708a7861A16366N33207k90850
12221C58723f2854A44971L0896M83337A30090B1998J32849L1152p9330a14172
12210A66797f773D23616a90974A09601K64882j68830R1558H1551K7206K82907
$$ y = [-25811, 56527, 130256, 47963, -55420, 113449, 25469, 161695, 56470, 1600, 108959, -216155, 72964, 519607, 41810, 390530, 259773, 452334, 163971, 540588, 18828, -156182, 325276, 223807, -84169, -93793, 167877, -111444, 65493, 271523, 292429, 40133, 122646, 15864, -103892, 319260, -109736, 1266, 126139, 195720, -99510, 232181, -22005, 110328, 274078, 76383, -383881, -191337, 261914, 217473, 19883, 79160, -231013, 216380, 56283, 96913, 13017, 123136, 135257, 75473, 50586, 229732, 65988, 406343, 160708, -17861, 116366, 649573, 358723, -62854, 144971, 175867, 659204, 130090, 21998, 154847, 185999, 106669, -114172, 166797, -6773, 423616, -190974, 109601, 374483, 205653, 297211, 81551, 108757, 391664]
12200C91664M3368o4941J47768A86953j6521J34519n0569J33723j56408J11356
12190C43053A23219J01591K5399o2947K38006A24535C0989Q3881J87334A18551
12179b3979C55324L1276j07369a1563A50920E228J33257J8924g4423h410H3696
12167a52868A45023J0514K04902h5415B67040l983A28696J08826i3162d5788q8725
12156a34513B86703g4012K7315F7208a95214b8223D26430g1658A59018p7150a74746
12144i1943A15102b44199a03406G4747K98376F512L6260J1499J3037b78254h0621
12132a29775j55991d638E7369B1157A0434c39130C18333B0546b11077A68336b71828
12120A47521a02157A00993m189g244A09044J13043a61163L754A60833J2001k6354
$$ y = [391664, 435032, 370091, 517859, 186953, 170432, 304951, 254382, 388105, 231697, 343053, 123219, 224810, 250209, 187262, 425268, 124535, 30989, 114870, 302204, 118551, -23979, 355324, 386600, 279231, -11563, 150920, 5228, 138485, 157409, -74423, -8410, 83696, -152868, 145023, 155537, 360439, -85415, 267040, 263057, 128696, 237522, -93162, -45788, -134513, 286703, -74012, -46697, 67208, -195214, -28223, 426430, -71658, 159018, 81868, -174746, -91943, 115102, -244199, -103406, 74747, 373123, 6512, 42772, 54271, 67308, -278254, -80621, -129775, -285766, -4638, 57369, 21157, 10434, -339130, 318333, 20546, -211077, 168336, -271828, 147521, -102157, 100993, 96804, -7244, 109044, 222087, -161163, -157409, 160833, 172834, 146480]
12109A46480k7736R0597a57951m8761E9405b9750j09388F8475K12698j05991D5952
12097a601A26615C2924d5851J6100j67415C1618J43190n3096B3642J0797J10612
12086A45051L5963b12327b1193D676g4022j9111p9503f4153q6370A84789L39891
12075E24680A33369h2926l31911h5519C85418E6758d09140C6460K40415M53b82498
12063B50719f0206b5475A179O00048R70880k02380E28521j60109j44540l1998
12053A91874H6009i8537M7265B33663K0657i0672r0478F2068c10985A0253b01224
12041G5827c7859G4207Q2931i5134L4814H6365B8535J40849L9599a69215r1216
12030b60431b6780m4341B59368G4875b77286a18260H7707g0445B95226e217k1362
$$ y = [146480, 118744, 209341, -157951, -206712, 59405, -29750, -139138, 68475, 281173, 175182, 45952, -1601, 126615, 32924, -45851, -29751, -197166, 31618, 174808, 121712, 23642, 34439, 145051, 181014, -212327, -21193, 4676, -74022, -93133, -172636, -64153, -150523, 184789, 524680, 133369, -82926, -414837, -85519, 385418, 56758, -409140, 36460, 276875, 277328, -282498, 250719, -60206, -25475, 1179, 601227, 1572107, 1369727, 528521, 368412, 223872, 191874, 86009, -98537, -51272, 233663, 254320, -90672, -181150, 62068, -310985, 10253, -201224, 75827, -37859, 74207, 157138, -95134, -60320, 86365, 28535, 169384, 208983, -169215, -260431, -26780, -71121, 259368, 74875, -277286, -118260, 87707, -70445, 295226, -5217, -26579]
12019b6579n2500E3067B00c3073F9453a87563A35585J929J12539b58553a02952
12007A18846a15938a9022P87l7012C5729N207R8547i1293K8488B1671M3879c6219
11994d10760c1867k8920k37899e9612A69815J23000E8594a9008A09370C4658b66589
11982D2639b29262D80449e5445G7877Q9334H360K9990a55616A06429C3082J82317
11971B15399A8397i6473H9636a7746k61247D4024J91581J3705a95201C91644c9385
11959a25118k10151H7806a51400A04939a99718b1960B97805c4955k48404a23624
11948a05270b5180o5646d859o3063L3611j11216A09488m4602J40313K5899a88040
11936a04786j54655R6273H5949l0272e0546B60692A02258c14850a21913L1866
$$ y = [-26579, -79079, 53067, 200, -33073, 69453, -187563, 135585, 137514, 250053, -258553, -102952, 118846, -115938, -19022, -18235, -55247, 35729, 40936, 139483, -91293, -62805, 21671, 65550, -36219, -410760, -31867, -60787, -298686, -59612, 169815, 292815, 58594, -19008, 109370, 34658, -266589, 42639, -229262, 480449, -55445, 77877, 167211, 8360, 38350, -155616, 106429, 33082, 215399, 18397, -96473, 89636, -17746, -278993, 44024, 235605, 249310, -195201, 391644, -39385, -125118, -335269, 87806, -151400, 104939, -199718, -21960, 297805, -34955, -283359, -123624, -105270, -25180, -90826, -4859, -67922, -34311, -145527, 109488, 64886, 205199, 231098, -188040, -104786, -259441, -163168, 85949, 55677, -50546, 260692, 102258, -314850, -121913, -90047]
11926i0047B95401h8670L7360k892D6335a88568a8080G1173e3672A9951b19062
11914i4088k2043C3123M09495A11395D5020a59338B52474a60309B35239H6737
11903A09968b28057P7582B2697a54054A7675f388j15883I3241d03714J43086c9659
11891c6141j89935K9117A57244j8416F2485a17919n79C00757i3730J726B22282
11879D6814b70362a35150L8024k40572a27052A94510K79551a7286j41900d1836
11868a8861B04562B3889a54484H6095b23505h488D28917b4213k9334j39265D76260
11856a12184J7459M6869J0969E8381b05924B17261b72896B91579a10936A0380
11845A45894I62J29419K470a9695A5891J41317A1502d2923C8889a67427A28893
$$ y = [-90047, 295401, -88670, -51310, -54202, 46335, -188568, -18080, 71173, -53672, 19951, -219062, -94088, -116131, 33123, 442618, 111395, 45020, -159338, 252474, -160309, 235239, 86737, 109968, -228057, -150475, 22697, -154054, 17675, -6388, -122271, 93241, -403714, -260628, -39659, -36141, -226076, -196959, 157244, 138828, 62485, -117919, -118498, 300757, -93730, -92004, 222282, 46814, -270362, -135150, -97126, -337698, -127052, 194510, 474061, -17286, -159186, -41836, -18861, 204562, 23889, -154484, 86095, -223505, -8488, 428917, -24213, -53547, -192812, 476260, -112184, -94725, -47856, -36887, 58381, -205924, 217261, -272896, 291579, -110936, 10380, 145894, 962, 130381, 132851, -19695, 15891, 157208, 11502, -42923, 38889, -167427, 128893]
11833d47386i464m2534A19915K3202a52973a3894B09035A3135a48771K5986C1463
11821c0548B12048b36459d2232o6024A31046n3362a3685B05664e6004l8935I1519
11809b4221r0634J5122B52032E5848e3571H8518K15468A16817J11094g1515B39883
11797G7434L6596E5297j6431L06970g8190A28592a82276j29180O3653J23892D7035
11785A07434h4387j01985g4755B93940i6668L7504A78875a99189A39070a58933
11774b42688b3185r0123J9857k04339A0380b6814C78884g202j94111I9467N5673
11763A55140d7888B18037a25655L7419k99429A56499l2193J18510C1664b03566
11752I2227J6165f6650I0054l9427N8852c84130a69095I6625l8585a41469A84277
$$ y = [-447386, -9464, -51998, 119915, 143117, -152973, -13894, 209035, 13135, -148771, -122785, 31463, -30548, 212048, -236459, -42232, -108256, 131046, 77684, -13685, 205664, -56004, -94939, 91519, -24221, -114855, -99733, 252032, 55848, -53571, 88518, 303986, 116817, 227911, -71515, 239883, 77434, 114030, 55297, 38866, 345836, -78190, 128592, -182276, -311456, -247803, -123911, 47035, 107434, -84387, -186372, -74755, 293940, -96668, -59164, 178875, -199189, 139070, -158933, -242688, -23185, -113308, -93451, -297790, 10380, -26814, 378884, -7202, -201313, 99467, 155140, -47888, 218037, -125655, -88236, -387665, 156499, 124306, 242816, 31664, -203566, 92227, 108392, -66650, 90054, 50627, 109479, -384130, -169095, 96625, 58040, -141469, 184277]
11740C0208g7490A9376M19060A26443M9207F0168J63364L0884o0863D6657J22040
11729A68697B9375M5537d3983G408a68057I6451d8037A04976d6669B69732b61923
11717C3604g1438H8002A2659J66156n8468m5477L37150a81945A08177K175A159
11705B02376j01004J09318F5435d7991D2945L5119e9396A95325d11067A08496
11694A98472Q2105d7173a3073p7882A30372L46405i4696A89522m8758h9315M3697
11683d5618j5929B01653a30374M3481F3805L504c8420C5751J03068N4714g3599
11671a28746A29754K0916R1264k5404p3903c0496j25029f4338B45817J51205a94508
11659A38411B4795a91379A57180F474J23753c9512k99233B44607E8904g0236o080
$$ y = [30208, -77490, 19376, 438436, 126443, 175650, 60168, 223532, 254416, 193553, 46657, 168697, 29375, 74912, -43983, 7408, -168057, 96451, -48037, 104976, -46669, 269732, -261923, 33604, -71438, 88002, 12659, 178815, 120347, 74870, 412020, -181945, 108177, 110352, 1159, 202376, 101372, 210690, 65435, -47991, 42945, 78064, -59396, 195325, -411067, 108496, 198472, 280577, -47173, -13073, -90955, 130372, 476777, -94696, 189522, 140764, -89315, -45618, -61547, 201653, -130374, -86893, 63805, 67309, -38420, 35751, 138819, 193533, -73599, -128746, 129754, 150670, 241934, 216530, 142627, -30496, -155525, -64338, 245817, 397022, -194508, 138411, 24795, -191379, 157180, 6474, 130227, -39512, -338745, 244607, 58904, -70236, -76316]
11648g6316j3035J2500A1204J57564a97781C6908f8258A43485a60910D41263b16739
11636d2716j19824A12666F7L24471d94498b11572L5856A46354a4697B96203j01547
11625A94656p418D2726d8023D3452K72457a89832M7969I4440P879K53650I5836
11613D907b3916C1667a58523A25315A5082K42907b03793B69091i6553B11116E6637
11601f2880C70489e0179A9600J15465L4395R9476n8041B8178L43571D8328O2623
11590A10951K28489D1154P0969a17772D04487I5289R7569P6957A08631M15320
11580E23951B07074J4623A00890J80165J5547L98942I1686J40037A10156K16109
11570C26265j27361O4234a21340k48230i2620r3787B49304B9827P5281J5294h8080
$$ y = [-76316, -89351, -76851, 11204, 168768, -197781, 36908, -68258, 143485, -160910, 441263, -216739, -42716, -162540, 112666, 67, 324538, -494498, -211572, -175716, 146354, -14697, 296203, 194656, 187238, 42726, -48023, 43452, 315909, -189832, -141863, 94440, 102319, 355969, 95836, 4907, -23916, 31667, -158523, 125315, 15082, 257989, -203793, 269091, -96553, 211116, 56637, -62880, 370489, -50179, 19600, 135065, 169460, 268936, 210895, 28178, 371749, 48328, 110951, 339440, 41154, 112123, -117772, 404487, 95289, 192858, 269815, 108631, 523951, 207074, 221697, 100890, 281055, 296602, 695544, 91686, 231723, 110156, 326265, 198904, 263138, -121340, -369570, -92620, -186407, 249304, 29827, 105108, 120402, -88080]
11558B57357i8593g618A87876L5568n9191Q2564A02145J42953K84F2739N4439
11547A17178J04980a02183p7694E3468e7483l7116r0163B88140N3066I9110J58089
11536B57199j26885F1285R2425N5521P47J91453A64189O1028c06411A92612E763
11524C6723K56369G3140j2023K7143K98156b36669F497L01556A4003P8613i5460
11512B27207F8133h0669A26461L9275A7340J35984P5724o3055K20490H974J64345
11501A73319B2819J38720K07437E8704R2083O8079L53850B56132n0078k9868K74841
11490D51027c9272F2921B9230e9984J2461B30673k465p2161n6995M8669K9726
11479A77447a14947C39693A59538K14529J9920r1980Q6433A08513e9914F2928
$$ y = [257357, -98593, -7618, 187876, 223444, 164253, 246817, 102145, 245098, 245382, 62739, 117178, 222158, -102183, -179877, 53468, -57483, -94599, -184762, 288140, 341206, 99110, 257199, 130314, 61285, 153710, 209231, 209978, 401431, 164189, 225217, -306411, 192612, 5763, 36723, 293092, 73140, 61117, 88260, 386416, -236669, 6497, 308053, 14003, 92616, -95460, 227207, 68133, -80669, 126461, 165736, 17340, 153324, 229048, 165993, 386483, 8974, 173319, 22819, 161539, 368976, 58704, 150787, 218866, 572716, 256132, 206054, 176186, 451027, -39272, 62921, 29230, -59984, -47523, 230673, 228208, 156047, 99052, 147721, 177447, -114947, 339693, 159538, 374067, 393987, 302007, 388440, 108513, -59914, 62928]
11468I6582l1812J44327H153K40500K40635A49833A529J80059b17881A36536E45
11456G3927c3365B37401J0269C605L13248a40136A9677a6950G3136J19151M61519
11445F53806b581j82418A43119C0764J05442L18476j74871A01057h028A55736
11434E4375b5554A29509F1201P3888N1475J398J25338A03317g4601C58807g0033
11422I3934J59247h2935E481K33565o5903B6791O1823a90585F6451e824p2699
11411g8523A09785c2153j09138B05965n8962a9732I5808a41809f1373C488d3248
11399A90255J0120Q1066b9459n828j24922b9674j7015A14938g071A55661h7940
11387F6842f8594A77884h2017G0154a28318A00671D0980J55354b16858A56013
$$ y = [96582, 64770, 209097, 8153, 248653, 489288, 149833, 1529, 181588, -217881, 136536, 545, 73927, -33365, 237401, 247670, 3605, 316853, -140136, 19677, -16950, 73136, 192287, 653806, -2581, -184999, 143119, 30764, 136206, 454682, 279811, 101057, -8028, 155736, 54375, -25554, 129509, 61201, 135089, 186564, 187962, 313300, 103317, -74601, 358807, -70033, 93934, 253181, -82935, 5481, 239046, 173143, 26791, 88614, -190585, 66451, -5824, -78523, 109785, -32153, -141291, 205965, 147003, -19732, 95808, -141809, -61373, 3488, -43248, 190255, 200375, 281441, -29459, -35287, -160209, -29674, -46689, 114938, -7071, 155661, -87940, 66842, -68594, 177884, -82017, 70154, -128318, 100671, 40980, 196334, -216858, 156013]
11376b9734n9629C77095R6417k07900K05112H6265k1631J79019b53076A78623
11365c7098k4651j30798i0859m22990b4634m4309j72004r4519f8944E1841c06429
11353a19166r939M0153j95139A16352g2807j12635H761K3440d04847A48384F6581
11341B84245f2715B62967a10607A08095a42124A51301J1156n1693B1296a19952
11330A06155d1250E9340c06813A39749b82332d0265r4862A13402a24639A81440
11319a18231b278A38090l8729j471c167C08448A27252I272a62932L0089a6351
11307A10194g5246C9143a19208d0189r7921b9194C9530K57216A20660R6579p8301
11296A38938a23968A53623J91828j44104r7093a34741F785O4195a00931A6114
$$ y = [-29734, -89363, 377095, 473512, 265612, 470724, 86265, 64634, 243653, -253076, 178623, -37098, -61749, -192547, -90859, -513849, -24634, -68943, -240947, -335466, -68944, 51841, -306429, -119166, -129105, -88952, -284091, 116352, -72807, -185442, 8761, 32201, -404847, 148384, 66581, 284245, -62715, 262967, -110607, 108095, -142124, 151301, 162457, 110764, 21296, -119952, 106155, -41250, 59340, -306813, 139749, -282332, -40265, -135127, 113402, -124639, 181440, -118231, -2278, 138090, 99361, 97890, -3167, 308448, 127252, 9272, -162932, -132843, -16351, 110194, -75246, 39143, -119208, -40189, -138110, -29194, 39530, 296746, 120660, 217239, 138938, -123968, 153623, 345451, 201347, 104254, -134741, 6785, 70980, -100931, 16114]
11285C08092H5507a30925B03444r6269a065j32731b2327F9511j98a64394d0643
11273g3251B82896c4128a745E3491c052E6045d7065j45880H8952a77126b5644
11261B21407L770j09102a48289D5391c8882A88441o0175b7716k36315O6101A06732
11249F7292j1198J48276G1895K39775d1373A93520a99151D99400b2082B06982
11238I7487M13095e3593R0l09709G6641a54182k13152d4461A67506D0834K4000
11227F4834a11176J6574p4113o40B87750b908l1702r6459k9688D5122O6077D6529
11214b4584l57950a76380D4770Q952L2233b11614P4770j52874A6709b90729i6367
11202h0992j85055O6485H8666L44487e6403r1023l45054A4461a58576N2637K5717
$$ y = [308092, 85507, -130925, 203444, 107175, -1065, -133796, -22327, 69511, 69313, -164394, -40643, -73251, 282896, -34128, -1745, 53491, -3052, 56045, -47065, -192945, 88952, -177126, -25644, 221407, 225177, 116075, -148289, 45391, -38882, 188441, 128266, -27716, -264031, -197930, 106732, 67292, 56094, 204370, 71895, 311670, -41373, 193520, -199151, 499400, -22082, 206982, 97487, 510582, -53593, -53503, -363212, 76641, -154182, -367334, -44461, 167506, 40834, 64834, -111176, -94602, -168715, -169355, 287750, -2908, -34610, -131069, -160757, 45122, 111199, 46529, -24584, -382534, -176380, 44770, 53722, 85955, -211614, -136844, -289718, 16709, -290729, -96367, -80992, -266047, -199562, 88666, 433153, -56403, -147426, -492480, 14461, -158576, -105939, -80222]
11191h0222A2726e9170o0621r1593j12821D8405J47510e19411F6275b18124e7477
11179B1191O8980i2323A34249a28580B3156L2204b84843J13484K4590k423B24408
11167c30026D2248J21752j5931A8863K6144e9809A22986g9789C13761a00685C90734
11155B47990b0928j67425j10162B39749c65807A36001o0662J79281D2854R0763
11145A33617m7350c07463b1885G1973a77904g7009B77886b20130J04546E1446
11134A41666E8473M5306M0663J0831J60265R987h6416B11286A0566a5689D7596
11122A02113J02376l5883f8313G6252B285M5616L606J2612J05851d8743C37500
11110b28771A07420B7623R1865a83696r734A44120j9908P7194B1104J99097J35633
$$ y = [-80222, 12726, -59170, -119791, -211384, -324205, 48405, 195915, -519411, 66275, -218124, -57477, 21191, 90171, -92323, 134249, -128580, 23156, 55360, -284843, -171359, -146769, -149192, 224408, -330026, 42248, 164000, 148069, 18863, 45007, -59809, 122986, -79789, 313761, -100685, 390734, 247990, -20928, -188353, -298515, 239749, -365807, 136001, 75339, 254620, 42854, 133617, 86267, -307463, -21885, 71973, -177904, -77009, 277886, -220130, -115584, 51446, 141666, 58473, 103779, 144442, 155273, 315538, 325525, -86416, 211286, 10566, -15689, 47596, 102113, 204489, 168606, -68313, 76252, 2285, 47901, 51507, 64119, 169970, -48743, 337500, -228771, 107420, 27623, 119488, -183696, -193430, 144120, 124212, 201406, 21104, 220201, 355834]
11099C55834j43782N6853j4914j13016L0506J34534A7307c09341A76597n0529
11089A26068o385a6949B1401L91964J81996p5998A43921j5793L09473j05486J02077
11078D34192j52066p5471e2993D25677j02289J3781I2770j6813M71544M5327B52607
11066B33085K34469j54981J33832J64707r729p5240O297n0601K43619m4592k84297
11055C96569J29204J00336B70753N72351j7792K41567k56170Q4172j03197J93221
11045I84905k24082J90844j87410P3060Q1549J30437k82252j03441k42249J97013
11035F18374J03820J64135p8180k89577M61492l76605L27115o2078l2009r8757
11025G37730R3768J34441P1202m53404R9231Q2552J04447l30835K99866k7808
$$ y = [355834, 212052, 268905, 253991, 140975, 171481, 306015, 17307, -309341, 176597, 126068, 119683, -16949, 21401, 413365, 595361, 519363, 143921, 128128, 437601, 332115, 434192, 282126, 206655, -52993, 425677, 323388, 337169, 92770, 75957, 547501, 592828, 252607, 233085, 467554, 312573, 446405, 611112, 601383, 526143, 532440, 481839, 725458, 680866, 396569, 525773, 626109, 270753, 843104, 825312, 1066879, 810709, 894881, 791684, 984905, 760823, 951667, 764257, 837317, 918866, 1049303, 767051, 663610, 421361, 618374, 722194, 886329, 808149, 518572, 980064, 603459, 930574, 868496, 836487, 737730, 831498, 965939, 1037141, 583737, 682968, 765520, 869967, 539132, 838998, 811190]
11015H11190j93089q6861L46720l36601q8553o4200L55080k01577J89664M6963
11005G78736l7103j26830J45444l3981K31235j94669J9915J72173k51989k5118
10995F77813q8351p7254j07173M19126J13334k40673K25247M4864j0131J20123
10985A076925j4232k87857M42251j30911k7255K31391L36918N2961R398M52568
10975B142157M72006j32606O70025J59998L01031j39549O2618k19459l3076l90628
10965B892517k52847m19157l10482J99438m1531l35242N53625n6665j32296l50870
10955A746490K36504n1522m29723J30945o03647m51406L27302k90849J68555A62837
10944A87512K41962k0892A78560O8962q472K2780o903C3239J47028C3549M3783
$$ y = [811190, 618101, 531240, 877960, 541359, 452806, 388606, 743686, 542109, 731773, 778736, 741633, 614803, 760247, 726266, 957501, 762832, 782747, 954920, 702931, 677813, 589462, 512208, 405035, 824161, 937495, 696822, 922069, 966933, 956802, 1076925, 1062693, 774836, 1217087, 1086176, 1058921, 1290312, 1627230, 1680191, 1689589, 2142157, 2614163, 2481557, 3151582, 3311580, 3612611, 3473062, 3535680, 3316221, 3283145, 2892517, 2639670, 2220513, 1910031, 2109469, 2067938, 1732696, 2286321, 2229656, 2097360, 1746490, 1982994, 1931472, 1501749, 1632694, 1029047, 577641, 904943, 614094, 782649, 162837, 187512, 429474, 408582, 178560, 247522, 239050, 261830, 254927, 33239, 180267, 33549, 77332]
10933G7332K40986a45610A11629Q3040J60605j60439a23844A8802J51269d57645
10922c9838A61835o2027b17622e295G4378b0943n0912o253A04113l4993a76070
10910a69367A30516D2525J41004e0659F2323b0534k38708E7076a16536E6002d8527
10898I9471R6312a27804A02048a7094j40711A25622a26922B36765D5085N9990
10888A05075d68073a34842j39543B23941A04884a84533D8809d69902a79003N6590
10878a22413o3852M9424I2669a54339a4587m0500F4235a4941j58929H8084J8082
10867A06166J14413h9557A91451p7401a74364B01148I3813A4327K88428f7412
10856b21070b0472E6487A6864e7898o759B05540H2992a36644M9968D42729f6497
$$ y = [77332, 318318, -145610, 111629, 194669, 355274, 194835, -123844, 18802, 170071, -457645, -39838, 161835, 99808, -217622, -5295, 74378, -20943, -71855, -78108, 104113, 69120, -176070, -169367, 130516, 42525, 183529, -50659, 62323, -20534, -259242, 57076, -116536, 56002, -48527, 99471, 195783, -127804, 102048, -17094, -157805, 125622, -126922, 236765, 45085, 105075, -468073, -134842, -274385, 223941, 104884, -184533, 48809, -469902, -179003, -122413, -186265, -136841, 92669, -154339, -14587, -55087, 64235, -14941, -173870, 88084, 106166, 220579, -89557, 191451, 114050, -174364, 201148, 93813, 14327, 302755, -67412, -221070, -20472, 56487, 16864, -57898, -64657, 205540, 82992, -136644, -86676, 442729, -66497]
10844a52330A49206D9823L7647e3624j4970A13485E5906J24537Q5330F6007N7285
10833A23292k3609c1326j1295q017o0183j11069F976Q4158c7940f154j14109m5414
10821a65677B26725r8972d5438k04922a6544A85184b8493A14147a48193m1677
10811a89870i772C27365c13478e7139D3390L90265I7047a23936A35149J60164
10801B95313b56835A25319h1235B0335f3210B3543a1043n9007k40241g4698q0411
10790a55109A66866h4350k3702j2460n0249B9801J38007p0139a90841B933f7392
10778A27074O1305q0114a80553A48002N5718e39907e0163A02836a54781n8690
10768b13471J7203H6873J17745B1314b09768G5506a9403p0074I8264a74957j77548
$$ y = [-152330, 149206, 49823, 87470, -53624, -68594, 113485, 55906, 180443, 265773, 66007, 123292, 99683, -31326, -42621, -50638, -110821, -221890, 6976, 91134, -37940, -6154, -120263, -165677, 226725, 127753, -45438, -250360, -16544, 185184, -28493, 114147, -148193, -189870, -9772, 327365, -313478, -57139, 43390, 433655, 97047, -123936, 135149, 295313, -256835, 125319, -81235, 20335, -63210, 23543, -11043, -70050, -310291, -74698, -155109, 166866, -84350, -108052, -120512, -170761, 29801, 167808, 97669, -190841, 2933, -67392, 127074, 188379, 108265, -180553, 148002, 203720, -539907, -50163, 102836, -154781, -213471, -196268, 86873, 204618, 21314, -209768, 75506, -19403, -89477, 98264, -174957, -352505]
10757c52505i5356j5395B15955G6324a47033E4511a84259B37869D2031R1027K2336
10746A55394m775f7719r2102C33438a45218j02060a00968A80403i9422o5644e7690
10734a77948e669p9492j04689B53097n0031b47555e884j45901O1730O033F7905
10722i7460j4306c79A18561b84763J12931I9944a68574j59007i2864B30135e444
10710B51360b47082f4971a8512o48l8830A41400a39833r798f2984k4168B55539
10698b17332O830C9179a04832l2809I2700e9214l42964E5032R6460m7632D6182
10686B9582a39512d3617j00389P97j15735J14191M3822j98708B57323e3183H7470
10674C11526b34003J12476M1620D8483a18784d5683K6q8269n7167e2996k6236
$$ y = [-352505, -95356, -110751, 215955, 76324, -147033, 54511, -184259, 237869, 42031, 133058, 155394, 150619, -67719, -159821, 333438, -145218, -247278, -100968, 180403, -99422, -165066, -57690, -177948, -5669, -85161, -189850, 253097, 203066, -247555, -5884, -151785, -90055, -84022, 67905, -97460, -111766, -379, 118561, -284763, -171832, 99944, -168574, -327581, -92864, 230135, -5444, 251360, -247082, -64971, -18512, -19160, -57990, 141400, -139833, -149631, -62984, -87152, 255539, -217332, -210502, 39179, -104832, -137641, 92700, -59214, -402178, 55032, 151492, 103860, 46182, 29582, -139512, -43617, -144006, -143209, -258944, -144753, -100931, -299639, 257323, -53183, 87470, 311526, -234003, -121527, -79907, 48483, -118784, -45683, -45657, -133926, -191093, -52996, -79232]
10663g9232k9214k41185a36598A21981J7225c13681A5487J3806J02772K15363
10653C47428F0172J64619b42022B3742b93012a29011a5633k6128f788k49628D1228
10641D6627J60014o9965a42729q2335N5759Q4209A42897E1536b2635G2891N0669
10630A23560a16875j92785D48044a12829A22953a21779j51960i7943B00250G7298
10619f45j30352j77106a43963C3199P492a67686l3687B91360A0703c19673d7036
10607a48377C5696R5072k3392K65237A17652P3001E1956N9398C9574b30898A61091
10595c0673j66121K5337C28449a44294B8387c42873Q6582n2832C39691d3489m7619
10584i1108n8496b486A88192p9025K4650b05666h6819j41325M0557Q930A44153
$$ y = [-79232, -108446, -349631, -136598, 121981, 139206, -313681, 15487, 29293, 132065, 347428, 60172, 224791, -242022, 23742, -293012, -129011, -15633, -41761, -6788, -256416, 41228, 46627, 206641, 136676, -142729, -225064, -169305, -85096, 142897, 51536, -22635, 72891, 123560, -116875, -309660, 448044, -112829, 122953, -121779, -273739, -97943, 200250, 77298, -645, -130997, -308103, -143963, 33199, 40691, -167686, -201373, 291360, 10703, -319673, -47036, -148377, 35696, 130768, 107376, 372613, 117652, 190653, 51956, 111354, 39574, -230898, 161091, -30673, -196794, -171457, 328449, -144294, 28387, -342873, -256291, -309123, 339691, -43489, -91108, -149604, -2486, 188192, 109167, 133817, -205666, -86819, -228144, -187587, -178657, 144153]
10572B1842a49908O2700j51533B27202a32578c2345j5855B1313c9439p3327A04032
10560b67954L4094Q7783A9725a57659J1557E2091a82368g7285j24223d5437A51165
10548f3375j10670p1194A3019M5031b1318D1601a74112l4996A26897a70980h3894
10536A15675a0707j8427A02904A6207d9412k03370d5690j63135m288d07A73185
10524A7437J86047A9966e43466a65846O6480J5741A52206O2984b87569A7349J00168
10513A17517b3277o7612j17226c8615j44756k7775A04641a98433o3310B83743
10502A33030b29280D13952i6866k6740A70525c59821b231j54128A26431i6062
10491f8908o5346r9724A2528O0074K85026a5440A2005K71470E9956L16326a94484
$$ y = [21842, -149908, -87208, -238741, 227202, -132578, -32345, -48200, 21313, -39439, -112766, 104032, -267954, -233860, -146077, 19725, -157659, -146102, 52091, -182368, -77285, -201508, -45437, 151165, -63375, -174045, -245239, 13019, 58050, -21318, 41601, -174112, -209108, 126897, -170980, -83894, 115675, -10707, -29134, 102904, 16207, -49412, -252782, -45690, -208825, -213113, -407, 173185, 17437, 203484, 19966, -543466, -165846, -99366, -83625, 152206, 215190, -287569, 17349, 117517, -23277, -90889, -208115, -38615, -183371, -211146, 104641, -198433, -261743, 283743, 133030, -229280, 413952, -96866, -123606, 170525, -359821, -2231, -156359, 126431, -96062, -68908, -134254, -233978, 12528, 72602, 357628, -15440, 12005, 283475, 59956, 376282, -194484]
10479F13282k41810G4347K72075A17028J16077a44258B07733a26447A43765h9089
10468a12010j85521a24640j13484N4403A28445a78085E6683R1916g4927m4630
10458a19557k05923d6970A37315k8816R4870r8476C7591d33468J07536A38399
10447a71068K1899N6978G7893N5862k0722a20540Q83b5419C7532i2516m5978A73247
10434A81449a71956j29490C0356L34261a03346A88784e6374a7586p5561j04604
10424a97751i4104A15164b37611g391n4975A29579d5777j24382P3287A97516H0285
10412a11939k0420q0009n3161B11K80508H5136J03490g89n7018A12850a06940
10400a11951A97820K5704a24211A31828D834J41043M3338J75374F5795J47803
$$ y = [613282, 371472, 74347, 346422, 117028, 233105, -144258, 207733, -126447, 143765, -89089, -112010, -297531, -124640, -238124, -183721, 128445, -178085, 56683, 148599, -74927, -119557, -325480, -46970, 137315, 108499, 203369, 104893, 37591, -433468, -325932, 138399, -171068, -149169, -92191, 77893, 133755, 113033, -120540, -119657, -25419, 37532, -92516, -138494, 173247, 181449, -171956, -301446, 30356, 364617, -103346, 188784, -56374, -17586, -93147, -197751, -94104, 115164, -237611, -7391, -62366, 129579, -45777, -170159, -96872, 197516, 80285, -111939, -132359, -212368, -265529, 211, 280719, 85136, 188626, -789, -57807, 112850, -106940, -111951, 197820, 223524, -124211, 131828, 4834, 145877, 189215, 364589, 65795, 213598]
10390B13598K0415b09260B21616C0500O6027M2888a26608A60717a22333l2627
10380a54960C31546I0123L32449j12665Q0456G222J92322L62414B71488D6387
10369D46602k10556K60190k6946J53232k44273q0323H352M30656j03334K13436
10359E49110k11375A57377M06840A68865J77277A70732J94686J21005J10679J47058
10349G44160j76115j79021j21587L06586k15353j34355J85068j88877H9769e1364
10338C44414m2134M131j03101N8014p1606D7656J83680b13023a6659B67367j02490
10327A64877c3140A87564o3918m9937K86516j14551L41749j37551A59560j912
10317A57648a8966n2153j39331k9147F5736A4991f818H0859P3291a74992C59367
$$ y = [213598, 234013, -209260, 221616, 30500, 96527, 139415, -126608, 160717, -122333, -154960, 331546, 90123, 422572, 309907, 390363, 7222, 199544, 561958, 271488, 46387, 446602, 236046, 496236, 469290, 622522, 378249, 297926, 8352, 439008, 335674, 549110, 337735, 157377, 564217, 168865, 346142, 170732, 365418, 486423, 597102, 744160, 568045, 389024, 267437, 574023, 358670, 224315, 409383, 220506, 89769, -51364, 344414, 302280, 306411, 203310, 261324, 189718, 47656, 231336, -213023, -16659, 267367, 164877, -33140, 187564, 123646, 73709, 360225, 245674, 587423, 449872, 159560, 157648, -18966, -71119, -210450, -239597, 65736, 14991, -6818, 80859, 154150, -174992, 359367]
10305b22081D83778a37000j41674A19314n0266K13226h716H7504b63480A41926
10294b12186f4843J9976C07595H551K7452a63483g1937r8854K2161A34598d9081
10282i1658M351E1676J6866P1979a56639f546A94889a1211A02664l3063f4222
10270a57456n5333N2390E6624a51480L8500B77744F5989d2101A76806K79762j7118
10259D39450O8247B2574L20221K10705j95073i9645C55034a64869M5145K3456
10249i6268F1153J29951a15321C9142c4045E898a96887A2319K1316a136l31909
10238c33045J16965R1610k82892A91387b90579Q4179l3298E4133J75346G9051
10227B34755a47726l58055J18458a23652B07902b87889a6151H2254b59803a08374
$$ y = [-222081, 483778, -137000, -278674, 119314, 69048, 282274, -8716, 87504, -263480, 141926, -212186, -64843, -44867, 307595, 8551, 36003, -163483, -71937, -170791, -148630, 134598, -49081, -91658, -87307, 51676, 68542, 140521, -156639, -6546, 194889, -11211, 102664, 69601, -64222, -157456, -212789, -160399, 56624, -151480, -112980, 277744, 65989, -42101, 176806, 456568, 439450, 507697, 22574, 342795, 553500, 358427, -99645, 355034, -164869, -119724, -96268, 61153, 191104, -115321, 39142, -34045, 5898, -196887, 12319, 33635, -1136, -333045, -216080, -124470, -407362, 191387, -290579, -206400, -239698, 54133, 229479, 79051, 234755, -147726, -505781, -387323, -123652, 207902, -287889, -16151, 82254, -259803, -108374]
10216a75243L9337a0836D4624b237C1555a00450a2468A89422A3664Q3079c69493
10204c135k27370k0492i4114o2795j71877O0552J0118B10357a01806I4793b12319
10192c08178P1568b5601D5120b33389o8932A45714g3384p4910D6462a10790D2279
10180e4645j54407O2028A22868K87596g7036G2499b26665O7167B7982b70026A09123
10168a6967B21695a04632l29705a65218j17910R7137O0424M3128c3028k68340
10158c01368F7446b57129M2240B15d12936C14082J06134i4317l3694N8369j89844
10147b59486d7162n2686K4779H6700J11193h9733j55500d0550j55130L3334a6149
10135b22232E294b04432g429m7109j5468F3254b303m73087f4923p4168f7654j21384
$$ y = [-175243, -135906, -10836, 44624, -2237, 31555, -100450, -12468, 189422, 13664, 96743, -369493, -3135, -230505, -250997, -94114, -156909, -328786, -268234, -258116, 210357, -101806, 94793, -212319, -308178, -236610, -25601, 45120, -233389, -302321, 145714, -73384, -148294, 46462, -110790, 42279, -54645, -209052, -147024, 122868, 410464, -77036, 72499, -226665, -159498, 27982, -270026, 109123, -16967, 221695, -104632, -434337, -165218, -283128, -185991, -125567, -82439, -33028, -301368, 67446, -257129, -214889, 215, -412936, 314082, 420216, -94317, -128011, -69642, -259486, -47162, -99848, -75069, 86700, 197893, -89733, -245233, -40550, -195680, -162346, -16149, -222232, 5294, -204432, -7429, -54538, -70006, 63254, -2303, -475390, -64923, -139091, -67654, -189038]
10123a89038E4944a54237E5955i2589A70092a88375E6225g4376j69898f2452n6713
10112a19165k25166G0588d0739j66369A00696c5796a683k01865K4940H6289b27670
10100A61784a01199j75558F8769C3490J1402b64590d9160f398A53222B651J39358
10089A42009C4495a36585c8807A5432a1869l1885F8066J10685b06746C7567d1865
10077I8609b76609A96284a59009H8537f6566A24466c15905p8461a25502A23802
10066c07641A93749e40379a60553k3771q4220A62775d11076B2294a06846A07298
10055B23356C9430J9490N3680B3846a49504d8726j89734q9074J26287N1786M4298
10044a05163n3934O1363A01976E0807J18682b04695M8352j70651a9628A70786
$$ y = [-189038, 54944, -154237, 55955, -92589, 170092, -188375, 56225, -74376, -244274, -62452, -119165, -344331, 70588, -40739, -207108, 100696, -35796, -1683, -203548, -178608, 86289, -227670, 161784, -101199, -276757, 68769, 33490, 44892, -264590, -49160, -6398, 153222, 2651, 142009, 34495, -136585, -38807, 15432, -11869, -43754, 68066, 178751, -206746, 37567, -41865, 98609, -276609, 196284, -159009, 88537, -66566, 124466, -315905, -394366, -125502, 123802, -307641, 193749, -540379, -160553, -184324, -268544, 162775, -411076, 22294, -106846, 107298, 223356, 39430, 58920, 112600, 23846, -149504, -48726, -238460, -327534, -201247, -149461, -105163, -159097, -97734, 101976, 50807, 169489, -204695, -156343, -326994, -19628, 170786]
10033g9497A70263c8691E6688L5775a69412B47165g2463m7344A20666B403J26755
10022A29158g7746L7728B19917J905n3668B4977K5537f4731n7130A92876b11297
10010b61420j83059B0288j726b1947k1912I879i8078I7662J13973a84043O4113
9999a19930r5545q1347l5415c4834j28167O8227q1895N8865j79161P1429i2741
9987b45158C7152c7019l21435B28144a14925p4763C32789A06878c88517e7551
9976c29708O4947F1643N4554J05036c59k10348A09891f8343n1777k23406J17000
9965b26526A87674a94194J1865e5165F2170b08422A59564c18868J6205a9197B46346
9953B378a41941l23591g6220o4156f453k93794A48037c09906J39777B8436C928
$$ y = [-79497, 170263, -38691, 56688, 92463, -169412, 247165, -72463, -119807, 120666, 2403, 129158, -77746, -40018, 219917, 221822, 168154, 24977, 50514, -64731, -121861, 192876, -211297, -261420, -444479, 20288, 18562, -21947, -43859, 9879, -98078, 97662, 211635, -184043, -119930, -215475, -296822, -332237, -34834, -163001, -94774, -176669, -117804, -296965, -225536, -92741, -245158, 37152, -37019, -358454, 228144, -114925, -189688, 332789, 106878, -388517, -57551, -329708, -264761, 61643, 116197, 221233, -359, -210707, 109891, -68343, -120120, -343526, -226526, 187674, -194194, -182329, -55165, 62170, -208422, 159564, -318868, -302663, -19197, 246346, 2378, -141941, -465532, -76220, -140376, -6453, -300247, 148037, -309906, -170129, 28436, 3928]
9941a63579C3759c51165B5715b11898O7357K4351a7590A99921l1916D6228j6945
9930B9283a94667O5330A80137a54459M8017k10575c636l7561n8195j66115j82553
9919d48060H7118f9772l5267B42282a91314A99762I3932g1877C9202c0630j18501
9908a49131A67983a9528k54132L6041j00953a23054n2066A6118f482m4053j38713
9897a89248h3056A29706a36369o2019f2209g924B95074D3472a06781G1197J85175
9886B56372k1907a67526L1766m36314A5368h1403A83730b2478j11935c2940j05703
9875a38643o2535i6596B03549m0018B8944J51398b61136L5720G0454a20995a9474
9863d45002a76098C24814A7646a84125A30052b6234G7113b00523B76636r2636
$$ y = [-163579, 33759, -351165, 25715, -211898, -144541, -120190, -17590, 199921, 168005, 46228, 29283, -194667, -129337, 180137, -154459, -106442, -317017, -3636, -41197, -99392, -265507, -448060, 87118, -69772, -105039, 242282, -191314, 199762, 93932, -71877, 39202, -30630, -149131, 167983, -19528, -273660, -237619, -338572, -123054, -175120, 16118, -6482, -50535, -189248, -83056, 129706, -136369, -198388, -62209, -7924, 295074, 43472, -106781, 71197, 256372, 234465, -167526, -135760, -572074, 15368, -81403, 183730, -22478, -134413, -32940, -138643, -201178, -96596, 203549, 163531, 28944, 180342, -261136, -225416, 70454, -120995, -19474, -445002, -176098, 324814, 17646, -184125, 130052, -26234, 77113, -200523, 276636, 184000]
9853A84000H3706e03803d9740A43846b65799a31619C6708c08145i6457j42370
9843b38827a7062j78391J5360m1842l12I061a0791B7445h7394n5521a3884B16487
9830b34828K1412B4384M70825b53902h1757b7052B86423a53736g6503A06427b98735
9818f26322A09262e2473E2649a49282A3985e6537n4207r9396N3492A26439b91837
9806A5711A100R6773a99849c002A6795d8738C5723K9852K23229d7954k09451A12795
9793D7333a66968F1796H028J0328g0689D23042B9790b91875d4730e112j94728
9782a99840A63207O3060b22301C53505c8992l3848j24204o5576H2966I554h2472
9770A81484i8257c2208r4114a7750B9271Q8779b04549P7561K6052A5937J99801
$$ y = [184000, 83706, -503803, -49740, 143846, -265799, -131619, 36708, -308145, -96457, -238827, -17062, -195453, -180093, -221935, -222247, 9061, -10791, 27445, -87394, -142915, -13884, 216487, -234828, -213416, 24384, 495209, -253902, -81757, -27052, 286423, -153736, -76503, 106427, -298735, -626322, 109262, -52473, 52649, -149282, 13985, -56537, -110744, -210140, -156648, 126439, -291837, 15711, 1100, 97873, -199849, -3002, 16795, -48738, 35723, 65575, 288804, -47954, -257405, 112795, 47333, -166968, 61796, 8028, 18356, -70689, 423042, 29790, -291875, -44730, -5112, -199840, 163207, 226267, -222301, 353505, -38992, -72840, -197044, -262620, 82966, 9554, -82472, 181484, -98257, -32208, -126322, -17750, 29271, 118050, -204549, -126988, -100936, 15937, 215738]
9759B15738c20854a22204b376j39352j89052b2536q7880q919k8156I1808L69M37940
9747E30117b21009e2265j46951A49926a65123n6063R0225k84946a22021H948J70519
9736A79467L9955a6614k60112M5919a1332B7411c7492a14A37918a20078b7066
9724g6729J6443b0450k0323H3412d60568J39972a52872l3212B9928i9564K324
9713i7240L4367K350k11113f5664m680j53038H5360d0223A7762b75326N2296m2367
9701b65397A22895a73839D00427F1575P1184a68001g4589B2901h2194j4710m8109
9690a45013j7899f0250I3740c40244a20730e7083l9734l179q0445j44640A6248
9678a91527j47285k2619J34902f3488K2919k38668N9142E2334K10640A6579K51046
$$ y = [215738, -320854, -122204, -2376, -141728, -330780, -22536, -110416, -119335, -147491, 91808, 92177, 530117, -221009, -52265, -199216, 149926, -165123, -221186, -130961, -415907, -122021, 8948, 179467, 219422, -16614, -276726, -230807, -11332, 27411, -37492, -114, 137918, -120078, -27066, -76729, -60286, -20450, -40773, 83412, -460568, -320596, -152872, -186084, 29928, -99564, -97240, -62873, -60523, -271636, -65664, -70344, -223382, 85360, -40223, 17762, -275326, -223030, -265397, 122895, -173839, 400427, 61575, 132759, -168001, -74589, 22901, -82194, -96904, -145013, -162912, -60250, 93740, -340244, -120730, -57083, -96817, -99996, -180441, -325081, 16248, -191527, -338812, -361431, -226529, -63488, -40569, -279237, -220095, 52334, 262974, 16579, 267625]
9667B67625b95361h8518m15784c8609l5051j47201R7162A47820h6754A97056c3138
9655i4631a5197I9402P3960b41598j44691F7120b15541j93380a13763E1607h8246
9643a0047k45866B01387a88679C2828a24869A43944j6753a63395d1910k6783C860
9631A21465a45553m2874f3688E4028F366J759a53552o5166B48414F0304K78011
9620C38315A01931b31588A31483a6174A01635J0422b09114C3505K00009J6685
9610B50199f8509m0511A25636a93770C645d4214k5268N412k89616e8089m5198
9599a03287E1791J66284C1539g1006j24338b7043E09081a96146b5376k33704M3846
9588b15234k21440J11557A26402g860k4202o036j9954a1899H890c994I5383l855
$$ y = [267625, -295361, -88518, -504302, -38609, -73660, -220861, -123699, 147820, -86754, 197056, -33138, -94631, -15197, 99402, 173362, -241598, -386289, 67120, -215541, -408921, -113763, 51607, -88246, -10047, -255913, 201387, -188679, 32828, -124869, 143944, 127191, -163395, -41910, -68693, 3860, 121465, -145553, -188427, -63688, 54028, 6366, 8125, -153552, -218718, 248414, 60304, 338315, 101931, -231588, 131483, -16174, 101635, 112057, -209114, 33505, 233514, 250199, -68509, -109020, 125636, -193770, 3645, -44214, -69482, -64070, -353686, -58089, -103287, 51791, 218075, 31539, -71006, -195344, -27043, 509081, -196146, -25376, -259080, -215234, -436674, -325117, 126402, -7860, -32062, -38098, -58052, -11899, 8890, -3994, 95383, 91528]
9576I1528J22496a44449J3744M0942A79021p5995b73887e4837j17478N6804K5973
9565h9538o7948J387k23288Q8490q3613f3628C01432j00383b0726d807A13272
9553F9736r742K0334c7603f717k30473L2934i7833l2092F7818J28801b23992R6282
9541a27710k1438f076C7868N3143a86898l2113c4809l05079B4038A0235R097d5646
9528a49603C95124A80768n9855E1348a65878F9713b24431k9928B12779f8592A81979
9516h5937r4838O3950c8996B19893d08817I8208h1028j70839b8770B00295b31967
9504B8831N5787a70450a7990j90009k80177a58098P5909A02937a66996j14459
9494b81455P8351A99721a96533g6216E2236a40752d946k8776G0432a75988L4300
$$ y = [91528, 214024, -144449, -130705, -89763, 179021, 103026, -273887, -54837, -172315, -115511, -89538, -157486, -156099, -379387, -290897, -374510, -63628, 301432, 201049, -20726, -4807, 113272, 69736, 59994, 80328, -37603, -6717, -237190, -204256, -97833, -129925, 67818, 196619, -223992, -127710, -149148, -6076, 37868, 91011, -186898, -219011, -34809, -339888, 24038, 10235, 19332, -45646, -149603, 395124, 180768, 120913, 51348, -165878, 69713, -224431, -254359, 212779, -68592, 181979, -85937, -180775, -116825, -38996, 219893, -408817, 98208, -81028, -251867, -28770, 200295, -231967, 28831, 84618, -170450, -17990, -207999, -488176, -158098, -82189, 102937, -166996, -281455, -203104, 199721, -196533, -76216, 52236, -140752, -4946, -33722, 70432, -175988, -141688]
9483a41688C956c34995j10674R1247M9061A44806J05601M5110b45101b3723E8660
9471c31592a54950A79752b64200b2732H2840m657P9638a6710E0155b62118C8924
9459g1612A84680b50983b8478l20627b183D5457c55316c7433B06207b63273g7740
9447a24364B36303D472L9983L5727N5367a00294c7368J7317G5715i4284L0349
9436f3935C30401m5249h9872j11014K7866b7436H1415K23035a69613q9778J07323
9425a52068M4057G1770B5350b33941O4622l0862d3222J8993E5201a99315j78655
9414c77970B65755L3244d75774B0801Q2350a44053b9989A62117b56162K3965C8570
9402a39395k59161J09462k19174h6633A11958b79126R6726L4464A49104i7275
$$ y = [-141688, 3956, -334995, -445669, -354422, -305361, 144806, 250407, 295517, -245101, -23723, 58660, -331592, -154950, 179752, -264200, -22732, 82840, 78183, 157821, -16710, 50155, -262118, 38924, -71612, 184680, -250983, -28478, -349105, -2183, 45457, -355316, -37433, 206207, -263273, -77740, -124364, 236303, 4472, 44455, 80182, 135549, -100294, -37368, -20051, 75715, -94284, -63935, 330401, 285152, -89872, -200886, -173020, -27436, 81415, 304450, -169613, -259391, -152068, -108011, 71770, 25350, -233941, -169319, -200181, -43222, -24229, 55201, -199315, -377970, 265755, 298999, -475774, 20801, 103151, -144053, -29989, 162117, -256162, -232197, 38570, -139395, -398556, -289094, -508268, -86633, 111958, -279126, -182400, -147936, 149104, -97275]
9391i3318J3065B10630B309J33272l19b2394D0986c57899a39070l07771a6773
9379B41919M9155q97a2089p1596j99992J24570j24435d289I057J68885a11624
9367c40475h3881p4988B79452A28529B4780a59609e9870M180A83307a73487j38583
9356c12070O1690N5220R396n2419C04044C6248b11338m2284E0835j6981R6777
9345A30631d3087G3748M0480Q828D0898b23723E7051M7391A3894b63286A3930
9333a55813h82k11360L3589K2743J2367G9326b15757l8655O7754J7726A56752
9321B43124j19837f2349c0922A32792c21374i8855j02397C2605J14976o0242M5259
9310A32598a58173j8625G3899e8919I3112l750K4833E1034e1182r5980A70324
$$ y = [-93318, -80253, 210630, 2309, 135581, 135262, -22394, 40986, -357899, -139070, -446841, -16773, 241919, 291074, 290177, -12089, -83685, -283677, -159107, -283542, -4289, 9057, 177942, -111624, -340475, -83881, -158869, 279452, 128529, 24780, -159609, -59870, -55690, 183307, -173487, -312070, -250380, -195160, -185764, -238183, 304044, 36248, -211338, -253622, 50835, 33854, 130631, -43087, 73748, 114228, 123056, 40898, -223723, 57051, 104442, 13894, -263286, 13930, -155813, -882, -212242, -178653, -155910, -143543, 79326, -215757, -254412, -186658, -168932, 156752, 243124, 123287, -62349, -30922, 132792, -321374, -98855, -201252, 32605, 147581, 87339, 132598, -158173, -176798, 73899, -58919, 93112, 89362, 114195, 51034, -51182, -147162, 170324]
9298B48209a54781I1270a25945M428A26635l2670a72734F5115a65646L0185a6255
9286b04148c310p0869j63415K8982b6485j84975C4157c1935b694j61098a4548
9274d22565A63128d4707C899d7045F3520R8273e39080c572j35268f9026n3426
9263a22452e3859k23090a02372A50608J21529a1603j49795A72981b22520c2591
9252a10854p2310O8272o3559q7709E736K72323e6739k21693o2051e1162p2293
9241a23455k51034K9882J31830J79C712J00097a35458L3665o2312e9270l102p0979
9229a33351J8773C1705b21589j13855B12452a22603c6988j40622A78508a34266
9218E7057b30618J01674k5887j36055g1373E8423i665B70210h3094j575E862J18736
$$ y = [248209, -154781, 91270, -125945, -121517, 126635, 93965, -172734, 65115, -165646, -135461, -16255, -204148, -3310, -74179, -237594, -208612, -26485, -211460, 34157, -31935, -2694, -163792, -14548, -422565, 163128, -44707, 3899, -47045, 63520, 161793, -539080, -3572, -138840, -69026, -122452, -53859, -276949, -102372, 150608, 272137, -11603, -161398, 172981, -222520, -32591, -110854, -183164, -114892, -178451, -266160, 5736, 278059, -56739, -278432, -340483, -51162, -123455, -374489, -344607, -212777, -212598, 3712, 103809, -135458, -101793, -164105, -59270, -62372, -133351, -114578, 31705, -221589, -335444, 212452, -122603, -36988, -177610, 178508, -134266, 57057, -230618, -128944, -154831, -290886, -71373, 58423, -9665, 270210, -83094, -84669, 5862, 124598]
9206A24598b89219q0326a27415M479c2965B22822b54759A40662I321J02518J7718
9195A29557J75791a58636c0302o7358k31269p3465a77284k06255a01887o4359
9185a66246e6746B45652a39229c5529k39022o6083O7911k4219G2113J42400b58004
9173A3588a00155B1052J4003e4912l31824J46450D46430i0601C0845M1532E07
9161B13962a06632a4775o8735r3822A45288J13346a95329b6499m51339B3851a43452
9149H7721R9404c91997N5850a8113q2230k7007A4830b23554Q9753a5319k15744
9138b31063D1286a86008j83713O8505a31883M9404A4415a45139d5419j68980f8427
9126A45228f7515k87196A2463L408Q2489e9980q9358C13068j24720c39044D6434
$$ y = [124598, -289219, -369545, -127415, -122936, -32965, 222822, -254759, 140662, 9321, 111839, 129557, 305348, -158636, -30302, -97660, -328929, -402394, -177284, -383539, -101887, -166246, -56746, 245652, -139229, -35529, -274551, -340634, -272723, -296942, 72113, 214513, -258004, 13588, -100155, 21052, 35055, -54912, -386736, -240286, 446430, -90601, 30845, 72377, 507, 213962, -106632, -14775, -83510, -177332, 145288, 258634, -195329, -26499, -477838, 23851, -143452, 87721, 187125, -391997, -336147, -18113, -100343, -127350, 14830, -223554, -133801, -15319, -231063, 41286, -186008, -369721, -301216, -131883, -82479, 14415, -145139, -45419, -214399, -68427, 145228, -67515, -354711, 12463, 15871, 98360, -59980, -149338, 313068, 188348, -339044, 46434]
9114B5839a48403j64724a28616e3805q3015A18046J46372A20380e0173A13549
9103a5103j37115j22179B5893J6411K31164b0185B57399a00084A2794d67254E4851
9091E2426b03137r5202a45889C82757d8927f491k60454a31702j04587C13817c2892
9079a89061a2579j17820l8738j5522D3938b48528Q9503B26000M3342h018j18305
9068a26323j10082D2069c84506a85812A60566o8349J17564a77130A88727a28148
9057c48258a17697j1940b4204k68990a46504k83375I537O4914E099d91993I3902
9045A56401n4424j1479C187L0452J39285D7320a13168k27449a2890l09095i7356
9033F1964c02645a3011j38716N0137A13971L673Q9540p6256b9411A13725A0450
$$ y = [25839, -148403, -313127, -128616, -53805, -136820, 118046, 264418, 120380, -50173, 113549, -15103, -152218, -274397, 25893, 42304, 273468, -20185, 257399, -100084, 12794, -467254, 54851, 52426, -203137, -298339, -145889, 382757, -48927, -6491, -266945, -131702, -236289, 313817, -32892, -189061, -12579, -130399, -169137, -184659, 43938, -248528, -159025, 226000, 269342, -8018, -126323, -236405, 42069, -384506, -185812, 160566, 92217, 209781, -177130, 188727, -128148, -348258, -117697, -129637, -24204, -293194, -146504, -429879, 9537, 74451, 5099, -491993, 93902, 156401, 101977, 90498, 3187, 33639, 172924, 47320, -113168, -340617, -12890, -321985, -97356, 61964, -302645, -13011, -151727, -101590, 113971, 117644, 207184, 130928, -29411, 113725, 10450]
9021B3585g9627A78073d3982A07213m9012h0912L2797k25773k9616j91117a63573
9009a48986C9404K236d3651j54690A25715K34598g7923E2154O3449e6215n2711
8998a08926A56720r337i5605j74116a8874j68226O5435p4160j06420a18036e2014
8986f1034o3329g161k1648j38463I7733l614a48637l9200A6691Q0641b71164B66023
8973c28248B3808b01659H3408a87664a9078p79583E2066A8349Q5826k2095a26214
8961a10340B47028d8362C5169J01081A0204J7400a20159j80j45340A07130a1197
8949b74799f156k60597P9535g5782I2261b22412f3405n4843j43597J7574A44153
8937A11743J28779q5089J69394A43189K86148a56948j77927e5738A57481D7518
$$ y = [23585, -79627, 178073, -43982, 107213, 58201, -80912, -48115, -273888, -303504, -494621, -163573, -148986, 39404, 41640, -43651, -198341, 125715, 360313, -77923, 52154, 115603, -56215, -108926, 156720, 147383, -95605, -269721, -18874, -187100, -121665, -195825, -302245, -118036, -52014, -61034, -124363, -7161, -28809, -167272, 97733, 94119, -148637, -187837, 16691, 97332, -271164, 266023, -328248, 23808, -201659, 83408, -187664, -19078, -798661, 52066, 18349, 104175, 82080, -126214, -110340, 247028, -48362, 35169, 136250, 10204, 27604, -120159, -120339, -265679, 107130, -11197, -274799, -6156, -266753, -187218, -75782, 92261, -222412, -63405, -118248, -261845, -244271, 144153, 111743, 240522, 155433, 324827, 143189, 429337, -156948, -334875, -55738, 157481, 47518]
8926C35094J28833L30330Q26430K175998P697255l26833C678712A540351D62617
8916D89024o1150A46742Q0087g2281B5256J91607g9781D50827K12204G0795b49911
8904A47761a50763B5256c0489k72585E3066h4093E3667a74182e0393B32920C3699
8892b13923A26064Q1468b13840i0179j27049D4502b47341j00511A20453a90900
8881a78879l9781B29277a08620A02565a22854d2318B51142H1370K35896b34353
$$ y = [335094, 463927, 794257, 1620687, 3796685, 11493940, 11167107, 3678712, 1540351, 462617, 489024, 427874, 146742, 226829, -72281, 25256, 216863, -79781, 450827, 663031, 70795, -249911, 147761, -150763, 25256, -30489, -303074, 53066, -84093, 53667, -174182, -50393, 232920, 33699, -213923, 126064, 207532, -213840, -90179, -217228, 44502, -247341, -347852, 120453, -190900, -178879, -218660, 229277, -108620, 102565, -122854, -42318, 251142, 81370, 317266, -234353]
$$ [...]