
##TITLE=AC1385_GUAAH12197_7519639_KFkDCzDVAo
##JCAMPDX= 6.0         $$ Bruker NMR JCAMP-DX V2.0
##DATA TYPE= NMR SPECTRUM
##DATA CLASS= NTUPLES
##ORIGIN= BRUKER
##OWNER= Administrator
$$ 1.72 TOPSPIN		Version 2.1
$$ 2013-02-20 18:32:28.783 -0500  Administrator@X
$$ Compression mode = diff/dup
##.OBSERVE FREQUENCY= 400.02188249412
##.OBSERVE NUCLEUS= ^1H
##.ACQUISITION MODE= SIMULTANEOUS (DQD)
##.ACQUISITION SCHEME= undefined
##.AVERAGES= 8
##.DIGITISER RES= 22
##SPECTROMETER/DATA SYSTEM= spect
##.PULSE SEQUENCE= zg30
##.SOLVENT NAME= COFFEE_meoh
##.SHIFT REFERENCE= INTERNAL, COFFEE_meoh, 1, 14.98509
##AUDIT TRAIL= $$ (NUMBER, WHEN, WHO, WHERE, PROCESS, VERSION, WHAT)
$$ ##TITLE= Audit trail, TOPSPIN		Version 2.1
$$ ##JCAMPDX= 5.01
$$ ##ORIGIN= Bruker BioSpin GmbH
$$ ##OWNER= Administrator
$$ $$ E:\/data/COFFEE/nmr/AC1385_GUAAH12197_7519639_KFkDCzDVAo/10/pdata/1/auditp.txt
$$ ##AUDIT TRAIL=  $$ (NUMBER, WHEN, WHO, WHERE, PROCESS, VERSION, WHAT)
(   1,<2013-02-20 18:32:19.908 -0500>,<Administrator>,<X>,<go>,<TOPSPIN 2.1>,
      <created by zg
	started at 2013-02-20 18:31:13.561 -0500,
	POWCHK enabled, PULCHK disabled,
       configuration hash MD5:
       86 BA 57 50 F2 9D 5C 9B 26 00 A9 28 5F 66 2E 89
       data hash MD5: 64K
       6D EB E8 50 42 AF AD D8 10 B7 6B E8 C4 4F FB 13>)
(   2,<2013-02-20 18:32:23.517 -0500>,<Administrator>,<X>,<proc1d>,<TOPSPIN 2.1>,
      <Start of raw data processing
       efp LB = 0 FT_mod = 6 PKNL = 1 PHC0 = 0 PHC1 = 0 SI = 32K 
       data hash MD5: 32K
       2E E1 93 68 79 41 C6 2B B4 B5 6B 2F 1B E4 C0 A7>)
(   3,<2013-02-20 18:32:23.986 -0500>,<Administrator>,<X>,<proc1d>,<TOPSPIN 2.1>,
      <pk PHC0 = 68.29651 PHC1 = 0 
       data hash MD5: 32K
       01 2C D1 68 A1 47 6D B4 0C B0 25 97 65 C1 0D 74>)
(   4,<2013-02-20 18:32:24.220 -0500>,<Administrator>,<X>,<proc1d>,<TOPSPIN 2.1>,
      <abs ABSG = 1 
       data hash MD5: 32K
       0F 98 F4 92 5B A1 81 2E C6 5D 28 E3 3A 35 B2 1B>)
(   5,<2013-02-20 18:32:24.392 -0500>,<Administrator>,<X>,<proc1d>,<TOPSPIN 2.1>,
      <abs ABSG = 2 
       data hash MD5: 32K
       28 93 29 DC 8F AF AE 30 E0 03 1F 5C 4E 7E 86 01>)
(   6,<2013-02-20 18:32:24.533 -0500>,<Administrator>,<X>,<proc1d>,<TOPSPIN 2.1>,
      <abs ABSG = 3 
       data hash MD5: 32K
       CF 10 16 CB FF 0A 2A C8 71 13 54 BC 02 CB 98 7E>)
(   7,<2013-02-20 18:32:24.704 -0500>,<Administrator>,<X>,<proc1d>,<TOPSPIN 2.1>,
      <abs ABSG = 4 
       data hash MD5: 32K
       C5 86 4F D6 67 99 2C FC 66 69 D7 42 41 C7 91 FE>)
(   8,<2013-02-20 18:32:24.861 -0500>,<Administrator>,<X>,<proc1d>,<TOPSPIN 2.1>,
      <abs ABSG = 5 
       data hash MD5: 32K
       2D 03 BD 65 9E 5C 5F 43 FE C2 C9 88 C0 A8 A1 93>)
$$ ##END=
$$ 
$$ $$ hash MD5
$$ $$ E1 BB FB 29 39 13 63 61 AF 1B 87 A5 1C 34 33 06
##$RELAX= 
##$RELAX= 
##$RELAX= 
##$RELAX= 
##$RELAX= 
##$RELAX= 
##$RELAX= 
$$ Bruker specific parameters
$$ --------------------------
##$DU= <E:\>
##$EXPNO= 10
##$NAME= <AC1385_GUAAH12197_7519639_KFkDCzDVAo>
$$ [...]
##$TP= (0..7)
150 150 150 150 150 150 150 150
##$TP07= 0
##$TPNAME0= <>
##$TPNAME1= <>
##$TPNAME2= <>
##$TPNAME3= <>
##$TPNAME4= <>
##$TPNAME5= <>
##$TPNAME6= <>
##$TPNAME7= <>
##$TPOAL= (0..7)
0.5 0.5 0.5 0.5 0.5 0.5 0.5 0.5
##$TPOFFS= (0..7)
0 0 0 0 0 0 0 0
##$TUNHIN= 0
##$TUNHOUT= 0
##$TUNXOUT= 0
##$USERA1= <user>
##$USERA2= <user>
##$USERA3= <user>
##$USERA4= <user>
##$USERA5= <user>
##$V9= 5
##$VALIST= <valist>
##$VCLIST= <CCCCCCCCCCCCCCC>
##$VD= 0
##$VDLIST= <DDDDDDDDDDDDDDD>
##$VPLIST= <PPPPPPPPPPPPPPP>
##$VTLIST= <TTTTTTTTTTTTTTT>
##$WBST= 1024
##$WBSW= 4
##$XGAIN= (0..3)
0 0 0 0
##$XL= 0
##$YL= 0
##$YMAX_a= 563837
##$YMIN_a= -561637
##$ZGOPTNS= <>
##$ZL1= 120
##$ZL2= 120
##$ZL3= 120
##$ZL4= 120
##$ABSF1= 14.98509
##$ABSF2= -5.573092
##$ABSG= 5
##$ABSL= 3
##$ALPHA= 0
##$AQORDER= 0
##$ASSFAC= 0
##$ASSFACI= 0
##$ASSFACX= 0
##$ASSWID= 0
##$AUNMP= <proc_prof1d_extract_pilot.lims>
##$AXLEFT= 0
##$AXNAME= <>
##$AXNUC= <1H>
##$AXRIGHT= 0
##$AXTYPE= 0
##$AXUNIT= <>
##$AZFE= 0.1
##$AZFW= 0.1
##$BCFW= 0
##$BC_mod= 0
##$BYTORDP= 0
##$COROFFS= 0
##$CY= 15
##$DATMOD= 1
##$DC= 0
##$DFILT= <>
##$DTYPP= 0
##$F1P= 0
##$F2P= 0
##$FCOR= 0.5
##$FTSIZE= 32768
##$FT_mod= 6
##$GAMMA= 0
##$GB= 0
##$INTBC= 1
##$INTSCL= 1
##$ISEN= 128
##$LB= 0
##$LEV0= 0
##$LPBIN= 0
##$MAXI= 10000
##$MC2= 0
##$MEAN= 0
##$ME_mod= 0
##$MI= 0
##$NCOEF= 0
##$NC_proc= -8
##$NLEV= 6
##$NOISF1= 0
##$NOISF2= 0
##$NSP= 0
##$NTH_PI= 0
##$NZP= 0
##$OFFSET= 14.98509
##$PC= 1
##$PHC0= 68.29651
##$PHC1= 0
##$PH_mod= 1
##$PKNL= yes
##$PPARMOD= 0
##$PPDIAG= 0
##$PPIPTYP= 0
##$PPMPNUM= 2147483647
##$PPRESOL= 1
##$PSCAL= 4
##$PSIGN= 0
##$PYNMP= <proc.py>
##$REVERSE= no
##$SF= 400.02
##$SI= 32768
##$SIGF1= 0
##$SIGF2= 0
##$SINO= 400
##$SIOLD= 32768
##$SPECTYP= <>
##$SREGLST= <1H.CDCl3>
##$SSB= 0
##$STSI= 32768
##$STSR= 0
##$SW_p= 8223.68421052631
##$SYMM= 0
##$S_DEV= 0
##$TDeff= 65536
##$TDoff= 0
##$TI= <>
##$TILT= no
##$TM1= 0
##$TM2= 0
##$TOPLEV= 0
##$USERP1= <user>
##$USERP2= <user>
##$USERP3= <user>
##$USERP4= <user>
##$USERP5= <user>
##$WDW= 1
##$XDIM= 32768
##$YMAX_p= 459919291
##$YMIN_p= -766776
##$CURPLOT= <Network HP LaserJet P1505>
##$CURPRIN= <$Network HP LaserJet P1505>
##$DFORMAT= <normdp>
##$LAYOUT= <+/1D_H.xwp>
##$LFORMAT= <normlp>
##$PFORMAT= <normpl>
##$SURQMSG= 1
$$ End of Bruker specific parameters
$$ ---------------------------------
##NTUPLES= NMR SPECTRUM
##VAR_NAME=  FREQUENCY,     SPECTRUM/REAL,   SPECTRUM/IMAG
##SYMBOL=    X,             R,               I
##VAR_TYPE=  INDEPENDENT,   DEPENDENT,       DEPENDENT
##VAR_FORM=  AFFN,          ASDF,            ASDF
##VAR_DIM=   32768,         32768,           32768
##UNITS=     HZ,            ARBITRARY UNITS, ARBITRARY UNITS
##FACTOR=    0.250966925370066, 1,           1
##FIRST=     8223.43324360094, -50785,       75318
##LAST=      0,             200713,          -170217
##MIN=       0,             -766776,         0
##MAX=       8223.43324360094, 459919291,    0
$$ Real data points
##PAGE= N=1
##DATA TABLE= (X++(R..R)), XYDATA
$$ [...]
23857 98652 72603 108820 -149111 -71731 -271401 -5150 392392 -11343 165427 330747 57910
23845 -93710 31718 63921 133424 198983 1349 -377588 252501 70106 -268990 205341 -40323
23833 423826 -87201 8316 141552 10986 -117938 -86678 25671 10463 -44621 153669 -126425
23821 5937 187757 -21770 309767 62690 -45735 -72087 -40306 -219627 20130 -42723 111713
23809 356123 71775 52650 -153339 -266711 -317789 260195 -281196 -266098 133161 55852
23798 -266351 -164471 -295307 212119 49720 -170280 -300298 -178560 -3668 -283598 -186525
23788 -186525 1006 -179729 73556 -81534 178099 88214 108720 -148980 -95399 12716 244662
23777 244662 541880 134177 114500 -296830 48624 150768 -53326 -63054 1819 -60749 -218617
23766 -218617 -71551 -448194 189763 76782 70216 -26614 -165401 22953 20223 -117440 -275289
23755 -275289 124667 -60718 -38495 77609 105666 40332 -108144 -134886 -322156 -85768 335598
23743 -58903 92526 12940 -68005 313036 -154372 140818 182336 199462 -129706 -106710 106865
23731 -87393 140985 39307 3793 1330 -111237 -244072 -165587 36987 171036 140829 -32306
23719 130506 -320251 -70905 78752 98640 194070 8479 -130983 -15384 -104378 190581 -203537
23707 223923 -72318 -7929 136682 114733 -129415 138823 165424 -199973 45981 111430 162299
23696 162299 -348966 -298405 88140 -269659 -138053 168618 121496 115265 -69545 -47407 48183
23684 -44474 22900 -110395 -51654 -54867 -26430 -93545 16163 273257 -139048 -7958 154650
23672 114529 -26980 -363832 99515 41886 -159989 -57604 -165901 -204728 161799 -193028
23661 -58506 124363 50197 -144797 -345500 -132391 233968 -314875 -173679 150542 356169
23651 356169 195062 110095 161488 -622198 -118880 -43506 229407 -84101 -185817 -231365
23641 -231365 94657 -127573 -98172 98413 -135036 -36226 62050 96342 -253039 -191431 209906
23629 -284809 36126 46357 -297083 4107 -330627 117874 159647 -49561 54893 -147373 16903
23617 -71371 80273 -41036 65023 229373 61345 -104364 -95047 190023 -32373 -37686 -175722
23606 -175722 157924 209056 75912 -69658 -78921 26438 78002 1730 151669 48798 214543
23595 214543 -142787 -6944 -168047 -327228 144499 -40401 -272808 352598 -347688 -184323
23585 -184323 -80817 486360 253886 66620 97823 -152975 179619 6163 -108986 -249113
23575 -249113 118449 77018 -129144 -164944 66890 -227294 37431 -172464 -311733 281397
23564 -133760 152647 521121 191676 -257796 -16142 155835 193414 44295 82349 11888
23553 -136860 -168812 14270 51003 -73981 116232 -181518 405518 79813 367415 -315 186970
23541 104235 58613 -157564 -41603 -20396 -374028 -195483 -166144 -252166 -361840 180808
23530 46127 159024 154670 -364391 -213419 -348780 -106098 3144 -48564 -148185 -214505 -13956
23518 -208682 -489496 129888 -236739 40293 15802 -334550 -140643 45326 -296264 -135697
23507 33956 177341 33374 -307677 -240493 -101895 -168290 209494 -82388 228277 -169313
23496 -255403 -32632 -415494 -3162 8965 118357 -108355 -116599 27649 22176 -256566 290284
23484 -269728 117825 164965 -37236 21893 -136944 128862 80050 138983 171820 -72162 51583
23472 193434 -88045 105554 -19889 -34728 -191151 322470 -214630 -458172 80025 60246
23462 60246 -144227 262115 -92549 147967 -141140 -26840 -71380 -234813 44427 -28526 115083
23450 -270048 -4 51681 -10016 -511309 -95941 -14191 -68516 424669 43193 -115279 160623
23438 -183005 -366497 225373 8337 -57722 -379707 8143 86984 -237153 -98437 -183998 76768
23426 322182 -173932 135336 91275 -68799 138794 -120400 -35521 12989 65400 129420 -57198
23414 225367 -40205 46668 411668 185262 43031 -38130 -10031 71034 206728 -281688 29110
23402 60684 -254603 -134786 -287598 -12154 -90008 263091 -199303 70371 122662 485 -269743
23390 -21245 -84855 -47522 -52730 -395710 82418 -27782 85044 -8836 -74538 74996 -95830 41526
23377 20463 446353 73947 -122320 98263 3815 -125748 75344 54435 8815 129938 -11417
23365 -50906 -6559 -168357 -193162 286410 -101468 -65130 88894 73120 249791 -181452 -1441
23353 37392 -379753 -290469 -42548 -81437 10574 380214 -303999 -74991 166014 -47201 -232564
23342 -232564 49668 149432 -173605 136151 78267 170689 349663 160007 106106 -129455
23331 64962 112248 -224752 11702 18723 129704 -125626 191730 -172195 -31691 198074 3577
23319 -47240 -17582 -169994 80386 120795 297824 171913 100413 -49186 -68736 -56688 -141956
23308 -141956 -67132 -115604 -341270 152491 101609 137643 237187 105686 -198308 -85715 -44792
23297 -44792 -24127 158877 252977 221754 127912 -57838 129814 79414 64515 -10174 44898
23285 -13089 139992 -451904 -305419 104776 110475 59921 47139 -28472 -290730 26788 177571
23274 177571 -99844 190687 56824 -218970 -201457 -201118 110772 -196035 52816 39772 146840
23263 146840 -270910 -88620 99812 209054 -68070 83136 109992 -216244 -224158 77582 10421
23251 -357569 -124085 -20415 -266351 76324 -60883 -2319 -401444 -78274 -186805 -49591 38359
23239 -97649 -212565 -14222 102924 91549 -56447 43856 -24478 -78906 390770 173970 -56940
23227 219783 98488 33480 -478630 123230 -53924 101903 156248 90058 337644 -368817
23216 -101924 48096 73941 33598 -12104 7371 19477 93435 -445136 -326411 165178 -100443
23204 -184513 277276 197368 -18834 105821 -38181 -106791 245591 -86123 80653 146170 46533
23192 -136308 -137604 -60169 -81524 -24039 157089 69220 127322 119438 -314999 139860 -14430
23180 -170049 -63286 86992 -318732 -167218 190096 -167143 -447437 -296653 -396270 -72886
23169 -101621 -39666 195868 9640 -60311 -28568 79022 -63484 178014 6470 24634 -5921 239427
23156 -42094 -258602 26278 -24076 -122096 -194665 86127 204722 218201 -74771 -394579 130213
23144 239145 -30516 119450 -121377 4313 -172178 -109304 244196 -865 316013 -73495 -50624
23133 -50624 326153 -213315 -39939 -45071 79192 -123768 -169644 -80129 -172042 -206529 -220352
23122 -220352 116228 -85156 -2969 105698 -136719 232917 38289 -103252 189266 -94841
23111 -70137 417294 63544 94274 234776 -270729 49417 50886 -16414 33373 91812 115746
23100 115746 -1594 230800 -16723 93516 126296 104883 -113155 -16825 -217278 -2797 231792
23088 193038 68510 60543 -102223 190028 -99082 -276900 -80761 -122947 -181096 103486 -21339
23076 -237661 -77904 -105365 -304020 -234127 21116 84001 119436 -30165 -113858 -120391 183121
23064 -62924 -176802 -216643 141235 205446 204155 69495 -186912 -36819 -190073 269255 115308
23052 -74608 240731 -78112 -158831 -40486 178177 64171 7269 -15134 -67033 232789 -224265
23040 -70520 169717 277389 -215643 43540 38098 129005 -218934 -23331 369789 247221 84419
23028 316506 -98615 25800 -217700 -165082 -129798 -92431 281870 -109065 74179 -51964 -192145
23017 -192145 -164443 85087 44267 -150456 -37385 -224838 214879 151150 71866 40164 -259685
23005 183908 43566 -55545 156796 150171 -225462 -70163 -43026 31011 -9877 389169 -215813
22993 13412 -291643 -30157 -216186 -123548 -202349 150488 -35526 -168054 -60471 -33751 -407517
22982 -407517 -261291 -208907 52084 31543 -290980 -35939 55708 -58020 -21729 -277745 71063
22970 -128734 -4661 137688 15932 -25887 -147119 34488 -100316 -74504 -19052 -62355 100143
22958 -275204 105733 -198684 -159468 -96511 -44531 -311947 -4311 -51281 16448 -3720 112546
22946 -33069 82854 73827 -882 2506 -283070 -14411 97770 -237422 -44391 -37168 -128854 -161021
22934 -161021 -16370 -187172 -34580 190804 -76756 -76589 -171048 171982 -84934 -101422 -108421
22923 -108421 -155036 34983 341899 155164 -97553 46093 -133150 -90724 129354 -187316
22912 167921 -88736 -406009 -237553 -148792 8810 66980 137311 157534 -213699 -280575 170431
22900 -439179 -208577 -104337 -277083 73691 107376 60278 139839 -356978 -126690 -207771
22890 -207771 -215723 45193 -27599 55253 333911 213707 -182004 -181237 -177796 -300177 -29788
22878 -63510 -100806 474814 -149606 -409944 -30239 -61016 -14369 72853 -51997 -266434 -151566
22867 -151566 -74293 64244 147313 86957 -118934 -207490 -184098 -130168 -99872 -153960 50158
22855 23484 -188302 -969 30706 159664 347569 -32628 -124424 -114838 -84381 269073 -116607
22843 138663 -44846 -141767 145263 31323 -99327 -143845 210513 -22845 -176989 -336263 56879
22831 -197933 -75646 -139190 5391 83777 34198 310925 -66598 107287 -129367 -219404 78435
22819 214253 75331 138948 -212933 58240 136918 -296209 -7877 -124931 170134 309607 111240
22807 15415 256419 244570 -19733 -149105 -129224 107394 12719 -245520 -100934 -77792 -4398
22795 114625 114279 85332 -79763 -248756 -38008 -23619 -38600 -222837 91348 97624 87620 28451
22782 -68496 116811 -36602 -22759 -343948 26837 -30752 -31731 196823 95256 2097 119459
22771 119459 -168037 87117 146716 141537 -28117 -133946 -53019 -99970 -12755 -69088 -118794
22760 -118794 256823 79797 7844 -188434 -194984 136603 -53878 -255894 56963 -145767 -299753
22749 -299753 -116791 48552 -187160 14504 18757 -258976 -88788 -277447 -153930 191039
22738 147064 -328228 82166 33469 -153931 -140679 -45431 293279 167059 -102233 -117048
22728 -117048 -116270 -304390 95310 232852 -155808 157434 -158201 54821 -247173 -298823 -264868
22717 -264868 -32111 -41016 -151839 -11334 -155022 233436 -492874 66804 204035 97446 -131742
22705 184819 -84415 -159794 166706 184503 -13618 167719 28382 -98055 -148775 -181275 -17355
22693 304046 -93936 -40185 47244 24535 -312418 -280072 -64098 128233 -114512 -7899 -232784
22682 -232784 -5816 -34739 -48524 357232 52717 190247 -4648 -75222 -78296 177974 152249
22671 152249 237236 -240938 -33157 -57992 20719 -134734 -18462 32003 19086 -546140 205068
22659 -190587 126220 -129834 114552 -295809 -190475 34305 -368893 -61725 -158216 86718
22648 136316 -161389 115103 -70257 118298 -180175 -10547 -44235 69031 -128144 -28012
22637 50406 -119551 -245212 -121666 -376816 -34515 -66519 -23718 20916 -419528 -314969
22627 -314969 -175848 -15524 130985 -300380 30360 308084 -104492 -76274 -241752 -251785
22617 -251785 -13677 132923 160046 -68191 388584 -89800 -14136 41554 143163 -166792 8460
22605 241048 -45253 -76479 241677 11113 138342 199626 -30906 102375 12107 351757 -13198
22593 -396672 -48242 16365 -314517 390870 151937 -213904 54582 269849 44043 -157024
22582 -49108 -416203 129738 -111804 -113883 65274 -98663 262672 60344 142751 4332 -56136
22570 26120 -167097 -137385 -176570 -307509 -321885 -243711 -221430 -199143 -37319 -22505 4134
22558 -185587 67535 142793 -38318 145994 -19332 -217110 -148481 163766 -93833 37277 113354
22547 113354 -211090 -4100 99385 219731 86447 155026 151534 -278497 -70491 -157594 234616
22535 -35978 -81324 204892 117843 -22927 239549 -181769 -351130 33825 253750 -82134 171723
22523 -9043 -219056 65820 82329 -29418 119697 58602 216004 -222546 -91093 -68460 150443
22511 -377141 291839 -8066 -48002 -69691 -167992 123950 -114935 -166421 -52583 -157319 -32027
22499 -264951 -298631 38775 137387 -176108 250033 23087 7188 16857 181274 -13713 75491
22487 -28028 157017 99311 66355 -230659 19729 -109284 241471 -103446 552185 -87075
22476 243606 -18802 -285004 3717 -150019 108754 56991 20510 158839 -197514 -135210 -52514
22464 77010 -76576 -279846 -241502 -86631 -57803 -98815 129499 64133 -82494 3063 163912
22453 163912 -148124 11488 465229 -38849 95275 138002 170187 -197302 119132 -114628
22442 -53927 41681 -28203 -116657 179962 -125568 75644 -102978 88663 -69711 130244 -205836
22430 81228 -5582 -215132 196651 -193570 18497 205393 -819 -117197 -198507 39171 -37372
22418 48427 143936 86880 -61743 99783 -84441 324302 -13393 -40516 -99041 65979 204919
22407 204919 -134405 213532 92058 -274 38895 206987 144527 -70622 32445 -38268 -239456
22396 -239456 -200475 71795 -323117 -40512 -185722 63177 6516 48372 -7720 -356918 -248977
22385 -248977 -147039 228987 -22294 125435 -33464 -156059 278546 25087 -149683 -61230
22374 -225628 81178 89557 117484 -294188 292081 148050 -25618 -296002 -64391 -80140 -397128
22363 -397128 -434710 -179755 -151045 181384 -299949 -27433 91254 66497 38416 -325909 15403
22351 12096 175406 113069 130774 -174391 -112642 -76718 -73814 3722 58952 168570 160073 17898
22338 99508 -157192 -116721 99290 -80792 111420 -229436 -144922 70368 107494 -279872 80715
22326 181825 18747 105049 115320 54880 -17258 -121462 93485 -72835 -271766 -95441 -43289
22314 98849 -256525 -145975 16665 95819 11613 9234 -303511 -241347 110625 -171690 -157842
22303 -157842 -195969 -107744 -140274 -263596 -12372 -10650 -147630 -81524 -148133 73243 -33395
22291 411847 -169000 -305236 -309365 66343 -135058 44607 275112 61953 80586 65860 -142280
22279 -119517 -160698 -355566 -150577 82429 168530 -366732 109534 -460454 -383044 -96541
22268 -21198 -44296 -386002 -65725 -85060 297228 -444907 -85494 347817 21882 -240828 70073
22256 -40745 -287443 -146659 -284921 -356528 -176515 -152928 -325172 -136361 -14708 121494
22245 -125084 -353100 204632 -39190 -158357 -205223 153645 -212794 -83980 -96678 231571
22234 -121218 -140951 28864 -114219 -121525 -465 51343 2764 -343738 -250883 26409 -79379 -102370
22222 -102370 -221168 -238059 -147654 327730 241811 -106933 210698 -123526 -133965 -304044
22212 -304044 -6929 -134170 138852 160362 -359147 120583 26412 -146713 -154460 79436 211771
22201 211771 20469 -18197 69162 167735 -99855 -39445 44265 -243308 -108494 156990 64746
22189 195402 199037 -135020 -72646 -224294 -70942 108916 -335478 -460178 70970 224720
22179 224720 -252179 -94429 126106 48853 23596 -167171 327007 154663 80867 115348
22169 115348 -441757 -118984 -52767 -68045 -212522 14399 148007 -264350 145963 -238716
22158 -292628 -46101 -417833 2099 65884 382369 -43791 -313173 -180701 -247120 -72456 115406
22146 -119736 -12003 -41826 251555 -98437 210456 49934 39712 -190480 90265 -222165 -17048
22134 170456 -20700 72706 328980 -296623 -3385 -7853 206387 -168897 370814 -34905 64710
22122 152060 126024 -212903 17869 553 180327 41933 -5392 194572 71069 198347 -217754
22110 86490 -281178 131047 251970 -32236 62199 -133092 -518449 190395 316587 306118
22100 306118 144402 164995 1828 120412 -88877 10660 -94028 63091 8462 107616 -234870
22088 -283394 -138371 260166 160797 -328727 -86799 -77862 -48218 -84588 138553 119596 -164777
22076 -94595 -193644 -85707 139933 -79448 -65306 95006 -226115 64576 82983 97862 -51002
22064 243341 187412 248170 191491 133763 -199644 -278924 80084 -41529 382722 49750 -49893
22052 -190408 42449 177889 -123093 -280357 -82569 -86662 -356381 26007 32705 178983 -9087
22040 10896 -325687 -445324 -63243 179335 83690 -5996 168395 42350 -207553 -86609 -2358
22028 17199 -67498 -48705 158928 129955 -482357 -117604 -20773 -240561 -16252 -167501 189093
22016 -157680 -240890 38514 43021 -257008 -17800 105219 -312959 28007 50250 -83309 -451745
22005 -451745 306530 -100075 160686 -118973 -300639 -126699 -183546 -337900 56235 -268537
21994 -421652 243554 -126026 102192 -2456 3563 154601 -371606 -145430 -215597 162953
21983 -50386 284362 -112022 95747 -245653 -237996 86273 -156885 -126029 304494 267285 -35457
21971 162119 130405 236617 -237462 69465 69560 -288291 -64280 -385599 -210290 147023 -141820
21959 42959 -61906 86519 -42507 71279 -55873 153606 98235 -13746 -147058 -275509 -1965
21947 275997 -78783 -82415 -255202 -161977 -4915 1689 -189518 -387915 51582 -423514 74029
21935 -119312 54821 -255075 -55153 -232642 -95756 -182284 -40504 19783 -190694 -175392 -19777
21923 -397123 -247860 279858 271626 -138100 -54871 112796 -90660 -180463 120097 -115270
21912 -121870 -72733 -166531 -158498 32162 63798 -148091 -187972 -69117 -147407 -131584 9633 101004
21900 101004 -188461 53456 -320665 -142502 -27684 -296469 -120930 -39593 99738 -95179
21889 -570552 10332 -167026 -149662 -3715 109942 3117 178784 -149303 -58993 275340 269350
21878 269350 -144391 45837 163213 -205359 66750 -266795 -156805 -304982 -284395 132428
21867 207099 -117738 -309907 -224765 26062 33925 -36874 171095 -331299 -160275 187259
21856 141472 -357448 -351865 337981 -205435 254149 -357745 -207379 -65580 -222067 84295
21845 159624 -57643 -74061 45134 131596 -96136 -110241 -200101 -74377 6401 90570 -338095
21833 105928 77904 -135872 91105 875 139022 -226966 3633 -33394 94838 97637 -118926
21821 132362 205319 -71733 -44009 88334 -192725 -105293 133443 -184907 6057 -15424 -209528
21810 -209528 -173600 -22938 56711 -118242 22373 65562 -142970 -18020 283597 -368446 -154744
21798 83500 -487465 -109071 -184178 106272 -116656 -82930 -10519 -143178 -9740 125929 -24031
21786 253591 -105699 -94310 -155955 -5835 380259 -781 119378 200699 113881 91017 -83765
21774 50536 -221399 -642874 -129259 195344 -123197 14195 -136956 210149 19289 -85269
21763 32047 55222 -88548 -244485 198851 123934 -346237 76341 -138376 -197673 -182745 -111866
21752 -111866 13481 -275882 189151 98868 -123430 -155703 -113631 -326875 -259741 -318838 126501
21740 70078 -12164 3766 -105610 -173085 -192859 130351 -41557 246422 -148396 115282 272693
21729 272693 -2420 -87239 -20978 12258 -75772 173009 -162298 60841 -90051 -15688 142978
21717 -14317 -215169 -8305 -19717 -153225 -343472 294993 237617 -77665 -107920 220163 37733
21705 38258 220840 -265283 -218960 -282442 -277212 -163191 46849 -4581 50789 -34303 -69403
21694 -69403 -159322 -130692 136108 -150337 -52386 -36276 -55953 -7505 54107 -55989 -317879
21683 -317879 -207673 48663 -24026 12815 -58044 -120984 -159356 133771 -58122 98531 134627
21672 134627 52853 85698 12774 106982 207 160424 136077 -308863 76176 264077 -259771
21660 43875 191729 -246811 326593 15479 -199678 -75012 -243244 39001 102054 59854 -6826
21648 20914 35676 7602 -25850 127362 47034 299797 -96158 -326798 -171084 306328 -54881
21636 -216070 -12052 -41312 25807 -126043 -33891 -55846 63541 4840 -46627 121269 -233804
21624 -154412 34166 134194 -115054 -50613 -202464 66171 -76788 -41849 117354 -67543 -30090
21612 164128 -269593 -115850 39483 100513 -280354 -105315 -10238 138452 -34989 -255800
21602 -255800 -423010 -227349 8063 -294670 62466 6692 -102026 -273847 -66217 58429 97389
21591 97389 -150423 79412 -22230 -102792 -33156 95743 -178370 -72314 -187823 -120719 -460438
21580 -460438 -113661 13335 -46962 -237206 -10987 -87956 -23742 -79821 -263158 -32635 80892
21568 51556 -130029 231659 -152430 229294 -48011 28389 -1500 -236687 47666 -99946 -53129
21557 -53129 -84990 -170894 21229 -67615 -54886 326648 47327 -10929 94497 -310354 -72317
21545 -9901 18608 -141473 -170349 206246 51448 -173631 253287 -2137 -26626 -100443 -6127
21533 -248074 -361585 -176020 85848 179718 134605 114715 -464860 -40521 -47836 -54753 -151264
21522 -151264 101069 530 74798 -100158 -87001 -242627 48553 -128976 -194851 -94183 -289631
21511 -289631 302929 -25982 79983 3975 -57381 -205312 50250 -116351 -108068 172817 -143118
21499 20244 -309808 -141132 22691 -156795 -265518 -81873 246257 199200 -210894 57584
21488 93014 -180891 -268217 134019 -6128 51878 -94219 -50147 -161092 -46779 -21802 -25450
21477 -25450 31373 -74244 210007 50360 -223556 -143798 -128214 -412807 230469 32567 35021
21466 35021 -67715 -279127 26056 -40150 230302 -270269 52365 -93985 -133398 -266222 -403236
21455 -403236 189065 -36581 -229081 283099 1747 204741 61156 -57483 -106983 -34727 -69517
21444 -69517 277482 7915 -84261 -367967 196395 -121822 18093 110439 -117860 282115 374748
21433 374748 308230 -11887 441431 -181928 161337 -298728 120710 -138592 -10495 -66416
21423 -66416 -58176 296287 -33689 -186661 -28868 -170137 -19582 172759 -43500 112373 -197092
21411 -392845 55769 -50859 -128500 -58861 92029 20338 -193311 -111834 9223 -172925 49870
21399 106749 -162838 50500 -25389 -16641 109435 -236560 42469 -235888 -152638 19732 -30862
21387 121291 -473512 -155085 84226 -16200 -70944 -69671 -41318 79954 83113 212382 -103010
21375 -244704 -50838 221862 -159382 126345 -10427 129244 -161073 -21510 59606 -77162
21364 -90356 22160 -75683 -144673 87319 -69780 111774 -21477 180763 -181558 43644 -232712
21352 267556 162571 24068 -101943 -75055 -26088 97154 -79776 -79044 69287 -205058 180603
21340 113788 -263144 110623 -9408 -23352 -165958 -15418 -10762 250569 -184624 -52193 -25649
21328 81240 -279984 -361459 453629 198448 -75133 41848 -96852 -205311 -73742 -150580 73273
21316 -120983 -57579 -71711 -175183 35606 -31067 -179432 -87115 19903 -191515 -24222 39970
21304 -104437 19976 175889 -273460 73895 130602 -262076 -286396 -27200 -57367 65476 -48218
21292 -58724 32931 -17143 122170 129755 344758 87080 -80548 -240916 -67408 -160853 -72449
21280 52456 255632 -1321 168238 338645 -55750 4950 -246197 735 19890 -169267 -189064
21269 -189064 -418735 -50404 -9266 -73841 -231144 38331 206259 -226122 -8767 -61541 59821
21257 -76343 -51603 -291759 -38311 86329 302783 -195000 2984 57934 -114002 -289294 -174427
21246 -174427 18155 -210547 19524 -197836 12885 -106660 -57202 -83524 371727 -222491
21235 -141328 -16352 -15125 -381016 -165383 -32380 -119627 -50202 -77903 -108882 8734 -160753
21223 -169997 -95328 -55609 20031 -185515 252965 -141554 -396213 44476 -118650 -22919
21212 59849 -8305 -168219 -27270 238894 -224460 -102052 -37830 302750 -157976 26336 65764
21201 65764 -18718 17352 29549 119856 -40736 83665 -338395 -80644 104813 -83368 -11754
21189 -3504 119837 -167148 -99652 214251 -121625 -287599 -130326 -103336 -77043 -72207 -142236
21178 -142236 130949 -92853 -238625 -76003 -79875 -27145 97285 160056 -205775 217039 88966
21166 -180645 -181606 -249844 -46400 237244 -110819 -196970 -176770 22322 308351 -12268 -48983
21155 -48983 -2740 55535 -229999 -55429 109825 -63690 -140113 -220664 187356 -100217 109855
21143 -176378 -208402 -15616 -150714 -19820 -67332 -40520 -317912 132993 -223951 51702 88150
21132 88150 -104915 -315859 -220566 -493514 113217 139739 -395334 9976 -120486 -98696 51389
21120 -113524 -55806 -131377 -52578 20222 -8339 30039 19005 -40580 -95731 342121 -212386
21108 2440 95983 -66602 -76881 59909 -113938 -392727 97522 -170185 -186782 -102414 125029
21096 -61923 -379837 -105564 -101304 64960 -229100 -321829 -94554 266695 103917 -104463 -47841
21084 119193 -59041 83982 -232445 50597 -298059 51486 -85606 -258822 205137 162195 -49776
21072 -215932 120799 5563 70377 -58073 -144456 161340 211484 125033 -407705 -197988 99796
21060 208152 -156254 -41208 -60799 -13574 56075 -122409 5081 -97760 37486 -28498 -44084
21049 -44084 399846 -39791 186918 -97478 -110592 148082 -316576 131056 -92508 -230570
21039 -230570 86859 -190005 -82108 -78766 -120173 -183818 141022 -74577 124695 -107751 -34325
21027 77294 143147 33203 139719 -20744 -160490 -256517 -15920 -315461 -27047 65992 -82101
21015 -98468 -245774 -182521 -128303 -64199 -245036 -19964 -411013 -164979 49028 -242770 111800
21003 -120806 -293391 114348 169388 316372 -251090 -341141 -238445 -264411 -296069 275839
20992 -53150 -22044 -41277 72317 23608 -189932 -253151 -256911 -15415 -59291 137075 60677
20980 -233031 -52216 -64201 -56840 -148007 216988 135174 -169514 -296344 49896 -4966 -353651
20969 -353651 31786 -203169 -155659 122169 39168 -76248 -323825 98543 -52765 -311381 27884
20957 152736 -173470 217660 -430045 301365 -100559 116925 254542 -124087 -267507 41308
20946 215099 -45836 -285043 88698 80545 358070 119320 112703 -332366 -52960 9467 93241
20935 93241 84935 2036 -227413 -40472 -222742 70858 -98409 -77526 -264780 -112971 104043
20923 1888 71683 -367178 -63763 -92762 -213164 -131379 75354 23114 -232882 -249348 -32107
20911 172564 -348184 -218511 43882 239137 -76164 -311976 -235774 -8893 -112465 -69146 65786
20899 -17441 -131940 -52484 -23976 160564 90352 158897 32978 -111515 116297 35060 204433
20888 204433 23726 -1445 -80625 -369900 -28643 14773 -126887 -127466 -44999 -195301 -125795
20877 -125795 1703 -27717 -199092 -264576 -153515 -64014 -357533 -307305 -320302 -373216 -93404
20865 -95823 -233696 -120425 -283733 229437 -48551 -121825 8004 279066 105102 329397
20855 329397 -27859 88607 -182346 275127 -193703 194140 168523 -13154 -2932 352757 12852
20843 -153982 69471 -269775 -197383 -88184 -259408 -71084 24952 6068 -42187 -42390 -287356
20832 -287356 -179279 31229 -175494 -34061 -137432 -264433 -513271 -164801 -321845 -30636
20821 -153002 -108059 29678 -214036 105560 -116148 178892 -180373 167491 -53058 -191974
20811 -191974 107093 -81693 264693 -64576 340389 -223224 -83564 -2881 -127610 -7389 324476
20799 -12591 31524 107116 84532 -309547 -39456 53456 -98052 175132 -130364 -212260 -130554
20788 -130554 52995 -3092 -45802 -119068 -271231 219458 -295910 -86247 -8510 -50414 99709
20776 100731 -5256 -4783 84262 -204835 45347 -107295 321816 -100877 -178470 -361409 -13351
20764 101715 -423748 -159404 -58118 1037 -15787 -198138 -27665 -152803 12639 -268640 -178353
20753 -178353 -23912 -93208 -49691 -64956 -6998 33856 93244 -221141 -100395 111911 -274165
20741 -108565 -135214 -45956 -355825 -31413 -18781 -98090 117929 183629 -112180 -259709 -6817
20729 8250 -190954 180013 -113625 -373432 167687 -148012 84618 -85070 179411 39247
20718 -248987 -248369 -38254 -6379 87516 -246070 147449 -50555 18640 255858 21905 -46100
20706 164218 35208 23299 -212482 153730 102735 142614 -81409 -43752 -97794 -24898 -234799
20695 -234799 6206 22424 -59108 -79942 -227965 23979 -55896 -263325 -96568 -312788 194344
20683 -372987 -121119 -514731 -93966 34874 53116 -163135 -140141 46027 65812 103680 -108902
20671 16746 98545 114679 -191095 274277 -14312 -208237 91240 -105457 -273673 13128 156368
20660 156368 -67421 -23773 -160321 -128407 -38409 199293 -48613 6973 -159224 120531 -188243
20648 -49559 -146926 -110564 -78672 49354 -12026 -495825 7512 108266 94047 4674 -82793 129716
20635 238821 21341 177980 -228123 307697 -70977 -294129 3908 38263 -299900 247833
20624 156627 -385040 -14666 -446203 122255 224045 154416 92815 69048 66498 371943 30785
20612 -165677 91677 -330077 183087 -87411 207555 -225535 184994 22157 -105710 -21852
20601 -109467 -252048 -144068 -192610 74264 -32558 -59073 -114768 50621 -154966 -112032 508
20589 110014 36147 -298180 61043 -185685 -73907 -129508 -92492 109021 197219 -89730 99416
20577 113214 199037 90070 121844 -7087 68193 -452586 -169339 68955 90927 237262 -265000
20565 -61269 328087 60478 191774 -125403 -52556 67301 -423671 225969 -15736 -139313
20555 -139313 69861 235310 186161 -4102 -209466 176736 316517 23841 20241 -99293 -113645
20544 -113645 111828 197054 57616 19975 64384 11072 -353692 -44421 -194620 -368835 -547793
20533 -547793 35718 -155136 -14651 -34440 -234803 222698 -389817 -96362 -484768 -53096
20522 -43108 -197769 -159147 27842 -375833 18684 -55174 -175363 7495 -16970 -122894 216269
20510 -40529 -19781 -161631 203902 -54862 27653 -146862 -47521 9019 103443 -105341 -38116
20498 -206738 -56376 202508 -45539 -123945 56067 -47737 -194232 -31410 132908 -235849 -146907
20487 -146907 -289869 -214834 -46455 99376 -171098 119570 -82052 267936 -368886 49346
20476 221020 144788 -37215 284891 -131542 33806 -766776 254852 24247 -94405 -276557
20466 -276557 -11133 -286708 82585 338588 73425 190794 85353 -30093 565015 -127586
20455 175511 361988 -177962 -105570 -96854 -124469 189442 -3817 -159530 94914 -83976 -171218
20444 -171218 -142167 -27911 -228103 -175073 -91820 154926 165582 8609 -142264 118998 293294
20433 293294 -191311 32235 -49821 -104355 33538 -96494 -277062 27793 -136452 20302 326299
20422 326299 -295412 -159912 -33711 -107796 -42481 -171015 -36383 2239 -67568 435540 80195
20410 -98708 -53610 28136 -99516 -141131 -546061 -49639 -117888 66248 -61265 -58321 66830 -202627
20397 18966 -67098 -201932 222102 -203043 99878 82213 -219793 -44681 -167064 86724 -57846
20385 -15156 -303616 345012 -2868 -237972 11583 23203 213516 -163787 90558 -97278 207717
20373 -430661 -132648 69673 202254 102891 -19164 375019 418493 -186305 61358 -230981
20362 46261 237830 -3560 -117414 -196501 43737 -217570 86134 110120 52109 -9435 -216860
20351 -216860 -68452 259036 -402585 -17938 -289830 -223028 -406411 -14025 -46094 -54569 7034
20339 -287761 21552 -386741 -288004 72404 -247777 207239 -97911 195357 171298 -356740
20328 109179 90312 -50991 -201300 3519 243844 121146 -254241 76794 20217 -112585 108990
20316 -40221 -259505 111383 -1225 -280939 -122417 -65208 -209538 131103 -259959 -138739
20306 -138739 37814 -155816 -252311 -128505 -232117 62060 -41027 -43721 -115353 -64687 -19897
20294 -126068 -375255 -37284 -409394 -38040 -13007 -239596 -84909 205105 189864 44704 -140738
20282 -96931 -42908 10240 -150154 -78721 29907 -141292 -261374 -55561 121391 -208563 -201484
20271 -201484 -42304 171756 -205598 -35003 -242975 -146209 -293345 114908 -119109 -67755
20261 -67755 -146390 -125905 -306097 20901 -157654 118113 -7744 -42072 -63935 -262501 175056
20249 318972 -269404 -270028 27162 2366 242287 67504 -104785 -117021 -290453 -257038 75147
20237 137719 -359821 -77763 -323282 223217 151240 -162174 -344516 -244234 -25568 -58100
20227 -58100 66409 70320 -58219 39545 -96046 -126758 140145 54895 -326745 -44070 193808
20215 -107710 -154630 28323 128712 66599 -66752 -94462 -275731 42094 263903 175873 3951
20203 -128615 24490 -107899 -298838 -29567 154686 84555 53825 48128 29963 58960 22343
20191 -42342 -329734 109761 -191018 -201541 102859 50604 -61053 246441 -241177 -128606
20181 -128606 -42743 -217102 -15523 -170537 -218212 -252274 -359188 -125375 -44337 -236535
20171 -236535 -187778 -108680 198315 -5550 -259311 13922 -218976 -26933 58781 18225 167173
20160 167173 57301 16176 -227908 132458 -91584 316110 27726 -28569 134418 4854 -349539
20148 33813 -156437 -8160 43558 -225253 236689 18412 129589 -124643 -80547 -188031 83953
20136 -7433 -211090 -82244 -47764 20729 -101092 -32378 -53299 -283606 116521 -101567 -91234
20125 -91234 -206562 199228 60322 -49865 94623 -31392 -87461 -128384 36121 -187808 289307
20113 -4983 -62816 -184763 173252 -557804 -65025 -298231 147460 89442 56382 -200914 -174806
20102 -174806 -37633 -48100 220950 3670 -142448 -44568 -55161 14774 -87681 -156866 -13252
20090 41757 -377071 -47153 -135034 -140007 12503 -24282 -203052 -434214 -140691 -200665 -173086
20079 -173086 -35383 177371 -30950 59832 148755 -288076 -24517 -462989 -225739 -134647 -89364
20068 -89364 -138166 111061 -147856 -246688 -99633 281317 -162314 317582 -142138 -115314
20058 -115314 -209390 -228120 -55613 135469 -36394 -321727 193824 -123031 34249 -25150 290576
20046 -129905 197098 56089 -12833 -31401 -115319 -162444 167730 261695 -412076 -95653 -48209
20035 -48209 -192781 -197512 -255135 -159485 -172735 -115338 168905 138469 19468 108133 -129523
20023 -761 -191020 103392 -161029 -58910 80353 -135554 -199364 170018 -264496 -86027 -220481
20012 -220481 43275 47010 -23418 -63047 -24032 14942 -318368 67681 -282389 335517 32662
20000 139674 -219277 -88925 -138395 119934 -10880 115152 79262 110778 -346799 -23591 -76004
19989 -76004 -250352 -118488 -135728 51737 -52489 -110252 65264 -85548 6824 240826 112779
19977 17677 -265741 -81098 -16186 -277438 -50668 -66117 276620 -96789 97924 -189005 34632
19965 121112 44761 177737 216547 -85196 -146382 73061 -53337 -71893 13069 195242 8822
19953 38602 17415 -295447 -239429 -18951 81126 -90505 -151366 153353 -155768 35374 31859
19942 31859 -2921 -146527 -121222 157153 -171207 108943 67616 -48612 -253307 -181908 -128123
19931 -128123 -68074 -545 -124878 -174509 80746 52134 53519 32708 212816 -74249 -305293
19920 -305293 -281039 -104141 -184048 -159665 -2433 -268742 228194 173670 -90648 -27639 53321
19908 -257329 -61463 -303097 11180 -319516 55243 95531 -66352 165566 -114822 -65478 26722
19896 -28432 -14601 -340007 147817 -196882 -213130 36623 -103001 215791 -197788 -84735
19885 -248526 -121677 -204460 58877 60869 -152535 136636 25269 -10980 -11083 72707 -13518
19873 -236935 -30998 -173956 -127550 243477 10039 117609 56996 220197 154847 355395
19863 355395 -310869 -149941 34837 -119333 -190558 203695 -58635 -57892 -52035 -41477 -92555
19852 -92555 -446338 -240868 -19086 179303 106213 -174489 -19095 98302 -108103 68522 -350655
19840 -317493 -131004 -163355 42687 251466 -31026 40265 -335347 -69403 -171740 -497084
19830 -497084 90601 -233423 107380 123450 -306857 -92982 -232908 69349 -119106 44796
19819 -352335 -75650 -450201 -281008 153373 -284310 104183 254553 -29207 -21962 24553
19808 153834 -164732 -81439 -241595 -181505 -385418 139992 199623 -101999 -77274 -14363
19797 -185879 -98433 -255699 63223 155543 -437803 46862 -129107 -62635 -123615 112808 -336360
19785 131889 48058 187875 -187758 -172023 -283805 52791 -116812 -109 7931 -136400 -231493
19774 -231493 -150888 -85765 -141111 41325 9446 -45325 133681 131784 -122528 59371 -371737
19762 64805 -68987 81970 -264812 -107513 100626 -200535 -102522 -335922 -97511 -54281 -121220
19751 -121220 124458 -14562 -277875 -214135 -306105 -49689 -49713 96323 -218803 83290 -234061
19739 -48266 -58492 -374387 10272 100172 287804 132412 -98359 65154 127736 -217083 265891
19727 13760 67010 -307886 -89131 -33053 -250763 -19871 187180 -132471 190746 98735 -59434
19715 -276403 -137872 62748 -29153 -24919 -225269 -107128 -311667 -101443 37012 -172039
19704 -417731 -37124 30157 69446 -11303 372489 -193715 -222872 45875 -201332 157967 -87791
19692 -103969 -29329 4518 -331531 22459 -411178 60519 141342 57005 -143839 232045 -163085
19680 32793 48570 -118280 1115 -113023 4104 -106360 253506 -58205 -116978 -175900 -201771
19669 -201771 29444 314063 -191670 9338 -261890 -28678 95736 -257379 19751 -264558 -442386
19658 -442386 28261 -69212 -163221 -198953 -239901 -23979 -118534 -67683 -54175 -225652 -161147
19647 -161147 -150252 -251246 -116366 55672 -228342 -38862 -192755 55818 -95205 -356852
19637 -356852 59872 -112288 279509 -217852 -200925 133077 -2037 4413 -216165 112646 -197535
19625 215406 48490 -302521 92510 -164870 -125189 -199779 54764 -160750 -340482 -223049
19615 -223049 195238 -270076 -228112 1561 -143183 -69531 -111702 -188847 -167221 -315520 34724
19603 165715 -122773 61059 -221660 -255385 5080 61949 -174185 -57675 -138145 -96324 -272031
19592 -272031 86604 -41699 470437 -113057 -190400 -142061 -182422 -173021 -158388 -284808 -23957
19580 -12819 -26510 171130 28271 -232921 -126002 28047 74477 -6236 4458 197461 -90714
19568 -200981 -405100 15168 67455 -100778 -61471 99566 -187914 -161723 388501 166448
19557 -76165 -117237 40895 323355 155778 -387523 51859 153308 -31605 144171 -3681 151225
19545 -122272 -463928 71909 -345795 -151410 166359 -301420 -24561 58376 -157479 -60606
19534 -220122 -10082 -471 88440 7258 -209634 234276 20666 -52660 -51657 -196187 -249355 -133154
19522 -133154 -303061 -166103 -237058 -168883 -55358 -44736 34238 -104125 -2487 -184133 -114265
19511 -114265 -38540 65141 200591 -125301 -85872 -266781 -109563 -248665 -180462 254453
19500 -191605 216437 -486965 54655 -151640 -51294 69699 -19770 29174 -279649 -60684 10215
19488 -175990 -35999 -106691 -305559 -99493 83460 -143847 128751 -97125 369381 170043
19477 -212209 169806 34910 -141262 71677 -98897 -81911 107146 12301 53072 22536 -213422
19465 4936 -215871 -116333 -36566 -177321 -16241 -503265 -122703 46932 -141789 -6073 69939
19453 -180340 -145702 -309479 201063 -236316 -11167 20285 -89337 284094 -111530 -42304
19442 -231154 17850 -79940 -191927 -19636 -230569 -350124 -81776 22112 -240000 252264
19431 -48120 64027 42619 -114273 -37372 -124936 61758 -20180 -105386 197086 -201704 185994
19419 -63337 -59722 -112034 -1022 -52933 -148187 11562 -164763 -54386 21272 -97464 -29550 149212
19406 412707 -232878 -59824 -69293 -23722 149820 -40525 -7012 -5422 -90335 94202 -234705
19394 176879 -74954 -6029 21127 232897 -31979 -66583 35235 37162 11718 720 146497 -347928
19381 166912 84430 64683 2445 -90651 97994 -38027 -128709 -158462 -218227 221472 -7722 -159247
19369 -159247 -129239 -131683 -249168 64957 -322113 -137040 5168 -304452 117949 -194689 -248093
19358 -248093 -319024 15365 116945 -325640 -385844 -475403 82730 -34855 -3247 -89203 57159
19346 166566 -427695 -13308 167685 -191581 -132438 10498 -38579 156152 -173371 -248280
19336 -248280 272215 -86216 14783 -422832 107296 205988 -79994 -38162 288295 -98461 -212627
19325 -212627 204598 -121277 216664 -272819 -110102 107880 66204 253215 -439776 -59358
19314 7789 -215146 -110181 -328705 15345 -92787 -101527 -184628 -134097 -199164 -192504 -1938 -149885
19302 -149885 -275486 -340121 -188806 280566 -239243 69879 -205813 182428 -106048 -41185
19291 -353999 -105430 -56765 117808 -235498 48975 196475 259 58947 143437 -3745 -67699
19280 -67699 -196564 53537 -71285 -290529 49079 -150835 -153634 -109273 383534 -26978 -281551
19269 -281551 -279885 9424 -176018 -207723 -18944 -208770 -194365 99119 -61276 351908 -66426
19257 2630 404294 161329 180346 -294671 -187151 -133160 -162264 -90942 288163 13376 -225574
19245 83344 -156996 66316 -59302 107846 55006 -207934 -298849 -282335 -157656 80415 27311
19233 -199178 -255056 136017 -51861 -299708 -92539 -158535 -141804 -14073 -14110 3929 -9947 -92823
19221 -92823 -178396 15822 178592 -166953 -172157 113690 -48017 -328864 -94113 82088 14912
19209 -56211 -256496 -7 17276 9709 -114296 69024 -145184 -97181 -138925 -192766 -133344 218847
19196 45063 137577 -26346 139663 90628 -258055 -119465 -101765 -290298 208404 -298732
19185 -124655 -343393 -126458 -126199 -96431 -95760 -59246 -130915 85612 312303 -142180 -42311
19173 -3672 -117076 -117331 -123842 -126608 -12166 -129291 -8532 325315 -560448 122396 -92250 79201
19160 -212522 48346 -108515 51265 187556 -169491 128648 195086 -192154 43086 57987
19150 57987 65523 -30137 157354 -18728 112480 38551 -110062 241602 -80733 45362 -136210
19138 -71962 14811 54371 115557 -414531 255948 -106666 163076 -406264 140296 5798 -108621
19126 -6544 119436 136366 -43478 -533926 196105 -202397 93018 466140 -264401 -13617 24295
19114 -163127 10890 193880 -182342 22199 -80453 5136 156578 -223997 230443 -32800 -7679
19102 115164 5591 -180523 -25702 -206896 -210195 -377047 50195 13254 -202738 -175176 40410
19090 -30468 -78239 268587 137736 -224956 297113 -40890 78467 -119839 106799 -343776
19079 -122959 17893 -118900 -84707 -80173 -356257 -2604 -106090 -62790 98607 112599 35981
19067 84302 -280208 14588 43944 -88867 151374 -192773 -340322 -136422 148627 -230558
19056 -139265 -8510 192719 -123626 23932 -321763 289535 -218398 -108859 175578 119754
19046 119754 -74076 25290 63422 -122943 -107078 393468 30452 264463 -107066 -119715 90501
19034 -201480 100822 99471 -201479 -50595 25147 -228563 263471 139278 362644 161193
19023 176553 143629 -40541 188080 108063 -278018 -28939 -82760 113574 167981 178877 -8669
19011 71304 -46267 -73664 -127989 -361408 165217 -545763 -71204 -137450 -220561 53586 53431
19000 53431 -145025 43844 -9268 84602 -327568 44651 -118103 124422 388983 -256651 -385032
18989 -385032 -193629 -520368 -44936 -133321 -34175 -218133 -79001 278320 115389 19662
18978 62709 130215 54259 -185856 -145425 38391 -184603 -186909 -43229 277680 -126190 300354
18966 -146262 -201814 -193990 133009 50583 -159339 -268341 437579 -142961 140282 -232571
18955 -25986 -106708 -212472 195948 93997 338055 257334 185938 110472 183023 -255459 -99149
18943 204391 -101068 38643 88612 222732 -268871 -179116 -372249 51458 -332989 99280
18932 281975 24614 40038 410499 4994 44289 7729 -179585 -30560 198782 -48392 -193787
18921 -193787 -158791 143485 470140 -68778 -140073 27789 109512 -118907 403524 -314396
18910 -280120 -212471 46920 77282 -498723 274911 59919 12363 1196 -126889 100788 -463545
18898 125685 -53461 -212675 129753 78056 -275325 -292612 -12172 161362 -249459 -86762
18887 19352 -121283 -553158 -34006 -35391 -132779 -102477 -1050 43948 -92749 -33903 382320
18875 11170 214129 -12043 -191774 5816 78567 -222877 -408382 -150380 -38310 29214 106911
18864 106911 6623 -11152 -397876 -142385 2441 -103451 -288273 -63283 64397 32475 367199
18853 367199 -227219 -379565 175670 320240 -158312 321385 297968 103074 24699 -132943
18842 -109282 306514 22465 -315671 -111092 -321996 80627 -90090 -135812 -53700 136016
18831 -142069 -198488 -39082 -278719 174565 -415337 -218002 34279 12753 -190316 21221
18820 -250673 -413517 131270 -100147 -73113 227079 188593 208522 156247 -9132 -151089 143159
18808 197608 208879 122862 4394 -80065 -252438 -69229 202906 -548 -78857 123531 -125651
18796 249395 -63649 -191745 123936 4622 -175429 -238193 133923 -111576 5767 -12554 -93273
18785 -93273 6796 -1030 -163486 -102816 -101278 -254414 -24007 -64098 222823 155956 -324007
18773 79899 114494 87079 -398543 48953 335207 137790 -69503 -37943 313340 -71702 30692
18761 -247316 -339357 -75057 -336268 -290702 117565 -98881 -45429 -6166 -3446 24777 -22460
18749 203223 69141 -257282 25057 44861 6508 302554 -99364 -138410 194798 -48525 -206405
18738 -206405 205337 -74151 -267918 -191429 -193624 -276601 -25023 -217512 -85798 -360066 -140925
18726 -206550 -180231 -20490 253353 -92553 -254457 -157456 -232171 -86790 34750 62723 157107
18715 157107 -5281 -283571 -243705 -45369 -72173 -68930 8134 -216944 -40926 -32429 -96688 -81247
18703 -81247 69426 -95473 -162379 305606 -97615 -52222 116036 201220 120573 211008 230960
18692 230960 -117516 -109145 -254748 -278750 -114597 -262912 -943 25633 -3543 -99060 -73302
18681 -73302 -163396 -185170 -268783 -67378 -242593 -470633 -107784 37504 -182562 243521 -485836
18669 47118 -209082 151903 441577 -154574 -5545 -143691 -182918 -44415 -230807 -145219 -47407
18657 -139657 -82479 72602 -444509 -223922 -201528 -122454 -45137 -38449 283050 4361 8786
18646 8786 -127395 -226096 80250 -82389 102580 -72604 62625 13325 166107 212356 -105472
18634 -491094 159898 -90465 90767 75572 -282335 196449 152214 61412 -259589 -180180 -386157
18623 -386157 -22924 400111 3124 74420 -230603 43073 -23428 -431272 -211128 -236833 241881
18611 76961 261772 107180 -222057 127998 -45562 -251935 -22591 -173554 -144057 -329966
18601 -329966 -104629 -90797 -225704 -252204 48318 -125329 -13369 -259300 -7611 -75397 -2139
18589 41611 -301851 117116 91671 -85393 -74446 -279298 113646 -387689 -394724 -85552 35659
18577 -384008 -94564 189733 -155027 -157611 83165 207148 -26773 17433 56653 -292118 -4846
18565 33224 46099 -56207 203183 140027 -86535 208405 -208474 42486 219529 -272009 52979
18553 286354 102235 -207689 -97160 -25657 36326 55693 -211218 362492 -164033 -133660
18543 -133660 400176 -6922 206504 16264 55629 -115176 -94962 -41762 -127621 -229644 13613
18531 -124195 -194141 -136909 96097 -73494 48430 -169159 275497 -180771 -150589 -152673 140918
18519 -258330 244526 32485 -279703 -399306 -91832 -6308 -68269 117870 -289600 -172505
18509 -172505 -150027 -254179 -75291 -150192 84028 86825 104169 44961 152564 -28460 -12247
18497 -136661 -90275 101782 -133818 212345 -55170 -117585 -2094 21676 -160945 124785 182819
18486 182819 -215611 -4792 -18776 72273 -44462 -132952 71785 92935 -61270 65019 -335747
18474 -364114 -286107 -30004 -156892 -200350 -106300 -99281 -54109 119359 -74683 49248 -203657
18462 -106896 -46775 312746 124803 -144610 -157748 -70585 350941 -33624 -147531 -331575
18452 -331575 -355867 -12241 -83664 -200901 -103838 113186 137321 130917 -117319 -197678 -83525
18440 -336894 -219810 -313501 -294409 -52509 -127388 -73582 166004 -81728 -40708 222219 -64797
18428 69341 -247197 -257093 -140858 333014 -71249 35220 155669 -136477 -86220 -222882 -201075
18417 -201075 58843 160130 131272 10473 60086 58729 -295811 -56211 -101415 -45814 -372044
18406 -372044 316862 130630 -233127 48645 -71800 115316 91678 -55670 -105787 -41150 108693
18394 -216398 -42171 -59021 -279152 -40313 78853 -213964 339260 71306 345501 34256 13433
18382 85990 -156933 -175036 -26199 -89366 -163184 -436142 196454 64209 189652 -7107 10484
18370 -386 -439113 88987 -80918 45206 -348 132415 -68414 -169660 -7558 220877 81376 -153700
18357 103000 71802 96045 -63780 291894 -136513 -53998 296133 7270 1608 117365 81383
18346 81383 -12533 -71295 -292332 -153597 -2568 -115596 -83501 11994 -78733 -220500 -54642
18334 -162871 -233096 6084 -283587 87694 -44780 -306841 300164 21240 78691 -286073 -185238
18323 -185238 -220267 58394 5643 -125955 173314 -159416 -215147 -191308 -151909 -28079 160703
18311 74153 -194035 -329493 -40520 217454 67151 -43675 -155617 -155441 -189367 124231 187128
18300 187128 65297 16892 -130256 13070 -367031 107412 254423 -239710 53708 -150363
18289 90413 -152331 -71728 -269815 -267106 -19610 -163352 -135905 138040 91314 -226762 127451
18277 -24188 40829 -73742 31211 -92471 -262380 61349 -308066 42157 -205201 -291047 -306503
18266 -306503 -292320 -23898 -204468 405984 194052 -196464 -114389 -199178 75490 -121897
18255 -185554 52235 -484614 51281 -338094 -27349 -19153 19260 -213611 -233463 -69381 -82220
18244 -82220 61971 84278 -118116 -193797 -182091 1722 -4342 -9842 -99551 -32182 120413 -88997
18231 -226721 -128519 -46475 -66671 140049 139935 -33031 19700 64824 -84548 210079 194768
18220 194768 41858 -235015 -228931 -57983 -2885 295567 -3778 65388 -257040 61582 77275
18209 77275 -434292 -13802 -28510 58693 261675 -43456 113069 -28265 -34317 -95153 66790
18197 91966 131043 191530 -59893 93327 -62611 -62074 -33637 -311105 309616 251791 -131771
18185 96930 22306 -164215 -94900 -21419 156938 172841 203966 74578 -252146 -8600 124866
18173 -110409 70715 -237316 -265187 -106685 -100099 -182973 -64071 80996 -422609 -222548 -51908
18161 43344 105126 -188828 -51902 11903 215998 153477 -325793 118577 -56105 -43409 227223
18149 118601 -53146 -248630 -313678 -221692 111459 -81320 -183390 21052 -28368 104512 -124297
18137 -47719 12780 -142393 -186440 -69948 63169 60193 205918 -39672 -174698 -35452 -26089
18126 -26089 -213462 -35016 105255 -100119 -24251 150268 -183166 193926 -202822 -37230
18115 -30561 63234 -299746 -207924 -240564 79870 -464624 86237 182919 33490 -141057 11505
18103 -72758 -165094 -168645 77074 167888 -178518 -146877 217345 113345 25453 -128429 74108
18091 -97623 197466 -68948 -106516 -13835 -4904 295433 190594 103930 -103840 -250297 24292
18079 -478717 -73721 -19487 -17363 52534 129994 -172743 -197569 190184 -146875 -112731 -286410
18068 -286410 30589 195463 -7591 -324895 -37645 -279008 -107375 -110618 -71731 -131858 3677
18056 283595 330834 28762 163920 -135130 352771 -33037 53004 -237994 443607 -108092
18045 -175623 149653 -42799 86563 99234 102081 39882 -189057 199918 -306649 -125918 -92307
18034 -92307 43888 -367330 46003 100008 -261912 245578 -198168 99274 -66551 196922 214165
18023 214165 -112286 145775 -192603 -64995 60031 50497 98356 -129413 -64651 190397 -28470
18011 -32907 -16677 -36265 -184981 28639 -19240 30103 -32230 50533 234154 -55518 -259020
18000 -259020 -89902 176436 -95601 112410 101207 -93244 -41857 156434 81097 -41623 202345
17988 45782 181675 -107185 -202502 -168668 53965 -42851 -93027 -317039 -99963 21351 69062
17977 69062 104568 -65932 125867 134712 -114048 27906 -294959 111473 -346297 -82953 -79094
17966 -79094 91206 48516 -85396 -170992 122077 -136077 111189 196835 191789 -201367 -124379
17955 -124379 26962 -281869 -159952 -168051 81708 167389 -85846 341029 -43029 -345325 -31158
17943 -21863 -38649 178539 -174988 60429 260965 3841 -183949 -210565 177189 170642 -97795
17931 192218 -109585 227233 14824 -2405 74811 -53113 26524 -147101 -324535 -6689 77460
17919 48852 -85050 -72718 -90167 -243396 -387372 -199559 -355509 110818 -279000 183345
17908 -20614 -160694 31355 -422297 18015 153403 -51383 29214 -23000 168778 -188751 36737
17896 -472682 -250016 41875 52932 38136 -219222 -29886 -96220 262931 83327 -206081 122428
17884 -207725 136523 -148579 -99353 -136308 -81900 -287102 155899 -157825 -6780 -61113 124404
17872 69183 286464 -5867 112623 164536 -224461 -276633 -188498 69686 54934 -16454 248202
17860 -53735 -206556 -419824 311637 17405 -194743 90870 -286493 192248 -185255 -25804
17849 198645 133225 -71073 -291468 -157722 -396692 -202506 -147639 264848 178202 -102008
17838 -204300 141113 -140042 -101377 17515 2980 -116006 44089 33306 -175813 458483 80030
17826 -58863 -192293 -232261 -1311 230021 -106499 -15673 74764 -76392 -240480 -109063 113276
17814 123242 -224526 95655 99868 74730 -73980 216363 -233998 216133 182547 297498 7653
17802 -85576 80661 187789 -227512 -82663 46715 159181 351225 -89398 38339 135673 116163
17791 116163 -168509 -29266 85111 -158838 -77667 66445 219127 71848 33980 132617 43358
17779 113842 11822 -84504 -103363 158059 72926 -66556 -60124 231674 20724 412099 -246974
17767 192443 -58704 -53833 -289001 -96380 126961 229189 118195 -192631 -12021 -118592
17757 -118592 73991 155561 141685 -6839 -96394 202574 304655 -255089 -298409 391861 -62588
17745 539650 81583 7394 181789 203103 143178 -98424 145139 70572 -36705 -67256 -10215
17733 154094 -15942 38546 -94514 -293340 279173 43715 -88722 246239 155824 50165 -64221
17721 7752 271942 55443 -284616 -74215 -19044 113077 158165 136952 -5095 351186 233414
17710 233414 126662 -43431 188656 -85253 117993 180479 193398 -153914 -217685 -181257 12040
17698 167813 -196872 -40490 160721 66634 -233668 165993 -40258 -129913 14995 -97653 234735
17686 207372 252160 -181659 66857 -306293 -270067 38907 24624 144724 -139482 -2755 106535
17674 -223194 84946 -111988 203053 141276 47640 253020 -269382 322919 270869 274702 280734
17663 280734 -188292 183291 218357 -24176 -187204 167402 78411 -390966 211056 -130408
17652 -257418 124081 222863 -212592 -258199 -289057 201647 152541 94516 50300 -215189 -198200
17641 -198200 92636 -63474 -60342 1426 2653 145544 57188 -149491 80411 81359 139059 211716
17629 211716 133875 81225 -27654 -153054 238063 287821 -86329 93780 -12100 43367 56439
17618 56439 -157134 -29385 -127716 3886 265750 -165520 -122047 -28345 -126407 137367 53461
17606 1483 -113678 72905 -274005 -83064 266655 -126239 54151 34059 150459 71252 30506
17594 -185902 28595 -86361 -233364 108024 -409984 296794 42259 -211443 -22035 134341
17583 -301671 -54001 375391 21833 -126670 -14769 -3489 217293 26000 106982 48129 15450
17571 -147534 -238804 14807 -152140 320301 -126909 91733 -16739 211416 -77655 251226
17560 50990 209454 -193011 -18136 -135840 -171933 -371917 227108 126134 297545 58172
17549 203013 151424 122894 218664 -79100 3522 225353 376751 672248 72564 -180589 345156
17537 259522 165655 157212 -122087 190224 -25689 174106 371863 21275 -207520 81236 -39505
17525 -34590 150966 216602 534603 223882 184421 2577 -289558 201529 -8345 -86632 280427
17513 412532 92269 -25564 149317 375724 380240 63474 -125100 122273 -24733 171487 -161993
17501 269511 2941 26655 72231 119289 96688 151342 23069 -57878 51082 213691 -9658 -161728
17489 -161728 94593 41277 153053 132555 -16297 556305 280537 164915 229175 -156362
17478 -60676 99772 -215762 134536 136510 259479 218633 578752 -160345 400950 14891 178611
17467 178611 198908 199549 -130251 -3242 -461857 -57773 10603 -68856 -30062 235944 -37699
17455 144012 129271 195864 78806 172541 145756 57942 246407 165522 149887 331078 261134
17444 261134 284872 194396 269034 -31320 374474 382645 221437 -134962 -8160 408749 399120
17433 399120 -64763 150115 28879 454474 266949 227459 65153 260102 430698 206541
17422 224644 188593 187415 217649 178476 234962 120069 322955 506123 112153 -42617 358975
17410 234406 360758 306990 278375 39819 104767 -108466 223459 181998 178581 325070 102535
17398 259360 151017 30065 -306478 474411 241088 227625 -2898 53257 252999 99169 161763
17387 161763 171429 -169673 -14122 265895 32487 176472 -33255 92301 257152 165227 281270
17376 281270 256175 98720 81848 142870 110723 307171 120238 226605 -37120 -84507 -120577
17365 -120577 10541 90766 220918 93999 339844 -18909 155905 -106673 168820 227829
17355 227829 195625 193090 166897 -10072 181500 303961 235562 -13298 41314 505902 195693
17343 59276 -199447 253380 395052 73297 384214 56123 240432 242851 107640 225894
17333 225894 191722 28812 492531 486203 391245 -39493 -43232 252351 323159 84372 354509
17322 354509 14312 118253 144979 127669 -91151 254822 114535 46039 -117504 103696
17311 113478 416461 325744 -168432 -311790 314254 247927 75741 201151 147797 108106
17301 108106 232080 81465 500804 100556 188499 423087 -53044 149675 82505 -114252
17290 582702 284997 169881 273706 -1766 94557 71059 276412 170813 269792 52561 -134236
17278 504306 509478 218768 120375 182588 326 387326 198273 131239 -116121 297054 321704
17267 321704 223972 64025 214557 377773 353200 252919 68108 170727 311348 391395
17257 391395 149890 307416 183921 42222 501149 47348 90897 77885 -174500 10401
17246 14429 173883 86974 67115 208346 50152 310530 194684 43996 238945 282469 504415
17235 504415 182978 -196663 201083 198387 184851 328844 365348 429631 183200 271692 88563
17223 201413 -70378 427756 256172 236900 132617 252424 140211 116878 33335 101252
17213 101252 -164640 16653 364210 230724 167254 117066 152483 312739 88070 466708
17203 466708 211134 259387 337203 311002 -145948 298785 46853 301914 374668 385528 39292
17191 300309 166071 106479 216472 414619 129491 409696 397276 85263 100689 90004
17181 90004 320842 218442 71772 341106 250438 392242 341648 391689 117631 443364
17171 443364 593319 361926 87834 404756 65216 405880 162458 342334 439418 335822
17161 335822 283683 322369 217276 16382 117055 466562 638398 280997 523774 276876
17151 276876 158462 393912 546976 123826 148485 248303 384526 -109087 150789 194203
17141 194203 798749 154850 71308 363628 344109 22148 409085 248886 429192 245923
17131 245923 391093 387948 357721 349399 85249 270294 367322 381168 213544 235961 381325
17120 381325 -47697 430201 485152 438437 136248 521727 454653 476983 14090 322786 577393
17109 577393 222882 517712 542231 366146 306760 592884 495679 304613 399671 402976 564070
17098 564070 361867 404848 488505 74721 332975 20830 -21327 349612 349755 471396 676010
17087 676010 768500 346422 550342 796620 485220 517620 650271 482012 686360 619583
17077 619583 351869 630814 536534 476401 507567 197553 331377 500777 24068 776528
17067 776528 150464 572902 163519 315980 460576 473688 801386 450892 437819 786162
17057 786162 859857 441867 172750 574194 616800 407109 618013 636821 594803 639301
17047 639301 898095 548627 531299 567818 606438 592134 283420 659879 483085 605058
17037 605058 419945 271608 660968 555773 532421 461164 721256 667495 452276 654789
17027 654789 544690 646039 546445 709762 759271 719825 373693 628029 510184 518129
17017 518129 792452 850392 881933 624917 514525 706132 725477 650761 564296 586796 980449
17006 980449 874568 620368 809640 674797 593515 604685 684136 741672 1102006 657796
16996 657796 576632 699818 626038 521046 687257 954750 980247 629308 508905 775781
16986 775781 1089686 1013900 892689 914259 826446 637970 1420151 893400 784650 978628
16976 978628 803184 936898 952942 926555 1009905 676386 912867 876975 1129156 1276159
16966 1276159 1359923 1018531 901623 749540 1054427 881462 925263 1242217 888161 1204712
16956 1204712 1134040 959823 1141979 1259406 1116377 1127760 1126916 1302205 1043952 1281894
16946 1281894 888463 1218870 1298607 1418236 1344625 1434333 1359214 1276089 1466399 1392548
16936 1392548 1357911 1298573 1504622 1188211 1429614 1132973 1418030 999935 1621590 1318784
16926 1318784 1026339 1244140 1418261 1368198 1326863 1780189 1847728 1665681 1714932 1408288
16916 1408288 1861258 1376365 1359484 1583274 1710161 1778147 1778744 1774679 1656374 1804302 1761848
16905 1761848 1860381 1960220 1725457 1904860 2044843 1903625 1769642 2175018 1768888 1873851
16895 1873851 1995797 1730087 1820184 2328719 2183728 2005099 2176275 2354213 2429924 2063432
16885 2063432 2373978 1947347 2530682 2532066 2190295 2244958 2400420 2618883 2561536 2136368
16875 2136368 2428031 2486029 2533143 2341062 2698430 2618884 2785221 2697213 2613420 2991088
16865 2991088 2990726 3160075 2996316 3077252 3350765 3102400 3217848 2980256 3264553 3298897
16855 3298897 3521988 3472913 3312186 3147445 3563182 3503270 3512035 4057161 3885812 3971774
16845 3971774 4027488 3934973 3862845 3911218 4111108 4480916 4264549 4571649 4108896 4213847
16835 4213847 4442098 4662940 4822025 4931070 4919155 5155459 5152996 5351983 5438359 5657671
16825 5657671 5600788 5498689 5581484 5673453 6131112 6599946 6121181 6358169 6788654 6725072
16815 6725072 7143864 7073642 6719132 7000199 7468002 7428260 7921939 7772338 7980417 8017470
16805 8017470 8420619 8532334 8781612 9223874 9299926 9461483 9809968 9783149 10124292 10293530
16795 10293530 10147594 10834430 11294502 11247485 11690988 12283564 12424717 12620750 13098215
16786 13098215 13396999 13950960 14115669 14629021 15104181 15437273 15902038 16496631 17164309
16777 17164309 17765389 18176632 18414975 19529224 20266206 20681411 21495424 22304288 22925390
16768 22925390 24207301 24726256 26133018 26977688 27925521 29134020 30096216 31657227 32556865
16759 32556865 34378535 35788183 37323442 39201781 41100355 42805807 44809412 46787715
16751 46787715 49166593 51926211 54355859 57193295 60038942 63547781 66739018 70401091
16743 70401091 74287027 78752888 83070224 87683547 93030736 98420175 103903132 109926581
16735 109926581 116221852 122516267 129205960 136567068 143726671 150649781 157678826 164508264
16727 164508264 171244558 177184481 182318470 186843786 190313575 192759199 193901093 193239436
16719 193239436 192041193 189618834 186071899 181399835 176559362 169922888 163391958 156596826
16711 156596826 148924423 141814966 134591108 127557736 120635086 113516590 107226275 101576259
16703 101576259 95557830 89978393 85029231 80449672 75952304 71634755 67359365 64111622
16695 64111622 60650622 57146144 54413643 51589764 48979955 46520437 44255493 42268974
16687 42268974 40006630 38306775 36503528 35109326 33409041 31946656 30439937 29181104
16679 29181104 27835851 26851795 25764621 25119497 23933449 22874854 22033686 21335035 20552210
16670 20552210 19848987 19009601 18635611 17759858 17348583 16776428 16100449 15691432 14987714
16661 14987714 14631358 14254858 13855915 13186396 12834249 12238100 12066733 11634322 11400202
16652 11400202 11262481 10746220 10565370 10416719 9785219 9782534 9692864 8936723 8725139 8697525
16642 8697525 8482416 8301094 8116052 7923751 7773040 7477155 7348616 7178585 7195128 6651635
16632 6651635 6673572 6666916 6308146 6069976 6298531 5829331 5694740 5701719 5739943 5308879
16622 5308879 5265363 5090647 5146716 5173150 4823984 4935402 4664541 4424250 4644411 4784812
16612 4784812 4567685 4431353 4388961 4246295 4108283 4081365 4329470 3857244 3587385 3792118
16602 3792118 3642411 3611491 3146328 3399991 3335894 3487086 3467129 3303793 3293326 3376752
16592 3376752 3454075 3360582 2836459 2761309 3148154 2964455 2995597 2743991 2917642 2712481
16582 2712481 2674118 2716577 2525863 2406509 2634064 2536542 2176891 2389841 2540253 2516788
16572 2516788 2702069 2074735 2162467 2214101 2162897 2360401 2356619 2370566 2078514 1879351
16562 1879351 2266237 1879044 1975210 1881582 1844532 1823378 1694785 1979563 2090412 2191092
16552 2191092 1769863 1941503 1955586 1838214 1769514 1925107 1689104 1546986 1629710 1603061
16542 1603061 1338663 1380926 1835978 1531377 1825823 1955778 1399221 1447834 1528566 1384387
16532 1384387 1662304 1297108 1588498 1381215 1405477 1629109 1450343 1307475 1233697 1065615
16522 1065615 939442 1320652 1219874 1057037 1129463 1391167 1053874 1008076 1157525 1050415
16512 1050415 1118785 1091466 1081350 1108590 908903 725905 1117532 986775 1322042 1084307
16502 1084307 882820 1071685 1053264 1138265 963804 1003587 789204 1135620 864060 718869
16492 718869 952244 1074555 874572 935800 670481 1087420 518417 941372 793411 1028217
16482 1028217 564820 1021947 536285 1197806 906876 1071453 813563 935609 1036225
16473 1036225 866059 325498 557100 940883 745736 806924 939210 841573 818555 883008
16463 883008 859260 490294 639032 896436 749081 799539 709702 811127 606582 664558
16453 664558 710670 594938 537556 897724 938496 692699 657516 666069 611486 695330 844317
16442 844317 744226 892354 580876 424598 756922 625964 548676 789301 693685 527784
16432 527784 571660 664689 534659 649953 718125 685807 282323 545859 684108 649678
16422 649678 479555 338485 880098 851047 632966 370270 420522 690791 507915 618911
16412 618911 341043 504759 505596 449254 807037 469314 590677 642099 765523 500986
16402 500986 538784 329539 733136 458619 289745 566014 629020 546912 407770 618391
16392 618391 262025 586847 350437 634489 643202 623214 629062 613551 320792 367239 386449
16381 386449 353247 581046 362520 228218 345528 587732 367951 340392 158055 486849
16371 486849 182204 2327 393021 143759 418191 401775 448757 529605 379316 546293
16361 546293 135722 511697 441301 664283 330786 607369 -6598 264707 304544 318094
16351 318094 105345 464065 222413 107693 504658 440031 289938 417643 430091 -122350
16340 446806 500966 222136 196516 246082 454679 449289 64346 242635 469511 149518 294285
16329 294285 37337 403587 358296 444359 63069 245916 354853 278712 230142 -50856 270743
16317 389139 416453 285719 496097 4367 374079 560375 515612 254909 427234 116226
16306 11189 324894 214835 89315 264395 345401 230841 103294 255479 340358 316343
16296 316343 326730 -76106 66605 407749 51182 199864 130476 -282877 180060 303211
16286 303211 254456 176971 83561 -149537 -170131 65725 122710 -129454 110630 314628 -78240
16274 313958 171587 21193 -24794 119733 279898 396899 345801 189925 131921 586955
16264 586955 50424 146826 -86281 1350 357345 382347 -44511 -75513 52016 92539 292314
16253 292314 493269 -5849 404785 165319 -24988 135151 414916 250336 303105 98054
16242 403450 -111614 38460 71790 264265 -265282 273674 185307 311776 259129 148757
16232 148757 467689 -14804 196471 472878 168869 174279 330844 66152 3512 396899 109750
16220 -54767 270301 -4636 132645 15180 111747 36719 -168472 -333546 313398 274371 52331
16208 -237953 63295 -134276 220394 -220649 107269 158184 144047 80522 113934 -73918 352335
16196 -77264 84436 343574 120511 60755 -22394 -27198 193532 -8236 47987 132208 73540
16185 73540 96798 242026 -99302 251310 13638 37106 24314 408103 120650 207095 2308
16173 259742 189603 146531 202753 19531 45988 -14035 338866 -24086 545375 -13434 387495
16161 172942 49113 131057 210587 218626 -76790 46819 -56118 407522 229533 67080 105055
16150 105055 47695 125505 -171720 543388 153625 50809 178547 -138279 255640 -1433
16139 -164199 146826 -81142 184673 93493 97908 322445 14404 244089 -158303 282622
16128 105180 88034 4018 33881 -262633 -6861 -51981 291568 248378 220585 77277 -115444
16116 123780 -184754 -110232 181044 -138871 -177051 188037 -28392 47563 -208141 67970
16105 194557 -138654 64312 92837 76096 169163 -16667 345238 330333 -22503 -100882 17807
16093 -41848 556506 259021 -227388 -177233 194246 152039 16195 176496 -70782 12224 -185753
16081 126286 260036 25645 -284357 153780 109241 -75904 -94514 -60282 -26758 4509 -236314
16069 -270889 -49070 -185864 249705 -323089 -164044 25532 149961 -80767 -470794 113497
16058 -109273 171964 -160575 98741 367175 -151868 -95089 129133 150107 -207253 -67287
16047 -19461 -156474 -132614 -84521 -118785 61036 6053 -220758 503689 -115288 -137792 225628
16035 83151 311263 -90582 -54166 -187775 213704 -242724 -187890 -45433 165853 -169499
16024 -202746 26427 28727 291745 -56058 4827 424046 158100 297025 -368376 17918 -10906
16012 222020 92691 -39395 -76571 136855 -381604 -34614 -189811 150654 8537 -167408 -166612
16001 -166612 -9489 253203 77172 -11216 -273505 44657 -50962 -299896 -69894 -152636 57464
15989 177736 124507 74685 22965 -150476 -270170 109680 337385 121074 123586 596198
15979 596198 102092 190698 235307 344908 -254453 89510 -233826 -201540 394078 65674
15968 -81279 118087 8111 271177 -88093 -4670 208709 348743 -181861 140681 197775 -5045
15956 -90276 153439 240669 8322 -254873 -94650 172089 -75823 -103360 -479410 49110 -81278
15944 -81410 162478 172761 114895 -116494 37763 -265430 29690 286985 -52466 71010 145381
15933 145381 -133579 213174 122118 -65688 -54905 198565 -74820 -89448 -170880 -243406 234049
15921 -206167 138232 -61152 13167 42783 -124348 74628 -134563 -167741 -75023 -61067 -125224
15910 -125224 125147 234226 -208366 161265 -91069 -222055 -162242 170038 -451839 -276074
15900 -276074 140205 -77084 -41101 418382 -91826 202246 -102266 -46369 -49181 -412675 74371
15888 -22650 -63610 -117962 96997 -146988 384293 -173680 -220482 270004 218882 140127 -254141
15876 -100467 -36577 -72810 -261047 -156484 -185025 -40517 74103 345154 -51304 34117 -455583
15864 20033 17795 -253209 247864 -99133 -198686 -50087 -49745 -317067 -24644 8554 69209 -82644
15851 -39181 -239487 -18330 93872 132900 94108 -39205 -96317 -81243 -123981 81533 -271917
15839 -33784 192770 45827 111966 210069 -370608 216219 -105 -133644 73394 99473 91417
15828 91417 81997 -350457 95617 -56205 302693 -704 119796 247919 54577 -292312 -87621
15816 -39927 -242822 -18490 -244664 -80384 28321 32220 217419 -151777 -378256 31844 -22604
15804 -5782 39851 -39591 66485 56285 -36180 55419 -113047 -376089 68775 -22389 106619
15792 -163320 22672 179616 -37113 -167495 -110112 293194 62500 -174792 -16602 23621 73592
15781 73592 74102 -123812 -155319 -221627 -11648 -189696 -144099 -73441 -23623 189765 -296633
15769 81641 237813 -108420 -153029 82533 -30485 -261160 -10395 142267 -147706 12077 -1149
15757 -153385 237810 -48677 334487 137189 -48675 148872 -87992 50875 -256393 -366470
15747 -366470 64253 434906 -47868 374023 -196936 45385 107588 -163141 197810 -38834
15736 -6892 -41757 369665 -134197 -189894 319977 -165330 -119630 56839 -133598 -55057 100214
15724 7276 -154624 177887 162242 -310659 137805 -127807 -3811 140776 65833 13106 -338910
15712 -63148 -15335 587572 126823 44801 44860 -245323 -118504 -12890 -132404 532134 -257109
15700 -154793 -368355 -207790 100635 154788 276294 137793 -167417 -101313 22810 238078
15690 238078 135208 82624 98275 215012 -248493 -61564 147705 421811 -117020 184516
15679 -65078 -288189 -245988 -390095 54930 -195160 -380532 65067 56731 128382 47268 -211228
15667 -11234 114639 104364 79658 20266 -281512 -156495 26074 -47077 84897 -48421 14502
15655 5979 56801 72185 -157283 62152 -91809 -52210 -68217 -33782 212500 -135933 -121172
15644 -121172 -272709 -76987 -134286 -6219 -194686 -376288 32135 -23654 -362679 -64439 56308
15632 -531339 80636 41081 123072 218921 11107 -222214 34830 -4361 228286 -114759 102922
15620 -161793 -47931 -264493 -51166 204841 -85296 271105 -133636 -218789 228499 54847
15609 -40421 -144197 -220291 -34509 -79981 26370 206169 -58101 189162 131483 4979 58230
15598 58230 -97647 -20299 -3128 326423 101988 -70207 -113336 -214996 396099 -5959 214428
15586 -191297 -219418 260545 -228460 201969 -131231 59287 -58130 -33998 -29369 -302638 -144472
15574 -51309 -275531 88515 -46763 45652 184162 -339439 -108976 -129243 198148 -11643 -110637
15563 -110637 62535 -80285 -151671 -186340 -271365 38545 -15967 -56172 -211347 -105130 60364
15551 -477289 103322 240029 320257 18073 17805 -65267 161758 -51450 76668 -175133 88486
15539 42025 16471 168890 15564 176508 47211 -124553 44136 10962 194841 234626 -19114
15527 154035 463055 303477 -312808 30471 -1684 169361 68739 -53071 377028 -203887
15516 -14177 17197 35667 -263959 -122834 146030 235040 66640 -229006 -153985 -123111 -45831
15504 82533 208933 -83975 -153264 202294 -192309 154807 216368 -300545 363993 -345804
15493 -95210 226832 52181 93834 -44100 -49974 339818 89921 165224 34912 126053 -264561
15481 -152909 306568 -123436 -1697 -20285 111179 253444 193320 -184153 112168 -190749
15470 169041 -68181 96237 103891 -174964 144609 51952 -36352 -147410 -204531 86649 -414132
15458 -165580 -256816 -102771 88633 188748 261445 -110457 168869 -7800 -160957 -85972 -161393
15447 -161393 134021 -117745 29263 -23906 127303 109861 -194555 -172025 94310 -14518 88508
15435 -185643 252644 37423 -127082 -325283 -185817 216788 285070 256710 132278 -58808
15424 175409 -200437 23686 -59678 -174820 16994 45042 -323263 -20414 262580 -2395 -248035
15413 -248035 -192254 140567 119915 -113935 81080 -287816 75062 -208438 160437 -138039
15402 177567 249484 301753 165715 -149858 109042 295451 81030 59603 -207083 -233567
15392 -233567 -75643 333196 12467 -232130 -181963 210661 -122723 -265780 -178046 219925
15381 1489 -14523 -83527 -116541 -391436 -38399 64008 -132450 146586 -104893 -74464 115004
15369 -166125 -41070 -77856 -265255 101330 123007 121408 -5024 143864 965 -70230 -87004 -420505
15357 -420505 -80692 -95638 216895 222360 -198821 177720 154623 74446 24094 36787 -194736
15345 -197040 -259427 -134498 31613 120980 311333 211577 -95046 167393 30350 -61489 -42957
15334 -42957 -29161 208322 29143 -709 -237646 5448 -49861 365378 227309 -246949 163039
15322 -236857 144313 -42333 64912 134634 78259 62976 -23843 84824 35403 -53994 -75060
15311 -75060 518145 11441 -271436 76363 -19253 -254608 -32255 -44390 -111495 -76776 -253206
15300 -253206 532185 234531 257710 105720 -357679 104400 -50347 132943 311397 34411
15289 173926 -632 169793 212413 5085 3240 172048 288899 245645 -108476 -309742 -222501
15278 -222501 236590 64572 42801 49228 71601 184480 268051 95219 120072 -112075 -193712
15267 -193712 385801 -181212 86608 -50313 370127 -98804 -316 12965 88833 328838 -100788
15255 261810 414230 48425 336933 113772 114431 178575 634861 1020324 2090945 1200845
15245 1200845 1323042 1679406 502284 244344 -130047 -139568 84519 296356 250614 96884
15234 245542 -172877 305420 205184 187932 69644 51680 433571 -139072 225436 163955
15224 163955 109563 282655 216176 -241072 197977 122580 31974 3655 57576 -1087 -279164
15213 -279164 210222 -6227 -132016 -345547 -206614 129442 244559 218968 180380 -110435
15202 333337 -259434 -48843 2643 48854 57628 101721 293986 233341 335296 27574 -83629
15190 291084 125878 303042 44708 -236932 240078 -147570 348240 -217971 -48569 4441
15179 320218 419304 67672 18417 210465 -84036 177082 -132440 -126990 21697 172674 -15161
15167 157480 -51535 130657 103616 -5849 495779 -124216 92536 161276 87696 155983 184023
15156 184023 294163 303321 206885 284854 -163195 -176434 -25507 122518 96038 -63772 214193
15144 316914 -120025 4673 74130 48370 276829 391632 194725 205378 99216 29243 177525
15133 177525 76742 274594 59734 70280 375162 -30613 274315 194359 59620 13722 436224
15122 436224 -256711 157159 127143 -337719 113275 380428 171475 328418 6778 157713
15112 157713 52684 -60373 432863 204858 443571 448094 209853 451159 -72118 -130315 133345
15100 -173336 515517 87098 142312 345439 342896 111838 -52519 132981 -28163 253747 152757
15089 152757 95798 204978 176078 324272 320955 383189 -380545 -56035 302611 -112434 12421
15077 116026 -194240 124678 146909 254773 205395 149359 61294 312995 42170 -89640 268536
15065 236101 50501 -256872 14940 178571 13829 224035 136767 518437 7121 -77615 -18626
15053 335606 149207 242180 171571 146547 -181930 341780 141896 258223 -122300 340372
15042 -129746 192980 274843 81337 204935 292742 37305 159314 279833 222864 131304 137958
15031 137958 43605 288275 -21480 122378 356551 367088 335871 68200 81486 -60248 412412
15019 109903 -198365 96501 216267 316480 295456 383945 119304 216488 -126039 105135
15008 111154 348962 -34173 197672 25084 186949 146020 -93417 197741 -87676 314376
14997 413026 170511 206882 164679 81964 71577 243435 184489 219073 258887 232403 38762
14985 267379 141118 147808 -63053 270178 135493 335384 451227 226668 590774 151108
14974 213854 254306 270223 130059 18027 325018 692749 10581 522016 476651 405051 195416
14962 522436 175039 402725 331711 61564 381988 351376 373438 554254 118366 -60187
14951 326577 254539 310292 1698 83856 198867 226361 -83013 286846 109425 5861 268142
14940 268142 213137 -110756 41214 406927 179726 75234 292914 367875 444471 278660
14930 278660 423900 -223154 431159 274261 170055 83799 26730 428915 33293 305317
14920 305317 308633 784000 181091 241871 349565 453308 126023 -20522 278483 253169
14910 253169 471325 138144 352123 615468 355311 205668 359173 381931 224779 313446
14900 313446 200485 291833 270365 190975 731760 605166 373391 556198 331641 136857
14889 222872 180410 265651 461121 275387 414860 504785 492103 172509 235460 197459 297495
14878 297495 390679 54443 298569 433782 352880 325246 320647 320237 456364 201491 615716
14867 615716 528759 548824 769707 711846 325217 278351 507503 418434 376336 223099 441438
14856 441438 353291 509492 724576 371008 211932 635615 631598 406245 385613 516914
14846 516914 229751 530282 579410 314262 486731 8904 641639 116780 606322 502978
14836 502978 292225 621906 547040 203866 334913 409005 457227 441294 635833 367721
14826 367721 435811 230524 555072 118599 322289 288584 556438 440865 275343 533540
14816 533540 506874 295957 321496 765981 575108 695433 382007 583776 540257 597460
14806 597460 727116 435375 501671 456080 486536 453932 816276 769160 646522 557135 716292
14795 716292 413829 141763 357154 794346 712150 481255 757751 451651 472991 413210
14785 413210 602086 489523 662087 521793 643011 340184 339736 470094 181882 434019
14775 434019 372058 892209 816211 798247 838021 800356 693164 755194 577261 710180 720357
14764 720357 791444 269020 596021 806325 854141 643445 548376 525158 1028911 613045
14754 613045 662620 643269 666251 567432 566162 1085449 832547 507310 862828 666838 880594
14743 880594 833487 738096 605894 627326 702043 733805 740212 1046595 808244 794982 1066609
14732 1066609 900728 617648 775752 771666 807889 583320 699727 1069629 869727 898789
14722 898789 744672 879871 1010047 626067 764958 936751 975670 805192 850501 875801
14712 875801 811033 728175 891092 695888 894269 829079 1004444 1167598 988562 690916
14702 690916 842821 734609 1009481 673981 1114757 791146 845734 1027666 909268 850799
14692 850799 1146035 982190 800474 1050467 1182424 789776 1102398 872736 884823 933839
14682 933839 826426 1069924 988726 915005 1109678 1169362 1499776 1151554 1038280 1215504
14672 1215504 987176 934133 1061735 1215966 984079 1033032 1509406 1183409 1030055 974999
14662 974999 1375123 1276266 1096646 1417694 1233833 1314979 753497 1167301 1231603 1048513
14652 1048513 1310623 1294776 1193782 1434085 1273933 1029490 1241607 1167705 1150993 1391701
14642 1391701 1012764 1271562 1210779 1208269 1411291 1141252 899142 1087253 1467292 1402104
14632 1402104 1419408 1315265 1505354 1590040 1753598 961317 1490756 1347989 1416059 1636831
14622 1636831 1287375 1327635 1910833 1477588 1400641 1596986 1657839 1284399 1262875 1876126
14612 1876126 1482677 1416292 1722609 1674764 1637326 1424394 1890645 1359823 1748930 2009853
14602 2009853 1760705 1886270 1806232 1850737 1563215 1982826 1723857 2014428 1867772 1641038
14592 1641038 1934467 2107698 1823763 1956936 2289881 2171706 1906545 1986033 2017500 1940642
14582 1940642 2278014 1785251 2058492 2163928 1844720 1963944 2313973 2295724 2370634 2273623
14572 2273623 2227464 2253170 1959011 2479276 2602530 2495881 2532869 2518595 2839065 2630236
14562 2630236 2740155 3061248 2939211 2634038 2577501 3156583 3413126 3728447 4007301 3918919
14552 3918919 4432987 4899218 5830322 7721620 10870306 18610174 36978353 48855043
14544 48855043 23194514 12912854 6389352 4029333 3066578 3209559 2127639 2534430
14536 2534430 2489958 2406337 2404965 2315151 2371961 2377443 2507034 2486401 2352220 2572218 2413815
14525 2413815 2614731 2624262 2497536 2541971 2510071 2413182 2968067 2589930 2903073 2661987
14515 2661987 2768259 2815221 2956359 2931719 2898935 3035642 3385180 3180228 3285708 3104818
14505 3104818 3041577 3270859 3342135 3477166 3559171 3479498 3574937 3819118 3262322 3983379
14495 3983379 3811406 3894488 4024467 3801980 3988041 3871877 3752808 3770360 4169459 4148619
14485 4148619 4124230 4323366 3982412 4423022 4343763 4396124 4509145 4296443 4278593 4410233
14475 4410233 4223201 4315565 4912419 4785960 4503718 4757271 4550327 4843005 5012603 4885957
14465 4885957 4848114 4817268 5088449 5126535 5052741 5381397 5406613 5332543 5745405 5328271
14455 5328271 5454608 5576164 5807992 5911335 5930482 5758950 5925480 6045211 6030958 6078724
14445 6078724 6293296 6222569 6523278 6681191 6896609 7064868 7010287 7192301 6930640 7154932
14435 7154932 7563187 7398247 7389969 7658286 7495778 7540252 7802588 7868707 8230554 8034674
14425 8034674 8381857 8299055 8652839 8190173 8490690 8652897 8720521 9002163 9284500 9580474
14415 9580474 9431214 9738634 9692093 10001964 10065744 10026327 9932267 10409985 10624115 10468170
14405 10468170 10741569 11275954 11106571 11678958 11978716 11547470 12201059 12108624 12201122 12560751
14395 12560751 12319707 12701629 13220162 13326133 13714443 13952066 14185914 14460476 14341271
14386 14341271 14894348 14945969 15121505 15742646 16141447 16164478 16465976 16734459 16836134 17588736
14376 17588736 17879245 17951068 18348272 18956188 19180943 19655156 19563446 20304752 20637214 20981365
14366 20981365 21765190 21815504 22226498 22835196 23559092 23698223 24353491 24725303 25577274
14357 25577274 25971504 26843874 27152530 27596078 28468833 29033893 29949137 30666671 31355449
14348 31355449 31873827 32803207 33916542 34604427 35427850 36205845 37388379 38495058 39289089
14339 39289089 40053161 41554085 42491850 43890845 45236857 46321290 47550863 49020918
14331 49020918 50636911 52205786 53527809 55417338 57231378 59187823 60603551 62799861
14323 62799861 64748065 67317020 69529935 71977931 74686387 76931050 79880156 82650065
14315 82650065 85982006 89155984 92314250 96188185 99753324 103594198 107908498 112395106
14307 112395106 116710201 121644985 126780999 132462905 138061227 144172581 150436075 157175997
14299 157175997 164670162 172011095 179471751 188113862 197088445 206263306 216063558 226480074
14291 226480074 237294140 248376750 260102135 272647124 285121238 298289273 311879655
14284 311879655 325878958 339953762 354162880 368482569 382441856 396299581 409595525
14277 409595525 422048777 433473910 443693575 452047260 457728309 459919291 459780408 459350853
14269 459350853 458189756 453984821 448388293 440255310 430637076 419922443 409164881 398595367
14261 398595367 386549992 372855555 358823689 343978013 329836164 315351426 301029723
14254 301029723 287515313 274792891 261556888 249152136 237055075 225960649 215007545
14247 215007545 204674596 195272943 185805077 177765011 169498212 161486186 154236539 147209888
14239 147209888 141000058 135161719 129644212 123772799 118274461 113717115 109011542 104801179
14231 104801179 100721544 96925311 93292076 89694792 85998094 82824451 79692881 77211684
14223 77211684 74022445 71647355 69240025 66992254 65213982 62812041 60704274 59090434
14215 59090434 56471053 55143307 53911664 52105524 50516035 48831528 47335168 45886060
14207 45886060 45332638 44248667 42572002 41354861 40087995 38666908 38058189 37398321
14199 37398321 36516583 35392344 34226164 33342814 32637467 31970886 30949083 30534337 29285872
14190 29285872 28864566 28256097 27609477 26947265 26248074 25688375 24895207 24531556 24410920
14181 24410920 23580069 22843633 22478260 22255458 21419893 21073280 20650743 20178897 19880927
14172 19880927 19399051 18845068 18598909 18143512 18279808 17647208 17406018 17102079 16895815
14163 16895815 16377678 16103469 15841613 15660899 15310737 15301349 14719471 14703307 14066896 13906860
14153 13906860 13760601 13315735 13204935 12823396 12955431 12492482 12717329 12308574 11889460
14144 11889460 12059766 11949772 11423981 11183349 11461164 11054060 10795210 10429119 10576525
14135 10576525 10410301 10249369 9999604 10075753 9984626 9800454 9740498 9437157 9084325 9461816
14125 9461816 9169919 9124831 8549436 8366201 8836537 8366158 8363843 8108650 8157744 8068839
14115 8068839 7931833 7868604 7555163 7632325 7466443 7539494 7162525 7349089 7108885 7404296
14105 7404296 7229091 6784806 6886095 7193835 7057455 6700239 6592672 6321589 6450720
14096 6450720 6346062 6386150 5984383 6063542 5838291 6073905 5757850 6001766 5667921 5528397
14086 5528397 5789548 5360592 5761022 5463386 5371855 5318701 5111857 5201254 5301225 4991408
14076 4991408 4871624 4793525 4747125 4814890 4839349 4655806 4790364 4870821 4403416 4379057
14066 4379057 4672198 4164682 4552802 4536666 4423154 4272442 4190172 4276515 4551513 4441343
14056 4441343 4329836 4447083 3922756 3867314 3980699 3924338 4127097 3903745 3933766 3743209
14046 3743209 3628983 3774708 3622034 3691170 3414442 3470927 3168218 3503439 3762094 3234619
14036 3234619 3404048 3407250 3418557 3555369 3515145 3257866 3120550 3343041 3350907 3346354 3174192
14025 3174192 3200468 3218809 3023441 3043616 3026331 2890180 3170267 3197226 3122515 2793669
14015 2793669 3045371 2975837 2639012 2655007 2558765 2466623 2933289 2420326 2696958 2507346
14005 2507346 2498086 2509018 2531543 2564812 2612269 2595855 2443497 2226632 2333394 2352003 2846763
13994 2846763 2430964 2564933 2328531 2646786 3125053 3217675 5547142 11474214 28447939
13985 28447939 49665171 29029030 14736737 9170971 6846764 5953320 4763010 4248969
13977 4248969 4072560 3910887 3178068 3446091 2828521 2958055 2804592 2836393 2581346 2386410
13967 2386410 2834947 2575387 2569337 2464788 2684573 2440632 2366126 2255120 2294200 2372868
13957 2372868 2552359 2305475 2081985 2062334 2057925 1856940 2182532 2180376 1956900 2150840
13947 2150840 1838463 1846525 1832159 1864724 1991712 2024650 1949108 1845071 2050309 1708235
13937 1708235 2028888 1894493 2037847 1801349 2381796 1876042 2110772 1824822 1670192
13928 1670192 1784784 1809165 1738548 1982511 1849908 1870907 1917123 2145774 1690907 1727990
13918 1727990 1604068 1605457 1647573 1682031 1593171 1373182 1560278 1478317 1477019 1588320 1648861
13907 1648861 1690439 1666242 1544238 1341812 1324087 1448762 1535217 1620980 1446851 1597834
13897 1597834 1675678 1368198 1553914 1403888 1486266 1431886 1466175 1102527 1411757 1345553
13887 1345553 1466375 1399032 976351 1300047 1308000 1242060 1513780 1704855 1345206 1311708
13877 1311708 1311840 1074395 1312794 1218740 1008756 1235442 1248948 1457937 1417617 1384002 1638822
13866 1638822 1182913 1215365 1287819 1100930 1210270 846510 1191361 1447941 1254126 1232735
13856 1232735 1568746 1051476 1157149 1146067 1351179 1012022 947086 1162918 1255069 964613
13846 964613 850281 1254005 1109034 1315279 1205864 1209783 1527309 1173847 1065718 1468517
13836 1468517 937063 996945 1205386 1234580 1142293 1219617 1117700 1108578 1066473 793893 1012127
13825 1012127 1138943 1302543 1015776 941544 1039818 678134 834500 913030 784401 878779
13815 878779 976341 1006363 699904 997997 1062222 772818 1087579 840212 906510 918767
13805 918767 1087197 879400 919442 750567 1177494 650771 1085178 783990 891536 1011397
13795 1011397 964170 624117 818285 1079243 1120749 635750 729090 1185815 883562 1140964
13785 1140964 1178454 741371 813471 887671 893430 918759 877147 788709 899028 1104858 862148
13774 862148 886798 696543 532887 893669 1006730 1202490 993663 978728 526220 584496
13764 584496 357217 754549 835132 709623 940139 572109 656148 641472 931438 1071012
13754 1071012 884003 752767 742014 618913 804679 488040 717214 612267 465834 573990
13744 573990 733232 682684 974052 754164 386770 145278 418937 519845 855305 713197
13734 713197 845584 804989 548685 830352 521358 675039 590661 765636 568764 300403
13724 300403 812741 394108 717216 738642 621347 944570 705253 689970 380607 784670
13714 784670 621812 660400 592382 667203 463408 848572 131878 820480 264356 652321
13704 652321 449983 687688 613615 539585 497795 403078 787705 724309 882636 455653
13694 455653 834880 572395 705011 583843 492796 540044 823386 830331 485290 532686
13684 532686 532370 341280 553222 658488 639406 518906 509764 424359 657481 404831 514416
13673 514416 168324 505592 883290 866979 304706 468910 630982 363766 487488 855534
13663 855534 546377 684353 512303 659184 607933 436561 481472 333446 531824 374137
13653 374137 318417 813332 460324 504909 520989 324117 439839 629324 679932 856168
13643 856168 320765 740732 362412 641655 237852 452780 553071 697411 169631 358331
13633 358331 553649 208548 280685 579998 561009 89500 165187 523042 586022 445767
13623 445767 466006 314936 564313 419818 407556 249761 727242 332832 378238 274094
13613 274094 507569 225632 269852 193411 487484 511279 477666 540408 205643 356757
13603 356757 315629 -24492 705121 641504 91544 600357 403694 233852 396123 544291
13593 544291 546041 428569 843493 172567 398211 351318 433115 343936 160035 389557
13583 389557 405216 410956 532475 256697 453155 271926 475171 321896 75110 373504
13573 373504 291548 -75583 447758 253919 579199 188756 344497 213662 187818 477242
13563 477242 330363 466501 627569 266398 486609 669653 268739 594537 459957 -25360
13552 428685 224010 486485 909050 198197 579436 653737 380426 499198 366657 275185
13542 275185 641845 205441 449100 412177 273377 418726 354003 258696 334085 413636
13532 413636 563472 119435 190131 430414 366183 266332 353442 197625 360923 451175
13522 451175 343198 186836 472204 251965 66535 349872 443050 395296 335629 120034
13511 133441 -16810 290530 296714 302415 298090 369242 120602 418126 564103 -27132 121502
13499 150165 180562 284143 107414 322644 148173 207078 231110 89445 115482 -30413 273797
13487 32232 102289 495077 324748 270862 608263 190999 564425 164647 224154 267335
13477 267335 330164 306618 89201 75213 72008 394681 350547 373954 425544 303779 201519
13466 201519 164526 184768 267458 133561 226576 108033 316826 225669 300662 414243 106482
13454 281057 128004 155558 378110 141824 -90077 257347 515832 169464 322945 380307
13444 380307 160377 309744 211 92429 289370 -66350 181819 276919 -200561 469593 229874
13432 271708 213655 288831 177970 182704 377323 169518 185278 343820 -45119 208549 75523
13420 297359 -45736 80134 442777 88948 352912 341484 -9238 153982 490306 271625 480400
13409 480400 -371426 -1936 228497 180433 351526 262199 141870 579241 342407 513122
13399 513122 385427 169643 109439 87065 383451 93647 238577 418072 26797 179344
13389 179344 294836 85221 387988 373602 173556 119824 276480 323416 42230 160291
13379 160291 -48442 248551 67258 440020 52787 260724 68299 2295 477595 -9504 321003
13367 437957 302972 123911 254759 126328 97703 335181 453089 415788 118958 198387
13357 198387 356564 513065 87058 261529 150926 334325 176975 14725 256175 616565
13347 616565 240428 253859 417750 322499 255057 291026 365149 282190 -13838 404237 386045
13336 386045 285001 131330 143052 251669 241951 343894 65350 308551 74808 -53454 389642
13324 120969 19343 142985 123614 324670 83036 34015 135345 240780 321027 69677 469548
13313 469548 144399 44885 426232 289654 366301 -7771 -202725 281485 158312 134657
13303 134657 218446 139245 298689 326371 6592 243930 -72536 71643 -17824 187651 278683
13292 278683 66577 113310 92293 -61179 306916 19733 12920 216200 -29942 186505 295975
13281 295975 224808 71432 117023 137018 -31311 213243 398363 13398 131479 236445 672340
13270 672340 140603 139108 189934 137949 313852 -117793 152903 316851 -361761 -132974
13259 158183 366553 54206 126658 272458 5217 311213 -128488 -410 -72199 316125 244191
13248 244191 199762 212225 216643 217408 277502 -106487 308312 -182026 -46685 -169628 204679
13236 71882 222467 90806 273644 34234 100732 237767 314570 46065 19904 253876 210340
13225 210340 -5683 121018 231112 -109990 -14283 222834 65632 -79605 -49232 266483 236205
13214 236205 -192066 96617 -73889 183054 -47167 479316 410436 -179082 433943 127931
13203 -227690 304795 -18988 -69663 14303 608179 -75267 132342 87698 201278 218705 -62852
13191 -114668 79880 176988 125832 89451 336248 121501 -233734 93411 -84338 191630 142659
13180 142659 -177009 121306 -53083 26039 237604 102315 272520 24987 113552 22295
13169 94118 -193499 319102 114639 157908 127247 19132 -308368 264345 121042 29936
13158 -135840 270281 460695 19063 -17589 244645 -208567 295731 -52450 220473 285435
13148 285435 -18838 224987 -13268 430462 71437 200757 80941 273339 73665 -31123 -110766
13137 -110766 -93779 -29647 397467 -146202 -55555 -4066 60355 103983 -206095 420621 288822
13126 288822 293967 369404 33202 227631 -35367 302740 245441 142453 -401794 79972 342552
13115 342552 161224 278047 201748 77230 -101327 57876 -293099 185532 188143 274347 21151
13103 82681 21539 30913 -124876 -238363 58345 116395 14574 -144881 141033 125583 -228419
13091 -200051 -11923 68643 211607 315069 -134267 115191 438600 -131364 287334 4999
13080 258243 -233692 357147 6357 167439 -44609 130629 65919 -39586 254276 -142406
13069 36894 151417 335147 124928 -14350 5204 16067 -180992 347817 -80352 118963 -29486
13057 -5649 27487 -19624 178671 150131 210222 268715 224900 301151 132240 80984 -47360
13045 223976 -91767 364430 -13845 258370 -52329 -187249 139971 285394 -471203 185957
13034 32719 124758 24650 22129 326763 70450 57778 -90352 386562 208613 -139706 340356
13022 39181 249306 -4189 45255 -145325 -216831 199487 -96979 18880 197540 46946 202239
13011 202239 -88821 -156457 145673 132217 180010 141440 53344 56522 197175 69755 158818
13000 158818 74731 215865 11749 143632 144168 312750 201273 4260 67804 225318 -153948
12988 140758 160253 66089 -5178 457026 7941 -140305 -193068 9921 59558 264701 100094
12976 247070 207729 86353 -17872 50938 -102584 162812 33244 -67924 -236188 10871 -74732
12964 -284174 190923 -315590 187596 132673 215061 390648 -124512 83679 8205 74571 78872
12953 78872 42968 147964 139099 -342768 -17499 -44906 8040 44830 19622 397436 374551
12942 374551 -246754 267843 50013 80885 137740 2089 246772 131378 152849 72961 102199
12931 102199 -164784 22114 -97447 41224 88453 142113 -211680 276303 -56615 191910 -80734
12919 -263837 196714 273655 48959 -227718 -114334 -177229 -194356 -38621 178869 435456
12909 435456 -33396 -17528 -64179 -178626 -13362 99940 241778 44039 227149 118048 -79998
12897 186836 115709 301309 81224 173471 285615 242871 258704 -114500 -4784 -54719 321486
12885 -119682 185579 178166 119738 -165763 30400 -11553 -209396 136554 86608 208671 -38045
12873 -184941 76807 -12053 90900 -274303 -69226 67356 -17566 -315548 235365 -161821 338131
12861 233683 61237 193245 -326349 29116 -290722 76890 -26997 -98288 -73093 -93816 272498
12849 -180947 -268754 -488201 -133278 26468 222429 -90327 91231 -80215 -163492 152620 465254
12838 465254 13009 -63189 -168250 30387 -157222 -110916 -180796 360756 247233 145364
12828 145364 -100289 266315 -45998 -25837 -109009 -289994 132300 45170 -68148 58540 -201938
12816 -71608 -71754 199126 22694 90591 178294 -151481 21312 -95741 17280 -85755 187925
12804 203244 349419 246863 146314 -25113 262934 127430 357622 223589 -89598 177645
12793 -79397 -92094 556730 -118303 -413395 203889 161242 273890 -111192 120021 208011
12783 208011 -160520 -279827 -89204 84491 85024 150720 -275701 29532 -137668 -151352 -33196
12771 119398 15257 -143286 -87519 -278630 -249438 -30973 290906 -100936 -113097 -123404 210603
12759 21543 -54864 -11784 86774 -361947 50594 81267 69935 97655 -177025 -131579 -69386
12748 -69386 -50369 222390 -51499 227400 -154210 -344136 -273141 138386 -104017 -87364
12738 -87364 -70653 -60729 -32474 -29726 85864 59484 247126 57691 109959 -113958 542688
12726 427847 -24222 33644 48207 322855 309393 -292388 275645 89715 -89051 -193485 222431
12714 -124881 -35244 23558 -246951 386890 18813 190932 266754 444770 -5847 -90888 293441
12702 239680 212875 286934 220307 -57899 -10918 -80862 146425 113379 387871 -131320 200664
12690 114404 -67079 -195452 52754 109563 -224741 147963 102275 -146841 175912 -120156
12679 30977 1777 354618 119097 6725 -10999 436152 355827 -31493 135699 385299 -85733
12667 -347291 230210 -190497 -79209 93144 -108876 519345 125746 -126588 196851 -119834
12656 -19881 -670 179572 -29613 327075 413395 -1930 76925 132260 -248348 393714 29746
12644 -294211 -76769 177998 -46849 82303 312167 -180404 -181163 38268 -143014 96208 -45207
12632 -40140 250930 118047 94663 459356 156210 -187699 404676 61554 138052 -212283
12621 211785 165875 -14043 -137550 92528 397350 -50029 283488 56005 -109506 70632 -104373
12609 -218372 131450 275174 -185027 -111276 227244 -40988 -253315 8430 111137 -11243
12598 114130 59305 -17947 316136 -81764 -50033 117563 -178183 -45245 213956 53275 46313
12587 46313 105901 57558 64086 242891 110673 62556 -129698 337682 -239914 28652 220017
12576 220017 226611 10457 -80362 150600 133387 -211893 402595 119667 -34597 -125083 -185597
12565 -185597 -49725 64790 88544 47324 231656 52435 -116293 227135 84941 129859 -72440
12553 -6126 -67284 72439 119152 -138277 22162 10779 31817 -172637 -8385 -39229 -149578
12542 -149578 -270451 99328 -67272 124207 -180225 -7460 168230 -140110 -13926 -55177 -38567
12531 -38567 325323 -110267 289003 47765 -151374 -17833 -158200 178793 -82371 -151954
12521 -151954 22794 -1544 11449 -169933 153445 153125 72917 -128115 180050 196284 -103110
12509 303722 -58998 281994 -23400 114549 55092 20236 54760 -12214 40182 -268468 73651
12497 327515 395735 -61223 -3633 280846 102073 240666 12774 32307 71506 -81323 137967
12485 251053 -36302 -69253 -76869 -281896 402758 -155157 -21026 225075 -209002 -93771 -57305
12474 -57305 -244641 -87806 57195 -59020 -164545 43183 317070 -68830 -133866 116532 -154812
12462 110970 146162 227960 68199 -57691 51576 171835 144477 7898 -376982 -78268 -67750
12451 -67750 -132282 -77394 -24607 212306 123193 -114937 87904 143315 -96990 125277 30842
12439 -52635 -194486 -215906 276725 85682 163369 -294737 -248602 140138 -8167 -155148 132063
12427 69246 209265 141626 451039 -90541 156083 -67264 -188521 72283 322900 -23097 255488
12415 259008 62707 70513 207498 27726 -112749 56655 63994 -46500 87965 184157 -338862
12403 -19272 190943 -18361 60378 -45957 -51272 35007 132642 -143109 217606 256255 -129182
12391 -378429 -182122 -58988 72572 72513 -17028 203819 -217021 -14775 -223307 22190 -9176
12379 -42086 -64537 34396 32143 150525 -75135 -61183 -53013 -145245 -51886 -172408 -23502 237362
12366 224278 -84987 99132 -39444 -124295 425746 -170543 -401718 375370 -209497 164911
12355 201341 235801 -207937 -52597 -171329 -215702 -175828 -249675 130998 22290 -178301 187467
12343 -36796 156950 303279 357716 -139528 182017 -155456 -7546 126446 -79516 22754 203388
12332 203388 76962 -46939 36114 -192788 -60527 157453 -224540 161141 -72525 34957 143722
12321 143722 -202062 -62083 32657 26845 -71565 157115 -7462 -122589 283662 -64347 99583
12309 -169023 49212 -345494 19036 -343048 9901 -208304 -76081 -70060 63715 31228 -79526
12297 62151 -126601 163693 112757 443 -158157 -84905 307032 -125866 93942 -167920 41692
12285 126348 270158 36380 319555 -169230 -44874 26586 49725 198321 -66356 34995 149
12273 -187251 185490 236224 135458 69221 199795 -15797 14687 326055 -65661 120131
12262 283661 313651 105858 125770 307573 49286 318676 143985 -6724 355940 -51244 99392
12250 -37623 46609 323757 62491 -103811 340593 216824 242039 265491 128520 169722 -48748
12238 -130749 23629 -168473 -248908 -18336 297596 165119 227369 209241 235718 130778 182349
12227 182349 -78752 95364 -52315 290859 396161 268766 229078 586440 327365 310019
12217 310019 318366 150135 67211 78008 318017 266476 122216 38693 149722 60595 214373
12206 214373 3394 361812 20904 208474 245838 398029 150629 194722 189974 -8296 196249
12194 26710 -93698 290083 479523 423724 238648 77298 139336 235056 40979 114367 149188
12183 149188 293078 -82841 -20176 2025 191844 251487 27691 172857 179027 298617 142212
12171 224824 261788 71134 -16820 -214485 -5433 221065 308291 14604 93680 89830 28023
12159 140989 31375 92828 -287287 -34744 97385 -127170 153738 48880 271599 -121008
12148 12282 -14995 160027 -94401 -224283 140012 -39407 -77307 -25365 56179 -35159 242006
12136 -94603 70095 49743 -217882 216082 102175 -25530 -7498 507806 28409 -100800 344439
12124 -87941 201136 110275 195202 118502 293952 65394 -144652 5613 -128224 44660 215260
12113 215260 -65910 123461 -50287 -46604 -18999 -131244 -359740 -64634 8513 119374 78765
12102 78765 -150409 -131254 75746 -30265 34561 179764 139177 413763 223414 26699 106591
12091 106591 144445 -94966 -5500 124375 138005 7987 70474 -80190 332432 -104485 23876
12079 116773 -149840 30526 150105 -392927 208997 239814 2578 123578 -25070 -124240 179953
12067 84684 -52624 -164791 39550 -261434 -7637 50045 -9559 515044 589211 2376964 483125
12055 429227 45886 338698 -31406 -14422 -17633 -343181 -49361 72915 11592 -141027 -164892
12044 -164892 -48560 -81095 -260725 -12944 462439 -367387 -159794 -161128 66628 -111197 214483
12032 -249409 32898 57704 -39269 271938 184993 325956 -134005 34200 4997 -44914 74215
12020 -114094 35890 -384793 366627 156969 -287487 -4842 -302756 206024 -115634 120599
12009 -120540 175478 -210775 117566 -95208 363883 126929 122588 -140778 -67651 -8365 100049
11997 41426 -98100 278318 -82260 81032 71942 -111806 -462787 -303976 147687 25427 -140866
11985 111229 1627 28572 145838 161871 -285479 -17210 87199 140868 -191770 -105054 -19366
11973 176995 78069 -186689 34747 -110386 -256696 76099 282045 86620 -370279 -136299
11962 -84927 19184 -127336 -279783 -63553 85741 29342 -222793 -301303 207962 184480 83967
11950 -98975 43699 -52836 21720 15831 14386 -142246 -124784 215087 -205448 -94576 113681
11938 -253397 -172304 -13841 -186729 277490 218929 45278 -141421 -122129 3213 -60063 -85010
11927 -85010 324813 357371 93253 -387877 -85151 -146416 -77329 -75789 118964 166856 -168814
11915 154000 -197632 -95260 -19765 89607 161050 -77771 -99871 -342259 -235717 91575 241227
11904 241227 -173613 -114144 273834 100962 305447 110582 -66698 55849 -26407 -344174
11894 -344174 -203649 82178 -394618 66722 -210575 -155194 -183947 -183348 -169079 -394239 -168787
11882 33264 219816 -374526 172391 -328465 -230158 -11325 -126090 204800 -17172 274891
11871 114780 46790 5603 253217 -77354 -79958 21380 96113 -187189 -83119 -14716 -175918
11860 -175918 -215610 -34426 -86309 -58792 12373 -3098 -4616 129557 -17817 104821 -124767
11848 -133369 -124473 -227679 -187843 190736 333762 -77700 -130005 -98834 -85475 20563 250923
11837 250923 17651 155646 -513373 -55571 98048 -303034 272899 -99460 10819 147671
11827 147671 45913 -167422 -185433 -89661 -256827 -155579 -102672 76010 221278 163640 -27434
11815 -335632 136678 32439 -184918 -116611 116111 60327 126078 72480 290019 -111872
11804 79468 -278460 -50575 -174886 85959 202005 -3233 82451 277784 -354251 -151437 -38438
11792 -62349 -209266 -197265 -189621 -68114 -176085 61709 113813 88270 -96086 70474 541330
11781 541330 -181866 57736 133029 53634 -318004 64446 49736 -23757 -106772 -273380 -50990
11769 -231860 97974 -184574 -52999 143878 -139566 -2936 78329 3303 -231598 80019 34630
11757 -91715 153038 -247044 178459 -154395 -84017 -47914 90702 42354 9126 -138604 100194
11745 53115 -33824 -147193 -4614 139214 15076 -192785 78128 -67858 112226 -21634 -13199
11734 -13199 413894 383372 128527 82330 -84286 713 -18257 -93347 -131813 -54842 140501
11722 25261 306314 49953 102440 -247852 318943 -259293 -220815 121457 -111807 -189531
11712 -189531 257810 264503 -117473 124038 -394713 44859 13627 94988 102187 438866 270049
11701 270049 128701 155540 -62779 26405 70170 191209 -96242 86939 251569 31165 111227
11690 111227 15156 -37948 685 134408 -182518 116605 201382 -378548 -178529 277335 362654
11679 362654 85795 -59822 259712 255407 -49952 -151364 -135131 461115 348799 79147 -112003
11667 -278013 218746 -274091 275715 98080 259420 -209346 101765 -45445 -100248 167489
11656 -90439 -66421 -196989 -47182 -153350 -71491 388093 175143 -159719 -7194 -31198 -83808
11645 -83808 122380 139280 -12151 -93238 -146109 84198 -36552 -121184 -106458 93387 -168748
11633 -181251 291079 -103534 -142662 7073 -29591 1718 -82183 -49210 347876 478764 41725
11621 47180 -279948 182957 184983 25218 94861 198859 -139840 179691 -75650 276417 450672
11610 450672 -38656 102978 80272 146547 -59646 -35585 19810 -46805 -66406 79488 408667
11599 408667 -62634 80766 16263 52714 6827 10478 109141 134528 187647 -156112 -237755 139316
11586 33427 -142764 -17220 95569 837409 272465 255023 110360 -33592 316903 389542 24837
11574 75961 312089 157363 -252261 308773 234002 141388 69770 -427238 25903 -5398 168459
11562 220730 110931 500761 356674 217925 -224694 -88099 136608 -81444 74950 -273277
11551 96112 249701 139828 161412 -128939 272027 -98426 184942 127177 438188 -7960 210769
11539 185806 -141999 188407 243943 231331 57875 -234716 189719 16923 58792 16912 263485
11528 263485 353486 -28756 135281 261232 -123412 171790 267822 292715 181845 -58648
11517 -68730 346741 43667 180810 26543 72346 135550 -159042 359501 64176 598 -56649
11505 303989 -37801 -110583 -9132 1732 201290 387326 -62010 44021 -1268 -143370 377561
11493 241639 21043 -43677 -173641 71670 -16110 -5692 -174611 121497 123269 223618 46633
11481 309978 331592 15039 279394 -672 91345 40554 362060 130662 114019 115207 228381
11470 228381 240265 129532 412311 208874 190764 182726 181173 -68605 217685 143622 -98810
11458 149669 -88375 446571 567572 173729 163957 -3234 -54930 274093 247830 222118 110352
11446 64611 -55790 362683 -129079 139787 -98492 13412 169138 191653 -149911 164767
11435 300625 76307 175540 129988 -127009 122531 10144 107821 -44501 278738 -67402 -125794
11424 -125794 -74767 -151542 248896 149657 -101483 -114668 -466651 -203923 -108820 132477
11413 47685 -76037 -191525 -172892 169349 -246042 53392 299537 40140 283436 234599 -169264
11401 201188 275719 -165792 97805 2697 327240 -147853 -107356 11210 52010 -290446 -4494
11389 109359 -163767 -126896 297991 -284860 45450 18596 -21982 -202842 -165060 217020
11378 258265 -12505 -23400 -25395 -160701 20413 -67459 224986 14837 102352 9618 67918
11367 67918 158969 8008 272807 -188186 163370 33624 128237 -20061 -311353 -19943 -86126
11356 -86126 -82904 -96636 103256 103775 157246 84137 -164835 -43179 69614 64056 -104054 -55352
11344 -55352 18722 -296097 318019 -26964 59764 -95900 70929 6645 -121505 -176208 217285
11332 252670 194549 147398 1434 -315706 -88940 378291 36709 203789 -183878 11149 -248868
11320 -417099 -288705 7985 -90390 162039 -35534 -141985 280911 28178 43286 107733 -58953
11308 212969 -182310 -109125 166657 -173033 -143292 339542 -75814 -151915 -196548 10947 -89517
11296 87113 73017 -427556 -202231 -250123 121334 -15884 -184105 218294 -76330 -293575
11286 -293575 -188475 -119738 -39642 214970 -87592 -364517 -20967 193975 -69558 21267 -91677
11274 121587 31861 -77101 -6093 266726 -196991 28090 62291 163934 -562966 -260638 146089
11262 100589 -85950 -124249 62262 -242617 -20510 -424018 -183796 -264309 247923 -165253
11251 -51311 -161099 37719 -60388 13054 -327399 144837 -102156 -94377 -270495 110647 59668
11240 59668 -196221 86740 -203850 166820 36823 326024 153781 414484 115314 38510
11229 -79244 -289169 -134625 115106 -291819 310849 -5128 78205 217892 99032 155437 83127
11218 83127 -84321 -176940 -214441 -17488 71431 34742 -350408 97521 -54743 -129390 -229005
11207 -229005 -365468 -102770 253248 -276527 -32395 -53970 -94659 -27088 -83685 151327
11196 73831 -248970 -146068 9660 24458 -107587 -186280 154141 -98123 113291 -98564 -105544
11185 -105544 -375368 -17576 -110643 -217916 -131912 -132181 -10090 -96544 -90622 137525 -13133
11173 63031 98844 283881 -75142 87501 -168815 -95806 -100473 -39046 36482 84477 -40655
11161 -29532 46605 -242941 -68240 206648 62905 67870 179857 246671 101144 -225576 -191085
11150 -191085 -119153 8312 -107868 -218240 -20249 -159312 113290 199725 -213111 -300657 -265600
11139 -265600 -70682 -162854 -166292 -74843 -167563 -88691 -62710 235414 -69837 103332 451153
11128 451153 19291 -57229 -37127 101495 -133900 91514 84005 135534 -217716 179277 -310475
11116 378077 -26486 379385 64979 -167657 229615 123317 49473 111555 89222 17693 -8999
11104 46364 263650 261969 440597 385142 100115 424606 141061 -139689 218240 -78385
11093 297447 211034 49197 71431 191823 -28657 87174 126443 308036 148086 195669 371213
11082 371213 259696 397124 56186 477654 301406 112225 31457 322800 80998 273490
11072 273490 95752 124400 337588 199931 223984 381571 417838 410811 411842 422405 406416
11061 406416 437717 474815 447209 599240 757877 755131 445230 486483 648586 1001357 411940
11049 568037 771060 703973 933988 562623 575043 679999 811363 688624 770757 730103
11039 730103 818393 916833 491813 978040 516123 969180 809300 913556 1187248 912621
11029 912621 708803 770135 885194 952545 887581 661795 840843 678136 888560 452048
11019 452048 835035 664734 545353 412574 683593 1089691 666319 184099 689260 674071
11009 674071 643308 556282 610187 603418 665178 615859 804446 649545 687274 540987 772549
10998 772549 496205 616644 860928 584029 459161 505229 697749 687787 729808 947790
10988 947790 868106 957071 866018 1206674 847280 960405 1203483 924394 1044490 1408823
10978 1408823 1137914 1800225 1494799 2219125 2340178 2640439 2803891 3011632 2858099
10969 2858099 2811236 2696370 2821796 2385532 2159117 1993873 1984355 2085374 2285114 2067258
10959 2067258 2116643 2341017 2259733 1966743 2271501 1976877 1865576 1500589 1399456 1254804
10949 1254804 662542 697375 612341 1061111 211788 494116 138353 143041 130588 415517
10939 415517 149096 305386 299271 -59554 511091 -8174 149309 347578 110415 -200077
10928 -147350 -169127 11183 -82939 -48547 -57734 388643 244222 -67170 159031 308264 173774
10917 173774 -109932 -32675 -191127 224595 -250601 -166623 -31020 -369 186945 -268294 181710
10905 -5438 44309 221055 270752 43543 217690 -123377 -70627 -178821 270747 -50012 42950
10893 160282 -2937 360153 -11514 -194595 -271669 -205715 -118596 42236 -284635 -66479 -162711
10882 -162711 -254428 77905 -175625 -367035 -229641 -214822 -169880 -81417 18716 -18479 155432
10870 109421 311016 128191 393797 138568 11318 127272 203818 -148394 -75586 -41347
10860 -41347 -141880 -125802 144065 -293003 159229 137000 33739 -367945 -52565 126769
10849 18797 -81528 208026 18265 4870 -61146 -10195 -55874 -334715 -145938 -176400 -63794
10837 108828 1686 -13833 136151 -85672 -270324 -16675 158057 152216 101732 -115276 220360
10825 -44532 85577 87051 -1958 -7598 63130 130332 17935 -103865 224618 146344 43491 -300478
10812 128715 -7368 228741 -176737 189049 -180654 -284739 -175855 -5079 130220 -77860
10801 -50825 -92684 -264808 54272 34596 -318082 -29444 -10302 181097 120692 -50338 8437
10789 163789 -154441 -125132 -640681 -185025 -204440 -313950 -111153 -68800 -123803 56686
10778 -144577 -168349 62814 60936 338887 -304260 -74331 296316 -220044 64776 74272 -33280
10766 35599 -301885 -92740 -162502 -96886 72792 -275397 -267284 -101037 53612 26296 279442
10755 279442 91474 -4140 44334 -224329 -243061 -299464 100970 3478 83189 -90234 -28057
10743 -345263 -181958 249686 29114 -267053 -268028 -218870 83148 29134 45523 -103880 -207708
10732 -207708 -226485 87802 83504 17316 247370 -374342 84120 126042 -357187 15517 -213413
10720 -4030 -128540 -86058 -4451 -132375 -207909 -7134 62416 -361857 3952 90968 -195104 -199955
10708 -199955 -222768 -223533 -99219 204609 72465 -211157 67342 -29404 147722 194203 -21198
10696 10706 -209663 485573 159051 143338 -228163 10059 -534730 -79244 -95060 305242
10685 107394 -350303 85572 -16472 -104130 84868 -248086 -172116 -445640 180208 -235053
10674 -434577 -85370 -79266 -278252 149822 -174804 -97518 -105334 100921 -9554 -204891 -69203
10662 110923 -126002 33014 207296 266150 159100 25760 -59490 -96359 120467 -298169
10651 -126520 -364601 59518 -73970 -304761 60097 -283863 178784 28604 -74274 53209 139553
10640 139553 136236 -97739 -38223 -25926 205716 -24038 -276877 146795 -258317 82905 -132455
10628 -136758 -441711 -267388 -205473 -370510 -15306 81699 -318157 -31067 -295618 23884
10617 -78395 58756 -333262 143912 -119310 69925 -53201 -121299 -250113 102921 -2219 -229622
10606 -229622 68962 -3441 218752 -315939 -181493 -29242 -389081 -452705 -269644 60779 12066
10594 -243524 -175099 179371 -325158 -144440 -58468 171394 -79556 108836 195087 -167449
10583 307132 -189998 -178763 -277086 140219 67347 45059 56141 -167964 76848 82918 194142
10572 194142 169246 -140163 -16726 -350551 218367 -127323 -243580 -106202 -176108 -37768
10561 20521 -65491 205498 -30191 6000 -98269 149651 -17843 106374 -20854 251847 -72314
10549 87403 118399 41263 74349 -134786 -471823 -159037 -352005 33476 109152 -46312 60131
10537 -202284 -41510 103916 32282 -235418 -465912 26334 150940 -92284 -115005 81650 127831
10526 127831 -12391 237233 24946 48089 -45072 -215013 -78560 -175742 -83581 183073 -40790
10514 58080 84974 -27272 244405 187747 64253 -275510 -173153 -205122 -7318 -368969 3337
10502 -14161 146034 -61226 -362447 49724 107094 -22288 -60473 -235745 180495 283667 -223149
10490 145100 184265 48248 -18917 -95056 81161 498256 21820 86289 224394 619653 493870
10479 493870 679801 419480 66942 564251 78455 327950 30239 233697 72525 7050 -70794
10467 -75710 -292200 -44581 -261841 2209 -36597 -155362 25912 25469 46813 -95570 182268
10455 204099 103306 67795 176733 -95924 33006 45520 -128058 -131051 144854 -112914 -63447
10444 -63447 91570 -54181 -27170 -116695 -59845 -187866 140628 111447 -407594 231709 -134214
10432 182585 -116988 122462 -28114 -30781 -318930 -63332 -124250 130946 164914 204093 -186677
10420 54357 63074 21149 91783 234526 -205663 -193720 216893 401673 -52269 -66060 6047
10408 -98756 -213200 -155671 -46776 -128915 -126891 -78890 -22713 41262 109906 -273784 -166919
10397 -166919 -275649 -180470 93975 44768 46796 -99611 429542 -8991 260223 -392862 -32585
10385 222588 128617 179203 -33567 284771 195014 -54536 119578 139601 310913 129220 585807
10374 585807 307315 -673 133352 589604 405950 296718 408946 715968 475781 599407
10364 599407 316736 266035 254650 282562 59463 153619 206683 214126 142613 -40211 142561
10352 186643 434642 366871 559926 611188 597599 366269 672797 296006 436200 518450
10342 518450 489986 70484 353955 362573 192258 162872 246305 274418 320026 171253 51869
10330 208084 174792 530506 323448 -237229 -206077 231631 188156 281071 181920 368910
10320 368910 314388 106533 144767 -281066 184040 209612 171316 239854 -66994 -148702 -28524
10308 -404216 100353 -40567 173838 25669 140762 16586 59662 -150263 -108050 -3768 -237664
10297 -237664 -75419 238409 -67341 76177 181072 34434 -549023 106133 -402427 5741 22906
10286 22906 -383810 -50006 -108086 145155 -300384 -5924 94637 -76516 138173 -116843 45257
10274 -188397 -195028 1124 -48170 225302 394990 -123646 122893 -26866 -184670 89840 -79037
10262 12806 -148937 31055 116208 80634 238013 273691 561675 300713 -188550 266665
10251 333573 212013 -320098 -116495 -158840 183262 -140421 -124330 196173 116299 -187844
10240 77255 153759 -44784 288205 -129659 -118436 113846 21004 -120648 -92877 8023 43709
10229 43709 -197289 -92088 46447 -52672 84928 -193055 -314548 -300823 18906 -153005 -100606
10218 -100606 -241128 118958 -154118 -160092 -334911 -23042 8948 -44916 -272966 -283772 37063
10206 -68611 141496 286078 -193485 -91301 -133811 -175516 299290 -252154 -157908 -395007
10196 -395007 -404299 -411124 -237322 178677 176630 28288 -81119 103566 149301 122774 -153116
10184 -112471 -72777 85764 222445 -73991 -8015 112287 -145378 -264031 -12323 -59334 96517
10172 -221179 -14842 34976 -58624 -49378 249589 69581 -224471 -29885 155602 -237597 -196221
10161 -196221 374211 197767 116781 -314918 -214572 -49941 223051 -207443 206261 17705
10150 -18717 -54015 23809 -367778 -460703 10786 301843 -197453 91860 -241902 219894 -178457
10138 -352166 -279037 -474320 -153627 -30917 -376792 -129251 -128777 14290 -260611 50619 43999
10127 43999 -454626 -202553 -238983 -140517 -71057 5202 -195520 -81859 -134066 -318534 121201
10115 -180868 -379784 68917 72662 144631 28140 -277637 313215 -94536 274744 84522 -173883
10103 166404 69640 291896 -92872 19862 -11133 111265 -268209 147009 -84831 -166958 209873
10091 -52776 -352764 333 -33125 -230486 -19918 8804 -121847 -206330 364005 -80472 -125587
10080 -125587 64799 -89710 -651 136862 -18316 16702 -214219 -13849 -49301 13975 -277881
10068 -556423 36058 -59363 44830 -103779 -208797 3320 300621 -220781 -153573 -125881 -428898
10057 -428898 -4060 -59539 -277320 -63472 -330189 -8621 -82228 -50412 -33366 -118397 73766
10045 -145442 -164854 153464 198880 112531 -51712 253180 -296006 -28955 53641 82219 -25531
10033 -178655 128106 -72293 -64910 -215031 59967 126702 221090 25623 -63140 -137423 -43352
10021 -116883 -313958 -59438 239913 134087 -209479 -146325 -35121 -289162 211871 -67996
10010 -134962 -241257 -278922 -141117 -274800 -101276 9168 -24837 66209 -228343 -43583 -141985
9999 -141985 6645 -81363 -140000 144279 149917 -347271 164314 11094 347654 -3680 -221510
9988 -221510 -192810 -263709 156557 -34293 -175988 -118522 226617 101212 -175778 17161 -239323
9976 -161271 -11877 -476705 -37014 115038 -262094 46996 177844 -312400 -64389 199744
9965 155623 -94915 -335210 -40568 -199254 -27893 -181136 -74019 -210170 -329369 -43374 42626
9953 -74005 -292668 -272332 253865 -249621 -361476 -94167 -150726 -608864 -373888 -98967 2212
9941 -330113 -58332 -296594 -438023 -237224 -111652 64961 55002 -200327 188504 -78801 -106774
9930 -106774 -80480 -145540 -25437 -77022 93764 36755 -248087 -78914 -45106 -13752 68208
9918 -69108 20436 -536660 -240543 19754 353920 49342 -64500 -123573 54186 -78786 -42305
9907 -42305 -48774 -64884 -418043 69183 29295 53406 -73742 21652 -210935 -118621 -243489
9896 -243489 -34398 30531 13292 9171 -120822 35166 -176966 -127994 31514 -66353 -43784
9885 -43784 209563 98367 -158718 -209198 76080 -180969 -113306 55080 62988 -18844 -349010
9874 -349010 -304459 100568 10473 -50906 68003 94355 -3146 -318678 -82301 -193385 -147573
9863 -147573 -445420 207328 158502 -77450 -130692 -209485 -12211 -135503 -132683 144067 425888
9852 425888 -81679 -536816 -75993 -165595 -213059 -167630 99181 -172935 -61490 -167608 -193870
9841 -193870 151313 474289 -257960 -27790 318317 213399 -152852 -150446 -236643 207554
9830 95189 -126465 -374811 -147889 -204133 -163717 186918 -9245 408 -37731 -136901 -143013 79898
9817 -95609 -64316 -404408 -261160 9305 115910 148131 8945 23308 -123922 -235742 -500108
9806 -500108 -75808 81412 191106 -40149 -70366 59144 -87142 54748 -69971 -208348 -10134
9794 -58704 -218568 139614 -211895 -149109 -245212 -124716 194588 -206117 -162655 -69259 -205528
9783 -205528 -41075 -72359 33946 386867 -57501 -184933 159209 379592 -79428 -335640 28770
9771 103148 -19324 -73179 142604 124249 -66148 201843 -198317 -282538 373247 -101369 96731
9759 -190432 25614 119297 69171 11519 -178577 -159284 -254034 -147554 74946 -239011 137381
9747 -190830 -311378 332960 -214222 40002 -78038 5415 -162631 -41143 -264836 -500213 -27042
9735 -103415 279875 -151538 -197083 -235972 96711 -126557 32343 215651 -229432 159197
9724 218385 -162724 9204 3498 -120798 -96029 -122941 -254723 -281574 -146276 138169 -209797
9712 257970 -249110 -188980 -84964 -10510 90851 190860 -58793 -104576 276389 -197769 -448748
9701 -448748 -31218 214546 387916 -177168 56691 -93963 -23135 -83504 4108 -113897 -61474
9690 -61474 91071 226356 197076 -133109 -214510 -378800 293969 -57429 84869 -161328 -37159
9678 75184 -97790 -69813 82568 -33786 96432 -67782 77581 -13837 -55449 -234550 -349856
9667 -349856 -153503 -189585 -212267 -100581 -312554 214450 162095 -112826 -120636 8361 -11446
9655 -139669 45335 -83751 -71257 -197962 189540 -473110 81591 -219265 -154811 -38480 48793
9643 -226904 190685 135925 228837 -42578 145142 -195140 -113817 -365338 192903 -280033
9632 -98894 -75593 155058 -186815 13006 -183582 136337 68563 -107937 -33108 97555 90762
9621 90762 -146829 91645 80918 176073 -109762 -238819 -380665 33707 11875 148850 106097
9610 106097 145144 181145 -407259 -283850 -197911 300192 -243089 -399195 -59015 -78584 -267740
9599 -267740 127960 -236216 -9581 149923 -115936 -213409 -413855 -51748 82096 204353 -7063
9587 -288897 -163368 95407 -305698 -46725 -54063 -158213 -62186 -335225 35161 -403358 52495
9575 103425 22916 -106586 141039 -8593 -81263 -51679 288388 176886 -108286 -139156 138922
9563 -180655 58635 -37688 -191847 -288690 25809 -146622 94805 -80914 -125087 13052 -214865
9551 180456 46878 120023 -141521 -454144 3131 105220 237261 -197642 -92692 2902 -362438
9539 -36919 -101325 -73203 -132225 -368041 -35613 -185623 -95624 -95087 183493 -393856 -106486
9527 -30984 220701 -259700 238300 -99293 233412 -381204 126840 294148 -330362 21201
9516 -226470 -291482 141645 3403 62671 175451 -147813 11518 113098 -106032 25186 -72315
9504 36854 -136698 6197 -219277 53672 -66086 -10675 78202 193271 129284 -145807 -330498
9493 -330498 21991 48250 -137425 -17244 130982 23597 168143 175923 -190053 -417590 84748
9481 -458881 -204689 -8042 48328 137961 -6168 26299 71734 121108 -135975 -263348 -103678
9469 -111798 -54812 -104814 -197578 -65933 -296810 -297535 -82120 -208256 -66452 -125883 -119791 47792
9456 -145030 -258325 -144769 20668 128398 197067 323818 -211408 -298733 46656 20889 -288878
9444 -87107 -307596 32328 -176525 -122624 -159565 126300 -90694 -26545 90083 -123665 111569
9432 -140857 8430 61241 307666 -89076 -138614 -138419 -11257 -329 128307 -32945 184338 204520
9420 204520 -100293 -142539 -110894 -158790 -140695 -83541 -151097 -156267 -29558 -42299 -3113 181364
9407 -319818 -23873 -86543 -97762 -322227 -13370 153591 -42945 -219982 -260887 290683 -173629
9395 25059 -192555 43270 77626 -124640 4593 247935 -362321 -35353 -133561 -143021 -434723
9384 -434723 -15659 -156149 63675 55483 -109227 -117584 -306456 -102335 119403 -77375 -202049
9373 -202049 47820 4879 -217036 -129255 46502 63267 -188279 -87830 -159013 -186876 -128167
9362 -128167 -146567 -149904 -234455 -67855 105587 -258147 -81187 -366936 121525 -69531 -91336
9351 -91336 -82127 -267470 -231741 92531 -91791 -63289 -251922 19123 21993 -178385 -39758 -163211
9339 -163211 -119515 20162 22475 125226 -11121 -191641 -139556 -327801 -162567 -270419 -68137
9327 -51301 -215069 -157909 152624 -333252 -124279 -275339 7727 108525 59611 -8376 82082
9315 -173518 -176900 153859 -136752 -109278 -83070 -22837 20468 -29035 -98370 -142449 -52691
9303 77623 -162950 27920 62513 -180691 -17316 -228103 110476 9809 -140986 173212 -479595
9291 -267609 -73868 99011 -132071 -260029 -15482 -249634 -295714 -18510 137803 34740 180057
9280 180057 -313522 -95543 -159020 284581 71845 236564 13200 -224883 -332238 156785
9269 -123773 17823 -242211 -412416 -99282 -19879 14333 243808 13390 421111 175304 -23344
9257 7096 -68380 134381 36575 -24935 -483496 142021 26269 81713 107787 -70986 163261
9245 -275187 79980 -185664 172147 -119178 -162974 250408 130652 86926 39220 202852
9235 202852 260399 -163487 31812 -131006 174863 185904 195307 104226 -110971 231334 28644
9223 -363911 -111444 -22594 -58653 100449 -84766 11463 86255 302932 96695 -315667 -12302
9211 -283897 102365 -186209 -35863 222316 -468551 -114537 -133606 246188 -500107 -252537
9201 -252537 28777 -36347 -182220 58180 114185 -347563 118631 -332398 -32384 17799 -44648
9189 432227 -78041 -99582 -154958 176476 -18437 -213434 -207799 120394 -22361 -113079 -80007
9178 -80007 -63851 -61390 -565861 347604 69151 -164965 210704 -111150 145644 -301226 -67807
9166 -130931 176002 257739 -115706 -89750 -6022 -133113 87803 -60054 209867 -354129 144163
9154 138052 115551 -110594 104665 -127163 -138149 -200924 -254268 -268641 -274031 -184405 -22642
9142 -58351 -251704 -204673 77370 -177110 -32787 -227747 -36341 -113954 -202097 -249585 -127511
9131 -127511 -119999 62768 -320814 185 -97812 -305789 -186309 -21988 169134 -115232 -60303
9120 -60303 188504 -62655 -224862 -169830 -302142 298016 -54261 -331303 64967 57260 -96002
9108 -15379 -149130 -110202 -77579 -125307 -145655 233551 -330734 -78340 -66016 -90060 -234342
9097 -234342 -3439 67014 -159333 -92704 140482 213685 68265 -51989 -109477 -48675 -564361
9086 -564361 -198769 -154008 -2776 102964 112233 -198935 32434 52600 -60172 96748 -193569
9074 -130377 -297268 -91345 -60382 -201409 17896 -182316 -249951 110727 -62508 95272 -118397
9062 -59734 -146645 -57280 -376682 -64205 261116 -172090 -205359 -55113 -117660 -58021 4254
9050 305428 -118345 -126018 1032 -103375 17146 -82600 -133487 -96917 147642 -328863 -149472
9038 -204363 -187627 -267824 17308 -211452 218707 -209403 41476 173278 52703 -376113 -134896
9026 -145074 183597 -208578 -69555 213513 -47139 207394 -25921 59953 31583 -56876 188338
9014 -40546 -26256 -174288 -69988 232431 -162506 -42525 -186877 -363413 -162990 -49171 192910
9002 -3762 351743 28137 -188318 -127023 -269586 89306 177534 -290514 -159176 -38690 -143375
8991 -143375 73360 -184690 -31329 20910 3296 326808 -277345 -390027 -241063 -238697 -146038
8980 -146038 -144091 86450 -66260 -483602 59874 80211 -46737 -181013 -172415 184549 -163171
8968 -190995 -119220 -55347 -38924 -168457 116091 248062 -149564 -27700 216349 -1887 137513
8956 18823 -16536 -239886 6816 -102631 255692 -219016 -137383 4897 -10670 -133709 -152213
8945 -152213 -253439 -301112 -315626 -103695 30863 -180538 45443 -130497 -213674 74225 -65119
8933 85306 -143989 65464 -71785 -71878 -85295 -230219 -4030 39083 107783 161807 794948 2748721
8921 2748721 8681648 1878754 751490 199770 143102 353230 238092 -52634 -38761 266559
8910 178642 -42708 -10164 139811 31645 -79647 82935 117961 -240215 349781 217928 53230
8898 95582 -338610 -137379 -171075 -112723 204735 -238175 -53175 -214549 91499 105426 75321
8887 75321 -152633 397014 -219137 38536 -402757 73561 99468 -36391 -250665 122197 -306373
8875 226826 -171548 319880 41972 115024 -179475 39368 -43717 43578 347837 -143711 -12968
8863 -162847 173060 38573 -42182 75541 -166471 -44259 194297 -36407 99835 -29204 -206680
8852 -206680 -102573 -117857 -67494 83455 16333 -48860 278543 42154 -43636 -127363 200528
8840 175764 -214608 -403076 -246054 -106170 3583 -216231 110439 -121279 -107440 -26930
8829 -131905 -215553 24575 -442860 -42996 -94534 -217927 -98882 -21252 -114874 90353 -376535
8817 98568 -24078 220371 -89606 109159 -43434 -86831 -132718 196077 31321 -171679 -162752
8806 -162752 -171626 -133257 -62860 -234786 -178160 -33330 -73688 167361 112651 183437 99373
8795 99373 113396 -19248 -253620 111194 48089 131442 113263 -162289 -22452 71364 -4030
8783 290250 200289 -7909 44266 -399398 -78983 81809 -90948 -287060 -34503 241790 -334930
8771 -120396 162232 -548637 -107007 -46539 -80069 52560 -26065 -280947 133825 -168321
8760 -276720 -170716 -160739 -363349 -347746 -17409 -162474 -146976 5343 -99138 -57978 -335641
8749 -335641 -6130 -66028 202469 -10506 218262 41414 -80818 12876 -428775 -33936 146793
8737 -198866 -133997 -305337 -352090 207556 -204109 -158372 -225956 -372624 -101672 24977 -374300
8725 141654 -40234 -204150 -193612 -79351 -28082 -1696 57892 -80184 -150770 -210035 399121
8713 -201081 -276508 -368305 4268 127442 -154295 -97590 -141814 70311 -118043 210948 212529
8702 212529 117889 36309 -7798 125125 82823 15973 -188782 -136513 -57784 -16857 92796
8690 -181739 146912 -20451 188148 24790 -154259 117956 -68713 -146329 -83567 -88678 96690
8678 -151334 -154480 95568 -219498 10043 -72949 268217 23179 292764 23930 -122743 -277395
8667 -277395 -109342 -185599 164348 -127171 -28214 -128616 -226871 -280897 -16727 -61895 37570
8655 -69127 -15474 -276642 -85007 -112818 12519 41156 -15911 -141125 -156337 23711 -189617
8643 -247784 169800 -48961 118584 -171607 -77731 -96261 151787 8270 203783 196395 -446
8631 3753 177923 47610 -175218 -21891 -408449 165114 -56153 -91179 -151130 -377059 213808
8619 -171743 59127 -249599 -115493 85634 -325436 390 -5758 -90313 250935 -111334 -13277
8607 185550 -137609 49991 -63489 102718 -341026 156694 -268097 -182086 -122373 -36581 218586
8595 -124918 381571 -106393 -214512 -146802 -2700 48736 -114249 -252276 229898 -183527
8584 -412591 -16329 -66956 24639 -148571 173995 -35551 -231465 213871 -225974 234621
8573 -196905 303532 -187406 -177706 -45182 -75230 208139 -425376 -90311 -131434 -178541 16042
8561 -184299 27012 -168222 105476 209457 36400 79252 -62314 -63520 11377 127221 -95404
8549 144913 224283 -193139 -359939 -88257 -23112 -49775 -164832 -42341 -59717 -25095 -83616
8538 -83616 39766 194467 11871 -103972 -83816 -214797 373349 -430709 -161084 94793 -94554
8526 -183149 342945 114679 -37410 -247683 118960 -60227 -128645 -13814 -172910 -459628
8516 -459628 -93294 -167973 117531 35847 -172025 -196737 -187218 -37352 -226293 -97100 36572
8504 72792 -287154 -71764 174901 -98332 -279031 208320 -84326 28992 -72290 -304842 -62930
8492 -133831 -347707 -299580 -281741 -218402 -98637 23683 10909 -45854 -206787 18311 204415
8481 204415 206662 -73080 42966 -18516 68313 -129717 -264575 -54433 94029 -68377 37856
8469 172750 -46935 -210110 41033 55534 -111426 -423091 -224806 -366319 62410 142905 16162
8457 -220 139668 -128593 -231511 -106406 178311 -251653 -243865 -41925 -174493 -107076 200752
8445 44540 -379055 -14707 -104792 125829 -463595 67714 -233508 -192712 156145 219259 -222529
8433 -2792 -97640 100577 28368 -56948 -91999 145275 -228713 -101004 -10942 55918 110903
8422 110903 -3073 -148517 58557 53653 -172234 -35540 -362618 -149936 -179747 -298334 -61564
8410 181346 -366445 95231 -115103 86334 223138 -136690 49177 -35663 91959 -237866 212545
8398 -146034 -2953 -133533 212437 -61300 20675 460 12332 -87399 206864 125718 -215806
8386 192174 29648 -185693 407120 -278348 -133454 10835 -235753 -60813 -267629 -132569
8375 1085 118269 47870 -80036 218122 -102935 -236716 -20678 52406 -60935 50887 302825
8364 302825 -167795 -441123 115562 131112 -78457 -131349 224900 -65978 14751 -113235 60515
8352 -13305 103746 30046 20401 -107570 -151016 120278 123866 85651 -168153 -276078 -81018
8340 -241016 287226 -146467 114463 247265 -110097 -12050 64465 264547 246549 -169205
8329 27779 -128498 -97543 62934 76621 147135 -210867 -71555 -110292 181232 -69037 -109642
8318 -109642 18973 -230450 -69432 129758 -324029 -19813 146261 -130375 -232580 10735
8307 -331278 21471 14348 113376 7728 -387674 157441 -63552 157190 -174872 -36983 -343081
8296 -343081 -412540 -122072 -164761 -131147 -216798 -402934 -238271 -224016 -91551 -89778 -22009
8284 -146078 -73590 78563 73132 -119962 -168083 -118864 89358 187366 140643 348948 -261086
8272 -190055 -296783 -229692 -195296 -183189 -123331 388372 307715 -216007 -104712 229137 -187244
8260 -220676 -161894 146652 -200069 -124056 70604 -129851 -10478 -264701 -58426 -194764 -107504
8249 -107504 61482 -86207 -191241 -161952 -241537 -173833 -24145 -3842 108327 -209897 -292460
8238 -292460 150888 27137 -103239 -52734 -464691 -75402 -945 -63607 52780 83108 54996
8227 54996 -115547 27871 -14319 -90779 32564 381947 141278 -151575 95037 -141522 100591
8215 -85175 111576 145708 -319770 -183525 126598 -222971 46964 -85150 76687 -128431 -194943
8204 -194943 -122197 32981 -268729 -142277 -84004 -201313 -147321 -5344 -141901 -68134 -85847
8193 -85847 2281 246073 -132413 36336 151639 29995 66499 6474 -9451 56327 -74963 -460123
8181 -460123 252276 -112233 -16940 10910 -25369 249403 79004 -35820 49234 79734 130545
8170 130545 111820 16888 -115317 -354621 -107939 103034 22203 28441 -137460 -196357 -198267
8159 -198267 -30632 -85563 -194308 -259523 -65698 16230 -143112 133475 296118 -45930 -60478
8148 -60478 -191207 58434 31044 33549 -129835 -53187 -57726 -130828 141929 -86691 -312389
8137 -312389 -4947 76243 -274782 -147685 -121282 28745 -80922 50381 -21093 214171 -139786
8125 -287297 16285 -32113 -150041 119418 -140709 -166546 342303 59748 -60997 240249 48383
8113 -196675 43579 -76470 -301144 143150 -146589 270357 -3912 73751 -225670 -173065 40674
8101 -262648 -287778 38931 -68446 350857 -108017 264312 -46795 -156719 -180446 -14135 -169803
8090 -169803 65669 117652 263816 -138878 -3608 -11705 78673 -169740 39335 54680 37232
8079 37232 -31335 112256 122918 77845 7766 -258474 -146007 -114764 -278236 53343 -237221
8067 45374 -113223 411950 192090 25524 265148 -157653 42331 -168764 86477 353848
8057 353848 -129638 -244574 -203705 148628 -89700 11065 104493 122640 20482 133178 -286658
8045 190210 -121718 -209753 -233457 -203576 99351 -191579 -125772 -105159 123224 194621 88538
8033 85026 -58108 -1146 142364 -44536 -224494 62857 -285740 -107287 64697 -127956 -27306
8021 -251896 -3399 -302472 -193614 78994 134174 -168813 40480 -114418 47000 71267 -140032
8009 -155385 -247126 121418 -187226 303798 139980 -325021 84414 -4690 -301578 -108218
7998 -30910 270058 179300 264561 -55001 114312 -124894 -281005 -292337 -100740 24471 76312
7987 76312 20665 -161408 -86395 -97105 66482 92588 -118243 -44088 32975 567 71985 72595
7975 72595 -98228 102761 58761 23932 -96123 -20797 -35907 -394616 64200 -73820 -164766
7964 -164766 -81430 -211484 97056 -216783 -89311 192892 116181 1961 86394 34902 -105016
7952 -95023 -120766 -155899 -36881 65631 -210473 104544 213848 131587 -248883 -125057 115677
7940 -246065 3159 157577 198096 41782 -121964 28391 108190 209862 -240415 -59610 -132475
7929 -132475 61662 5864 -19730 -281886 -18772 -22813 -162182 -288773 -168726 3042 -117821
7917 4188 162680 -6528 185809 100370 173955 -125699 -45705 -108459 -104555 -269194 -213520 -230009
7905 -230009 -116798 178994 -73144 -124859 -128496 -168988 -234779 173426 93995 -225043 55044
7893 -79217 -164070 -287062 185077 -208765 -173022 299120 -109134 96533 -335742 -273040 137903
7881 -95109 -49307 -34932 -437138 117131 -30807 -133139 -55032 86061 -8056 257984 -261497
7869 -169964 194772 121762 88268 132390 -86704 -149307 -240329 -213094 -256584 -160212 -179433
7858 -179433 -2786 6208 -304285 6772 -355204 -356628 -81185 26010 141433 -376638 -102072
7846 97505 66184 303505 76648 -258263 -65070 -127214 -55857 213335 216185 -61883 -29266
7834 173521 -79985 -118830 -107862 -66511 -106414 386429 -253025 193743 -112361 -118138 59870
7822 89302 -31746 -123963 131644 -233753 -10796 43965 -28125 -136329 118867 -120995 1413
7810 -36797 -220478 -36569 -314575 -137757 -356647 -29414 -205521 149049 124470 -269120
7799 143950 104872 -112017 -205870 -147599 353870 49313 165017 -155527 -62945 328673 -274978
7787 -327887 -150325 159802 83889 -197938 -313927 114156 64508 3465 -229156 85792 -126380
7775 -64932 -16421 -242527 -285140 -79179 171509 -6288 -219025 -165759 -136252 45102 -22345
7763 69723 -26059 -74586 -196008 48470 156011 -194398 306079 -62105 132474 -41233 55187
7751 -93150 -127706 -136804 -204497 -116647 93509 -118838 -218575 -4827 26039 -52277 -199131 -189575
7739 -189575 -120712 -161502 179418 -149038 -352639 -242873 65123 -42898 -93592 42407 -275064
7727 12370 261969 329148 -52208 3695 -110406 -165192 -55954 212503 63232 187345 108652
7716 108652 -377685 -356260 -189532 88844 83010 128753 -2433 33200 -229500 180970 -273349
7704 -10627 -21149 49721 -157350 -111253 -7078 60454 -7954 135050 -9845 45041 -154743 -139942
7692 -139942 -178266 -84693 -166640 -43153 74469 106597 9332 113267 -104669 51421 81245
7681 81245 -518438 101238 6979 -42128 -237374 -45392 -820 312017 -249484 27096 -166734
7669 -151755 -4077 36748 -115176 -167232 -47738 -77092 -79589 -241977 127975 -137251 64315
7657 62414 55177 197069 -56985 -250618 -175653 -74633 91114 -115715 326451 -144555 37381
7645 -174255 43452 131443 3750 -208817 -172496 45069 -242546 170026 36499 -195227 247174
7633 -16861 93299 -233041 -92859 -260071 132990 14773 57483 -3231 -13046 -130825 100813
7621 -149445 -127931 50446 -24040 -6521 100451 202366 -159381 -50328 -136863 198465 -199382
7609 281677 -57431 41884 -57396 -123387 -89192 -154782 -80127 -14286 136598 -95980 -36197
7597 98160 -72250 -118846 -135369 -16255 -120647 48193 -106265 -397111 -156704 38641 -112042
7585 185039 -129913 -67887 -122489 -269148 -177633 107349 -66926 -162814 -214701 -340286 290702
7573 -151304 181366 281360 42538 34333 205134 -50458 -265367 45443 -73379 -27127 55576
7561 -241500 193308 -5443 -50418 78866 -40925 -140056 -299798 95494 178792 65183 90564
7550 90564 -192545 -15656 256918 105585 240209 126951 239919 -153307 -140392 -133309 -120562
7539 -120562 -155365 -106787 -26205 -144836 250012 -167175 -410102 -202659 -256531 -184105 -44309
7527 -83697 -35984 26985 -24133 -32620 -244953 -95171 -107837 -8850 -86657 -476426 -258408 28969
7514 -152713 -25438 111627 -131730 -110171 81504 -239469 250200 -199564 -81109 -26849 154316
7502 -15099 198394 86856 135780 -17432 87462 -250591 -332580 -150467 -225946 11428 -233906
7490 -306742 -296925 -38066 -936 -14651 -400980 -93087 -87477 -73261 17940 -131890 31351 40410
7478 40410 67181 180526 128956 -219331 38539 -120214 -61678 40040 -50803 273089 294626
7467 294626 -56033 50315 5964 89543 127206 -211373 -173710 -19635 3237 135086 57307 12169
7454 181446 -167775 314024 97802 107803 272698 7472 132303 -545832 -74687 -30368 -34414
7443 -34414 -275207 -206669 -237690 -115409 -218243 -347254 -70749 -130706 20554 56653 186262
7432 186262 145878 211293 232477 -90370 -33030 -15731 -102608 -36670 17098 -215821 -140928
7421 -140928 79284 -469418 -48058 -294557 -92251 190346 294896 -346331 -228104 73780
7410 102045 -131046 -220171 -67300 236937 66280 -37757 -37777 -121758 -324762 268990 -443133
7398 250477 -27196 -16280 -209691 -45949 30968 -161660 -3168 7310 -301898 -368976 181744
7386 46257 -95028 -159423 141224 -339606 -285292 -281202 62774 -18106 106868 14089 261004
7375 261004 -230086 -193808 -327600 -113552 12841 -186426 -468175 9870 68132 50011 -246307
7363 183915 -30199 277948 -28418 -116152 -339771 158064 69420 106077 -75529 5491 -68522
7351 181136 -275647 -145210 -2303 -29482 25739 -30118 -23592 128056 -59840 49431 -3146 162676
7338 111383 -2784 -178914 231750 21428 113686 48970 -20175 -163525 -218447 -240567 -193442
7327 -193442 -194717 214127 131350 -391580 103916 -101766 36832 -40115 -51682 -48456 -134971
7316 -134971 -378438 -22790 -118235 78879 66035 -24447 -98754 90192 -277386 265264 148028
7305 148028 75077 -215223 -114317 -175143 -226628 106967 31217 167360 -28181 -453051 322806
7293 -114308 -131903 298613 -164450 -267731 -134452 202274 -48579 10802 -73941 -104509 60610
7281 8880 -61910 88052 135829 -462210 -254924 393084 -149899 315193 12324 -149600 -38714
7269 -132146 85749 189755 -357231 -408225 -85251 -293542 86063 31110 152240 -184330 -24558
7257 162827 -251950 25491 112835 178702 230116 -497116 -307398 291834 -181667 -7958 -170369
7246 -170369 -228322 175440 -196767 -282539 -72971 -360440 199826 237738 70281 -192286 -546857
7235 -546857 -8320 19651 -170402 13511 241010 -292512 199495 286423 -74321 -44635 52068
7223 35504 269486 -53763 -50111 263690 48244 -31658 -49397 221983 65650 -80130 -107333
7212 -107333 143152 128037 -80846 327108 -211727 118482 240522 -170333 -299166 117043
7201 -254294 -142412 -27281 -253658 -142385 157988 148544 73665 -100558 265219 6530 -88763
7189 240891 6984 -154513 76987 85736 -119811 87542 -140496 114081 162757 -359650 25536
7177 10201 -316143 154590 -105147 -187915 -107914 15535 202586 -8148 -401481 -45584 364627
7165 51504 -132631 -106638 -95575 -96527 -214565 628 -118179 -1465 -98618 -300209 -215212 -244667
7153 -244667 -425679 -74875 187638 -212793 -33803 145945 99998 135078 27535 -149617 -18201
7141 -97494 245019 1247 -371831 40171 -295417 -282520 -183328 -168711 -35911 -241097 -145654
7130 -145654 -231373 57303 -314756 128602 -250982 -272467 -146966 -270064 -52882 14621 -44433
7118 36844 -41030 -55227 -101061 -10253 -91338 -6138 274955 273917 294888 232194 49292 -13935
7105 70627 -285163 102091 215725 -3067 -86634 -85141 -94454 331832 -59169 52860 12464 -128643
7092 -262779 -83233 -153997 92391 128153 -183838 111047 -51924 130326 69501 -188500 -310705
7081 -310705 30651 -209264 150987 196283 -188380 -210110 -71082 69993 -148525 22960 -225943
7069 37237 57523 -230553 23534 87092 230809 323208 -31000 157407 51017 -368426 48205
7057 214307 -201730 -74971 -372751 -51330 -58562 -165747 -155530 -209854 -195069 -37936 -8162
7045 304724 138160 -367284 352970 -110985 100485 8492 -33613 -244634 -94903 -311877
7035 -311877 -203391 -22584 101189 -25103 144926 207931 -128750 -61674 133882 -139734
7024 117155 156470 94050 -33093 -12354 14518 405786 -47462 -43395 94639 -17813 165742
7012 174402 -19822 135895 300900 -105862 133357 -260141 36333 42250 -264403 281983
7001 77204 192939 14539 -171790 77865 -369342 -104605 223638 -246786 215279 52558
6990 -194855 -113201 -36516 111891 292329 84438 1594 -108464 138177 -122689 431029 159310
6978 -99460 -8894 22046 91588 -95147 -63315 -241566 -82809 -273253 102130 -96470 -147775
6967 -147775 -11490 -174912 -40705 183619 -245043 -178742 172422 -9260 -61980 32954 -274782
6955 6341 -326716 262292 -138648 -24769 -180676 -125765 229127 -322274 -135111 160866
6944 -56863 -50787 -227669 14928 -263268 205293 147222 -98958 91851 -68941 172513 -69305
6932 -35826 190540 88692 65372 -280394 -110030 2671 -86986 160449 65355 134176 13150
6920 -402411 -17821 136066 -98834 -86464 -37518 -114460 220816 105969 -46159 36829 447741
6909 447741 111225 -50525 4459 92131 -288209 67698 11656 -254984 -25006 -189293 39253
6897 -150954 -19678 -26484 -110370 9439 28825 -55466 71137 -48969 121771 85263 -2879 -25455
6885 -25455 -15191 -17236 103817 -58872 28897 -104357 13379 -131911 -32839 -135588 -93959
6874 -93959 -251124 224687 150156 21295 129460 -140254 -9589 47869 -131154 -100943 213568
6862 -219775 282010 65236 65503 -72567 2229 -4397 75891 -324107 66248 104341 52686 54349
6850 54349 69132 10468 55291 -21173 -55865 359189 -35918 41454 -270470 232812 173857
6839 173857 -128916 -84144 -169280 113371 -95273 148084 -179300 104403 -19709 -254561
6829 -254561 -254812 -53243 -217919 -56040 -136739 278156 264236 -209795 -104501 -19877 -17043
6818 -17043 200046 -253223 -248144 248267 -2164 -11605 -75178 -186070 150703 -261523 -244301
6807 -244301 284736 -33449 -206643 123834 -37875 -14837 -245023 250643 157706 -44848 92031
6795 165764 316547 9957 -6226 -117613 -386399 -213517 -38052 -117228 -43580 36780 -154752
6783 -186194 -167932 122462 -210326 79200 -93108 162577 -166986 -92603 -2801 -152885 -291078
6772 -291078 -305522 -55396 110522 -200797 -217901 -311987 -157263 248604 -240017 -94014 -244614
6761 -244614 -173080 -101298 355932 187973 -178351 -62539 279855 91175 -151345 -19492 368957
6749 -188815 179008 -179470 204912 62420 -47494 -102242 19197 106454 -21194 45257 111029
6738 111029 85180 163031 200016 -133920 233905 21456 -160158 287194 -75458 -168441 -196422
6727 -196422 -17593 186607 358187 3420 381497 -221075 465448 74924 -339988 73802 427711
6716 427711 28489 168183 68924 -31311 -196395 72701 -157671 8851 89034 32489 -183109
6704 -179140 181285 121381 72411 -211803 -221319 34006 -148364 -64513 -222147 -27710 -260283
6693 -260283 -14366 -171310 55071 149820 -351864 -180510 343891 18534 -164047 156148
6682 -144797 129491 -251452 47907 -190863 -450428 55111 61869 -8090 -140410 127018 114488
6671 114488 -216057 8586 -189060 95995 -162603 -164345 -288615 -199610 -116236 29975 122237
6660 122237 232012 10765 25490 -437157 176963 78727 103817 -193986 -129496 -116371 -80178
6649 -80178 -139226 -19091 -184588 17464 -33521 238355 74762 185406 -216767 -392561 146229
6637 -55104 224945 328656 32454 68581 -236818 -69178 160135 128572 187270 -134600 -37689
6625 -190086 69851 -460896 27910 5321 -81202 -195384 73372 -130367 -45699 -89741 194843
6613 35956 141364 -132470 -232989 -34192 -163485 95363 -262647 -366343 258791 -205510
6602 120148 -187089 -115986 205138 -159390 126983 147334 160365 238684 -40887 -43650 117028
6590 -21689 397073 -98295 69832 -34913 -26684 -10050 38400 286191 -90389 66188 296529
6579 296529 -234815 150608 -29471 61059 -116000 13128 -97835 -57444 196283 178108 -333468
6567 2469 7158 -42986 11965 -95309 48276 -71743 -180105 -57171 -74075 -4865 -217204 97627
6554 -61560 -17940 -68463 -26561 274120 -85703 131037 -70929 15970 199290 -110390 45565
6542 -45080 -250530 196183 139305 -117988 -155217 15360 116635 -90764 -234816 -16599 -45376
6531 -45376 -205359 -413391 1789 119783 36042 264607 415122 124457 -17805 362858 -156315
6519 -78758 -126398 134840 -75219 46750 -106128 6275 -195638 -113404 -15696 147796 -124249
6507 -163661 186706 -48767 -98765 208585 161179 -272711 10799 177051 57908 -34053 158159
6495 232838 151891 -333555 117732 -146828 683 -128702 197958 127020 -147348 -87083 49076
6483 36158 -74473 -227111 204506 -51475 -255056 24048 162880 407338 -47995 -210552 -67980
6471 229827 -68195 63224 -133757 185515 170471 -181204 -3557 191268 -120286 -232646 -137429
6460 -137429 114421 -241256 168142 -137626 16184 -335170 -450900 -110640 225961 -12893
6449 -187692 -188642 2255 26531 184387 -71808 -169395 2136 -304939 374691 -7953 40045 21463
6437 21463 52339 -26362 10432 14502 251748 -260543 -382069 27841 -432272 -282129 251087
6425 -342739 67600 270970 -80083 -71592 -168773 -179871 38977 -141138 184426 37271 180202
6414 180202 158182 140776 -86061 95368 377666 -129821 -42199 70968 202865 -16317 -60525
6403 -60525 -178280 -223531 -33680 352284 -108761 -190715 73108 -467526 164595 -215973 -378483
6392 -378483 49036 62132 143128 -18758 217565 130274 -290401 85569 128718 -211383 163511
6380 46646 -366872 -51869 -97342 -116530 -150346 -234990 206208 -112026 -289223 -264569 135536
6368 170136 -114125 -407633 94333 161826 -139699 179577 76690 -448499 -149480 -108592
6358 -108592 -259384 117879 -43251 -74142 -62953 -99848 -116064 189185 -133873 -135855 -46636
6346 7406 -146935 166396 -155850 282518 -183562 131680 107593 58435 254922 149700
6336 149700 -85409 -117720 31122 -64258 -28439 -88159 -106688 44477 39186 118309 -89371 -63888
6324 -63888 -50160 -2547 104152 294446 113282 198469 333529 -24704 -61078 8572 -1503 39107
6311 -228486 164889 176709 -125964 17125 42465 52173 -156522 144637 -285507 -44974 345105
6299 -54231 -140609 600 -48984 206492 -130356 -211236 -485323 187497 -331203 29787 164226
6288 164226 190821 -89361 -27164 341768 -420997 -163829 139608 16952 -257042 -312154 157998
6276 50955 47817 -226236 -145369 -30436 -44152 -50272 245654 -432816 -599118 -315382 -220448
6265 -220448 -17950 -158064 102807 186387 69714 -32683 -41096 -97471 209032 -22266 10991
6253 -117988 -75708 -83913 128841 -68880 -226419 -68224 287690 -28545 250449 -130503 -60899
6241 202298 110795 -335704 143819 3250 10603 -360144 -24184 260429 -216163 216941 153540
6230 153540 -132954 24490 117267 486091 40938 -74581 -31765 337557 130366 16285 -34946
6218 -87680 262247 -66590 -6661 97540 179 239700 -131333 78406 63438 132494 212501 -114922
6205 -163794 13694 -217882 -260907 16118 195477 19011 -154265 -276997 -79131 -973 -752 60936
6192 -135392 -102931 166858 34349 -286210 48308 50477 204884 -90631 30887 -244819 281346
6180 -71310 -439326 -31416 -13595 -161979 -270735 -60305 -131679 25847 103160 -28821 -109142
6169 -109142 292186 50399 208598 -261885 -12886 368003 56412 -190791 -197923 -65294 -50055
6158 -50055 45939 -135516 -12516 109987 -50975 88254 -75456 42870 -118979 -176207 -192773
6147 -192773 -125131 -108865 -83998 -120337 96578 112057 1926 9350 138678 145922 53552 -232208
6134 40185 -232138 -199828 -126277 48629 148367 302751 127107 -98359 13016 204381 -181194
6122 -55470 12478 112357 34262 51851 -141765 -95450 28523 -79378 -220451 44827 31469
6111 31469 143296 -248047 89188 40230 402016 -252547 165183 274464 -93454 123901
6100 67416 -28256 100056 68976 257712 156375 55305 -76581 -180573 -8009 77305 -117586
6088 -236058 -133606 -35149 211397 -292266 -68024 -593775 350185 90266 -361789 197930
6077 102268 230308 5600 -52772 24505 156116 49816 112005 -138320 -96018 -118054 -260953
6066 -260953 -17706 -70948 154151 -6911 19901 31349 169954 -9208 275444 -181591 -17448
6054 -240504 67877 126580 -128828 124459 51066 -129417 131088 22749 -100734 116488
6043 -234512 71188 56179 22514 -80228 -23999 224593 -244723 -184381 -51724 -33056 -155182
6032 -155182 -81477 334780 -132530 127204 28177 185202 -173889 170392 -262621 -17150
6021 -46510 -442463 15073 -121909 -88172 2015 -226794 83247 46208 45557 18396 -26689 -179163
6009 -179163 -233794 -75836 150528 -78436 -3960 -173846 117056 -3386 -10087 -258991 -154412
5998 -154412 -164943 31686 77287 115923 -211371 211383 -149487 78780 -109254 -307626 -100606
5986 -58885 -8971 60931 12108 69265 75408 138578 -123770 -74608 319756 284125 -120304 -287620
5974 -287620 -130908 -343528 101284 -18464 99675 184805 223009 -254931 -128475 -109563 -41909
5962 -103214 -92191 -367969 291297 31649 -336825 -153385 207341 -230999 238521 -264355
5951 194458 -72170 -97675 169674 78936 -8162 188496 200681 -88319 -26532 -168784 -76478
5939 5572 100902 143743 88448 -60872 50694 64192 399901 129586 179720 -181683 -46264
5927 274927 -12782 34352 149462 -83336 -269272 245199 120259 128560 27565 187583 -206066
5915 -160266 -75282 296912 -150590 -102120 148316 336479 60250 -378668 -210388 -216851 72251
5903 -8748 180449 5804 -171641 -41910 -106630 -27184 -77327 -33610 -87952 -184706 -89173 -383626
5891 -383626 -112311 18158 -158750 341966 -268120 -183977 69685 12446 266321 -117864
5880 -203725 64605 159118 -18143 29662 15614 117488 -240306 -165228 -109677 -160986 -409791
5869 -409791 -164664 271394 -148960 318561 -21456 -168657 279326 -43842 28370 240106
5859 240106 -317698 -113296 -231107 -111294 -319513 -147896 -195484 67639 70890 -333880
5848 -103325 -520 -105938 142164 93142 -101827 117531 53534 -138317 58054 158117 226068
5837 226068 -205728 -235704 -68815 27936 156270 74428 -93945 165019 49378 15581 -24992
5825 -23904 -162873 126683 -50398 89210 -106116 -100101 -19180 9241 154682 -85864 -281440
5814 -281440 412732 -65913 252960 -250302 -146579 -226719 -467113 34571 -153138 230843
5803 -151376 79469 173268 257765 59716 5355 58018 -48355 30487 109053 78419 -40152 -208796
5791 -208796 -235740 -145929 122516 103645 -223187 -25984 300471 202826 -192243 135534 -26871
5779 124400 -306007 510361 97102 -206726 -160327 -298263 122732 -180752 22030 -113105
5768 139267 162188 17757 -53449 20130 -200659 -109591 -17031 -181025 -313803 2232 171732
5757 171732 -163565 306160 -124036 8579 56688 -98491 195008 -29723 237246 265057 134033
5746 134033 -361649 195533 163313 216200 19085 15079 115259 146872 101425 162916 -72882
5734 492555 -167417 -123003 -76966 -46338 -237960 331413 137272 -51632 -74890 107936 -120440
5722 -1106 -40139 143269 157751 -146904 127160 -23665 159999 22575 195803 -163573 273086
5710 -35848 116127 -64904 20007 50746 267244 247966 192990 40816 226677 -268360 225260
5698 43461 -64620 -137912 -51961 31271 -47720 -206126 -82982 -84279 101392 78076 56098 177118
5686 177118 61663 34556 247539 93687 96959 -323130 -126761 117615 -195139 151992 -331946
5674 100473 110333 -127417 14219 -377308 206533 252923 -90873 -247734 -169704 -89283 99617
5662 125712 -210588 -168032 -111725 -296698 -32738 -106459 34315 -125379 13011 338064 -6958
5650 -268227 32566 -13929 53171 102089 -109500 94529 -167868 119878 18861 17967 48759
5639 48759 -110793 197053 -337539 -211760 -158406 60525 -7938 64542 5748 -168034 91689
5627 -115078 -49435 -53304 -17658 177335 -233346 -166492 165553 -81766 -13009 -12309 -377470
5616 -377470 220796 54380 -6995 269082 -196430 171621 -149782 126291 148489 202987 131866
5605 131866 -226537 -161248 360164 46577 -10952 -198324 157118 152342 86934 -52458 166327
5593 359863 123225 -171717 115616 346610 -92630 123265 -182708 174753 48878 -78687
5582 61352 -146682 -52665 130513 116627 -47902 -162490 111870 -13680 113323 -38088 33997
5570 61460 -74724 154409 107913 69033 -132988 26093 149790 -142055 257481 70784 34866
5558 -189720 -27655 -65125 327466 -153202 -174157 152183 82274 14145 83083 24254 -80395
5546 -330463 155042 -349792 437013 -150623 41305 145073 182297 92786 -43548 -116012 -58875
5535 -58875 106800 28316 99881 -138815 135248 -35442 99413 -278955 -97922 562208 -58364
5523 160566 -254128 182439 109883 33660 107119 -24806 -67357 -16009 -77765 -329882 -100787
5511 -32837 -38569 -80030 106297 62953 -170768 -74756 74440 -110990 -177327 -323105 94719
5499 -162703 -31344 75654 180350 54811 -106800 92808 160848 114079 278584 -158340 -38764
5487 -109431 210764 -284698 -349548 338326 -164164 333345 77701 -44963 178630 43680
5476 -54609 95768 181668 180402 -15559 325996 -178218 331744 115746 -6062 -99239 -69623
5465 -69623 -253923 9373 -275335 -19257 -56963 46627 -366862 99828 -90341 -181558 170590
5453 276117 42784 106641 91505 231917 -113545 256356 -256312 69311 102461 -64249 12389
5441 4629 -59141 133776 123732 41284 167747 -201792 4747 -49706 290712 141187 -326714
5429 -47370 -175605 -194197 -4628 -61756 30023 309528 -191619 127000 -354415 72126 54122
5418 54122 -79610 145252 -172611 176126 92043 -138730 111540 182874 -141278 200096
5407 -247939 -34826 163681 -65344 360177 -133071 -87472 -169291 -179736 -267681 84848 14672
5395 87712 -54784 46261 -32384 227498 131543 -68143 -188313 253405 12352 -169544 171359
5383 93066 -36849 158821 92955 132835 99709 -26757 -166847 182474 76035 144072 -28318
5371 10352 -296943 -151311 -123891 -154686 -67631 142902 270218 17571 31029 48041 -37174
5359 -103449 -82420 -82654 -165029 -112122 -1993 87268 -86293 127430 -50722 -4532 -330349 -1699
5346 -111889 55390 -183541 -288991 178630 93462 -2721 -48055 98573 292816 42875 -195912
5334 -346199 2858 165138 23134 -12513 -11616 9060 -121850 -47673 -282335 -64173 114134 -247163
5321 -5839 -414436 -157751 50244 -302123 54321 -163187 209170 -39747 93115 -132021 -82860
5310 -82860 125142 162669 247328 -220369 263201 24732 -297633 64316 244055 124083 -190878
5298 -256381 -35822 37032 5395 262790 -104985 -94585 22275 -323304 -30017 92156 -87783
5286 56850 243257 50156 140889 -86030 -68982 -101509 216279 216234 -186776 -220855 286735 23883
5273 6681 -184507 193254 283444 -139444 -125468 -38696 -80370 -157730 30957 -121145 77896
5261 232055 -370726 45262 36141 91151 180405 -15739 208337 -80102 129126 -101559 92301
5249 -952 157690 -67819 107067 168746 -7947 -104433 267470 -218487 137186 32462 105852
5238 105852 170725 40853 -245669 -19665 123794 10905 90387 -31568 176244 115567 23905
5226 250607 -14481 267446 265216 129793 -20250 198611 -176373 -106256 -111697 -106011 110575
5214 13397 -5346 -94398 44941 284565 256608 -439198 -1088 -46727 68305 -167981 -47142 91056
5201 -263047 6040 16873 -233431 -24847 -21185 280102 -224083 115123 179138 -423638 -95740
5189 -197302 218158 91782 -16579 413760 22156 -80717 -119861 -10947 51149 -214336 12140
5177 57179 -76493 79356 -263437 -119500 -120532 251629 -224998 60806 240240 41163 -94629
5165 169228 144813 -132437 181284 200023 4113 -186451 123612 55040 -76288 214663 252266
5154 252266 171936 -52540 -16044 -157930 -75512 -5120 214493 235739 94845 -108043 257720
5142 -541953 -136147 -32712 -47690 -217083 -180170 123529 26341 -49099 257939 8450 -16681
5130 249593 83328 -83034 147580 41933 38353 250941 188687 80380 170915 -78122 -225460
5119 -225460 -11712 -56892 -174196 -49261 -9816 -198864 7919 -229819 126223 237146 -87888
5107 -37549 -14170 -90959 250104 -121590 -182932 200299 338629 -130926 -121686 70686 150160
5096 150160 -36668 130206 90566 91819 39170 -227193 -73000 -106501 380959 61650 243120
5085 243120 344096 246116 173791 76772 -190315 148362 -22848 50789 264943 121505 -125187
5073 -138430 -207344 -44858 284832 -50055 124655 -21414 82478 70821 103030 -91793 -113631
5062 -113631 226638 33854 -60126 -59528 52810 144464 10464 7092 153756 -202263 -73433 213614
5049 -105209 194559 -67711 -155424 -31052 82239 139899 99381 98274 -3955 331273 -141882
5037 -200998 319410 -32855 -73179 62494 -192988 51788 15426 -125075 91239 -116172 235082
5025 -44728 -340782 -66299 -97866 -24014 116732 31831 -105872 258768 -116403 236082 -315148
5013 -75064 -193491 125823 12514 -304401 247416 -234661 213397 -93360 -7314 -189055 -111944
5002 -111944 118392 173843 -283007 29163 -32690 3607 -221132 -20163 -287005 179181 -41633
4990 -457182 62865 92232 -136545 -130904 122104 -98799 -127888 -42250 -82919 174276 -86381
4978 77704 -160678 -50115 220825 -40642 -319706 -3098 -119163 38383 -274303 -5104 106308
4966 -218442 67315 18703 178770 184613 205631 156711 91237 5677 109182 145846 88624 7005
4953 -176341 89966 -47195 99832 -243611 73457 32450 86215 251329 -91183 4450 -242919
4941 91339 -95719 281146 253228 111324 -45663 -159312 -36458 -130601 -18640 -144706 -144556
4930 -144556 80774 -185394 137964 -63453 -110705 -131596 -22740 -84692 -305889 85057 113732
4919 113732 -21077 -43464 153246 -6828 -23641 359075 230450 155427 -78278 54356 -24208
4907 135406 36981 -56014 -139872 -19901 -184 155498 -106877 -187065 -99916 214920 105809
4895 112756 182554 -185128 94912 -35883 25098 -119168 -141541 51351 34567 8658 -165224
4883 40033 -138336 -224996 -76712 17286 116779 -24567 7747 44886 249540 58103 -29820 450903
4870 -132269 172870 49473 135950 414949 -175141 -97238 133578 27120 -114707 195600
4859 52503 275283 95952 -46030 346528 -255385 -149283 136110 246156 28676 240867
4849 240867 -155830 105526 4334 -272765 16083 52321 128225 -42303 16263 207724 -327232
4837 -34054 -163147 -280047 32989 175591 -77345 265735 44451 108675 -24719 -161657 -58009
4825 262801 114111 -143627 -206905 31251 31560 12290 -217344 -53026 54752 51495 -165972
4813 -29374 20361 -89344 -129224 449638 448661 -86021 110225 -18529 184598 109260 323925
4802 323925 206453 -230428 -178232 267304 -539105 -187433 620 -228675 270980 139695
4792 139695 12602 -184439 116914 -23663 -85793 -2750 -313521 -100674 79577 7469 81827
4781 81827 -193388 421680 276038 24582 -247001 81475 181249 -117130 248901 45087 7228
4769 59625 -41367 -65978 46180 -181214 -36069 276823 -37865 -208854 -71686 -47805 41579
4757 248722 59552 -220041 -5872 -119344 -140277 -160283 -150431 -117800 75977 264176 -111178
4745 -108961 -93195 -14394 64659 22480 110152 -53742 -477 -60918 45649 -167315 369781 279376
4733 279376 6940 47494 -63426 181297 28375 216333 -222521 -147024 129097 129524 -33838
4721 139662 56008 23376 -97622 112620 133509 18931 103630 -255118 62815 218351 114640
4710 114640 -9130 51960 206053 -285260 99615 -151486 -109425 -89019 -188774 -2225 204356
4698 64767 -140844 66745 234337 -28790 -33900 -27214 257309 30358 -74963 51557 -115510
4686 -44428 43348 193 -108134 -128966 -174122 -185590 -25488 155577 -126791 -38069 264903
4674 -36465 -1567 -150912 70517 211024 101556 -269389 -228909 -52538 90121 36086 80662
4663 80662 36204 53302 35500 -47667 191878 -75521 -349199 -104765 207343 -184134 -188576
4652 -188576 89987 100256 -73561 81042 -15997 246190 -113776 128073 122898 127850 318437
4641 318437 88437 -293306 210148 -65817 -6941 -113355 -146049 -193279 39786 201084 187682
4630 187682 310854 -13815 71520 156434 -162372 193477 147222 144013 -320610 -143290 -115701
4619 -115701 108147 208894 205314 115890 454954 -146432 110408 43850 100543 119151 200164
4608 200164 27646 -132196 66433 1490 -229101 -35119 -75817 321001 341651 261635 236003
4597 236003 -156209 -279661 -409026 -21128 134437 -28671 158382 329135 53507 160199
4587 160199 124339 102415 -124029 89982 -47620 20159 40250 212370 -77967 -23378 -75948
4576 -75948 -321881 176827 137550 -57556 -212322 172710 45293 143753 219792 -45805 -146918
4565 -146918 72680 696226 91621 247409 35997 371797 -36601 -153482 -390708 163555
4554 -120610 -32094 259236 -395262 193274 177470 19308 33272 47824 81166 -72342 -283511
4543 -283511 -110196 27802 126744 -314939 -38127 6817 -93280 182981 377147 172629 212912
4532 212912 393951 -168353 152231 220682 84670 18239 -184586 307876 -45005 -14834 37898
4520 -278787 34085 180890 -258057 347620 -201915 -19797 -44820 289886 23233 31438 135547
4509 135547 -26910 -243006 365203 77050 12937 -72758 -73502 -150351 37108 -77469 143204
4497 -70083 99602 61406 68255 -54167 136343 238077 -283803 47000 348650 9534 216946
$$ [...]
##END NTUPLES=NMR SPECTRUM
##END=
