
##TITLE=AC1385_GUAAH12197_7519639_KFkDCzDVAo
##JCAMPDX= 6.0         $$ Bruker NMR JCAMP-DX V2.0
##DATA TYPE= NMR SPECTRUM
##DATA CLASS= NTUPLES
##ORIGIN= BRUKER
##OWNER= Administrator
$$ 1.72 TOPSPIN		Version 2.1
$$ 2013-02-20 18:45:32.658 -0500  Administrator@X
$$ Compression mode = diff/dup
##.OBSERVE FREQUENCY= 400.02188249412
##.OBSERVE NUCLEUS= ^1H
##.ACQUISITION MODE= SIMULTANEOUS (DQD)
##.ACQUISITION SCHEME= undefined
##.AVERAGES= 64
##.DIGITISER RES= 22
##SPECTROMETER/DATA SYSTEM= spect
##.PULSE SEQUENCE= noesygpps1d.comp
##.SOLVENT NAME= COFFEE_meoh
##.SHIFT REFERENCE= INTERNAL, COFFEE_meoh, 1, 14.96112
##AUDIT TRAIL= $$ (NUMBER, WHEN, WHO, WHERE, PROCESS, VERSION, WHAT)
$$ ##TITLE= Audit trail, TOPSPIN		Version 2.1
$$ ##JCAMPDX= 5.01
$$ ##ORIGIN= Bruker BioSpin GmbH
$$ ##OWNER= Administrator
$$ $$ E:\/data/COFFEE/nmr/AC1385_GUAAH12197_7519639_KFkDCzDVAo/12/pdata/1/auditp.txt
$$ ##AUDIT TRAIL=  $$ (NUMBER, WHEN, WHO, WHERE, PROCESS, VERSION, WHAT)
(   1,<2013-02-20 18:45:26.689 -0500>,<Administrator>,<X>,<go>,<TOPSPIN 2.1>,
      <created by zg
	started at 2013-02-20 18:33:56.095 -0500,
	POWCHK enabled, PULCHK disabled,
       configuration hash MD5:
       86 BA 57 50 F2 9D 5C 9B 26 00 A9 28 5F 66 2E 89
       data hash MD5: 64K
       4B A8 99 F4 55 CF 8B A8 22 29 D1 D2 27 A9 0C F7>)
(   2,<2013-02-20 18:45:29.814 -0500>,<Administrator>,<X>,<proc1d>,<TOPSPIN 2.1>,
      <Start of raw data processing
       efp LB = 0.3 FT_mod = 6 PKNL = 1 PHC0 = 0 PHC1 = 0 SI = 128K 
       data hash MD5: 128K
       01 B9 D0 D1 31 BF BF BD D2 CB 0F 30 7F 19 98 C1>)
(   3,<2013-02-20 18:45:30.908 -0500>,<Administrator>,<X>,<proc1d>,<TOPSPIN 2.1>,
      <pk PHC0 = 250.3949 PHC1 = 0 
       data hash MD5: 128K
       E6 F7 12 5F C2 0B 28 1D 67 8E 67 D6 4D 05 74 00>)
(   4,<2013-02-20 18:45:31.611 -0500>,<Administrator>,<X>,<proc1d>,<TOPSPIN 2.1>,
      <abs ABSG = 1 
       data hash MD5: 128K
       3D 99 01 D1 76 3C 72 07 FD FB 39 C8 96 81 CA CE>)
(   5,<2013-02-20 18:45:31.783 -0500>,<Administrator>,<X>,<proc1d>,<TOPSPIN 2.1>,
      <abs ABSG = 2 
       data hash MD5: 128K
       16 8F 7B 6D 13 78 44 04 FB DC 4D 95 45 15 B1 8A>)
(   6,<2013-02-20 18:45:31.970 -0500>,<Administrator>,<X>,<proc1d>,<TOPSPIN 2.1>,
      <abs ABSG = 3 
       data hash MD5: 128K
       A1 8F E8 B1 0A 2B 55 56 5E A4 14 79 5A 27 1F 60>)
(   7,<2013-02-20 18:45:32.158 -0500>,<Administrator>,<X>,<proc1d>,<TOPSPIN 2.1>,
      <abs ABSG = 4 
       data hash MD5: 128K
       98 21 3D F9 83 B4 03 9F 5B 5A EA 6F 51 82 05 53>)
(   8,<2013-02-20 18:45:32.314 -0500>,<Administrator>,<X>,<proc1d>,<TOPSPIN 2.1>,
      <abs ABSG = 5 
       data hash MD5: 128K
       72 80 85 FE DC 18 0D A4 57 D7 83 74 19 CF C6 D7>)
$$ ##END=
$$ 
$$ $$ hash MD5
$$ $$ C6 07 7B FB 6E 6F 67 71 7F CA 27 DD 2E 48 E6 27
##$RELAX= 
##$RELAX= 
##$RELAX= 
##$RELAX= 
##$RELAX= 
##$RELAX= 
##$RELAX= 
##$RELAX= 
$$ Bruker specific parameters
$$ --------------------------
##$DU= <E:\>
##$EXPNO= 12
$$ [...]
150 150 150 150 150 150 150 150
##$TP07= 0
##$TPNAME0= <>
##$TPNAME1= <>
##$TPNAME2= <>
##$TPNAME3= <>
##$TPNAME4= <>
##$TPNAME5= <>
##$TPNAME6= <>
##$TPNAME7= <>
##$TPOAL= (0..7)
0.5 0.5 0.5 0.5 0.5 0.5 0.5 0.5
##$TPOFFS= (0..7)
0 0 0 0 0 0 0 0
##$TUNHIN= 0
##$TUNHOUT= 0
##$TUNXOUT= 0
##$USERA1= <user>
##$USERA2= <user>
##$USERA3= <user>
##$USERA4= <user>
##$USERA5= <user>
##$V9= 5
##$VALIST= <valist>
##$VCLIST= <CCCCCCCCCCCCCCC>
##$VD= 0
##$VDLIST= <DDDDDDDDDDDDDDD>
##$VPLIST= <PPPPPPPPPPPPPPP>
##$VTLIST= <TTTTTTTTTTTTTTT>
##$WBST= 1024
##$WBSW= 4
##$XGAIN= (0..3)
0 0 0 0
##$XL= 0
##$YL= 0
##$YMAX_a= 6350471
##$YMIN_a= -11317990
##$ZGOPTNS= <>
##$ZL1= 120
##$ZL2= 120
##$ZL3= 120
##$ZL4= 120
##$ABSF1= 14.96112
##$ABSF2= -5.597062
##$ABSG= 5
##$ABSL= 3
##$ALPHA= 0
##$AQORDER= 0
##$ASSFAC= 0
##$ASSFACI= 0
##$ASSFACX= 0
##$ASSWID= 0
##$AUNMP= <proc_prof1d_extract.lims>
##$AXLEFT= 0
##$AXNAME= <>
##$AXNUC= <1H>
##$AXRIGHT= 0
##$AXTYPE= 0
##$AXUNIT= <>
##$AZFE= 0.1
##$AZFW= 0.1
##$BCFW= 0
##$BC_mod= 0
##$BYTORDP= 0
##$COROFFS= 0
##$CY= 15
##$DATMOD= 1
##$DC= 0
##$DFILT= <>
##$DTYPP= 0
##$F1P= 0
##$F2P= 0
##$FCOR= 0.5
##$FTSIZE= 131072
##$FT_mod= 6
##$GAMMA= 0
##$GB= 0
##$INTBC= 1
##$INTSCL= 1
##$ISEN= 128
##$LB= 0.3
##$LEV0= 0
##$LPBIN= 0
##$MAXI= 10000
##$MC2= 0
##$MEAN= 0
##$ME_mod= 0
##$MI= 0
##$NCOEF= 0
##$NC_proc= -2
##$NLEV= 6
##$NOISF1= 0
##$NOISF2= 0
##$NSP= 0
##$NTH_PI= 0
##$NZP= 0
##$OFFSET= 14.96112
##$PC= 1
##$PHC0= 250.3949
##$PHC1= 0
##$PH_mod= 1
##$PKNL= yes
##$PPARMOD= 0
##$PPDIAG= 0
##$PPIPTYP= 0
##$PPMPNUM= 2147483647
##$PPRESOL= 1
##$PSCAL= 4
##$PSIGN= 0
##$PYNMP= <proc.py>
##$REVERSE= no
##$SF= 400.020009587227
##$SI= 131072
##$SIGF1= 0
##$SIGF2= 0
##$SINO= 400
##$SIOLD= 131072
##$SPECTYP= <>
##$SREGLST= <1H.CDCl3>
##$SSB= 0
##$STSI= 131072
##$STSR= 0
##$SW_p= 8223.68421052631
##$SYMM= 0
##$S_DEV= 0
##$TDeff= 65536
##$TDoff= 0
##$TI= <>
##$TILT= no
##$TM1= 0
##$TM2= 0
##$TOPLEV= 0
##$USERP1= <user>
##$USERP2= <user>
##$USERP3= <user>
##$USERP4= <user>
##$USERP5= <user>
##$WDW= 1
##$XDIM= 131072
##$YMAX_p= 433879142
##$YMIN_p= -11722
##$CURPLOT= <Network HP LaserJet P1505>
##$CURPRIN= <$Network HP LaserJet P1505>
##$DFORMAT= <normdp>
##$LAYOUT= <+/1D_H.xwp>
##$LFORMAT= <normlp>
##$PFORMAT= <normpl>
##$SURQMSG= 1
$$ End of Bruker specific parameters
$$ ---------------------------------
##NTUPLES= NMR SPECTRUM
##VAR_NAME=  FREQUENCY,     SPECTRUM/REAL,   SPECTRUM/IMAG
##SYMBOL=    X,             R,               I
##VAR_TYPE=  INDEPENDENT,   DEPENDENT,       DEPENDENT
##VAR_FORM=  AFFN,          ASDF,            ASDF
##VAR_DIM=   131072,        131072,          131072
##UNITS=     HZ,            ARBITRARY UNITS, ARBITRARY UNITS
##FACTOR=    0.0627417313425164, 1,          1
##FIRST=     8223.62146879497, 1718,         -63928
##LAST=      0,             4577,            -64138
##MIN=       0,             -11722,          0
##MAX=       8223.62146879497, 433879142,    0
$$ Real data points
##PAGE= N=1
##DATA TABLE= (X++(R..R)), XYDATA
$$ [...]
$$ plain form
63888 792478 776954 763251 750771 738713 726893 716110 707448 701153 696436 692582 689914 689431 691784
63875 691784 696984 704969 716031 730604 748924 771029 796954 826813 860674 898314 939080 982138
63863 982138 1027003 1073791 1122791 1173748 1225637 1277164 1327474 1376321 1423518 1468261 1509127
63852 1509127 1544732 1574289 1597517 1614253 1624345 1627715 1624294 1614043 1597225 1574465 1546248 1512514
63840 1512514 1473056 1428217 1378978 1326628 1272649 1218551 1165169 1112280 1059566 1007871 958865
63829 958865 913479 871519 832847 797921 766667 737663 709174 680524 651905 623441 595222
63818 595222 567799 541785 517096 493393 471206 451750 435474 421468 408599 396647 386011
63807 386011 376746 368401 360608 353400 346935 341172 335819 330490 324882 318971 313098 307816 303499 300011
$$ packed form
63888G92478j5524j3703j2480j2058j1820j0783q662o295m717l854k668m83K353
63875F91784N200P985J1062J4573J8320K2105K5925K9859L3861L7640M0766M3058
63863I82138M4865M6788M9000N0957N1889N1527N0310M8847M7197M4743M0866
63852A509127L5605K9557K3228J6736J0092L370l421j0251j6818k2760k8217l3734
63840A512514l9458m4839m9239n2350n3979n4098n3382n2889n2714n1695m9006
63829I58865m5386m1960l8672l4926l1254k9004k8489k8650k8619k8464k8219
63818E95222k7423k6014k4689k3703k2187j9456j6276j4006j2869j1952j0636
63807C86011r265q345p793p208o465n763n353n329n608n911n873n282m317l488
$$ plain form
63793 300011 296820 293539 290273 287281 284376 280983 276919 272710 268898 265310 261522 257860 255309 254236
63779 254236 253705 252463 250374 248462 247634 247731 247901 247546 246656 245471 244177 243000 242307 242413 243229 244104 244070
63762 244070 242494 239707 236934 235325 235024 235384 236008 237144 238907 240674 241640 241752 241625 241663 241707 241479 240977
63745 240977 240363 239783 239381 239301 239654 240555 242071 243930 245541 246676 247930 250105 253252 256732 260067 263157
63729 263157 265823 267858 269676 272150 275548 279213 282627 286211 290654 295985 301749 307662 313534 318934
63715 318934 323499 327414 331045 334295 336767 338380 339275 339227 337739 334797 331088 327349 323842 320522 317393
63700 317393 314555 312139 310285 308986 308001 307143 306716 307334 309234 311929 314635 316953 319183 322120 326422
63685 326422 331873 337277 341393 344047 346098 348292 350487 352093 352948 353447 354046 354892 355835 356533 356644 356178
$$ packed form
63793C00011l191l281l266k992k905l393m064m209l812l588l788l662k551j073
63779B54236n31j242k089j912q28R7J70l55q90j185j294j177o93J06Q16Q75l4
63762B44070j576k787k773j609l01L60O24J136J763J767R66J12j27L8M4k28n02
63745B40977o14n80m02q0L53R01J516J859J611J135J254K175L147L480L335L090
63729B63157K666K035J818K474L398L665L414L584M443N331N764N913N872N400
63715C18934M565L915L631L250K472J613Q95m8j488k942l709l739l507l320l129
63700C17393k838k416j854j299r85q58m27O18J900K695K706K318K230K937M302
63685C26422N451N404M116K654K051K194K195J606Q55M99N99Q46R43O98J11m66
$$ plain form
63669 356178 355685 355871 356931 358407 359722 360733 361697 362854 364141 365253 365845 365704 364765 362964 360107 356028
63653 356028 350913 345332 339840 334683 329977 325904 322445 319152 315646 312346 310201 309586 309942 310755 312339
63638 312339 315165 318775 322090 324759 327581 331432 336214 341171 345864 350477 355321 360386 365536 370877
63624 370877 376719 383113 389679 396146 402934 410858 420179 430336 440743 451531 463274 476355 490953
63611 490953 507318 525585 545472 566559 588798 612453 637778 665073 694703 726454 758997
63600 758997 790469 819464 844962 865576 879765 886974 888091 884719 878570 871448 864958 859810 855824
63587 855824 852642 849807 846036 839310 828156 812435 792661 769277 743071 715576 688390 662388
63575 662388 638065 616107 596999 580421 565702 552766 542156 534319 529295 526867 526508 527340 528703
$$ packed form
63669C56178m93J86J060J476J315J011R64J157J287J112N92j41r39j801k857m079
63653C56028n115n581n492n157m706m073l459l293l506l300k145o15L56Q13J584
63638C12339K826L610L315K669K822L851M782M957M693M613M844N065N150N341
63624C70877N842O394O566O467O788P924R321J0157J0407J0788J1743J3081J4598
63611D90953J6365J8267J9887K1087K2239K3655K5325K7295K9630L1751L2543
63600G58997L1472K8995K5498K0614J4189P209J117l372o149p122o490n148l986
63587H55824l182k835l771o726j1154j5721j9774k3384k6206k7495k7186k6002
63575F62388k4323k1958j9108j6578j4719j2936j0610p837n024k428l59Q32J363
$$ plain form
63562 528703 530728 534009 538854 545215 553021 562015 571350 580019 587814 595500 604018 613933 625675 639835
63548 639835 656968 677396 701407 729492 762317 800640 845159 895817 950467 1004052 1049693
63537 1049693 1081544 1097407 1099058 1090343 1075168 1057005 1039210 1024591 1014307 1007649 1003130 999538
63525 999538 996008 991633 985253 975331 960022 937973 909438 876234 840343 802943 764896 727475
63513 727475 691980 659001 628609 600957 576161 553847 533413 514701 497974 483279 470242
63502 470242 458407 447450 437134 427420 418561 410807 404036 397874 392012 386235 380406 374763 369981
63489 369981 366560 364242 362332 360481 358877 357889 357774 358571 359987 361593 363390 365886 369283 372956 376215
63474 376215 379338 383302 388631 394955 401495 407428 411934 414588 415791 416334 416385 415283 412426 408031 402937
$$ packed form
63562E28703K025L281M845O361P806Q994R335Q669P795P686Q518R915J1742J4160
63548F39835J7133K0428K4011K8085L2825L8323M4519N0658N4650N3585M5641
63537A049693L1851J5863J651q715j5175j8163j7795j4619j0284o658m519l592
63525I99538l530m375o380r922j5309k2049k8535l3204l5891l7400l8047l7421
63513G27475l5495l2979l0392k7652k4796k2314k0434j8712j6727j4695j3037
63502D70242j1835j0957j0316r714q859p754o771o162n862n777n829n643m782
63489C69981l421k318j910j851j604r88j15P97J416J606J797K496L397L673L259
63474C76215L123L964N329O324O540N933M506K654J203N43N1j102k857m395n094
$$ plain form
63459 402937 398051 394045 391261 389668 388995 388962 389351 389973 390745 391688 392737 393761 394894 396579 399077 402249
63443 402249 406098 411122 417712 425549 434153 443743 455047 468498 484261 502899 525429 552824 585976
63430 585976 625684 671445 719847 764986 801223 825637 838176 840469 835111 825467 815098 806853
63418 806853 802463 802835 808544 820037 837485 860615 888850 921604 958094 996653 1034467 1068356
63406 1068356 1095746 1114997 1125442 1127778 1124129 1116996 1108081 1098400 1089121 1081394 1075238 1069260 1061646
63393 1061646 1050984 1036059 1015663 989143 956987 920627 881824 842281 803440 766306 731442
63382 731442 699083 669213 641748 616927 595359 577389 562631 550454 540731 533608 528766 525539
63370 525539 523720 523700 525852 530289 537195 546637 558023 570404 583565 598227 614971 633619 654017
$$ packed form
63459D02937m886m006k784j593o73l3L89O22P72R43J049J024J133J685K498L172
63443D02249L849N024O590P837Q604R590J1304J3451J5763J8638K2530K7395L3152
63430E85976L9708M5761M8402M5139L6237K4414J2539K293n358r644j0369q245
63418H06853m390L72N709J1493J7448K3130K8235L2754L6490L8559L7814L3889
63406A068356K7390J9251J0445K336l649p133q915r681r279p727o156n978p614
63393A061646j0662j4925k0396k6520l2156l6360l8803l9543l8841l7134l4864
63382G31442l2359k9870k7465k4821k1568j7970j4758j2177r723p123m842l227
63370E25539j819k0K152M437O906R442J1386J2381J3161J4662J6744J8648K0398
$$ plain form
63357 654017 676869 703251 733526 767033 802703 839779 878116 917840 958532 998677 1036116
63346 1036116 1068916 1095487 1114231 1123987 1125172 1119973 1111145 1100947 1091092 1082849 1076567 1071414 1065918
63333 1065918 1058554 1047808 1032315 1011475 985651 955566 921906 885784 849068 813634 780450
63322 780450 749791 722210 698841 680748 668339 661536 660171 663511 668906 671172 664531 646199 618209
63309 618209 585407 551990 520287 491844 467980 448939 433693 421191 411121 403154 396340 389857
63297 389857 383721 378157 372893 367639 362665 358270 354141 349891 345851 342675 340439 338702 337126 335455
63283 335455 333238 330285 327232 325028 323906 323384 323103 323053 323042 322579 321468 320097 319011 318488 318521 318925 319389
63266 319389 319682 319833 319989 320195 320565 321468 323176 325396 327552 329572 332114 335833 340657 345877 350847 355467
$$ packed form
63357F54017K2852K6382L0275L3507L5670L7076L8337L9724M0692M0145L7439
63346A036116L2800K6571J8744R756J185n199q828j0198r855q243o282n153n496
63333A065918p364j0746j5493k0840k5824l0085l3660l6122l6716l5434l3184
63322G80450l0659k7581k3369j8093j2409o803j365L340N395K266o641j8332k7990
63309F18209l2802l3417l1703k8443k3864j9041j5246j2502j0070p967o814o483
63297C89857o136n564n264n254m974m395m129m250m040l176k236j737j576j671
63283C35455k217k953l053k204j122n22k81n0j1m63j111j371j086n23L3M04M64
63266C19389K93J51J56K06L70R03J708K220K156K020K542L719M824N220M970M620
$$ plain form
63250 355467 360045 364806 369696 374647 379845 385509 391534 397598 403577 409624 415969 422943 431108 440873
63236 440873 451972 463742 476014 489341 504322 521182 539961 560507 582157 604060 626088
63225 626088 648781 672110 695058 716927 738478 761055 784954 809355 833678 858382 884418
63214 884418 912250 941384 970644 998995 1026098 1051720 1074582 1092424 1103565 1107899 1106085 1098370
63202 1098370 1084672 1065196 1040375 1010711 977359 942426 907958 874888 843539 814666 789198
63191 789198 767347 748901 734176 723791 717590 714738 714928 718664 726315 737644 752380 770403 791134
63178 791134 813519 837024 862037 888936 917246 946020 974651 1003054 1031474 1060360 1089997
63167 1089997 1119887 1148764 1175456 1199439 1220436 1237879 1250982 1258972 1260932 1255742 1242524 1221123
$$ packed form
63250C55467M578M761M890M951N198N664O025O064N979O047O345O974Q165R765
63236D40873J1099J1770J2272J3327J4981J6860J8779K0546K1650K1903K2028
63225F26088K2693K3329K2948K1869K1551K2577K3899K4401K4323K4704K6036
63214H84418K7832K9134K9260K8351K7103K5622K2862J7842J1141M334j814p715
63202A098370j3698j9476k4821k9664l3352l4933l4468l3070l1349k8873k5468
63191G89198k1851j8446j4725j0385o201k852J90L736P651J1329J4736J8023K0731
63178G91134K2385K3505K5013K6899K8310K8774K8631K8403K8420K8886K9637
63167A089997K9890K8877K6692K3983K0997J7443J3103P990J960n190j3218k1401
$$ plain form
63155 1221123 1192126 1156703 1116537 1073475 1028858 983326 937397 891966 848069 806437 767573
63144 767573 732017 700179 672043 647336 625899 607600 591899 577806 564494 551929 540836
63133 540836 532016 525684 521386 518479 516518 515073 513445 510933 507517 504014 501408 500115 499975 500763 502411
63118 502411 504782 507528 510355 513295 516497 519788 522745 525339 528240 532141 536858 541424 545081 547840
63104 547840 550038 551774 553022 553975 554926 555916 556710 557051 556820 556120 555397 555302 556279 558344 561323 565041 569196
63087 569196 573373 577312 580828 583295 583710 581753 578508 575631 573955 573280 573309 574170 576076 578984 582777
63072 582777 587451 592984 599243 606072 613307 620750 628368 636487 645595 655977 667649 680519 694406
63059 694406 709095 724674 741684 760665 781719 804837 830454 859221 891225 925903 962828
$$ packed form
63155A221123k8997l5423m0166m3062m4617m5532m5929m5431m3897m1632l8864
63144G67573l5556l1838k8136k4707k1437j8299j5701j4093j3312j2565j1093
63133E40836q820o332m298k907j961j445j628k512l416l503k606j293j40P88J648
63118E02411K371K746K827K940L202L291K957K594K901L901M717M566L657K759
63104E47840K198J736J248R53R51R90P94L41k31p00p23r5R77K065K979L718M155
63087E69196M177L939L516K467M15j957l245k877j676o75K9Q61J906K908L793
63072E82777M674N533O259O829P235P443P618Q119R108J0382J1672J2870J3887
63059F94406J4689J5579J7010J8981K1054K3118K5617K8767L2004L4678L6925
$$ plain form
63048 962828 1002287 1044966 1091296 1141078 1193468 1247343 1301949 1357334 1414015 1472214 1531514
63037 1531514 1591180 1650657 1709835 1769111 1829198 1890721 1953897 2018424 2083300 2146599 2205857
63026 2205857 2259036 2304856 2341948 2368168 2381314 2380274 2364932 2335319 2291781 2236021 2171096
63015 2171096 2099995 2024697 1946846 1868728 1793036 1722011 1657198 1599789 1550666 1510103 1477849
63004 1477849 1453670 1437727 1430332 1431409 1440312 1456182 1478379 1506435 1539635 1576927 1617303 1660007
62992 1660007 1704297 1749437 1795330 1842871 1893142 1946176 2000803 2055652 2109932 2163213 2214774
62981 2214774 2263306 2306988 2343695 2371245 2387650 2391253 2380884 2356090 2317211 2265195 2201415
62970 2201415 2127692 2046222 1959238 1868833 1777174 1686672 1599660 1517792 1441683 1370996 1305067
$$ packed form
63048I62828L9459M2679M6330M9782N2390N3875N4606N5385N6681N8199N9300
63037A531514N9666N9477N9178N9276O0087O1523O3176O4527O4876O3299N9258
63026B205857N3179M5820L7092K6220J3146j040j5342k9613m3538n5760o4925
63015B171096p1101p5298p7851p8118p5692p1025o4813n7409m9123m0563l2254
63004A477849k4179j5943p395J077Q903J5870K2197K8056L3200L7292M0376M2704
62992A660007M4290M5140M5893M7541N0271N3034N4627N4849N4280N3281N1561
62981B214774M8532M3682L6707K7550J6405L603j0369k4794l8879n2016o3780
62970B201415p3723q1470q6984r0405r1659r0502q7012q1868p6109p0687o5929
$$ plain form
62959 1305067 1243901 1188501 1139745 1096947 1058175 1022069 988597 957749 928471 899565 870982
62948 870982 843439 817283 792493 769221 747406 726260 705116 684580 665906 649419 634441
62937 634441 620578 608071 596875 586492 576788 568082 560183 552276 544068 536289 529706 524287 519599
62924 519599 515370 511376 507396 503577 500314 497603 495084 492857 491555 491428 491943 492502 492870 492746 491772 490270
62908 490270 489173 488756 488174 486686 484596 482428 479913 476527 472550 468820 465764 463259 461153 459407 458009
62893 458009 457213 457528 458979 460665 461554 461444 460746 459695 458325 456896 455734 454840 454180 454171 455288 457261 459171
62876 459171 460361 460893 461152 461439 461955 462780 463703 464303 464272 463608 462538 461336 460055 458335 455649 451940 447925
62859 447925 444619 442631 441885 441802 441734 441477 441459 442165 443412 444524 445202 445712 446231 446647 447157 448332 450230 452107
$$ packed form
62959A305067o1166n5400m8756m2798l8772l6106l3472l0848k9278k8906k8583
62948H70982k7543k6156k4790k3272k1815k1146k1144k0536j8674j6487j4978
62937F34441j3863j2507j1196j0383r704q706p899p907q208p779o583n419m688
62924E19599m229l994l980l819l263k711k519k227j302j27N15N59L68j24r74j502
62908D90270j097m17n82j488k090k168k515l386l977l730l056k505k106j746j398
62893D58009p96L15J451J686Q89j10o98j051j370j429j162q94o60rJ117J973J910
62876D59171J190N32K59K87N16Q25R23O00l1o64j070j202j281j720k686l709m015
62859D47925l306j988p46q3o8k57j8P06J247J112O78N10N19M16N10J175J898J877
$$ plain form
62841 452107 453440 454524 455546 455856 454968 453641 452937 452579 451434 449494 448136 448203 448939 449313 449496 450320 451942
62824 451942 453847 455823 458119 460741 463207 465137 466640 468075 469822 472344 475972 480372 484569 487871
62810 487871 490608 493664 497502 502019 507140 512965 519302 525642 531869 538524 546026 554050 562081 570302
62796 570302 579526 590431 603158 617255 631633 644987 656991 668918 682564 698793 717689 739692
62784 739692 765574 795389 828562 865280 906810 954054 1006641 1064058 1126915 1196391 1272886
62773 1272886 1355827 1444401 1537748 1634542 1732904 1830634 1925182 2013569 2092829 2160566 2214907
62762 2214907 2254074 2276333 2280413 2266053 2234291 2187348 2127916 2058360 1980580 1896519 1808439
62751 1808439 1718575 1628767 1540381 1454382 1371498 1292609 1218794 1150625 1087681 1029320 975745
$$ packed form
62841D52107J333J084J022L10q88j327p04l58j145j940j358O7P36L74J83Q24J622
62824D51942J905J976K296K622K466J930J503J435J747K522L628M400M197L302
62810D87871K737L056L838M517N121N825O337O340O227O655P502Q024Q031Q221
62796E70302R224J0905J2727J4097J4378J3354J2004J1927J3646J6229J8896K2003
62784G39692K5882K9815L3173L6718M1530M7244N2587N7417O2857O9476P6495
62773A272886Q2941Q8574R3347R6794R8362R7730R4548Q8387P9260O7737N4341
62762B214907L9167K2259M080j4360l1762m6943n9432o9556p7780q4061q8080
62751A808439q9864q9808q8386q5999q2884p8889p3815o8169o2944n8361n3575
$$ plain form
62740 975745 927652 884950 846660 812018 780757 752312 725904 701752 681100 664449 650548
62729 650548 637728 625486 614277 604608 596931 591590 588100 585206 582364 580485 580528 582165 584743 588685
62715 588685 594783 602712 611553 621422 633287 647290 662506 678468 695933 715923 738970 765513
62703 765513 796255 831716 871886 916560 965704 1019562 1078794 1144285 1216282 1293858 1375820
62692 1375820 1462021 1553137 1649158 1748690 1849619 1949762 2046815 2138238 2221242 2292529 2348276
62681 2348276 2385211 2401842 2398213 2374691 2331758 2271006 2195503 2108806 2014015 1913864 1811069
62670 1811069 1708223 1607487 1510427 1417938 1330446 1248499 1172946 1104143 1041346 983539 930577
62659 930577 882839 839995 801095 765790 734475 707006 682213 659120 637885 619072 602495
$$ packed form
62740I75745m8093m2702l8290l4642l1261k8445k6408k4152k0652j6651j3901
62729F50548j2820j2242j1209r669p677n341l490k894k842j879M3J637K578L942
62715E88685O098P929Q841R869J1865J4003J5216J5962J7465J9990K3047K6543
62703G65513L0742L5461M0170M4674M9144N3858N9232O5491P1997P7576Q1962
62692A375820Q6201R1116R6021R9532J00929J00143R7053R1423Q3004P1287N5747
62681B348276L6935J6631l629k3522m2933o0752p5503q6697r4791j00151j02795
62670A811069j02846j00736r7060r2489q7492q1947p5553o8803o2797n7807n2962
62659I30577m7738m2844l8900l5305l1315k7469k4793k3093k1235j8813j6577
$$ plain form
62648 602495 587254 572495 557834 543449 530093 518631 509185 500959 493122 485628 478961 473391 468732
62635 468732 464697 461322 459081 458501 459449 460913 461708 461337 459906 457574 454574 451542 449108 447159 445073
62620 445073 442698 440491 438718 437252 436288 436510 438201 440747 443366 445890 448493 451143 453764 456658 460448
62605 460448 465673 472506 480631 489380 498341 507869 518720 531257 545516 561934 581273 603732 628862
62592 628862 656621 687803 723045 762045 804187 849269 896932 945788 993839 1039578 1082113
62581 1082113 1120269 1152131 1175569 1189096 1192415 1186452 1172685 1152130 1125055 1091849 1053871 1013052
62569 1013052 970834 927895 884852 842787 802956 766266 733064 703166 675938 650604 626721
62558 626721 604428 584199 566417 551223 538579 528223 519492 511459 503539 495939 489272 483774 479133
$$ packed form
62648F02495j5241j4759j4661j4385j3356j1462r446q226p837p494o667n570m659
62635D68732m035l375k241n80R48J464P95l71j431k332l000l032k434j949k086
62620D45073k375k207j773j466r64K22J691K546K619K524K603K650K621K894L790
62605D60448N225O833Q125Q749Q961R528J0851J2537J4259J6418J9339K2459K5130
62592F28862K7759L1182L5242L9000M2142M5082M7663M8856M8051M5739M2535
62581A082113L8156L1862K3438J3527L319n963j3767k0555k7075l3206l7978m0819
62569A013052m2218m2939m3043m2065l9831l6690l3202k9898k7228k5334k3883
62558F26721k2293k0229j7782j5194j2644j0356q731q033p920p600o667n498m641
$$ plain form
62545 479133 475037 471474 468454 465869 463823 462683 462502 462820 463409 464750 467280 470510 473491 475901 478012
62530 478012 479822 481020 481861 483315 486146 490374 495843 502836 511832 522993 536162 551171 568017
62517 568017 586921 608266 632303 659030 688609 721794 759562 802339 849790 901284 956181
62506 956181 1013752 1073143 1133345 1192964 1250225 1303440 1351121 1391342 1421610 1440208 1447401 1444606
62494 1444606 1432719 1412221 1384720 1353193 1320428 1287974 1256779 1227935 1202545 1181538 1165903
62483 1165903 1156433 1153035 1154989 1162043 1174526 1192215 1213955 1238573 1265076 1291356 1313736 1328832
62471 1328832 1335645 1335374 1329597 1318943 1302758 1279375 1247214 1206368 1159010 1107862 1054670 1000406
62459 1000406 946196 893276 842381 793972 748907 708315 672810 642195 615796 592825 572678
$$ packed form
62545D79133m096l563l020k585k046j140j81L18N89J341K530L230K981K410K111
62530D78012J810J198Q41J454K831M228N469O993Q996J1161J3169J5009J6846
62517E68017J8904K1345K4037K6727K9579L3185L7768M2777M7451N1494N4897
62506I56181N7571N9391O0202N9619N7261N3215M7681M0221L0268J8598P193k795
62494A444606j1887k0498k7501l1527l2765l2454l1195k8844k5390k1007j5635
62483A165903r470l398J954P054J2483J7689K1740K4618K6503K6280K2380J5096
62471A328832O813k71n777j0654j6185k3383l2161m0846m7358n1148n3192n4264
62459A000406n4210n2920n0895m8409m5065m0592l5505l0615k6399k2971k0147
$$ plain form
62448 572678 555265 540901 529620 520765 513429 507023 501332 496497 493140 492017 493216 496003 499621
62435 499621 503744 508064 512163 516128 520490 525060 528515 529759 529053 527138 523906 518774 511836 503754
62421 503754 494955 485814 477195 469719 462722 455116 447275 440873 436596 433096 428709 423363 418164 413758
62407 413758 409912 406338 403130 400363 397839 395416 393281 391702 390728 390319 390592 391631 393108 394495 395857
62392 395857 398036 401679 406294 410729 414367 417359 419864 421861 423724 426108 428990 431568 433628 436307
62378 436307 440884 447258 454197 460737 466820 472922 479655 487455 496098 504686 512593 520293 528876 539016
62364 539016 550783 564127 578942 594967 612247 631582 654001 679919 709371 742893 781541
62353 781541 825945 875765 930066 987796 1047883 1109141 1170053 1228388 1281338 1326535 1362934
$$ packed form
62448E72678j7413j4364j1281q855p336o406n691m835l357j123J199K787L618
62435D99621M123M320M099L965M362M570L455J244p06j915l232n132o938q082
62421E03754q799r141q619p476o997p606p841o402m277l500m387n346n199m406
62407D13758l846l574l208k767k524k423k135j579r74m09K73J039J477J387J362
62392C95857K179L643M615M435L638K992K505J997J863K384K882K578K060K679
62378D36307M577O374O939O540O083O102O733P800Q643Q588P907P700Q583J0140
62364E39016J1767J3344J4815J6025J7280J9335K2419K5918K9452L3522L8648
62353G81541M4404M9820N4301N7730O0087O1258O0912N8335N2950M5197L6399
$$ plain form
62342 1362934 1390500 1409362 1419806 1422693 1418992 1408819 1391645 1367589 1337866 1303726 1265618 1223851
62330 1223851 1179653 1134956 1091258 1049087 1008643 970575 935876 905066 877671 852608 828982
62319 828982 806359 784375 762452 740044 717040 693816 671042 649410 629209 610088 591531
62308 591531 573705 557507 543616 531815 521403 511919 503242 495359 488429 482805 478634 475543 472950
62295 472950 470563 468464 466904 466092 465839 465412 464194 462627 461956 462811 464594 466501 468518 470969 473734
62280 473734 476490 479268 482170 484952 487407 489799 492439 495223 498051 501219 504837 508417 511733 515569
62266 515569 520864 527589 535314 544468 556085 570564 587649 607465 630608 657272 687215 720609
62254 720609 758138 800254 847176 899520 957903 1021625 1088437 1155658 1220746 1280856 1333131
$$ packed form
62342A362934K7566J8862J0444K887l701j0173j7174k4056k9723l4140l8108m1767
62330A223851m4198m4697m3698m2171m0444l8068l4699l0810k7395k5063k3626
62319H28982k2623k1984k1923k2408k3004k3224k2774k1632k0201j9121j8557
62308E91531j7826j6198j3891j1801j0412r484q677p883o930n624m171l091k593
62295D72950k387k099j560q12k53m27j218j567o71Q55J783J907K017K451K765
62280D73734K756K778K902K782K455K392K640K784K828L168L618L580L316L836
62266E15569N295O725P725R154J1617J4479J7085J9816K3143K6664K9943L3394
62254G20609L7529M2116M6922N2344N8383O3722O6812O7221O5088O0110N2275
$$ plain form
62243 1333131 1376025 1409687 1434608 1450589 1457345 1455284 1445006 1426541 1399703 1364838 1322723 1274031
62231 1274031 1219468 1160352 1098727 1036921 977051 920662 868605 821285 778992 741735 708886
62220 708886 679531 653311 630526 611279 594961 580753 568198 557032 546916 537642 529263 521670
62208 521670 514317 506732 499118 492110 486023 480669 475899 472041 469587 468515 468055 467309 466158 465423 466022
62193 466022 468160 471443 475522 480285 485527 490853 496066 501511 507966 516085 525790 536190 546384 556411
62179 556411 567034 578430 589545 599068 606590 612445 616878 619967 622121 624171 627149 632320 640990
62166 640990 653724 670054 689533 712713 740499 772971 809601 850275 895047 942951 991877
62155 991877 1039613 1084242 1123614 1155573 1179078 1194579 1203140 1205789 1203632 1197564 1187418 1172042
$$ packed form
62243A333131M2894L3662K4921J5981O756k061j0278j8465k6838l4865m2115m8692
62231A274031n4563n9116o1625o1806n9870n6389n2057m7320m2293l7257l2849
62220G08886k9355k6220k2785j9247j6318j4208j2555j1166j0116r274q379p593
62208E21670p353p585p614p008o087n354m770l858k454j072m60p46j151p35N99
62193D66022K138L283M079M763N242N326N213N445O455Q119R705J0400J0194J0027
62179E56411J0623J1396J1115R523P522N855M433L089K154K050K978N171Q670
62166F40990J2734J6330J9479K3180K7786L2472L6630M0674M4772M7904M8926
62155I91877M7736M4629L9372L1959K3505J5501Q561K649k157o068j0146j5376
$$ plain form
62143 1172042 1150618 1123623 1092511 1059054 1025109 992340 961825 934236 910314 890629 874999
62132 874999 862884 854391 850058 849551 851427 854426 858201 862537 866750 870339 873582 876987 880640 884371
62118 884371 887997 891136 893418 895267 897926 902252 907811 913206 916745 916747 912203 903695 893130 882258
62104 882258 871942 862963 856392 852451 849670 845928 839999 831836 822208 812748 805625 802161 801926 803671
62090 803671 806779 811271 816935 823282 830136 837625 845699 854099 862664 871336 880211 889942 901608 915684
62076 915684 931515 948317 966287 986188 1008275 1032190 1057473 1083417 1108693 1131989 1153032
62065 1153032 1172392 1190378 1206784 1221779 1236505 1252632 1271529 1293758 1319000 1346392 1375009
62054 1375009 1403807 1431071 1454581 1472870 1486016 1494779 1499408 1499787 1496151 1488601 1476055 1456666
$$ packed form
62143A172042k1424k6995l1112l3457l3945l2769l0515k7589k3922j9685j5630
62132H74999j2115q493m333n07J876K999L775M336M213L589L243L405L653L731
62118H84371L626L139K282J849K659M326N559N395L539Km544q508j0565j0872
62104H82258j0316q979o571l941k781l742n929q163r628r460p123l464k35J745
62090H03671L108M492N664O347O854P489Q074Q400Q565Q672Q875R731J1666J4076
62076I15684J5831J6802J7970J9901K2087K3915K5283K5944K5276K3296K1043
62065A153032J9360J7986J6406J4995J4726J6127J8897K2229K5242K7392K8617
62054A375009K8798K7264K3510J8289J3146Q763M629L79l636p550j2546j9389
$$ plain form
62042 1456666 1429514 1395296 1355272 1310292 1261212 1209589 1157338 1105782 1055394 1006396 959325
62031 959325 914960 873845 836115 801829 771282 744650 721404 700568 681698 665208 651430
62020 651430 639769 629143 618939 609092 599448 589613 579407 569078 559071 549771 541382 533815 526831
62007 526831 520527 515546 512498 511269 511162 511578 512331 513494 515250 517872 521519 525981 530695 535003 538423
61992 538423 540893 542814 544623 546249 547222 547287 546499 544600 540843 534782 526825 517722 507909 497724 487850
61977 487850 478981 471181 463995 457078 450475 444426 439201 434971 431626 428875 426606 424888 423586 422447
61963 422447 421610 421471 421885 422190 422260 422784 424077 425461 426447 427694 429936 432725 435227 437717 441092 445351
61947 445351 449793 454510 460365 467511 475228 483436 493083 504530 516654 528240 539450 551231 563988
$$ packed form
62042A456666k7152l4218m0024m4980m9080n1623n2251n1556n0388m8998m7071
62031I59325m4365m1115l7730l4286l0547k6632k3246k0836j8870j6490j3778
62020F51430j1661j0626j0204r847r644r835j0206j0329j0007r300q389p567o984
62007E26831o304m981l048j229j07M16P53J163J756K622L647M462M714M308L420
61992E38423K470J921J809J626R73O5p88j899l757o061p957r103r813j0185r874
61977D87850q869p800p186o917o603o049n225m230l345k751k269j718j302j139
61963D22447q37j39M14L05P0N24J293J384R86J247K242K789K502K490L375M259
61947D45351M442M717N855P146P717Q208R647J1447J2124J1586J1210J1781J2757
$$ plain form
61934 563988 577602 592190 607965 624508 640886 656515 671498 686129 700417 714040 726462
61923 726462 737050 745205 750411 752237 750514 745645 738538 730094 720884 711326 701929 693244 685790 680098
61909 680098 676601 675368 676246 679495 686011 696556 710808 727374 744718 761785 777773 791675 802400
61896 802400 809365 812708 812783 809559 802697 792152 778553 762985 746517 729841 713193 696662 680805
61883 680805 666755 655327 646042 637517 628940 620646 613112 605950 598315 589882 580948 571885 563017 554897
61869 554897 548202 543322 540256 538765 538427 538769 539691 541563 544695 548887 553773 559318 565676 572839 580905
61854 580905 590443 602152 616220 632362 650330 670024 691264 713829 737649 762668 788704 815686
61842 815686 843705 872395 900458 926239 948618 966995 980754 989330 992669 991147 985149 975188
$$ packed form
61934E63988J3614J4588J5775J6543J6378J5629J4983J4631J4288J3623J2422
61923G26462J0588Q155N206J826j723m869p107q444r210r558r397q685p454n692
61909F80098l497j233Q78L249O516J0545J4252J6566J7344J7067J5988J3902J0725
61896H02400O965L343P5l224o862j0545j3599j5568j6468j6676j6648j6531j5857
61883F80805j4050j1428r285q525q577q294p534p162p635q433q934r063q868q120
61869E54897o695m880l066j491l38L42R22J872L132M192M886N545O358P163Q066
61854E80905R538J1709J4068J6142J7968J9694K1240K2565K3820K5019K6036K6982
61842H15686K8019K8690K8063K5781K2379J8377J3759Q576L339j522n998r961
$$ plain form
61830 975188 962245 947572 932310 917761 905707 897780 894609 896136 902494 913794 929155 946754
61818 946754 964922 982498 998077 1009774 1016099 1016580 1011297 1000345 983977 962730 937179 907957
61806 907957 876228 843641 811575 780740 751595 724620 699999 677486 656843 638046 620917
61795 620917 605145 590867 578736 568984 560862 553338 546082 539425 533623 528549 523936 519647 515810
61782 515810 512725 510408 508179 505167 501357 497688 494802 492153 488857 485069 481989 480495 480259 480244 479809
61767 479809 479181 479041 479789 481275 483169 485368 487854 490382 492736 495256 498640 503037 507764 512102 516020
61752 516020 519901 523873 527741 531279 534216 536186 537082 537344 537542 537656 537129 535574 533204 530524 527949
61737 527949 525823 524497 524092 524247 524371 524314 524687 526354 529551 533602 537535 540927 544075 547459 551197 555010
$$ packed form
61830I75188j2943j4673j5262j4549j2054p927l171J527O358J1300J5361J7599
61818I46754J8168J7576J5579J1697O325M81n283j0952j6368k1247k5551k9222
61806I07957l1729l2587l2066l0835k9145k6975k4621k2513k0643j8797j7129
61795F20917j5772j4278j2131r752q122p524p256o657n802n074m613m289l837
61782E15810l085k317k229l012l810l669k886k649l296l788l080j494k36j5m35
61767D79809o28j40P48J486J894K199K486K528K354K520L384M397M727M338L918
61752E16020L881L972L868L538K937J970Q96K62J98J14n27j555k370k680k575
61737E27949k126j326m05J55J24n7L73J667L197M051L933L392L148L384L738L813
$$ plain form
61721 555010 558517 561492 563908 565935 567964 570601 574341 579015 583646 587161 589261 590326 590464 589110
61707 589110 585789 580910 575467 570223 565494 561405 557847 554284 550178 545708 541698 538737 536625 534777
61693 534777 532850 530819 528666 526264 523622 521069 519004 517335 515340 512386 508741 505304 502496 499930
61679 499930 497374 495441 494809 495072 495005 493896 492196 490883 490516 490867 491171 490824 489997 489459 489658 490315 491144
61662 491144 492470 494655 497275 499496 501047 502263 503422 504665 506418 509109 512421 515440 517632 519162
61648 519162 520287 521062 521769 522996 525017 527523 530100 532569 534731 536281 537249 538091 539083 539859 539780 538553
61632 538553 536350 533505 530263 526685 522727 518415 513871 509064 503830 498336 493228 488944 485120 481161
61618 481161 477155 473718 471051 468771 466663 465078 464439 464721 465407 465620 464465 461691 458031 454463 451213
$$ packed form
61721E55010L507K975K416K027K029K637L740M674M631L515K100J065J38j354
61707E89110l321m879n443n244m729m089l558l563m106m470m010k961k112j848
61693E34777j927k031k153k402k642k553k065j669j995k954l645l437k808k566
61679D99930k556j933o32K63o7j109j700j313l67L51L04l47q27n38J99O57Q29
61662D91144J326K185K620K221J551J216J159J243J753K691L312L019K192J530
61648E19162J125P75P07J227K021K506K577K469K162J550R68Q42R92P76p9j227
61632E38553k203k845l242l578l958m312m544m807n234n494n108m284l824l959
61618D81161m006l437k667k280k108j585o39K82O86K13j155k774l660l568l250
$$ plain form
61603 451213 447826 444020 439895 435510 430880 426387 422552 419386 416454 413542 410691 407631 403867 399421
61589 399421 394922 390829 387007 383099 378930 374652 370936 368749 368268 368208 366986 364412 361464 358653 355668
61574 355668 352562 350023 348211 346445 344483 343055 342564 342211 341131 339659 338702 338399 338083 337201 335713 333970
61558 333970 332604 332189 332590 333011 332982 332897 333314 334247 335439 336786 338073 338830 338909 338847 339288 340377 341927 343694
61540 343694 345190 345761 345217 344098 343095 342628 343002 344306 345964 347130 347819 348922 350816 352776 354115
61525 354115 354924 355126 353814 350452 346088 342419 340116 338781 337971 337333 336227 334250 331977 330296 329178
61510 329178 327938 326542 325712 325723 325978 325978 325994 326374 326755 326410 325201 323778 322801 322199 321369 320014 318495 317153
61492 317153 315689 313733 311750 310636 310461 310421 310127 310117 310797 311720 312359 312802 313191 313239 312927 312973 313927 315347
$$ packed form
61603D51213l387l806m125m385m630m493l835l166k932k912k851l060l764m446
61589C99421m499m093l822l908m169m278l716k187m81o0j222k574k948k811k985
61574C55668l106k539j812j766j962j428m91l53j080j472r57l03l16q82j488j743
61558C33970j366m15M01M21k9q5M17R33J192J347J287P57P9o2M41J089J550J767
61540C43694J496N71n44j119j003m67L74J304J658J166O89J103J894J960J339
61525C54115Q09K02j312l362m364l669k303j335q10o38j106j977k273j681j118
61510C29178j240j396q30J1K55%J6L80L81l45j209j423r77o02q30j355j519j342
61492C17153j464j956j983j114j75m0k94j0O80R23O39M43L89M8l12M6R54J420
$$ plain form
61474 315347 316591 317863 319772 322245 324590 326238 326837 326133 324475 322973 322407 322346 322111 322115 323262 325363
61458 325363 327151 327817 327625 327030 326152 325271 324997 325572 326494 327120 327302 327289 327368 327674 328130 328485 328571 328454 328277
61439 328277 328189 328525 329679 331504 333254 334474 335597 337297 339639 342299 345167 348185 350915 352867 354070
61424 354070 354853 355336 355531 355668 355995 356557 357554 359452 362283 365273 367710 369691 371480 372714 373000 372814
61408 372814 372914 373198 372965 372028 370708 368968 366503 363606 361033 358962 356855 354419 351992 349881 347968
61393 347968 346142 344633 343778 343734 344340 345045 345295 345320 346100 348033 350147 351277 351525 351730 352045 352096 352188 353111
61375 353111 354766 356117 356655 356904 357349 357854 358406 359473 361120 362625 363531 364501 366534 369637 372733 374803
61359 374803 375909 377128 379468 382841 386310 389449 392954 397547 402937 408541 414716 422262 431004 439944
$$ packed form
61474C15347J244J272J909K473K345J648N99p04j658j502n66o1k35MJ147K101
61458C25363J788O66j92n95q78q81k74N75R22O26J82j3P9L06M56L55Q6j17j77
61439C28277q8L36J154J825J750J220J123J700K342K660K868L018K730J952J203
61424C54070P83M83J95J37L27N62R97J898K831K990K437J981J789J234K86j86
61408C72814J00K84k33r37j320j740k465k897k573k071k107k436k427k111j913
61393C47968j826j509q55m4O06P05K50K5P80J933K114J130K48K05L15N1R2R23
61375C53111J655J351N38K49M45N05N52J067J647J505R06R70K033L103L096K070
61359C74803J106J219K340L373L469L139L505M593N390N604O175P546Q742Q940
$$ plain form
61345 439944 448707 457796 467307 476365 484092 490351 495343 499282 502758 506680 511459 516656 521541 525548
61331 525548 528176 529164 528914 528135 526935 524828 521694 518107 514615 511329 508300 505686 503456 501482 499936
61316 499936 499003 498329 497549 497277 498585 501448 504723 507839 511484 516336 522238 529094 537506 547756 559038
61301 559038 570514 582527 595921 610550 625077 637828 647301 652443 653312 651325 648168 644468 639843
61288 639843 633905 626752 618727 610278 601966 594129 586569 578895 571160 563892 557596 552476 548605 546141
61274 546141 545287 546048 548019 550544 553288 556574 560854 565897 570831 575014 578551 581935 585522 589443 593721
61259 593721 598452 604084 611431 621046 632620 645298 658373 671208 682731 691815 698281 702915 706371
61246 706371 708596 709438 709117 707852 705574 702326 698474 694225 689427 684114 678887 674444 671042 668603 666948
$$ packed form
61345D39944Q763R089R511R058P727O259M992L939L476L922M779N197M885M007
61331E25548K628R88k50p79j200k107l134l587l492l286l029k614k230j974j546
61316D99936r33o74p80k72J308K863L275L116L645M852N902O856Q412J0250J1282
61301E59038J1476J2013J3394J4629J4527J2751R473N142Q69j987l157l700m625
61288F39843n938p153q025q449q312p837p560p674p735p268o296n120l871k464
61274E46141q54P61J971K525K744L286M280N043M934M183L537L384L587L921M278
61259E93721M731N632P347R615J1574J2678J3075J2835J1523R084O466M634L456
61246G06371K225Q42l21j265k278l248l852m249m798n313n227m443l402k439j655
$$ plain form
61231 666948 665615 663803 660971 657495 654542 653258 653963 655944 658133 660195 662820 666722 671630 676657
61217 676657 681367 685942 690534 695173 700180 705928 712166 718237 723996 729825 735654 740668 744198 746320
61203 746320 747452 747963 748387 749397 751349 754339 758838 765682 775239 787169 801176 817470 836308 857586
61189 857586 881034 906158 931675 955576 976129 992605 1005086 1014185 1021068 1027037 1032583 1037178
61177 1037178 1040219 1041852 1042664 1042936 1042366 1040262 1035985 1029473 1021277 1011860 1001156 989259 977074 965501
61163 965501 954235 942208 928972 914697 899076 881501 862428 843363 825199 807630 790506
61152 790506 774626 760762 748946 739246 732238 728064 725920 725161 726092 728849 732135 733826 732443 727592
61138 727592 719637 709622 699051 689051 679934 671816 665164 660342 657195 655514 655432 656970 659758 663701
$$ packed form
61231F66948j333j812k832l476k953j284P05J981K189K062K625L902M908N027
61217F76657M710M575M592M639N007N748O238O071N759N829N829N014L530K122
61203G46320J132N11M24J010J952K990M499O844R557J1930J4007J6294J8838K1278
61189H57586K3448K5124K5517K3901K0553J6476J2481R099O883N969N546M595
61177A037178L041J633Q12K72n70k104m277o512q196r417j0704j1897j2185j1573
61163I65501j1266j2027j3236j4275j5621j7575j9073j9065j8164j7569j7124
61152G90506j5880j3864j1816r700p008m174k144p59R31K757L286J691j383m851
61138G27592p955j0015j0571j0000r117q118o652m822l147j681q2J538K788L943
$$ plain form
61124 663701 669422 677600 688220 700906 715580 732421 751524 772948 796784 822947 851173 881256
61112 881256 912921 945413 977804 1009729 1041330 1072541 1103048 1132827 1161876 1189459 1214545
61101 1214545 1237092 1257900 1277052 1293479 1306179 1314713 1318325 1315856 1307123 1293284 1275335 1253272
61089 1253272 1227294 1198703 1168794 1137753 1105344 1071915 1038053 1004079 970557 938652 909279
61078 909279 882461 857928 835684 815697 797776 782039 768646 756888 745599 734817 725874 719439
61066 719439 714687 710837 708171 706878 706249 705792 705994 707215 709029 711343 714908 719971 725702 731733 738841
61051 738841 747265 755939 764510 774576 787595 802915 819248 836736 856049 876783 898414 921745
61039 921745 947710 975629 1004266 1033768 1064978 1097631 1130766 1164271 1198555 1233432 1268733
$$ packed form
61124F63701N721Q178J0620J2686J4674J6841J9103K1424K3836K6163K8226L0083
61112H81256L1665L2492L2391L1925L1601L1211L0507K9779K9049K7583K5086
61101A214545K2547K0808J9152J6427J2700Q534L612k469q733j3839j7949k2063
61089A253272k5978k8591k9909l1041l2409l3429l3862l3974l3522l1905k9373
61078I09279k6818k4533k2244j9987j7921j5737j3393j1758j1289j0782q943o435
61066G19439m752l850k666j293o29m57K02J221J814K314L565N063N731O031P108
61051G38841Q424Q674Q571J0066J3019J5320J6333J7488J9313K0734K1631K3331
61039I21745K5965K7919K8637K9502L1210L2653L3135L3505L4284L4877L5301
$$ plain form
61028 1268733 1305281 1343924 1384352 1426129 1469892 1516125 1563644 1610663 1656521 1701262 1744982
61017 1744982 1789078 1836879 1891374 1953538 2024174 2105440 2198546 2301875 2413838 2536160 2672589
61006 2672589 2827155 3006931 3224225 3492512 3822461 4225782 4720134 5325517 6060133
60997 6060133 6948557 8032679 9365274 10991818 12942702 15224380 17769302 20357894
60989 20357894 22613000 24145564 24776103 24644396 24109296 23544366 23210518 23251586 23703022
60980 23703022 24434540 25107550 25277694 24622676 23114333 20993083 18594997 16195600 13962883
60971 13962883 11982342 10284431 8858705 7671726 6687214 5873495 5200520 4640417 4172227
60962 4172227 3781271 3453756 3175572 2935561 2726049 2540204 2371959 2218288 2078556
$$ packed form
61028A268733L6548L8643M0428M1777M3763M6233M7519M7019M5858M4741M3720
61017A744982M4096M7801N4495O2164P0636Q1266R3106J03329J11963J22322J36429
61006B672589J54566J79776K17294K68287L29949M03321M94352O05383P34616
60997F060133Q88424J084122J332595J626544J950884K281678K544922K588592
60989B0357894K255106J532564O30539j31707n35100n64930l33848M1068M51436
60980B3703022P31518O73010J70144o55018j508343k121250k398086k399397k232717
60971A3962883j980541j697911j425726j186979r84512q13719o72975n60103m68190
60962D172227l90956l27515k78184k40011k09512j85845j68245j53671j39732
$$ plain form
60953 2078556 1951490 1835007 1728555 1633033 1548458 1473764 1408465 1352097 1302102 1254619 1207579
60942 1207579 1161232 1115822 1070904 1027082 986205 949160 914932 882295 851092 821584 793878
60931 793878 768303 745184 723987 703702 684187 666133 649731 634441 620076 607012 595264
60920 595264 584372 574214 564954 556330 548054 540732 535179 530857 526298 521219 516949 514494 513308 512342
60906 512342 511287 510316 509488 508950 509101 510153 511924 514218 516901 519646 522161 524659 527438 530078 531810
60891 531810 532623 533172 533533 532983 531233 528996 526897 524470 520714 515279 508798 502290 496397 490940 485181
60876 485181 478743 472145 466110 460622 455144 449522 444066 438950 434253 430473 428184 427137 426457 425868 426046
60861 426046 427544 430062 433104 436839 441837 448257 455595 463115 470377 477454 484641 491865 498575 504411
$$ packed form
60953B078556j27066j16483j06452r5522q4575p4694o5299n6368m9995m7483m7040
60942A207579m6347m5410m4918m3822m0877l7045l4228l2637l1203k9508k7706
60931G93878k5575k3119k1197k0285j9515j8054j6402j5290j4365j3064j1748
60920E95264j0892j0158r260q624q276p322n553m322m559n079m270k455j186r66
60906E12342j055r71q28n38J51J052J771K294K683K745K515K498K779K640J732
60891E31810Q13N49L61n50j750k237k099k427l756n435o481o508n893n457n759
60876D85181o438o598o035n488n478n622n456n116m697l780k289j047o80n89J78
60861D26046J498K518L042L735M998O420P338P520P262P077P187P224O710N836
$$ plain form
60847 504411 509735 515175 520896 526762 532894 539377 545530 550131 552428 552446 550341 546128 540261 533876 528143
60832 528143 523612 520290 517939 516131 514308 512114 509568 506854 504088 501248 498165 494629 490687 486727
60818 486727 482965 478973 474072 468194 462015 456190 450785 445542 440438 435730 431529 427539 423328 418862
60804 418862 414643 411158 408337 405810 403576 402006 401208 400829 400584 400509 400589 400658 400858 401608 402821 403740 403981
60787 403981 404239 405480 407890 411080 414868 419235 423912 428628 433557 438957 444623 450284 456275 463183
60773 463183 470875 478431 485007 490441 495144 499864 505401 512147 519876 528201 536984 546042 554773 562512
60759 562512 569073 574660 579547 584117 588813 593663 598245 602479 606913 611794 616446 620233 623582 627363
60745 627363 631732 636493 642082 649097 657054 664711 671606 678332 685296 692258 699296 707219 716653 727503
$$ packed form
60847E04411N324N440N721N866O132O483O153M601K297J8k105m213n867o385n733
60832E28143m531l322k351j808j823k194k546k714k766k840l083l536l942l960
60818D86727l762l992m901n878o179n825n405n243n104m708m201l990m211m466
60804D18862m219l485k821k527k234j570p98l79k45p5Q0O9K00P50J213R19K41
60787D03981K58J241K410L190L788M367M677M716M929N400N666N661N991O908
60773D63183P692P556O576N434M703M720N537O746P729Q325Q783R058Q731P739
60759E62512O561N587M887M570M696M850M582M234M434M881M652L787L349L781
60745F27363M369M761N589P015P957P657O895O726O964O962P038P923R434J0850
$$ plain form
60731 727503 739697 753753 770136 788613 808726 830490 854211 879911 907250 935742 964774
60720 964774 993639 1021714 1048400 1072838 1093970 1110971 1123344 1130599 1132368 1128990 1121507 1110696
60708 1110696 1096422 1078294 1056755 1033049 1008156 982163 954862 926691 898764 871963 846261
60697 846261 821032 795790 770434 745070 720070 696227 674317 654365 635681 617711 600491
60686 600491 584262 569152 555402 543330 532820 523289 514358 506104 498459 491032 483886 477832 473429
60673 473429 470177 467216 464313 461627 459041 456381 453905 451958 450441 449169 448321 447908 447206 445428 442624
60658 442624 439321 435653 431643 428031 425893 425474 426076 427017 428127 429438 431040 433213 436167 439743 443714
60643 443714 448074 452577 456456 459186 461153 462899 464163 464488 464313 464563 465439 466542 467920 469934 472318
$$ packed form
60731G27503J2194J4056J6383J8477K0113K1764K3721K5700K7339K8492K9032
60720I64774K8865K8075K6686K4438K1132J7001J2373P255J769l378p483j0811
60708A110696j4274j8128k1539k3706k4893k5993k7301k8171k7927k6801k5702
60697H46261k5229k5242k5356k5364k5000k3843k1910j9952j8684j7970j7220
60686F00491j6229j5110j3750j2072j0510r531q931q254p645p427p146o054m403
60673D73429l252k961k903k686k586k660k476j947j517j272q48m13p02j778k804
60658D42624l303l668m010l612k138m19O02R41J110J311J602K173K954L576L971
60643D43714M360M503L879K730J967J746J264L25j75K50Q76J103J378K014K384
$$ plain form
60628 472318 474415 476278 478495 480932 482711 483486 483745 483710 482973 481455 479726 478016 475719 472221 467545
60613 467545 462011 455974 450106 445114 440864 436500 431685 427050 423249 420304 418053 416440 415110 413552
60599 413552 411982 411281 411643 412031 411451 410133 408961 408343 408132 408202 408619 409567 411391 414281 417705 420604 422361
60582 422361 423128 423121 422273 420807 419455 418698 418375 418330 418845 420032 421392 422433 423358 424873 427759 432748 440137
60565 440137 449290 459206 469912 482492 497319 513111 528294 542481 555789 567440 576071 581028
60553 581028 582400 580025 573531 563507 551909 541026 532321 526201 522341 520140 519250 519826 522155 526215
60539 526215 531836 539164 548619 560398 574216 589411 605082 620170 633638 644584 652167 655732
60527 655732 655207 651303 645146 637776 629996 622386 615347 609323 605033 603090 603106 603548 602883 600845 598406
$$ packed form
60628D72318K097J863K217K437J779P75K59l5p37j518j729j710k297l498m676
60613D67545n534o037n868m992m250m364m815m635l801k945k251j613j330j558
60599D13552j570p01L62L88n80j318j172o18k11P0M17R48J824K890L424K899J757
60582D22361P67pq48j466j352p57l23m5N15J187J360J041R25J515K886M989P389
60565D40137R153R916J0706J2580J4827J5792J5183J4187J3308J1651Q631M957
60553E81028J372k375o494j0024j1598j0883q705o120l860k201q90N76K329M060
60539E26215N621P328R455J1779J3818J5195J5671J5088J3468J0946P583L565
60527F55732n25l904o157p370p780p610p039o024m290j943J6M42o65k038k439
$$ plain form
60512 598406 596711 596332 597338 599604 602834 606456 609826 612666 615267 618113 621392 625182 630144 637553
60498 637553 648389 662827 681031 703957 732678 767229 806875 851253 900371 953458 1008703
60487 1008703 1064176 1117951 1166916 1206467 1232309 1242364 1236700 1216309 1182590 1137633 1084240
60476 1084240 1025631 965249 906389 851436 801438 756628 717133 682966 653663 628321 605983
60465 605983 585945 567962 552287 539168 528137 518110 508359 499049 490673 483366 476992 471427 466380
60452 466380 461314 456006 450942 446757 443448 440537 437822 435516 433638 431709 429266 426453 423891 421964
60438 421964 420426 418806 417060 415573 414583 413990 413828 414386 415549 416503 416597 416104 415553 414749 413265 411582 410715
60421 410715 410701 410456 409362 408042 407271 406943 406698 406850 408033 410257 412892 415400 417729 420118 422713 425286
$$ packed form
60512E98406j695l79J006K266L230L622L370K840K601K846L279L790M962P409
60498F37553J0836J4438J8204K2926K8721L4551L9646M4378M9118N3087N5245
60487A008703N5473N3775M8965L9551K5842J0055n664k0391l3719m4957n3393
60476A084240n8609o0382n8860n4953m9998m4810l9495l4167k9303k5342k2338
60465F05983k0038j7983j5675j3119j1031j0027r751r310q376p307o374n565n047
60452D66380n066n308n064m185l309k911k715k306j878j929k443k813k562j927
60438D21964j538j620j746j487r90n93j62N58J163R54R4m93n51q04j484j683q67
60421D10715j4k45j094j320p71l28k45J52J183K224K635K508K329K389K595K573
$$ plain form
60405 425286 427287 428377 428832 429103 429175 428885 428685 429353 430878 432355 433169 433649 434361 435419 436744 438409 440431
60388 440431 442659 445063 447607 449833 451222 452097 453415 455460 457458 458769 459703 460857 462365 464199 466480
60373 466480 469044 471320 473059 474633 476268 477636 478549 479383 480394 481290 481902 482542 483298 483702 483623 483704 484290
60356 484290 484666 484059 482850 482098 482400 483802 486196 489046 491319 492488 493306 494974 497949 502135 507610
60341 507610 514382 521787 528899 535292 540887 545433 548728 550875 551680 550325 546400 540845 535097 529635
60327 529635 524103 518544 513577 509510 506031 502808 499813 497057 494427 491743 488784 485549 482649 480915
60313 480915 480370 480201 480086 480720 482598 485214 488149 492048 497594 504389 511914 520783 531862 544869 559206
60298 559206 575430 594174 613877 631386 644932 654929 661665 663867 660391 652151 641584 630908
$$ packed form
60405D25286K001J090M55K71P2k90k00O68J525J477Q14M80P12J058J325J665K022
60388D40431K228K404K544K226J389Q75J318K045J998J311R34J154J508J834K281
60373D66480K564K276J739J574J635J368R13Q34J011Q96O12O40P56M04p9Q1N86
60356D84290L76o07j209p52L02J402K394K850K273J169Q18J668K975M186N475
60341E07610O772P405P112O393N595M546L295K147Q05j355l925n555n748n462
60327E29635n532n559m967m067l479l223k995k756k630k684k959l235k900j734
60313D80915n45j69j15O34J878K616K935L899N546O795P525Q869J1079J3007J4337
60298E59206J6224J8744J9703J7509J3546R997O736K202l476q240j0567j0676
$$ plain form
60286 630908 621387 613457 606827 600850 595175 589786 584396 578506 572157 565917 559819 553032 544954 536080
60272 536080 527417 519484 512169 505179 498345 491828 486194 481970 479051 476810 474732 472560 469980 466793
60258 466793 463428 460707 459038 458280 458287 458920 459613 459682 459219 458992 459342 459841 460143 460437 460779 460764 460305 460155 461202
60239 461202 463575 466703 469768 471903 472491 471767 470788 470521 471244 472897 475449 478553 481361 483260 484617
60224 484617 486361 488972 492135 495236 497880 500076 502219 504893 508503 512998 517955 522903 527728 532931
60210 532931 539339 547274 556054 564592 572436 579903 587309 594582 601668 608864 616426 624137 631394 637623
60196 637623 642557 646348 649487 652442 655296 657832 659842 661155 661465 660483 658225 654933 650740 645656 639815
60181 639815 633455 626771 620033 613781 608567 604521 601306 598344 594930 590496 585190 579989 575780 572499
$$ packed form
60286F30908r521p930o630n977n675n389n390n890o349o240o098o787q078q874
60272E36080q663p933p315o990o834o517n634m224k919k241k078k172k580l187
60258D66793l365k721j669p58PO33O93O9m63k27L50M99L02K94L42j5m59j50J047
60239D61202K373L128L065K135N88p24r79k67P23J653K552L104K808J899J357
60224D84617J744K611L163L101K644K196K143K674L610M495M957M948M825N203
60210E32931O408P935Q780Q538P844P467P406P273P086P196P562P711P257O229
60196F37623M934L791L139K955K854K536K010J313L10r82k258l292m193n084n841
60181F39815o360o684o738o252n214m046l215k962l414m434n306n201m209l281
$$ plain form
60167 572499 569539 566720 564249 562019 559705 557542 556281 556187 556637 556896 556866 556927 557459 558636 560299 561922
60151 561922 563023 563672 564269 564888 565277 565503 566042 567099 568322 569407 570642 572633 575720 579776 584383 589132
60135 589132 593952 599160 605051 611552 618399 625345 631874 637103 640538 642740 644667 646512 647803 648514
60121 648514 649265 650407 651683 653005 654853 657515 660491 663072 665183 667310 669727 672021 673310 672990 671448
60106 671448 669855 668889 667882 665688 662165 658127 654007 649451 644287 639004 633953 628855 623598 618832
60092 618832 615202 612497 610090 607878 606257 605447 605345 605818 606680 607580 608399 609763 612664 617348 622723 627001
60076 627001 628969 628762 627506 626234 625081 623419 620548 616188 610601 604509 598733 593543 588429 582818
60062 582818 576913 571456 566730 562246 557443 552253 546847 541243 535460 529833 524917 521081 518289 516221
$$ packed form
60167E72499k960k819k471k230k314k163j261r4M50K59l0O1N32J177J663J623
60151E61922J101O49N97O19L89K26N39J057J223J085J235J991L087M056M607M749
60135E89132M820N208N891O501O847O946O529N229L435K202J927J845J291P11
60121F48514P51J142J276J322J848K662K976K581K111K127K417K294J289l20j542
60106F71448j593r66j007k194l523m038m120m556n164n283n051n098n257m766
60092F18832l630k705k407k212j621q10j02M73Q62R00Q19J364K901M684N375M278
60076F27001J968k07j256j272j153j662k871m360n587o092n776n190n114n611
60062E82818n905n457m726m484m803n190n406n604n783n627m916l836k792k068
$$ plain form
60048 516221 514628 513594 513400 514136 515666 518078 521833 527224 533877 541070 548353 555597 562732 569746 576645
60033 576645 583039 588093 591313 593125 594193 594455 593378 590912 587497 583205 577526 570114 561223 551354
60019 551354 540952 530528 520605 511385 502689 494274 486105 478483 472055 467396 464270 461618 458671 455722
60005 455722 453464 451999 451057 450738 451343 452780 454802 457585 461400 465998 470977 476466 482718 489361 495802
59990 495802 502110 508633 515009 520473 524965 529084 533086 536790 540265 543615 546255 547413 547248 546435 544807
59975 544807 541539 536659 531157 525524 519455 513081 507207 502043 497070 492493 489454 488148 487016 484669
59961 484669 481578 479107 477772 477309 477594 478487 479354 479697 479958 481051 483306 486263 489140 491256 492486 493625
59945 493625 495748 498967 502365 505332 508140 510955 513165 514154 513961 512731 510373 507265 504364 501938 498993
$$ packed form
60048E16221j593j034j94P36J530K412L755N391O653P193P283P244P135P014O899
60033E76645O394N054L220J812J068K62j077k466l415m292n679p412q891r869
60019E51354j0402j0424r923r220q696q415q169p622o428m659l126k652k947k949
60005D55722k258j465r42l19O05J437K022K783L815M598M979N489O252O643O441
59990D95802O308O523O376N464M492M119M002L704L475L350K640J158j65q13j628
59975E44807l268m880n502n633o069o374n874n164m973m577l039j306j132k347
59961D84669l091k471j335m63K85Q93Q67L43K61J093K255K957K877K116J230J139
59945D93625K123L219L398K967K808K815K210R89j93j230k358l108k901k426k945
$$ plain form
59930 498993 494810 490348 487246 485898 485304 484447 483067 481389 479801 478692 478177 478087 478405 479223 480148 480381
59914 480381 479781 479244 479604 480759 482300 484299 486903 489761 492485 495202 498075 500821 503228 505709 508734
59899 508734 512104 515309 518251 521182 524297 527752 531679 535920 540296 545369 552189 560852 569932 577800
59885 577800 583885 588312 591225 593113 594978 597430 600193 603048 606461 610619 614727 618151 621467 625342
59871 625342 628970 630706 629818 626621 621390 614247 605887 597312 588903 580601 572869 566497 561513 557173
59857 557173 553119 549766 547436 545842 544703 544308 545170 547386 550578 554412 559131 565445 573675 583199 593293
59842 593293 604299 616915 630066 640599 645987 646717 645294 643598 642139 641279 641861 644403 648287 651880
59828 651880 653237 651063 645500 637786 628904 618975 608146 597254 586970 576941 566550 556052 546226
$$ packed form
59930D98993m183m462l102j348n94q57j380j678j588j109n15r0L18Q18R25K33
59914D80381o00n37L60J155J541J999K604K858K724K717K873K746K407K481L025
59899E08734L370L205K942K931L115L455L927M241M376N073O820Q663R080P868
59885E77800O085M427K913J888J865K452K763K855L413M158M108L424L316L875
59871F25342L628J736q88l197n231p143q360q575q409q302p732o372m984m340
59857E57173m054l353k330j594j139l95Q62K216L192L834M719O314Q230R524J0094
59842E93293J1006J2616J3151J0533N388P30j423j696j459q60N82K542L884L593
59828F51880J357k174n563p714q882r929j0829j0892j0284j0029j0391j0498r826
$$ plain form
59815 546226 537360 529300 522162 516235 511436 507422 503980 500842 497571 494162 491290 489424 488198 487159
59801 487159 486467 486209 485758 484674 483594 483266 483250 482557 481172 479912 479070 478215 477106 475938 474777 473513
59785 473513 472216 470880 469104 466678 464093 461853 459774 457648 456061 455623 455941 456263 456648 457484 458358 458517
59769 458517 458097 457749 457427 456778 456476 457876 461268 465569 469699 473306 476277 478663 481097 484287 488091
59754 488091 491973 496164 501291 507005 512246 516917 522021 527962 533854 538846 543102 547044 550532 553186
59740 553186 554886 555708 556004 556572 558032 559993 561587 562712 563877 564963 565287 565015 565336 566894 569023 570897
59724 570897 572495 573987 575105 575710 576334 577573 579437 581660 584133 586679 588851 590314 591154 591707 592404
59709 592404 593745 595946 598584 601071 603365 605711 607892 609433 610434 611436 612526 613352 614044 615298 617461
$$ packed form
59815E46226q866q060p138n927m799m014l442l138l271l409k872j866j226j039
59801D87159o92k58m51j084j080l28j6o93j385j260q42q55j109j168j161j264
59785D73513j297j336j776k426k585k240k079k126j587m38L18L22L85Q36Q74J59
59769D58517m20l48l22o49l02J400L392M301M130L607K971K386K434L190L804
59754D88091L882M191N127N714N241M671N104N941N892M992M256L942L488K654
59740E53186J700Q22K96N68J460J961J594J125J165J086L24k72L21J558K129J874
59724E70897J598J492J118O05O24J239J864K223K473K546K172J463Q40N53O97
59709E92404J341K201K638K487K294K346K181J541J001J002J090Q26O92J254K163
$$ plain form
59694 617461 620281 623586 627452 631633 635541 638854 641440 642740 642110 639872 637174 634710 632310 629854
59680 629854 627712 626112 624909 624136 623939 623817 622771 620435 617286 613607 609157 604050 598991 594257 589333
59665 589333 583998 578966 574940 571728 568783 565997 563519 561352 559607 558710 558950 560157 562063 564593 567616
59650 567616 570845 574125 577437 580542 583090 585036 586382 586540 584717 581055 576689 572477 568332 563990
59636 563990 559758 556150 553255 550791 548406 545824 543036 540422 538374 536901 535868 535328 535116 534536 533155
59621 533155 531544 530444 529608 528338 526751 525389 523909 521519 518582 516363 515077 513524 510998 508294
59607 508294 506501 505924 506573 508514 511224 513648 515398 517012 518643 519520 519151 518049 516773 515199 513260
59592 513260 511440 509970 508399 506548 505083 504549 504586 504581 504404 504082 503500 502826 502524 502556 502368 501906 501743 501814 501105
$$ packed form
59694F17461K820L305L866M181L908L313K586J300o30k238k698k464k400k456
59680F29854k142j600j203p73j97j22j046k336l149l679m450n107n059m734m924
59665E89333n335n032m026l212k945k786k478k167j745q97K40J207J906K530L023
59650E67616L229L280L312L105K548J946J346J58j823l662m366m212m145m342
59636E63990m232l608k895k464k385k582k788k614k048j473j033n40k12n80j381
59621E33155j611j100q36j270j587j362j480k390k937k219j286j553k526k704
59607E08294j793n77O49J941K710K424J750J614J631Q77l69j102j276j574j939
59592E13260j820j470j571j851j465n34L7nj77l22n82o74l02L2j88m62j63P1p09
$$ plain form
59573 501105 499089 496530 494271 492169 489862 487647 485888 484333 482716 481345 480475 479798 479142 479005 479815
59558 479815 481278 482937 484632 486004 486410 485903 485519 486015 487047 488055 489143 490558 492175 494029 496521
59543 496521 499536 502316 504805 508169 513368 520229 528626 539469 553695 571351 592491 617377 644121
59530 644121 667106 679991 680649 672350 660448 648990 640012 634300 632001 632998 637032 643286 650188 656155
59516 656155 660464 663110 664158 663585 661327 657083 650485 641813 631957 621343 609570 596635 583767
59503 583767 572331 562500 553656 545475 537871 530489 523193 516729 512143 509676 508719 508497 508341 507784 506942
59488 506942 506437 506535 506869 507387 508806 511514 514636 516950 518268 519385 521120 523921 527895 532719 537971
59473 537971 543848 550878 558629 565618 571008 575448 579688 583408 586140 588277 590201 591366 591346 590992 591519
$$ packed form
59573E01105k016k559k259k102k307k215j759j555j617j371q70o77o56j37Q10
59558D79815J463J659J695J372M06n07l84M96J032J008J088J415J617J854K492
59543D96521L015K780K489L364N199O861Q397J0843J4226J7656K1140K4886K6744
59530F44121K2985J2885O58q299j1902j1458q978n712k299R97M034O254O902N967
59516F56155M309K646J048n73k258m244o598q672r856j0614j1773j2935j2868
59503E83767j1436r831q844q181p604p382p296o464m586k467r57k22j56n57q42
59488E06942n05R8L34N18J419K708L122K314J318J117J735K801L974M824N252
59473E37971N877P030P751O989N390M440M240L720K732K137J924J165k0l54N27
$$ plain form
59458 591519 593099 595386 598759 603943 610967 619563 630022 642624 656648 670905 684780 697963 709904
59445 709904 720504 730621 740720 749544 755198 756974 755032 749022 738465 724223 708321 692503
59433 692503 677843 665275 655201 646825 638997 631589 625218 620109 616162 613590 612506 612489 613647 617295
59419 617295 624331 633754 644319 656807 672770 691674 711423 731425 752845 775929 799550 823673
59407 823673 849285 874383 892174 895508 882574 857513 826855 796630 771327 753133 741851 736704
59395 736704 738114 746456 758814 768211 767236 752797 727614 697557 667792 640907 617554 597729
59383 597729 581232 567659 556674 548225 542154 537879 534771 532589 531230 530355 529696 529415 529736 530553 531745
59368 531745 533485 535737 537950 539777 541653 544080 546890 549863 553499 558272 563570 568358 572605 577222
$$ packed form
59458E91519J580K287L373N184P024Q596J0459J2602J4024J4257J3875J3183J1941
59445G09904J0600J0117J0099Q824N654J776j942o010j0557j4242j5902j5818
59433F92503j4660j2568j0074q376p828p408o371n109l947k572j084j7J158L648
59419F17295P036R423J0565J2488J5963J8904J9749K0002K1420K3084K3621K4123
59407H23673K5612K5098J7791L334j2934k5061l0658l0225k5303j8194j1282n147
59395G36704J410Q342J2358R397r75j4439k5183l0057k9765k6885k3353j9825
59383E97729j6497j3573j0985q449o071m275l108k182j359q75o59k81L21Q17J192
59368E31745J740K252K213J827J876K427K810K973L636M773N298M788M247M617
$$ plain form
59354 577222 582900 589941 598903 610251 623532 637893 653470 671246 691555 713608 736602 760316
59342 760316 784439 808170 830783 851947 871221 887806 901078 910965 917690 921417 922140 919607 913519
59329 913519 904090 892148 878334 862642 845169 826817 808661 791079 774151 758396 744357 731924
59317 731924 720825 711328 703603 696863 690081 683229 676909 671173 665673 660561 656152 652019 647602 643520
59303 643520 641157 641020 642529 645349 649806 656050 663834 673281 685048 699631 716970 736170 754529
59290 754529 767387 770635 763896 750504 734455 718206 703000 689711 678844 670584 665153 662555
59278 662555 662075 662926 665303 669928 676789 685359 695809 708762 723871 739879 756234 773406 791346
59265 791346 808752 824256 837423 848231 856351 861278 862533 859676 852724 842521 830047 815552
$$ packed form
59354E77222N678P041Q962J1348J3281J4361J5577J7776K0309K2053K2994K3714
59342G60316K4123K3731K2613K1164J9274J6585J3272R887O725L727P23k533o088
59329I13519r429j1942j3814j5692j7473j8352j8156j7582j6928j5755j4039j2433
59317G31924j1099r497p725o740o782o852o320n736n500n112m409m133m417m082
59303F43520k363j37J509K820M457O244P784R447J1767J4583J7339J9200J8359
59290G54529J2858L248o739j3392j6049j6249j5206j3289j0867q260n431k598
59278F62555m80Q51K377M625O861Q570J0450J2953J5109J6008J6355J7172J7940
59265G91346J7406J5504J3167J0808Q120M927J255k857o952j0203j2474j4495
$$ plain form
59253 815552 799084 781504 764074 747367 731576 717440 705556 695125 684843 674992 667175 662013
59241 662013 658570 656179 655292 656179 658238 661068 664934 669716 674628 679405 684684 690678 696472 700987 703684
59226 703684 704130 702028 697979 693055 687202 679137 668241 655517 642414 629724 617935 607452 598044
59213 598044 589070 580670 573674 568128 563089 558240 554432 552144 550566 548766 546687 544485 542021 539592
59199 539592 538151 538180 539163 540509 542040 543361 543968 544385 545971 549099 552762 556441 560989 566963 573440
59184 573440 579424 585288 591848 598912 605719 612067 618193 624214 630284 636579 642593 647355 650929 654872
59170 654872 660572 667980 676395 685570 695446 705813 716853 729148 742534 755821 768139 779525
59158 779525 789689 797428 802044 804261 804868 803406 799001 791554 781361 768563 753910 739089 725324
$$ packed form
59253H15552j6468j7580j7430j6707j5791j4136j1884j0431j0282r851p817n162
59241F62013l443k391q87Q87K059K830L866M782M912M777N279N994N794M515K697
59226G03684M46k102m049m924n853q065j0896j2724j3103j2690j1789j0483r408
59213E98044q974q400o996n546n039m849l808k288j578j800k079k202k464k429
59199E39592j441K9R83J346J531J321O07M17J586L128L663L679M548N974O477
59184E73440N984N864O560P064O807O348O126O021O070O295O014M762L574L943
59170F54872N700P408Q415R175R876J0367J1040J2295J3386J3287J2318J1386
59158G79525J0164P739M616K217O07j462m405p447j0193j2798j4653j4821j3765
$$ plain form
59145 725324 712379 699727 687788 677124 667347 657845 648863 640936 633991 627867 622943 619292 615986
59132 615986 612324 609135 607764 608191 609123 609617 609790 610272 611692 614437 618286 622530 626878 631801 637715
59117 637715 644507 652225 661486 672646 685262 698756 712784 726543 738859 749650 760286 771650
59105 771650 782754 792130 799688 806264 812125 816967 820738 823443 824571 823625 820883 817036 812540 807780
59091 807780 803215 798811 794069 789173 785276 782997 781451 779456 776772 773383 768610 761875 753603 744426
59077 744426 734290 723216 712090 701674 691633 681551 672083 663932 656457 648597 640614 633621 627756
59064 627756 622130 616381 611109 606828 603423 600642 598310 596086 593670 591172 588800 586382 583654 580745
59050 580745 577966 575419 573189 571505 570388 569589 569066 568978 569029 568643 567997 567969 568765 569627 570262 571356 573105
$$ packed form
59145G25324j2945j2652j1939j0664r777r502q982p927o945o124m924l651l306
59132F15986l662l189j371M27R32M94J73M82J420K745L849M244M348M923N914
59117F37715O792P718R261J1160J2616J3494J4028J3759J2316J0791J0636J1364
59105G71650J1104R376P558O576N861M842L771K705J128r46k742l847m496m760
59091H07780m565m404m742m896l897k279j546j995k684l389m773o735q272r177
59077G44426j0136j1074j1126j0416j0041j0082r468q151p475p860p983o993n865
59064F27756n626n749n272m281l405k781k332k224k416k498k372k418k728k909
59050E80745k779k547k230j684j117p99n23q8N1l86o46k8P96Q62O35J094J749
$$ plain form
59033 573105 574525 575038 575555 577039 579079 580911 582871 585738 589518 593972 599595 606991 615894 625694 636275
59018 636275 647536 658814 669634 680212 690475 699421 706265 711272 714659 715784 714423 711770 709148
59005 709148 706713 704475 703420 704329 706537 709185 712794 718298 725415 733341 742081 751696 761162 769497
58991 769497 777162 784832 791558 795859 797965 799327 800354 800153 798041 793840 787211 778261 768457 759521
58977 759521 751797 744926 739496 736489 735721 736446 739071 744608 752779 762273 772656 784468 797646 811412
58963 811412 825556 840433 855791 870954 885915 900877 914998 926971 936500 943750 947662 946529
58951 946529 940133 929806 916491 900330 882080 863252 844689 826404 808876 792943 778305 763693
58939 763693 748901 735310 724034 714812 707024 700579 695353 690752 686303 681942 677532 672886 668335
$$ packed form
59033E73105J420N13N17J484K040J832J960K867L780M454N623P396Q903R800J0581
59018F36275J1261J1278J0820J0578J0263Q946O844N007L387J125j361k653k622
59005G09148k435k238j055R09K208K648L609N504P117P926Q740R615R466Q335
58991G69497P665P670O726M301K106J362J027k01k112m201o629q950r804q936
58977G59521p724o871n430l007p68P25K625N537Q171R494J0383J1812J3178J3766
58963H11412J4144J4877J5358J5163J4961J4962J4121J1973R529P250L912j133
58951I46529o396j0327j3315j6161j8250j8828j8563j8285j7528j5933j4638j4612
58939G63693j4792j3591j1276r222p788o445n226m601m449m361m410m646m551
$$ plain form
58926 668335 664469 661282 658321 655629 653664 652352 651059 649496 647946 646677 645804 645535 645912 646592 647465
58911 647465 648981 651235 653420 655054 657015 660378 664889 669730 675125 681993 690586 700674 712485 726187
58897 726187 740989 755959 771234 787269 803569 819399 835059 851200 867731 884840 904167
58886 904167 927195 953183 980395 1008530 1037942 1067173 1093517 1115798 1134509 1149455 1159415 1164149
58874 1164149 1164561 1160633 1151057 1135250 1114189 1089163 1061338 1032549 1004757 978523 953475 930224
58862 930224 910118 893159 877897 863506 850286 838150 826381 814963 804425 794301 783487
58851 783487 772205 761792 752414 742888 732983 723994 716569 709738 702573 695214 687877 680357 672916 666154
58837 666154 659788 652998 646084 640164 635191 630018 624554 619975 616566 613193 609278 605450 601966 598400
$$ packed form
58926F68335l866l187k961k692j965j312j293j563j550j269q73k69L77O80Q73
58911F47465J516K254K185J634J961L363M511M841N395O868Q593J0088J1811J3702
58897G26187J4802J4970J5275J6035J6300J5830J5660J6141J6531J7109J9327
58886I04167K3028K5988K7212K8135K9412K9231K6344K2281J8711J4946R960M734
58874A164149M12l928r576j5807k1061k5026k7825k8789k7792k6234k5048k3251
58862I30224k0106j6959j5262j4391j3220j2136j1769j1418j0538j0124j0814
58851G83487j1282j0413r378r526r905q989p425o831p165p359p337p520p441o762
58837F66154o366o790o914n920m973n173n464m579l409l373l915l828l484l566
$$ plain form
58823 598400 595298 594188 595307 597099 598551 600368 603308 607160 611935 618304 626090 633875 640731 646920
58809 646920 652517 656988 660534 664075 667445 669443 670137 671119 672812 673544 672213 669958 668189 666706 664829
58794 664829 662642 659923 655420 648570 640739 633660 627718 622622 618521 615504 613152 611470 611228 612710
58780 612710 615176 618153 622037 626872 631788 636289 640779 645230 648601 650146 650029 648165 643926 637612
58766 637612 630737 624156 617253 609659 602356 596268 591099 586299 582045 578615 575966 574486 574913 576998
58752 576998 579503 581990 585272 589669 594233 598143 601519 604475 606874 609444 613548 619322 625527 631598
58738 631598 638270 645784 653209 660009 666611 672956 678247 682571 687006 691688 695694 699257 703949 709998
58724 709998 715565 719471 722587 725662 727877 728561 728410 728082 727524 727543 729903 734827 740418 745578 751386 758512
$$ packed form
58823E98400l102j110J119J792J452J817K940L852M775O369P786P785O856O189
58809F46920N597M471L546L541L370J998O94R82J693P32j331k255j769j483j877
58794F64829k187k719m503o850p831p079n942n096m101l017k352j682k42J482
58780F12710K466K977L884M835M916M501M490M451L371J545j17j864m239o314
58766F37612o875o581o903p594p303o088n169m800m254l430k649j480M27K085
58752E76998K505K487L282M397M564L910L376K956K399K570M104N774O205O071
58738F31598O672P514P425O800O602O345N291M324M435M682M006L563M692O049
58724G09998N567L906L116L075K215O84j51l28n58J9K360M924N591N160N808P126
$$ plain form
58708 758512 765539 771164 775869 779985 782206 781593 779121 775650 770147 761470 750158 737050 721924 705012
58694 705012 687987 671898 655898 639615 624896 613462 604536 596558 589618 584363 579994 575247 570099
58681 570099 564894 559133 552689 546845 542527 538819 534739 531076 528956 527991 527377 527530 529083 531606 534714
58666 534714 539121 545259 552306 559928 569386 581487 594886 607783 619646 629920 636899 639617 639342
58653 639342 637687 634800 630752 626702 622957 617807 610176 601659 594095 587034 579605 572949 568412 564956
58639 564956 560779 556214 552718 550284 548058 546364 545947 546326 546893 548491 551950 556165 559503 561875 563606
58624 563606 563759 561684 558933 557444 556934 556078 555068 555045 556261 558811 563912 572303 582584 593127 604394
58609 604394 617296 630573 642036 651228 658738 664090 666571 667054 666793 665381 661917 657121 652234 646973
$$ packed form
58708G58512P027N625M705M116K221o13k472l471n503q677j1312j3108j5126j6912
58694G05012j7025j6089j6000j6283j4719j1434q926p978o940n255m369m747n148
58681E70099n205n761o444n844m318l708m080l663k120r65o14J53J553K523L108
58666E34714M407O138P047P622R458J2101J3399J2897J1863J0274O979K718k75
58653F39342j655k887m048m050l745n150p631q517p564p061p429o656m537l456
58639E64956m177m565l496k434k226j694m17L79N67J598L459M215L338K372J731
58624E63606J53k075k751j489n10q56j010k3J216K550N101Q391J0281J0543J1267
58609F04394J2902J3277J1463R192P510N352K481M83k61j412l464m796m887n261
$$ plain form
58595 646973 640632 634052 628463 623538 618594 614511 612410 611730 611687 613322 617890 624576 632013 640677 651529
58580 651529 663650 675570 687548 700209 712373 722826 732781 743830 754686 762792 768155 772907
58568 772907 778142 783878 791198 801600 814873 830065 847736 868979 893151 918936 946470 975967
58556 975967 1005420 1032197 1055725 1076023 1091053 1098583 1099740 1097841 1094493 1089527 1083665 1078258 1073129
58543 1073129 1067477 1062159 1058390 1054978 1049394 1040655 1028732 1012520 991370 967502 943910 920844
58531 920844 897111 873564 852150 832790 814535 798735 787582 780337 774365 769169 766052 764658
58519 764658 763349 762362 763102 764809 765310 764605 764489 765149 765428 765858 768050 771502 774253 776248 778891 781866
58503 781866 783629 784371 785270 785565 783709 780531 777768 774449 768526 761189 755581 751913 747948 743643 740999
$$ packed form
58595F46973o341o580n589m925m944m083k101o80m3J635M568O686P437Q664J0852
58580F51529J2121J1920J1978J2661J2164J0453R955J1049J0856Q106N363M752
58568G72907N235N736P320J0402J3273J5192J7671K1243K4172K5785K7534K9497
58556I75967K9453K6777K3528K0298J5030P530J157j899l348m966n862n407n129
58543A073129n652n318l769l412n584q739j1923j6212k1150k3868k3592k3066
58531I20844k3733k3547k1414j9360j8255j5800j1153p245n972n196l117j394
58519G64658j309r87P40J707N01p05j16O60K79M30K192L452K751J995K643K975
58503G81866J763P42Q99K95j856l178k763l319n923p337n608l668l965m305k644
$$ plain form
58488 740999 739780 737815 735499 735572 738374 741543 744603 749628 757145 765658 775629 789674 808053 827846
58474 827846 847174 866438 884943 900256 911650 920454 926406 927330 923021 915776 906644 894902 881735
58461 881735 870451 862248 855456 849638 846744 847509 850441 855140 863048 874143 886410 899188 913493
58448 913493 928347 940404 947950 951856 952112 947077 936845 923848 909524 893758 877974 865046
58436 865046 855604 847904 841681 838535 838335 839105 840712 844785 850829 856448 861665 868841 878176 887535 896961
58421 896961 908773 922758 935788 946695 956933 965914 970597 970508 968575 966106 961601 955180 949326
58408 949326 944333 937893 930046 923573 918523 911634 902448 894763 890514 887240 883202 880010 878559 877288
58394 877288 876156 877463 881126 883950 885157 887669 892405 896402 898232 900090 902750 903685 902208 901323 902400
$$ packed form
58488G40999j219j965k316P3K802L169L060N025P517Q513R971J4045J8379J9793
58474H27846J9328J9264J8505J5313J1394Q804N952R24m309p245r132j1742j3167
58461H81735j1284q203o792n818k894P65K932M699P908J1095J2267J2778J4305
58448I13493J4854J2057P546L906K56n035j0232j2997j4324j5766j5784j2928
58436H65046r442p700o223l146k00P70J607M073O044N619N217P176R335R359R426
58421H96961J1812J3985J3030J0907J0238Q981M683q9j933k469m505o421n854
58408I49326m993o440p847o473n050o889r186p685m249l274m038l192j451j271
58394H77288j132J307L663K824J207K512M736L997J830J858K660R35j477q85J077
$$ plain form
58379 902400 903009 901919 901183 901426 900422 898340 899033 903911 909802 914966 921821 931546 941637 951247 963362
58364 963362 979072 995161 1009929 1025925 1044323 1062215 1078197 1095012 1113820 1131427 1146036
58353 1146036 1160094 1174478 1185579 1191288 1194322 1196674 1196533 1193757 1192505 1195052 1198672 1201781 1207226
58340 1207226 1216245 1225311 1232561 1241359 1253883 1267323 1280100 1295555 1315466 1335994 1354254 1372889
58328 1372889 1394140 1415406 1434670 1454077 1473966 1489701 1498883 1505587 1513202 1519424 1522606 1526339
58316 1526339 1533000 1539340 1543375 1549076 1559247 1570337 1579355 1589295 1602570 1615880 1627000 1639855
58304 1639855 1657280 1675427 1691006 1707301 1727283 1747609 1765415 1784205 1806929 1830026 1850436
58293 1850436 1871664 1896692 1921846 1943959 1966621 1993022 2019781 2044252 2070529 2101583 2133070
$$ packed form
58379I02400O09j090p36K43j004k082O93M878N891N164O855R725J0091R610J2115
58364I63362J5710J6089J4768J5996J8398J7892J5982J6815J8808J7607J4609
58353A146036J4058J4384J1101N709L034K352j41k776j252K547L620L109N445
58340A207226R019R066P250Q798J2524J3440J2777J5455J9911K0528J8260J8635
58328A372889K1251K1266J9264J9407J9889J5735R182O704P615O222L182L733
58316A526339O661O340M035N701J0171J1090R018R940J3275J3310J1120J2855
58304A639855J7425J8147J5579J6295J9982K0326J7806J8790K2724K3097K0410
58293A850436K1228K5028K5154K2113K2662K6401K6759K4471K6277L1054L1487
$$ plain form
58282 2133070 2161752 2192274 2228538 2266291 2301608 2338688 2381568 2426260 2469006 2514172 2565739
58271 2565739 2619205 2670285 2723346 2782559 2843149 2900345 2958588 3022765 3088934 3153022 3219904
58260 3219904 3294202 3370946 3445259 3522298 3607468 3695987 3782435 3871078 3966091 4061430 4151746
58249 4151746 4243404 4343160 4446162 4547108 4652601 4769802 4893514 5017533 5147800 5290796
58239 5290796 5440306 5589950 5747349 5921028 6104970 6291529 6487584 6701927 6929048
58230 6929048 7162121 7409328 7679913 7967314 8264351 8581418 8930454 9305087 9696838
58221 9696838 10116324 10577162 11074254 11600572 12169622 12797449 13478967 14207460 15000451
58212 15000451 15879805 16844732 17893333 19052019 20353514 21806468 23419962 25237014
$$ packed form
58282B133070K8682L0522L6264L7753L5317L7080M2880M4692M2746M5166N1567
58271B565739N3466N1080N3061N9213O0590N7196N8243O4177O6169O4088O6882
58260C219904P4298P6744P4313P7039Q5170Q8519Q6448Q8643R5013R5339R0316
58249D151746R1658R9756J03002J00946J05493J17201J23712J24019J30267J42996
58239E290796J49510J49644J57399J73679J83942J86559J96055K14343K27121
58230F929048K33073K47207K70585K87401K97037L17067L49036L74633L91751
58221I696838M19486M60838M97092N26318N69050O27827O81518P28493P92991
58212A5000451Q79354R64927J048601J158686J301495J452954J613494J817052
$$ plain form
58204 25237014 27309844 29667260 32346779 35436035 39044137 43264286 48214598 54088438
58196 54088438 61118523 69533368 79611716 91741823 106369065 123951497 145054669
58189 145054669 170399434 200633598 235989082 276050767 319367355 362643783 400289937
58182 400289937 425654236 433879142 424314318 400509311 368074781 332354400 297200186
58175 297200186 264689206 235303140 208541175 183821910 161054699 140506606 122371352
58168 122371352 106613460 93088657 81611712 71920713 63712457 56739432 50816198
58161 50816198 45754315 41364898 37516791 34132672 31135868 28450663 26041823 23901381
58153 23901381 21999716 20288707 18743026 17357798 16112601 14974505 13930438 12983107
$$ packed form
58204B5237014K072830K357416K679519L089256L608102M220149M950312N873840
58196E4088438P030085Q414845J0078348J2130107J4627242J7582432K1103172
58189A45054669K5344765L0234164L5355484M0061685M3316588M3276428L7646154
58182D00289937K5364299Q224906r564824k3805007l2434530l5720381l5154214
58175B97200186l2510980k9386066k6761965k4719265k2767211k0548093j8135254
58168A22371352j5757892j3524803j1476945r690999q208256o973025n923234
58161E0816198n061883m389417l848107l384119k996804k685205k408840k140442
58153B3901381j901665j711009j545681j385228j245197j138096j044067r47331
$$ plain form
58145 12983107 12121208 11324530 10591560 9932082 9338353 8791191 8288007 7837725 7434072
58136 7434072 7060095 6713499 6401992 6118179 5843697 5574770 5321108 5083251 4852880
58127 4852880 4631989 4430341 4246332 4069876 3901313 3748681 3609548 3474092 3343200
58118 3343200 3225525 3119548 3016099 2915835 2826900 2747691 2668862 2590315 2519836 2456724
58108 2456724 2392680 2327329 2267519 2212676 2155731 2097143 2043569 1993978 1941268 1886381 1836976
58097 1836976 1793350 1749211 1705217 1668131 1637359 1605539 1571978 1542831 1518584 1493828 1468846
58086 1468846 1449007 1432981 1413666 1390641 1369955 1351823 1330289 1305097 1282326 1262921 1241711
58075 1241711 1218159 1197165 1178756 1157610 1133447 1111603 1092837 1072627 1050961 1032781 1018176
$$ packed form
58145A2983107q61899p96678p32970o59478n93729n47162n03184m50282m03653
58136G434072l73977l46596l11507k83813k74482k68927k53662k37857k30371
58127D852880k20891k01648j84009j76456j68563j52632j39133j35456j30892
58118C343200j17675j05977j03449j00264q8935p9209p8829p8547p0479o3112
58108B456724o4044o5351n9810n4843n6945n8588n3574m9591n2710n4887m9405
58097A836976m3626m4139m3994l7086l0772l1820l3561k9147k4247k4756k4982
58086A468846j9839j6026j9315k3025k0686j8132k1534k5192k2771j9405k1210
58075A241711k3552k0994j8409k1146k4163k1844j8766k0210k1666j8180j4605
$$ plain form
58064 1018176 1002060 984274 970245 960811 950848 938794 928331 919869 909521 897306 887405 879440
58052 879440 868377 853870 840961 830860 819844 807989 799947 795944 790812 783238 777370 773957 768519
58039 768519 759914 752358 747235 740988 732825 726487 722576 716930 708537 701394 696599 690060 680133 670269
58025 670269 662077 652868 642127 633445 627865 621937 614407 608392 605041 601482 596779 593502 591715 587854
58011 587854 581303 575693 572095 567441 561352 557760 557769 557493 555158 553910 555337 556541 556012 556245 558141 558864
57995 558864 557689 557954 560668 562000 559695 556382 554004 550667 545636 541857 540690 539383 536456 534406
57981 534406 534437 533736 530726 528038 527492 526990 525084 523823 524341 524378 522904 522569 524827 527139 527668 528290 530293
57964 530293 531636 531289 531870 535035 538360 539653 540363 541989 542989 542017 540471 539192 536322 530969 525408
$$ packed form
58064A018176j6116j7786j4029r434r963j2054j0463q462j0348j2215r901p965
58052H79440j1063j4507j2909j0101j1016j1855q042m003n132p574n868l413n438
58039G68519q605p556n123o247q163o338l911n646q393p143m795o539r927r864
58025F70269q192r209j0741q682n580n928p530o015l351l559m703l277j787l861
58011E87854o551n610l598m654o089l592Rk76k335j248J427J204n29K33J896P23
57995E58864j175K65K714J332k305l313k378l337n031l779j167j307k927k050
57981E34406L1p01l010k688n46n02j906j261N18L7j474l35K258K312N29O22K003
57964E30293J343l47N81L165L325J293P10J626J000r72j546j279k870n353n561
$$ plain form
57949 525408 521313 517409 512952 509741 508457 506876 503947 501760 501315 500447 498327 497845 500897 505352 509371
57934 509371 514744 523024 532241 540526 549383 560274 571307 580408 588556 596950 604015 608136 610453 612193
57920 612193 612073 608973 604336 599392 592846 583802 574130 565558 557315 548907 542064 537481 532732 526046
57906 526046 519125 513650 508146 501088 494149 489306 485359 480256 474533 469696 465437 461014 457183 454397
57892 454397 451301 447244 443995 442921 442849 442642 443206 444953 446120 445772 445710 447192 448625 448740 449016 450513
57876 450513 451335 449940 448075 447593 447106 444698 441330 438671 436071 432679 430175 430322 431829 432464 432261 432108
57860 432108 431395 429711 428711 429668 431292 432467 434812 439904 446334 452322 458849 467229 475953 483085 489711
57845 489711 497735 506174 512873 518172 523651 528772 531846 533028 533446 532701 529984 526338 523178 519919 515613
$$ packed form
57949E25408m095l904m457l211j284j581k929k187m45q68k120m82L052M455M019
57934E09371N373Q280R217Q285Q857J0891J1033R101Q148Q394P065M121K317J740
57920F12193j20l100m637m944o546r044r672q572q243q408o843m583m749o686
57906E26046o921n475n504p058o939m843l947n103n723m837m259m423l831k786
57892D54397l096m057l249j074p2k07N64J747J167l48o2J482J433J15K76J497
57876D50513Q22j395j865m82m87k408l368k659k600l392k504J47J507O35k03j53
57860D32108p13j684j000R57J624J175K345N092O430N988O527Q380Q724P132O626
57845D89711Q024Q439O699N299N479N121L074J182M18p45k717l646l160l259m306
$$ plain form
57830 515613 511420 508851 507052 504453 501658 500054 499023 497173 494954 493529 492438 490915 490038 490968 492519
57815 492519 493077 493482 495351 497948 499462 500126 501325 502754 502977 501649 498809 493375 484939 475750 468317
57800 468317 462291 456146 450432 446637 444211 441625 439219 438208 437977 437187 436466 437183 438569 438880 438538 439287
57784 439287 441036 442253 442754 443427 443977 443658 443557 445498 449168 452810 456158 460290 465253 470282 475716
57769 475716 482253 488886 493864 497167 499890 501936 502467 501778 500485 497839 493203 488241 485111 483306 480759
57754 480759 477175 473769 470570 466744 462862 460181 458292 456072 454279 454541 456325 457594 457961 458527 459106
57739 459106 458410 456664 455365 454664 453504 452016 451229 450723 449182 447006 445760 445256 443859 441614 440404
57724 440404 440922 442034 443239 445228 447853 449969 451610 454041 457327 460013 461490 462583 463559 463568 462416
$$ packed form
57830E15613m193k569j799k599k795j604j031j850k219j425j091j523q77R30J551
57815D92519N58M05J869K597J514O64J199J429K23j328k840n434q436r189p433
57800D68317o026o145n714l795k426k586k406j011k31p90p21P17J386L11l42P49
57784D39287J749J217N01O73N50l19j01J941L670L642L348M132M963N029N434
57769D75716O537O633M978L303K723K046N31o89j293k646m636m962l130j805k547
57754D80759l584l406l199l826l882k681j889k220j793K62J784J269L67N66N79
57739D59106o96j746j299p01j160j488p87n06j541k176j246n04j397k245j210
57724D40404N18J112J205J989K625K116J641K431L286K686J477J093R76Rj152
$$ plain form
57709 462416 461069 460128 459396 458917 458797 458126 455863 452704 450368 449331 448897 449044 450200 451606 451947 451439
57693 451439 451322 451638 451469 451011 451281 452034 452141 451892 452834 455445 458815 462395 466133 469346 471574 474232
57677 474232 479252 486539 494910 505037 518963 537109 558442 583546 614909 654078 700942 755975
57665 755975 820607 894595 974305 1052916 1120218 1163498 1172934 1147996 1097271 1031974 961147 891739
57653 891739 829047 775436 730642 694149 665739 643930 626318 611767 600239 590658 581488 573333
57641 573333 568133 565531 562926 559501 557231 557202 557927 558268 559201 561427 563855 565759 568120 571481 574698
57626 574698 577101 579792 583483 587010 589267 590726 591833 591847 590641 589832 590630 592116 592955 593361 594075 594837
57610 594837 595213 595734 597065 599023 601347 604341 607923 611127 613286 614686 615529 615525 614991 615013 615909 616778 617083
$$ packed form
57709D62416j347r41p32m79j20o71k263l159k336j037m34J47J156J406L41n08
57693D51439j17L16j69m58K70P53J07k49R42K611L370L580L738L213K228K658
57677D74232N020P287Q371J0127J3926J8146K1333K5104L1363L9169M6864N5033
57665G55975O4632P3988P9710P8611O7302M3280R436k4938n0725o5297p0827o9408
57653H91739o2692n3611m4794l6493k8410k1809j7612j4551j1528r581r170q155
57641E73333n200k602k605l425k270k9P25L41R33K226K428J904K361L361L217
57626E74698K403K691L691L527K257J459J107J4j206q09P98J486Q39M06P14P62
57610E94837L76N21J331J958K324K994L582L204K159J400Q43mn34K2Q96Q69L05
$$ plain form
57593 617083 617322 617705 617552 616522 615072 613285 610721 607817 605935 605549 605863 606428 607540 608855 609503 609957
57577 609957 611751 614816 617197 618113 619172 621625 624494 626576 628369 630674 633015 634811 636682 639263
57563 639263 642002 644261 646444 649006 651571 653950 656877 660840 665313 669856 674752 679899 684468 688372
57549 688372 692744 698255 704350 710827 718517 727497 736019 742227 745759 747084 746778 746162 747025 749680 752615
57534 752615 754871 757293 760620 763947 766160 767472 768570 769615 771044 773870 778092 782067 784560 786267
57520 786267 788402 791056 793805 796627 799312 801259 802773 805336 809735 815166 820880 827284 834541 841583
57506 841583 847483 852478 856811 860079 862621 866034 871218 877281 883243 889312 895654 901551 906856 912630
57492 912630 919210 925289 930080 934710 940191 945683 950216 954536 959725 965457 971116 977286 984574 992287
$$ packed form
57593F17083K39L83j53j030j450j787k564k904j882l86L14N65J112J315O48M54
57577F09957J794L065K381R16J059K453K869K082J793K305K341J796J871K581
57563F39263K739K259K183K562K565K379K927L963M473M543M896N147M569L904
57549F88372M372N511O095O477P690Q980Q522O208L532J325l06o16Q63K655K935
57534G52615K256K422L327L327K213J312J098J045J429K826M222L975K493J707
57520G86267K135K654K749K822K685J947J514K563M399N431N714O404P257P042
57506H41583N900M995M333L268K542L413N184O063N962O069O342N897N305N774
57492I12630O580O079M791M630N481N492M533M320N189N732N659O170P288P713
$$ plain form
57478 992287 999769 1007768 1017002 1026638 1035655 1044409 1053341 1061473 1067869 1073393 1079390 1085782 1092068 1098950
57464 1098950 1107137 1115630 1123057 1129849 1137358 1145701 1154189 1162999 1172588 1182194 1190778 1198893 1207986 1218283
57450 1218283 1228919 1239511 1250014 1259653 1267749 1275291 1284142 1294810 1306267 1317624 1328720 1339435
57438 1339435 1349726 1360132 1371222 1382801 1394499 1406604 1419473 1432755 1446059 1459661 1473648
57427 1473648 1487224 1499884 1512408 1525669 1539272 1552446 1565311 1578200 1590726 1602702 1615064
57416 1615064 1628601 1642719 1656598 1670544 1684938 1698996 1712137 1725447 1740140 1755461 1769853
57405 1769853 1783427 1797481 1812261 1826977 1841572 1856761 1872629 1888717 1905138 1922190 1939274
57394 1939274 1955593 1971619 1988491 2006353 2024470 2042532 2060608 2078378 2095760 2113764 2133358
$$ packed form
57478I92287P482P999R234R636R017Q754Q932Q132O396N524N997O392O286O882
57464A098950Q187Q493P427O792P509Q343Q488Q810R589R606Q584Q115R093J0297
57450A218283J0636J0592J0503R639Q096P542Q851J0668J1457J1357J1096J0715
57438A339435J0291J0406J1090J1579J1698J2105J2869J3282J3304J3602J3987
57427A473648J3576J2660J2524J3261J3603J3174J2865J2889J2526J1976J2362
57416A615064J3537J4118J3879J3946J4394J4058J3141J3310J4693J5321J4392
57405A769853J3574J4054J4780J4716J4595J5189J5868J6088J6421J7052J7084
57394A939274J6319J6026J6872J7862J8117J8062J8076J7770J7382J8004J9594
$$ plain form
57383 2133358 2153965 2174413 2194870 2216447 2239280 2262309 2284586 2305646 2325138 2343347 2361570
57372 2361570 2380723 2400066 2418466 2436238 2454525 2473611 2493201 2513661 2535443 2557850 2579846
57361 2579846 2601605 2623916 2646634 2669195 2692031 2715993 2740834 2765719 2790734 2816429 2842429
57350 2842429 2867932 2893086 2918423 2943584 2968139 2993021 3019430 3046807 3073555 3099361 3125158
57339 3125158 3151212 3176961 3202469 3228409 3254783 3281119 3307627 3334755 3362037 3388851 3415784
57328 3415784 3443679 3471893 3499161 3525703 3552708 3580185 3607123 3633412 3659822 3686430 3712894
57317 3712894 3739935 3768618 3798357 3827515 3855817 3884305 3913126 3941341 3968928 3997067 4026388
57306 4026388 4056695 4088293 4121634 4155595 4188095 4218707 4248955 4279951 4311476 4343445 4376323
$$ packed form
57383B133358K0607K0448K0457K1577K2833K3029K2277K1060J9492J8209J8223
57372B361570J9153J9343J8400J7772J8287J9086J9590K0460K1782K2407K1996
57361B579846K1759K2311K2718K2561K2836K3962K4841K4885K5015K5695K6000
57350B842429K5503K5154K5337K5161K4555K4882K6409K7377K6748K5806K5797
57339C125158K6054K5749K5508K5940K6374K6336K6508K7128K7282K6814K6933
57328C415784K7895K8214K7268K6542K7005K7477K6938K6289K6410K6608K6464
57317C712894K7041K8683K9739K9158K8302K8488K8821K8215K7587K8139K9321
57306D026388L0307L1598L3341L3961L2500L0612L0248L0996L1525L1969L2878
$$ plain form
57295 4376323 4409841 4443055 4475968 4509463 4543479 4577021 4610065 4643617 4677621 4710748 4742630
57284 4742630 4774453 4806848 4838946 4870136 4901138 4932734 4964878 4997478 5030644 5063762 5095764
57273 5095764 5126718 5157828 5189655 5221776 5254286 5287941 5322554 5356909 5390576 5424175 5457540
57262 5457540 5489453 5519712 5549753 5580583 5611628 5642085 5671841 5700574 5727619 5753344 5779110
57251 5779110 5805254 5830693 5855091 5879777 5905783 5932530 5959225 5986124 6013526 6040919 6067943
57240 6067943 6095009 6122200 6148673 6173805 6197868 6221090 6243234 6264427 6285108 6304793 6322279
57229 6322279 6337496 6351728 6365593 6378341 6389562 6399918 6409654 6418163 6425773 6434165 6444051 6454035
57217 6454035 6462840 6471190 6480406 6490499 6500808 6511362 6522453 6533813 6545146 6556613 6568151 6579271
$$ packed form
57295D376323L3518L3214L2913L3495L4016L3542L3044L3552L4004L3127L1882
57284D742630L1823L2395L2098L1190L1002L1596L2144L2600L3166L3118L2002
57273E095764L0954L1110L1827L2121L2510L3655L4613L4355L3667L3599L3365
57262E457540L1913L0259L0041L0830L1045L0457K9756K8733K7045K5725K5766
57251E779110K6144K5439K4398K4686K6006K6747K6695K6899K7402K7393K7024
57240F067943K7066K7191K6473K5132K4063K3222K2144K1193K0681J9685J7486
57229F322279J5217J4232J3865J2748J1221J0356R736Q509P610Q392R886R984
57217F454035Q805Q350R216J0093J0309J0554J1091J1360J1333J1467J1538J1120
$$ plain form
57205 6579271 6590109 6601407 6612919 6623173 6631525 6639102 6646964 6654673 6661416 6667088 6671398 6673426 6673045
57192 6673045 6671431 6669102 6664891 6657985 6649613 6641353 6633001 6623490 6612807 6601479 6589070 6574678 6558319
57179 6558319 6540641 6521770 6501564 6480368 6458466 6435199 6409551 6381183 6350281 6316934 6281275
57168 6281275 6243563 6203585 6160770 6115347 6068549 6021234 5973403 5925547 5879161 5835053 5792369
57157 5792369 5750257 5709468 5671350 5636308 5604320 5575989 5551963 5531968 5515310 5501545 5489869
57146 5489869 5478738 5467008 5454662 5441563 5426389 5407618 5384694 5357454 5325413 5288567 5247967
57135 5247967 5204513 5158128 5109056 5059067 5010302 4963753 4919890 4879932 4845296 4816445 4793147
57124 4793147 4775106 4761387 4750056 4739536 4729758 4721221 4713929 4708396 4706859 4712227 4726415 4750771
$$ packed form
57205F579271J0838J1298J1512J0254Q352P577P862P709O743N672M310K028l81
57192F673045j614k329m211o906q372q260q352r511j0683j1328j2409j4392j6359
57179F558319j7678j8871k0206k1196k1902k3267k5648k8368l0902l3347l5659
57168F281275l7712l9978m2815m5423m6798m7315m7831m7856m6386m4108m2684
57157E792369m2112m0789l8118l5042l1988k8331k4026j9995j6658j3765j1676
57146E489869j1131j1730j2346j3099j5174j8771k2924k7240l2041l6846m0600
57135E247967m3454m6385m9072m9989m8765m6549m3863l9958l4636k8851k3298
57124D793147j8041j3719j1331j0520r778q537p292n533j537N368J4188K4356
$$ plain form
57112 4750771 4787355 4838282 4904136 4984259 5078606 5188573 5316586 5466129 5642322 5851814
57102 5851814 6102249 6402443 6762926 7196056 7716221 8340757 9090634 9989863 11064277
57093 11064277 12340351 13843475 15595307 17611327 19899068 22456240 25268392 28306945
57085 28306945 31527959 34871522 38262206 41610185 44811124 47745977 50287075 52313145
57077 52313145 53724137 54445183 54424575 53640903 52120771 49948892 47256432 44195481 40916867
57068 40916867 37557083 34230217 31023774 28000422 25202875 22656663 20371096 18342181
57060 18342181 16557045 14996883 13638722 12457886 11430036 10531783 9742553 9048607
57052 9048607 8443703 7922644 7473950 7080243 6724802 6395855 6085831 5789900 5506056
$$ packed form
57112D750771L6584N0927O5854Q0123R4347J09967J28013J49543J76193K09492
57102E851814K50435L00194L60483M33130N20165O24536P49877Q99229J074414
57093A1064277J276074J503124J751832K016020K287741K557172K812152L038553
57085B8306945L221014L343563L390684L347979L200939K934853K541098K026070
57077E2313145J410992P21046k0608p83672j520132k171879k692460l060951l278614
57068D0916867l359784l326866l206443l023352k797547k546212k285567k028915
57060A8342181j785136j560162j358161j180836j027850q98253p89230o93946
57052I048607o04904n21059m48694l93707l55441l28947l10024k95931k83844
$$ plain form
57043 5506056 5234740 4977301 4735039 4508776 4297842 4099798 3912347 3735013 3568007
57034 3568007 3410555 3261861 3122690 2994220 2875993 2766771 2666891 2578293 2502939 2442626
57024 2442626 2399346 2373961 2365083 2370344 2386663 2406390 2414593 2394398 2336842 2244780 2128270 1998516
57012 1998516 1865316 1736140 1615239 1504376 1404677 1316701 1239195 1169922 1107937 1053423
57002 1053423 1005391 961577 920797 883522 849868 818864 789974 763510 739157 715840 693481
56991 693481 673217 655379 638874 622972 608210 595115 583680 574612 569494 568770 570552 571857 570082
56978 570082 563249 550346 532054 510228 486467 462023 438661 417956 399683 382452 366119 351981
56966 351981 340548 330931 322812 317280 315070 315564 318233 323664 332440 344228 358555 375086 392252
$$ packed form
57043E506056k71316k57439k42262k26263k10934j98044j87451j77334j67006
57034C568007j57452j48694j39171j28470j18227j09222r9880q8598p5354o0313
57024B442626m3280k5385q878N261J6319J9727Q203k0195n7556r2062j16510j29754
57012A998516j33200j29176j20901j10863r9699q7976p7506o9273o1985n4514
57002A053423m8032m3814m0780l7275l3654l1004k8890k6464k4353k3317k2359
56991F93481k0264j7838j6505j5902j4762j3095j1435r068n118p24J782J305j775
56978E70082o833j2903j8292k1826k3761k4444k3362k0705j8273j7231j6333j4138
56966C51981j1433r617q119n532k210M94K669N431Q776J1788J4327J6531J7166
$$ plain form
56953 392252 406619 414572 414197 405470 389757 369497 347393 325308 304400 285963 270993 259065
56941 259065 249079 241223 236798 236050 237725 241143 247213 256913 270204 287003 307845 332763 360340
56928 360340 388042 412400 428820 433120 424393 405617 381089 354062 326785 301020 277626 256590
56916 256590 238083 222658 210253 200154 192109 186207 181518 176424 170775 166232 163861 162802 161894
56903 161894 161126 160676 159985 158846 158335 159536 162167 165239 168341 171635 175387 180121 186530 194773 204606
56888 204606 216444 231263 249066 268441 287888 306382 322230 332855 336591 333759 325496 312747
56876 312747 297081 281169 267310 256117 247391 241468 238968 239930 243950 250710 259959 271683 286699
56863 286699 306446 331854 363051 400169 443293 491048 539759 584141 618293 636784 636762 619875
$$ packed form
56953C92252J4367P953l75q727j5713k0260k2104k2085k0908j8437j4970j1928
56941B59065r986p856m425p48J675L418O070R700J3291J6799K0842K4918K7577
56928C60340K7702K4358J6420M300q727j8776k4528k7027k7277k5765k3394k1036
56916B56590j8507j5425j2405j0099q045n902m689n094n649m543k371j059r08
56903A61894p68m50o91j139n11J201K631L072L102L294L752M734O409Q243R833
56888B04606J1838J4819J7803J9375J9447J8494J5848J0625L736k832q263j2749
56876C12747j5666j5912j3859j1193q726n923k500R62M020O760R249J1724J5016
56863B86699J9747K5408L1197L7118M3124M7755M8711M4382L4152J8491k2j6887
$$ plain form
56851 619875 591251 556325 519226 483495 452199 426744 407032 393208 385901 384616 387817 395293
56839 395293 408843 430055 459124 496517 543874 602135 670171 745805 825760 902830 965008
56828 965008 1000302 1003015 975360 924624 860020 790504 722754 660324 604893 557724 519517 490014
56816 490014 468730 455406 449249 448897 454022 465919 485733 513167 547756 589992 639761 694110
56804 694110 747159 791277 818225 821497 799907 758599 705573 647607 589579 535437 487710 446801
56792 446801 412299 384481 363540 348394 337704 331361 329734 332298 338462 349097 365726 388461
56780 388461 415785 445704 475661 501658 518906 523733 514703 492745 461186 424963 388451 353912
56768 353912 322184 293994 269766 249005 230944 215385 202160 190503 179722 169877 161067 152865
$$ packed form
56851F19875k8624l4926l7099l5731l1296k5455j9712j3824p307j285L201P476
56839C95293J3550K1212K9069L7393M7357N8261O8036P5634P9955P7070O2178
56828I65008L5294K713k7655n0736o4604o9516o7750o2430n5431m7169l8207k9503
56816D90014k1284j3324o157l52N125J1897J9814K7434L4589M2236M9769N4349
56804F94110N3049M4118K6948L272k1590m1308n3026n7966n8028n4142m7727m0909
56792D46801l4502k7818k0941j5146j0690o343j627K564O164J0635J6629K2735
56780C88461K7324K9919K9957K5997J7248M827r030k1958l1559l6223l6512l4539
56768C53912l1728k8190k4228k0761j8061j5559j3225j1657j0781r845q810q202
$$ plain form
56756 152865 145158 138638 133608 129291 125146 121828 119781 118042 115673 113413 112539 112857 113181 113066 112782
56741 112782 112220 111149 109973 108990 107482 104813 101829 99916 99184 98779 98381 98101 97449 95866 93927 92762
56725 92762 92501 92463 92498 92978 93777 94425 95110 96479 98639 101153 103774 106328 108341 109637 110828 112401 113883
56708 113883 114741 115464 116748 118219 119030 119189 119334 119759 120535 121900 123538 124251 123483 122441 122576 123648 124487
56691 124487 124892 125408 125918 125916 125706 125916 126198 125832 125290 125834 127677 129739 131101 131734 131994 132271 132833 133301
56673 133301 132759 131106 129550 128946 128545 127349 125713 124472 123480 122339 121636 122003 122853 123516 124659 126930
56657 126930 129125 129569 128687 128317 129039 130084 131412 133781 136905 139467 141055 142415 143796 144609 144751 144809
56641 144809 144921 144758 144529 144681 144781 143972 142332 140585 138835 136870 135184 134283 133570 132449 131850 132866
$$ packed form
56756A52865p707o520n030m317m145l318k047j739k369k260q74L18L24j15k84
56741A12782n62j071j176r83j508k669k984j913p32m05l98k80o52j583j939j165
56725I2762k61l8L5M80P99O48O85J369K160K514K621K554K013J296J191J573J482
56708A13883Q58P23J284J471Q11J59J45M25P76J365J638P13p68j042J35J072Q39
56691A24487M05N16N10kk10K10K82l66n42N44J843K062J362O33K60K77N62M68
56673A33301n42j653j556o04m01j196j636j241r92j141p03L67Q50O63J143K271
56657A26930K195M44q82l70P22J045J328K369L124K562J588J360J381Q13J42N8
56641A44809J12j63k29J52J00q09j640j747j750j965j686r01p13j121n99J016
$$ plain form
56625 132866 134560 135168 134975 135788 137799 139306 139565 139630 140080 140138 139609 139670 141038 143043 145154 147845 151317
56608 151317 154818 157771 160306 162242 162887 162217 161006 159489 157179 154185 151347 148824 145995 143020 141033
56593 141033 140370 140002 139156 138259 137923 138180 139067 140765 142834 144387 145235 145847 146248 146188 146283 147516 149496 150661
56575 150661 150352 149345 148278 147096 146261 146844 148989 151599 153934 156305 159057 162152 165878 170647 175919
56560 175919 180752 185531 191781 200242 210583 222806 236897 250793 260733 264578 263509 259995 255589
56547 255589 251093 247181 243867 240414 236442 232304 228229 224210 220782 218658 217451 216025 214096 212201
56533 212201 210252 207726 205171 203721 203055 201662 199265 197078 195508 193641 191336 189743 189207 188628 187533
56518 187533 186854 187037 187272 187288 187915 189092 189272 187775 185905 184772 183776 182309 181162 181033 181081 180213 178649
$$ packed form
56625A32866J694O08j93Q13K011J507K59O5M50N8n29O1J368K005K111K691L472
56608A51317L501K953K535J936O45o70j211j517k310k994k838k523k829k975j987
56593A41033o63l68q46q97l36K57Q87J698K069J553Q48O12M01o0R5J233J980J165
56575A50661l09j007j067j182q35N83K145K610K335K371K752L095L726M769N272
56560A75919M833M779O250Q461J0341J2223J4091J3896R940L845j069l514m406
56547B55589m496l912l314l453l972m138m075m019l428k124j207j426j929j895
56533B12201j949k526k555j450o66j393k397k187j570j867k305j593n36n79j095
56518A87533o79J83K35J6O27J177J80j497j870j133r96j467j147j29M8q68j564
$$ plain form
56501 178649 177290 176659 177134 178953 181361 183072 184106 185671 187812 188905 188138 186713 185858 185356 184790 184485
56485 184485 184302 183252 181225 179501 178677 177806 176404 175470 175555 175636 175001 174491 174843 175566 176507 178597 181865
56468 181865 184631 186036 187545 190475 193829 196120 197596 198968 199603 198770 197373 196683 196516 196237 196310 197293
56452 197293 198455 198972 199397 200470 201514 201502 200751 200231 200186 200632 202117 204704 207264 208945 210236 211526
56436 211526 211981 211074 209849 209382 209314 209163 209616 211030 212100 211672 210633 210416 210848 211056 211270 212075 212943 213200
56418 213200 213511 214855 216882 218644 219953 220758 220398 218941 218051 218974 220728 221761 222202 222931 223620 223452
56402 223452 222823 222668 222943 223227 223837 224972 225824 225969 226399 227746 228844 228700 228538 229929 232116 233221 233122
56385 233122 233059 233260 232954 232177 231720 231765 232100 233001 234529 235793 236350 237328 239617 242089 243280 243743 244899
$$ packed form
56501A78649j359o31M75J819K408J711J034J565K141J093p67j425q55n02n66l05
56485A84485j83j050k027j724q24q71j402r34Q5Q1o35n10L52P23R41K090L268
56468A81865K766J405J509K930L354K291J476J372O35q33j397o90j67k79P3R83
56452A97293J162N17M25J073J044j2p51n20m5M46J485K587K560J681J291J290
56436B11526M55r07j225m67o8j51M53J414J070m28j039k17M32K08K14Q05Q68K57
56418B13200L11J344K027J762J309Q05l60j457q90R23J754J033M41P29O89j68
56402B23452o29j55K75K84O10J135Q52J45M30J347J098j44j62J391K187J105r9
56385B33122o3K01l06p77m57M5L35R01J528J264N57R78K289K472J191M63J156
$$ plain form
56368 244899 246697 248338 250263 253264 256439 258182 258635 259124 259733 259428 258161 256885 255777 254221 252391
56353 252391 251291 251379 252378 254000 255798 256995 257621 258959 261658 264439 265987 266982 268755 271138 273275
56338 273275 275449 278343 281503 284240 287043 290512 293985 296946 300521 305784 311716 316683 320708 324459
56324 324459 327429 329207 331194 334699 338506 340690 341652 342996 344489 344721 343840 343040 342183 340493 338864
56309 338864 338870 340054 340660 340515 340786 341576 342219 343325 345998 349583 352673 355783 360485 366404 371658 375824
56293 375824 379833 383361 385074 385377 386370 389033 392677 396964 402261 408154 413784 419435 425806 432187 437444
56278 437444 442217 447986 454660 461332 468538 477312 486865 495869 505198 516515 528917 540091 550329
56265 550329 562246 576785 592593 609120 627234 646787 666701 687599 711486 738679 767898
$$ packed form
56368B44899J798J641J925L001L175J743M53M89O09l05j267j276j108j556j830
56353B52391j100Q8R99J622J798J197O26J338K699K781J548R95J773K383K137
56338B73275K174K894L160K737K803L469L473K961L575N263N932M967M025L751
56324C24459K970J778J987L505L807K184R62J344J493K32q81q00q57j690j629
56309C38864OJ184O06j45K71P90O43J106K673L585L090L110M702N919N254M166
56293C75824M009L528J713L03R93K663L644M287N297N893N630N651O371O381N257
56278D37444M773N769O674O672P206Q774R553R004R329J1317J2402J1174J0238
56265E50329J1917J4539J5808J6527J8114J9553J9914K0898K3887K7193K9219
$$ plain form
56254 767898 799495 835728 877712 924897 977725 1037920 1105876 1180593 1262584 1354115 1456108
56243 1456108 1567203 1686106 1812359 1944515 2079919 2216431 2352129 2483515 2606384
56234 2606384 2718192 2817031 2898882 2958995 2995886 3011040 3004971 2976829 2927777 2861359 2780277
56223 2780277 2685961 2581443 2471270 2358073 2242316 2125747 2011922 1902895 1798486 1699172
56213 1699172 1606542 1520480 1439163 1362429 1292070 1228303 1169189 1114104 1064598 1021052 981540
56202 981540 944711 910961 880297 851885 826004 803431 782774 761702 740991 723817 710763
56191 710763 699199 688020 678964 672413 665866 657909 650192 644174 639170 634693 631494 629236 626320 623005
56177 623005 621528 622317 623266 623483 624360 626316 627971 629287 631893 635618 638428 640497 644408 650507 656129
$$ packed form
56254G67898L1597L6233M1984M7185N2828O0195O7956P4717Q1991R1531J01993
56243A456108J11095J18903J26253J32156J35404J36512J35698J31386J22869
56234B606384J11808R8839Q1851O0113L6891J5154o069k8142m9052o6418q1082
56223B780277r4316j04518j10173j13197j15757j16569j13825j09027j04409r9314
56213A699172r2630q6062q1317p6734p0359o3767n9114n5085m9506m3546l9512
56202I81540l6829l3750l0664k8412k5881k2573k0657k1072k0711j7174j3054
56191G10763j1564j1179r056o551o547p957p717o018n004m477l199k258k916l315
56177F23005j477P89R49K17Q77J956J655J316K606L725K810K069L911O099N622
$$ plain form
56162 656129 660393 665579 672653 679721 686176 694046 703791 713050 721222 730959 743351 755930 767364
56149 767364 780033 795952 814222 834398 858262 886071 915194 944807 978096 1017672 1062681
56138 1062681 1112672 1170413 1238463 1316578 1404584 1503892 1613639 1728547 1842404 1950278
56128 1950278 2046408 2125166 2186828 2238460 2286735 2333404 2378741 2423613 2465312 2496447 2511728
56117 2511728 2512331 2501609 2481429 2455241 2428983 2404459 2375593 2334694 2278816 2207686 2120812 2020733
56105 2020733 1914876 1810217 1709534 1615492 1533370 1465855 1409608 1360951 1320780 1290286 1266557
56094 1266557 1246696 1231905 1223144 1216966 1210132 1204403 1202340 1202243 1201658 1202098 1205815 1211418 1216948 1223751
56080 1223751 1233199 1243150 1251614 1260300 1270766 1281027 1289757 1299645 1312586 1325939 1337594 1350170
$$ packed form
56162F56129M264N186P074P068O455P870R745R259Q172R737J2392J2579J1434
56149G67364J2669J5919J8270K0176K3864K7809K9123K9613L3289L9576M5009
56138A062681M9991N7741O8050P8115Q8006R9308J09747J14908J13857J07874
56128A950278R6130P8758O1662N1632M8275M6669M5337M4872M1699L1135J5281
56117B511728O03j0722k0180k6188k6258k4524k8866m0899n5878p1130q6874j00079
56105B020733j05857j04659j00683r4042q2122o7515n6247m8657m0171l0494k3729
56094A266557j9861j4791q761o178o834n729k063r7n85M40L717N603N530O803
56080A223751R448R951Q464Q686J0466J0261Q730R888J2941J3353J1655J2576
$$ plain form
56068 1350170 1365893 1382038 1396046 1410504 1428258 1447184 1464648 1482619 1503393 1524846 1544932
56057 1544932 1566246 1590942 1615764 1637317 1657635 1679343 1700230 1718122 1736157 1757483 1779495
56046 1779495 1799124 1818964 1842328 1867189 1890971 1916333 1946220 1978248 2010055 2044794 2085016
56035 2085016 2126666 2165791 2205569 2249907 2295923 2339919 2384889 2434503 2485526 2534052 2583395
56024 2583395 2637726 2693721 2746912 2800526 2859497 2921535 2982817 3046561 3116941 3190550 3263272
56013 3263272 3339547 3425185 3516974 3609258 3704598 3807770 3915439 4022337 4131566 4248228
56003 4248228 4369227 4490158 4615521 4750979 4892541 5034996 5183622 5345435 5516650
55994 5516650 5691548 5875595 6076131 6288503 6505921 6734588 6983828 7249892 7525620
$$ packed form
56068A350170J5723J6145J4008J4458J7754J8926J7464J7971K0774K1453K0086
56057A544932K1314K4696K4822K1553K0318K1708K0887J7892J8035K1326K2012
56046A779495J9629J9840K3364K4861K3782K5362K9887L2028L1807L4739M0222
56035B085016M1650L9125L9778M4338M6016M3996M4970M9614N1023M8526M9343
56024B583395N4331N5995N3191N3614N8971O2038O1282O3744P0380P3609P2722
56013C263272P6275Q5638R1789R2284R5340J03172J07669J06898J09229J16662
56003D248228J20999J20931J25363J35458J41562J42455J48626J61813J71215
55994E516650J74898J84047K00536K12372K17418K28667K49240K66064K75728
$$ plain form
55985 7525620 7817343 8135295 8476262 8833632 9215509 9634064 10086256 10564910 11079282
55976 11079282 11643856 12256917 12912575 13623711 14409459 15271096 16206038 17234900 18387951
55967 18387951 19676926 21109597 22720096 24554272 26639989 29008149 31730921 34904883
55959 34904883 38616680 42971364 48140493 54339248 61781193 70713183 81473798 94460633
55951 94460633 110082997 128836506 151376342 178358092 210126606 246479974 286338117
55944 286338117 327006474 363555222 389584018 399726456 392279701 369817376 337457269
55937 337457269 300474549 262930050 227473409 195578483 167794527 144058138 124028200
55930 124028200 107267028 93279388 81570198 71731959 63450918 56448160 50471236
$$ packed form
55985G525620K91723L17952L40967L57370L81877M18555M52192M78654N14372
55976A1079282N64574O13061O55658P11136P85748Q61637R34942J028862J153051
55967A8387951J288975J432671J610499J834176K085717K368160K722772L173962
55959C4904883L711797M354684N169129O198755P441945Q931990J0760615J2986835
55951I4460633J5622364J8753509K2539836K6981750L1768514L6353368L9858143
55944B86338117M0668357L6548748K6028796J0142438p446755k2462325l2360107
55937C37457269l6982720l7544499l5456641l1894926k7783956k3736389k0029938
55930A24028200j6761172j3987640j1709190r838239q281041p002758n976924
$$ plain form
55923 50471236 45333754 40906966 37068323 33694384 30696029 28019119 25611774 23424176
55915 23424176 21435255 19644604 18037789 16586200 15275669 14105620 13062119 12118658
55907 12118658 11262086 10493027 9802216 9169979 8588098 8060121 7580697 7135234 6719313
55898 6719313 6338959 5992088 5667939 5364011 5085923 4831167 4589922 4361321 4152583
55889 4152583 3962617 3782248 3610117 3452985 3310629 3175351 3046423 2930614 2828252
55880 2828252 2732511 2642688 2564700 2497806 2433473 2367888 2303686 2239423 2169661 2095962 2025976
55869 2025976 1960946 1895051 1827274 1762738 1702127 1640948 1579871 1524939 1476762 1429961 1383945
55858 1383945 1343882 1310131 1276999 1243140 1213335 1188717 1164754 1140206 1118749 1100398 1080386
$$ packed form
55923E0471236n137482m426788l838643l373939k998355k676910k407345k187598
55915B3424176j988921j790651j606815j451589j310531j170049j043501r43461
55907A2118658q56572p69059o90811o32237n81881n27977m79424m45463m15921
55898F719313l80354l46871l24149l03928k78088k54756k41245k28601k08738
55889D152583j89966j80369j72131j57132j42356j35278j28928j15809j02362
55880B828252r5741q9823p7988o6894o4333o5585o4202o4263o9762p3699o9986
55869B025976o5030o5895o7777o4536o0611o1179o1077n4932m8177m6801m6016
55858A383945m0063l3751l3132l3859k9805k4618k3963k4548k1457j8351k0012
$$ plain form
55847 1080386 1057905 1037217 1018776 997941 973842 951000 930659 908918 884995 863169 844839
55836 844839 826522 807338 790690 776844 761481 743534 727148 714151 701688 688886 678687
55825 678687 671309 662967 652843 644392 637998 629258 616501 603263 591394 578424 563870 551442
55813 551442 542614 534213 524734 516970 512056 506928 500153 494630 492049 490069 487307 485854 486645 487553 488176
55798 488176 491362 497770 503963 507915 511416 515049 515986 513085 509241 506313 502378 496266 490186 485560
55784 485560 480708 474950 470748 469486 469061 467459 464698 459681 449690 435091 420371 408467 398001
55771 398001 387677 379050 373033 367990 363391 361379 362731 365105 366932 369029 370893 369871 365895 362564
55757 362564 361486 359866 355820 351458 348228 343628 335511 325697 316376 306519 294816 282844 272466
$$ packed form
55847A080386k2481k0688j8441k0835k4099k2842k0341k1741k3923k1826j8330
55836H44839j8317j9184j6648j3846j5363j7947j6386j2997j2463j2802j0199
55825F78687p378q342j0124q451o394q740j2757j3238j1869j2970j4554j2428
55813E51442q828q401r479p764m914n128o775n523k581j980k762j453P91R08O23
55798D88176L186O408O193L952L501L633R37k901l844k928l935o112o080m626
55784D85560m852n758m202j262m25j602k761n017r991j4599j4720j1904j0466
55771C98001j0324q627o017n043m599k012J352K374J827K097J864j022l976l331
55757C62564j078j620m046m362l230m600q117r814r321r857j1703j1972j0378
$$ plain form
55744 272466 263073 253923 246271 240789 235783 230160 225300 222027 218808 214935 212296 211915 211909 210935 210419 211321
55728 211321 211972 211333 211103 212260 212764 211074 208805 207477 205722 202258 198598 196242 194045 190926 188393
55713 188393 187784 187791 187235 187626 190316 193749 196172 198572 202317 206342 209281 211958 215067 216698 214912 210766
55697 210766 206257 201329 195366 189570 185285 181771 177995 174778 172986 171540 169457 167912 168043 168665 168360
55682 168360 167928 168648 170099 171796 174931 180269 186263 191334 195942 200365 202815 202174 200397 199681 199273
55667 199273 197574 195299 193936 193094 192115 192320 194789 197667 198635 198490 199447 201405 202833 204019 206352 209413
55651 209413 211631 213044 214776 216550 217133 216523 215415 213333 209520 204844 200695 196787 192097 187029 182581
55636 182581 178332 173354 168204 163962 160225 156021 151769 148374 145426 142337 140176 140196 141446 141945 141396
$$ packed form
55744B72466r393r150p652n482n006n623m860l273l219l873k639l81or74n16R02
55728B11321O51o39k30J157N04j690k269j328j755l464l660k356k197l119k533
55713A88393o09Pn56L91K690L433K423K400L745M025K939K677L109J631j786m146
55697B10766m509m928n963n796m285l514l776l217j792j446k083j545J31O22l05
55682A68360m32P20J451J697L135N338N994N071M608M423K450o41j777p16m08
55667A99273j699k275j363q42r79K05K469K878R68j45R57J958J428J186K333L061
55651B09413K218J413J732J774N83o10j108k082l813m676m149l908m690n068m448
55636A82581m249m978n150m242l737m204m252l395k948l089k161K0J250M99n49
$$ plain form
55621 141396 140727 139916 138389 136742 135947 135559 134614 133455 132740 131618 128965 125604 123132 121297 118656 115242
55605 115242 112467 110880 109909 109325 109159 108698 107302 105688 104863 104483 103790 103207 103277 103015 101239 98715 97085
55588 97085 96479 96059 95998 96860 97811 97619 96827 96849 97455 97238 96111 95326 95376 95801 96730 98698 101234 103398 105463
55569 105463 108406 112156 115913 119705 123932 127929 130678 132434 133981 134918 134477 133405 133013 132817 131141
55554 131141 127784 124193 121207 118489 116011 114268 113058 111678 110288 109649 109743 109987 110417 111236 111752 111342
55538 111342 110884 111596 113046 114143 115471 118550 123098 127150 129815 131979 134279 136271 137708 138894 139584
55523 139584 139127 137897 137091 136996 136840 136311 135814 135189 133657 131162 128584 126518 124903 123657 122524 120628
55507 120628 117394 113636 110580 108242 106073 104500 104253 104598 103970 102165 100311 98922 97589 96393 95995
$$ packed form
55621A41396o69q11j527j647p95l88r45j159p15j122k653l361k472j835k641l414
55605A15242k775j587r71n84j66m61j396j614q25l80o93n83P0k62j776k524j630
55588I7085o06m20o1Q62R51j92p92K2O06k17j127p85N0M25R29J968K536K164K065
55569A05463K943L750L757L792M227L997K749J756J547R37m41j072l92j96j676
55554A31141l357l591k986k718k478j743j210j380j390o39R4K44M30Q19N16m10
55538A11342m58P12J450J097J328L079M548M052K665K164K300J992J437J186O90
55523A39584m57j230q06r5j56n29m97o25j532k495k578k066j615j246j133j896
55507A20628l234l758l056k338k169j573k47L45o28j805j854j389j333j196l98
$$ plain form
55492 95995 96303 96521 96475 96535 96371 95156 92892 90287 87515 84370 81274 78835 76789 74691 73159 72970
55476 72970 73534 73818 74189 75575 77366 78078 77767 77838 78709 79500 79808 79878 79286 77472 75408 74651 74842 74263
55458 74263 72878 72506 73741 75007 75214 75221 75919 76745 76958 76809 76699 76595 76850 78168 80203 81512 81405 80609
55440 80609 79766 78748 77791 77793 78898 80091 80715 81183 81823 82252 82240 81981 81219 79399 76984 75351 75043 75322
55422 75322 75628 76146 76734 76765 76331 76281 76720 76875 76693 77126 78473 79880 80921 82204 83901 85085 85127 84540
55404 84540 83867 82924 81643 80567 79981 79535 79057 78768 78504 77824 77010 76780 76970 76781 76364 76688 77702 78241
55386 78241 77977 77846 78182 78116 77338 76855 77346 78249 79078 80148 81373 81867 81526 81576 82700 83953 84359 84329 84645
55367 84645 85222 85776 86604 87832 88824 89147 89247 89478 89377 88541 87399 86509 85832 85144 84342 83148 81419 79990
$$ packed form
55492I5995L08K18m6O0j64j215k264k605k772l145l096k439k046k098j532j89
55476G2970N64K84L71J386J791P12l11P1Q71P91L08P0n92j814k064p57J91n79
55458G4263j385l72J235J266K07PO98Q26K13j49j10j04K55J318K035J309j07p96
55440H0609q43j018r57KJ105J193O24M68O40M29j2k59p62j820k415j633l08K79
55422G5322L06N18N88L1m34n0M39J55j82M33J347J407J041J283J697J184M2n87
55404H4540o73r43j281j076n86m46m78k89k64o80q14k30J90j89m17L24J014N39
55386G8241k64j31L36o6p78m83M91R03Q29J070J225M94l41N0J124J253M06l0L16
55367H4645N77N54Q28J228R92L23J00K31j01q36j142q90o77o88q02j194j729j429
$$ plain form
55349 79990 80101 81739 83614 84902 85781 86201 85679 84620 84250 84732 84884 84257 83929 84573 85341 85418 85196 85116
55331 85116 84778 84064 83663 83671 83096 81652 80590 80756 81272 81233 81314 82476 84336 86069 87758 89580 90727 90398
55313 90398 89038 87491 85800 83861 82280 81558 81247 80930 81128 82294 83770 84675 84938 84787 84314 84282 85882
55296 85882 88657 90150 88986 86943 86433 87245 87540 86923 86501 86627 86630 86485 86883 87725 88127 87911 87745 87846
55278 87846 87823 87697 87868 88106 87770 87024 86719 87024 87250 87142 87296 88032 88745 88775 88288 87923 87920 87925 87571 87107 87279
55257 87279 88350 89518 89808 89436 89472 90191 90739 90571 90158 89888 89436 88692 88172 87869 86888 84990 83402 83166
55239 83166 83783 84440 85443 87272 89202 90191 90422 90660 90773 90155 89110 88499 88405 88278 88091 88266 88807 89458
55221 89458 90367 91661 92803 93317 93680 94496 95263 95039 93990 93176 93091 93407 93853 94353 94532 94062 93342 92990
$$ packed form
55349G9990J11J638J875J288Q79M20n22j059l70M82J52o27l28O44P68P7k22q0
55331H5116l38p14m01Qn75j444j062J66N16l9Q1J162J860J733J689J822J147l29
55313I0398j360j547j691j939j581p22l11l17J98J166J476R05K63j51m73l2J600
55296H5882K775J493j164k043n10Q12K95o17m22J26Lj45L98Q42M02k16j66J01
55278H7846k3j26J71K38l36p46l05L05K26j08J54P36P13L0m87l65lNl54m64J72
55257H7279J071J168K90l72L6P19N48j68m13k70m52p44n20l03r81j898j588k36
55239H3166O17O57J003J829J930R89K31K38J13o18j045o11r4j27j87J75N41O51
55221H9458R09J294J142N14L63Q16P67k24j049q14q5L16M46N00J79m70p20l52
$$ plain form
55203 92990 92953 92861 92870 93255 93487 92693 90805 88545 86634 85719 86490 88838 91302 92385 92136 91609 91235 90804
55185 90804 90548 90973 91765 92019 91602 91331 91850 93127 94891 96704 97815 97772 97096 96598 96298 95779 95208 95065
55167 95065 95232 95324 95657 96847 98650 100201 101225 102051 102690 102898 102996 103556 104344 104613 104341 104158 104122 103635 102601
55148 102601 101669 101203 100941 100760 100856 101071 100912 100302 99555 98615 97178 95532 94375 93807 93362 93052 93374 94221
55130 94221 94811 94887 95045 95597 96047 96004 95806 95845 96074 96547 97698 99641 101736 103279 104123 104393 104151 103659 103466
55111 103466 103772 104080 103774 102728 101160 99299 97523 96521 96898 98604 100928 103038 104549 105533 106074 105946
55095 105946 105036 103949 103645 104306 105118 105454 105688 106422 107482 108265 108593 108653 108531 108412 108793 109782 110595 110490
55077 110490 109844 109528 109556 109220 108396 107809 108009 108872 110130 111699 113323 114453 114634 113813 112345 110970 110462
$$ packed form
55203I2990l7r2RL85K32p94j888k260j911r15P71K348K464J083k49n27l74m31
55185I0804k56M25P92K54m17k71N19J277J764J813J111m3o76m98l00n19n71j43
55167I5065J67R2L33J190J803J551J024Q26O39K08R8N60P88K69k72j83l6m87j034
55148A02601r32m66k62j81R6K15j59o10p47r40j437j646j157n68m45l10L22Q47
55130I4221N90P6J58N52M50m3j98L9K29M73J151J943K095J543Q44K70k42m92j93
55111A03466L06L08l06j046j568j861j776j002L77J706K324K110J511R84N41j28
55095A05946r10j087l04O61Q12L36K34P34J060P83L28O0j22j19L81R89Q13j05
55077A10490o46l16K8l36q24n87K00Q63J258J569J624J130J81q21j468j375n08
$$ plain form
55060 110462 110866 111360 111228 110661 110187 109817 109289 108704 108307 108031 107838 108089 108930 109780 110047 109930 109803 109385 108379
55041 108379 107444 107574 108780 110247 111463 112375 112758 112375 111540 110757 110052 109388 109255 109963 110770 110736 110096 109830
55023 109830 110202 110812 111644 112917 114123 114449 114029 113661 113419 112726 111687 111111 111174 111232 111058 111096 111389 111385 111004
55004 111004 110859 111137 111215 110688 109965 109626 109889 110770 112020 112956 113128 113111 113789 115012 115902 116304 116830 117578 117974
54985 117974 117963 118088 118283 117750 116299 114750 113715 113012 112483 112394 112758 113215 113768 114684 115549 115555 114919 114859 115827
54966 115827 116847 117041 116739 116622 116750 116974 117446 118214 119031 119924 121228 122798 123962 124473 124718 124844 124600
54949 124600 124217 124371 125032 125366 125131 125077 125541 125734 124963 123647 122556 121927 121780 122225 122913 123049 122511 122207
54931 122207 122817 123943 124917 125693 126445 127094 127717 128760 130426 132511 135157 139014 144330 150607 157399 164619
$$ packed form
55060A10462M04M94j32n67m74l70n28n85l97k76j93K51Q41Q50K67j17j27m18j006
55041A08379r35J30J206J467J216R12L83l83q35p83p05o64j33P08Q07l4o40k66
55023A09830L72O10Q32J273J206L26m20l68k42o93j039n76O3N8j74L8K93ml81
55004A11004j45K78P8n27p23l39K63Q81J250R36J72j7O78J223Q90M02N26P48L96
54985A17974j1J25J95n33j451j549j035p03n29q9L64M57N53R16Q65Oo36o0R68
54966A15827J020J94l02j17J28K24M72P68Q17Q93J304J570J164N11K45J26k44
54949A24600l83J54O61L34k35n4M64J93p71j316j091o29j47M45O88J36n38l04
54931A22207O10J126R74P76P52O49O23J043J666K085K646L857N316O277O792P220
$$ plain form
54915 164619 171868 178445 184292 189922 195038 198329 199089 197978 195679 191959 186665 180568 174402 168015
54901 168015 161245 154802 149492 145287 141854 139237 137330 135494 133409 131640 130708 130327 130150 130453 131400
54886 131400 132409 132971 133369 133972 134585 135144 136248 138313 140949 143867 147566 152394 157799 163305 169393
54871 169393 176552 184203 191427 197903 203254 206331 206302 203796 199921 194748 187867 179864 172045 165028 158643
54856 158643 152963 148402 144996 142396 140381 138666 136589 133777 130819 128563 127038 125768 124681 123960
54842 123960 123372 122556 121616 120747 119678 118216 116906 116338 116222 115947 115679 116042 117068 118250 119367 120497
54826 120497 121485 122138 122616 122973 122721 121583 120225 119451 119087 118502 117800 117557 117752 117913 118071 118588 119272 119546
54808 119546 119378 119233 119282 119431 119849 120684 121487 121844 122276 123550 125236 125977 125262 124041 123511 123990 124990 125671
$$ packed form
54915A64619P249O577N847N630N116L291P60j111k299l720n294o097o166o387
54901A68015o770o443n310m205l433k617j907j836k085j769r32l81j77L03R47
54886A31400J009N62L98O03O13N59J104K065K636K918L699M828N405N506O088
54871A69393P159P651P224O476N351L077k9k506l875n173o881q003p819p017o385
54856A58643n680m561l406k600k015j715k077k812k958k256j525j270j087p21
54842A23960n88q16r40q69j069j462j310n68j16k75k68L63J026J182J117J130
54826A20497R88O53M78L57k52j138j358p74l64n85p02k43J95J61J58N17O84K74
54808A19546j68j45M9J49M18Q35Q03L57M32J274J686P41p15j221n30M79J000O81
$$ plain form
54790 125671 125259 123725 122108 121579 122161 122916 123189 123040 122725 122491 122776 123879 125427 126783 127862 128948
54774 128948 129951 130537 130847 131351 132196 133402 135503 139107 143940 149130 154406 160228 166718 173294 179441
54759 179441 185177 190729 196276 201869 206930 209982 209689 206158 200585 193822 186190 178489 172003 167153
54745 167153 163058 158864 154812 151634 149475 147868 146360 144855 143607 143019 143236 143867 144380 144643 144775 144744
54729 144744 144589 144825 146015 148047 150409 152999 155996 159092 161671 163842 166603 170769 176219 182290 188322
54714 188322 193741 198051 200983 202392 202056 199914 196328 191764 186449 180704 175252 170529 166051 161197
54700 161197 156369 152525 149761 147225 144426 141692 139281 136978 134820 133397 133018 133241 133499 133679 133802
54685 133802 133672 133180 132567 132053 131502 130690 129676 128800 128366 128282 127928 126744 125137 124321 124797 125560 125459 124816
$$ packed form
54790A25671m12j534j617n29N82P55K73j49l15k34K85J103J548J356J079J086
54774A28948J003N86L10N04Q45J206K101L604M833N190N276N822O490O576O147
54759A79441N736N552N547N593N061L052k93l531n573o763p632p701o486m850
54745A67153m095m194m052l178k159j607j508j505j248n88K17O31N13K63J32l1
54729A44744j55K36J190K032K362K590K997L096K579K171K761M166N450O071O032
54714A88322N419M310K932J409l36k142l586m564n315n745n452m723m478m854
54700A61197m828l844k764k536k799k734k411k303k158j423l79K23K58J80J23
54685A33802j30m92o13n14n51q12j014q76m34q4l54j184j607q16M76P63j01o43
$$ plain form
54667 124816 124810 125685 126645 127290 127987 128770 129056 128715 128443 128672 128901 128518 127630 126738 126168 126060 126410 126891 127147
54648 127147 127333 127849 128509 128727 128559 128764 129605 130340 130207 129272 128073 127108 126895 127784 129289 130227 130000 129241
54630 129241 128913 129278 130036 130878 131489 131496 130880 130104 129551 129217 129118 129482 130219 130713 130536 130057 130002 130690 131835 132767
54610 132767 132736 131484 129708 128575 128578 129239 129968 130669 131371 131931 132377 132994 133729 134006 133464 132446 131441 130517
54592 130517 129624 129006 128929 129366 130252 131622 133136 133914 133371 131953 130627 129823 129267 128659 128110 127918 128241 129023
54574 129023 130064 131088 131758 131715 130856 129776 129604 130957 133078 134513 134643 134146 133971 134368 135095 136040 137256
54557 137256 138580 139547 139732 139168 138402 137938 137547 136519 134858 133703 134048 135478 136820 137709 138664 139854
54541 139854 140773 141173 141427 141795 142121 142466 143286 144723 146326 147717 148935 149963 150537 150644 150648 150699 150562 150176
$$ packed form
54667A24816oQ75R60O45O97P83K86l41k72K29K29l83q88q92n70j08L50M81K56
54648A27147J86N16O60K18j68K05Q41P35j33r35j199r65k13Q89J505R38k27p59
54630A29241l28L65P58Q42O11Po16p76n53l34r9L64P37M94j77m79n5O88J145R32
54610A32767l1j252j776j133LO61P29P01P02N60M46O17P35K77n42j018j005r24
54592A30517q93o18p7M37Q86J370J514P78n43j418j326q04n56o08n49j92L23P82
54574A29023J041J024O70m3q59j080j72J353K121J435J30m97j75L97P27R45J216
54557A37256J324R67J85n64p66m64l91j028j661j155L45J430J342Q89R55J190
54541A39854R19M00K54L68L26L45Q20J437J603J391J218J028N74J07MN1j37l86
$$ plain form
54523 150176 149842 149666 149388 148894 148335 147666 146706 145761 145492 145975 146530 146597 146186 145420 144457 143972 144740 146433 147682
54504 147682 147760 147318 147066 146598 145209 143132 141327 140481 140724 141788 143007 143625 143488 143005 142290 141133 140037
54487 140037 140209 141925 143853 144757 145046 145706 146486 146288 144917 143348 142365 141867 141481 141105 140761 140452 140271
54470 140271 140342 140746 141707 143515 145968 148244 149668 150302 150487 150347 150153 150593 151995 153607 154290 153746 152621
54453 152621 151693 151443 152099 153476 154896 155695 155751 155311 154599 153880 153500 153519 153607 153579 153590 153521 152817 151411 150215
54434 150215 150087 150768 151436 151825 152089 152047 151376 150291 149284 148471 147814 147696 148449 149561 150197 150470 151319 153075
54416 153075 154896 155867 156079 156292 156907 157518 157364 156142 154444 153271 153068 153469 154021 154670 155315 155528 155256
54399 155256 155328 156572 158717 160733 162006 162609 162737 162556 162461 162842 163638 164599 165784 167322 168914 170153 171070
$$ packed form
54523A50176l34j76k78m94n59o69r60r45k69M83N55O7m11p66r63m85P68J693J249
54504A47682P8m42k52m68j389k077j805q46K43J064J219O18j37m83p15j157j096
54487A40037J72J716J928R04K89O60P80j98j371j569r83m98l86l76l44l09j81
54470A40271P1M04R61J808K453K276J424O34J85j40j94M40J402J612O83n44j125
54453A52621r28k50O56J377J420P99N6m40p12p19l80J9Q8k8J1o9p04j406j196
54434A50215j28O81O68L89K64m2o71j085j007q13o57j18P53J112O36K73Q49J756
54416A53075J821R71K12K13O15O11j54j222j698j173k03M01N52O49O45K13k72
54399A55256P2J244K145K016J273O03J28j81r5L81P96R61J185J538J592J239R17
$$ plain form
54382 171070 171806 171973 171094 169493 168055 167122 166333 165459 164639 163805 162680 161511 161070 161640 162539 162984 162937 162911
54364 162911 163365 164469 165991 167192 167322 166574 166156 167004 168651 169726 169507 168601 168120 168482 169151 169383 168976
54347 168976 168225 167356 166292 164919 163371 161980 161135 161148 161921 162738 162750 161827 160616 159734 159266 159120 159341 159854
54329 159854 160426 161133 162353 164011 165409 166218 167041 168477 170149 171285 171837 172405 173439 175153 177795 181277
54313 181277 184834 187847 190801 194661 199457 204188 207995 210623 211790 211005 208285 204456 200470 196759
54299 196759 193232 189504 185143 180191 175413 171647 168969 166998 165763 165594 166224 166772 166741 166372 165856 164953
54283 164953 163671 162697 162690 163525 164619 165633 166512 167063 166969 166199 165158 164390 164138 164190 164143 163895 163801 164236 165132
54264 165132 166122 166989 167726 168250 168301 167682 166485 165193 164540 164989 166175 167196 167676 168120 168985 169933 170524 171095
$$ packed form
54382A71070P36J67q79j601j438r33p89q74q20q34j125j169m41N70Q99M45m7k6
54364A62911M54J104J522J201J30p48m18Q48J647J075k19r06m81L62O69K32m07
54347A68976p51q69j064j373j548j391q45J3P73Q17J2r23j211q82m68j46K21N13
54329A59854N72P07J220J658J398Q09Q23J436J672J136N52N68J034J714K642L482
54313A81277L557L013K954L860M796M731L807K628J167p85k720l829l986l711
54299A96759l527l728m361m952m778l766k678j971j235j69O30N48l1l69n16r03
54283A64953j282r74pQ35J094J014Q79N51r4p70j041p68k52N2m7k48r4M35Q96
54264A65132R90Q67P37N24N1o19j197j292o53M49J186J021M80M44Q65R48N91N71
$$ plain form
54246 171095 172202 173495 174063 173840 173799 174574 175620 176033 175557 174434 172787 170734 168826 167786 167759 168131 168252
54229 168252 168126 168192 168496 168464 167667 166503 165674 165200 164538 163628 163130 163356 163695 163458 162737 162001 161389 160926 160957
54210 160957 161727 162878 163847 164438 164585 164034 162902 162070 162313 163364 164427 165273 166084 166629 166458 165745 165162
54193 165162 164984 165040 165359 166111 167007 167500 167536 167484 167374 166899 166105 165442 165209 165448 166227 167403 168335 168560 168518 168873
54173 168873 169415 169532 169522 170357 172189 174149 175615 176605 176818 175527 172885 170244 168606 167564 166327 164966
54157 164966 163980 163307 162540 161749 161387 161529 161729 161580 161068 160396 159713 159102 158778 159126 160229 161376 161604 160964
54139 160964 160566 160952 161213 160494 159597 159875 161094 161755 161333 160732 160521 160204 159587 159478 160466 162072 163668 165277
54121 165277 166916 168127 168728 169232 169995 170723 171318 172291 173789 175067 175606 175976 176874 177976 178493 178315 177863
$$ packed form
54246A71095J107J293N68k23m1P75J046M13m76j123j647k053j908j040k7L72J21
54229A68252j26O6L04l2p97j164q29m74o62r10m98K26L39k37p21p36o12m63L1
54210A60957P70J151R69N91J47n51j132q32K43J051J063Q46Q11N45j71p13n83
54193A65162j78N6L19P52Q96M93L6n2j10m75p94o63k33K39P79J176R32K25m2L55
54173A68873N42J17j0Q35J832J960J466R90K13j291k642k641j638j042j237j361
54157A64966r86o73p67p91l62J42K00j49n12o72o83o11l24L48J103J147K28o40
54139A60964l98L86K61p19q97K78J219O61m22o01k11l17o17j09R88J606J596J609
54121A65277J639J211O01N04P63P28N95R73J498J278N39L70Q98J102N17j78m52
$$ plain form
54104 177863 177299 176530 175628 174702 173726 172901 172743 173359 174107 174352 174067 173431 172545 171922 172432 174119 175813 176556
54086 176556 176779 177373 178332 179191 180147 181667 183330 184134 183861 183260 182914 182715 182504 182549 183193 184450 186126 187998
54068 187998 189886 191717 193484 195068 196297 197303 198449 199675 200362 200091 199161 198076 196965 195896 195290
54053 195290 195565 196626 198023 199329 200200 200579 201111 202797 205842 209381 212692 216061 220005 224385 228897
54038 228897 233773 239236 244809 249995 255223 261275 268130 275167 282222 289603 297285 304915 312436 319898
54024 319898 326775 332276 336327 339539 342238 344244 345557 346493 347092 347162 347047 347536 348639 349095 347551 343874
54008 343874 338940 333478 327555 321042 314183 307547 301577 296303 291522 287169 283350 280098 277299 274910
53994 274910 272966 271432 270438 270677 273038 277558 283209 289115 295620 303843 314492 327348 341291 354152
$$ packed form
54104A77863n64p69r02r26r76q25j58O16P48K45k85o36q86o23N10J687J694P43
54086A76556K23N94R59Q59R56J520J663Q04k73o01l46j99k11M5O44J257J676J872
54068A87998J888J831J767J584J229J006J146J226O87k71r30j085j111j069o06
54053A95290K75J061J397J306Q71L79N32J686L045L539L311L369L944M380M512
54038B28897M876N463N573N186N228O052O855P037P055P381P682P630P521P462
54024C19898O877N501M051L212K699K006J313R36N99P0j15M89J103M56j544l677
54008C43874m934n462n923o513o859o636n970n274m781m353l819l252k799k389
53994B74910j944j534r94K39K361M520N651N906O505Q223J0649J2856J3943J2861
$$ plain form
53980 354152 362882 364827 359331 348065 333907 319483 306261 294419 283459 273114 263728 255834
53968 255834 249649 245014 241435 238223 235015 232271 230708 230206 229873 229297 228898 228845 228589 228032 228184 229866
53952 229866 232489 234917 236875 238662 240134 241049 241993 243829 246429 248922 251031 253239 255802 258522 261505
53937 261505 265254 269936 275315 281430 288556 296434 304233 311439 318162 324474 330077 334761 338665 341972
53923 341972 344833 347677 351143 355529 360611 365968 371250 376343 381615 387749 394962 402654 410274 418128
53909 418128 426778 436052 445348 454476 463397 471504 478109 483362 487668 490361 490185 487209 483152 479458
53895 479458 475944 471701 466414 460337 453708 446716 439565 432100 423799 414389 404143 393418 382423
53882 382423 371589 361581 352635 344333 336289 328709 322065 316600 312249 308643 305087 301002 296570 292486
$$ packed form
53980C54152Q730J945n496j1266j4158j4424j3222j1842j0960j0345r386p894
53968B55834o185m635l579l212l208k744j563n02l33n76l99n3k56n57J52J682
53952B29866K623K428J958J787J472R15R44J836K600K493K109K208K563K720K983
53937B61505L749M682N379O115P126P878P799P206O723O312N603M684L904L307
53923C41972K861K844L466M386N082N357N282N093N272O134P213P692P620P854
53909D18128Q650R274R296R128Q921Q107O605N253M306K693j76k976m057l694
53895D79458l514m243n287o077o629o992p151p465q301r410j0246j0725j0995
53882C82423j0834j0008q946q302q044p580o644n465m351l606l556m085m432m084
$$ plain form
53868 292486 289006 285671 282048 278258 274651 271399 268558 266132 263985 261988 260191 258496 256384 253571
53854 253571 250636 248241 245936 242789 239162 236672 236032 236118 235695 235006 234903 235295 235415 235000 234245 233047 231270
53837 231270 229537 228849 229348 230196 230721 231190 232316 234447 237296 240185 242536 244443 246778 250480 255794
53822 255794 262387 270144 279493 290977 304906 321557 341321 363963 387449 407728 420355 422876
53810 422876 415961 402478 385763 368619 353008 339870 329231 320968 315332 312422 311545 311884 313677
53797 313677 317884 324491 331887 338287 343249 347486 351707 356088 360508 364807 368895 372883 377028 381469
53783 381469 386188 391253 396806 402725 408536 413699 417664 419645 418750 414530 407176 397156 384956 371263
53769 371263 357057 343314 330756 319819 310560 302622 295585 289319 283753 278503 273198 268012 263368
$$ packed form
53868B92486l480l335l623l790l607l252k841k426k147j997j797j695k112k813
53854B53571k935k395k305l147l627k490o40Q6m23o89j03L92J20m15p55j198j777
53837B31270j733o88M99Q48N25M69J126K131K849K889K351J907K335L702N314
53822B55794O593P757R349J1484J3929J6651J9764K2642K3486K0279J2627K521
53810D22876o915j3483j6715j7144j5611j3138j0639q263n636k910q77L39J793
53797C13677M207O607P396O400M962M237M221M381M420M299M088L988M145M441
53783C81469M719N065N553N919N811N163L965J981q95m220p354j0020j2200j3693
53769C71263j4206j3743j2558j0937r259p938p037o266n566n250n305n186m644
$$ plain form
53756 263368 259247 255309 251592 248443 245831 243365 240965 238813 236702 234281 231999 230881 231066 231420 230950
53741 230950 229869 228898 228365 228469 229618 231766 233983 235434 236414 237804 239826 241878 243357 244146 244458 244602
53725 244602 244801 245059 245387 246158 247703 249501 250468 250353 250168 250784 251788 252276 252214 252317 253024 254256 255862
53708 255862 257716 259633 261675 264218 267299 270252 272520 274437 276689 279355 282049 284634 287180 289579
53694 289579 291835 294500 298184 302815 307939 313374 318856 323373 325782 326101 325435 324564 323316 321420 319257
53679 319257 317434 316117 315088 314187 313457 313056 313060 313253 313193 312704 312141 311843 311450 310173 307661 304346 300986
53662 300986 298227 296486 295862 296131 297037 298447 300047 301213 301579 301548 301822 302554 303344 303890 304171 304144 303769 303273
53644 303273 302981 302902 302824 302635 302198 301199 299707 298660 299100 300900 302862 304153 305065 306286 308036 310119 312319
$$ packed form
53756B63368m121l938l717l149k612k466k400k152k111k421k282j118J85L54m70
53741B30950j081r71n33J04J149K148K217J451R80J390K022K052J479P89L12J44
53725B44602J99K58L28P71J545J798R67j15j85O16J004M88o2J03P07J232J606
53708B55862J854J917K042K543L081K953K268J917K252K666K694K585K546K399
53694B89579K256K665L684M631N124N435N482M517K409L19o66q71j248j896k163
53679C19257j823j317j029r01p30m01MJ93o0m89n63k98l93j277k512l315l360
53662C00986k759j741o24K69R06J410J600J166L66l1K74P32P90N46K81k7l75m96
53644C03273k92p9p8j89m37r99j492j047M40J800J962J291R12J221J750K083K200
$$ plain form
53627 312319 314481 316630 319132 322314 325777 328538 330146 331249 332835 335248 338222 341484 344941 348475
53613 348475 351931 355284 358658 362258 366338 371046 376158 381145 385691 390006 394540 399477 404533 409135
53599 409135 412736 415181 416875 418438 420133 421745 423012 423923 424544 424820 424701 424261 423534 422474 421204 420083
53583 420083 419175 417819 415215 411505 407902 405485 404119 402889 401330 399733 398217 396180 393130 389625
53569 389625 386756 384851 383314 381738 380452 379714 379037 377799 376117 374634 373766 373580 374148 375436 376977
53554 376977 378137 378761 379205 379809 380668 381815 383303 385143 387466 390590 394513 398554 402056 405404 409767
53539 409767 415690 422552 429612 437029 445397 454720 464345 473742 482847 491670 499992 507537 514193 520021
53525 520021 525350 530975 537934 546743 556906 567435 577892 588716 600534 613436 627068 641179
$$ packed form
53627C12319K162K149K502L182L463K761J608J103J586K413K974L262L457L534
53613C48475L456L353L374L600M080M708N112M987M546M315M534M937N056M602
53599D09135L601K445J694J563J695J612J267R11O21K76j19m40p27j060j270j121
53583D20083r08j356k604l710l603k417j366j230j559j597j516k037l050l505
53569C89625k869j905j537j576j286p38o77j238j682j483q68j86N68J288J541
53554C76977J160O24M44O04Q59J147J488J840K323L124L923M041L502L348M363
53539D09767N923O862P060P417Q368R323R625R397R105Q823Q322P545O656N828
53525E20021N329N625O959Q809J0163J0529J0457J0824J1818J2902J3632J4111
$$ plain form
53513 641179 655852 671376 688220 706986 727986 750814 774663 799080 824142 849947 876339
53502 876339 903193 930449 957650 983928 1008788 1032605 1055974 1078913 1101008 1122107 1142434
53491 1142434 1162184 1181392 1200128 1218532 1236769 1255194 1274351 1294430 1314842 1334698 1353664
53480 1353664 1372088 1390428 1408961 1427926 1447483 1467320 1486565 1504236 1519696 1532691 1543193
53469 1543193 1551306 1557170 1560803 1561959 1560183 1555097 1546785 1535833 1522831 1507951 1491341 1473796 1456520
53456 1456520 1440091 1424036 1407561 1390158 1371391 1350849 1328785 1306247 1283979 1261659 1238841
53445 1238841 1216166 1194788 1174842 1155372 1135771 1116545 1098610 1082568 1068837 1057777 1049333
53434 1049333 1042940 1038019 1034206 1031091 1028245 1025707 1024003 1023445 1023825 1025014 1027435 1031631 1037669 1045296
$$ packed form
53513F41179J4673J5524J6844J8766K1000K2828K3849K4417K5062K5805K6392
53502H76339K6854K7256K7201K6278K4860K3817K3369K2939K2095K1099K0327
53491A142434J9750J9208J8736J8404J8237J8425J9157K0079K0412J9856J8966
53480A353664J8424J8340J8533J8965J9557J9837J9245J7671J5460J2995J0502
53469A543193Q113N864L633J156j776n086q312j0952j3002j4880j6610j7545j7276
53456A456520j6429j6055j6475j7403j8767k0542k2064k2538k2268k2320k2818
53445A238841k2675k1378j9946j9470j9601j9226j7935j6042j3731j1060q444
53434A049333o393m921l813l115k846k538j704n58L80J189K421M196O038P627
$$ plain form
53420 1045296 1054428 1065150 1077369 1090773 1105115 1120389 1136838 1154934 1175201 1197766 1222044
53409 1222044 1247063 1272368 1298624 1327161 1358771 1393014 1428873 1465879 1504236 1543984 1584740
53398 1584740 1626585 1670562 1717660 1767594 1819230 1872042 1926495 1982952 2040828 2099000 2156726
53387 2156726 2214024 2271478 2329720 2388730 2447471 2504423 2558605 2609942 2658705 2704921 2748351
53376 2748351 2788711 2825709 2858955 2887933 2912020 2930678 2943806 2951784 2955009 2953477 2946966 2935393
53364 2935393 2918624 2896041 2866671 2829818 2785539 2734783 2679348 2621413 2562617 2503585 2444462
53353 2444462 2385649 2327659 2270667 2214741 2160367 2108192 2058371 2010605 1964629 1920088 1876117
53342 1876117 1831801 1787101 1742723 1699066 1656008 1613806 1573499 1536083 1501788 1470390 1441734
$$ packed form
53420A045296R132J0722J2219J3404J4342J5274J6449J8096K0267K2565K4278
53409A222044K5019K5305K6256K8537L1610L4243L5859L7006L8357L9748M0756
53398A584740M1845M3977M7098M9934N1636N2812N4453N6457N7876N8172N7726
53387B156726N7298N7454N8242N9010N8741N6952N4182N1337M8763M6216M3430
53376B748351M0360L6998L3246K8978K4087J8658J3128P978L225j532o511j1573
53364B935393j6769k2583k9370l6853m4279n0756n5435n7935n8796n9032n9123
53353B444462n8813n7990n6992n5926n4374n2175m9821m7766m5976m4541m3971
53342A876117m4316m4700m4378m3657m3058m2202m0307l7416l4295l1398k8656
$$ plain form
53331 1441734 1415625 1391659 1369530 1349281 1331034 1314648 1299657 1285278 1270522 1254734 1238153
53320 1238153 1221635 1205853 1191133 1177871 1166357 1156124 1146210 1136392 1127576 1120645 1115502 1111621
53308 1111621 1108990 1107953 1108476 1110133 1112727 1116529 1121976 1129247 1138037 1147747 1158186 1170165 1184936
53295 1184936 1202915 1223354 1245376 1268810 1293748 1319920 1346965 1374935 1403936 1433575 1463185
53284 1463185 1492388 1520973 1548407 1573969 1597336 1618694 1638274 1655982 1671374 1683743 1692415
53273 1692415 1697213 1698555 1696848 1691934 1683480 1671798 1657891 1642527 1625514 1606051 1583738 1559147
53261 1559147 1533378 1507129 1480369 1452981 1425452 1398575 1372470 1346230 1318693 1289406 1258859
53250 1258859 1228044 1197869 1168745 1140530 1112838 1085345 1057778 1029872 1001714 973985 947462
$$ packed form
53331A441734k6109k3966k2129k0249j8247j6386j4991j4379j4756j5788j6581
53320A238153j6518j5782j4720j3262j1514j0233r914r818q816o931n143l881
53308A111621k631j037N23J657K594L802N447P271Q790R710J0439J1979J4771
53295A184936J7979K0439K2022K3434K4938K6172K7045K7970K9001K9639K9610
53284A463185K9203K8585K7434K5562K3367K1358J9580J7708J5392J2369Q672
53273A692415M798J342j707m914q454j1682j3907j5364j7013j9463k2313k4591
53261A559147k5769k6249k6760k7388k7529k6877k6105k6240k7537k9287l0547
53250A258859l0815l0175k9124k8215k7692k7493k7567k7906k8158k7729k6523
$$ plain form
53239 947462 922223 897662 873261 849017 825214 802216 780507 760493 742183 725360 710000
53228 710000 696162 683594 671998 661568 652605 644650 636680 628284 619810 611220 601663 590590 578533
53215 578533 566224 553629 540441 526986 513976 501731 490215 479486 469581 460235 451322 443331
53203 443331 436901 431997 427926 423931 419442 414075 407891 401415 395037 388631 382139 376116 371162 367124
53189 367124 363430 359922 356734 353583 349962 346041 342645 340141 337892 335093 331726 328430 325665 323321
53175 323321 321069 318852 316933 315458 314173 312760 311389 310600 310621 311119 311701 312166 312158 311163 309253 307425 306647
53158 306647 306807 306958 306341 304880 302982 301280 300281 299834 299159 297837 296471 295952 296335 296889 296999 296511 295499
53141 295499 294301 293612 293861 294521 294611 293842 292736 291666 290398 288695 286834 285343 284535 284359 284381 283952 282772
$$ packed form
53239I47462k5239k4561k4401k4244k3803k2998k1709k0014j8310j6823j5360
53228G10000j3838j2568j1596j0430q963p955p970q396q474q590r557j1073j2057
53215E78533j2309j2595j3188j3455j3010j2245j1516j0729r905r346q913p991
53203D43331o430m904m071l995m489n367o184o476o378o406o492o023m954m038
53189C67124l694l508l188l151l621l921l396k504k249k799l367l296k765k344
53175C23321k252k217j919j475j285j413j371p89K1M98N82M65qr95j910j828p78
53158C06647J60J51o17j461j898j702r99m47o75j322j366n19L83N54J10m88j012
53141B95499j198o89K49O60R0p69j106j070j268j703j861j491q08j76K2m29j180
$$ plain form
53124 282772 281314 280355 280101 280137 280123 280059 279897 279474 278955 278848 279378 280220 280964 281519 281906 282093 282211 282568 283166
53105 283166 283465 282908 281583 280111 278943 277952 276690 274950 273003 271304 269996 268842 267606 266298 264990
53090 264990 263701 262614 262145 262519 263432 264361 264984 265126 264646 263674 262685 261966 261347 260808 260926 262083 263560
53073 263560 264209 263957 263813 264368 265049 265105 264619 264131 263782 263276 262437 261461 260780 260813 261567 262305 261975 260215 257824
53054 257824 256056 255675 256716 258757 261140 263180 264561 265551 266660 268150 269882 271544 272900 273949 274864
53039 274864 275703 276216 276101 275448 274732 274293 274014 273533 272601 271241 269717 268397 267470 266781 266055 265211 264304 263279
53021 263279 262092 260995 260348 260142 260063 260112 260767 262345 264426 266167 267021 267021 266507 265818 265181 264699 264345 264020
53003 264020 263724 263718 264436 266040 268048 269611 270235 270112 269760 269637 270090 271187 272336 272553 271510 269926 268564
$$ packed form
53124B82772j458r59k54L6j4o4j62m23n19j07N30Q42P44N55L87J87J18L57N98
53105B83166K99n57j325j472j168r91j262j740j947j699j308j154j236j308j308
53090B64990j289j087m69L74R13R29O23J42m80r72r89p19o19n39J18J157J477
53073B63560O49k52j44N55O81N6m86m88l49n06q39r76o81L3P54P38l30j760k391
53054B57824j768l81J041K041K383K040J381R90J109J490J732J662J356J049R15
53039B74864Q39N13j15o53p16m39k79m81r32j360j524j320r27o89p26q44r07j025
53021B63279j187j097o47k06p9M9O55J578K081J741Q54%n14o89o37m82l54l25
53003B64020k96oP18J604K008J563O24j23l52j23M53J097J149K17j043j584j362
$$ plain form
52986 268564 267330 265973 265140 265759 267549 269160 269923 270558 271859 273508 274697 275280 275789 276754 278434 280834
52970 280834 283446 285342 286062 286269 287133 289199 292186 295636 299269 302782 305761 307869 308918 308793 307591
52955 307591 305817 304141 302833 301607 300050 298080 295935 293875 291996 290285 288745 287381 286068 284597
52941 284597 282993 281665 280969 280651 280059 279042 278296 278556 279621 280481 280371 279414 278301 277615 277500 277668 277515
52924 277515 276421 274306 271911 270263 269736 269801 269790 269661 269792 270256 270760 271213 271838 272554 272741 271940 270501 269217
52906 269217 268517 268309 268355 268371 267896 266591 264713 262990 261924 261433 261167 260917 260651 260446 260520 261209 262777 265173
52888 265173 267956 270465 272228 273268 273853 273951 273183 271440 269205 267083 265289 263812 262738 262049 261395 260488
52872 260488 259541 258975 258892 259187 259956 261367 263255 265250 267112 268595 269245 268910 268349 268790 270841 274153 278018
$$ packed form
52986B68564j234j357q33O19J790J611P63O35J301J649J189N83N09R65J680K400
52970B80834K612J896P20K07Q64K066K987L450L633L513K979K108J049j25j202
52955C07591j774j676j308j226j557j970k145k060j879j711j540j364j313j471
52941B84597j604j328o96l18n92j017p46K60J065Q60j10r57j113o86j15J68j53
52924B77515j094k115k395j648n27O5j1j29J31M64N04M53O25P16J87q01j439j284
52906B69217p00k08M6J6m75j305j878j723j066m91k66k50k66k05P4O89J568K396
52888B65173K783K509J763J040N85R8p68j743k235k122j794j477j074o89o54r07
52872B60488r47n66q3K95P69J411J888J995J862J483O50l35n61M41K051L312L865
$$ plain form
52855 278018 281753 284605 285884 285415 283596 281021 278288 275941 274173 272707 271340 270357 269877 269134 267170
52840 267170 264140 261168 258904 256973 254893 252703 250478 248073 245665 243897 243048 242602 241986 241272 240819
52825 240819 240720 241000 241871 243310 244636 244883 243509 240677 237171 234164 232619 232624 233507 234663 235916 237117
52809 237117 237986 238630 239732 241932 245321 249643 254538 259357 263198 265382 265642 263855 260157 255458 251226
52794 251226 248363 246707 245742 245225 244903 244279 243138 241809 240571 239288 237967 237083 236921 237069 237050 236984 237184
52777 237184 237569 237987 238667 239771 240895 241566 241971 242638 243641 244567 245105 245254 245196 245277 245852 246792 247485 247647
52759 247647 247739 248253 249042 249796 250639 251670 252363 252127 251217 250415 250062 249970 250076 250540 251340 252314 253466 254727
52741 254727 255605 255646 255105 254611 254322 253981 253676 253907 254913 256446 258217 260055 261651 262607 262879 262896 263244 264374
$$ packed form
52855B78018L735K852J279m69j819k575k733k347j768j466j367r83m80p43j964
52840B67170l030k972k264j931k080k190k225k405k408j768q49m46o16p14m53
52825B40819r9K80Q71J439J326K47j374k832l506l007j545NQ83J156J253J201
52809B37117Q69O44J102K200L389M322M895M819L841K184K60j787l698m699m232
52794B51226k863j656r65n17l22o24j141j329j238j283j321q84j62J48j9o6K00
52777B37184L85M18O80J104J124O71M05O67J003R26N38J49n8Q1N75R40O93J62
52759B47647R2N14P89P54Q43J031O93k36r10q02l53r2J06M64Q00R74J152J261
52741B54727Q78M1n41m94k89l41l05K31J006J533J771J838J596R56K72J7L48J130
$$ plain form
52723 264374 266298 268272 269125 268359 266665 264982 263483 262060 261232 261679 263084 264411 265297 266326 267810
52708 267810 269182 269762 269434 268334 266564 264503 262800 261718 260978 260457 260482 261154 261884 261978 261312 260219 259084
52691 259084 258341 258450 259485 260966 262354 263520 264613 265771 267185 269117 271555 274011 275905 276997 277391
52676 277391 277300 276986 276721 276627 276706 277046 277744 278534 278879 278644 278445 278980 280123 280985 280900 280115 279398 279124 279011 278791
52656 278791 278796 279507 280700 281562 281852 282428 284272 287350 290798 293887 296278 297631 297633 296409 294394 291858 288969
52639 288969 286248 284369 283461 283053 282720 282318 281623 280416 279119 278733 279793 281730 283602 285117 286737 289035
52623 289035 292127 295492 298193 299519 299528 298706 297166 294654 291447 288622 287034 286382 285714 284541 283127 281872
52607 281872 280910 280218 279738 279353 278926 278427 277916 277411 276916 276508 276358 276677 277628 279180 281078 283069 285100
$$ packed form
52723B64374J924J974Q53p66j694j683j499j423q28M47J405J327Q86J029J484
52708B67810J372N80l28j100j770k061j703j082p40n21K5O72P30R4o66j093j135
52691B59084p43J09J035J481J388J166J093J158J414J932K438K456J894J092L94
52676B77391r1l14k65r4P9L40O98P90L45k35j99N35J143Q62q5p85p17k74j13k20
52656B78791NP11J193Q62K90N76J844L078L448L089K391J353Kj224k015k536k889
52639B88969k721j879r08m08l33m02o95j207j297l86J060J937J872J515J620K298
52623B89035L092L365K701J326Rq22j540k512l207k825j588o52o68j173j414j255
52607B81872r62o92m80l85m27m99n11n05m95m08j50L19R51J552J898J991K031
$$ plain form
52590 285100 287101 288691 289459 289615 289927 290855 292069 293053 293845 294835 296017 296894 297119 296922 296815 297104 297792
52573 297792 298760 299886 300988 301804 302148 302090 301959 302105 302631 303325 303805 303717 302899 301429 299586 297732 296188
52556 296188 295052 294079 292920 291658 290958 291333 292385 293141 293124 292637 292008 291178 290200 289440 288914 288081 286861
52539 286861 286306 287428 289704 291513 291925 291328 290490 289814 289587 290065 291011 291715 291776 291451 291074 290636 290123 289798
52521 289798 289855 290192 290714 291466 292249 292512 291944 290915 290119 290006 290739 292357 294756 297695 301074 305005 309468
52504 309468 314010 317909 320525 321507 320928 319279 317155 314910 312697 310666 308784 306619 303810 300752 298324
52489 298324 296801 295539 293892 291999 290420 289388 288737 288345 288307 288790 289858 291352 292900 294151 295083 295951
52473 295951 297044 298588 300630 302762 304230 304786 305167 306233 307807 309095 310032 311382 313487 315881 318403
$$ packed form
52590B85100K001J590P68J56L12R28J214R84P92R90J182Q77K25j97j07K89O88
52573B97792R68J126J102Q16L44n8j31J46N26O94M80q8q18j470j843j854j544
52556B96188j136r73j159j262p00L75J052P56j7m87o29q30r78p60n26q33j220
52539B86861n55J122K276J809M12n97q38o76k27M78R46P04O1l25l77m38n13l25
52521B89798N7L37N22P52P83K63n68j029p96j13P33J618K399K939L379L931M463
52504C09468M542L899K616R82n79j649k124k245k213k031j882k165k809l058k428
52489B98324j523j262j647j893j579j032o51l92l8M83J068J494J548J251R32Q68
52473B95951J093J544K042K132J468N56L81J066J574J288R37J350K105K394K522
$$ plain form
52458 318403 321711 326102 330501 333284 333716 332195 329508 326339 323100 319772 316152 312541 309766 308168
52444 308168 307001 305223 302588 299621 296977 295167 294368 294029 293132 291409 289893 289670 290452 291054 290947 290576
52428 290576 290280 289754 288769 287816 287702 288689 290131 290893 290252 288638 287311 287153 287982 289200 290671 292527 294537
52411 294537 296279 297772 299417 301456 304054 307803 313511 321358 330766 341279 353154 366797 381748
52398 381748 396301 408043 414898 416060 412119 404347 394005 382330 370736 360468 352098 345591 340739
52385 340739 337290 334859 333140 332176 332118 332783 333759 334874 336261 337973 339786 341410 342718 343879 345458
52370 345458 348178 352357 357683 363696 370247 377156 383739 389130 392933 395204 395960 395169 393164 390647 388347
52355 388347 386901 386763 387676 388446 387952 386428 385209 385159 385952 386994 388353 390400 393004 395566 397668 399424
$$ packed form
52458C18403L308M391M399K783M32j521k687l169l239l328l620l611k775j598
52444C08168j167j778k635k967k644j810p99l39q97j723j516k23P82O02j07l71
52428B90576k96n26r85r53j14R87J442P62o41j614j327j58Q29J218J471J856K010
52411B94537J742J493J645K039K598L749N708P847R408J0513J1875J3643J4951
52398C81748J4553J1742O855J162l941p772j0342j1675j1594j0268q370o507m852
52385C40739l449k431j719r64n8O65R76J115J387J712J813J624J308J161J579
52370C45458K720M179N326O013O551O909O583N391L803K271P56p91k005k517k300
52355C88347j446j38R13P70m94j524j219n0P93J042J359K047K604K562K102J756
$$ plain form
52339 399424 401362 404131 408114 413087 418393 423569 428743 434359 440738 447968 456024 464883 474656 485661
52325 485661 498207 512241 527381 543370 560376 578796 598788 619959 641368 661954 681202
52314 681202 699384 717033 734322 751215 768025 785447 804003 823729 844378 865622 887062
52303 887062 908369 929421 950048 969781 988241 1005697 1022717 1039240 1054580 1068381 1080885
52292 1080885 1091927 1100326 1104841 1105348 1102624 1097418 1090357 1082377 1074371 1066359 1057760 1048621 1039918 1032337
52278 1032337 1025455 1018625 1012219 1007369 1004664 1003762 1004197 1005919 1008902 1012845 1017642 1023742 1031598 1041134
52264 1041134 1052168 1065063 1080227 1097037 1113931 1129777 1144673 1159243 1173719 1188097 1202689
52253 1202689 1217971 1234090 1250870 1268104 1285385 1301876 1316786 1330020 1341791 1351472 1357434 1358443
$$ packed form
52339C99424J938K769L983M973N306N176N174N616O379P230Q056Q859R773J1005
52325D85661J2546J4034J5140J5989J7006J8420J9992K1171K1409K0586J9248
52314F81202J8182J7649J7289J6893J6810J7422J8556J9726K0649K1244K1440
52303H87062K1307K1052K0627J9733J8460J7456J7020J6523J5340J3801J2504
52292A080885J1042Q399M515N07k724n206p061p980q006q012q599r139q703p581
52278A032337o882o830o406m850k705r02M35J722K983L943M797O100P856R536
52264A041134J1034J2895J5164J6810J6894J5846J4896J4570J4476J4378J4592
52253A202689J5282J6119J6780J7234J7281J6491J4910J3234J1771R681N962J009
$$ plain form
52241 1358443 1355095 1349541 1343795 1338459 1333035 1327144 1321041 1314917 1308162 1299921 1290312 1280557 1271685 1263605
52227 1263605 1255751 1248164 1241361 1235431 1229877 1224312 1218778 1213370 1208065 1203080 1198980 1196206 1194740 1194331
52213 1194331 1194840 1196302 1198908 1202997 1208738 1215653 1222648 1228798 1234122 1239475 1245671 1252659 1259527 1265410
52199 1265410 1270431 1275620 1281798 1288811 1295979 1303023 1310203 1317800 1325882 1334436 1343254 1351747 1359353 1366082
52185 1366082 1372202 1377380 1380756 1382016 1381814 1380766 1378464 1373883 1366499 1356667 1345154 1332750 1320168
52172 1320168 1307927 1296235 1285155 1274871 1265630 1257560 1250755 1245479 1242012 1240294 1239903 1240423 1241703
52159 1241703 1243733 1246450 1249787 1253813 1258604 1263848 1268619 1271748 1272569 1271334 1268930 1266240 1263823 1261965
$$ packed form
52241A358443l348n554n746n336n424n891o103o124o755q241r609r755q872q080
52227A263605p854p587o803n930n554n565n534n408n305m985m100k774j466m09
52213A194331N09J462K606M089N741O915O995O150N324N353O196O988O868N883
52199A265410N021N189O178P013P168P044P180P597Q082Q554Q818Q493P606O729
52185A366082O120N178L376J260k02j048k302m581p384r832j1513j2404j2582
52172A320168j2241j1692j1080j0284r241q070o805n276l467j718l91N20J280
52159A241703K030K717L337M026M791N244M771L129Q21j235k404k690k417j858
$$ [...]
##END NTUPLES=NMR SPECTRUM
##END=
